(footprint "SolderJumper-2_Open_Pad0602" (version 20211014) (generator pcbnew)
  (layer "F.Cu")
  (tedit 5A3EABFC)
  (descr "SMD Solder Jumper, 1x1.5mm Pads, 0.3mm gap, open")
  (tags "solder jumper open")
  (attr exclude_from_pos_files exclude_from_bom)
  (fp_text reference "REF**" (at 0 -1.775) (layer "F.SilkS")
    (effects (font (size 1 1) (thickness 0.15)))
    (tstamp 732d89d4-2969-4956-97df-5bf80fb988d0)
  )
  (fp_text value "SolderJumper-2_P1.3mm_Open_Pad1.0x1.5mm" (at 0 1.9) (layer "F.Fab")
    (effects (font (size 1 1) (thickness 0.15)))
    (tstamp e5a4db1a-c061-4b0a-ad51-a24c8790a5c4)
  )
  (fp_line (start 1.225 0.725) (end -1.225 0.725) (layer "F.SilkS") (width 0.12) (tstamp 0afca7c1-a1da-4c94-baed-c05f52325e81))
  (fp_line (start -1.225 0.725) (end -1.225 -0.725) (layer "F.SilkS") (width 0.12) (tstamp 2b78501f-9740-4fac-a533-e8eeb064d3d8))
  (fp_line (start -1.225 -0.725) (end 1.225 -0.725) (layer "F.SilkS") (width 0.12) (tstamp 8836b64e-369e-4f15-96a2-8a1544e9b710))
  (fp_line (start 1.225 -0.725) (end 1.225 0.725) (layer "F.SilkS") (width 0.12) (tstamp bef3ac59-f4df-486e-ae42-6082ded2534b))
  (fp_line (start -1.25 -0.75) (end 1.25 -0.75) (layer "F.CrtYd") (width 0.05) (tstamp 5e522d62-2040-4627-b73c-ae2bc7b5c9a4))
  (fp_line (start 1.25 0.75) (end 1.25 -0.75) (layer "F.CrtYd") (width 0.05) (tstamp 5e939036-bb28-43e0-a5a9-2b1fa0e13751))
  (fp_line (start 1.25 0.75) (end -1.25 0.75) (layer "F.CrtYd") (width 0.05) (tstamp 80727963-3592-4046-a0ca-c28e2e012625))
  (fp_line (start -1.25 -0.75) (end -1.25 0.75) (layer "F.CrtYd") (width 0.05) (tstamp cd488bed-8cd4-4cfb-b5d4-35466b1cd694))
  (pad "1" smd rect (at -0.65 0) (size 0.65 0.95) (layers "F.Cu" "F.Mask") (tstamp 003e114e-b0ac-40f1-9aec-50bbd5050086))
  (pad "2" smd rect (at 0.65 0) (size 0.65 0.95) (layers "F.Cu" "F.Mask") (tstamp a5e10e8c-d3d0-475e-966d-105f9d5f626e))
)
