Name,Bit Order,Def. Val.,Description
ckdivend,"0,1,2,3,4,5",0,"Reset signal, Active High"
ckdivend2,"0,1,2,3,4,5",0,Monitor voltage of Baseline
timerend,"0,1,2,3",0,Voltage monitor of Baseline
slowdownend,"0,1,2,3",7,
maxcycend ,"0,1,2,3,4,5,6,7",30,Data Input of Shift Register
resetckdivend ,"0,1,2,3",10,Clock of the shift registers
sendcounter ,0,0,Clock of the shift registers
ckdivend3 ,"0,1,2,3,4,5",0,Load signal of the shift registers
ts_counter_ts1_6bit,0,0,Output of the shift regsiter
countsheeps ,0,0,Enable SOUT
Invert ,0,1,
SelEx ,0,1,
SelSlow ,0,0,
EnPLL ,0,0,
SelTSCk ,0,1,
ExtraNU ,"0,1,2,3,4,5,6,7,8,9,10,11",0,
q00        ,0,0,
q01        ,0,0,
qon0       ,0,0,
qon1       ,0,1,
qon2       ,0,0,
qon3       ,0,1,
NC0 ,"5,4,3,2,1,0",10,
VNCompFine ,"5,4,3,2,1,0",10,
VP1,"5,4,3,2,1,0",5,
NFB2,"5,4,3,2,1,0",10,
VP2,"5,4,3,2,1,0",5,
VNRegC    ,"5,4,3,2,1,0",10,
VNDel    ,"5,4,3,2,1,0",16,
IPBigFine ,"5,4,3,2,1,0",25,
IPDAC    ,"5,4,3,2,1,0",0,
VP1_2    ,"5,4,3,2,1,0",0,
NC1,"5,4,3,2,1,0",10,
PFB1,"5,4,3,2,1,0",0,
BLResP,"5,4,3,2,1,0",1,
VNComp2 ,"5,4,3,2,1,0",0,
VPVCO      ,"5,4,3,2,1,0",16,
VNVCO      ,"5,4,3,2,1,0",16,
VPDelDclMux      ,"5,4,3,2,1,0",32,
VNDelDclMux      ,"5,4,3,2,1,0",32,
VPDelDcl      ,"5,4,3,2,1,0",32,
VNDelDcl      ,"5,4,3,2,1,0",32,
VPDelPreEmp      ,"5,4,3,2,1,0",32,
VNDelPreEmp      ,"5,4,3,2,1,0",32,
VPDcl      ,"5,4,3,2,1,0",32,
VNDcl      ,"5,4,3,2,1,0",32,
VNLVDS      ,"5,4,3,2,1,0",20,
VNLVDSDel      ,"5,4,3,2,1,0",0,
VPPump      ,"5,4,3,2,1,0",16,
IPRegCasc,"5,4,3,2,1,0",10,
IPSmallFine ,"5,4,3,2,1,0",23,
VNComp    ,"5,4,3,2,1,0",10,
IPFoll    ,"5,4,3,2,1,0",10,
NC2,"5,4,3,2,1,0",0,
IPBiasRec    ,"5,4,3,2,1,0",10,
VNBiasRec,"5,4,3,2,1,0",10,
Pixel Conf,29 x 25bits,--,
VDACTh,"0,1,2,3,4,5,6,7",100,
VDACBL,"0,1,2,3,4,5,6,7",114,
VDACCascN,"0,1,2,3,4,5,6,7",200,
VDACCascP,"0,1,2,3,4,5,6,7",100,
