forecast_date,target,horizon,q0.025,q0.25,q0.5,q0.75,q0.975
2024-01-10,DAX,1 day,-1.6449787,-0.4739031,0.09527683,0.6320969,1.563315
2024-01-10,DAX,2 day,-2.2563788,-0.5546621,0.10051579,0.8922532,2.353154
2024-01-10,DAX,5 day,-3.0368366,-0.8003658,0.15661116,1.0780927,3.074166
2024-01-10,DAX,6 day,-3.6171550,-0.9417379,0.20215715,1.3086011,3.429153
2024-01-10,DAX,7 day,-4.2119693,-1.4168921,0.12030080,1.9076979,4.239251
2024-01-10,energy,36 hour,64.2879322,66.3566553,68.46584397,70.0518015,73.362934
2024-01-10,energy,40 hour,60.3437939,63.1125440,66.46945846,68.0147984,71.079343
2024-01-10,energy,44 hour,56.9019891,58.3923002,62.52186191,64.0860199,70.480006
2024-01-10,energy,60 hour,53.9112972,55.7305933,58.12531991,61.1012687,62.835787
2024-01-10,energy,64 hour,50.2295786,53.2072399,56.46959589,60.0988189,61.891689
2024-01-10,energy,68 hour,48.9971439,51.3044314,55.21802039,57.9503389,59.847373
2024-01-10,infections,0 week,NA,NA,NA,NA,NA
2024-01-10,infections,1 week,NA,NA,NA,NA,NA
2024-01-10,infections,2 week,NA,NA,NA,NA,NA
2024-01-10,infections,3 week,NA,NA,NA,NA,NA
2024-01-10,infections,4 week,NA,NA,NA,NA,NA
