forecast_date,target,horizon,q0.025,q0.25,q0.5,q0.75,q0.975
2024-02-07,DAX,1 day,-2.174163158643237,-0.5037845064799228,0.09979194175744904,0.6526917335355672,1.9160804863884147
2024-02-07,DAX,2 day,-1.5572503091655447,-0.44112583954257506,0.051751596689615105,0.5446290329218052,1.6607535025447748
2024-02-07,DAX,5 day,-1.8776829115833242,-0.5212282429353058,0.06216565493954685,0.6455595528143995,2.0020142214624173
2024-02-07,DAX,6 day,-3.769115152271249,-0.8053949051659319,0.188020103823887,1.152169117360281,3.6277180901875203
2024-02-07,DAX,7 day,-4.456848313246646,-0.9485564386110611,0.3102799727760107,1.4647254150871818,4.333234887104178
2024-02-07,energy,36 hour,67.97967971989796,69.72576742631848,70.30161910372568,70.97837277605947,72.20204314935341
2024-02-07,energy,40 hour,63.45199897204113,66.38813230315003,66.99059889854527,67.07797186924425,67.54558156515665
2024-02-07,energy,44 hour,58.34285829007318,61.253161117881696,63.08577113665197,65.17904821552612,68.0417554045303
2024-02-07,energy,60 hour,55.27957456125412,59.03323229595952,60.31447876926647,62.60025938822238,66.1762246914997
2024-02-07,energy,64 hour,51.44633321110158,55.54529451881818,57.09232035405482,58.7501274443359,62.17396734725249
2024-02-07,energy,68 hour,51.90539369879755,54.28113940088042,55.29647668929684,57.825592779697395,60.23344658444965
2024-02-07,infections,0 week,NA,NA,NA,NA,NA
2024-02-07,infections,1 week,NA,NA,NA,NA,NA
2024-02-07,infections,2 week,NA,NA,NA,NA,NA
2024-02-07,infections,3 week,NA,NA,NA,NA,NA
2024-02-07,infections,4 week,NA,NA,NA,NA,NA
