forecast_date,target,horizon,q0.025,q0.25,q0.5,q0.75,q0.975
2023-11-15,DAX,1 day,-2.183,-0.781,1.112,3.088,5.977
2023-11-15,DAX,2 day,-4.592,-1.419,1.023,2.601,4.971
2023-11-15,DAX,5 day,-5.918,-3.781,-1.017,0.991,3.875
2023-11-15,DAX,6 day,-4.423,-1.408,0.103,3.001,5.491
2023-11-15,DAX,7 day,-6.481,-3.418,0.841,5.131,7.211
2023-11-15,energy,36 hour,58.711,63.137,66.192,69.324,73.248
2023-11-15,energy,40 hour,55.947,58.132,62.809,65.126,71.152
2023-11-15,energy,44 hour,50.475,53.126,57.867,58.114,65.992
2023-11-15,energy,60 hour,47.137,51.771,55.453,58.316,63.594
2023-11-15,energy,64 hour,44.648,49.773,52.325,55.581,61.359
2023-11-15,energy,68 hour,42.158,47.142,50.986,53.581,57.643
2023-11-15,infections,0 week,NA,NA,NA,NA,NA
2023-11-15,infections,1 week,NA,NA,NA,NA,NA
2023-11-15,infections,2 week,NA,NA,NA,NA,NA
2023-11-15,infections,3 week,NA,NA,NA,NA,NA
2023-11-15,infections,4 week,NA,NA,NA,NA,NA
