"model","target","horizon","forecast_date","q0.025","q0.25","q0.5","q0.75","q0.975","value","qscore_q0.025","qscore_q0.25","qscore_q0.5","qscore_q0.75","qscore_q0.975","mean_qscore","ae","interval_coverage_0.5","interval_coverage_0.95","scores_imputed"
"BrienneVonTarth","DAX","1 day",2024-01-10,-3.05552133039545,-0.566572783629777,0.0719232224564061,0.741838750761924,2.64539647375111,-0.859179928062304,0.109817070116657,0.43891071664879,0.93110315051871,0.800509339412114,0.175228820090671,0.491113819357388,0.93110315051871,FALSE,TRUE,FALSE
"mean_ensemble","DAX","1 day",2024-01-10,-2.25545578454275,-0.441446401317159,0.207975407164399,0.853745271187277,2.37488467527992,-0.859179928062304,0.0698137928240223,0.626600290117717,1.0671553352267,0.85646259962479,0.161703230167111,0.556347049592069,1.0671553352267,FALSE,TRUE,FALSE
"DAX_benchmark","DAX","1 day",2024-01-10,-3.32126527152158,-0.538265958707562,0.0686313077538969,0.71565263188873,2.71977200360272,-0.859179928062304,0.123104267172964,0.481370954032112,0.927811235816201,0.787416279975517,0.178947596583252,0.499730066716009,0.927811235816201,FALSE,TRUE,FALSE
"Rachel","DAX","1 day",2024-01-10,-2.1928727729817,-0.389264177442883,0.0516841019449388,0.58092694947221,1.98281058925477,-0.859179928062304,0.0666846422459697,0.70487362592913,0.910864030007242,0.720053438767257,0.142099525865854,0.508915052563091,0.910864030007242,FALSE,TRUE,FALSE
"JonSnow","DAX","1 day",2024-01-10,-3.32126527152158,-0.538265958707562,0.0686313077538969,0.71565263188873,2.71977200360272,-0.859179928062304,0.123104267172964,0.481370954032112,0.927811235816201,0.787416279975517,0.178947596583252,0.499730066716009,0.927811235816201,FALSE,TRUE,FALSE
"CharlesBoyle","DAX","1 day",2024-01-10,-0.819362246258062,-0.14957351493492,0.0749310125146784,0.432574011440856,1.09064131095422,-0.859179928062304,0.0776444795182716,1.06440961969108,0.934110940576982,0.64587696975158,0.0974910619508263,0.563906614297747,0.934110940576982,FALSE,FALSE,FALSE
"median_ensemble","DAX","1 day",2024-01-10,-2.1928727729817,-0.4739031,0.0686313077538969,0.6320969,1.98281058925477,-0.859179928062304,0.0666846422459698,0.577915242093455,0.927811235816201,0.745638414031152,0.142099525865854,0.492029812010526,0.927811235816201,FALSE,TRUE,FALSE
"homersimpson","DAX","1 day",2024-01-10,-3.32126527152158,-0.538265958707562,0.0686313077538969,0.71565263188873,2.71977200360272,-0.859179928062304,0.123104267172964,0.481370954032112,0.927811235816201,0.787416279975517,0.178947596583252,0.499730066716009,0.927811235816201,FALSE,TRUE,FALSE
"MasterYoda","DAX","1 day",2023-12-20,-1.362,-0.3132,0.0899,0.4988,1.873,-0.859179928062304,0.0251410035968848,0.818969892093455,0.949079928062304,0.678989964031152,0.136608996403115,0.521757956837382,0.949079928062304,FALSE,TRUE,FALSE
"DaenerysTargaryen","DAX","1 day",2024-01-10,-2.623,-0.562,1.622,3.352,5.749,-0.859179928062304,0.0881910035968848,0.445769892093455,2.4811799280623,2.10558996403115,0.330408996403115,1.09022795683738,2.4811799280623,FALSE,TRUE,FALSE
"Phoebe","DAX","1 day",2024-01-10,-1.6449787,-0.4739031,0.09527683,0.6320969,1.563315,-0.859179928062304,0.0392899385968848,0.577915242093455,0.954456758062304,0.745638414031152,0.121124746403115,0.487685019837382,0.954456758062304,FALSE,TRUE,FALSE
"JakePeralta","DAX","1 day",2024-01-10,-1.5276744462736,-0.397897327283024,0.0294134227369014,0.486945467796228,1.49475222308152,-0.859179928062304,0.0334247259105646,0.691923901168919,0.888593350799205,0.673062697929266,0.117696607557191,0.480940256673029,0.888593350799205,FALSE,TRUE,FALSE
"TormundGiantsbane","DAX","1 day",2024-01-10,-1.6208083194967,-0.388701635075456,0.0467069658937751,0.519058007922643,1.56549982022932,-0.859179928062304,0.0380814195717198,0.705717439480271,0.905886893956079,0.689118967992473,0.121233987414581,0.492007741683025,0.905886893956079,FALSE,TRUE,FALSE
"BrienneVonTarth","DAX","2 day",2024-01-10,-3.91077363970152,-0.817935609433798,0.0740388594009385,0.999541699136564,3.49303931505373,0.0883382466930982,0.199955594319731,0.453136928063448,0.0142993872921597,0.455601726221733,0.170235053418032,0.258645737863021,0.0142993872921597,TRUE,TRUE,FALSE
"mean_ensemble","DAX","2 day",2024-01-10,-2.86839848866732,-0.699135544212854,0.215185208614544,1.07404247088597,3.04389718157468,0.0883382466930982,0.147836836768021,0.393736895452976,0.126846961921446,0.492852112096436,0.147777946744079,0.261810150596592,0.126846961921446,TRUE,TRUE,FALSE
"DAX_benchmark","DAX","2 day",2024-01-10,-4.0878949635655,-0.785749596108021,0.0894760728836097,0.978977141698723,3.57049232679329,0.0883382466930982,0.20881166051293,0.437043921400559,0.0011378261905115,0.445319447502812,0.17410770400501,0.253284111922364,0.0011378261905115,TRUE,TRUE,FALSE
"Rachel","DAX","2 day",2024-01-10,-2.04775338397612,-0.149088409677425,0.17409060668094,0.455187625571564,1.7164313575441,0.0883382466930982,0.106804581533461,0.118713328185262,0.085752359987842,0.183424689439233,0.0814046555425502,0.11521992293767,0.085752359987842,TRUE,TRUE,FALSE
"JonSnow","DAX","2 day",2024-01-10,-4.0878949635655,-0.785749596108021,0.0894760728836097,0.978977141698723,3.57049232679329,0.0883382466930982,0.20881166051293,0.437043921400559,0.0011378261905115,0.445319447502812,0.17410770400501,0.253284111922364,0.0011378261905115,TRUE,TRUE,FALSE
"CharlesBoyle","DAX","2 day",2024-01-10,-1.01277907389496,-0.167019767141596,0.260405539145392,0.610148567857349,1.44761458141716,0.0883382466930982,0.0550558660294027,0.127679006917347,0.172067292452294,0.260905160582126,0.0679638167362029,0.136734228543474,0.172067292452294,TRUE,TRUE,FALSE
"median_ensemble","DAX","2 day",2024-01-10,-2.48937040736896,-0.719622865422711,0.0894760728836097,0.960577694388594,2.5527,0.0883382466930982,0.128885432703103,0.403980556057905,0.0011378261905115,0.436119723847748,0.123218087665345,0.218668325292922,0.0011378261905115,TRUE,TRUE,FALSE
"homersimpson","DAX","2 day",2024-01-10,-4.0878949635655,-0.785749596108021,0.0894760728836097,0.978977141698722,3.57049232679329,0.0883382466930982,0.20881166051293,0.437043921400559,0.0011378261905115,0.445319447502812,0.174107704005009,0.253284111922364,0.0011378261905115,TRUE,TRUE,FALSE
"MasterYoda","DAX","2 day",2023-12-20,-1.9749,-0.533,0.03145,0.6218,2.5527,0.0883382466930982,0.103161912334655,0.310669123346549,0.0568882466930982,0.266730876653451,0.123218087665345,0.17213364933862,0.0568882466930982,TRUE,TRUE,FALSE
"DaenerysTargaryen","DAX","2 day",2024-01-10,-3.521,-1.763,1.345,3.642,6.636,0.0883382466930982,0.180466912334655,0.925669123346549,1.2566617533069,1.77683087665345,0.327383087665345,0.89340235066138,1.2566617533069,TRUE,TRUE,FALSE
"Phoebe","DAX","2 day",2024-01-10,-2.2563788,-0.5546621,0.10051579,0.8922532,2.353154,0.0883382466930982,0.117235852334655,0.321500173346549,0.0121775433069018,0.401957476653451,0.113240787665345,0.19322236666138,0.0121775433069018,TRUE,TRUE,FALSE
"JakePeralta","DAX","2 day",2024-01-10,-2.07574317970247,-0.628913446341798,0.019463094133032,0.696026967695377,2.14504224731141,0.0883382466930982,0.108204071319778,0.358625846517448,0.0688751525600662,0.303844360501139,0.102835200030916,0.188476926185869,0.0688751525600662,TRUE,TRUE,FALSE
"TormundGiantsbane","DAX","2 day",2024-01-10,-2.48937040736896,-0.719622865422711,0.0936451867488499,0.960577694388594,2.42741051561525,0.0883382466930982,0.128885432703103,0.403980556057905,0.0053069400557517,0.436119723847748,0.116953613446108,0.218249253222123,0.0053069400557517,TRUE,TRUE,FALSE
"BrienneVonTarth","DAX","5 day",2024-01-10,-4.78137101461396,-0.950683808693939,0.135265459400627,1.22354780603133,4.40061627456178,-0.405798949901737,0.218778603235611,0.272442429396101,0.541064409302364,0.814673377966534,0.240320761223176,0.417455916224757,0.541064409302364,TRUE,TRUE,FALSE
"mean_ensemble","DAX","5 day",2024-01-10,-3.63115286141,-0.950919619020973,0.170382868753656,1.08832587806797,3.46196101432591,-0.405798949901737,0.161267695575413,0.272560334559618,0.576181818655393,0.747062413984853,0.193387998211383,0.390092052197332,0.576181818655393,TRUE,TRUE,FALSE
"DAX_benchmark","DAX","5 day",2024-01-10,-5.25916085313898,-0.885121520375876,0.168228146492844,1.24066584919045,4.62869696515187,-0.405798949901737,0.242668095161862,0.239661285237069,0.57402709639458,0.823232399546092,0.251724795752681,0.426262734418457,0.57402709639458,TRUE,TRUE,FALSE
"Rachel","DAX","5 day",2024-01-10,-2.62201595752368,-0.282015554270929,0.321119518023747,0.812104313379738,2.99858336991921,-0.405798949901737,0.110810850381097,0.185675093446212,0.726918467925484,0.608951631640737,0.170219115991047,0.360515031876916,0.726918467925484,FALSE,TRUE,FALSE
"JonSnow","DAX","5 day",2024-01-10,-5.25916085313898,-0.885121520375876,0.168228146492844,1.24066584919045,4.62869696515187,-0.405798949901737,0.242668095161862,0.239661285237069,0.57402709639458,0.823232399546092,0.251724795752681,0.426262734418457,0.57402709639458,TRUE,TRUE,FALSE
"CharlesBoyle","DAX","5 day",2024-01-10,-1.00048218326474,-0.0940487620895158,0.192024203948016,1.04674753581731,2.09411629027508,-0.405798949901737,0.0297341616681501,0.467625281718331,0.597823153849752,0.726273242859521,0.124995762008841,0.389290320420919,0.597823153849752,FALSE,TRUE,FALSE
"median_ensemble","DAX","5 day",2024-01-10,-3.0368366,-0.8003658,0.168228146492844,1.0780927,3.2,-0.405798949901737,0.131551882504913,0.197283425049132,0.574027096394581,0.741945824950868,0.180289947495087,0.365019635278916,0.574027096394581,TRUE,TRUE,FALSE
"homersimpson","DAX","5 day",2024-01-10,-5.25916085313898,-0.885121520375876,0.168228146492844,1.24066584919045,4.62869696515187,-0.405798949901737,0.242668095161862,0.239661285237069,0.57402709639458,0.823232399546092,0.251724795752681,0.426262734418457,0.57402709639458,TRUE,TRUE,FALSE
"MasterYoda","DAX","5 day",2023-12-20,-2.3866,-0.6901,0.1006,0.9643,3.2,-0.405798949901737,0.0990400525049132,0.142150525049132,0.506398949901737,0.685049474950868,0.180289947495087,0.322585789980347,0.506398949901737,TRUE,TRUE,FALSE
"DaenerysTargaryen","DAX","5 day",2024-01-10,-5.418,-3.511,0.247,1.341,3.532,-0.405798949901737,0.250610052504913,1.55260052504913,0.652798949901737,0.873399474950868,0.196889947495087,0.705259789980347,0.652798949901737,TRUE,TRUE,FALSE
"Phoebe","DAX","5 day",2024-01-10,-3.0368366,-0.8003658,0.15661116,1.0780927,3.074166,-0.405798949901737,0.131551882504913,0.197283425049132,0.562410109901737,0.741945824950868,0.173998247495087,0.361437897980347,0.562410109901737,TRUE,TRUE,FALSE
"JakePeralta","DAX","5 day",2024-01-10,-2.61293173453628,-0.762115893773297,0.0865512383473543,0.907767028830209,2.54667771184849,-0.405798949901737,0.110356639231727,0.17815847193578,0.492350188249091,0.656782989365973,0.147623833087512,0.317054424374017,0.492350188249091,TRUE,TRUE,FALSE
"TormundGiantsbane","DAX","5 day",2024-01-10,-2.30696142615436,-0.714421429275398,0.130355537091936,0.876027727117797,2.34932061552481,-0.405798949901737,0.0950581238126312,0.154311239686831,0.536154486993673,0.640913338509767,0.137755978271327,0.312838633454846,0.536154486993673,TRUE,TRUE,FALSE
"BrienneVonTarth","DAX","6 day",2024-01-10,-5.59083593896643,-1.07098803138665,0.177473136577904,1.45189049365045,4.88374021468717,-0.710319082135946,0.244025842841524,0.180334474625354,0.88779221871385,1.0811047878932,0.279702964841156,0.534592057783016,0.88779221871385,TRUE,TRUE,FALSE
"mean_ensemble","DAX","6 day",2024-01-10,-4.0719728395585,-0.839496821911781,0.257205934117072,1.44965103541428,4.10569563257014,-0.710319082135946,0.168082687871128,0.0645888698879174,0.967525016253018,1.07998505877511,0.240800735735305,0.504196473704496,0.967525016253018,TRUE,TRUE,FALSE
"DAX_benchmark","DAX","6 day",2024-01-10,-6.28262880068359,-1.00746347507736,0.212652134178715,1.44081525186115,5.3673964152176,-0.710319082135946,0.278615485927382,0.148572196470709,0.922971216314661,1.07556716699855,0.303885774867677,0.545922368115795,0.922971216314661,TRUE,TRUE,FALSE
"Rachel","DAX","6 day",2024-01-10,-3.08056341196459,-0.228330035858835,0.43597591582091,1.07676894534188,2.92105109841418,-0.710319082135946,0.118512216491432,0.722983569415667,1.14629499795686,0.893544013738914,0.181568509027507,0.612580661326075,1.14629499795686,FALSE,TRUE,FALSE
"JonSnow","DAX","6 day",2024-01-10,-6.28262880068359,-1.00746347507736,0.212652134178715,1.44081525186115,5.3673964152176,-0.710319082135946,0.278615485927382,0.148572196470709,0.922971216314661,1.07556716699855,0.303885774867677,0.545922368115795,0.922971216314661,TRUE,TRUE,FALSE
"CharlesBoyle","DAX","6 day",2024-01-10,-1.02117674268047,-0.173610064913276,0.380787304168972,1.13195042792857,2.66971943702146,-0.710319082135946,0.0155428830272262,0.805063525834005,1.09110638630492,0.92113475503226,0.16900192595787,0.600369895231256,1.09110638630492,FALSE,TRUE,FALSE
"median_ensemble","DAX","6 day",2024-01-10,-3.617155,-0.9417379,0.212652134178715,1.3086011,3.6384,-0.710319082135946,0.145341795893203,0.115709408932027,0.922971216314661,1.00946009106797,0.217435954106798,0.482183693262932,0.922971216314661,TRUE,TRUE,FALSE
"homersimpson","DAX","6 day",2024-01-10,-6.28262880068359,-1.00746347507736,0.212652134178715,1.44081525186115,5.3673964152176,-0.710319082135946,0.278615485927382,0.148572196470709,0.922971216314661,1.07556716699855,0.303885774867677,0.545922368115795,0.922971216314661,TRUE,TRUE,FALSE
"MasterYoda","DAX","6 day",2023-12-20,-2.994,-0.7711,0.1855,1.0693,3.6384,-0.710319082135946,0.114184045893203,0.0303904589320269,0.895819082135946,0.889809541067973,0.217435954106798,0.429527816427189,0.895819082135946,TRUE,TRUE,FALSE
"DaenerysTargaryen","DAX","6 day",2024-01-10,-4.453,-1.622,0.462,3.625,5.975,-0.710319082135946,0.187134045893203,0.455840458932027,1.17231908213595,2.16765954106797,0.334265954106798,0.863443816427189,1.17231908213595,TRUE,TRUE,FALSE
"Phoebe","DAX","6 day",2024-01-10,-3.617155,-0.9417379,0.20215715,1.3086011,3.429153,-0.710319082135946,0.145341795893203,0.115709408932027,0.912476232135946,1.00946009106797,0.206973604106797,0.477992226427189,0.912476232135946,TRUE,TRUE,FALSE
"JakePeralta","DAX","6 day",2024-01-10,-2.96200456049372,-0.873082567645791,0.130488035111131,1.06767955697435,3.00706441068355,-0.710319082135946,0.112584273917889,0.0813817427549225,0.840807117247078,0.888999319555146,0.185869174640975,0.421928325623202,0.840807117247078,TRUE,TRUE,FALSE
"TormundGiantsbane","DAX","6 day",2024-01-10,-2.22507917898752,-0.531226015992939,0.216927331072729,0.89252511007839,2.53633455181234,-0.710319082135946,0.0757380048425787,0.268639599214511,0.927246413208675,0.801422096107168,0.162332681697414,0.447075759014069,0.927246413208675,FALSE,TRUE,FALSE
"BrienneVonTarth","DAX","7 day",2024-01-10,-5.92642012045391,-1.09558505060528,0.277594879314282,1.54693772737146,5.17994741360069,-1.55866322151557,0.218387844946917,0.694617256365426,1.83625810082985,1.55280047444351,0.336930531755813,0.927798841668304,1.83625810082985,FALSE,TRUE,FALSE
"mean_ensemble","DAX","7 day",2024-01-10,-4.56187232302966,-1.11953456823555,0.401539088012075,1.83702231543077,4.77254715440377,-1.55866322151557,0.150160455075705,0.658692979920024,1.96020230952764,1.69784276847317,0.316560518795967,0.956691806358501,1.96020230952764,FALSE,TRUE,FALSE
"DAX_benchmark","DAX","7 day",2024-01-10,-6.73574196413719,-1.04928943756333,0.342611649307223,1.60713387846174,6.25993408587484,-1.55866322151557,0.258853937131081,0.764060675928357,1.90127487082279,1.58289854998865,0.390929865369521,0.97960357984808,1.90127487082279,FALSE,TRUE,FALSE
"Rachel","DAX","7 day",2024-01-10,-3.44937607887221,-0.192734923975748,0.653435644253866,1.43559355081038,3.28389725728539,-1.55866322151557,0.0945356428678323,2.04889244630973,2.21209886576943,1.49712838616297,0.242128023940048,1.21895667301,2.21209886576943,FALSE,TRUE,FALSE
"JonSnow","DAX","7 day",2024-01-10,-6.73574196413719,-1.04928943756333,0.342611649307223,1.60713387846174,6.25993408587484,-1.55866322151557,0.258853937131081,0.764060675928357,1.90127487082279,1.58289854998865,0.390929865369521,0.97960357984808,1.90127487082279,FALSE,TRUE,FALSE
"CharlesBoyle","DAX","7 day",2024-01-10,-0.901381284732912,-0.266985102609807,0.5189836575763,1.50675643916456,3.07871036080063,-1.55866322151557,1.28169977672618,1.93751717835864,2.07764687909187,1.53270983034006,0.23186867911581,1.41228846872651,2.07764687909187,FALSE,FALSE,FALSE
"median_ensemble","DAX","7 day",2024-01-10,-4.2119693,-1.04928943756333,0.342611649307223,1.54693772737146,4.239251,-1.55866322151557,0.132665303924222,0.764060675928354,1.90127487082279,1.55280047444351,0.289895711075779,0.928139407238931,1.90127487082279,FALSE,TRUE,FALSE
"homersimpson","DAX","7 day",2024-01-10,-6.73574196413719,-1.04928943756333,0.342611649307223,1.60713387846174,6.25993408587484,-1.55866322151557,0.258853937131081,0.764060675928357,1.90127487082279,1.58289854998865,0.390929865369521,0.97960357984808,1.90127487082279,FALSE,TRUE,FALSE
"MasterYoda","DAX","7 day",2023-12-20,-3.0513,-0.8832,0.0323,1.3364,4.1399,-1.55866322151557,0.0746318389242217,1.01319483227335,1.59096322151557,1.44753161075778,0.284928161075779,0.88224993290934,1.59096322151557,FALSE,TRUE,FALSE
"DaenerysTargaryen","DAX","7 day",2024-01-10,-6.532,-3.763,1.543,5.322,7.542,-1.55866322151557,0.248666838924222,1.10216838924222,3.10166322151557,3.44033161075778,0.455033161075779,1.66957264430311,3.10166322151557,TRUE,TRUE,FALSE
"Phoebe","DAX","7 day",2024-01-10,-4.2119693,-1.4168921,0.1203008,1.9076979,4.239251,-1.55866322151557,0.132665303924222,0.212656682273349,1.67896402151557,1.73318056075778,0.289895711075779,0.80947245590934,1.67896402151557,FALSE,TRUE,FALSE
"JakePeralta","DAX","7 day",2024-01-10,-3.15200433139299,-0.876685131936374,0.122186037300143,1.20980510757225,3.1703638630164,-1.55866322151557,0.079667055493871,1.02296713436879,1.68084925881571,1.38423416454391,0.236451354226599,0.880833793489775,1.68084925881571,FALSE,TRUE,FALSE
"TormundGiantsbane","DAX","7 day",2024-01-10,-2.74891854546264,-0.671929628773836,0.121294001766567,1.12065310943462,3.08414654611387,-1.55866322151557,0.0595127661973537,1.3301003891126,1.67995722328213,1.33965816547509,0.232140488381472,0.928273806489729,1.67995722328213,FALSE,TRUE,FALSE
"mean_ensemble","infections","0 week",2024-01-10,2082,2082,2082,2082,2082,963,2182.05,1678.5,1119,559.5,55.9500000000001,1119,1119,FALSE,FALSE,FALSE
"infections_benchmark_strong","infections","0 week",2024-01-10,2082,2082,2082,2082,2082,963,2182.05,1678.5,1119,559.5,55.9500000000001,1119,1119,FALSE,FALSE,FALSE
"StannisBaratheon","infections","0 week",2024-01-10,2082,2082,2082,2082,2082,963,2182.05,1678.5,1119,559.5,55.9500000000001,1119,1119,FALSE,FALSE,FALSE
"median_ensemble","infections","0 week",2024-01-10,2082,2082,2082,2082,2082,963,2182.05,1678.5,1119,559.5,55.9500000000001,1119,1119,FALSE,FALSE,FALSE
"infections_benchmark_weak","infections","0 week",2024-01-10,2082,2082,2082,2082,2082,963,2182.05,1678.5,1119,559.5,55.9500000000001,1119,1119,FALSE,FALSE,FALSE
"StannisBaratheon","infections","1 week",2024-01-10,1012.2,1249,1326,1372,2862.2,1658,32.29,204.5,332,429,60.21,211.6,332,FALSE,TRUE,FALSE
"mean_ensemble","infections","1 week",2024-01-10,1198.1,1518.5,1677.75,1831.5,2855.1,1658,22.995,69.75,19.75,86.75,59.855,51.82,19.75,TRUE,TRUE,FALSE
"infections_benchmark_strong","infections","1 week",2024-01-10,1384,1788,2029.5,2291,2848,1658,13.7,195,371.5,316.5,59.5,191.24,371.5,FALSE,TRUE,FALSE
"median_ensemble","infections","1 week",2024-01-10,1198.1,1518.5,1677.75,1831.5,2855.1,1658,22.995,69.75,19.75,86.75,59.855,51.82,19.75,TRUE,TRUE,FALSE
"infections_benchmark_weak","infections","1 week",2024-01-10,1017.75,1133,1264,1370.5,2774.75,1658,32.0125,262.5,394,431.25,55.8375,235.12,394,FALSE,TRUE,FALSE
"infections_benchmark_weak","infections","2 week",2024-01-10,1088.25,1192.5,1302,1390,2824.5,1665,28.8375,236.25,363,412.5,57.9750000000001,219.7125,363,FALSE,TRUE,FALSE
"mean_ensemble","infections","2 week",2024-01-10,1148.9875,1438.875,1636.5,1861.5,3016.9125,1665,25.800625,113.0625,28.5,98.25,67.5956250000001,66.64175,28.5,TRUE,TRUE,FALSE
"infections_benchmark_strong","infections","2 week",2024-01-10,1196.975,1661.75,1965,2311,3124.025,1665,23.40125,1.625,300,323,72.9512500000001,144.1955,300,TRUE,TRUE,FALSE
"StannisBaratheon","infections","2 week",2024-01-10,1101,1216,1308,1412,2909.8,1665,28.2,224.5,357,379.5,62.2400000000001,210.288,357,FALSE,TRUE,FALSE
"median_ensemble","infections","2 week",2024-01-10,1148.9875,1438.875,1636.5,1861.5,3016.9125,1665,25.800625,113.0625,28.5,98.25,67.5956250000001,66.64175,28.5,TRUE,TRUE,FALSE
"median_ensemble","infections","3 week",2024-01-10,961.3,1403.5,1597,1861,2891.2,1763,40.085,179.75,166,49,56.41,98.249,166,TRUE,TRUE,FALSE
"StannisBaratheon","infections","3 week",2024-01-10,823.6,1227,1274,1404,2529.4,1763,46.97,268,489,538.5,38.32,276.158,489,FALSE,TRUE,FALSE
"mean_ensemble","infections","3 week",2024-01-10,961.3,1403.5,1597,1861,2891.2,1763,40.085,179.75,166,49,56.41,98.249,166,TRUE,TRUE,FALSE
"infections_benchmark_weak","infections","3 week",2024-01-10,831.25,1144.5,1245,1373.5,2465.25,1763,46.5875,309.25,518,584.25,35.1125,298.64,518,FALSE,TRUE,FALSE
"infections_benchmark_strong","infections","3 week",2024-01-10,1099,1580,1920,2318,3253,1763,33.2,91.5,157,277.5,74.5000000000001,126.74,157,TRUE,TRUE,FALSE
"infections_benchmark_weak","infections","4 week",2024-01-10,389,483.5,572,700,1228.25,2026,81.85,771.25,1454,1989,1555.6125,1170.3425,1454,FALSE,FALSE,FALSE
"median_ensemble","infections","4 week",2024-01-10,728.8,1018,1270.75,1503.5,2307.2125,2026,64.86,504,755.25,783.75,14.060625,424.384125,755.25,FALSE,TRUE,FALSE
"infections_benchmark_strong","infections","4 week",2024-01-10,1030,1531,1877.5,2295,3369.025,2026,49.8,247.5,148.5,134.5,67.1512500000001,129.49025,148.5,TRUE,TRUE,FALSE
"mean_ensemble","infections","4 week",2024-01-10,728.8,1018,1270.75,1503.5,2307.2125,2026,64.86,504,755.25,783.75,14.060625,424.384125,755.25,FALSE,TRUE,FALSE
"StannisBaratheon","infections","4 week",2024-01-10,427.6,505,664,712,1245.4,2026,79.92,760.5,1362,1971,1522.17,1139.118,1362,FALSE,FALSE,FALSE
"MasterYoda","energy","36 hour",2023-12-20,46.2509,53.2509,61.2509,68.2509,77.2509,63.30825,0.8528675,5.028675,2.05735,2.471325,0.697132500000001,2.22147,2.05735,TRUE,TRUE,FALSE
"MasterYoda","energy","40 hour",2023-12-20,45.7222,52.7222,60.7222,67.7222,76.7222,60.02825,0.7153025,3.653025,0.693950000000001,3.846975,0.834697500000001,1.94879,0.693950000000001,TRUE,TRUE,FALSE
"MasterYoda","energy","44 hour",2023-12-20,45.5772,53.5772,61.5772,68.5772,77.5772,55.70225,0.5062525,1.062525,5.87495,6.437475,1.0937475,2.99499,5.87495,TRUE,TRUE,FALSE
"MasterYoda","energy","60 hour",2023-12-20,44.2498,51.2498,59.2498,66.2498,75.2498,56.35875,0.6054475,2.554475,2.89105,4.945525,0.9445525,2.38821,2.89105,TRUE,TRUE,FALSE
"MasterYoda","energy","64 hour",2023-12-20,44.562,51.562,59.562,66.562,75.562,55.02275,0.5230375,1.730375,4.53925,5.769625,1.0269625,2.71785,4.53925,TRUE,TRUE,FALSE
"MasterYoda","energy","68 hour",2023-12-20,45.3964,52.3964,60.3964,67.2964,76.3964,50.78625,0.2694925,2.415225,9.61015,8.255075,1.2805075,4.36609,9.61015,FALSE,TRUE,FALSE
"BrienneVonTarth","energy","36 hour",2024-01-10,58.1688353987192,65.6594232621649,67.6299418618208,69.4605936395731,71.3512359912893,71.2565,0.65438323006404,2.79853836891755,3.62655813817923,2.69385954064041,0.00473679956446276,1.95561521547314,3.62655813817923,FALSE,TRUE,FALSE
"Rachel","energy","36 hour",2024-01-10,67.464925,68.28275,68.5145,68.708375,69.35799375,71.2565,0.18957875,1.486875,2.742,3.82218750000002,3.70208718750002,2.38854568750001,2.742,FALSE,FALSE,FALSE
"Phoebe","energy","36 hour",2024-01-10,64.2879322,66.3566553,68.46584397,70.0518015,73.362934,71.2565,0.34842839,2.44992235,2.79065603000001,1.80704775000001,0.1053217,1.500275244,2.79065603000001,FALSE,TRUE,FALSE
"mean_ensemble","energy","36 hour",2024-01-10,57.5159395993842,62.2522227131937,66.3878628330358,68.7872881940355,72.5221641456173,71.2565,0.68702802003079,4.50213864340315,4.86863716696421,3.70381770894676,0.0632832072808647,2.76498094932515,4.86863716696421,FALSE,TRUE,FALSE
"JonSnow","energy","36 hour",2024-01-10,63.452465057373,62.9492835998535,63.2453956604004,62.7987365722656,62.9030227661133,71.2565,0.390201747131348,4.15360820007324,8.01110433959961,12.6866451416016,16.2892806060791,8.30616800689698,8.01110433959961,FALSE,FALSE,FALSE
"homersimpson","energy","36 hour",2024-01-10,54.8925569099937,55.0891820151251,72.8527545062632,74.1807545635558,75.6445378247251,71.2565,0.818197154500316,8.08365899243744,1.59625450626319,1.4621272817779,0.219401891236257,2.43592796524302,1.59625450626319,TRUE,TRUE,FALSE
"CharlesBoyle","energy","36 hour",2024-01-10,53.2212375,62.70025,66.79075,70.410625,75.62845,71.2565,0.901763125,4.278125,4.46575,1.26881249999999,0.218597499999999,2.226609625,4.46575,FALSE,TRUE,FALSE
"StannisBaratheon","energy","36 hour",2024-01-10,50.1254,58.8556875,61.719125,65.3528125,71.79365625,71.2565,1.056555,6.20040625,9.537375,8.85553125000001,0.0268578124999998,5.1353450625,9.537375,FALSE,TRUE,FALSE
"power_benchmark","energy","36 hour",2024-01-10,53.2747625,60.327375,63.453625,66.6040625,73.29589375,71.2565,0.899086875,5.4645625,7.802875,6.97865625000001,0.101969687499999,4.2494300625,7.802875,FALSE,TRUE,FALSE
"median_ensemble","energy","36 hour",2024-01-10,56.5306961543564,62.8247667999268,67.2103459309104,69.0844843197865,73.329413875,71.2565,0.73629019228218,4.2158666000366,4.0461540690896,3.25802352032026,0.10364569375,2.47199601509573,4.0461540690896,FALSE,TRUE,FALSE
"JakePeralta","energy","36 hour",2024-01-10,53.5516348538573,60.1465482192247,63.8027033432051,66.2300926737675,71.2379262819145,71.2565,0.885243257307133,5.55497589038764,7.45379665679491,7.53961098934871,0.0362187502666806,4.29396910882101,7.45379665679491,FALSE,FALSE,FALSE
"DaenerysTargaryen","energy","36 hour",2024-01-10,60.614,64.694,68.362,71.593,74.438,71.2565,0.532125,3.28125,2.89450000000001,0.16825,0.159075,1.40704,2.89450000000001,TRUE,TRUE,FALSE
"TormundGiantsbane","energy","36 hour",2024-01-10,64.886625772667,68.7146176619561,70.5668146547403,71.8057043792639,74.0014191333651,71.2565,0.318493711366649,1.27094116902195,0.689685345259733,0.27460218963197,0.137245956668255,0.53819367438971,0.689685345259733,TRUE,TRUE,FALSE
"median_ensemble","energy","40 hour",2024-01-10,54.5525348422395,60.6561875,63.4603125,66.2819001333208,70.9286875,67.7365,0.659198257888025,3.54015625,4.27618750000001,2.1818998000188,0.159609375,2.16341023658137,4.27618750000001,FALSE,TRUE,FALSE
"BrienneVonTarth","energy","40 hour",2024-01-10,54.8401513598216,61.6356711750116,64.0356224756895,65.9597377666416,68.1446691181081,67.7365,0.644817432008919,3.0504144124942,3.70087752431049,2.66514335003755,0.0204084559054053,2.01633223495131,3.70087752431049,FALSE,TRUE,FALSE
"Rachel","energy","40 hour",2024-01-10,63.099,64.1941875,64.498875,64.91675,66.96425,67.7365,0.231875,1.77115625,3.23762500000001,4.22962500000002,1.5058875,2.19523375000001,3.23762500000001,FALSE,FALSE,FALSE
"Phoebe","energy","40 hour",2024-01-10,60.3437939,63.112544,66.46945846,68.0147984,71.079343,67.7365,0.369635305,2.311978,1.26704154000001,0.139149199999999,0.16714215,0.850989239000002,1.26704154000001,TRUE,TRUE,FALSE
"mean_ensemble","energy","40 hour",2024-01-10,55.3018000220796,59.712756963223,63.8584949383827,66.411256986876,70.4380184784577,67.7365,0.621734998896021,4.0118715183885,3.87800506161731,1.98786451968601,0.135075923922885,2.12691040450215,3.87800506161731,FALSE,TRUE,FALSE
"JonSnow","energy","40 hour",2024-01-10,63.5176849365234,63.0014839172363,63.3451957702637,62.8889923095703,62.9456558227539,67.7365,0.210940753173828,2.36750804138184,4.39130422973633,7.27126153564454,9.3421461456299,4.71663214111329,4.39130422973633,FALSE,FALSE,FALSE
"homersimpson","energy","40 hour",2024-01-10,54.2649183246573,54.772756429721,72.3427598947697,73.0792790473415,74.7266407334639,67.7365,0.673579083767134,6.4818717851395,4.60625989476972,2.67138952367075,0.349507036673195,2.95652146480406,4.60625989476972,TRUE,TRUE,FALSE
"CharlesBoyle","energy","40 hour",2024-01-10,49.0783375,58.221125,61.765,65.505125,70.893375,67.7365,0.932908125,4.7576875,5.97150000000001,3.34706250000002,0.157843749999999,3.03340037500001,5.97150000000001,FALSE,TRUE,FALSE
"StannisBaratheon","energy","40 hour",2024-01-10,53.2747625,60.327375,63.453625,66.6040625,73.29589375,67.7365,0.723086875,3.7045625,4.282875,1.69865625000001,0.2779696875,2.1374300625,4.282875,FALSE,TRUE,FALSE
"power_benchmark","energy","40 hour",2024-01-10,50.64201875,55.75,58.491375,62.370375,68.5155875,67.7365,0.8547240625,5.99325,9.245125,8.04918750000002,0.0389543749999995,4.8362481875,9.245125,FALSE,TRUE,FALSE
"TormundGiantsbane","energy","40 hour",2024-01-10,61.527319360012,64.794078925227,67.3251751945744,69.1823925269954,73.0360336170878,67.7365,0.310459031999401,1.4712105373865,0.411324805425636,0.722946263497676,0.264976680854388,0.63618346383272,0.411324805425636,TRUE,TRUE,FALSE
"JakePeralta","energy","40 hour",2024-01-10,51.1604136339405,57.0366616114796,60.3856524652953,62.9373712919637,67.9685732000784,67.7365,0.828804318302973,5.34991919426022,7.35084753470476,7.1986930620545,0.0116036600039216,4.14797355386527,7.35084753470476,FALSE,TRUE,FALSE
"DaenerysTargaryen","energy","40 hour",2024-01-10,56.151,60.985,63.467,67.754,70.964,67.7365,0.579275,3.37575,4.26950000000001,0.00874999999999915,0.161375,1.67893,4.26950000000001,TRUE,TRUE,FALSE
"median_ensemble","energy","44 hour",2024-01-10,53.1515283760677,56.3658125,62.049530955,63.2765608791029,67.63879375,63.058,0.495323581196615,3.34609375,1.008469045,0.109280439551451,0.2290396875,1.03764130064961,1.008469045,TRUE,TRUE,FALSE
"power_benchmark","energy","44 hour",2024-01-10,49.34880625,52.423625,56.135375,58.662,65.452725,63.058,0.6854596875,5.3171875,6.922625,6.594,0.11973625,3.9278016875,6.922625,FALSE,TRUE,FALSE
"BrienneVonTarth","energy","44 hour",2024-01-10,53.7790567521353,60.7128637010017,62.7746628675105,63.5830709464383,64.4257429253084,63.058,0.463947162393233,1.17256814949915,0.283337132489542,0.262535473219145,0.0683871462654207,0.450155012773299,0.283337132489542,TRUE,TRUE,FALSE
"Rachel","energy","44 hour",2024-01-10,61.639525,62.5735,62.86925,62.873,65.401,63.058,0.07092375,0.242249999999999,0.188749999999999,0.277499999999993,0.11715,0.179314749999998,0.188749999999999,FALSE,TRUE,FALSE
"Phoebe","energy","44 hour",2024-01-10,56.9019891,58.3923002,62.52186191,64.0860199,70.480006,63.058,0.307800545,2.3328499,0.536138090000001,0.514009949999998,0.3711003,0.812379757,0.536138090000001,TRUE,TRUE,FALSE
"mean_ensemble","energy","44 hour",2024-01-10,53.8586037019379,57.7409003393315,61.8421937396939,64.3808513293959,68.5756749559459,63.058,0.459969814903105,2.65854983033425,1.2158062603061,0.661425664697948,0.275883747797295,1.05432706360774,1.2158062603061,TRUE,TRUE,FALSE
"JonSnow","energy","44 hour",2024-01-10,63.5747108459473,63.0436973571777,63.4376335144043,62.9700508117676,62.9794807434082,63.058,1.00758614959717,0.00715132141113273,0.379633514404297,0.131923782348633,0.153112550354004,0.335881463623047,0.379633514404297,FALSE,FALSE,FALSE
"homersimpson","energy","44 hour",2024-01-10,53.8796359367617,54.6267955730925,70.1690650532069,72.246541742533,75.1284029240947,63.058,0.458918203161914,4.21560221345374,7.11106505320686,4.59427087126651,0.603520146204736,3.39667529745875,7.11106505320686,TRUE,TRUE,FALSE
"CharlesBoyle","energy","44 hour",2024-01-10,51.2695875,56.364625,60.345,66.77825,71.5138125,63.058,0.589420625,3.3466875,2.713,1.860125,0.422790625,1.78640475,2.713,TRUE,TRUE,FALSE
"StannisBaratheon","energy","44 hour",2024-01-10,50.64201875,55.75,58.491375,62.370375,68.5155875,63.058,0.6207990625,3.654,4.566625,1.0314375,0.272879375,2.0291481875,4.566625,FALSE,TRUE,FALSE
"DaenerysTargaryen","energy","44 hour",2024-01-10,52.524,56.367,60.321,62.865,66.762,63.058,0.5267,3.3455,2.737,0.289499999999997,0.1852,1.41678,2.737,FALSE,TRUE,FALSE
"TormundGiantsbane","energy","44 hour",2024-01-10,58.9180157834375,65.6418569704333,67.1971083456391,68.8247636007402,70.847354598278,63.058,0.206999210828126,3.87578545564999,4.13910834563908,2.88338180037008,0.389467729913902,2.29894850848024,4.13910834563908,FALSE,TRUE,FALSE
"JakePeralta","energy","44 hour",2024-01-10,48.2486985049734,53.4173402702726,56.2667931855661,58.7339439512719,63.8247872802619,63.058,0.740465074751328,4.8203298648637,6.79120681443388,6.48608407309218,0.0383393640130944,3.77528503823083,6.79120681443388,FALSE,TRUE,FALSE
"median_ensemble","energy","60 hour",2024-01-10,49.8385833564932,53.4745450875399,58.687559955,60.3775825158936,62.4160495297198,63.37225,0.67668333217534,4.94885245623005,4.684690045,4.4920012261596,1.86459091704639,3.33336359532228,4.684690045,FALSE,FALSE,FALSE
"StannisBaratheon","energy","60 hour",2024-01-10,44.2046375,45.914875,48.68825,51.5310625,57.127775,63.37225,0.958380625,8.7286875,14.684,17.76178125,12.17672625,10.861915125,14.684,FALSE,FALSE,FALSE
"power_benchmark","energy","60 hour",2024-01-10,47.75543125,51.0500625,53.83775,56.397625,61.4666125,63.37225,0.7808409375,6.16109375,9.5345,10.4619375,3.71599312500001,6.1308730625,9.5345,FALSE,FALSE,FALSE
"BrienneVonTarth","energy","60 hour",2024-01-10,50.3535792129863,57.3031996635675,59.3942088269599,62.1910073209707,65.7735055307612,63.37225,0.650933539350684,3.03452516821626,3.97804117304005,1.77186401854389,0.120062776538059,1.91108533513779,3.97804117304005,FALSE,TRUE,FALSE
"Rachel","energy","60 hour",2024-01-10,60.5065,60.8685,61.0535,61.42575,61.68315,63.37225,0.1432875,1.251875,2.31875,2.91975,3.29374500000001,1.9854815,2.31875,FALSE,FALSE,FALSE
"Phoebe","energy","60 hour",2024-01-10,53.9112972,55.7305933,58.12531991,61.1012687,62.835787,63.37225,0.47304764,3.82082835,5.24693009,3.40647195,1.04610285,2.798676176,5.24693009,FALSE,FALSE,FALSE
"mean_ensemble","energy","60 hour",2024-01-10,51.0875560973122,54.3698620323706,58.2014405745993,60.9846116386671,64.4139505449802,63.37225,0.61423469513439,4.5011939838147,5.1708094254007,3.58145754199936,0.0520850272490098,2.78395613471963,5.1708094254007,FALSE,TRUE,FALSE
"JonSnow","energy","60 hour",2024-01-10,60.1672019958496,59.7676239013672,60.0377502441406,59.6538963317871,59.7387161254883,63.37225,0.16025240020752,1.80231304931641,3.33449975585938,5.57753050231934,7.08539105529785,3.5919973526001,3.33449975585938,FALSE,FALSE,FALSE
"homersimpson","energy","60 hour",2024-01-10,53.2529907440049,53.2639651750797,69.0567118123776,73.8055607600116,75.4069631221681,63.37225,0.505962962799757,5.05414241246013,5.68446181237758,5.2166553800058,0.601735656108404,3.41259164475034,5.68446181237758,TRUE,TRUE,FALSE
"CharlesBoyle","energy","60 hour",2024-01-10,49.3235875,53.685125,55.87025,59.58625,64.1890625,63.37225,0.702433125,4.8435625,7.502,5.679,0.0408406250000003,3.75356725,7.502,FALSE,TRUE,FALSE
"JakePeralta","energy","60 hour",2024-01-10,45.4067334873841,51.9943023312776,55.170459474614,57.390019480296,61.9963120594396,63.37225,0.898275825630794,5.6889738343612,8.20179052538598,8.97334577955604,2.68307898409285,5.28909298980537,8.20179052538598,FALSE,FALSE,FALSE
"DaenerysTargaryen","energy","60 hour",2024-01-10,48.514,51.953,55.853,58.865,61.462,63.37225,0.7429125,5.709625,7.51925,6.760875,3.7249875,4.89153,7.51925,FALSE,FALSE,FALSE
"TormundGiantsbane","energy","60 hour",2024-01-10,55.4049142775217,59.657297517155,62.0802866270998,63.6180995709403,66.0377227019056,63.37225,0.398366786123917,1.85747624142251,1.29196337290016,0.122924785470161,0.133273635095278,0.760800964202405,1.29196337290016,TRUE,TRUE,FALSE
"median_ensemble","energy","64 hour",2024-01-10,47.3901632120444,52.1973506934659,56.1347426654144,58.7110757240197,61.63080625,62.169,0.73894183939778,4.98582465326705,6.0342573345856,5.18688641397044,1.0494778125,3.59907761074417,6.0342573345856,FALSE,FALSE,FALSE
"CharlesBoyle","energy","64 hour",2024-01-10,45.7258375,49.532875,51.758,54.84975,60.9199875,62.169,0.822158125,6.3180625,10.411,10.978875,2.435574375,6.193134,10.411,FALSE,FALSE,FALSE
"StannisBaratheon","energy","64 hour",2024-01-10,47.75543125,51.0500625,53.83775,56.397625,61.4666125,62.169,0.7206784375,5.55946875,8.33125,8.6570625,1.369655625,4.9276230625,8.33125,FALSE,FALSE,FALSE
"power_benchmark","energy","64 hour",2024-01-10,44.08115625,47.022,49.9235,53.2171875,58.4553875,62.169,0.9043921875,7.5735,12.2455,13.42771875,7.24154437500001,8.2785310625,12.2455,FALSE,FALSE,FALSE
"BrienneVonTarth","energy","64 hour",2024-01-10,47.0248951740888,53.2794475764142,55.7998894408287,58.6901514480393,62.56693865758,62.169,0.757205241295562,4.4447762117929,6.3691105591713,5.21827282794102,0.0198969328790014,3.36185235461596,6.3691105591713,FALSE,TRUE,FALSE
"Rachel","energy","64 hour",2024-01-10,55.905,57.1980625,58.221375,58.6575,59.61575,62.169,0.3132,2.48546875,3.947625,5.26725,4.9788375,3.39847625,3.947625,FALSE,FALSE,FALSE
"Phoebe","energy","64 hour",2024-01-10,50.2295786,53.2072399,56.46959589,60.0988189,61.891689,62.169,0.59697107,4.48088005,5.69940411,3.10527165,0.540756449999995,2.884656666,5.69940411,FALSE,FALSE,FALSE
"mean_ensemble","energy","64 hour",2024-01-10,49.1300161545767,52.7735193471216,56.6623487785057,59.5951626854269,63.4945671887949,62.169,0.651949192271165,4.6977403264392,5.50665122149429,3.86075597185965,0.0662783594397454,2.95667501430081,5.50665122149429,FALSE,TRUE,FALSE
"JonSnow","energy","64 hour",2024-01-10,60.2980728149414,59.8785057067871,60.2040901184082,59.8072280883789,59.8390312194824,62.169,0.0935463592529295,1.14524714660644,1.96490988159179,3.54265786743164,4.54343912200927,2.25796007537841,1.96490988159179,FALSE,FALSE,FALSE
"homersimpson","energy","64 hour",2024-01-10,52.4637555822706,52.8327013869317,68.2869681533385,72.4152303700947,75.2346686397302,62.169,0.485262220886468,4.66814930653413,6.11796815333855,5.12311518504735,0.653283431986512,3.4095556595586,6.11796815333855,TRUE,TRUE,FALSE
"JakePeralta","energy","64 hour",2024-01-10,43.7841500534036,49.6530535094687,52.5220463826405,54.8659358844284,59.4955967635397,62.169,0.91924249732982,6.25797324526565,9.64695361735954,10.9545961733574,5.21313631109751,6.59838036888199,9.64695361735954,FALSE,FALSE,FALSE
"DaenerysTargaryen","energy","64 hour",2024-01-10,45.414,50.652,54.873,58.732,61.795,62.169,0.83775,5.7585,7.296,5.1555,0.729299999999991,3.95541,7.296,FALSE,FALSE,FALSE
"TormundGiantsbane","energy","64 hour",2024-01-10,52.3163166302159,57.4142840858578,58.4899703568528,60.848525034182,65.0921444852068,62.169,0.492634168489207,2.37735795707111,3.67902964314722,1.98071244872703,0.146157224260338,1.73517828833898,3.67902964314722,FALSE,TRUE,FALSE
"homersimpson","energy","68 hour",2024-01-10,52.1291355259147,53.0153617591999,66.6599855126852,71.530757690438,75.023547311144,58.50575,0.318830723704266,2.74519412040006,8.15423551268521,6.51250384521899,0.8258898655572,3.71133081351315,8.15423551268521,TRUE,TRUE,FALSE
"median_ensemble","energy","68 hour",2024-01-10,46.7474002832012,51.8305357512021,54.8784751113248,57.27591945,59.8893084482422,58.50575,0.58791748583994,3.33760712439895,3.6272748886752,1.84474582499999,0.06917792241211,1.89334464926524,3.6272748886752,FALSE,TRUE,FALSE
"CharlesBoyle","energy","68 hour",2024-01-10,45.9224,49.931625,53.03775,58.76475,63.532,58.50575,0.6291675,4.2870625,5.468,0.129500000000004,0.2513125,2.1530085,5.468,TRUE,TRUE,FALSE
"StannisBaratheon","energy","68 hour",2024-01-10,44.08115625,47.022,49.9235,53.2171875,58.4553875,58.50575,0.7212296875,5.741875,8.58225,7.93284375,0.0982068749999971,4.6152810625,8.58225,FALSE,FALSE,FALSE
"power_benchmark","energy","68 hour",2024-01-10,43.28444375,46.5779375,49.14375,52.8503125,57.51120625,58.50575,0.7610653125,5.96390625,9.362,8.48315625,1.93936031250001,5.301897625,9.362,FALSE,FALSE,FALSE
"BrienneVonTarth","energy","68 hour",2024-01-10,45.9638005664025,52.3566401024043,54.5389298326496,56.313484627836,58.8480124647803,58.50575,0.627097471679877,3.07455494879786,3.96682016735036,3.28839805824606,0.0171131232390163,2.19479675386263,3.96682016735036,FALSE,TRUE,FALSE
"Rachel","energy","68 hour",2024-01-10,54.3425,55.30425,55.395,56.6015,56.9955,58.50575,0.2081625,1.60075,3.11075,2.856375,2.9449875,2.144205,3.11075,FALSE,FALSE,FALSE
"Phoebe","energy","68 hour",2024-01-10,48.9971439,51.3044314,55.21802039,57.9503389,59.847373,58.50575,0.475430305,3.6006593,3.28772961,0.833116650000001,0.06708115,1.652803403,3.28772961,FALSE,TRUE,FALSE
"mean_ensemble","energy","68 hour",2024-01-10,48.5024156349779,51.7932766154165,55.5577072380907,58.5188458592275,62.4029705971709,58.50575,0.500166718251105,3.35623669229175,2.9480427619093,0.00654792961374895,0.194861029858545,1.40117102638489,2.9480427619093,TRUE,TRUE,FALSE
"JonSnow","energy","68 hour",2024-01-10,60.4220733642578,59.9804916381836,60.3637084960938,59.9522476196289,59.9312438964844,58.50575,3.73683056030274,2.21211245727539,1.85795849609375,0.723248809814454,0.0712746948242189,1.72028500366211,1.85795849609375,FALSE,FALSE,FALSE
"TormundGiantsbane","energy","68 hour",2024-01-10,52.3646085390151,56.3485590172393,59.1553647230403,60.0027721293813,64.2592751002098,58.50575,0.307057073049243,1.07859549138034,0.649614723040266,0.748511064690632,0.287676255010491,0.614290921434194,0.649614723040266,TRUE,TRUE,FALSE
"JakePeralta","energy","68 hour",2024-01-10,41.5943257241452,46.7556229679705,49.12507790262,51.3843993434453,56.0737016434319,58.50575,0.845571213792739,5.87506351601477,9.38067209737995,10.682025984832,4.74249429530776,6.30516542146544,9.38067209737995,FALSE,FALSE,FALSE
"DaenerysTargaryen","energy","68 hour",2024-01-10,47.531,50.526,53.735,56.362,61.962,58.50575,0.5487375,3.989875,4.77075,3.215625,0.1728125,2.53956,4.77075,FALSE,TRUE,FALSE
"infections_benchmark_strong","DAX","1 day",2024-01-10,NA,NA,NA,NA,NA,-0.859179928062304,NA,NA,NA,NA,NA,1.10113023640576,2.50599172734293,FALSE,FALSE,TRUE
"infections_benchmark_weak","DAX","1 day",2024-01-10,NA,NA,NA,NA,NA,-0.859179928062304,NA,NA,NA,NA,NA,1.10113023640576,2.50599172734293,FALSE,FALSE,TRUE
"power_benchmark","DAX","1 day",2024-01-10,NA,NA,NA,NA,NA,-0.859179928062304,NA,NA,NA,NA,NA,1.10113023640576,2.50599172734293,FALSE,FALSE,TRUE
"StannisBaratheon","DAX","1 day",2024-01-10,NA,NA,NA,NA,NA,-0.859179928062304,NA,NA,NA,NA,NA,1.10113023640576,2.50599172734293,FALSE,FALSE,TRUE
"TyrionLannister","DAX","1 day",2024-01-10,NA,NA,NA,NA,NA,-0.859179928062304,NA,NA,NA,NA,NA,1.10113023640576,2.50599172734293,FALSE,FALSE,TRUE
"infections_benchmark_strong","DAX","2 day",2024-01-10,NA,NA,NA,NA,NA,0.0883382466930982,NA,NA,NA,NA,NA,0.902336374167994,1.26922837083997,FALSE,FALSE,TRUE
"infections_benchmark_weak","DAX","2 day",2024-01-10,NA,NA,NA,NA,NA,0.0883382466930982,NA,NA,NA,NA,NA,0.902336374167994,1.26922837083997,FALSE,FALSE,TRUE
"power_benchmark","DAX","2 day",2024-01-10,NA,NA,NA,NA,NA,0.0883382466930982,NA,NA,NA,NA,NA,0.902336374167994,1.26922837083997,FALSE,FALSE,TRUE
"StannisBaratheon","DAX","2 day",2024-01-10,NA,NA,NA,NA,NA,0.0883382466930982,NA,NA,NA,NA,NA,0.902336374167994,1.26922837083997,FALSE,FALSE,TRUE
"TyrionLannister","DAX","2 day",2024-01-10,NA,NA,NA,NA,NA,0.0883382466930982,NA,NA,NA,NA,NA,0.902336374167994,1.26922837083997,FALSE,FALSE,TRUE
"infections_benchmark_strong","DAX","5 day",2024-01-10,NA,NA,NA,NA,NA,-0.405798949901737,NA,NA,NA,NA,NA,0.712312387880151,0.734187652604739,FALSE,FALSE,TRUE
"infections_benchmark_weak","DAX","5 day",2024-01-10,NA,NA,NA,NA,NA,-0.405798949901737,NA,NA,NA,NA,NA,0.712312387880151,0.734187652604739,FALSE,FALSE,TRUE
"power_benchmark","DAX","5 day",2024-01-10,NA,NA,NA,NA,NA,-0.405798949901737,NA,NA,NA,NA,NA,0.712312387880151,0.734187652604739,FALSE,FALSE,TRUE
"StannisBaratheon","DAX","5 day",2024-01-10,NA,NA,NA,NA,NA,-0.405798949901737,NA,NA,NA,NA,NA,0.712312387880151,0.734187652604739,FALSE,FALSE,TRUE
"TyrionLannister","DAX","5 day",2024-01-10,NA,NA,NA,NA,NA,-0.405798949901737,NA,NA,NA,NA,NA,0.712312387880151,0.734187652604739,FALSE,FALSE,TRUE
"infections_benchmark_strong","DAX","6 day",2024-01-10,NA,NA,NA,NA,NA,-0.710319082135946,NA,NA,NA,NA,NA,0.872078254591461,1.18404227295731,FALSE,FALSE,TRUE
"infections_benchmark_weak","DAX","6 day",2024-01-10,NA,NA,NA,NA,NA,-0.710319082135946,NA,NA,NA,NA,NA,0.872078254591461,1.18404227295731,FALSE,FALSE,TRUE
"power_benchmark","DAX","6 day",2024-01-10,NA,NA,NA,NA,NA,-0.710319082135946,NA,NA,NA,NA,NA,0.872078254591461,1.18404227295731,FALSE,FALSE,TRUE
"StannisBaratheon","DAX","6 day",2024-01-10,NA,NA,NA,NA,NA,-0.710319082135946,NA,NA,NA,NA,NA,0.872078254591461,1.18404227295731,FALSE,FALSE,TRUE
"TyrionLannister","DAX","6 day",2024-01-10,NA,NA,NA,NA,NA,-0.710319082135946,NA,NA,NA,NA,NA,0.872078254591461,1.18404227295731,FALSE,FALSE,TRUE
"infections_benchmark_strong","DAX","7 day",2024-01-10,NA,NA,NA,NA,NA,-1.55866322151557,NA,NA,NA,NA,NA,1.68626837074614,3.13267985373072,FALSE,FALSE,TRUE
"infections_benchmark_weak","DAX","7 day",2024-01-10,NA,NA,NA,NA,NA,-1.55866322151557,NA,NA,NA,NA,NA,1.68626837074614,3.13267985373072,FALSE,FALSE,TRUE
"power_benchmark","DAX","7 day",2024-01-10,NA,NA,NA,NA,NA,-1.55866322151557,NA,NA,NA,NA,NA,1.68626837074614,3.13267985373072,FALSE,FALSE,TRUE
"StannisBaratheon","DAX","7 day",2024-01-10,NA,NA,NA,NA,NA,-1.55866322151557,NA,NA,NA,NA,NA,1.68626837074614,3.13267985373072,FALSE,FALSE,TRUE
"TyrionLannister","DAX","7 day",2024-01-10,NA,NA,NA,NA,NA,-1.55866322151557,NA,NA,NA,NA,NA,1.68626837074614,3.13267985373072,FALSE,FALSE,TRUE
"BrienneVonTarth","infections","0 week",2024-01-10,NA,NA,NA,NA,NA,963,NA,NA,NA,NA,NA,1130.19,1130.19,FALSE,FALSE,TRUE
"CharlesBoyle","infections","0 week",2024-01-10,NA,NA,NA,NA,NA,963,NA,NA,NA,NA,NA,1130.19,1130.19,FALSE,FALSE,TRUE
"DaenerysTargaryen","infections","0 week",2024-01-10,NA,NA,NA,NA,NA,963,NA,NA,NA,NA,NA,1130.19,1130.19,FALSE,FALSE,TRUE
"DAX_benchmark","infections","0 week",2024-01-10,NA,NA,NA,NA,NA,963,NA,NA,NA,NA,NA,1130.19,1130.19,FALSE,FALSE,TRUE
"homersimpson","infections","0 week",2024-01-10,NA,NA,NA,NA,NA,963,NA,NA,NA,NA,NA,1130.19,1130.19,FALSE,FALSE,TRUE
"JakePeralta","infections","0 week",2024-01-10,NA,NA,NA,NA,NA,963,NA,NA,NA,NA,NA,1130.19,1130.19,FALSE,FALSE,TRUE
"JonSnow","infections","0 week",2024-01-10,NA,NA,NA,NA,NA,963,NA,NA,NA,NA,NA,1130.19,1130.19,FALSE,FALSE,TRUE
"MasterYoda","infections","0 week",2024-01-10,NA,NA,NA,NA,NA,963,NA,NA,NA,NA,NA,1130.19,1130.19,FALSE,FALSE,TRUE
"Phoebe","infections","0 week",2024-01-10,NA,NA,NA,NA,NA,963,NA,NA,NA,NA,NA,1130.19,1130.19,FALSE,FALSE,TRUE
"power_benchmark","infections","0 week",2024-01-10,NA,NA,NA,NA,NA,963,NA,NA,NA,NA,NA,1130.19,1130.19,FALSE,FALSE,TRUE
"Rachel","infections","0 week",2024-01-10,NA,NA,NA,NA,NA,963,NA,NA,NA,NA,NA,1130.19,1130.19,FALSE,FALSE,TRUE
"TormundGiantsbane","infections","0 week",2024-01-10,NA,NA,NA,NA,NA,963,NA,NA,NA,NA,NA,1130.19,1130.19,FALSE,FALSE,TRUE
"TyrionLannister","infections","0 week",2024-01-10,NA,NA,NA,NA,NA,963,NA,NA,NA,NA,NA,1130.19,1130.19,FALSE,FALSE,TRUE
"BrienneVonTarth","infections","1 week",2024-01-10,NA,NA,NA,NA,NA,1658,NA,NA,NA,NA,NA,237.4712,397.94,FALSE,FALSE,TRUE
"CharlesBoyle","infections","1 week",2024-01-10,NA,NA,NA,NA,NA,1658,NA,NA,NA,NA,NA,237.4712,397.94,FALSE,FALSE,TRUE
"DaenerysTargaryen","infections","1 week",2024-01-10,NA,NA,NA,NA,NA,1658,NA,NA,NA,NA,NA,237.4712,397.94,FALSE,FALSE,TRUE
"DAX_benchmark","infections","1 week",2024-01-10,NA,NA,NA,NA,NA,1658,NA,NA,NA,NA,NA,237.4712,397.94,FALSE,FALSE,TRUE
"homersimpson","infections","1 week",2024-01-10,NA,NA,NA,NA,NA,1658,NA,NA,NA,NA,NA,237.4712,397.94,FALSE,FALSE,TRUE
"JakePeralta","infections","1 week",2024-01-10,NA,NA,NA,NA,NA,1658,NA,NA,NA,NA,NA,237.4712,397.94,FALSE,FALSE,TRUE
"JonSnow","infections","1 week",2024-01-10,NA,NA,NA,NA,NA,1658,NA,NA,NA,NA,NA,237.4712,397.94,FALSE,FALSE,TRUE
"MasterYoda","infections","1 week",2024-01-10,NA,NA,NA,NA,NA,1658,NA,NA,NA,NA,NA,237.4712,397.94,FALSE,FALSE,TRUE
"Phoebe","infections","1 week",2024-01-10,NA,NA,NA,NA,NA,1658,NA,NA,NA,NA,NA,237.4712,397.94,FALSE,FALSE,TRUE
"power_benchmark","infections","1 week",2024-01-10,NA,NA,NA,NA,NA,1658,NA,NA,NA,NA,NA,237.4712,397.94,FALSE,FALSE,TRUE
"Rachel","infections","1 week",2024-01-10,NA,NA,NA,NA,NA,1658,NA,NA,NA,NA,NA,237.4712,397.94,FALSE,FALSE,TRUE
"TormundGiantsbane","infections","1 week",2024-01-10,NA,NA,NA,NA,NA,1658,NA,NA,NA,NA,NA,237.4712,397.94,FALSE,FALSE,TRUE
"TyrionLannister","infections","1 week",2024-01-10,NA,NA,NA,NA,NA,1658,NA,NA,NA,NA,NA,237.4712,397.94,FALSE,FALSE,TRUE
"BrienneVonTarth","infections","2 week",2024-01-10,NA,NA,NA,NA,NA,1665,NA,NA,NA,NA,NA,221.909625,366.63,FALSE,FALSE,TRUE
"CharlesBoyle","infections","2 week",2024-01-10,NA,NA,NA,NA,NA,1665,NA,NA,NA,NA,NA,221.909625,366.63,FALSE,FALSE,TRUE
"DaenerysTargaryen","infections","2 week",2024-01-10,NA,NA,NA,NA,NA,1665,NA,NA,NA,NA,NA,221.909625,366.63,FALSE,FALSE,TRUE
"DAX_benchmark","infections","2 week",2024-01-10,NA,NA,NA,NA,NA,1665,NA,NA,NA,NA,NA,221.909625,366.63,FALSE,FALSE,TRUE
"homersimpson","infections","2 week",2024-01-10,NA,NA,NA,NA,NA,1665,NA,NA,NA,NA,NA,221.909625,366.63,FALSE,FALSE,TRUE
"JakePeralta","infections","2 week",2024-01-10,NA,NA,NA,NA,NA,1665,NA,NA,NA,NA,NA,221.909625,366.63,FALSE,FALSE,TRUE
"JonSnow","infections","2 week",2024-01-10,NA,NA,NA,NA,NA,1665,NA,NA,NA,NA,NA,221.909625,366.63,FALSE,FALSE,TRUE
"MasterYoda","infections","2 week",2024-01-10,NA,NA,NA,NA,NA,1665,NA,NA,NA,NA,NA,221.909625,366.63,FALSE,FALSE,TRUE
"Phoebe","infections","2 week",2024-01-10,NA,NA,NA,NA,NA,1665,NA,NA,NA,NA,NA,221.909625,366.63,FALSE,FALSE,TRUE
"power_benchmark","infections","2 week",2024-01-10,NA,NA,NA,NA,NA,1665,NA,NA,NA,NA,NA,221.909625,366.63,FALSE,FALSE,TRUE
"Rachel","infections","2 week",2024-01-10,NA,NA,NA,NA,NA,1665,NA,NA,NA,NA,NA,221.909625,366.63,FALSE,FALSE,TRUE
"TormundGiantsbane","infections","2 week",2024-01-10,NA,NA,NA,NA,NA,1665,NA,NA,NA,NA,NA,221.909625,366.63,FALSE,FALSE,TRUE
"TyrionLannister","infections","2 week",2024-01-10,NA,NA,NA,NA,NA,1665,NA,NA,NA,NA,NA,221.909625,366.63,FALSE,FALSE,TRUE
"BrienneVonTarth","infections","3 week",2024-01-10,NA,NA,NA,NA,NA,1763,NA,NA,NA,NA,NA,301.6264,523.18,FALSE,FALSE,TRUE
"CharlesBoyle","infections","3 week",2024-01-10,NA,NA,NA,NA,NA,1763,NA,NA,NA,NA,NA,301.6264,523.18,FALSE,FALSE,TRUE
"DaenerysTargaryen","infections","3 week",2024-01-10,NA,NA,NA,NA,NA,1763,NA,NA,NA,NA,NA,301.6264,523.18,FALSE,FALSE,TRUE
"DAX_benchmark","infections","3 week",2024-01-10,NA,NA,NA,NA,NA,1763,NA,NA,NA,NA,NA,301.6264,523.18,FALSE,FALSE,TRUE
"homersimpson","infections","3 week",2024-01-10,NA,NA,NA,NA,NA,1763,NA,NA,NA,NA,NA,301.6264,523.18,FALSE,FALSE,TRUE
"JakePeralta","infections","3 week",2024-01-10,NA,NA,NA,NA,NA,1763,NA,NA,NA,NA,NA,301.6264,523.18,FALSE,FALSE,TRUE
"JonSnow","infections","3 week",2024-01-10,NA,NA,NA,NA,NA,1763,NA,NA,NA,NA,NA,301.6264,523.18,FALSE,FALSE,TRUE
"MasterYoda","infections","3 week",2024-01-10,NA,NA,NA,NA,NA,1763,NA,NA,NA,NA,NA,301.6264,523.18,FALSE,FALSE,TRUE
"Phoebe","infections","3 week",2024-01-10,NA,NA,NA,NA,NA,1763,NA,NA,NA,NA,NA,301.6264,523.18,FALSE,FALSE,TRUE
"power_benchmark","infections","3 week",2024-01-10,NA,NA,NA,NA,NA,1763,NA,NA,NA,NA,NA,301.6264,523.18,FALSE,FALSE,TRUE
"Rachel","infections","3 week",2024-01-10,NA,NA,NA,NA,NA,1763,NA,NA,NA,NA,NA,301.6264,523.18,FALSE,FALSE,TRUE
"TormundGiantsbane","infections","3 week",2024-01-10,NA,NA,NA,NA,NA,1763,NA,NA,NA,NA,NA,301.6264,523.18,FALSE,FALSE,TRUE
"TyrionLannister","infections","3 week",2024-01-10,NA,NA,NA,NA,NA,1763,NA,NA,NA,NA,NA,301.6264,523.18,FALSE,FALSE,TRUE
"BrienneVonTarth","infections","4 week",2024-01-10,NA,NA,NA,NA,NA,2026,NA,NA,NA,NA,NA,1182.045925,1468.54,FALSE,FALSE,TRUE
"CharlesBoyle","infections","4 week",2024-01-10,NA,NA,NA,NA,NA,2026,NA,NA,NA,NA,NA,1182.045925,1468.54,FALSE,FALSE,TRUE
"DaenerysTargaryen","infections","4 week",2024-01-10,NA,NA,NA,NA,NA,2026,NA,NA,NA,NA,NA,1182.045925,1468.54,FALSE,FALSE,TRUE
"DAX_benchmark","infections","4 week",2024-01-10,NA,NA,NA,NA,NA,2026,NA,NA,NA,NA,NA,1182.045925,1468.54,FALSE,FALSE,TRUE
"homersimpson","infections","4 week",2024-01-10,NA,NA,NA,NA,NA,2026,NA,NA,NA,NA,NA,1182.045925,1468.54,FALSE,FALSE,TRUE
"JakePeralta","infections","4 week",2024-01-10,NA,NA,NA,NA,NA,2026,NA,NA,NA,NA,NA,1182.045925,1468.54,FALSE,FALSE,TRUE
"JonSnow","infections","4 week",2024-01-10,NA,NA,NA,NA,NA,2026,NA,NA,NA,NA,NA,1182.045925,1468.54,FALSE,FALSE,TRUE
"MasterYoda","infections","4 week",2024-01-10,NA,NA,NA,NA,NA,2026,NA,NA,NA,NA,NA,1182.045925,1468.54,FALSE,FALSE,TRUE
"Phoebe","infections","4 week",2024-01-10,NA,NA,NA,NA,NA,2026,NA,NA,NA,NA,NA,1182.045925,1468.54,FALSE,FALSE,TRUE
"power_benchmark","infections","4 week",2024-01-10,NA,NA,NA,NA,NA,2026,NA,NA,NA,NA,NA,1182.045925,1468.54,FALSE,FALSE,TRUE
"Rachel","infections","4 week",2024-01-10,NA,NA,NA,NA,NA,2026,NA,NA,NA,NA,NA,1182.045925,1468.54,FALSE,FALSE,TRUE
"TormundGiantsbane","infections","4 week",2024-01-10,NA,NA,NA,NA,NA,2026,NA,NA,NA,NA,NA,1182.045925,1468.54,FALSE,FALSE,TRUE
"TyrionLannister","infections","4 week",2024-01-10,NA,NA,NA,NA,NA,2026,NA,NA,NA,NA,NA,1182.045925,1468.54,FALSE,FALSE,TRUE
"DAX_benchmark","energy","36 hour",2023-12-20,NA,NA,NA,NA,NA,63.30825,NA,NA,NA,NA,NA,8.38922968696595,9.63274875,FALSE,FALSE,TRUE
"infections_benchmark_strong","energy","36 hour",2023-12-20,NA,NA,NA,NA,NA,63.30825,NA,NA,NA,NA,NA,8.38922968696595,9.63274875,FALSE,FALSE,TRUE
"infections_benchmark_weak","energy","36 hour",2023-12-20,NA,NA,NA,NA,NA,63.30825,NA,NA,NA,NA,NA,8.38922968696595,9.63274875,FALSE,FALSE,TRUE
"TyrionLannister","energy","36 hour",2023-12-20,NA,NA,NA,NA,NA,63.30825,NA,NA,NA,NA,NA,8.38922968696595,9.63274875,FALSE,FALSE,TRUE
"DAX_benchmark","energy","40 hour",2023-12-20,NA,NA,NA,NA,NA,60.02825,NA,NA,NA,NA,NA,4.884610669375,9.33757625,FALSE,FALSE,TRUE
"infections_benchmark_strong","energy","40 hour",2023-12-20,NA,NA,NA,NA,NA,60.02825,NA,NA,NA,NA,NA,4.884610669375,9.33757625,FALSE,FALSE,TRUE
"infections_benchmark_weak","energy","40 hour",2023-12-20,NA,NA,NA,NA,NA,60.02825,NA,NA,NA,NA,NA,4.884610669375,9.33757625,FALSE,FALSE,TRUE
"TyrionLannister","energy","40 hour",2023-12-20,NA,NA,NA,NA,NA,60.02825,NA,NA,NA,NA,NA,4.884610669375,9.33757625,FALSE,FALSE,TRUE
"DAX_benchmark","energy","44 hour",2023-12-20,NA,NA,NA,NA,NA,55.70225,NA,NA,NA,NA,NA,3.967079704375,7.18217570373893,FALSE,FALSE,TRUE
"infections_benchmark_strong","energy","44 hour",2023-12-20,NA,NA,NA,NA,NA,55.70225,NA,NA,NA,NA,NA,3.967079704375,7.18217570373893,FALSE,FALSE,TRUE
"infections_benchmark_weak","energy","44 hour",2023-12-20,NA,NA,NA,NA,NA,55.70225,NA,NA,NA,NA,NA,3.967079704375,7.18217570373893,FALSE,FALSE,TRUE
"TyrionLannister","energy","44 hour",2023-12-20,NA,NA,NA,NA,NA,55.70225,NA,NA,NA,NA,NA,3.967079704375,7.18217570373893,FALSE,FALSE,TRUE
"DAX_benchmark","energy","60 hour",2023-12-20,NA,NA,NA,NA,NA,56.35875,NA,NA,NA,NA,NA,10.97053427625,14.83084,FALSE,FALSE,TRUE
"infections_benchmark_strong","energy","60 hour",2023-12-20,NA,NA,NA,NA,NA,56.35875,NA,NA,NA,NA,NA,10.97053427625,14.83084,FALSE,FALSE,TRUE
"infections_benchmark_weak","energy","60 hour",2023-12-20,NA,NA,NA,NA,NA,56.35875,NA,NA,NA,NA,NA,10.97053427625,14.83084,FALSE,FALSE,TRUE
"TyrionLannister","energy","60 hour",2023-12-20,NA,NA,NA,NA,NA,56.35875,NA,NA,NA,NA,NA,10.97053427625,14.83084,FALSE,FALSE,TRUE
"DAX_benchmark","energy","64 hour",2023-12-20,NA,NA,NA,NA,NA,55.02275,NA,NA,NA,NA,NA,8.361316373125,12.367955,FALSE,FALSE,TRUE
"infections_benchmark_strong","energy","64 hour",2023-12-20,NA,NA,NA,NA,NA,55.02275,NA,NA,NA,NA,NA,8.361316373125,12.367955,FALSE,FALSE,TRUE
"infections_benchmark_weak","energy","64 hour",2023-12-20,NA,NA,NA,NA,NA,55.02275,NA,NA,NA,NA,NA,8.361316373125,12.367955,FALSE,FALSE,TRUE
"TyrionLannister","energy","64 hour",2023-12-20,NA,NA,NA,NA,NA,55.02275,NA,NA,NA,NA,NA,8.361316373125,12.367955,FALSE,FALSE,TRUE
"DAX_benchmark","energy","68 hour",2023-12-20,NA,NA,NA,NA,NA,50.78625,NA,NA,NA,NA,NA,6.3682170756801,9.7062515,FALSE,FALSE,TRUE
"infections_benchmark_strong","energy","68 hour",2023-12-20,NA,NA,NA,NA,NA,50.78625,NA,NA,NA,NA,NA,6.3682170756801,9.7062515,FALSE,FALSE,TRUE
"infections_benchmark_weak","energy","68 hour",2023-12-20,NA,NA,NA,NA,NA,50.78625,NA,NA,NA,NA,NA,6.3682170756801,9.7062515,FALSE,FALSE,TRUE
"TyrionLannister","energy","68 hour",2023-12-20,NA,NA,NA,NA,NA,50.78625,NA,NA,NA,NA,NA,6.3682170756801,9.7062515,FALSE,FALSE,TRUE
