forecast_date,target,horizon,q0.025,q0.25,q0.5,q0.75,q0.975
2023-12-20,DAX,1 day,-3.3212652715215762,-0.5437241817249028,0.06938907616023116,0.7256703903693928,2.719772003602724
2023-12-20,DAX,2 day,-4.087894963565497,-0.8052124104092062,0.09424036225427201,1.0009699558993113,3.5704923267932855
2023-12-20,DAX,5 day,-5.259160853138978,-0.8967017569316393,0.16656701683981368,1.2606590400791706,4.628696965151875
2023-12-20,DAX,6 day,-6.282628800683585,-1.030576944465711,0.2077735120485258,1.4630057610208969,5.367396415217598
2023-12-20,DAX,7 day,-6.735741964137194,-1.085267909001253,0.3448082894547788,1.6229430100992204,6.259934085874841
