"model","target","horizon","forecast_date","q0.025","q0.25","q0.5","q0.75","q0.975","value","qscore_q0.025","qscore_q0.25","qscore_q0.5","qscore_q0.75","qscore_q0.975","mean_qscore","ae","interval_coverage_0.5","interval_coverage_0.95","scores_imputed"
"BrienneVonTarth","DAX","1 day",2023-11-29,-2.88511685983658,-0.539092699342847,0.043882851843849,0.670233730279191,2.48439294680403,0.302511958645368,0.159381440924097,0.420802328994108,0.258629106801519,0.183860885816911,0.109094049407933,0.226353562388914,0.258629106801519,TRUE,TRUE,FALSE
"mean_ensemble","DAX","1 day",2023-11-29,-2.03041389680144,-0.382285157533243,0.236743000301718,0.81292669377288,2.16651193359134,0.302511958645368,0.11664629277234,0.342398558089306,0.0657689583436504,0.255207367563756,0.0931999987472987,0.17464423510327,0.0657689583436504,TRUE,TRUE,FALSE
"DAX_benchmark","DAX","1 day",2023-11-29,-3.32126527152158,-0.546439101462548,0.0686313077538969,0.71827355543963,2.71977200360272,0.302511958645368,0.181188861508347,0.424475530053958,0.233880650891471,0.207880798397131,0.120863002247868,0.233657768619755,0.233880650891471,TRUE,TRUE,FALSE
"Rachel","DAX","1 day",2023-11-29,-3.17745222597765,-0.569902164328964,0.0885583058779726,0.785580130674165,2.60766053467612,0.302511958645368,0.173998209231151,0.436207061487166,0.213953652767396,0.241534086014398,0.115257428801538,0.23619008766033,0.213953652767396,TRUE,TRUE,FALSE
"JonSnow","DAX","1 day",2023-11-29,-2.86598216577398,-0.544096351206487,0.065096207298225,0.661908329165538,2.28500482536246,0.302511958645368,0.158424706220968,0.423304154925928,0.237415751347143,0.179698185260085,0.0991246433358547,0.219593488217996,0.237415751347143,TRUE,TRUE,FALSE
"CharlesBoyle","DAX","1 day",2023-11-29,-1.24348188072672,-0.0853074745163162,0.224057729711458,0.701413940906148,1.54123822687243,0.302511958645368,0.0772996919686046,0.193909716580842,0.0784542289339108,0.19945099113039,0.0619363134113531,0.12221018840502,0.0784542289339108,TRUE,TRUE,FALSE
"median_ensemble","DAX","1 day",2023-11-29,-2.154,-0.451710011424943,0.0823160238510034,0.661908329165538,1.64542701678058,0.302511958645368,0.122825597932268,0.377110985035156,0.220195934794365,0.179698185260085,0.0671457529067606,0.193395291185727,0.220195934794365,TRUE,TRUE,FALSE
"homersimpson","DAX","1 day",2023-11-29,-1.40372527338609,-0.397952523570089,0.0823160238510034,0.488504776629606,1.63059737371597,0.302511958645368,0.0853118616015731,0.350232241107729,0.220195934794365,0.0929964089921187,0.0664042707535303,0.163028143449863,0.220195934794365,TRUE,TRUE,FALSE
"StannisBaratheon","DAX","1 day",2023-11-29,-2.26301517618043,-0.388991453489605,0.0966890594074181,0.605486893219268,1.64542701678058,0.302511958645368,0.12827635674129,0.345751706067487,0.20582289923795,0.15148746728695,0.0671457529067606,0.179696836448087,0.20582289923795,TRUE,TRUE,FALSE
"MasterYoda","DAX","1 day",2023-11-29,-1.0526,-0.1116,0.0822,0.1022,0.8792,0.302511958645368,0.0677555979322684,0.207055979322684,0.220311958645368,0.300467937968053,0.0288344020677316,0.164885175187221,0.220311958645368,FALSE,TRUE,FALSE
"DaenerysTargaryen","DAX","1 day",2023-11-29,-2.154,-0.615,1.783,3.415,5.762,0.302511958645368,0.122825597932268,0.458755979322684,1.48048804135463,1.55624402067732,0.272974402067732,0.778257608270926,1.48048804135463,TRUE,TRUE,FALSE
"Phoebe","DAX","1 day",2023-11-29,-0.78395083,-0.08638414,0.27962988,0.64564389,1.34321058,0.302511958645368,0.0543231394322684,0.194448049322684,0.0228820786453684,0.171565965677316,0.0520349310677316,0.0990508328290737,0.0228820786453684,TRUE,TRUE,FALSE
"JakePeralta","DAX","1 day",2023-11-29,-2.45525090274043,-0.54792365407405,0.0335570175727717,0.632591739455817,2.15450426878101,0.302511958645368,0.13788814306929,0.425217806359709,0.268954941072597,0.165039890405224,0.0925996155067819,0.21794007928272,0.268954941072597,TRUE,TRUE,FALSE
"TormundGiantsbane","DAX","1 day",2023-11-29,-1.54605819154849,-0.451710011424943,0.0059828908942882,0.439796092371934,1.57040913321965,0.302511958645368,0.0924285075096929,0.377110985035156,0.29652906775108,0.0686420668632828,0.0633948587287141,0.179621097177585,0.29652906775108,TRUE,TRUE,FALSE
"TyrionLannister","DAX","1 day",2023-11-29,-1.24348188072672,-0.0853074745163162,0.224057729711458,0.701413940906148,1.54123822687243,0.302511958645368,0.0772996919686046,0.193909716580842,0.0784542289339108,0.19945099113039,0.0619363134113531,0.12221018840502,0.0784542289339108,TRUE,TRUE,FALSE
"mean_ensemble","DAX","2 day",2023-11-29,-2.53057414046146,-0.542813419734754,0.226764041742357,1.07158844637527,2.87007843431707,1.41919560914818,0.197488487480482,0.981004514441468,1.19243156740583,0.521410744159369,0.0725441412584444,0.592975890949118,1.19243156740583,FALSE,TRUE,FALSE
"DAX_benchmark","DAX","2 day",2023-11-29,-4.0878949635655,-0.817404076536876,0.0802650430125951,1.00096995589931,3.57049232679329,1.41919560914818,0.275354528635684,1.11829984284253,1.33893056613559,0.627338479873307,0.107564835882255,0.693497650673873,1.33893056613559,FALSE,TRUE,FALSE
"Rachel","DAX","2 day",2023-11-29,-3.9021663661825,-1.11623010774738,-0.0065418952077574,1.27743387455144,3.22079067452884,1.41919560914818,0.266068098766534,1.26771285844778,1.42573750435594,0.212642601895111,0.0900797532690328,0.65244816334688,1.42573750435594,FALSE,TRUE,FALSE
"BrienneVonTarth","DAX","2 day",2023-11-29,-3.38772819060928,-0.735238060438547,0.0792258658314608,0.869535695896149,3.13085328877462,1.41919560914818,0.240346189987873,1.07721683479337,1.33996974331672,0.824489869878051,0.0855828839813219,0.713521104391467,1.33996974331672,FALSE,TRUE,FALSE
"CharlesBoyle","DAX","2 day",2023-11-29,-1.73335876404517,-0.162375126772618,0.498570101979201,1.09248164471558,2.49960658281221,1.41919560914818,0.157627718659668,0.7907853679604,0.920625507168982,0.490070946648902,0.0540205486832015,0.482626017824231,0.920625507168982,FALSE,TRUE,FALSE
"median_ensemble","DAX","2 day",2023-11-29,-2.19501781417982,-0.529277534016768,0.0795225055632897,0.870506672295535,2.49960658281221,1.41919560914818,0.1807106711664,0.974236571582475,1.33967310358489,0.823033405278972,0.0540205486832014,0.674334860059188,1.33967310358489,FALSE,TRUE,FALSE
"homersimpson","DAX","2 day",2023-11-29,-1.96081724845872,-0.203717887881893,0.0795225055632897,0.761404943229316,2.32671797924639,1.41919560914818,0.169000642880345,0.811456748515038,1.33967310358489,0.986685998878301,0.0453761185049104,0.670438522472697,1.33967310358489,FALSE,TRUE,FALSE
"StannisBaratheon","DAX","2 day",2023-11-29,-2.19501781417982,-0.529277534016768,0.039754713044739,0.820362334321313,2.44065459352821,1.41919560914818,0.1807106711664,0.974236571582475,1.37944089610344,0.898249912240305,0.0510729492190014,0.696742200062325,1.37944089610344,FALSE,TRUE,FALSE
"MasterYoda","DAX","2 day",2023-11-29,-2.1404,-1.1994,-0.544,0.2096,2.105,1.41919560914818,0.177979780457409,1.30929780457409,1.96319560914818,1.81439341372227,0.0342902195425909,1.05983136548891,1.96319560914818,FALSE,TRUE,FALSE
"DaenerysTargaryen","DAX","2 day",2023-11-29,-2.615,-0.151,1.621,3.624,6.137,1.41919560914818,0.201709780457409,0.785097804574091,0.201804390851817,1.10240219542591,0.235890219542591,0.505380878170363,0.201804390851817,TRUE,TRUE,FALSE
"Phoebe","DAX","2 day",2023-11-29,-0.87267971,-0.07106879,0.34953734,0.77014348,1.5717544,1.41919560914818,0.114593765957409,0.745132199574091,1.06965826914818,0.973578193722274,0.00762793954259087,0.58211807358891,1.06965826914818,FALSE,TRUE,FALSE
"JakePeralta","DAX","2 day",2023-11-29,-3.13076729382187,-0.782713412616443,0.038870716914019,0.870506672295535,2.87206597543576,1.41919560914818,0.227498145148502,1.10095451088231,1.38032489223416,0.823033405278972,0.0726435183143789,0.720890894371666,1.38032489223416,FALSE,TRUE,FALSE
"TormundGiantsbane","DAX","2 day",2023-11-29,-1.91698087183334,-0.505299548569349,0.0187808874620934,0.614117371383793,1.92474073605093,1.41919560914818,0.166808824049076,0.962247578858766,1.40041472168609,1.20761735664658,0.0252772563451374,0.752473147517131,1.40041472168609,FALSE,TRUE,FALSE
"TyrionLannister","DAX","2 day",2023-11-29,-1.73335876404517,-0.162375126772618,0.498570101979201,1.09248164471558,2.49960658281221,1.41919560914818,0.157627718659668,0.7907853679604,0.920625507168982,0.490070946648902,0.0540205486832015,0.482626017824231,0.920625507168982,FALSE,TRUE,FALSE
"JonSnow","DAX","2 day",2023-11-29,-3.22129383925758,-0.620474785199309,0.194377162071801,0.927612185870434,3.0117365061395,1.41919560914818,0.232024472420288,1.01983519717375,1.22481844707638,0.737375134916624,0.0796270448495659,0.658736059287321,1.22481844707638,FALSE,TRUE,FALSE
"mean_ensemble","DAX","5 day",2023-11-29,-3.56372606669985,-0.845259224250578,0.236996407060344,1.08595996350539,3.29450001903379,1.46334031279558,0.251353318974772,1.15429976852308,1.22634390573524,0.566070523935285,0.0915579853119106,0.657925100496057,1.22634390573524,FALSE,TRUE,FALSE
"DAX_benchmark","DAX","5 day",2023-11-29,-5.25916085313898,-0.912911877239653,0.16421387707215,1.23242567249799,4.62869696515187,1.46334031279558,0.336125058296728,1.18812609501762,1.29912643572343,0.346371960446379,0.158267832617815,0.665603476420394,1.29912643572343,FALSE,TRUE,FALSE
"BrienneVonTarth","DAX","5 day",2023-11-29,-4.49192780628028,-0.872108165925178,0.16369401804727,1.15181532841606,4.1392710214515,1.46334031279558,0.297763405953793,1.16772423936038,1.29964629474831,0.467287476569287,0.133796535432796,0.673243590412913,1.29964629474831,FALSE,TRUE,FALSE
"CharlesBoyle","DAX","5 day",2023-11-29,-2.25651117836474,0.0037281755628892,0.608450363009005,1.41932682317214,2.98607308212107,1.46334031279558,0.185992574558016,0.729806068616345,0.854889949786575,0.0660202344351601,0.0761366384662748,0.382569093172474,0.854889949786575,FALSE,TRUE,FALSE
"median_ensemble","DAX","5 day",2023-11-29,-4.0075799347204,-0.872108165925178,0.16369401804727,1.08635854394005,3.07403738074518,1.46334031279558,0.273546012375799,1.16772423936038,1.29964629474831,0.565472653283295,0.0805348533974801,0.677384810633053,1.29964629474831,FALSE,TRUE,FALSE
"homersimpson","DAX","5 day",2023-11-29,-2.24932476922692,0.200870552022048,0.414624594747881,0.853135130529026,2.84600068644374,1.46334031279558,0.185633254101125,0.631234880386766,1.0487157180477,0.915307773399832,0.069133018682408,0.570004928923566,1.0487157180477,FALSE,TRUE,FALSE
"StannisBaratheon","DAX","5 day",2023-11-29,-3.04538649790997,-0.708559677707035,0.237739000586686,1.05795015561452,2.74509135239119,1.46334031279558,0.225436340535278,1.08594999525131,1.22560131220889,0.60808523577159,0.0640875519797805,0.64183208714937,1.22560131220889,FALSE,TRUE,FALSE
"MasterYoda","DAX","5 day",2023-11-29,-4.7404,-1.176,-0.0802,0.7506,4.0389,1.46334031279558,0.310187015639779,1.31967015639779,1.54354031279558,1.06911046919337,0.128777984360221,0.874257187677348,1.54354031279558,FALSE,TRUE,FALSE
"DaenerysTargaryen","DAX","5 day",2023-11-29,-5.625,-3.121,0.848,1.762,3.852,1.46334031279558,0.354417015639779,2.29217015639779,0.61534031279558,0.14932984360221,0.119432984360221,0.706138062559116,0.61534031279558,TRUE,TRUE,FALSE
"Phoebe","DAX","5 day",2023-11-29,-1.19445019,-0.36520067,0.06990747,0.50501561,1.33426513,1.46334031279558,0.132889525139779,0.91427049139779,1.39343284279558,1.43748705419337,0.251696606451382,0.82595530399558,1.39343284279558,FALSE,FALSE,FALSE
"JakePeralta","DAX","5 day",2023-11-29,-4.0075799347204,-0.930672072872491,0.0814519619633636,1.08635854394005,3.69234799072685,1.46334031279558,0.273546012375799,1.19700619283404,1.38188835083222,0.565472653283291,0.111450383896564,0.705872718644381,1.38188835083222,FALSE,TRUE,FALSE
"TormundGiantsbane","DAX","5 day",2023-11-29,-2.25883017362821,-0.692058314505878,0.0933537886569894,0.734025027995378,2.24453387115721,1.46334031279558,0.18610852432119,1.07769931365073,1.36998652413859,1.0939729272003,0.0390596779180815,0.753365393445779,1.36998652413859,FALSE,TRUE,FALSE
"TyrionLannister","DAX","5 day",2023-11-29,-2.25651117836474,0.0037281755628892,0.608450363009005,1.41932682317214,2.98607308212107,1.46334031279558,0.185992574558016,0.729806068616345,0.854889949786575,0.0660202344351601,0.0761366384662748,0.382569093172474,0.854889949786575,FALSE,TRUE,FALSE
"Rachel","DAX","5 day",2023-11-29,-4.66492902813501,-1.31265588903559,0.0379138587830684,1.4793926135076,4.26120968512955,1.46334031279558,0.30641346704653,1.38799810091559,1.42542645401251,0.00802615035601195,0.139893468616698,0.653551528189468,1.42542645401251,TRUE,TRUE,FALSE
"JonSnow","DAX","5 day",2023-11-29,-4.27842725732884,-1.10553015111951,-0.166646004090948,0.666107796725196,3.07403738074518,1.46334031279558,0.287088378506221,1.28443523195755,1.62998631688653,1.19584877410558,0.0805348533974801,0.89557871097067,1.62998631688653,FALSE,TRUE,FALSE
"mean_ensemble","DAX","6 day",2023-11-29,-4.05933307932732,-0.837940522766485,0.410091269834919,1.41312720932955,3.97483432830437,2.24268798990792,0.315101053461762,1.5403142563372,1.832596720073,1.24434117086756,0.0866073169198225,1.00379210353187,1.832596720073,FALSE,TRUE,FALSE
"BrienneVonTarth","DAX","6 day",2023-11-29,-5.27680602368585,-1.03242505621575,0.160613255934307,1.39650112903677,4.51721171064075,2.24268798990792,0.375974700679689,1.63755652306184,2.08207473397361,1.26928029130673,0.113726186036642,1.0957224870117,2.08207473397361,FALSE,TRUE,FALSE
"CharlesBoyle","DAX","6 day",2023-11-29,-2.94732163645505,-0.527455548920219,0.882785153382848,1.74687294967293,3.59166971249187,2.24268798990792,0.259500481318149,1.38507176941407,1.35990283652507,0.743722560352489,0.0674490861291973,0.763129346747796,1.35990283652507,FALSE,TRUE,FALSE
"median_ensemble","DAX","6 day",2023-11-29,-4.451,-1.0137271513128,0.185784313440689,1.38062744019295,3.6798495320659,2.24268798990792,0.334684399495396,1.62820757061036,2.05690367646723,1.29309082457246,0.071858077107899,1.07694890965067,2.05690367646723,FALSE,TRUE,FALSE
"homersimpson","DAX","6 day",2023-11-29,-2.95665471633885,0.428414991581505,0.638682324459339,0.848949657337172,3.24633030479029,2.24268798990792,0.259967135312339,0.907136499163208,1.60400566544858,2.09060749885612,0.0501821157441185,0.982379782904874,1.60400566544858,FALSE,TRUE,FALSE
"StannisBaratheon","DAX","6 day",2023-11-29,-3.24407177376679,-0.821213379539043,0.272700951772069,1.29363658261295,3.50399083235925,2.24268798990792,0.274337988183736,1.53195068472348,1.96998703813585,1.42357711094246,0.0630651421225665,1.05258359282162,1.96998703813585,FALSE,TRUE,FALSE
"MasterYoda","DAX","6 day",2023-11-29,-5.6054,-1.241,-0.1085,0.7592,4.9428,2.24268798990792,0.392404399495396,1.74184399495396,2.35118798990792,2.22523198486188,0.135005600504604,1.36913479394475,2.35118798990792,FALSE,TRUE,FALSE
"DaenerysTargaryen","DAX","6 day",2023-11-29,-4.451,-1.515,1.871,3.651,5.895,2.24268798990792,0.334684399495396,1.87884399495396,0.371687989907921,0.704156005046039,0.182615600504604,0.694397597981584,0.371687989907921,TRUE,TRUE,FALSE
"Phoebe","DAX","6 day",2023-11-29,-1.1965347,-0.3200681,0.1398149,0.599698,1.4761646,2.24268798990792,0.171961134495396,1.28137804495396,2.10287308990792,2.46448498486188,1.49472061032045,1.50308357290792,2.10287308990792,FALSE,FALSE,FALSE
"JakePeralta","DAX","6 day",2023-11-29,-5.05599778550301,-1.18094239117178,0.100558829442043,1.38062744019295,4.59838159277001,2.24268798990792,0.364934288770546,1.71181519053985,2.14212916046588,1.29309082457246,0.117784680143105,1.12595082889837,2.14212916046588,FALSE,TRUE,FALSE
"TormundGiantsbane","DAX","6 day",2023-11-29,-2.44662039880921,-0.684070720506671,0.185784313440689,0.8816511489694,2.6181529228502,2.24268798990792,0.234465419435857,1.4633793552073,2.05690367646723,2.04155526140778,0.018773246647114,1.16301539183306,2.05690367646723,FALSE,TRUE,FALSE
"TyrionLannister","DAX","6 day",2023-11-29,-2.94732163645505,-0.527455548920219,0.882785153382848,1.74687294967293,3.59166971249187,2.24268798990792,0.259500481318149,1.38507176941407,1.35990283652507,0.743722560352489,0.0674490861291973,0.763129346747796,1.35990283652507,FALSE,TRUE,FALSE
"DAX_benchmark","DAX","6 day",2023-11-29,-6.28262880068359,-1.04407044662245,0.203116289701999,1.44344054466479,5.3673964152176,2.24268798990792,0.426265839529575,1.64337921826518,2.03957170020592,1.1988711678647,0.156235421265484,1.09286466942617,2.03957170020592,FALSE,TRUE,FALSE
"Rachel","DAX","6 day",2023-11-29,-5.71970475864137,-1.41421344433687,0.0787966316982718,1.66389740881942,4.64422893227905,2.24268798990792,0.398119637427465,1.8284507171224,2.16389135820965,0.868185871632758,0.120077047118557,1.07574492630217,2.16389135820965,FALSE,TRUE,FALSE
"JonSnow","DAX","6 day",2023-11-29,-4.6412678009164,-1.0137271513128,0.0230487046395384,0.958305910304874,3.6798495320659,2.24268798990792,0.344197789541216,1.62820757061036,2.21963928526838,1.92657311940457,0.0718580771078989,1.23809516838649,2.21963928526838,FALSE,TRUE,FALSE
"BrienneVonTarth","DAX","7 day",2023-11-29,-5.68324409066592,-1.10670732477615,0.261509880483546,1.49156497187359,5.06849520363003,2.98587763928548,0.43345608649757,2.04629248203082,2.72436775880194,2.24146900111784,0.104130878217228,1.50994324133308,2.72436775880194,FALSE,TRUE,FALSE
"CharlesBoyle","DAX","7 day",2023-11-29,-2.6779751709011,-0.544994460948445,1.30431480276254,2.64276516863751,3.79106968739758,2.98587763928548,0.283192640509329,1.76543605011696,1.68156283652294,0.514668705971966,0.0402596024056047,0.857023967105361,1.68156283652294,FALSE,TRUE,FALSE
"median_ensemble","DAX","7 day",2023-11-29,-4.55449887339736,-0.896354782177827,0.261509880483546,1.49156497187359,4.36329690101472,2.98587763928548,0.377018825634142,1.94111621073166,2.72436775880194,2.24146900111784,0.0688709630864619,1.47056855187441,2.72436775880194,FALSE,TRUE,FALSE
"homersimpson","DAX","7 day",2023-11-29,-2.75051853973231,0.755914148606784,0.934025478945344,1.1121368092839,3.44539828194982,2.98587763928548,0.28681980895089,1.11498174533935,2.05185216034014,2.81061124500237,0.0229760321332171,1.25744819835319,2.05185216034014,FALSE,TRUE,FALSE
"StannisBaratheon","DAX","7 day",2023-11-29,-3.41042321496537,-0.896354782177827,0.244529578559723,1.49083115443651,4.12663640984914,2.98587763928548,0.319815042712543,1.94111621073166,2.74134806072576,2.24256972727346,0.0570379385281829,1.46037739599432,2.74134806072576,FALSE,TRUE,FALSE
"MasterYoda","DAX","7 day",2023-11-29,-7.3424,-2.9194,-0.6262,0.2414,6.1965,2.98587763928548,0.516413881964274,2.95263881964274,3.61207763928548,4.11671645892823,0.160531118035726,2.27167558357129,3.61207763928548,FALSE,TRUE,FALSE
"DaenerysTargaryen","DAX","7 day",2023-11-29,-6.572,-3.527,1.935,5.362,7.161,2.98587763928548,0.477893881964274,3.25643881964274,1.05087763928548,1.18806118035726,0.208756118035726,1.2364055278571,1.05087763928548,TRUE,TRUE,FALSE
"Phoebe","DAX","7 day",2023-11-29,-2.436182,-0.7008226,0.2097224,1.1202674,2.8556268,2.98587763928548,0.271102981964274,1.84335011964274,2.77615523928548,2.79841535892823,0.253989136606693,1.58860256728548,2.77615523928548,FALSE,FALSE,FALSE
"JakePeralta","DAX","7 day",2023-11-29,-5.59618849505453,-1.31266250482996,0.171305824653611,1.56406984791942,5.35828455592335,2.98587763928548,0.429103306717001,2.14927007205772,2.81457181463187,2.13271168704909,0.118620345831893,1.52885544525752,2.81457181463187,FALSE,TRUE,FALSE
"TormundGiantsbane","DAX","7 day",2023-11-29,-2.73461203384826,-0.624501577921812,0.15193516911527,0.99733716348026,2.75446542998619,2.98587763928548,0.286024483656687,1.80518960860365,2.83394247017021,2.98281071370784,0.451253808133623,1.6718442168544,2.83394247017021,FALSE,FALSE,FALSE
"mean_ensemble","DAX","7 day",2023-11-29,-4.56202421056686,-1.13544718547014,0.511849815584396,1.78555451098097,4.69659079965644,2.98587763928548,0.377395092492617,2.06066241237781,2.47402782370109,1.80048469245677,0.0855356580185479,1.35962113580937,2.47402782370109,FALSE,TRUE,FALSE
"DAX_benchmark","DAX","7 day",2023-11-29,-6.73574196413719,-1.09164649868041,0.343478060809232,1.59446118485933,6.25993408587484,2.98587763928548,0.486080980171134,2.03876206898295,2.64239957847625,2.08712468163923,0.163702822329468,1.48361402631981,2.64239957847625,FALSE,TRUE,FALSE
"Rachel","DAX","7 day",2023-11-29,-6.13455518376598,-1.38507633088796,0.149276711626946,1.75025459835486,5.88390335251049,2.98587763928548,0.456021641152573,2.18547698508672,2.83660092765854,1.85343456139594,0.144901285661251,1.495287080191,2.83660092765854,FALSE,TRUE,FALSE
"JonSnow","DAX","7 day",2023-11-29,-4.55449887339736,-0.862567018547597,0.270834892878388,1.20235517526978,4.36329690101472,2.98587763928548,0.377018825634142,1.92422232891654,2.7150427464071,2.67528369602356,0.068870963086462,1.55208771201356,2.7150427464071,FALSE,TRUE,FALSE
"TyrionLannister","DAX","7 day",2023-11-29,-2.6779751709011,-0.544994460948445,1.30431480276254,2.64276516863751,3.79106968739758,2.98587763928548,0.283192640509329,1.76543605011696,1.68156283652294,0.514668705971966,0.0402596024056047,0.857023967105361,1.68156283652294,FALSE,TRUE,FALSE
"mean_ensemble","infections","0 week",2023-11-29,1770,1770,1770,1770,1770,1924,7.7,77,154,231,300.3,154,154,FALSE,FALSE,FALSE
"infections_benchmark_strong","infections","0 week",2023-11-29,1643,1643,1643,1643,1643,1924,14.05,140.5,281,421.5,547.95,281,281,FALSE,FALSE,FALSE
"median_ensemble","infections","0 week",2023-11-29,1770,1770,1770,1770,1770,1924,7.7,77,154,231,300.3,154,154,FALSE,FALSE,FALSE
"infections_benchmark_weak","infections","0 week",2023-11-29,1643,1643,1643,1643,1643,1924,14.05,140.5,281,421.5,547.95,281,281,FALSE,FALSE,FALSE
"StannisBaratheon","infections","0 week",2023-11-29,1897,1897,1897,1897,1897,1924,1.35,13.5,27,40.5,52.65,27,27,FALSE,FALSE,FALSE
"mean_ensemble","infections","1 week",2023-11-29,1042.4875,1247.5,1424,1556.75,2207.1375,2077,51.725625,414.75,653,780.375,6.506875,381.2715,653,FALSE,TRUE,FALSE
"infections_benchmark_strong","infections","1 week",2023-11-29,1107.975,1426,1620,1826,2280.025,2077,48.45125,325.5,457,376.5,10.15125,243.5205,457,FALSE,TRUE,FALSE
"median_ensemble","infections","1 week",2023-11-29,1042.4875,1247.5,1424,1556.75,2207.1375,2077,51.725625,414.75,653,780.375,6.506875,381.2715,653,FALSE,TRUE,FALSE
"infections_benchmark_weak","infections","1 week",2023-11-29,735.75,845.5,1065,1143,1448,2077,67.0625,615.75,1012,1401,1226.55,864.4725,1012,FALSE,FALSE,FALSE
"StannisBaratheon","infections","1 week",2023-11-29,977,1069,1228,1287.5,2134.25,2077,55,504,849,1184.25,2.8625,519.0225,849,FALSE,TRUE,FALSE
"mean_ensemble","infections","2 week",2023-11-29,990.5,1223.5,1421.5,1632.75,2489.5,2082,54.575,429.25,660.5,673.875,20.375,367.715,660.5,FALSE,TRUE,FALSE
"infections_benchmark_strong","infections","2 week",2023-11-29,976,1366,1607,1896,2538,2082,55.3,358,475,279,22.8,238.02,475,FALSE,TRUE,FALSE
"median_ensemble","infections","2 week",2023-11-29,990.5,1223.5,1421.5,1632.75,2489.5,2082,54.575,429.25,660.5,673.875,20.375,367.715,660.5,FALSE,TRUE,FALSE
"infections_benchmark_weak","infections","2 week",2023-11-29,1027,1093.5,1171,1268.5,1810,2082,52.75,494.25,911,1220.25,530.4,641.73,911,FALSE,FALSE,FALSE
"StannisBaratheon","infections","2 week",2023-11-29,1005,1081,1236,1369.5,2441,2082,53.85,500.5,846,1068.75,17.95,497.41,846,FALSE,TRUE,FALSE
"mean_ensemble","infections","3 week",2023-11-29,972.875,1231,1439,1652.25,2744.9,2327,67.70625,548,888,1012.125,20.895,507.34525,888,FALSE,TRUE,FALSE
"median_ensemble","infections","3 week",2023-11-29,972.875,1231,1439,1652.25,2744.9,2327,67.70625,548,888,1012.125,20.895,507.34525,888,FALSE,TRUE,FALSE
"infections_benchmark_weak","infections","3 week",2023-11-29,976.75,1070,1158,1293.5,1850.5,2327,67.5125,628.5,1169,1550.25,929.175,868.8875,1169,FALSE,FALSE,FALSE
"StannisBaratheon","infections","3 week",2023-11-29,1017.75,1133,1264,1370.5,2774.75,2327,65.4625,597,1063,1434.75,22.3875,636.52,1063,FALSE,TRUE,FALSE
"infections_benchmark_strong","infections","3 week",2023-11-29,928,1329,1614,1934,2715.05,2327,69.95,499,713,589.5,19.4025,378.1705,713,FALSE,TRUE,FALSE
"median_ensemble","infections","4 week",2023-11-29,994.125,1255.75,1461.5,1685.625,2841.25,2539,77.24375,641.625,1077.5,1280.0625,15.1125,618.30875,1077.5,FALSE,TRUE,FALSE
"infections_benchmark_weak","infections","4 week",2023-11-29,977,1069,1228,1287.5,2134.25,2539,78.1,735,1311,1877.25,789.2625,958.1225,1311,FALSE,FALSE,FALSE
"StannisBaratheon","infections","4 week",2023-11-29,1088.25,1192.5,1302,1390,2824.5,2539,72.5375,673.25,1237,1723.5,14.275,744.1125,1237,FALSE,TRUE,FALSE
"mean_ensemble","infections","4 week",2023-11-29,994.125,1255.75,1461.5,1685.625,2841.25,2539,77.24375,641.625,1077.5,1280.0625,15.1125,618.30875,1077.5,FALSE,TRUE,FALSE
"infections_benchmark_strong","infections","4 week",2023-11-29,900,1319,1621,1981.25,2858,2539,81.95,610,918,836.625,15.95,492.505,918,FALSE,TRUE,FALSE
"BrienneVonTarth","energy","36 hour",2023-11-29,50.1367838303122,59.9210364182598,66.8738690761113,71.6302017338319,80.3948293218916,71.60025,1.07317330848439,5.83960679087011,4.72638092388868,0.0149758669159326,0.439728966094578,2.41877317125074,4.72638092388868,TRUE,TRUE,FALSE
"Rachel","energy","36 hour",2023-11-29,60.7024998974439,64.1430013099423,64.8287668468256,65.551999333331,69.1697493076911,71.60025,0.544887505127806,3.72862434502884,6.7714831531744,9.07237600000355,4.7394763500024,4.9713694706674,6.7714831531744,FALSE,FALSE,FALSE
"Phoebe","energy","36 hour",2023-11-29,60.64323,65.17515,67.55305,69.93096,74.46287,71.60025,0.547851,3.21255,4.0472,2.50393500000001,0.143131,2.0909334,4.0472,FALSE,TRUE,FALSE
"mean_ensemble","energy","36 hour",2023-11-29,53.8626883934459,60.8669771884887,64.5638779115168,67.8497162458851,73.8872145573408,71.60025,0.886878080327705,5.36663640575565,7.0363720884832,5.62580063117235,0.11434822786704,3.80600708672119,7.0363720884832,FALSE,TRUE,FALSE
"JonSnow","energy","36 hour",2023-11-29,39.5982506408851,47.270818270564,51.3997044727295,54.5609395934698,57.7444504621672,71.60025,1.60009996795574,12.164715864718,20.2005455272705,25.5589656097953,27.0188090987741,17.3086272137027,20.2005455272705,FALSE,FALSE,FALSE
"homersimpson","energy","36 hour",2023-11-29,66.8935038271756,69.493656645477,69.5690789840116,70.8163019980337,71.2532156832487,71.60025,0.235337308641219,1.05329667726148,2.03117101598841,1.17592200294948,0.6767169176651,1.03448878450114,2.03117101598841,FALSE,FALSE,FALSE
"CharlesBoyle","energy","36 hour",2023-11-29,53.09115,62.79025,66.81025,70.54275,75.65035,71.60025,0.925455,4.405,4.79000000000001,1.58625000000001,0.202504999999999,2.381842,4.79000000000001,FALSE,TRUE,FALSE
"StannisBaratheon","energy","36 hour",2023-11-29,51.53419375,59.8349375,62.870625,66.24125,74.8439,71.60025,1.0033028125,5.88265625,8.72962500000001,8.03850000000001,0.1621825,4.7632533125,8.72962500000001,FALSE,TRUE,FALSE
"power_benchmark","energy","36 hour",2023-11-29,53.2747625,60.8725625,63.61675,66.89475,74.96348125,71.60025,0.916274375,5.36384375,7.98350000000001,7.05825,0.1681615625,4.2980059375,7.98350000000001,FALSE,TRUE,FALSE
"median_ensemble","energy","36 hour",2023-11-29,53.09115,60.8725625,65.0185,68.28275,74.97015,71.60025,0.925455,5.36384375,6.58175,4.97625000000001,0.168495,3.60315875,6.58175,FALSE,TRUE,FALSE
"MasterYoda","energy","36 hour",2023-11-29,46.2509,53.2509,61.2509,68.2509,77.2509,71.60025,1.2674675,9.174675,10.34935,5.024025,0.2825325,5.21961,10.34935,FALSE,TRUE,FALSE
"JakePeralta","energy","36 hour",2023-11-29,50.4671309189803,60.49776580611,66.0516684700409,69.1570710378403,75.9010557204319,71.60025,1.05665595405099,5.55124209694502,5.54858152995909,3.66476844323958,0.215040286021594,3.20725766204326,5.54858152995909,FALSE,TRUE,FALSE
"DaenerysTargaryen","energy","36 hour",2023-11-29,64.511,68.241,71.736,74.246,78.843,71.60025,0.3544625,1.679625,0.135750000000002,1.322875,0.3621375,0.77097,0.135750000000002,TRUE,TRUE,FALSE
"TormundGiantsbane","energy","36 hour",2023-11-29,49.48524375,58.321375,61.75125,65.9404375,75.0858375,71.60025,1.1057503125,6.6394375,9.849,8.48971875,0.174279375,5.2516371875,9.849,FALSE,TRUE,FALSE
"TyrionLannister","energy","36 hour",2023-11-29,53.6263,61.45825,65.0185,68.28275,74.97015,71.60025,0.8986975,5.071,6.58175,4.97625000000001,0.168495,3.5392385,6.58175,FALSE,TRUE,FALSE
"BrienneVonTarth","energy","40 hour",2023-11-29,47.6889341196483,58.5110458858472,64.9275265275977,70.0833825025535,79.1596185509372,69.0305,1.06707829401759,5.25972705707639,4.10297347240228,0.526441251276772,0.506455927546861,2.29253520046398,4.10297347240228,TRUE,TRUE,FALSE
"Phoebe","energy","40 hour",2023-11-29,57.03538,61.67632,64.11142,66.54653,71.18747,69.0305,0.599756,3.67709,4.91908000000001,3.725955,0.1078485,2.6059459,4.91908000000001,FALSE,TRUE,FALSE
"mean_ensemble","energy","40 hour",2023-11-29,52.7958484367976,59.3152454327927,62.9262482698519,66.3902068538006,72.5762040011336,69.0305,0.81173257816012,4.85762728360365,6.10425173014811,3.9604397192991,0.17728520005668,3.18226730225353,6.10425173014811,FALSE,TRUE,FALSE
"JonSnow","energy","40 hour",2023-11-29,50.5670397026117,59.9615325243169,64.0197353499099,68.9263577560559,74.3592491596646,69.0305,0.923173014869413,4.53448373784155,5.01076465009014,0.156213365916081,0.266437457983231,2.17821444534008,5.01076465009014,FALSE,TRUE,FALSE
"Rachel","energy","40 hour",2023-11-29,56.8427500256475,59.5660006666642,60.0119433179789,61.3380003333413,64.2462873509738,69.0305,0.609387498717623,4.73224966666792,9.01855668202112,11.5387494999881,9.32921466560101,7.04563160259916,9.01855668202112,FALSE,FALSE,FALSE
"CharlesBoyle","energy","40 hour",2023-11-29,48.93745,58.255,61.99225,65.56125,70.944,69.0305,1.0046525,5.38775,7.03825000000001,5.203875,0.0956749999999993,3.7460405,7.03825000000001,FALSE,TRUE,FALSE
"StannisBaratheon","energy","40 hour",2023-11-29,51.66358125,59.2420625,62.263125,65.577625,73.36360625,69.0305,0.8683459375,4.89421875,6.767375,5.17931250000001,0.2166553125,3.5851815,6.767375,FALSE,TRUE,FALSE
"power_benchmark","energy","40 hour",2023-11-29,50.64201875,55.8010625,58.5375,62.6764375,70.579475,69.0305,0.9194240625,6.61471875,10.493,9.53109375000001,0.0774487499999993,5.5271370625,10.493,FALSE,TRUE,FALSE
"median_ensemble","energy","40 hour",2023-11-29,51.66358125,59.2420625,63.6461046723771,66.54653,73.198,69.0305,0.8683459375,4.89421875,5.3843953276229,3.725955,0.208375,3.01625800302458,5.3843953276229,FALSE,TRUE,FALSE
"MasterYoda","energy","40 hour",2023-11-29,45.7222,52.7222,60.7222,67.7222,76.7222,69.0305,1.165415,8.15415,8.3083,1.96245,0.384585,3.99498,8.3083,FALSE,TRUE,FALSE
"JakePeralta","energy","40 hour",2023-11-29,50.0254032175141,58.7574044648324,63.6461046723771,67.0675084310163,73.8813016244053,69.0305,0.950254839124293,5.13654776758379,5.38439532762286,2.94448735347552,0.242540081220263,2.93164507380535,5.38439532762286,FALSE,TRUE,FALSE
"DaenerysTargaryen","energy","40 hour",2023-11-29,60.376,63.245,67.523,70.135,73.198,69.0305,0.432725,2.89275,1.50750000000001,0.552250000000001,0.208375,1.11872,1.50750000000001,TRUE,TRUE,FALSE
"TormundGiantsbane","energy","40 hour",2023-11-29,53.49408125,61.0410625,63.89025,67.744875,75.42703125,69.0305,0.7768209375,3.99471875,5.14025,1.92843750000002,0.3198265625,2.43201075,5.14025,FALSE,TRUE,FALSE
"homersimpson","energy","40 hour",2023-11-29,60.9861413629477,65.5472495846443,66.3741726402112,66.3752725764405,68.5869628287554,69.0305,0.402217931852614,1.74162520767783,2.65632735978885,3.9828411353392,0.864897483927053,1.92958182371711,2.65632735978885,FALSE,FALSE,FALSE
"TyrionLannister","energy","40 hour",2023-11-29,52.36505,56.77225,60.022,63.31825,71.83545,69.0305,0.8332725,6.129125,9.00850000000001,8.56837500000001,0.1402475,4.935904,9.00850000000001,FALSE,TRUE,FALSE
"Phoebe","energy","44 hour",2023-11-29,55.01802,58.8061,60.79371,62.78133,66.56941,63.04375,0.4012865,2.118825,2.25004000000001,0.393630000000009,0.176283,1.0680129,2.25004000000001,FALSE,TRUE,FALSE
"mean_ensemble","energy","44 hour",2023-11-29,51.348527664864,56.5124568800245,60.1054148027768,63.8115185352817,69.5664155434825,63.04375,0.5847611167568,3.26564655998775,2.9383351972232,0.383884267640848,0.326133277174125,1.49975208375655,2.9383351972232,TRUE,TRUE,FALSE
"BrienneVonTarth","energy","44 hour",2023-11-29,43.8987500256416,55.1320003333203,62.3691876936427,66.6192496664735,72.038998974891,63.04375,0.957249998717922,3.95587483333984,0.674562306357259,1.78774983323674,0.44976244874455,1.56503988407926,0.674562306357259,TRUE,TRUE,FALSE
"Rachel","energy","44 hour",2023-11-29,56.4520005897522,57.5275016429624,58.8574433166359,59.6792493333372,61.9977874022573,63.04375,0.329587470512391,2.75812417851878,4.18630668336409,5.04675099999417,2.03962706559823,2.87207927959753,4.18630668336409,FALSE,FALSE,FALSE
"CharlesBoyle","energy","44 hour",2023-11-29,51.15945,56.3295,60.34625,66.94725,71.54025,63.04375,0.594215,3.357125,2.69750000000001,1.95175,0.424825,1.805083,2.69750000000001,TRUE,TRUE,FALSE
"StannisBaratheon","energy","44 hour",2023-11-29,51.09976875,55.669625,59.109625,64.1291875,72.68700625,63.04375,0.5971990625,3.6870625,3.934125,0.542718749999999,0.4821628125,1.848653625,3.934125,TRUE,TRUE,FALSE
"power_benchmark","energy","44 hour",2023-11-29,49.34880625,52.423625,56.379125,59.9759375,67.13554375,63.04375,0.6847471875,5.3100625,6.664625,4.60171875,0.2045896875,3.493148625,6.664625,FALSE,TRUE,FALSE
"median_ensemble","energy","44 hour",2023-11-29,51.0531375,56.0755,59.3461708490651,62.8846875,68.9771797743045,63.04375,0.599530625,3.484125,3.6975791509349,0.238593750000007,0.296671488715225,1.66330000293003,3.6975791509349,FALSE,TRUE,FALSE
"MasterYoda","energy","44 hour",2023-11-29,45.5772,53.5772,61.5772,68.5772,77.5772,63.04375,0.8733275,4.733275,1.46655000000001,2.766725,0.726672500000001,2.11331,1.46655000000001,TRUE,TRUE,FALSE
"JakePeralta","energy","44 hour",2023-11-29,47.654779671517,54.8935693407988,58.8007606677811,62.0649851632406,68.9771797743045,63.04375,0.769448516424152,4.07509032960061,4.24298933221894,1.46814725513915,0.296671488715227,2.17046938441961,4.24298933221894,FALSE,TRUE,FALSE
"DaenerysTargaryen","energy","44 hour",2023-11-29,57.412,61.413,64.574,68.134,74.985,63.04375,0.2815875,0.815375000000003,1.53025,2.545125,0.5970625,1.15388,1.53025,TRUE,TRUE,FALSE
"TormundGiantsbane","energy","44 hour",2023-11-29,51.0531375,56.0755,58.84075,62.8846875,71.20035625,63.04375,0.599530625,3.484125,4.203,0.238593750000007,0.4078303125,1.7866159375,4.203,FALSE,TRUE,FALSE
"homersimpson","energy","44 hour",2023-11-29,60.5643547932129,63.0787952018186,63.2494199089737,64.3913053313097,65.4911514548103,63.04375,0.123969760339357,0.0525678027279604,0.205669908973682,0.673777665654839,0.122370072740517,0.235671042087271,0.205669908973682,FALSE,TRUE,FALSE
"TyrionLannister","energy","44 hour",2023-11-29,49.4583,53.485,57.12675,60.6255,67.3882,63.04375,0.6792725,4.779375,5.917,3.627375,0.2172225,3.044049,5.917,FALSE,TRUE,FALSE
"JonSnow","energy","44 hour",2023-11-29,48.8342920631086,56.2505229214178,59.3461708490651,62.7398589643017,66.7753182090091,63.04375,0.710472896844571,3.39661353929112,3.69757915093494,0.455836553547492,0.186578410450456,1.68941611021372,3.69757915093494,FALSE,TRUE,FALSE
"Phoebe","energy","60 hour",2023-11-29,51.0023,55.53422,57.91212,60.29002,64.82194,61.4685,0.52331,2.96714,3.55638,1.76772,0.167672,1.7964444,3.55638,FALSE,TRUE,FALSE
"BrienneVonTarth","energy","60 hour",2023-11-29,31.2346252435896,33.5235005,42.5797638509929,44.7412495000002,45.1003747564102,61.4685,1.51169373782052,13.97249975,18.8887361490071,25.0908757499998,31.9178442250001,18.2763299223655,18.8887361490071,FALSE,FALSE,FALSE
"Rachel","energy","60 hour",2023-11-29,52.3795000256418,53.5554999784327,55.3280474121202,58.3069983333159,62.2187121105697,61.4685,0.454449998717908,3.95650001078367,6.14045258787979,4.74225250002614,0.037510605528485,3.0662331405872,6.14045258787979,FALSE,TRUE,FALSE
"CharlesBoyle","energy","60 hour",2023-11-29,49.2787,53.68125,55.89975,59.7025,64.193,61.4685,0.60949,3.893625,5.56875,2.649,0.136225,2.571418,5.56875,FALSE,TRUE,FALSE
"StannisBaratheon","energy","60 hour",2023-11-29,46.2101,48.7510625,51.54975,54.9141875,61.31649375,61.4685,0.76292,6.35871875,9.91875,9.83146875,0.296412187499999,5.4336539375,9.91875,FALSE,FALSE,FALSE
"power_benchmark","energy","60 hour",2023-11-29,47.4772,51.317125,53.83775,57.222375,62.95748125,61.4685,0.699565,5.0756875,7.63075,6.3691875,0.0744490625000002,3.9699278125,7.63075,FALSE,TRUE,FALSE
"median_ensemble","energy","60 hour",2023-11-29,47.4772,52.0101649972366,55.3280474121202,58.3069983333159,62.95748125,61.4685,0.699565,4.7291675013817,6.1404525878798,4.74225250002614,0.0744490625000002,3.27717733035753,6.1404525878798,FALSE,TRUE,FALSE
"MasterYoda","energy","60 hour",2023-11-29,44.2498,51.2498,59.2498,66.2498,75.2498,61.4685,0.860935,5.10935,2.2187,2.39065,0.689065,2.25374,2.2187,TRUE,TRUE,FALSE
"JakePeralta","energy","60 hour",2023-11-29,43.4151227234706,52.0101649972366,56.1952601646904,59.4307641385318,64.503686178934,61.4685,0.902668863826471,4.72916750138171,5.2732398353096,3.05660379220232,0.151759308946703,2.82268786033336,5.2732398353096,FALSE,TRUE,FALSE
"DaenerysTargaryen","energy","60 hour",2023-11-29,51.125,55.156,58.854,61.155,66.954,61.4685,0.517175,3.15625,2.6145,0.470249999999997,0.274275,1.40649,2.6145,FALSE,TRUE,FALSE
"TormundGiantsbane","energy","60 hour",2023-11-29,43.24550625,45.17225,48.34175,51.3673125,57.9448125,61.4685,0.9111496875,8.148125,13.12675,15.15178125,6.871190625,8.8417993125,13.12675,FALSE,FALSE,FALSE
"homersimpson","energy","60 hour",2023-11-29,53.4568752729171,55.8106536051798,57.0296614729258,58.7355587527852,59.4591475542677,61.4685,0.400581236354143,2.82892319741012,4.43883852707417,4.09941187082223,3.91823726917791,3.13719842016771,4.43883852707417,FALSE,FALSE,FALSE
"TyrionLannister","energy","60 hour",2023-11-29,47.6983,52.0665,54.65975,58.2195,63.6255,61.4685,0.68851,4.701,6.80875,4.8735,0.10785,3.435922,6.80875,FALSE,TRUE,FALSE
"mean_ensemble","energy","60 hour",2023-11-29,46.1065215445779,50.247938750393,53.9223191689102,57.189836353626,61.9490549966471,61.4685,0.768098922771105,5.6102806248035,7.5461808310898,6.417995469561,0.0240277498323551,4.07331671961155,7.5461808310898,FALSE,TRUE,FALSE
"JonSnow","energy","60 hour",2023-11-29,38.6117505638929,45.3951771742596,49.5527462951033,53.1326068725057,56.9927668562304,61.4685,1.14283747180536,8.03666141287021,11.9157537048967,12.5038396912415,8.72767963035063,8.46535438223288,11.9157537048967,FALSE,FALSE,FALSE
"BrienneVonTarth","energy","64 hour",2023-11-29,29.4776252179486,33.2665001666666,39.9165138248162,42.1249998333336,44.3521247360492,60.14875,1.53355623910257,13.4411249166667,20.2322361751838,27.0356252499997,30.803419264704,18.6091923691314,20.2322361751838,FALSE,FALSE,FALSE
"Rachel","energy","64 hour",2023-11-29,48.5197501538455,48.9784993351545,50.5112238832735,54.0929993333262,57.2952501538525,60.14875,0.581449992307725,5.58512533242275,9.63752611672651,9.08362600001071,5.56432469998769,6.09041042829108,9.63752611672651,FALSE,FALSE,FALSE
"CharlesBoyle","energy","64 hour",2023-11-29,45.81345,49.548,51.665,54.97875,60.94065,60.14875,0.716765,5.300375,8.48375,7.755,0.0395949999999999,4.459097,8.48375,FALSE,TRUE,FALSE
"StannisBaratheon","energy","64 hour",2023-11-29,45.99123125,49.9445625,52.159625,55.6895,61.81280625,60.14875,0.7078759375,5.10209375,7.989125,6.688875,0.0832028125000002,4.1142345,7.989125,FALSE,TRUE,FALSE
"power_benchmark","energy","64 hour",2023-11-29,44.08115625,47.3979375,50.04575,53.5734375,60.18688125,60.14875,0.8033796875,6.37540625,10.103,9.86296875,0.00190656249999997,5.42933225,10.103,FALSE,TRUE,FALSE
"median_ensemble","energy","64 hour",2023-11-29,45.99123125,49.9445625,53.5520434119965,56.8764434849207,61.91813,60.14875,0.7078759375,5.10209375,6.5967065880035,4.90845977261895,0.088469,3.48072100962449,6.5967065880035,FALSE,TRUE,FALSE
"MasterYoda","energy","64 hour",2023-11-29,44.562,51.562,59.562,66.562,75.562,60.14875,0.7793375,4.293375,0.586750000000002,3.206625,0.770662500000001,1.92735,0.586750000000002,TRUE,TRUE,FALSE
"JakePeralta","energy","64 hour",2023-11-29,42.4244537388786,49.6984583553386,53.5520434119965,56.8764434849207,62.5142507224942,60.14875,0.886214813056069,5.2251458223307,6.59670658800353,4.90845977261898,0.118275036124709,3.5469604064268,6.59670658800353,FALSE,TRUE,FALSE
"DaenerysTargaryen","energy","64 hour",2023-11-29,50.156,54.174,58.621,61.671,67.548,60.14875,0.4996375,2.987375,1.52775,0.761125,0.3699625,1.22917,1.52775,TRUE,TRUE,FALSE
"TormundGiantsbane","energy","64 hour",2023-11-29,47.87725625,51.655,54.305875,57.56675,64.12195,60.14875,0.6135746875,4.246875,5.842875,3.873,0.19866,2.9549969375,5.842875,FALSE,TRUE,FALSE
"homersimpson","energy","64 hour",2023-11-29,52.7069237461845,54.5308066823849,56.5642417240453,57.3209262596828,59.4662649418068,60.14875,0.372091312690777,2.80897165880753,3.5845082759547,4.24173561047584,1.3308458634767,2.46763054428111,3.5845082759547,FALSE,FALSE,FALSE
"Phoebe","energy","64 hour",2023-11-29,47.76603,52.40697,54.84208,57.27719,61.91813,60.14875,0.619136,3.87089,5.30667,4.30734,0.088469,2.838501,5.30667,FALSE,TRUE,FALSE
"mean_ensemble","energy","64 hour",2023-11-29,45.6452243255751,49.9513558436582,53.4342792320319,56.8496939574119,62.4731018159947,60.14875,0.725176283721245,5.0986970781709,6.7144707679681,4.94858406388215,0.116217590799735,3.52062915690843,6.7144707679681,FALSE,TRUE,FALSE
"JonSnow","energy","64 hour",2023-11-29,49.5805396256195,58.0858914280125,62.1727771722837,67.4980250350918,73.6075655537279,60.14875,0.528410518719025,1.03142928599373,2.02402717228367,3.67463751754591,0.672940777686396,1.58628905444575,2.02402717228367,TRUE,TRUE,FALSE
"TyrionLannister","energy","64 hour",2023-11-29,44.4315,48.119,50.7275,53.814,62.82445,60.14875,0.7858625,6.014875,9.42125,9.502125,0.133785,5.1715795,9.42125,FALSE,TRUE,FALSE
"BrienneVonTarth","energy","68 hour",2023-11-29,29.3436252179485,31.5507501666666,36.4998293077031,37.7427498333337,39.6286247820512,56.22,1.34381873910258,12.3346249166667,19.7201706922969,27.7158752499995,32.3531816750002,18.6935342546132,19.7201706922969,FALSE,FALSE,FALSE
"CharlesBoyle","energy","68 hour",2023-11-29,45.9167,49.80575,53.02225,58.81825,63.5605,56.22,0.515165,3.207125,3.19775,1.299125,0.367025,1.717238,3.19775,TRUE,TRUE,FALSE
"StannisBaratheon","energy","68 hour",2023-11-29,44.6488625,47.78325,50.627875,55.9173125,63.29043125,56.22,0.578556875,4.218375,5.592125,0.454031249999996,0.3535215625,2.2393219375,5.592125,FALSE,TRUE,FALSE
"power_benchmark","energy","68 hour",2023-11-29,43.28444375,46.3519375,49.405625,53.355125,59.91381875,56.22,0.6467778125,4.93403125,6.814375,4.2973125,0.1846909375,3.3754375,6.814375,FALSE,TRUE,FALSE
"median_ensemble","energy","68 hour",2023-11-29,45.3964,48.1290007179501,50.627875,54.08225,59.91381875,56.22,0.54118,4.04549964102495,5.592125,3.206625,0.1846909375,2.71402411570499,5.592125,FALSE,TRUE,FALSE
"MasterYoda","energy","68 hour",2023-11-29,45.3964,52.3964,60.3964,67.2964,76.3964,56.22,0.54118,1.9118,4.1764,5.5382,1.00882,2.63528,4.1764,TRUE,TRUE,FALSE
"JakePeralta","energy","68 hour",2023-11-29,41.8523930798476,46.2271102292888,49.2666257046659,52.8914580356813,59.3359544983498,56.22,0.718380346007621,4.9964448853556,6.95337429533409,4.99281294647806,0.155797724917489,3.56336203961857,6.95337429533409,FALSE,TRUE,FALSE
"DaenerysTargaryen","energy","68 hour",2023-11-29,50.126,53.874,56.161,61.764,65.954,56.22,0.3047,1.173,0.0589999999999975,2.772,0.4867,0.95908,0.0589999999999975,TRUE,TRUE,FALSE
"TormundGiantsbane","energy","68 hour",2023-11-29,44.1126375,47.477,50.18125,53.671,62.3891875,56.22,0.605368125,4.3715,6.03875,3.8235,0.308459375,3.0295155,6.03875,FALSE,TRUE,FALSE
"Rachel","energy","68 hour",2023-11-29,46.9400003114528,48.1290007179501,49.3567238819305,52.4342483333222,55.0467502051359,56.22,0.46399998442736,4.04549964102494,6.86327611806948,5.67862750001676,2.28783709998492,3.86784806870469,6.86327611806948,FALSE,FALSE,FALSE
"Phoebe","energy","68 hour",2023-11-29,48.20778,51.99587,53.98348,55.97109,59.75918,56.22,0.400611,2.112065,2.23652,0.373365000000003,0.176959,1.059904,2.23652,FALSE,TRUE,FALSE
"mean_ensemble","energy","68 hour",2023-11-29,44.7833094283662,48.4620927735818,51.5329739700231,55.3032867540133,60.5329810396318,56.22,0.57183452858169,3.8789536132091,4.6870260299769,1.37506986898005,0.21564905198159,2.14570661854586,4.6870260299769,FALSE,TRUE,FALSE
"JonSnow","energy","68 hour",2023-11-29,47.8477919861164,54.3748818251134,57.4992126714389,61.3115262433375,66.0236346030724,56.22,0.418610400694182,0.922559087443304,1.27921267143887,2.54576312166877,0.490181730153622,1.13126540227975,1.27921267143887,TRUE,TRUE,FALSE
"homersimpson","energy","68 hour",2023-11-29,51.1813882233955,52.921255617545,53.4971400445616,53.6873178564978,55.8961719266044,56.22,0.251930588830226,1.64937219122749,2.72285995543844,3.79902321525324,0.631464743121482,1.81093013877417,2.72285995543844,FALSE,FALSE,FALSE
"TyrionLannister","energy","68 hour",2023-11-29,43.325,47.12,50.03125,54.08225,59.7341,56.22,0.64475,4.55,6.18875,3.206625,0.175705,2.953166,6.18875,FALSE,TRUE,FALSE
"infections_benchmark_strong","DAX","1 day",2023-11-29,NA,NA,NA,NA,NA,0.302511958645368,NA,NA,NA,NA,NA,0.786040184353636,1.49529292176818,FALSE,FALSE,TRUE
"infections_benchmark_weak","DAX","1 day",2023-11-29,NA,NA,NA,NA,NA,0.302511958645368,NA,NA,NA,NA,NA,0.786040184353636,1.49529292176818,FALSE,FALSE,TRUE
"power_benchmark","DAX","1 day",2023-11-29,NA,NA,NA,NA,NA,0.302511958645368,NA,NA,NA,NA,NA,0.786040184353636,1.49529292176818,FALSE,FALSE,TRUE
"infections_benchmark_strong","DAX","2 day",2023-11-29,NA,NA,NA,NA,NA,1.41919560914818,NA,NA,NA,NA,NA,1.0704296791438,1.98282756523966,FALSE,FALSE,TRUE
"infections_benchmark_weak","DAX","2 day",2023-11-29,NA,NA,NA,NA,NA,1.41919560914818,NA,NA,NA,NA,NA,1.0704296791438,1.98282756523966,FALSE,FALSE,TRUE
"power_benchmark","DAX","2 day",2023-11-29,NA,NA,NA,NA,NA,1.41919560914818,NA,NA,NA,NA,NA,1.0704296791438,1.98282756523966,FALSE,FALSE,TRUE
"infections_benchmark_strong","DAX","5 day",2023-11-29,NA,NA,NA,NA,NA,1.46334031279558,NA,NA,NA,NA,NA,0.904534498080377,1.64628618005539,FALSE,FALSE,TRUE
"infections_benchmark_weak","DAX","5 day",2023-11-29,NA,NA,NA,NA,NA,1.46334031279558,NA,NA,NA,NA,NA,0.904534498080377,1.64628618005539,FALSE,FALSE,TRUE
"power_benchmark","DAX","5 day",2023-11-29,NA,NA,NA,NA,NA,1.46334031279558,NA,NA,NA,NA,NA,0.904534498080377,1.64628618005539,FALSE,FALSE,TRUE
"infections_benchmark_strong","DAX","6 day",2023-11-29,NA,NA,NA,NA,NA,2.24268798990792,NA,NA,NA,NA,NA,1.518114408637,2.374699869807,FALSE,FALSE,TRUE
"infections_benchmark_weak","DAX","6 day",2023-11-29,NA,NA,NA,NA,NA,2.24268798990792,NA,NA,NA,NA,NA,1.518114408637,2.374699869807,FALSE,FALSE,TRUE
"power_benchmark","DAX","6 day",2023-11-29,NA,NA,NA,NA,NA,2.24268798990792,NA,NA,NA,NA,NA,1.518114408637,2.374699869807,FALSE,FALSE,TRUE
"infections_benchmark_strong","DAX","7 day",2023-11-29,NA,NA,NA,NA,NA,2.98587763928548,NA,NA,NA,NA,NA,2.294392339407,3.64819841567834,FALSE,FALSE,TRUE
"infections_benchmark_weak","DAX","7 day",2023-11-29,NA,NA,NA,NA,NA,2.98587763928548,NA,NA,NA,NA,NA,2.294392339407,3.64819841567834,FALSE,FALSE,TRUE
"power_benchmark","DAX","7 day",2023-11-29,NA,NA,NA,NA,NA,2.98587763928548,NA,NA,NA,NA,NA,2.294392339407,3.64819841567834,FALSE,FALSE,TRUE
"BrienneVonTarth","infections","0 week",2023-11-29,NA,NA,NA,NA,NA,1924,NA,NA,NA,NA,NA,283.81,283.81,FALSE,FALSE,TRUE
"CharlesBoyle","infections","0 week",2023-11-29,NA,NA,NA,NA,NA,1924,NA,NA,NA,NA,NA,283.81,283.81,FALSE,FALSE,TRUE
"DaenerysTargaryen","infections","0 week",2023-11-29,NA,NA,NA,NA,NA,1924,NA,NA,NA,NA,NA,283.81,283.81,FALSE,FALSE,TRUE
"DAX_benchmark","infections","0 week",2023-11-29,NA,NA,NA,NA,NA,1924,NA,NA,NA,NA,NA,283.81,283.81,FALSE,FALSE,TRUE
"homersimpson","infections","0 week",2023-11-29,NA,NA,NA,NA,NA,1924,NA,NA,NA,NA,NA,283.81,283.81,FALSE,FALSE,TRUE
"JakePeralta","infections","0 week",2023-11-29,NA,NA,NA,NA,NA,1924,NA,NA,NA,NA,NA,283.81,283.81,FALSE,FALSE,TRUE
"JonSnow","infections","0 week",2023-11-29,NA,NA,NA,NA,NA,1924,NA,NA,NA,NA,NA,283.81,283.81,FALSE,FALSE,TRUE
"MasterYoda","infections","0 week",2023-11-29,NA,NA,NA,NA,NA,1924,NA,NA,NA,NA,NA,283.81,283.81,FALSE,FALSE,TRUE
"Phoebe","infections","0 week",2023-11-29,NA,NA,NA,NA,NA,1924,NA,NA,NA,NA,NA,283.81,283.81,FALSE,FALSE,TRUE
"power_benchmark","infections","0 week",2023-11-29,NA,NA,NA,NA,NA,1924,NA,NA,NA,NA,NA,283.81,283.81,FALSE,FALSE,TRUE
"Rachel","infections","0 week",2023-11-29,NA,NA,NA,NA,NA,1924,NA,NA,NA,NA,NA,283.81,283.81,FALSE,FALSE,TRUE
"TormundGiantsbane","infections","0 week",2023-11-29,NA,NA,NA,NA,NA,1924,NA,NA,NA,NA,NA,283.81,283.81,FALSE,FALSE,TRUE
"TyrionLannister","infections","0 week",2023-11-29,NA,NA,NA,NA,NA,1924,NA,NA,NA,NA,NA,283.81,283.81,FALSE,FALSE,TRUE
"BrienneVonTarth","infections","1 week",2023-11-29,NA,NA,NA,NA,NA,2077,NA,NA,NA,NA,NA,873.117225,1022.12,FALSE,FALSE,TRUE
"CharlesBoyle","infections","1 week",2023-11-29,NA,NA,NA,NA,NA,2077,NA,NA,NA,NA,NA,873.117225,1022.12,FALSE,FALSE,TRUE
"DaenerysTargaryen","infections","1 week",2023-11-29,NA,NA,NA,NA,NA,2077,NA,NA,NA,NA,NA,873.117225,1022.12,FALSE,FALSE,TRUE
"DAX_benchmark","infections","1 week",2023-11-29,NA,NA,NA,NA,NA,2077,NA,NA,NA,NA,NA,873.117225,1022.12,FALSE,FALSE,TRUE
"homersimpson","infections","1 week",2023-11-29,NA,NA,NA,NA,NA,2077,NA,NA,NA,NA,NA,873.117225,1022.12,FALSE,FALSE,TRUE
"JakePeralta","infections","1 week",2023-11-29,NA,NA,NA,NA,NA,2077,NA,NA,NA,NA,NA,873.117225,1022.12,FALSE,FALSE,TRUE
"JonSnow","infections","1 week",2023-11-29,NA,NA,NA,NA,NA,2077,NA,NA,NA,NA,NA,873.117225,1022.12,FALSE,FALSE,TRUE
"MasterYoda","infections","1 week",2023-11-29,NA,NA,NA,NA,NA,2077,NA,NA,NA,NA,NA,873.117225,1022.12,FALSE,FALSE,TRUE
"Phoebe","infections","1 week",2023-11-29,NA,NA,NA,NA,NA,2077,NA,NA,NA,NA,NA,873.117225,1022.12,FALSE,FALSE,TRUE
"power_benchmark","infections","1 week",2023-11-29,NA,NA,NA,NA,NA,2077,NA,NA,NA,NA,NA,873.117225,1022.12,FALSE,FALSE,TRUE
"Rachel","infections","1 week",2023-11-29,NA,NA,NA,NA,NA,2077,NA,NA,NA,NA,NA,873.117225,1022.12,FALSE,FALSE,TRUE
"TormundGiantsbane","infections","1 week",2023-11-29,NA,NA,NA,NA,NA,2077,NA,NA,NA,NA,NA,873.117225,1022.12,FALSE,FALSE,TRUE
"TyrionLannister","infections","1 week",2023-11-29,NA,NA,NA,NA,NA,2077,NA,NA,NA,NA,NA,873.117225,1022.12,FALSE,FALSE,TRUE
"BrienneVonTarth","infections","2 week",2023-11-29,NA,NA,NA,NA,NA,2082,NA,NA,NA,NA,NA,648.1473,920.11,FALSE,FALSE,TRUE
"CharlesBoyle","infections","2 week",2023-11-29,NA,NA,NA,NA,NA,2082,NA,NA,NA,NA,NA,648.1473,920.11,FALSE,FALSE,TRUE
"DaenerysTargaryen","infections","2 week",2023-11-29,NA,NA,NA,NA,NA,2082,NA,NA,NA,NA,NA,648.1473,920.11,FALSE,FALSE,TRUE
"DAX_benchmark","infections","2 week",2023-11-29,NA,NA,NA,NA,NA,2082,NA,NA,NA,NA,NA,648.1473,920.11,FALSE,FALSE,TRUE
"homersimpson","infections","2 week",2023-11-29,NA,NA,NA,NA,NA,2082,NA,NA,NA,NA,NA,648.1473,920.11,FALSE,FALSE,TRUE
"JakePeralta","infections","2 week",2023-11-29,NA,NA,NA,NA,NA,2082,NA,NA,NA,NA,NA,648.1473,920.11,FALSE,FALSE,TRUE
"JonSnow","infections","2 week",2023-11-29,NA,NA,NA,NA,NA,2082,NA,NA,NA,NA,NA,648.1473,920.11,FALSE,FALSE,TRUE
"MasterYoda","infections","2 week",2023-11-29,NA,NA,NA,NA,NA,2082,NA,NA,NA,NA,NA,648.1473,920.11,FALSE,FALSE,TRUE
"Phoebe","infections","2 week",2023-11-29,NA,NA,NA,NA,NA,2082,NA,NA,NA,NA,NA,648.1473,920.11,FALSE,FALSE,TRUE
"power_benchmark","infections","2 week",2023-11-29,NA,NA,NA,NA,NA,2082,NA,NA,NA,NA,NA,648.1473,920.11,FALSE,FALSE,TRUE
"Rachel","infections","2 week",2023-11-29,NA,NA,NA,NA,NA,2082,NA,NA,NA,NA,NA,648.1473,920.11,FALSE,FALSE,TRUE
"TormundGiantsbane","infections","2 week",2023-11-29,NA,NA,NA,NA,NA,2082,NA,NA,NA,NA,NA,648.1473,920.11,FALSE,FALSE,TRUE
"TyrionLannister","infections","2 week",2023-11-29,NA,NA,NA,NA,NA,2082,NA,NA,NA,NA,NA,648.1473,920.11,FALSE,FALSE,TRUE
"BrienneVonTarth","infections","3 week",2023-11-29,NA,NA,NA,NA,NA,2327,NA,NA,NA,NA,NA,877.576375,1180.69,FALSE,FALSE,TRUE
"CharlesBoyle","infections","3 week",2023-11-29,NA,NA,NA,NA,NA,2327,NA,NA,NA,NA,NA,877.576375,1180.69,FALSE,FALSE,TRUE
"DaenerysTargaryen","infections","3 week",2023-11-29,NA,NA,NA,NA,NA,2327,NA,NA,NA,NA,NA,877.576375,1180.69,FALSE,FALSE,TRUE
"DAX_benchmark","infections","3 week",2023-11-29,NA,NA,NA,NA,NA,2327,NA,NA,NA,NA,NA,877.576375,1180.69,FALSE,FALSE,TRUE
"homersimpson","infections","3 week",2023-11-29,NA,NA,NA,NA,NA,2327,NA,NA,NA,NA,NA,877.576375,1180.69,FALSE,FALSE,TRUE
"JakePeralta","infections","3 week",2023-11-29,NA,NA,NA,NA,NA,2327,NA,NA,NA,NA,NA,877.576375,1180.69,FALSE,FALSE,TRUE
"JonSnow","infections","3 week",2023-11-29,NA,NA,NA,NA,NA,2327,NA,NA,NA,NA,NA,877.576375,1180.69,FALSE,FALSE,TRUE
"MasterYoda","infections","3 week",2023-11-29,NA,NA,NA,NA,NA,2327,NA,NA,NA,NA,NA,877.576375,1180.69,FALSE,FALSE,TRUE
"Phoebe","infections","3 week",2023-11-29,NA,NA,NA,NA,NA,2327,NA,NA,NA,NA,NA,877.576375,1180.69,FALSE,FALSE,TRUE
"power_benchmark","infections","3 week",2023-11-29,NA,NA,NA,NA,NA,2327,NA,NA,NA,NA,NA,877.576375,1180.69,FALSE,FALSE,TRUE
"Rachel","infections","3 week",2023-11-29,NA,NA,NA,NA,NA,2327,NA,NA,NA,NA,NA,877.576375,1180.69,FALSE,FALSE,TRUE
"TormundGiantsbane","infections","3 week",2023-11-29,NA,NA,NA,NA,NA,2327,NA,NA,NA,NA,NA,877.576375,1180.69,FALSE,FALSE,TRUE
"TyrionLannister","infections","3 week",2023-11-29,NA,NA,NA,NA,NA,2327,NA,NA,NA,NA,NA,877.576375,1180.69,FALSE,FALSE,TRUE
"BrienneVonTarth","infections","4 week",2023-11-29,NA,NA,NA,NA,NA,2539,NA,NA,NA,NA,NA,967.703725,1324.11,FALSE,FALSE,TRUE
"CharlesBoyle","infections","4 week",2023-11-29,NA,NA,NA,NA,NA,2539,NA,NA,NA,NA,NA,967.703725,1324.11,FALSE,FALSE,TRUE
"DaenerysTargaryen","infections","4 week",2023-11-29,NA,NA,NA,NA,NA,2539,NA,NA,NA,NA,NA,967.703725,1324.11,FALSE,FALSE,TRUE
"DAX_benchmark","infections","4 week",2023-11-29,NA,NA,NA,NA,NA,2539,NA,NA,NA,NA,NA,967.703725,1324.11,FALSE,FALSE,TRUE
"homersimpson","infections","4 week",2023-11-29,NA,NA,NA,NA,NA,2539,NA,NA,NA,NA,NA,967.703725,1324.11,FALSE,FALSE,TRUE
"JakePeralta","infections","4 week",2023-11-29,NA,NA,NA,NA,NA,2539,NA,NA,NA,NA,NA,967.703725,1324.11,FALSE,FALSE,TRUE
"JonSnow","infections","4 week",2023-11-29,NA,NA,NA,NA,NA,2539,NA,NA,NA,NA,NA,967.703725,1324.11,FALSE,FALSE,TRUE
"MasterYoda","infections","4 week",2023-11-29,NA,NA,NA,NA,NA,2539,NA,NA,NA,NA,NA,967.703725,1324.11,FALSE,FALSE,TRUE
"Phoebe","infections","4 week",2023-11-29,NA,NA,NA,NA,NA,2539,NA,NA,NA,NA,NA,967.703725,1324.11,FALSE,FALSE,TRUE
"power_benchmark","infections","4 week",2023-11-29,NA,NA,NA,NA,NA,2539,NA,NA,NA,NA,NA,967.703725,1324.11,FALSE,FALSE,TRUE
"Rachel","infections","4 week",2023-11-29,NA,NA,NA,NA,NA,2539,NA,NA,NA,NA,NA,967.703725,1324.11,FALSE,FALSE,TRUE
"TormundGiantsbane","infections","4 week",2023-11-29,NA,NA,NA,NA,NA,2539,NA,NA,NA,NA,NA,967.703725,1324.11,FALSE,FALSE,TRUE
"TyrionLannister","infections","4 week",2023-11-29,NA,NA,NA,NA,NA,2539,NA,NA,NA,NA,NA,967.703725,1324.11,FALSE,FALSE,TRUE
"DAX_benchmark","energy","36 hour",2023-11-29,NA,NA,NA,NA,NA,71.60025,NA,NA,NA,NA,NA,17.4817134858398,20.4025509825432,FALSE,FALSE,TRUE
"infections_benchmark_strong","energy","36 hour",2023-11-29,NA,NA,NA,NA,NA,71.60025,NA,NA,NA,NA,NA,17.4817134858398,20.4025509825432,FALSE,FALSE,TRUE
"infections_benchmark_weak","energy","36 hour",2023-11-29,NA,NA,NA,NA,NA,71.60025,NA,NA,NA,NA,NA,17.4817134858398,20.4025509825432,FALSE,FALSE,TRUE
"DAX_benchmark","energy","40 hour",2023-11-29,NA,NA,NA,NA,NA,69.0305,NA,NA,NA,NA,NA,7.11608791862515,10.59793,FALSE,FALSE,TRUE
"infections_benchmark_strong","energy","40 hour",2023-11-29,NA,NA,NA,NA,NA,69.0305,NA,NA,NA,NA,NA,7.11608791862515,10.59793,FALSE,FALSE,TRUE
"infections_benchmark_weak","energy","40 hour",2023-11-29,NA,NA,NA,NA,NA,69.0305,NA,NA,NA,NA,NA,7.11608791862515,10.59793,FALSE,FALSE,TRUE
"DAX_benchmark","energy","44 hour",2023-11-29,NA,NA,NA,NA,NA,63.04375,NA,NA,NA,NA,NA,3.52808011125,6.73127125,FALSE,FALSE,TRUE
"infections_benchmark_strong","energy","44 hour",2023-11-29,NA,NA,NA,NA,NA,63.04375,NA,NA,NA,NA,NA,3.52808011125,6.73127125,FALSE,FALSE,TRUE
"infections_benchmark_weak","energy","44 hour",2023-11-29,NA,NA,NA,NA,NA,63.04375,NA,NA,NA,NA,NA,3.52808011125,6.73127125,FALSE,FALSE,TRUE
"DAX_benchmark","energy","60 hour",2023-11-29,NA,NA,NA,NA,NA,61.4685,NA,NA,NA,NA,NA,18.4590932215892,19.0776235104972,FALSE,FALSE,TRUE
"infections_benchmark_strong","energy","60 hour",2023-11-29,NA,NA,NA,NA,NA,61.4685,NA,NA,NA,NA,NA,18.4590932215892,19.0776235104972,FALSE,FALSE,TRUE
"infections_benchmark_weak","energy","60 hour",2023-11-29,NA,NA,NA,NA,NA,61.4685,NA,NA,NA,NA,NA,18.4590932215892,19.0776235104972,FALSE,FALSE,TRUE
"DAX_benchmark","energy","64 hour",2023-11-29,NA,NA,NA,NA,NA,60.14875,NA,NA,NA,NA,NA,18.7952842928227,20.4345585369357,FALSE,FALSE,TRUE
"infections_benchmark_strong","energy","64 hour",2023-11-29,NA,NA,NA,NA,NA,60.14875,NA,NA,NA,NA,NA,18.7952842928227,20.4345585369357,FALSE,FALSE,TRUE
"infections_benchmark_weak","energy","64 hour",2023-11-29,NA,NA,NA,NA,NA,60.14875,NA,NA,NA,NA,NA,18.7952842928227,20.4345585369357,FALSE,FALSE,TRUE
"DAX_benchmark","energy","68 hour",2023-11-29,NA,NA,NA,NA,NA,56.22,NA,NA,NA,NA,NA,18.8804695971593,19.9173723992198,FALSE,FALSE,TRUE
"infections_benchmark_strong","energy","68 hour",2023-11-29,NA,NA,NA,NA,NA,56.22,NA,NA,NA,NA,NA,18.8804695971593,19.9173723992198,FALSE,FALSE,TRUE
"infections_benchmark_weak","energy","68 hour",2023-11-29,NA,NA,NA,NA,NA,56.22,NA,NA,NA,NA,NA,18.8804695971593,19.9173723992198,FALSE,FALSE,TRUE
