"model","target","horizon","forecast_date","q0.025","q0.25","q0.5","q0.75","q0.975","target_end_date","mean_qscore","ae"
"BrienneVonTarth","DAX","1 day",2023-12-20 23:59:00,-2.707,-0.498,0.044,0.642,2.379,2023-12-21 17:30:00,0.228274623591931,0.316861069090209
"BrienneVonTarth","DAX","2 day",2023-12-20 23:59:00,-3.26,-0.696,0.091,0.847,3.032,2023-12-22 17:30:00,0.267666331978323,0.251841020369449
"BrienneVonTarth","DAX","5 day",2023-12-20 23:59:00,-4.404,-0.828,0.18,1.15,4.043,2023-12-25 17:30:00,0.307578401805253,0.126510461705256
"BrienneVonTarth","DAX","6 day",2023-12-20 23:59:00,-5.14,-0.979,0.175,1.382,4.366,2023-12-26 17:30:00,NA,NA
"BrienneVonTarth","DAX","7 day",2023-12-20 23:59:00,-5.429,-1.033,0.274,1.44,4.838,2023-12-27 17:30:00,NA,NA
"BrienneVonTarth","energy","36 hour",2023-12-20 23:59:00,50.094,59.775,66.541,71.269,80.245,2023-12-22 12:00:00,2.09739065194035,3.23230860244787
"BrienneVonTarth","energy","40 hour",2023-12-20 23:59:00,47.627,58.356,64.801,69.791,78.963,2023-12-22 16:00:00,2.41140397119211,4.77248559776662
"BrienneVonTarth","energy","44 hour",2023-12-20 23:59:00,43.433,54.944,62.216,65.895,71.891,2023-12-22 20:00:00,2.68237739996996,6.51375000000785
"BrienneVonTarth","energy","60 hour",2023-12-20 23:59:00,51.699,59.811,67.666,71.271,77.157,2023-12-23 12:00:00,5.04291479696557,11.3068138357001
"BrienneVonTarth","energy","64 hour",2023-12-20 23:59:00,48.626,57.14,63.551,67.513,73.723,2023-12-23 16:00:00,3.84083957074483,8.52849197069176
"BrienneVonTarth","energy","68 hour",2023-12-20 23:59:00,50.522,56.482,61.72,65.15,70.587,2023-12-23 20:00:00,5.5324776061664,10.9340063608516
"BrienneVonTarth","infections","0 week",2023-12-20 23:59:00,NA,NA,NA,NA,NA,2023-12-10,299.97,299.97
"BrienneVonTarth","infections","1 week",2023-12-20 23:59:00,NA,NA,NA,NA,NA,2023-12-17,771.3572,1287.75
"BrienneVonTarth","infections","2 week",2023-12-20 23:59:00,NA,NA,NA,NA,NA,2023-12-24,568.541625,944.35
"BrienneVonTarth","infections","3 week",2023-12-20 23:59:00,NA,NA,NA,NA,NA,2023-12-31,567.3172525,923.645
"BrienneVonTarth","infections","4 week",2023-12-20 23:59:00,NA,NA,NA,NA,NA,2024-01-07,810.365925,1096.86
"CharlesBoyle","DAX","1 day",2023-12-20 23:59:00,-0.65,-0.055,0.224,0.77,1.288,2023-12-21 17:30:00,0.288601706311822,0.497129214164094
"CharlesBoyle","DAX","2 day",2023-12-20 23:59:00,-0.338,-0.047,0.584,1.145,2.5,2023-12-22 17:30:00,0.341980048601452,0.745187807557368
"CharlesBoyle","DAX","5 day",2023-12-20 23:59:00,-0.373,0.101,0.838,1.527,2.969,2023-12-25 17:30:00,0.351583490154868,0.784028202088471
"CharlesBoyle","DAX","6 day",2023-12-20 23:59:00,-0.418,0.517,1.074,2.216,3.592,2023-12-26 17:30:00,NA,NA
"CharlesBoyle","DAX","7 day",2023-12-20 23:59:00,-0.441,0.665,1.371,2.661,3.791,2023-12-27 17:30:00,NA,NA
"CharlesBoyle","energy","36 hour",2023-12-20 23:59:00,53.156,62.776,66.8,70.434,75.639,2023-12-22 12:00:00,1.6889133125,3.49137499999999
"CharlesBoyle","energy","40 hour",2023-12-20 23:59:00,49.008,58.327,61.857,65.59,70.919,2023-12-22 16:00:00,1.3112204375,1.829
"CharlesBoyle","energy","44 hour",2023-12-20 23:59:00,51.215,56.382,60.346,66.864,71.527,2023-12-22 20:00:00,2.451956375,4.643375
"CharlesBoyle","energy","60 hour",2023-12-20 23:59:00,49.301,53.687,55.89,59.708,64.191,2023-12-23 12:00:00,0.844667624999999,0.468499999999999
"CharlesBoyle","energy","64 hour",2023-12-20 23:59:00,45.717,49.56,51.713,54.92,60.93,2023-12-23 16:00:00,1.39097425,3.309375
"CharlesBoyle","energy","68 hour",2023-12-20 23:59:00,45.92,49.897,53.03,58.814,63.546,2023-12-23 20:00:00,1.5167795,2.24375
"CharlesBoyle","infections","0 week",2023-12-20 23:59:00,NA,NA,NA,NA,NA,2023-12-10,299.97,299.97
"CharlesBoyle","infections","1 week",2023-12-20 23:59:00,NA,NA,NA,NA,NA,2023-12-17,771.3572,1287.75
"CharlesBoyle","infections","2 week",2023-12-20 23:59:00,NA,NA,NA,NA,NA,2023-12-24,568.541625,944.35
"CharlesBoyle","infections","3 week",2023-12-20 23:59:00,NA,NA,NA,NA,NA,2023-12-31,567.3172525,923.645
"CharlesBoyle","infections","4 week",2023-12-20 23:59:00,NA,NA,NA,NA,NA,2024-01-07,810.365925,1096.86
"DaenerysTargaryen","DAX","1 day",2023-12-20 23:59:00,-3.572,-1.873,0.742,3.341,5.462,2023-12-21 17:30:00,0.814754296890527,1.01507148445264
"DaenerysTargaryen","DAX","2 day",2023-12-20 23:59:00,-2.892,-0.792,1.754,3.462,6.28,2023-12-22 17:30:00,0.900063203246307,1.91471601623153
"DaenerysTargaryen","DAX","5 day",2023-12-20 23:59:00,-5.622,-3.958,-0.362,1.864,3.352,2023-12-25 17:30:00,0.75511759383513,0.415887969175648
"DaenerysTargaryen","DAX","6 day",2023-12-20 23:59:00,-4.231,-1.653,1.746,3.753,5.325,2023-12-26 17:30:00,NA,NA
"DaenerysTargaryen","DAX","7 day",2023-12-20 23:59:00,-6.462,-3.864,1.462,5.235,7.352,2023-12-27 17:30:00,NA,NA
"DaenerysTargaryen","energy","36 hour",2023-12-20 23:59:00,60.847,64.635,67.874,70.362,74.842,2023-12-22 12:00:00,2.1565,4.56574999999999
"DaenerysTargaryen","energy","40 hour",2023-12-20 23:59:00,57.735,60.643,64.773,67.982,70.842,2023-12-22 16:00:00,2.05982,4.74475
"DaenerysTargaryen","energy","44 hour",2023-12-20 23:59:00,53.873,57.737,59.854,63.658,69.968,2023-12-22 20:00:00,2.3973,4.15175
"DaenerysTargaryen","energy","60 hour",2023-12-20 23:59:00,50.732,54.836,57.266,60.754,65.829,2023-12-23 12:00:00,0.924219999999999,0.907249999999998
"DaenerysTargaryen","energy","64 hour",2023-12-20 23:59:00,50.112,53.723,57.742,60.476,66.852,2023-12-23 16:00:00,1.38655,2.71925
"DaenerysTargaryen","energy","68 hour",2023-12-20 23:59:00,47.262,50.462,53.546,58.849,62.683,2023-12-23 20:00:00,1.54486,2.75975
"DaenerysTargaryen","infections","0 week",2023-12-20 23:59:00,NA,NA,NA,NA,NA,2023-12-10,299.97,299.97
"DaenerysTargaryen","infections","1 week",2023-12-20 23:59:00,NA,NA,NA,NA,NA,2023-12-17,771.3572,1287.75
"DaenerysTargaryen","infections","2 week",2023-12-20 23:59:00,NA,NA,NA,NA,NA,2023-12-24,568.541625,944.35
"DaenerysTargaryen","infections","3 week",2023-12-20 23:59:00,NA,NA,NA,NA,NA,2023-12-31,567.3172525,923.645
"DaenerysTargaryen","infections","4 week",2023-12-20 23:59:00,NA,NA,NA,NA,NA,2024-01-07,810.365925,1096.86
"DAX_benchmark","DAX","1 day",2023-12-20 23:59:00,-3.321,-0.544,0.069,0.726,2.72,2023-12-21 17:30:00,0.255841942083246,0.342460560612867
"DAX_benchmark","DAX","2 day",2023-12-20 23:59:00,-4.088,-0.805,0.094,1.001,3.57,2023-12-22 17:30:00,0.3081933852316,0.254956378485804
"DAX_benchmark","DAX","5 day",2023-12-20 23:59:00,-5.259,-0.897,0.167,1.261,4.629,2023-12-25 17:30:00,0.337150467416823,0.112679047664166
"DAX_benchmark","DAX","6 day",2023-12-20 23:59:00,-6.283,-1.031,0.208,1.463,5.367,2023-12-26 17:30:00,NA,NA
"DAX_benchmark","DAX","7 day",2023-12-20 23:59:00,-6.736,-1.085,0.345,1.623,6.26,2023-12-27 17:30:00,NA,NA
"homersimpson","DAX","1 day",2023-12-20 23:59:00,-2.521,-0.48,0.076,0.639,2.219,2023-12-21 17:30:00,0.229090410688743,0.349000330114979
"homersimpson","DAX","2 day",2023-12-20 23:59:00,-3.743,-0.704,0.131,0.905,3.311,2023-12-22 17:30:00,0.289847206833329,0.291950152838805
"homersimpson","DAX","5 day",2023-12-20 23:59:00,-4.397,-0.857,0.166,1.162,3.98,2023-12-25 17:30:00,0.308060351982563,0.112276488681928
"homersimpson","DAX","6 day",2023-12-20 23:59:00,-5.047,-0.922,0.204,1.377,4.661,2023-12-26 17:30:00,NA,NA
"homersimpson","DAX","7 day",2023-12-20 23:59:00,-5.432,-1.039,0.335,1.53,4.845,2023-12-27 17:30:00,NA,NA
"homersimpson","energy","36 hour",2023-12-20 23:59:00,66.796,71.26,71.549,71.703,72.907,2023-12-22 12:00:00,6.32944747005862,8.24040586804024
"homersimpson","energy","40 hour",2023-12-20 23:59:00,61.782,65.43,67.142,67.218,70.236,2023-12-22 16:00:00,4.54824105528479,7.11359202416935
"homersimpson","energy","44 hour",2023-12-20 23:59:00,56.466,59.251,59.996,62.669,63,2023-12-22 20:00:00,2.990755673883,4.29325465098413
"homersimpson","energy","60 hour",2023-12-20 23:59:00,55.209,58.347,58.875,61.194,61.449,2023-12-23 12:00:00,1.6457041228162,2.51615277745948
"homersimpson","energy","64 hour",2023-12-20 23:59:00,53.774,57.838,59.547,60.962,61.087,2023-12-23 16:00:00,2.41652787965788,4.5238510559273
"homersimpson","energy","68 hour",2023-12-20 23:59:00,51.024,52.135,54.758,56.098,58.425,2023-12-23 20:00:00,1.89920320090113,3.97145566179527
"homersimpson","infections","0 week",2023-12-20 23:59:00,NA,NA,NA,NA,NA,2023-12-10,299.97,299.97
"homersimpson","infections","1 week",2023-12-20 23:59:00,NA,NA,NA,NA,NA,2023-12-17,771.3572,1287.75
"homersimpson","infections","2 week",2023-12-20 23:59:00,NA,NA,NA,NA,NA,2023-12-24,568.541625,944.35
"homersimpson","infections","3 week",2023-12-20 23:59:00,NA,NA,NA,NA,NA,2023-12-31,567.3172525,923.645
"homersimpson","infections","4 week",2023-12-20 23:59:00,NA,NA,NA,NA,NA,2024-01-07,810.365925,1096.86
"infections_benchmark_strong","infections","0 week",2023-12-20 23:59:00,2030,2030,2030,2030,2030,2023-12-10,297,297
"infections_benchmark_strong","infections","1 week",2023-12-20 23:59:00,1349,1753,1983,2226,2774,2023-12-17,297.95,556
"infections_benchmark_strong","infections","2 week",2023-12-20 23:59:00,1188.975,1633,1924.5,2260,3064.025,2023-12-24,143.9505,312.5
"infections_benchmark_strong","infections","3 week",2023-12-20 23:59:00,1086.975,1554,1877.5,2267,3238,2023-12-31,561.70025,914.5
"infections_benchmark_strong","infections","4 week",2023-12-20 23:59:00,1019.975,1487.75,1837.5,2265,3321.025,2024-01-07,136.6355,179.5
"infections_benchmark_weak","infections","0 week",2023-12-20 23:59:00,2030,2030,2030,2030,2030,2023-12-10,297,297
"infections_benchmark_weak","infections","1 week",2023-12-20 23:59:00,1017.75,1133,1264,1370.5,2774.75,2023-12-17,763.72,1275
"infections_benchmark_weak","infections","2 week",2023-12-20 23:59:00,1088.25,1192.5,1302,1390,2824.5,2023-12-24,562.9125,935
"infections_benchmark_weak","infections","3 week",2023-12-20 23:59:00,831.25,1144.5,1245,1373.5,2465.25,2023-12-31,168.24,282
"infections_benchmark_weak","infections","4 week",2023-12-20 23:59:00,389,483.5,572,700,1228.25,2024-01-07,802.3425,1086
"JakePeralta","DAX","1 day",2023-12-20 23:59:00,-2.995,-0.651,0.09,0.832,3.176,2023-12-21 17:30:00,0.282717116892524,0.363420252267096
"JakePeralta","DAX","2 day",2023-12-20 23:59:00,-3.031,-0.595,0.175,0.946,3.381,2023-12-22 17:30:00,0.285397244830321,0.335837183721855
"JakePeralta","DAX","5 day",2023-12-20 23:59:00,-4.198,-0.903,0.139,1.182,4.477,2023-12-25 17:30:00,0.312299127223927,0.0852949331395628
"JakePeralta","DAX","6 day",2023-12-20 23:59:00,-4.625,-0.968,0.189,1.346,5.004,2023-12-26 17:30:00,NA,NA
"JakePeralta","DAX","7 day",2023-12-20 23:59:00,-4.801,-0.987,0.22,1.427,5.241,2023-12-27 17:30:00,NA,NA
"JakePeralta","energy","36 hour",2023-12-20 23:59:00,51.9,60.617,64.82,68.046,75.561,2023-12-22 12:00:00,1.28187430911018,1.51196829404047
"JakePeralta","energy","40 hour",2023-12-20 23:59:00,50.359,57.274,61.116,64.826,72.008,2023-12-22 16:00:00,1.18928825965621,1.08787355165213
"JakePeralta","energy","44 hour",2023-12-20 23:59:00,48.509,53.747,57.667,61.013,68.182,2023-12-22 20:00:00,1.3162813656958,1.96442339994564
"JakePeralta","energy","60 hour",2023-12-20 23:59:00,44.561,51.389,55.098,57.795,64.019,2023-12-23 12:00:00,1.08743242962474,1.2610158977467
"JakePeralta","energy","64 hour",2023-12-20 23:59:00,42.5,48.401,51.943,55.229,61.568,2023-12-23 16:00:00,1.4895487146261,3.08011064013505
"JakePeralta","energy","68 hour",2023-12-20 23:59:00,40.898,46.242,49,52.447,58.684,2023-12-23 20:00:00,1.15565700634829,1.78606079184154
"JakePeralta","infections","0 week",2023-12-20 23:59:00,NA,NA,NA,NA,NA,2023-12-10,299.97,299.97
"JakePeralta","infections","1 week",2023-12-20 23:59:00,NA,NA,NA,NA,NA,2023-12-17,771.3572,1287.75
"JakePeralta","infections","2 week",2023-12-20 23:59:00,NA,NA,NA,NA,NA,2023-12-24,568.541625,944.35
"JakePeralta","infections","3 week",2023-12-20 23:59:00,NA,NA,NA,NA,NA,2023-12-31,567.3172525,923.645
"JakePeralta","infections","4 week",2023-12-20 23:59:00,NA,NA,NA,NA,NA,2024-01-07,810.365925,1096.86
"JonSnow","DAX","1 day",2023-12-20 23:59:00,-2.89,-0.553,0.063,0.678,2.289,2023-12-21 17:30:00,0.242169326862473,0.336094405148467
"JonSnow","DAX","2 day",2023-12-20 23:59:00,-2.823,-0.241,0.59,1.336,3.442,2023-12-22 17:30:00,0.370514087998927,0.75039570783639
"JonSnow","DAX","5 day",2023-12-20 23:59:00,-4.088,-0.93,0.005,0.864,3.226,2023-12-25 17:30:00,0.262378039240042,0.0490581788267698
"JonSnow","DAX","6 day",2023-12-20 23:59:00,-4.646,-1.06,-0.013,0.942,3.583,2023-12-26 17:30:00,NA,NA
"JonSnow","DAX","7 day",2023-12-20 23:59:00,-4.84,-1.197,-0.074,0.862,3.965,2023-12-27 17:30:00,NA,NA
"JonSnow","energy","36 hour",2023-12-20 23:59:00,39.281,47.79,52.278,55.285,57.967,2023-12-22 12:00:00,8.48817958062388,11.0304434039049
"JonSnow","energy","40 hour",2023-12-20 23:59:00,51.067,61.134,65.266,69.948,74.691,2023-12-22 16:00:00,2.6076696894868,5.23788287590669
"JonSnow","energy","44 hour",2023-12-20 23:59:00,49.137,57.356,60.579,63.718,67.169,2023-12-22 20:00:00,2.45348703862936,4.87683765350983
"JonSnow","energy","60 hour",2023-12-20 23:59:00,39.198,46.567,50.931,54.228,57.455,2023-12-23 12:00:00,2.88638725226179,5.42789195723693
"JonSnow","energy","64 hour",2023-12-20 23:59:00,51.437,60.238,64.164,69.075,74.311,2023-12-23 16:00:00,5.02675944764821,9.14169831201133
"JonSnow","energy","68 hour",2023-12-20 23:59:00,48.827,55.971,59.11,62.569,66.591,2023-12-23 20:00:00,4.57608450965938,8.32325710545943
"JonSnow","infections","0 week",2023-12-20 23:59:00,NA,NA,NA,NA,NA,2023-12-10,299.97,299.97
"JonSnow","infections","1 week",2023-12-20 23:59:00,NA,NA,NA,NA,NA,2023-12-17,771.3572,1287.75
"JonSnow","infections","2 week",2023-12-20 23:59:00,NA,NA,NA,NA,NA,2023-12-24,568.541625,944.35
"JonSnow","infections","3 week",2023-12-20 23:59:00,NA,NA,NA,NA,NA,2023-12-31,567.3172525,923.645
"JonSnow","infections","4 week",2023-12-20 23:59:00,NA,NA,NA,NA,NA,2024-01-07,810.365925,1096.86
"MasterYoda","DAX","1 day",2023-12-20 23:59:00,-1.165,-0.85,-0.5,0.032,0.23,2023-12-21 17:30:00,0.147535703109473,0.226928515547364
"MasterYoda","DAX","2 day",2023-12-20 23:59:00,-1.17,-0.79,-0.39,0.44,2.203,2023-12-22 17:30:00,0.202586796753694,0.229283983768468
"MasterYoda","DAX","5 day",2023-12-20 23:59:00,-0.82,0.25,0.71,1.68,2.212,2023-12-25 17:30:00,0.382987218494611,0.656112030824352
"MasterYoda","DAX","6 day",2023-12-20 23:59:00,-0.3,0.62,1.102,1.86,2.234,2023-12-26 17:30:00,NA,NA
"MasterYoda","DAX","7 day",2023-12-20 23:59:00,0.38,1.139,1.184,2.76,2.284,2023-12-27 17:30:00,NA,NA
"MasterYoda","energy","36 hour",2023-12-20 23:59:00,46.251,53.251,61.251,68.251,77.251,2023-12-22 12:00:00,2.22147,2.05735
"MasterYoda","energy","40 hour",2023-12-20 23:59:00,45.722,52.722,60.722,67.722,76.722,2023-12-22 16:00:00,1.94879,0.693950000000001
"MasterYoda","energy","44 hour",2023-12-20 23:59:00,45.577,53.577,61.577,68.577,77.577,2023-12-22 20:00:00,2.99499,5.87495
"MasterYoda","energy","60 hour",2023-12-20 23:59:00,44.25,51.25,59.25,66.25,75.25,2023-12-23 12:00:00,2.38821,2.89105
"MasterYoda","energy","64 hour",2023-12-20 23:59:00,44.562,51.562,59.562,66.562,75.562,2023-12-23 16:00:00,2.71785,4.53925
"MasterYoda","energy","68 hour",2023-12-20 23:59:00,45.396,52.396,60.396,67.296,76.396,2023-12-23 20:00:00,4.36609,9.61015
"MasterYoda","infections","0 week",2023-12-20 23:59:00,NA,NA,NA,NA,NA,2023-12-10,299.97,299.97
"MasterYoda","infections","1 week",2023-12-20 23:59:00,NA,NA,NA,NA,NA,2023-12-17,771.3572,1287.75
"MasterYoda","infections","2 week",2023-12-20 23:59:00,NA,NA,NA,NA,NA,2023-12-24,568.541625,944.35
"MasterYoda","infections","3 week",2023-12-20 23:59:00,NA,NA,NA,NA,NA,2023-12-31,567.3172525,923.645
"MasterYoda","infections","4 week",2023-12-20 23:59:00,NA,NA,NA,NA,NA,2024-01-07,810.365925,1096.86
"mean_ensemble","DAX","1 day",2023-12-20 23:59:00,-2.103,-0.552,0.081,0.796,2.117,2023-12-21 17:30:00,0.247853018544488,0.35430686230123
"mean_ensemble","DAX","2 day",2023-12-20 23:59:00,-2.326,-0.526,0.273,1.066,2.907,2023-12-22 17:30:00,0.298443855270653,0.434120297557236
"mean_ensemble","DAX","5 day",2023-12-20 23:59:00,-3.134,-0.814,0.249,1.192,3.205,2023-12-25 17:30:00,0.303043720698457,0.195264072996899
"mean_ensemble","DAX","6 day",2023-12-20 23:59:00,-3.276,-0.614,0.483,1.554,3.732,2023-12-26 17:30:00,NA,NA
"mean_ensemble","DAX","7 day",2023-12-20 23:59:00,-3.596,-0.769,0.511,1.827,4.097,2023-12-27 17:30:00,NA,NA
"mean_ensemble","energy","36 hour",2023-12-20 23:59:00,53.275,61.168,64.976,68.191,73.614,2023-12-22 12:00:00,1.23921323228596,1.6675103354326
"mean_ensemble","energy","40 hour",2023-12-20 23:59:00,52.279,59.273,63.328,67.06,72.742,2023-12-22 16:00:00,1.64335949605817,3.300175696115
"mean_ensemble","energy","44 hour",2023-12-20 23:59:00,49.884,55.176,59.433,63.518,68.884,2023-12-22 20:00:00,1.77031173541254,3.7305069772652
"mean_ensemble","energy","60 hour",2023-12-20 23:59:00,48.152,53.103,56.566,59.997,64.66,2023-12-23 12:00:00,0.895901700542304,0.206979519859701
"mean_ensemble","energy","64 hour",2023-12-20 23:59:00,47.52,52.521,56.117,59.886,65.11,2023-12-23 16:00:00,1.13120406430503,1.0939277460381
"mean_ensemble","energy","68 hour",2023-12-20 23:59:00,45.946,50.408,53.932,58.066,62.871,2023-12-23 20:00:00,1.56417147080536,3.1455621797127
"mean_ensemble","infections","0 week",2023-12-20 23:59:00,2030,2030,2030,2030,2030,2023-12-10,297,297
"mean_ensemble","infections","1 week",2023-12-20 23:59:00,1180.6,1501,1654.5,1799,2818.1,2023-12-17,519.075,884.5
"mean_ensemble","infections","2 week",2023-12-20 23:59:00,1144.987,1424.5,1616.25,1836,2986.912,2023-12-24,344.11925,620.75
"mean_ensemble","infections","3 week",2023-12-20 23:59:00,955.288,1390.5,1575.75,1835.5,2883.7,2023-12-31,357.334125,612.75
"mean_ensemble","infections","4 week",2023-12-20 23:59:00,723.788,996.375,1250.75,1488.5,2283.212,2024-01-07,214.05675,407.25
"median_ensemble","DAX","1 day",2023-12-20 23:59:00,-2.15,-0.48,0.063,0.639,1.85,2023-12-21 17:30:00,0.219111909889843,0.336094405148467
"median_ensemble","DAX","2 day",2023-12-20 23:59:00,-2.278,-0.577,0.094,0.905,2.5,2023-12-22 17:30:00,0.246922530834305,0.254956378485804
"median_ensemble","DAX","5 day",2023-12-20 23:59:00,-3.226,-0.731,0.167,1.162,2.986,2023-12-25 17:30:00,0.273892817877364,0.112679047664166
"median_ensemble","DAX","6 day",2023-12-20 23:59:00,-3.288,-0.819,0.208,1.377,3.583,2023-12-26 17:30:00,NA,NA
"median_ensemble","DAX","7 day",2023-12-20 23:59:00,-3.416,-0.887,0.335,1.44,3.791,2023-12-27 17:30:00,NA,NA
"median_ensemble","energy","36 hour",2023-12-20 23:59:00,52.011,61.777,65.905,69.112,74.842,2023-12-22 12:00:00,1.48116625,2.59650000000001
"median_ensemble","energy","40 hour",2023-12-20 23:59:00,51.067,59.169,62.33,67.722,72.008,2023-12-22 16:00:00,1.52520425060433,2.30225
"median_ensemble","energy","44 hour",2023-12-20 23:59:00,49.349,54.944,59.929,63.658,68.182,2023-12-22 20:00:00,1.90500875160741,4.2265
"median_ensemble","energy","60 hour",2023-12-20 23:59:00,47.846,53.256,55.89,59.269,62.915,2023-12-23 12:00:00,0.845676125,0.468499999999999
"median_ensemble","energy","64 hour",2023-12-20 23:59:00,47.124,51.562,56.414,59.392,62.033,2023-12-23 16:00:00,1.210261125,1.39113
"median_ensemble","energy","68 hour",2023-12-20 23:59:00,45.396,50.462,53.546,57.625,61.911,2023-12-23 20:00:00,1.4333675,2.75975
"median_ensemble","infections","0 week",2023-12-20 23:59:00,2030,2030,2030,2030,2030,2023-12-10,297,297
"median_ensemble","infections","1 week",2023-12-20 23:59:00,1180.6,1501,1654.5,1799,2818.1,2023-12-17,519.075,884.5
"median_ensemble","infections","2 week",2023-12-20 23:59:00,1144.987,1424.5,1616.25,1836,2986.912,2023-12-24,344.11925,620.75
"median_ensemble","infections","3 week",2023-12-20 23:59:00,955.288,1390.5,1575.75,1835.5,2883.7,2023-12-31,357.334125,612.75
"median_ensemble","infections","4 week",2023-12-20 23:59:00,723.788,996.375,1250.75,1488.5,2283.212,2024-01-07,214.05675,407.25
"Phoebe","DAX","1 day",2023-12-20 23:59:00,-1.713,-0.394,0.044,0.545,1.663,2023-12-21 17:30:00,0.191042888874409,0.317009346313579
"Phoebe","DAX","2 day",2023-12-20 23:59:00,-2.217,-0.577,0.031,0.804,2.365,2023-12-22 17:30:00,0.222325028299286,0.192163237401921
"Phoebe","DAX","5 day",2023-12-20 23:59:00,-3.071,-0.731,0.185,0.982,2.628,2023-12-25 17:30:00,0.254445233662754,0.130886358482485
"Phoebe","DAX","6 day",2023-12-20 23:59:00,-3.288,-0.819,0.16,1.134,3.23,2023-12-26 17:30:00,NA,NA
"Phoebe","DAX","7 day",2023-12-20 23:59:00,-3.416,-0.881,0.173,1.325,3.729,2023-12-27 17:30:00,NA,NA
"Phoebe","energy","36 hour",2023-12-20 23:59:00,64.338,66.397,68.497,70.134,73.449,2023-12-22 12:00:00,3.1499049,5.18886999999999
"Phoebe","energy","40 hour",2023-12-20 23:59:00,60.429,63.145,66.54,67.947,71.088,2023-12-22 16:00:00,3.2959348,6.51224999999999
"Phoebe","energy","44 hour",2023-12-20 23:59:00,56.899,58.364,62.508,64.011,70.523,2023-12-22 20:00:00,3.6055664,6.80525
"Phoebe","energy","60 hour",2023-12-20 23:59:00,53.843,55.715,58.093,61.164,62.779,2023-12-23 12:00:00,0.9811367,1.73425
"Phoebe","energy","64 hour",2023-12-20 23:59:00,51.142,53.324,56.414,60.12,61.823,2023-12-23 16:00:00,1.0646684,1.39113
"Phoebe","energy","68 hour",2023-12-20 23:59:00,49.897,51.25,55.025,57.625,58.799,2023-12-23 20:00:00,1.7597672,4.23849999999999
"Phoebe","infections","0 week",2023-12-20 23:59:00,NA,NA,NA,NA,NA,2023-12-10,299.97,299.97
"Phoebe","infections","1 week",2023-12-20 23:59:00,NA,NA,NA,NA,NA,2023-12-17,771.3572,1287.75
"Phoebe","infections","2 week",2023-12-20 23:59:00,NA,NA,NA,NA,NA,2023-12-24,568.541625,944.35
"Phoebe","infections","3 week",2023-12-20 23:59:00,NA,NA,NA,NA,NA,2023-12-31,567.3172525,923.645
"Phoebe","infections","4 week",2023-12-20 23:59:00,NA,NA,NA,NA,NA,2024-01-07,810.365925,1096.86
"power_benchmark","energy","36 hour",2023-12-20 23:59:00,53.275,60.736,63.617,66.895,74.963,2023-12-22 12:00:00,0.894424687499999,0.308499999999995
"power_benchmark","energy","40 hour",2023-12-20 23:59:00,50.642,55.801,58.538,62.527,69.876,2023-12-22 16:00:00,1.1630965,1.49075
"power_benchmark","energy","44 hour",2023-12-20 23:59:00,49.349,52.621,56.507,59.938,67.136,2023-12-22 20:00:00,1.070498625,0.804375
"power_benchmark","energy","60 hour",2023-12-20 23:59:00,47.755,51.246,54.027,56.633,62.915,2023-12-23 12:00:00,1.1566605625,2.33175
"power_benchmark","energy","64 hour",2023-12-20 23:59:00,44.081,47.022,50.046,53.573,60.033,2023-12-23 16:00:00,2.38978625,4.977
"power_benchmark","energy","68 hour",2023-12-20 23:59:00,43.284,46.578,49.029,53.047,59.174,2023-12-23 20:00:00,1.157283625,1.757375
"Rachel","DAX","1 day",2023-12-20 23:59:00,-2.15,-0.397,-0.019,0.547,1.85,2023-12-21 17:30:00,0.185335681102902,0.25439421068743
"Rachel","DAX","2 day",2023-12-20 23:59:00,-2.278,-0.446,-0.062,0.51,1.985,2023-12-22 17:30:00,0.157986700910043,0.099170543639417
"Rachel","DAX","5 day",2023-12-20 23:59:00,-3.226,-0.639,0.118,0.788,2.986,2023-12-25 17:30:00,0.217679225818382,0.0640845686995277
"Rachel","DAX","6 day",2023-12-20 23:59:00,-2.718,-0.596,0.212,1.013,2.781,2023-12-26 17:30:00,NA,NA
"Rachel","DAX","7 day",2023-12-20 23:59:00,-2.799,-0.887,-0.441,0.024,1.395,2023-12-27 17:30:00,NA,NA
"Rachel","energy","36 hour",2023-12-20 23:59:00,52.011,64.123,67.657,69.112,71.163,2023-12-22 12:00:00,1.8859075,4.3485
"Rachel","energy","40 hour",2023-12-20 23:59:00,52.006,61.481,66.804,68.879,70.915,2023-12-22 16:00:00,2.865265,6.77549999999999
"Rachel","energy","44 hour",2023-12-20 23:59:00,47.561,52.028,59.929,61.924,63.653,2023-12-22 20:00:00,1.9958404375,4.2265
"Rachel","energy","60 hour",2023-12-20 23:59:00,47.846,53.791,57.705,59.269,61.93,2023-12-23 12:00:00,0.957795625000001,1.34575
"Rachel","energy","64 hour",2023-12-20 23:59:00,47.124,53.736,57.4,59.221,62.033,2023-12-23 16:00:00,1.173166375,2.37775
"Rachel","energy","68 hour",2023-12-20 23:59:00,43.299,52.107,54.893,57.961,61.911,2023-12-23 20:00:00,2.12115,4.1065
"Rachel","infections","0 week",2023-12-20 23:59:00,NA,NA,NA,NA,NA,2023-12-10,299.97,299.97
"Rachel","infections","1 week",2023-12-20 23:59:00,NA,NA,NA,NA,NA,2023-12-17,771.3572,1287.75
"Rachel","infections","2 week",2023-12-20 23:59:00,NA,NA,NA,NA,NA,2023-12-24,568.541625,944.35
"Rachel","infections","3 week",2023-12-20 23:59:00,NA,NA,NA,NA,NA,2023-12-31,567.3172525,923.645
"Rachel","infections","4 week",2023-12-20 23:59:00,NA,NA,NA,NA,NA,2024-01-07,810.365925,1096.86
"StannisBaratheon","DAX","1 day",2023-12-20 23:59:00,-1.61,-0.393,-0.001,0.492,1.622,2023-12-21 17:30:00,0.175078199165131,0.271733081347541
"StannisBaratheon","DAX","2 day",2023-12-20 23:59:00,-2.146,-0.561,0.032,0.832,2.439,2023-12-22 17:30:00,0.223732913324563,0.19259485156401
"StannisBaratheon","DAX","5 day",2023-12-20 23:59:00,-2.753,-0.631,0.176,0.989,2.862,2023-12-25 17:30:00,0.242623347969978,0.122064312213082
"StannisBaratheon","DAX","6 day",2023-12-20 23:59:00,-3.057,-0.66,0.288,1.238,3.359,2023-12-26 17:30:00,NA,NA
"StannisBaratheon","DAX","7 day",2023-12-20 23:59:00,-3.286,-0.668,0.376,1.422,3.373,2023-12-27 17:30:00,NA,NA
"StannisBaratheon","energy","36 hour",2023-12-20 23:59:00,51.534,59.849,62.981,66.525,74.844,2023-12-22 12:00:00,0.966259562500001,0.327500000000001
"StannisBaratheon","energy","40 hour",2023-12-20 23:59:00,51.664,59.169,62.33,65.797,73.364,2023-12-22 16:00:00,1.3403065,2.30225
"StannisBaratheon","energy","44 hour",2023-12-20 23:59:00,51.1,55.624,59.244,64.356,72.687,2023-12-22 20:00:00,1.797441125,3.542
"StannisBaratheon","energy","60 hour",2023-12-20 23:59:00,46.37,48.765,51.625,54.914,61.316,2023-12-23 12:00:00,2.2889420625,4.73375
"StannisBaratheon","energy","64 hour",2023-12-20 23:59:00,45.991,49.882,52.365,55.69,61.407,2023-12-23 16:00:00,1.26641925,2.6575
"StannisBaratheon","energy","68 hour",2023-12-20 23:59:00,44.649,47.49,50.628,56.024,62.932,2023-12-23 20:00:00,1.067901625,0.158374999999999
"StannisBaratheon","infections","0 week",2023-12-20 23:59:00,2030,2030,2030,2030,2030,2023-12-10,297,297
"StannisBaratheon","infections","1 week",2023-12-20 23:59:00,1012.2,1249,1326,1372,2862.2,2023-12-17,740.2,1213
"StannisBaratheon","infections","2 week",2023-12-20 23:59:00,1101,1216,1308,1412,2909.8,2023-12-24,553.488,929
"StannisBaratheon","infections","3 week",2023-12-20 23:59:00,823.6,1227,1274,1404,2529.4,2023-12-31,202.558,311
"StannisBaratheon","infections","4 week",2023-12-20 23:59:00,427.6,505,664,712,1245.4,2024-01-07,771.118,994
"TormundGiantsbane","DAX","1 day",2023-12-20 23:59:00,-1.534,-0.417,0.036,0.495,1.52,2023-12-21 17:30:00,0.183695786741237,0.309446611503749
"TormundGiantsbane","DAX","2 day",2023-12-20 23:59:00,-1.817,-0.48,-0.014,0.603,1.816,2023-12-22 17:30:00,0.174063020435411,0.1470624757914
"TormundGiantsbane","DAX","5 day",2023-12-20 23:59:00,-2.054,-0.532,0.101,0.668,2.066,2023-12-25 17:30:00,0.170596674104447,0.0469268726014132
"TormundGiantsbane","DAX","6 day",2023-12-20 23:59:00,-2.266,-0.58,0.117,0.765,2.343,2023-12-26 17:30:00,NA,NA
"TormundGiantsbane","DAX","7 day",2023-12-20 23:59:00,-2.894,-0.7,0.118,1.157,3.022,2023-12-27 17:30:00,NA,NA
"TormundGiantsbane","energy","36 hour",2023-12-20 23:59:00,50.199,61.777,64.917,68.839,73.331,2023-12-22 12:00:00,1.2592884375,1.60875
"TormundGiantsbane","energy","40 hour",2023-12-20 23:59:00,52.17,59.477,62.233,68.215,73.992,2023-12-22 16:00:00,1.5329540625,2.204625
"TormundGiantsbane","energy","44 hour",2023-12-20 23:59:00,46.027,50.981,54.152,60.202,64.737,2023-12-22 20:00:00,1.419149375,1.55
"TormundGiantsbane","energy","60 hour",2023-12-20 23:59:00,46.486,51.672,53.555,57.819,62.481,2023-12-23 12:00:00,1.335274625,2.803375
"TormundGiantsbane","energy","64 hour",2023-12-20 23:59:00,47.204,51.177,53.382,59.392,65.009,2023-12-23 16:00:00,1.32761175,1.6405
"TormundGiantsbane","energy","68 hour",2023-12-20 23:59:00,42.087,46.023,48.627,53.57,57.643,2023-12-23 20:00:00,1.342128625,2.15962500000001
"TormundGiantsbane","infections","0 week",2023-12-20 23:59:00,NA,NA,NA,NA,NA,2023-12-10,299.97,299.97
"TormundGiantsbane","infections","1 week",2023-12-20 23:59:00,NA,NA,NA,NA,NA,2023-12-17,771.3572,1287.75
"TormundGiantsbane","infections","2 week",2023-12-20 23:59:00,NA,NA,NA,NA,NA,2023-12-24,568.541625,944.35
"TormundGiantsbane","infections","3 week",2023-12-20 23:59:00,NA,NA,NA,NA,NA,2023-12-31,567.3172525,923.645
"TormundGiantsbane","infections","4 week",2023-12-20 23:59:00,NA,NA,NA,NA,NA,2024-01-07,810.365925,1096.86
"TyrionLannister","DAX","1 day",2023-12-20 23:59:00,-0.505,-0.072,0.187,0.607,1.1,2023-12-21 17:30:00,0.256614499979247,0.460297159760703
"TyrionLannister","DAX","2 day",2023-12-20 23:59:00,-0.432,-0.108,0.536,1.033,1.473,2023-12-22 17:30:00,0.293698037067077,0.696972476574587
"TyrionLannister","DAX","5 day",2023-12-20 23:59:00,-0.482,-0.021,0.816,1.385,2.234,2023-12-25 17:30:00,0.320262091301252,0.762515820861864
"TyrionLannister","DAX","6 day",2023-12-20 23:59:00,-0.565,0.153,0.815,1.711,2.674,2023-12-26 17:30:00,NA,NA
"TyrionLannister","DAX","7 day",2023-12-20 23:59:00,-0.586,0.535,1.304,2.289,3.163,2023-12-27 17:30:00,NA,NA
"TyrionLannister","energy","36 hour",2023-12-20 23:59:00,52.888,62.201,65.905,69.632,74.824,2023-12-22 12:00:00,1.481695,2.59650000000001
"TyrionLannister","energy","40 hour",2023-12-20 23:59:00,49.422,57.59,61.147,65.335,72.031,2023-12-22 16:00:00,1.224436125,1.118875
"TyrionLannister","energy","44 hour",2023-12-20 23:59:00,49.349,54.675,58.052,62.909,67.442,2023-12-22 20:00:00,1.4743720625,2.350125
"TyrionLannister","energy","60 hour",2023-12-20 23:59:00,48.724,53.256,55.374,58.959,63.813,2023-12-23 12:00:00,0.918031750000001,0.984250000000003
"TyrionLannister","energy","64 hour",2023-12-20 23:59:00,45.485,49.172,51.687,55.789,62.086,2023-12-23 16:00:00,1.4949104375,3.335875
"TyrionLannister","energy","68 hour",2023-12-20 23:59:00,44.227,48.277,51.353,55.414,59.955,2023-12-23 20:00:00,0.984279500000001,0.566375000000001
"TyrionLannister","infections","0 week",2023-12-20 23:59:00,NA,NA,NA,NA,NA,2023-12-10,299.97,299.97
"TyrionLannister","infections","1 week",2023-12-20 23:59:00,NA,NA,NA,NA,NA,2023-12-17,771.3572,1287.75
"TyrionLannister","infections","2 week",2023-12-20 23:59:00,NA,NA,NA,NA,NA,2023-12-24,568.541625,944.35
"TyrionLannister","infections","3 week",2023-12-20 23:59:00,NA,NA,NA,NA,NA,2023-12-31,567.3172525,923.645
"TyrionLannister","infections","4 week",2023-12-20 23:59:00,NA,NA,NA,NA,NA,2024-01-07,810.365925,1096.86
