"","forecast_date","target","horizon","q0.025","q0.25","q0.5","q0.75","q0.975"
"2",2024-01-24,"DAX","1 day",-1.95092184537503,-0.407890848761787,0.178109237947144,0.824896753628816,2.1418060255314
"4",2024-01-24,"DAX","2 day",-2.33643073856729,-0.602302112836351,0.190255861327533,0.876869824196528,2.49706092993811
"11",2024-01-24,"DAX","5 day",-3.14244303756535,-0.867632779567015,0.189364523739526,1.04772002738052,3.02709976113941
"12",2024-01-24,"DAX","6 day",-3.48232261692622,-0.796687382531222,0.185608400057657,1.2902367692172,3.51234830181131
"16",2024-01-24,"DAX","7 day",-4.18418368888362,-1.17819290518436,0.38087359433954,1.83657751071171,4.33490097527369
"7",2024-01-24,"energy","36 hour",59.798791478404,65.8886796155812,69.0415582540846,72.4285054362691,76.1716901626747
"9",2024-01-24,"energy","40 hour",57.1635478902215,63.2099105119485,66.5292288216801,68.9606663372888,72.923698824949
"10",2024-01-24,"energy","44 hour",54.8146649698545,59.5923262240577,63.0415339288715,65.5033471591275,69.5051227083163
"13",2024-01-24,"energy","60 hour",53.1009648370322,56.6968222172666,59.330718815987,62.0572383064686,66.1312975658377
"14",2024-01-24,"energy","64 hour",49.8947522448029,54.348402049985,56.7471090777851,60.2125660756773,64.9804409882183
"15",2024-01-24,"energy","68 hour",48.727841983374,53.2210950520354,55.66239822221,58.3125635985805,62.8178548408555
"1",2024-01-24,"infections","0 week",2082,2082,2082,2082,2082
"3",2024-01-24,"infections","1 week",1379,1779,2027,2279,2825
"5",2024-01-24,"infections","2 week",1199.975,1660,1960,2305,3085.05
"6",2024-01-24,"infections","3 week",1089,1587,1914,2302,3239.025
"8",2024-01-24,"infections","4 week",1029,1519,1863.5,2280,3348.025
