"","forecast_date","target","horizon","q0.025","q0.25","q0.5","q0.75","q0.975"
"2",2023-11-08,"DAX","1 day",-1.55667174647961,-0.124539451449416,0.400326787780866,0.94038758787061,2.05631628908103
"4",2023-11-08,"DAX","2 day",-2.14425658547873,-0.313664212610326,0.409869588936953,1.1057129856213,2.67714583903467
"11",2023-11-08,"DAX","5 day",-2.75175571523442,-0.543505652855778,0.330547058336132,1.14762363950553,2.95303311340042
"12",2023-11-08,"DAX","6 day",-3.05045324578239,-0.541646496830684,0.391169330258584,1.26399810301859,3.41973660481039
"16",2023-11-08,"DAX","7 day",-2.87288637845741,-0.365023299836131,0.703137440569224,1.67175266122614,3.89842674828591
"7",2023-11-08,"energy","36 hour",43.6092697127692,49.4384560870345,51.5637999066525,54.5611373710047,60.3544332192921
"9",2023-11-08,"energy","40 hour",42.2033054503791,47.3421183871443,49.5280247067624,52.4441668586146,58.484930675652
"10",2023-11-08,"energy","44 hour",43.0588374145372,48.2787212063659,51.0953544214667,54.7962086239978,60.7277962900002
"13",2023-11-08,"energy","60 hour",41.5627049041452,46.0967646641575,48.3801790064168,51.5264096267519,56.8354306757744
"14",2023-11-08,"energy","64 hour",39.3899971336068,43.7244014248692,45.9170501421285,49.1205385749636,54.5746455614861
"15",2023-11-08,"energy","68 hour",39.8304956627064,43.7068270590322,46.6685932967743,50.4846062802882,55.8997433657757
"1",2023-11-08,"infections","0 week",1405.66666666667,1439,1472.33333333333,1505.66666666667,1539
"3",2023-11-08,"infections","1 week",917.675,1385.16666666667,1553.66666666667,1693.08333333333,1989.48333333333
"5",2023-11-08,"infections","2 week",878.808333333333,1374,1560.5,1760.66666666667,2072.13333333333
"6",2023-11-08,"infections","3 week",856.725,1357.58333333333,1579.66666666667,1818.58333333333,2178.05
"8",2023-11-08,"infections","4 week",844.458333333333,1329.58333333333,1543,1851.5,2362.34166666667
