"","forecast_date","target","horizon","q0.025","q0.25","q0.5","q0.75","q0.975"
"1",2023-11-29,"infections","0 week",1643,1643,1643,1643,1643
"2",2023-11-29,"infections","1 week",735.75,845.5,1065,1143,1448
"3",2023-11-29,"infections","2 week",1027,1093.5,1171,1268.5,1810
"4",2023-11-29,"infections","3 week",976.75,1070,1158,1293.5,1850.5
"5",2023-11-29,"infections","4 week",977,1069,1228,1287.5,2134.25
