forecast_date,target,horizon,q0.025,q0.25,q0.5,q0.75,q0.975
2023-12-13,DAX,1 day,-0.2854828281130039,-0.0077762533301939,0.2240577297114576,0.7522291563112571,1.099621428039943
2023-12-13,DAX,2 day,-0.205030383523761,0.3144318329120654,0.6696162372021419,1.112707184843709,1.473450010752586
2023-12-13,DAX,5 day,0.0125904455749648,0.6856884380344486,0.9709068153780364,1.552565226393865,2.677033870908527
2023-12-13,DAX,6 day,0.3108062294349745,0.817891669374049,1.2775284972627254,2.3180418661698177,3.619843499515354
2023-12-13,DAX,7 day,0.4887552539404449,1.3070167837120117,1.998775687856913,2.728545970536977,3.9999448242992206
2023-12-13,energy,36 hour,52.87185,62.15775,66.05775,69.74375,74.82535
2023-12-13,energy,40 hour,49.416375,57.5835,61.193,65.476625,72.0326
2023-12-13,energy,44 hour,49.3474875,54.628125,58.1955,63.049625000000006,67.444525
2023-12-13,energy,60 hour,48.7189875,53.228750000000005,55.403,58.975125,63.819087499999995
2023-12-13,energy,64 hour,45.4788,49.21875,51.66175,55.801249999999996,62.0880125
2023-12-13,energy,68 hour,44.2178625,48.26425,51.34825,55.590625,59.96501249999999
2023-12-13,infections,0 week,NA,NA,NA,NA,NA
2023-12-13,infections,1 week,NA,NA,NA,NA,NA
2023-12-13,infections,2 week,NA,NA,NA,NA,NA
2023-12-13,infections,3 week,NA,NA,NA,NA,NA
2023-12-13,infections,4 week,NA,NA,NA,NA,NA
