"","forecast_date","target","horizon","q0.025","q0.25","q0.5","q0.75","q0.975"
"2",2023-12-20,"DAX","1 day",-2.14995145797729,-0.479547328115482,0.0630229206958307,0.639341749834621,1.85046064853668
"4",2023-12-20,"DAX","2 day",-2.27811145782471,-0.576670397189094,0.094240362254272,0.904870350118658,2.49960658281221
"11",2023-12-20,"DAX","5 day",-3.22569251060486,-0.730688368278054,0.166567016839814,1.16168141590425,2.98631048202515
"12",2023-12-20,"DAX","6 day",-3.28829841432478,-0.818592961488562,0.207773512048526,1.37748696005384,3.58262313854889
"16",2023-12-20,"DAX","7 day",-3.41640653163075,-0.886797786218514,0.334873704991523,1.43963225001722,3.79106968739758
"7",2023-12-20,"energy","36 hour",52.011,61.776625,65.90475,69.1121875,74.842
"9",2023-12-20,"energy","40 hour",51.0672570273146,59.1686875,62.3305,67.7222,72.0075570877471
"10",2023-12-20,"energy","44 hour",49.34880625,54.9442503335704,59.92875,63.658,68.1821847464448
"13",2023-12-20,"energy","60 hour",47.84575,53.256125,55.89025,59.269,62.9146125
"14",2023-12-20,"energy","64 hour",47.12428125,51.562,56.41388,59.3915,62.03279375
"15",2023-12-20,"energy","68 hour",45.3964,50.462,53.546,57.62469,61.91125
"1",2023-12-20,"infections","0 week",2030,2030,2030,2030,2030
"3",2023-12-20,"infections","1 week",1180.6,1501,1654.5,1799,2818.1
"5",2023-12-20,"infections","2 week",1144.9875,1424.5,1616.25,1836,2986.9125
"6",2023-12-20,"infections","3 week",955.2875,1390.5,1575.75,1835.5,2883.7
"8",2023-12-20,"infections","4 week",723.7875,996.375,1250.75,1488.5,2283.2125
