forecast_date,target,horizon,q0.025,q0.25,q0.5,q0.75,q0.975
2023-11-22,DAX,1 day,-1.583897437108086,-0.2791402784703134,0.1541048949671442,0.6099709775984508,1.5412382268724296
2023-11-22,DAX,2 day,-1.838776285619903,-0.7678839393693515,0.1930362286208797,1.018317146801051,2.4996065828122127
2023-11-22,DAX,5 day,-2.256511178364744,-1.1237641383454289,0.5374337666818718,1.5500005787691506,2.986073082121074
2023-11-22,DAX,6 day,-2.9473216364550536,-1.000770311564203,0.8054816540217224,1.7468729496729285,3.591669712491865
2023-11-22,DAX,7 day,-2.6779751709011013,-1.0285707352605034,1.0230944518071716,2.6533092539365644,3.7910696873975778
2023-11-22,energy,36 hour,53.63964375,61.140375000000006,64.128,67.40312499999999,75.81706249999999
2023-11-22,energy,40 hour,50.97789375,56.48475,59.3595,62.9045625,70.57074374999999
2023-11-22,energy,44 hour,51.00661875,54.8659375,58.908125,63.099875,71.5553875
2023-11-22,energy,60 hour,47.84225625,51.6094375,54.42825,57.365625,63.6835375
2023-11-22,energy,64 hour,44.25519375,47.6435,49.9185,53.1553125,59.40171874999999
2023-11-22,energy,68 hour,44.56158125,48.0353125,51.4305,56.440125,63.6415375
2023-11-22,infections,0 week,,,,,
2023-11-22,infections,1 week,,,,,
2023-11-22,infections,2 week,,,,,
2023-11-22,infections,3 week,,,,,
2023-11-22,infections,4 week,,,,,
