"","forecast_date","target","horizon","q0.025","q0.25","q0.5","q0.75","q0.975"
"2",2024-01-10,"DAX","1 day",-2.1928727729817,-0.4739031,0.0686313077538969,0.6320969,1.98281058925477
"4",2024-01-10,"DAX","2 day",-2.48937040736896,-0.719622865422711,0.0894760728836097,0.960577694388594,2.5527
"11",2024-01-10,"DAX","5 day",-3.0368366,-0.8003658,0.168228146492844,1.0780927,3.2
"12",2024-01-10,"DAX","6 day",-3.617155,-0.9417379,0.212652134178715,1.3086011,3.6384
"16",2024-01-10,"DAX","7 day",-4.2119693,-1.04928943756333,0.342611649307223,1.54693772737146,4.239251
"7",2024-01-10,"energy","36 hour",56.5306961543564,62.8247667999268,67.2103459309104,69.0844843197865,73.329413875
"9",2024-01-10,"energy","40 hour",54.5525348422395,60.6561875,63.4603125,66.2819001333208,70.9286875
"10",2024-01-10,"energy","44 hour",53.1515283760677,56.3658125,62.049530955,63.2765608791029,67.63879375
"13",2024-01-10,"energy","60 hour",49.8385833564932,53.4745450875399,58.687559955,60.3775825158936,62.4160495297198
"14",2024-01-10,"energy","64 hour",47.3901632120444,52.1973506934659,56.1347426654144,58.7110757240197,61.63080625
"15",2024-01-10,"energy","68 hour",46.7474002832012,51.8305357512021,54.8784751113248,57.27591945,59.8893084482422
"1",2024-01-10,"infections","0 week",2082,2082,2082,2082,2082
"3",2024-01-10,"infections","1 week",1198.1,1518.5,1677.75,1831.5,2855.1
"5",2024-01-10,"infections","2 week",1148.9875,1438.875,1636.5,1861.5,3016.9125
"6",2024-01-10,"infections","3 week",961.3,1403.5,1597,1861,2891.2
"8",2024-01-10,"infections","4 week",728.8,1018,1270.75,1503.5,2307.2125
