"","forecast_date","target","horizon","q0.025","q0.25","q0.5","q0.75","q0.975"
"1",2024-02-14,"infections","0 week",2082,2082,2082,2082,2082
"2",2024-02-14,"infections","1 week",1017.75,1133,1264,1370.5,2774.75
"3",2024-02-14,"infections","2 week",1088.25,1192.5,1302,1390,2824.5
"4",2024-02-14,"infections","3 week",831.25,1144.5,1245,1373.5,2465.25
"5",2024-02-14,"infections","4 week",389,483.5,572,700,1228.25
