forecast_date,target,horizon,q0.025,q0.25,q0.5,q0.75,q0.975
2024-01-31,DAX,1 day,-1.0043027163855145,-0.2966579702888161,-0.0295837451209202,0.3161121577516468,1.118252595094508
2024-01-31,DAX,2 day,-1.1881516020803318,-0.2083751629189389,0.0764355997366905,0.4484659345746156,1.3510950717708818
2024-01-31,DAX,5 day,-1.2141376033685392,-0.3379296988180513,0.0908387311497449,0.3796316490014551,1.993784635169762
2024-01-31,DAX,6 day,-1.0211767426804697,-0.4026000029684784,-0.0929146830423555,0.473965174649571,1.976266806987481
2024-01-31,DAX,7 day,-1.160469808411646,-0.5451065030881885,-0.2035950469546854,0.5335636368791974,2.5140510562250458
2024-01-31,energy,36 hour,51.57,62.082,66.04025,70.1118125,75.1255625
2024-01-31,energy,40 hour,49.77265625,59.1265625,62.9875,66.730125,71.71928125
2024-01-31,energy,44 hour,52.170875,57.5641875,60.957625,67.9705625,73.47234375
2024-01-31,energy,60 hour,48.30246875,52.3113125,55.1635,58.8773125,63.10068750000001
2024-01-31,energy,64 hour,46.0519375,50.30675,52.612625,55.6199375,61.344
2024-01-31,energy,68 hour,46.38815625,50.273875,53.340625,59.71225,65.48271875
2024-01-31,infections,0 week,,,,,
2024-01-31,infections,1 week,,,,,
2024-01-31,infections,2 week,,,,,
2024-01-31,infections,3 week,,,,,
2024-01-31,infections,4 week,,,,,
