13
Lattice="5.727564927611035 0.0 0.0 0.0 5.727564927611035 0.0 0.0 0.0 13.75" Properties=species:S:1:pos:R:3:tags:I:1 pbc="T T F"
Al       0.00000000       0.00000000       4.00000000        3
Al       2.86378246       0.00000000       4.00000000        3
Al       0.00000000       2.86378246       4.00000000        3
Al       2.86378246       2.86378246       4.00000000        3
Al       1.43189123       1.43189123       6.02500000        2
Al       4.29567370       1.43189123       6.02500000        2
Al       1.43189123       4.29567370       6.02500000        2
Al       4.29567370       4.29567370       6.02500000        2
Al       0.00000000       0.00000000       8.05000000        1
Al       2.86378246       0.00000000       8.05000000        1
Al       0.00000000       2.86378246       8.05000000        1
Al       2.86378246       2.86378246       8.05000000        1
Au       1.43189123       1.43189123       9.75000000        0
