17
Lattice="8.1228 0.0 0.0 0.0 5.743686962222088 0.0 0.0 0.0 13.743686962222087" Properties=species:S:1:pos:R:3 pbc="T T F"
Al       0.00000000       0.00000000       5.43592174
Al       2.03070000       1.43592174       4.00000000
Al       0.00000000       0.00000000       8.30776522
Al       2.03070000       1.43592174       6.87184348
Al       0.00000000       2.87184348       5.43592174
Al       2.03070000       4.30776522       4.00000000
Al       0.00000000       2.87184348       8.30776522
Al       2.03070000       4.30776522       6.87184348
Al       4.06140000       0.00000000       5.43592174
Al       6.09210000       1.43592174       4.00000000
Al       4.06140000       0.00000000       8.30776522
Al       6.09210000       1.43592174       6.87184348
Al       4.06140000       2.87184348       5.43592174
Al       6.09210000       4.30776522       4.00000000
Al       4.06140000       2.87184348       8.30776522
Al       6.09210000       4.30776522       6.87184348
Al       6.09210000       1.43592174       9.74368696
