HEADER:
Checked=true
WithData=false
Cellformat=Vtu
POINTS:
0 0
1 -1
1 1
3 2
5 1
5 -1
3 -2
3 0
-1 -1
-1 1
-3 2
-4.875 1
-4.875 -1
-3 -2
-3 0
CELLS:
5 1 0 1 2
5 1 7 2 1
5 1 7 3 2
5 1 7 4 3
5 1 7 5 4
5 1 7 6 5
5 1 7 1 6
5 1 0 8 1
5 1 0 2 9
5 1 8 0 9
5 1 14 8 9
5 1 14 9 10
5 1 14 10 11
5 1 14 11 12
5 1 14 12 13
5 1 14 13 8
FACES:
1 2 3
1 3 4
1 4 5
1 5 6
1 6 1
1 9 2
1 8 1
1 9 10
1 10 11
1 11 12
1 12 13
1 13 8
