Xlibs.tcz
Xprogs.tcz
Xvesa.tcz
fltk-1.1.10.tcz
wbar.tcz
flwm_topside.tcz
expat2.tcz
fontconfig.tcz
gcc_libs.tcz
gsfonts.tcz
kmaps.tcz
libxp.tcz
openmotif-lib.tcz
openssh.tcz
openssl-1.0.0.tcz
popt.tcz
rsync.tcz
sun-jre7.tcz
Xorg-7.6-lib.tcz
xpdf.tcz
