0.07186229, 0.07429091
0.12319714, 0.11675643
0.17372479, 0.15813618
0.22397763, 0.19565743
0.27418596, 0.23456168
0.32439574, 0.27403321
0.37443029, 0.31256274
0.42445211, 0.35329566
0.47453286, 0.39295834
0.52472060, 0.43362896
0.57480612, 0.47594958
0.62486642, 0.52128404
0.67492880, 0.56872780
0.72489270, 0.61720059
0.77506351, 0.66793147
0.82517430, 0.72586983
0.87533856, 0.79559735
0.92561085, 0.87225364
