0.07188080, 0.08428586
0.12316217, 0.13046333
0.17372916, 0.17309200
0.22402528, 0.21288807
0.27425616, 0.25349670
0.32436455, 0.29411828
0.37444185, 0.33175344
0.42466779, 0.37217003
0.47461394, 0.40962416
0.52473621, 0.45147298
0.57474392, 0.49474324
0.62490179, 0.53442112
0.67488545, 0.58397169
0.72491708, 0.63008751
0.77491727, 0.67836219
0.82516956, 0.73454949
0.87542661, 0.79780643
0.92556013, 0.87340390
