{
  "variables": {
    "ou_short_name": {
      "friendly_name": {
        "de": "OE-Kurzbezeichnung",
        "en": "OU short name"
      },
      "optional": false,
      "default": "",
      "nullable": false,
      "description": {
        "de": "Name der OE der der Serviceaccount zugeordnet werden soll",
        "en": "Name of the OU the service account should be linked to"
      },
      "type": "typeahead",
      "type_params": {
        "query": [
          {
            "idx": "own_mgr2ou_list",
            "name": "cntl.mgr2ou.list",
            "old": {
              "is_own": true
            }
          },
          {
            "idx": "unit_list",
            "name": "org.unit.list",
            "inner_join_ref": {
              "own_mgr2ou_list": "default"
            },
            "old": {
              "sorting_params_list": [
                "sub_position"
              ]
            }
          },
          {
            "idx": "unit_list_superset",
            "name": "org.unit.list",
            "inner_join_ref": {
              "unit_list": "api_func_org_unit_hierarchy_gfk_list_is_superset"
            }
          }
        ],
        "query_path": "unit_list_superset",
        "display_value": "short_name",
        "return_value": "short_name"
      }
    },
    "group_name": {
      "friendly_name": {
        "de": "Gruppenname",
        "en": "Group name"
      },
      "optional": false,
      "default": "",
      "nullable": false,
      "description": {
        "de": "Name der Gruppe, deren Mitglieder den Serviceaccount verwalten können.",
        "en": "Name of the group managing the service account"
      },
      "type": "str"
    }
  },
  "transaction": [
    {
      "idx": "add_svc_to_ou",
      "name": "cntl.mgr2ou.create",
      "new": {
        "ou_short_name": "{{ou_short_name}}"
      },
      "new_ref_params": [
        {
          "idx": "",
          "params": {
            "mgr_login_name": "login_name"
          }
        }
      ]
    },
    {
      "idx": "add_svc_to_group",
      "name": "cntl.mgr2group.create",
      "new": {
        "group_name": "{{group_name}}"
      },
      "new_ref_params": [
        {
          "idx": "",
          "params": {
            "mgr_login_name": "login_name"
          }
        }
      ]
    }
  ],
  "returning": []
}