{
  "variables": {
    "fqdn_description": {
      "friendly_name": {
        "de": "FQDN-Beschreibung",
        "en": "FQDN description"
      },
      "optional": true,
      "default": "",
      "nullable": true,
      "description": {
        "de": "Nur falls der FQDN noch nicht extistiert: Beschreibung des FQDN. Die FQDN-Beschreibung kann später über die Bereibitungsfunktion des FQDNs geändert werden.",
        "en": "Only if FQDN does not exist yet: Description of FQDN. The description can be changed later via the FQDN's edit function."
      },
      "type": "str"
    },
    "fqdn_description_overwrite": {
      "friendly_name": {
        "de": "FQDN-Beschreibung überschreiben",
        "en": "Overwrite FQDN description"
      },
      "optional": false,
      "default": false,
      "nullable": false,
      "description": {
        "de": "Nur falls der FQDN bereits existiert: Beschreibung des exsitierenden FQDN überschreiben.",
        "en": "Only if FQDN does already exist: Overwrite Description of existing FQDN."
      },
      "type": "bool"
    }
  },
  "transaction": [
    {
      "idx": "check_fqdn",
      "name": "dns.fqdn.list",
      "old": {
        "value_list": [
          "{{ fqdn }}"
        ]
      }
    },
    {
      "idx": "rec_type_def",
      "name": "dnscfg.record_type.list",
      "old": {
        "name": "{{type}}"
      },
      "when": {
        "returns_no_data": [
          "check_fqdn"
        ]
      }
    },
    {
      "idx": "fqdn_type",
      "name": "dnscfg.fqdn_type.list",
      "inner_join_ref": {
        "rec_type_def": "api_fkey_dnscfg_record_type_dflt_fqdn_type"
      },
      "when": {
        "returns_no_data": [
          "check_fqdn"
        ]
      }
    },
    {
      "idx": "crt_fqdn",
      "name": "dns.fqdn.create",
      "new": {
        "value": "{{fqdn}}",
        "description": "{{fqdn_description}}"
      },
      "new_ref_params": [
        {
          "idx": "fqdn_type",
          "params": {
            "type": "name"
          }
        }
      ],
      "when": {
        "returns_no_data": [
          "check_fqdn"
        ]
      }
    },
    {
      "idx": "upd_fqdn",
      "name": "dns.fqdn.update",
      "new": {
        "description": "{{fqdn_description}}"
      },
      "old": {
        "value": "{{fqdn}}"
      },
      "when": {
        "and": [
          {
            "and": [
              true,
              "{{fqdn_description_overwrite}}"
            ]
          },
          {
            "returns_data": [
              "check_fqdn"
            ]
          }
        ]
      }
    }
  ],
  "returning": []
}