
[VERYDIFF_EXPERIMENT] Running on /home/i57/steuber/NeuroDiff/repos/VeryDiffExperiments/src/../benchmarks/mnist-prune/specs/mnist_73_global_5.vnnlib /home/i57/steuber/NeuroDiff/repos/VeryDiffExperiments/src/../benchmarks/mnist-prune/nets/mnist_relu_2_512.onnx
Found input X
op: matmul, weight: (512, 784), bias: nothing
op: bias, weight: nothing, bias: (512,)
op: relu, weight: nothing, bias: nothing
op: matmul, weight: (512, 512), bias: nothing
op: bias, weight: nothing, bias: (512,)
op: relu, weight: nothing, bias: nothing
op: matmul, weight: (10, 512), bias: nothing
op: bias, weight: nothing, bias: (10,)
Found input X
op: matmul, weight: (512, 784), bias: nothing
op: bias, weight: nothing, bias: (512,)
op: relu, weight: nothing, bias: nothing
op: matmul, weight: (512, 512), bias: nothing
op: bias, weight: nothing, bias: (512,)
op: relu, weight: nothing, bias: nothing
op: matmul, weight: (10, 512), bias: nothing
op: bias, weight: nothing, bias: (10,)
Distance: 1085.5985166831802
Distance: 1719.8468985003963
Distance: 31.228482716001736
Running with 1 threads
[Thread 1] Time to first task: 0.02s
Zono Bounds:
[0.0, 0.0, 0.0, 0.0, 0.0, 0.0, 0.0, 0.0, 0.0, 0.0, 0.0, 0.0, 0.0, 0.0, 0.0, 0.0, 0.0, 0.0, 0.0, 0.0, 0.0, 0.0, 0.0, 0.0, 0.0, 0.0, 0.0, 0.0, 0.0, 0.0, 0.0, 0.0, 0.0, 0.0, 0.0, 0.0, 0.0, 0.0, 0.0, 0.0, 0.0, 0.0, 0.0, 0.0, 0.0, 0.0, 0.0, 0.0, 0.0, 0.0, 0.0, 0.0, 0.0, 0.0, 0.0, 0.0, 0.0, 0.0, 0.0, 0.0, 0.0, 0.0, 0.0, 0.0, 0.0, 0.0, 0.0, 0.0, 0.0, 0.0, 0.0, 0.0, 0.0, 0.0, 0.0, 0.0, 0.0, 0.0, 0.0, 0.0, 0.0, 0.0, 0.0, 0.0, 0.0, 0.0, 0.0, 0.0, 0.0, 0.0, 0.0, 0.0, 0.0, 0.0, 0.0, 0.0, 0.0, 0.0, 0.0, 0.0, 0.0, 0.0, 0.0, 0.0, 0.0, 0.0, 0.0, 0.0, 0.0, 0.0, 0.0, 0.0, 0.0, 0.0, 0.0, 0.0, 0.0, 0.0, 0.0, 0.0, 0.0, 0.0, 0.0, 0.0, 0.0, 0.0, 0.0, 0.0, 0.0, 0.0, 0.0, 0.0, 0.0, 0.0, 0.0, 0.0, 0.0, 0.0, 0.0, 0.0, 0.0, 0.0, 0.0, 0.0, 0.0, 0.0, 0.0, 0.0, 0.0, 0.0, 0.0, 0.0, 0.0, 0.0, 0.0, 0.0, 0.0, 0.0, 0.0, 0.0, 0.0, 0.0, 0.0, 0.0, 0.0, 0.0, 0.0, 0.0, 0.0, 0.0, 0.0, 0.0, 0.0, 0.0, 0.0, 0.0, 0.0, 0.0, 0.0, 0.0, 0.0, 0.0, 0.0, 0.0, 0.0, 0.0, 0.0, 0.0, 0.0, 0.0, 0.0, 0.0, 0.0, 0.0, 0.0, 0.0, 0.0, 0.0, 0.0, 0.0, 0.0, 0.0, 0.0, 0.0, 0.0, 0.0, 0.0, 0.0, 0.0, 0.0, 0.0, 0.0, 0.0, 0.0, 0.0, 0.0, 0.0, 0.0, 0.0, 0.0, 0.0, 0.0, 0.0, 0.0, 0.0, 0.0, 0.0, 0.0, 0.0, 0.0, 0.0, 0.0, 0.0, 0.0, 0.0, 0.0, 0.0, 0.0, 0.0, 0.0, 0.0, 0.0, 0.0, 0.0, 0.0, 0.0, 0.0, 0.0, 0.0, 0.0, 0.0, 0.0, 0.0, 0.0, 0.0, 0.0, 0.0, 0.0, 0.0, 0.0, 0.0, 0.0, 0.0, 0.0, 0.0, 0.0, 0.0, 0.0, 0.0, 0.0, 0.0, 0.0, 0.0, 0.0, 0.0, 0.0, 0.0, 0.0, 0.0, 0.0, 0.0, 0.0, 0.0, 0.0, 0.0, 0.0, 0.0, 0.0, 0.0, 0.0, 0.0, 0.0, 0.0, 0.0, 0.0, 0.0, 0.0, 0.0, 0.0, 0.0, 0.0, 0.0, 0.0, 0.0, 0.0, 0.0, 0.0, 0.0, 0.0, 0.0, 0.0, 0.0, 0.0, 0.0, 0.0, 0.0, 0.0, 0.0, 0.0, 0.0, 0.0, 0.0, 0.0, 0.0, 0.0, 0.0, 0.0, 0.0, 0.0, 0.0, 0.0, 0.0, 0.0, 0.0, 0.0, 0.0, 0.0, 0.0, 0.0, 0.0, 0.0, 0.0, 0.0, 0.0, 0.0, 0.0, 0.0, 0.0, 0.0, 0.0, 0.0, 0.0, 0.0, 0.0, 0.0, 0.0, 0.0, 0.0, 0.0, 0.0, 0.0, 0.0, 0.0, 0.0, 0.0, 0.0, 0.0, 0.0, 0.0, 0.0, 0.0, 0.0, 0.0, 0.0, 0.0, 0.0, 0.0, 0.0, 0.0, 0.0, 0.0, 0.0, 0.0, 0.0, 0.0, 0.0, 0.0, 0.0, 0.0, 0.0, 0.0, 0.0, 0.0, 0.0, 0.0, 0.0, 0.0, 0.0, 0.0, 0.0, 0.0, 0.0, 0.0, 0.0, 0.0, 0.0, 0.0, 0.0, 0.0, 0.0, 0.0, 0.0, 0.0, 0.0, 0.0, 0.0, 0.0, 0.0, 0.0, 0.0, 0.0, 0.0, 0.0, 0.0, 0.0, 0.0, 0.0, 0.0, 0.0, 0.0, 0.0, 0.0, 0.0, 0.0, 0.0, 0.0, 0.0, 0.0, 0.0, 0.0, 0.0, 0.0, 0.0, 0.0, 0.0, 0.0, 0.0, 0.0, 0.0, 0.0, 0.0, 0.0, 0.0, 0.0, 0.0, 0.0, 0.0, 0.0, 0.0, 0.0, 0.0, 0.0, 0.0, 0.0, 0.0, 0.0, 0.0, 0.0, 0.0, 0.0, 0.0, 0.0, 0.0, 0.0, 0.0, 0.0, 0.0, 0.0, 0.0, 0.0, 0.0, 0.0, 0.0, 0.0, 0.0, 0.0, 0.0, 0.0, 0.0, 0.0, 0.0, 0.0, 0.0, 0.0, 0.0, 0.0, 0.0, 0.0, 0.0, 0.0, 0.0, 0.0, 0.0, 0.0, 0.0, 0.0, 0.0, 0.0, 0.0, 0.0, 0.0, 0.0, 0.0, 0.0, 0.0, 0.0, 0.0, 0.0, 0.0, 0.0, 0.0, 0.0, 0.0, 0.0, 0.0, 0.0, 0.0, 0.0, 0.0, 0.0, 0.0, 0.0, 0.0, 0.0, 0.0, 0.0, 0.0, 0.0, 0.0, 0.0, 0.0, 0.0, 0.0, 0.0, 0.0, 0.0, 0.0, 0.0, 0.0, 0.0, 0.0, 0.0, 0.0, 0.0, 0.0, 0.0, 0.0, 0.0, 0.0, 0.0, 0.0, 0.0, 0.0, 0.0, 0.0, 0.0, 0.0, 0.0, 0.0, 0.0, 0.0, 0.0, 0.0, 0.0, 0.0, 0.0, 0.0, 0.0, 0.0, 0.0, 0.0, 0.0, 0.0, 0.0, 0.0, 0.0, 0.0, 0.0, 0.0, 0.0, 0.0, 0.0, 0.0, 0.0, 0.0, 0.0, 0.0, 0.0, 0.0, 0.0, 0.0, 0.0, 0.0, 0.0, 0.0, 0.0, 0.0, 0.0, 0.0, 0.0, 0.0, 0.0, 0.0, 0.0, 0.0, 0.0, 0.0, 0.0, 0.0, 0.0, 0.0, 0.0, 0.0, 0.0, 0.0, 0.0, 0.0, 0.0, 0.0, 0.0, 0.0, 0.0, 0.0, 0.0, 0.0, 0.0, 0.0, 0.0, 0.0, 0.0, 0.0, 0.0, 0.0, 0.0, 0.0, 0.0, 0.0, 0.0, 0.0, 0.0, 0.0, 0.0, 0.0, 0.0, 0.0, 0.0, 0.0, 0.0, 0.0, 0.0, 0.0, 0.0, 0.0, 0.0, 0.0, 0.0, 0.0, 0.0, 0.0, 0.0, 0.0, 0.0, 0.0, 0.0, 0.0, 0.0, 0.0, 0.0, 0.0, 0.0, 0.0, 0.0, 0.0, 0.0, 0.0, 0.0, 0.0, 0.0, 0.0, 0.0, 0.0, 0.0, 0.0, 0.0, 0.0, 0.0, 0.0, 0.0, 0.0, 0.0, 0.0, 0.0, 0.0, 0.0, 0.0, 0.0, 0.0, 0.0, 0.0, 0.0, 0.0, 0.0, 0.0, 0.0, 0.0, 0.0, 0.0, 0.0, 0.0, 0.0, 0.0, 0.0, 0.0, 0.0, 0.0, 0.0, 0.0, 0.0, 0.0, 0.0, 0.0, 0.0, 0.0, 0.0, 0.0, 0.0, 0.0, 0.0, 0.0, 0.0, 0.0, 0.0, 0.0, 0.0, 0.0, 0.0, 0.0, 0.0, 0.0, 0.0, 0.0, 0.0, 0.0, 0.0, 0.0, 0.0, 0.0, 0.0, 0.0, 0.0, 0.0, 0.0, 0.0, 0.0, 0.0, 0.0, 0.0, 0.0, 0.0, 0.0, 0.0, 0.0, 0.0, 0.0, 0.0, 0.0, 0.0, 0.0, 0.0, 0.0, 0.0, 0.0, 0.0, 0.0]
[0.0, 0.0, 0.0, 0.0, 0.0, 0.0, 0.0, 0.0, 0.0, 0.0, 0.0, 0.0, 0.0, 0.0, 0.0, 0.0, 0.0, 0.0, 0.0, 0.0, 0.0, 0.0, 0.0, 0.0, 0.0, 0.0, 0.0, 0.0, 0.0, 0.0, 0.0, 0.0, 0.0, 0.0, 0.0, 0.0, 0.0, 0.0, 0.0, 0.0, 0.0, 0.0, 0.0, 0.0, 0.0, 0.0, 0.0, 0.0, 0.0, 0.0, 0.0, 0.0, 0.0, 0.0, 0.0, 0.0, 0.0, 0.0, 0.0, 0.0, 0.0, 0.0, 0.0, 0.0, 0.0, 0.0, 0.0, 0.0, 0.0, 0.0, 0.0, 0.0, 0.0, 0.0, 0.0, 0.0, 0.0, 0.0, 0.0, 0.0, 0.0, 0.0, 0.0, 0.0, 0.0, 0.0, 0.0, 0.0, 0.0, 0.0, 0.0, 0.0, 0.0, 0.0, 0.0, 0.0, 0.0, 0.0, 0.0, 0.0, 0.0, 0.0, 0.0, 0.0, 0.0, 0.0, 0.0, 0.0, 0.0, 0.0, 0.0, 0.0, 0.0, 0.0, 0.0, 0.0, 0.0, 0.0, 0.0, 0.0, 0.0, 0.0, 0.0, 0.0, 0.0, 0.0, 0.0, 0.0, 0.0, 0.0, 0.0, 0.0, 0.0, 0.0, 0.0, 0.0, 0.0, 0.0, 0.0, 0.0, 0.0, 0.0, 0.0, 0.0, 0.0, 0.0, 0.0, 0.0, 0.0, 0.0, 0.0, 0.0, 0.0, 0.0, 0.0, 0.0, 0.0, 0.0, 0.0, 0.0, 0.0, 0.0, 0.0, 0.0, 0.0, 0.0, 0.0, 0.0, 0.0, 0.0, 0.0, 0.0, 0.0, 0.0, 0.0, 0.0, 0.0, 0.0, 0.0, 0.0, 0.0, 0.0, 0.0, 0.0, 0.0, 0.0, 0.0, 0.0, 0.0, 0.0, 0.0, 0.0, 0.0, 0.0, 0.0, 0.0, 0.0, 0.0, 0.0, 0.0, 0.0, 0.0, 0.0, 0.0, 0.0, 0.0, 0.0, 0.0, 0.0, 0.0, 0.0, 0.0, 0.0, 0.0, 0.0, 0.0, 0.0, 0.0, 0.0, 0.0, 0.0, 0.0, 0.0, 0.0, 0.0, 0.0, 0.0, 0.0, 0.0, 0.0, 0.0, 0.0, 0.0, 0.0, 0.0, 0.0, 0.0, 0.0, 0.0, 0.0, 0.0, 0.0, 0.0, 0.0, 0.0, 0.0, 0.0, 0.0, 0.0, 0.0, 0.0, 0.0, 0.0, 0.0, 0.0, 0.0, 0.0, 0.0, 0.0, 0.0, 0.0, 0.0, 0.0, 0.0, 0.0, 0.0, 0.0, 0.0, 0.0, 0.0, 0.0, 0.0, 0.0, 0.0, 0.0, 0.0, 0.0, 0.0, 0.0, 0.0, 0.0, 0.0, 0.0, 0.0, 0.0, 0.0, 0.0, 0.0, 0.0, 0.0, 0.0, 0.0, 0.0, 0.0, 0.0, 0.0, 0.0, 0.0, 0.0, 0.0, 0.0, 0.0, 0.0, 0.0, 0.0, 0.0, 0.0, 0.0, 0.0, 0.0, 0.0, 0.0, 0.0, 0.0, 0.0, 0.0, 0.0, 0.0, 0.0, 0.0, 0.0, 0.0, 0.0, 0.0, 0.0, 0.0, 0.0, 0.0, 0.0, 0.0, 0.0, 0.0, 0.0, 0.0, 0.0, 0.0, 0.0, 0.0, 0.0, 0.0, 0.0, 0.0, 0.0, 0.0, 0.0, 0.0, 0.0, 0.0, 0.0, 0.0, 0.0, 0.0, 0.0, 0.0, 0.0, 0.0, 0.0, 0.0, 0.0, 0.0, 0.0, 0.0, 0.0, 0.0, 0.0, 0.0, 0.0, 0.0, 0.0, 0.0, 0.0, 0.0, 0.0, 0.0, 0.0, 0.0, 0.0, 0.0, 0.0, 0.0, 0.0, 0.0, 0.0, 0.0, 0.0, 0.0, 0.0, 0.0, 0.0, 0.0, 0.0, 0.0, 0.0, 0.0, 0.0, 0.0, 0.0, 0.0, 0.0, 0.0, 0.0, 0.0, 0.0, 0.0, 0.0, 0.0, 0.0, 0.0, 0.0, 0.0, 0.0, 0.0, 0.0, 0.0, 0.0, 0.0, 0.0, 0.0, 0.0, 0.0, 0.0, 0.0, 0.0, 0.0, 0.0, 0.0, 0.0, 0.0, 0.0, 0.0, 0.0, 0.0, 0.0, 0.0, 0.0, 0.0, 0.0, 0.0, 0.0, 0.0, 0.0, 0.0, 0.0, 0.0, 0.0, 0.0, 0.0, 0.0, 0.0, 0.0, 0.0, 0.0, 0.0, 0.0, 0.0, 0.0, 0.0, 0.0, 0.0, 0.0, 0.0, 0.0, 0.0, 0.0, 0.0, 0.0, 0.0, 0.0, 0.0, 0.0, 0.0, 0.0, 0.0, 0.0, 0.0, 0.0, 0.0, 0.0, 0.0, 0.0, 0.0, 0.0, 0.0, 0.0, 0.0, 0.0, 0.0, 0.0, 0.0, 0.0, 0.0, 0.0, 0.0, 0.0, 0.0, 0.0, 0.0, 0.0, 0.0, 0.0, 0.0, 0.0, 0.0, 0.0, 0.0, 0.0, 0.0, 0.0, 0.0, 0.0, 0.0, 0.0, 0.0, 0.0, 0.0, 0.0, 0.0, 0.0, 0.0, 0.0, 0.0, 0.0, 0.0, 0.0, 0.0, 0.0, 0.0, 0.0, 0.0, 0.0, 0.0, 0.0, 0.0, 0.0, 0.0, 0.0, 0.0, 0.0, 0.0, 0.0, 0.0, 0.0, 0.0, 0.0, 0.0, 0.0, 0.0, 0.0, 0.0, 0.0, 0.0, 0.0, 0.0, 0.0, 0.0, 0.0, 0.0, 0.0, 0.0, 0.0, 0.0, 0.0, 0.0, 0.0, 0.0, 0.0, 0.0, 0.0, 0.0, 0.0, 0.0, 0.0, 0.0, 0.0, 0.0, 0.0, 0.0, 0.0, 0.0, 0.0, 0.0, 0.0, 0.0, 0.0, 0.0, 0.0, 0.0, 0.0, 0.0, 0.0, 0.0, 0.0, 0.0, 0.0, 0.0, 0.0, 0.0, 0.0, 0.0, 0.0, 0.0, 0.0, 0.0, 0.0, 0.0, 0.0, 0.0, 0.0, 0.0, 0.0, 0.0, 0.0, 0.0, 0.0, 0.0, 0.0, 0.0, 0.0, 0.0, 0.0, 0.0, 0.0, 0.0, 0.0, 0.0, 0.0, 0.0, 0.0, 0.0, 0.0, 0.0, 0.0, 0.0, 0.0, 0.0, 0.0, 0.0, 0.0, 0.0, 0.0, 0.0, 0.0, 0.0, 0.0, 0.0, 0.0, 0.0, 0.0, 0.0, 0.0, 0.0, 0.0, 0.0, 0.0, 0.0, 0.0, 0.0, 0.0, 0.0, 0.0, 0.0, 0.0, 0.0, 0.0, 0.0, 0.0, 0.0, 0.0, 0.0, 0.0, 0.0, 0.0, 0.0, 0.0, 0.0, 0.0, 0.0, 0.0, 0.0, 0.0, 0.0, 0.0, 0.0, 0.0, 0.0, 0.0, 0.0, 0.0, 0.0, 0.0, 0.0, 0.0, 0.0, 0.0, 0.0, 0.0, 0.0, 0.0, 0.0, 0.0, 0.0, 0.0, 0.0, 0.0, 0.0, 0.0, 0.0, 0.0, 0.0, 0.0, 0.0, 0.0, 0.0, 0.0, 0.0, 0.0, 0.0, 0.0, 0.0, 0.0, 0.0, 0.0, 0.0, 0.0, 0.0, 0.0, 0.0, 0.0, 0.0, 0.0, 0.0, 0.0, 0.0, 0.0, 0.0, 0.0, 0.0, 0.0, 0.0, 0.0, 0.0, 0.0, 0.0, 0.0, 0.0, 0.0, 0.0, 0.0, 0.0, 0.0, 0.0, 0.0, 0.0, 0.0, 0.0, 0.0, 0.0, 0.0, 0.0, 0.0, 0.0, 0.0, 0.0, 0.0, 0.0, 0.0, 0.0, 0.0, 0.0, 0.0, 0.0, 0.0, 0.0, 0.0, 0.0, 0.0, 0.0, 0.0, 0.0, 0.0, 0.0, 0.0, 0.0, 0.0]

Found counterexample: ([0.00980392, 0.00980392, 0.00980392, 0.00980392, 0.00980392, 0.00980392, 0.00980392, 0.00980392, 0.00980392, 0.00980392, 0.00980392, 0.00980392, 0.00980392, 0.00980392, 0.00980392, 0.00980392, 0.00980392, 0.00980392, 0.00980392, 0.00980392, 0.00980392, 0.00980392, 0.00980392, 0.00980392, 0.00980392, 0.00980392, 0.00980392, 0.00980392, 0.00980392, 0.00980392, 0.00980392, 0.00980392, 0.00980392, 0.00980392, 0.00980392, 0.00980392, 0.00980392, 0.00980392, 0.00980392, 0.00980392, 0.00980392, 0.00980392, 0.00980392, 0.00980392, 0.00980392, 0.00980392, 0.00980392, 0.00980392, 0.00980392, 0.00980392, 0.00980392, 0.00980392, 0.00980392, 0.00980392, 0.00980392, 0.00980392, 0.00980392, 0.00980392, 0.00980392, 0.00980392, 0.00980392, 0.00980392, 0.00980392, 0.00980392, 0.00980392, 0.00980392, 0.00980392, 0.00980392, 0.00980392, 0.00980392, 0.00980392, 0.00980392, 0.00980392, 0.00980392, 0.00980392, 0.00980392, 0.00980392, 0.00980392, 0.00980392, 0.00980392, 0.00980392, 0.00980392, 0.00980392, 0.00980392, 0.00980392, 0.00980392, 0.00980392, 0.00980392, 0.00980392, 0.00980392, 0.00980392, 0.00980392, 0.00980392, 0.00980392, 0.00980392, 0.00980392, 0.00980392, 0.00980392, 0.00980392, 0.00980392, 0.00980392, 0.00980392, 0.00980392, 0.00980392, 0.00980392, 0.00980392, 0.00980392, 0.00980392, 0.00980392, 0.00980392, 0.00980392, 0.00980392, 0.00980392, 0.00980392, 0.00980392, 0.00980392, 0.00980392, 0.00980392, 0.00980392, 0.00980392, 0.00980392, 0.00980392, 0.00980392, 0.00980392, 0.00980392, 0.00980392, 0.00980392, 0.00980392, 0.00980392, 0.00980392, 0.00980392, 0.00980392, 0.00980392, 0.00980392, 0.00980392, 0.00980392, 0.00980392, 0.00980392, 0.00980392, 0.00980392, 0.00980392, 0.00980392, 0.00980392, 0.00980392, 0.00980392, 0.00980392, 0.00980392, 0.00980392, 0.00980392, 0.00980392, 0.00980392, 0.00980392, 0.00980392, 0.00980392, 0.00980392, 0.00980392, 0.00980392, 0.00980392, 0.00980392, 0.00980392, 0.00980392, 0.00980392, 0.00980392, 0.00980392, 0.00980392, 0.00980392, 0.00980392, 0.00980392, 0.00980392, 0.00980392, 0.00980392, 0.00980392, 0.00980392, 0.00980392, 0.00980392, 0.00980392, 0.00980392, 0.00980392, 0.00980392, 0.00980392, 0.17647058999999998, 0.60392159, 0.815686285, 0.97254902, 0.90196079, 0.988235295, 0.99019608, 0.5411765, 0.00980392, 0.00980392, 0.00980392, 0.00980392, 0.00980392, 0.00980392, 0.00980392, 0.00980392, 0.00980392, 0.00980392, 0.00980392, 0.00980392, 0.00980392, 0.00980392, 0.00980392, 0.00980392, 0.00980392, 0.00980392, 0.00980392, 0.15686275, 0.8039215799999999, 0.988235295, 0.988235295, 0.988235295, 0.988235295, 0.988235295, 0.988235295, 0.8352941300000001, 0.121568635, 0.00980392, 0.00980392, 0.00980392, 0.00980392, 0.00980392, 0.00980392, 0.00980392, 0.00980392, 0.00980392, 0.00980392, 0.00980392, 0.00980392, 0.00980392, 0.00980392, 0.00980392, 0.00980392, 0.00980392, 0.066666665, 0.8235294200000001, 0.988235295, 0.988235295, 0.988235295, 0.988235295, 0.9254902, 0.988235295, 0.988235295, 0.988235295, 0.490196095, 0.00980392, 0.00980392, 0.00980392, 0.00980392, 0.00980392, 0.00980392, 0.00980392, 0.00980392, 0.00980392, 0.00980392, 0.00980392, 0.00980392, 0.00980392, 0.00980392, 0.00980392, 0.00980392, 0.00980392, 0.38431373, 0.988235295, 0.988235295, 0.988235295, 0.596078455, 0.15686275, 0.101960785, 0.59215689, 0.988235295, 0.988235295, 0.6588235499999999, 0.00980392, 0.00980392, 0.00980392, 0.00980392, 0.00980392, 0.00980392, 0.00980392, 0.00980392, 0.00980392, 0.00980392, 0.00980392, 0.00980392, 0.00980392, 0.00980392, 0.00980392, 0.00980392, 0.00980392, 0.6509804100000001, 0.988235295, 0.988235295, 0.792156875, 0.17254902500000002, 0.00980392, 0.039215685, 0.81176472, 0.988235295, 0.988235295, 0.8039215799999999, 0.00980392, 0.00980392, 0.00980392, 0.00980392, 0.00980392, 0.00980392, 0.00980392, 0.00980392, 0.00980392, 0.00980392, 0.00980392, 0.00980392, 0.00980392, 0.00980392, 0.00980392, 0.00980392, 0.00980392, 0.20784313999999998, 0.984313725, 0.988235295, 0.9490196099999999, 0.32549020500000003, 0.5333333600000001, 0.7058823700000001, 0.988235295, 0.988235295, 0.988235295, 0.490196095, 0.00980392, 0.00980392, 0.00980392, 0.00980392, 0.00980392, 0.00980392, 0.00980392, 0.00980392, 0.00980392, 0.00980392, 0.00980392, 0.00980392, 0.00980392, 0.00980392, 0.00980392, 0.00980392, 0.00980392, 0.00980392, 0.741176485, 0.988235295, 0.988235295, 0.988235295, 0.988235295, 0.988235295, 0.988235295, 0.988235295, 0.988235295, 0.24705883, 0.00980392, 0.00980392, 0.00980392, 0.00980392, 0.00980392, 0.00980392, 0.00980392, 0.00980392, 0.00980392, 0.00980392, 0.00980392, 0.00980392, 0.00980392, 0.00980392, 0.00980392, 0.00980392, 0.00980392, 0.00980392, 0.015686275, 0.21960784500000002, 0.819607855, 0.988235295, 0.988235295, 0.988235295, 0.988235295, 0.988235295, 0.7882353049999999, 0.011764705, 0.00980392, 0.00980392, 0.00980392, 0.00980392, 0.00980392, 0.00980392, 0.00980392, 0.00980392, 0.00980392, 0.00980392, 0.00980392, 0.00980392, 0.00980392, 0.00980392, 0.00980392, 0.00980392, 0.00980392, 0.00980392, 0.00980392, 0.00980392, 0.34509805, 0.8941176550000001, 0.988235295, 0.988235295, 0.988235295, 0.93333334, 0.36078432, 0.00980392, 0.00980392, 0.00980392, 0.00980392, 0.00980392, 0.00980392, 0.00980392, 0.00980392, 0.00980392, 0.00980392, 0.00980392, 0.00980392, 0.00980392, 0.00980392, 0.00980392, 0.00980392, 0.00980392, 0.00980392, 0.00980392, 0.00980392, 0.00980392, 0.40392157500000003, 0.97254902, 0.988235295, 0.988235295, 0.988235295, 0.23921569, 0.00980392, 0.00980392, 0.00980392, 0.00980392, 0.00980392, 0.00980392, 0.00980392, 0.00980392, 0.00980392, 0.00980392, 0.00980392, 0.00980392, 0.00980392, 0.00980392, 0.00980392, 0.00980392, 0.00980392, 0.00980392, 0.00980392, 0.00980392, 0.00980392, 0.356862755, 0.97254902, 0.988235295, 0.988235295, 0.98627451, 0.6509804100000001, 0.01372549, 0.00980392, 0.00980392, 0.00980392, 0.00980392, 0.00980392, 0.00980392, 0.00980392, 0.00980392, 0.00980392, 0.00980392, 0.00980392, 0.00980392, 0.00980392, 0.00980392, 0.00980392, 0.00980392, 0.00980392, 0.00980392, 0.00980392, 0.00980392, 0.39215687, 0.90196079, 0.988235295, 0.988235295, 0.666666685, 0.44313726, 0.00980392, 0.00980392, 0.00980392, 0.00980392, 0.00980392, 0.00980392, 0.00980392, 0.00980392, 0.00980392, 0.00980392, 0.00980392, 0.00980392, 0.00980392, 0.00980392, 0.00980392, 0.00980392, 0.00980392, 0.00980392, 0.00980392, 0.00980392, 0.00980392, 0.37254903, 0.98627451, 0.988235295, 0.988235295, 0.89803922, 0.0627451, 0.00980392, 0.00980392, 0.00980392, 0.00980392, 0.00980392, 0.00980392, 0.00980392, 0.00980392, 0.00980392, 0.00980392, 0.00980392, 0.00980392, 0.00980392, 0.00980392, 0.00980392, 0.00980392, 0.00980392, 0.00980392, 0.00980392, 0.00980392, 0.00980392, 0.37254903, 0.890196085, 0.988235295, 0.988235295, 0.988235295, 0.521568655, 0.00980392, 0.00980392, 0.00980392, 0.00980392, 0.00980392, 0.00980392, 0.00980392, 0.00980392, 0.00980392, 0.00980392, 0.00980392, 0.00980392, 0.00980392, 0.00980392, 0.00980392, 0.00980392, 0.00980392, 0.00980392, 0.00980392, 0.00980392, 0.00980392, 0.149019615, 0.8941176550000001, 0.988235295, 0.988235295, 0.988235295, 0.792156875, 0.078431375, 0.00980392, 0.00980392, 0.00980392, 0.00980392, 0.00980392, 0.00980392, 0.00980392, 0.00980392, 0.00980392, 0.00980392, 0.00980392, 0.00980392, 0.00980392, 0.00980392, 0.00980392, 0.00980392, 0.00980392, 0.00980392, 0.00980392, 0.00980392, 0.00980392, 0.75686276, 0.988235295, 0.988235295, 0.988235295, 0.792156875, 0.082352945, 0.00980392, 0.00980392, 0.00980392, 0.00980392, 0.00980392, 0.00980392, 0.00980392, 0.00980392, 0.00980392, 0.00980392, 0.00980392, 0.00980392, 0.00980392, 0.00980392, 0.00980392, 0.00980392, 0.00980392, 0.00980392, 0.00980392, 0.00980392, 0.00980392, 0.356862755, 0.964705885, 0.988235295, 0.988235295, 0.9490196099999999, 0.352941185, 0.00980392, 0.00980392, 0.00980392, 0.00980392, 0.00980392, 0.00980392, 0.00980392, 0.00980392, 0.00980392, 0.00980392, 0.00980392, 0.00980392, 0.00980392, 0.00980392, 0.00980392, 0.00980392, 0.00980392, 0.00980392, 0.00980392, 0.00980392, 0.00980392, 0.13725490499999998, 0.9490196099999999, 0.988235295, 0.988235295, 0.988235295, 0.552941205, 0.00980392, 0.00980392, 0.00980392, 0.00980392, 0.00980392, 0.00980392, 0.00980392, 0.00980392, 0.00980392, 0.00980392, 0.00980392, 0.00980392, 0.00980392, 0.00980392, 0.00980392, 0.00980392, 0.00980392, 0.00980392, 0.00980392, 0.00980392, 0.00980392, 0.00980392, 0.00980392, 0.839215695, 0.988235295, 0.988235295, 0.72549021, 0.09019608, 0.00980392, 0.00980392, 0.00980392, 0.00980392, 0.00980392, 0.00980392, 0.00980392, 0.00980392, 0.00980392, 0.00980392, 0.00980392, 0.00980392, 0.00980392, 0.00980392, 0.00980392, 0.00980392, 0.00980392, 0.00980392, 0.00980392, 0.00980392, 0.00980392, 0.00980392, 0.00980392, 0.717647075, 0.988235295, 0.9686274500000001, 0.09411765, 0.00980392, 0.00980392, 0.00980392, 0.00980392, 0.00980392, 0.00980392, 0.00980392, 0.00980392, 0.00980392, 0.00980392, 0.00980392, 0.00980392, 0.00980392, 0.00980392, 0.00980392, 0.00980392, 0.00980392, 0.00980392, 0.00980392, 0.00980392, 0.00980392, 0.00980392, 0.00980392, 0.00980392, 0.00980392, 0.00980392, 0.00980392, 0.00980392, 0.00980392, 0.00980392, 0.00980392, 0.00980392, 0.00980392, 0.00980392, 0.00980392, 0.00980392, 0.00980392, 0.00980392, 0.00980392, 0.00980392, 0.00980392, 0.00980392, 0.00980392, 0.00980392, 0.00980392, 0.00980392, 0.00980392, 0.00980392, 0.00980392, 0.00980392, 0.00980392, 0.00980392, 0.00980392, 0.00980392, 0.00980392, 0.00980392, 0.00980392, 0.00980392, 0.00980392, 0.00980392, 0.00980392, 0.00980392, 0.00980392, 0.00980392, 0.00980392, 0.00980392, 0.00980392, 0.00980392, 0.00980392, 0.00980392, 0.00980392, 0.00980392, 0.00980392], ([-60.77901514727789, -41.272751067624995, -43.705991720196266, -51.621145190508685, -29.814677018223133, -49.3137438490348, -72.77536494449693, -22.06790980538573, -28.172796246721717, 2.407678847893435], [-58.24284885047299, -42.082693729119725, -40.68657711510646, -49.88609822009448, -28.009208632036948, -45.79898552886259, -69.36758900579349, -21.993453359634305, -31.520736858704755, 1.5651754446482018], 3.514758320172213))
[Thread 1] Total splits: 0
Processed 1 zonotopes (Work Done: 0.0%); Generated 0 (0.216052691s/loop)
[Thread 1] Finished in 0.22s
 ────────────────────────────────────────────────────────────────────────────────
                                        Time                    Allocations      
                               ───────────────────────   ────────────────────────
       Tot / % measured:            218ms / 100.0%            132MiB / 100.0%    

 Section               ncalls     time    %tot     avg     alloc    %tot      avg
 ────────────────────────────────────────────────────────────────────────────────
 Verify                     1    216ms   99.1%   216ms    122MiB   92.6%   122MiB
   Zonotope Loop            1    216ms   99.0%   216ms    122MiB   92.6%   122MiB
     Zonotope Propa...      1    189ms   86.8%   189ms    101MiB   76.3%   101MiB
       DiffZonotope...      2    133ms   60.9%  66.4ms   87.6MiB   66.3%  43.8MiB
         Zonotope_R...      4    132ms   60.5%  33.0ms   87.5MiB   66.2%  21.9MiB
           Column M...      4   71.0ms   32.5%  17.7ms   16.2MiB   12.3%  4.05MiB
           Influenc...      4   54.0ms   24.7%  13.5ms   54.9MiB   41.6%  13.7MiB
             Multiply       4   39.3ms   18.0%  9.82ms   30.1MiB   22.8%  7.52MiB
             Alloca...      4   11.4ms    5.2%  2.85ms   24.8MiB   18.8%  6.21MiB
             Set Ma...      4   3.25ms    1.5%   813μs     0.00B    0.0%    0.00B
           Allocation       4   4.84ms    2.2%  1.21ms   16.2MiB   12.3%  4.05MiB
           Set Matrix       4   2.07ms    0.9%   517μs   22.5KiB    0.0%  5.61KiB
           Vectors          4   82.0μs    0.0%  20.5μs    100KiB    0.1%  25.0KiB
           Bounds           4   2.11μs    0.0%   527ns     0.00B    0.0%    0.00B
       DiffZonotope...      3   56.6ms   25.9%  18.9ms   13.3MiB   10.1%  4.44MiB
         Zonotope_D...      6   56.6ms   25.9%  9.43ms   13.3MiB   10.1%  2.22MiB
     Property Check         1   1.66ms    0.8%  1.66ms    349KiB    0.3%   349KiB
 Initialize                 1   2.07ms    0.9%  2.07ms   9.84MiB    7.4%  9.84MiB
 ────────────────────────────────────────────────────────────────────────────────
[VERYDIFF_TIMER] 0.272155771

[VERYDIFF_EXPERIMENT] Running on /home/i57/steuber/NeuroDiff/repos/VeryDiffExperiments/src/../benchmarks/mnist-prune/specs/mnist_73_global_5.vnnlib /home/i57/steuber/NeuroDiff/repos/VeryDiffExperiments/src/../benchmarks/mnist-prune/nets/mnist_relu_3_100.onnx
Found input X
op: matmul, weight: (100, 784), bias: nothing
op: bias, weight: nothing, bias: (100,)
op: relu, weight: nothing, bias: nothing
op: matmul, weight: (100, 100), bias: nothing
op: bias, weight: nothing, bias: (100,)
op: relu, weight: nothing, bias: nothing
op: matmul, weight: (10, 100), bias: nothing
op: bias, weight: nothing, bias: (10,)
op: relu, weight: nothing, bias: nothing
op: matmul, weight: (10, 10), bias: nothing
op: bias, weight: nothing, bias: (10,)
Found input X
op: matmul, weight: (100, 784), bias: nothing
op: bias, weight: nothing, bias: (100,)
op: relu, weight: nothing, bias: nothing
op: matmul, weight: (100, 100), bias: nothing
op: bias, weight: nothing, bias: (100,)
op: relu, weight: nothing, bias: nothing
op: matmul, weight: (10, 100), bias: nothing
op: bias, weight: nothing, bias: (10,)
op: relu, weight: nothing, bias: nothing
op: matmul, weight: (10, 10), bias: nothing
op: bias, weight: nothing, bias: (10,)
Distance: 296.6600370998244
Distance: 77.24290861755458
Distance: 5.7170369567975285
Distance: 0.0
Running with 1 threads
[Thread 1] Time to first task: 0.0s
Zono Bounds:
[0.0, 0.0, 0.0, 0.0, 0.0, 0.0, 0.0, 0.0, 0.0, 0.0, 0.0, 0.0, 0.0, 0.0, 0.0, 0.0, 0.0, 0.0, 0.0, 0.0, 0.0, 0.0, 0.0, 0.0, 0.0, 0.0, 0.0, 0.0, 0.0, 0.0, 0.0, 0.0, 0.0, 0.0, 0.0, 0.0, 0.0, 0.0, 0.0, 0.0, 0.0, 0.0, 0.0, 0.0, 0.0, 0.0, 0.0, 0.0, 0.0, 0.0, 0.0, 0.0, 0.0, 0.0, 0.0, 0.0, 0.0, 0.0, 0.0, 0.0, 0.0, 0.0, 0.0, 0.0, 0.0, 0.0, 0.0, 0.0, 0.0, 0.0, 0.0, 0.0, 0.0, 0.0, 0.0, 0.0, 0.0, 0.0, 0.0, 0.0, 0.0, 0.0, 0.0, 0.0, 0.0, 0.0, 0.0, 0.0, 0.0, 0.0, 0.0, 0.0, 0.0, 0.0, 0.0, 0.0, 0.0, 0.0, 0.0, 0.0, 0.0, 0.0, 0.0, 0.0, 0.0, 0.0, 0.0, 0.0, 0.0, 0.0, 0.0, 0.0, 0.0, 0.0, 0.0, 0.0, 0.0, 0.0, 0.0, 0.0, 0.0, 0.0, 0.0, 0.0, 0.0, 0.0, 0.0, 0.0, 0.0, 0.0, 0.0, 0.0, 0.0, 0.0, 0.0, 0.0, 0.0, 0.0, 0.0, 0.0, 0.0, 0.0, 0.0, 0.0, 0.0, 0.0, 0.0, 0.0, 0.0, 0.0, 0.0, 0.0, 0.0, 0.0, 0.0, 0.0, 0.0, 0.0, 0.0, 0.0, 0.0, 0.0, 0.0, 0.0, 0.0, 0.0, 0.0, 0.0, 0.0, 0.0, 0.0, 0.0, 0.0, 0.0, 0.0, 0.0, 0.0, 0.0, 0.0, 0.0, 0.0, 0.0, 0.0, 0.0, 0.0, 0.0, 0.0, 0.0, 0.0, 0.0, 0.0, 0.0, 0.0, 0.0, 0.0, 0.0, 0.0, 0.0, 0.0, 0.0, 0.0, 0.0, 0.0, 0.0, 0.0, 0.0, 0.0, 0.0, 0.0, 0.0, 0.0, 0.0, 0.0, 0.0, 0.0, 0.0, 0.0, 0.0, 0.0, 0.0, 0.0, 0.0, 0.0, 0.0, 0.0, 0.0, 0.0, 0.0, 0.0, 0.0, 0.0, 0.0, 0.0, 0.0, 0.0, 0.0, 0.0, 0.0, 0.0, 0.0, 0.0, 0.0, 0.0, 0.0, 0.0, 0.0, 0.0, 0.0, 0.0, 0.0, 0.0, 0.0, 0.0, 0.0, 0.0, 0.0, 0.0, 0.0, 0.0, 0.0, 0.0, 0.0, 0.0, 0.0, 0.0, 0.0, 0.0, 0.0, 0.0, 0.0, 0.0, 0.0, 0.0, 0.0, 0.0, 0.0, 0.0, 0.0, 0.0, 0.0, 0.0, 0.0, 0.0, 0.0, 0.0, 0.0, 0.0, 0.0, 0.0, 0.0, 0.0, 0.0, 0.0, 0.0, 0.0, 0.0, 0.0, 0.0, 0.0, 0.0, 0.0, 0.0, 0.0, 0.0, 0.0, 0.0, 0.0, 0.0, 0.0, 0.0, 0.0, 0.0, 0.0, 0.0, 0.0, 0.0, 0.0, 0.0, 0.0, 0.0, 0.0, 0.0, 0.0, 0.0, 0.0, 0.0, 0.0, 0.0, 0.0, 0.0, 0.0, 0.0, 0.0, 0.0, 0.0, 0.0, 0.0, 0.0, 0.0, 0.0, 0.0, 0.0, 0.0, 0.0, 0.0, 0.0, 0.0, 0.0, 0.0, 0.0, 0.0, 0.0, 0.0, 0.0, 0.0, 0.0, 0.0, 0.0, 0.0, 0.0, 0.0, 0.0, 0.0, 0.0, 0.0, 0.0, 0.0, 0.0, 0.0, 0.0, 0.0, 0.0, 0.0, 0.0, 0.0, 0.0, 0.0, 0.0, 0.0, 0.0, 0.0, 0.0, 0.0, 0.0, 0.0, 0.0, 0.0, 0.0, 0.0, 0.0, 0.0, 0.0, 0.0, 0.0, 0.0, 0.0, 0.0, 0.0, 0.0, 0.0, 0.0, 0.0, 0.0, 0.0, 0.0, 0.0, 0.0, 0.0, 0.0, 0.0, 0.0, 0.0, 0.0, 0.0, 0.0, 0.0, 0.0, 0.0, 0.0, 0.0, 0.0, 0.0, 0.0, 0.0, 0.0, 0.0, 0.0, 0.0, 0.0, 0.0, 0.0, 0.0, 0.0, 0.0, 0.0, 0.0, 0.0, 0.0, 0.0, 0.0, 0.0, 0.0, 0.0, 0.0, 0.0, 0.0, 0.0, 0.0, 0.0, 0.0, 0.0, 0.0, 0.0, 0.0, 0.0, 0.0, 0.0, 0.0, 0.0, 0.0, 0.0, 0.0, 0.0, 0.0, 0.0, 0.0, 0.0, 0.0, 0.0, 0.0, 0.0, 0.0, 0.0, 0.0, 0.0, 0.0, 0.0, 0.0, 0.0, 0.0, 0.0, 0.0, 0.0, 0.0, 0.0, 0.0, 0.0, 0.0, 0.0, 0.0, 0.0, 0.0, 0.0, 0.0, 0.0, 0.0, 0.0, 0.0, 0.0, 0.0, 0.0, 0.0, 0.0, 0.0, 0.0, 0.0, 0.0, 0.0, 0.0, 0.0, 0.0, 0.0, 0.0, 0.0, 0.0, 0.0, 0.0, 0.0, 0.0, 0.0, 0.0, 0.0, 0.0, 0.0, 0.0, 0.0, 0.0, 0.0, 0.0, 0.0, 0.0, 0.0, 0.0, 0.0, 0.0, 0.0, 0.0, 0.0, 0.0, 0.0, 0.0, 0.0, 0.0, 0.0, 0.0, 0.0, 0.0, 0.0, 0.0, 0.0, 0.0, 0.0, 0.0, 0.0, 0.0, 0.0, 0.0, 0.0, 0.0, 0.0, 0.0, 0.0, 0.0, 0.0, 0.0, 0.0, 0.0, 0.0, 0.0, 0.0, 0.0, 0.0, 0.0, 0.0, 0.0, 0.0, 0.0, 0.0, 0.0, 0.0, 0.0, 0.0, 0.0, 0.0, 0.0, 0.0, 0.0, 0.0, 0.0, 0.0, 0.0, 0.0, 0.0, 0.0, 0.0, 0.0, 0.0, 0.0, 0.0, 0.0, 0.0, 0.0, 0.0, 0.0, 0.0, 0.0, 0.0, 0.0, 0.0, 0.0, 0.0, 0.0, 0.0, 0.0, 0.0, 0.0, 0.0, 0.0, 0.0, 0.0, 0.0, 0.0, 0.0, 0.0, 0.0, 0.0, 0.0, 0.0, 0.0, 0.0, 0.0, 0.0, 0.0, 0.0, 0.0, 0.0, 0.0, 0.0, 0.0, 0.0, 0.0, 0.0, 0.0, 0.0, 0.0, 0.0, 0.0, 0.0, 0.0, 0.0, 0.0, 0.0, 0.0, 0.0, 0.0, 0.0, 0.0, 0.0, 0.0, 0.0, 0.0, 0.0, 0.0, 0.0, 0.0, 0.0, 0.0, 0.0, 0.0, 0.0, 0.0, 0.0, 0.0, 0.0, 0.0, 0.0, 0.0, 0.0, 0.0, 0.0, 0.0, 0.0, 0.0, 0.0, 0.0, 0.0, 0.0, 0.0, 0.0, 0.0, 0.0, 0.0, 0.0, 0.0, 0.0, 0.0, 0.0, 0.0, 0.0, 0.0, 0.0, 0.0, 0.0, 0.0, 0.0, 0.0, 0.0, 0.0, 0.0, 0.0, 0.0, 0.0, 0.0, 0.0, 0.0, 0.0, 0.0, 0.0, 0.0, 0.0, 0.0, 0.0, 0.0, 0.0, 0.0, 0.0, 0.0, 0.0, 0.0, 0.0, 0.0, 0.0, 0.0, 0.0, 0.0, 0.0, 0.0, 0.0, 0.0, 0.0, 0.0, 0.0, 0.0, 0.0, 0.0, 0.0, 0.0, 0.0, 0.0, 0.0, 0.0, 0.0, 0.0, 0.0, 0.0, 0.0, 0.0, 0.0, 0.0, 0.0, 0.0, 0.0, 0.0, 0.0, 0.0, 0.0, 0.0, 0.0, 0.0, 0.0, 0.0, 0.0, 0.0, 0.0, 0.0, 0.0, 0.0, 0.0, 0.0, 0.0, 0.0, 0.0, 0.0, 0.0]
[0.0, 0.0, 0.0, 0.0, 0.0, 0.0, 0.0, 0.0, 0.0, 0.0, 0.0, 0.0, 0.0, 0.0, 0.0, 0.0, 0.0, 0.0, 0.0, 0.0, 0.0, 0.0, 0.0, 0.0, 0.0, 0.0, 0.0, 0.0, 0.0, 0.0, 0.0, 0.0, 0.0, 0.0, 0.0, 0.0, 0.0, 0.0, 0.0, 0.0, 0.0, 0.0, 0.0, 0.0, 0.0, 0.0, 0.0, 0.0, 0.0, 0.0, 0.0, 0.0, 0.0, 0.0, 0.0, 0.0, 0.0, 0.0, 0.0, 0.0, 0.0, 0.0, 0.0, 0.0, 0.0, 0.0, 0.0, 0.0, 0.0, 0.0, 0.0, 0.0, 0.0, 0.0, 0.0, 0.0, 0.0, 0.0, 0.0, 0.0, 0.0, 0.0, 0.0, 0.0, 0.0, 0.0, 0.0, 0.0, 0.0, 0.0, 0.0, 0.0, 0.0, 0.0, 0.0, 0.0, 0.0, 0.0, 0.0, 0.0, 0.0, 0.0, 0.0, 0.0, 0.0, 0.0, 0.0, 0.0, 0.0, 0.0, 0.0, 0.0, 0.0, 0.0, 0.0, 0.0, 0.0, 0.0, 0.0, 0.0, 0.0, 0.0, 0.0, 0.0, 0.0, 0.0, 0.0, 0.0, 0.0, 0.0, 0.0, 0.0, 0.0, 0.0, 0.0, 0.0, 0.0, 0.0, 0.0, 0.0, 0.0, 0.0, 0.0, 0.0, 0.0, 0.0, 0.0, 0.0, 0.0, 0.0, 0.0, 0.0, 0.0, 0.0, 0.0, 0.0, 0.0, 0.0, 0.0, 0.0, 0.0, 0.0, 0.0, 0.0, 0.0, 0.0, 0.0, 0.0, 0.0, 0.0, 0.0, 0.0, 0.0, 0.0, 0.0, 0.0, 0.0, 0.0, 0.0, 0.0, 0.0, 0.0, 0.0, 0.0, 0.0, 0.0, 0.0, 0.0, 0.0, 0.0, 0.0, 0.0, 0.0, 0.0, 0.0, 0.0, 0.0, 0.0, 0.0, 0.0, 0.0, 0.0, 0.0, 0.0, 0.0, 0.0, 0.0, 0.0, 0.0, 0.0, 0.0, 0.0, 0.0, 0.0, 0.0, 0.0, 0.0, 0.0, 0.0, 0.0, 0.0, 0.0, 0.0, 0.0, 0.0, 0.0, 0.0, 0.0, 0.0, 0.0, 0.0, 0.0, 0.0, 0.0, 0.0, 0.0, 0.0, 0.0, 0.0, 0.0, 0.0, 0.0, 0.0, 0.0, 0.0, 0.0, 0.0, 0.0, 0.0, 0.0, 0.0, 0.0, 0.0, 0.0, 0.0, 0.0, 0.0, 0.0, 0.0, 0.0, 0.0, 0.0, 0.0, 0.0, 0.0, 0.0, 0.0, 0.0, 0.0, 0.0, 0.0, 0.0, 0.0, 0.0, 0.0, 0.0, 0.0, 0.0, 0.0, 0.0, 0.0, 0.0, 0.0, 0.0, 0.0, 0.0, 0.0, 0.0, 0.0, 0.0, 0.0, 0.0, 0.0, 0.0, 0.0, 0.0, 0.0, 0.0, 0.0, 0.0, 0.0, 0.0, 0.0, 0.0, 0.0, 0.0, 0.0, 0.0, 0.0, 0.0, 0.0, 0.0, 0.0, 0.0, 0.0, 0.0, 0.0, 0.0, 0.0, 0.0, 0.0, 0.0, 0.0, 0.0, 0.0, 0.0, 0.0, 0.0, 0.0, 0.0, 0.0, 0.0, 0.0, 0.0, 0.0, 0.0, 0.0, 0.0, 0.0, 0.0, 0.0, 0.0, 0.0, 0.0, 0.0, 0.0, 0.0, 0.0, 0.0, 0.0, 0.0, 0.0, 0.0, 0.0, 0.0, 0.0, 0.0, 0.0, 0.0, 0.0, 0.0, 0.0, 0.0, 0.0, 0.0, 0.0, 0.0, 0.0, 0.0, 0.0, 0.0, 0.0, 0.0, 0.0, 0.0, 0.0, 0.0, 0.0, 0.0, 0.0, 0.0, 0.0, 0.0, 0.0, 0.0, 0.0, 0.0, 0.0, 0.0, 0.0, 0.0, 0.0, 0.0, 0.0, 0.0, 0.0, 0.0, 0.0, 0.0, 0.0, 0.0, 0.0, 0.0, 0.0, 0.0, 0.0, 0.0, 0.0, 0.0, 0.0, 0.0, 0.0, 0.0, 0.0, 0.0, 0.0, 0.0, 0.0, 0.0, 0.0, 0.0, 0.0, 0.0, 0.0, 0.0, 0.0, 0.0, 0.0, 0.0, 0.0, 0.0, 0.0, 0.0, 0.0, 0.0, 0.0, 0.0, 0.0, 0.0, 0.0, 0.0, 0.0, 0.0, 0.0, 0.0, 0.0, 0.0, 0.0, 0.0, 0.0, 0.0, 0.0, 0.0, 0.0, 0.0, 0.0, 0.0, 0.0, 0.0, 0.0, 0.0, 0.0, 0.0, 0.0, 0.0, 0.0, 0.0, 0.0, 0.0, 0.0, 0.0, 0.0, 0.0, 0.0, 0.0, 0.0, 0.0, 0.0, 0.0, 0.0, 0.0, 0.0, 0.0, 0.0, 0.0, 0.0, 0.0, 0.0, 0.0, 0.0, 0.0, 0.0, 0.0, 0.0, 0.0, 0.0, 0.0, 0.0, 0.0, 0.0, 0.0, 0.0, 0.0, 0.0, 0.0, 0.0, 0.0, 0.0, 0.0, 0.0, 0.0, 0.0, 0.0, 0.0, 0.0, 0.0, 0.0, 0.0, 0.0, 0.0, 0.0, 0.0, 0.0, 0.0, 0.0, 0.0, 0.0, 0.0, 0.0, 0.0, 0.0, 0.0, 0.0, 0.0, 0.0, 0.0, 0.0, 0.0, 0.0, 0.0, 0.0, 0.0, 0.0, 0.0, 0.0, 0.0, 0.0, 0.0, 0.0, 0.0, 0.0, 0.0, 0.0, 0.0, 0.0, 0.0, 0.0, 0.0, 0.0, 0.0, 0.0, 0.0, 0.0, 0.0, 0.0, 0.0, 0.0, 0.0, 0.0, 0.0, 0.0, 0.0, 0.0, 0.0, 0.0, 0.0, 0.0, 0.0, 0.0, 0.0, 0.0, 0.0, 0.0, 0.0, 0.0, 0.0, 0.0, 0.0, 0.0, 0.0, 0.0, 0.0, 0.0, 0.0, 0.0, 0.0, 0.0, 0.0, 0.0, 0.0, 0.0, 0.0, 0.0, 0.0, 0.0, 0.0, 0.0, 0.0, 0.0, 0.0, 0.0, 0.0, 0.0, 0.0, 0.0, 0.0, 0.0, 0.0, 0.0, 0.0, 0.0, 0.0, 0.0, 0.0, 0.0, 0.0, 0.0, 0.0, 0.0, 0.0, 0.0, 0.0, 0.0, 0.0, 0.0, 0.0, 0.0, 0.0, 0.0, 0.0, 0.0, 0.0, 0.0, 0.0, 0.0, 0.0, 0.0, 0.0, 0.0, 0.0, 0.0, 0.0, 0.0, 0.0, 0.0, 0.0, 0.0, 0.0, 0.0, 0.0, 0.0, 0.0, 0.0, 0.0, 0.0, 0.0, 0.0, 0.0, 0.0, 0.0, 0.0, 0.0, 0.0, 0.0, 0.0, 0.0, 0.0, 0.0, 0.0, 0.0, 0.0, 0.0, 0.0, 0.0, 0.0, 0.0, 0.0, 0.0, 0.0, 0.0, 0.0, 0.0, 0.0, 0.0, 0.0, 0.0, 0.0, 0.0, 0.0, 0.0, 0.0, 0.0, 0.0, 0.0, 0.0, 0.0, 0.0, 0.0, 0.0, 0.0, 0.0, 0.0, 0.0, 0.0, 0.0, 0.0, 0.0, 0.0, 0.0, 0.0, 0.0, 0.0, 0.0, 0.0, 0.0, 0.0, 0.0, 0.0, 0.0, 0.0, 0.0, 0.0, 0.0, 0.0, 0.0, 0.0, 0.0, 0.0, 0.0, 0.0, 0.0, 0.0, 0.0, 0.0, 0.0, 0.0, 0.0, 0.0, 0.0, 0.0, 0.0, 0.0, 0.0, 0.0, 0.0, 0.0, 0.0, 0.0, 0.0, 0.0, 0.0, 0.0, 0.0, 0.0, 0.0, 0.0, 0.0, 0.0, 0.0, 0.0, 0.0, 0.0, 0.0, 0.0, 0.0, 0.0, 0.0, 0.0, 0.0, 0.0, 0.0, 0.0, 0.0, 0.0]
[Thread 1] Processed 100 zonotopes (Work Done: 0.0%; Expected Zonos: Inf)
[Thread 1] Processed 200 zonotopes (Work Done: 0.0%; Expected Zonos: Inf)
[Thread 1] Processed 300 zonotopes (Work Done: 0.0%; Expected Zonos: Inf)
[Thread 1] Processed 400 zonotopes (Work Done: 0.0%; Expected Zonos: Inf)
[Thread 1] Processed 500 zonotopes (Work Done: 0.0%; Expected Zonos: Inf)
[Thread 1] Processed 600 zonotopes (Work Done: 0.0%; Expected Zonos: Inf)


TIMEOUT REACHED
UNKNOWN
[Thread 1] Total splits: 604
Processed 604 zonotopes (Work Done: 0.0%); Generated 1208 (0.19873600411423842s/loop)
[Thread 1] Finished in 120.04s
 ────────────────────────────────────────────────────────────────────────────────
                                        Time                    Allocations      
                               ───────────────────────   ────────────────────────
       Tot / % measured:             120s / 100.0%           62.1GiB / 100.0%    

 Section               ncalls     time    %tot     avg     alloc    %tot      avg
 ────────────────────────────────────────────────────────────────────────────────
 Verify                     1     120s  100.0%    120s   62.1GiB  100.0%  62.1GiB
   Zonotope Loop            1     120s  100.0%    120s   62.1GiB  100.0%  62.1GiB
     Zonotope Propa...    604    71.6s   59.7%   119ms   41.1GiB   66.3%  69.8MiB
       DiffZonotope...  1.81k    63.5s   52.9%  35.0ms   39.5GiB   63.7%  22.3MiB
         Zonotope_R...  3.62k    63.4s   52.8%  17.5ms   39.5GiB   63.7%  11.2MiB
           Influenc...  3.62k    62.5s   52.1%  17.3ms   36.3GiB   58.5%  10.3MiB
             Multiply   3.62k    37.4s   31.1%  10.3ms   18.5GiB   29.7%  5.21MiB
             Alloca...  3.62k    22.5s   18.8%  6.21ms   17.9GiB   28.8%  5.06MiB
             Set Ma...  3.62k    2.65s    2.2%   730μs     0.00B    0.0%    0.00B
           Column M...  3.62k    507ms    0.4%   140μs   1.58GiB    2.6%   458KiB
           Set Matrix   3.62k    203ms    0.2%  56.0μs   3.26MiB    0.0%     943B
           Allocation   3.62k   95.6ms    0.1%  26.4μs   1.58GiB    2.6%   458KiB
           Vectors      3.62k   18.4ms    0.0%  5.07μs   11.5MiB    0.0%  3.26KiB
           Bounds       3.62k   1.90ms    0.0%   524ns     0.00B    0.0%    0.00B
       DiffZonotope...  2.42k    8.17s    6.8%  3.38ms   1.60GiB    2.6%   695KiB
         Zonotope_D...  4.83k    8.16s    6.8%  1.69ms   1.60GiB    2.6%   347KiB
     Compute Split        604    15.1s   12.6%  25.1ms   9.06GiB   14.6%  15.4MiB
     Property Check       604    136ms    0.1%   225μs    124MiB    0.2%   211KiB
 Initialize                 1    513μs    0.0%   513μs   5.41MiB    0.0%  5.41MiB
 ────────────────────────────────────────────────────────────────────────────────
[VERYDIFF_TIMER] 120.06700722

[VERYDIFF_EXPERIMENT] Running on /home/i57/steuber/NeuroDiff/repos/VeryDiffExperiments/src/../benchmarks/mnist-prune/specs/mnist_73_global_5.vnnlib /home/i57/steuber/NeuroDiff/repos/VeryDiffExperiments/src/../benchmarks/mnist-prune/nets/mnist_relu_4_1024.onnx
Found input X
op: matmul, weight: (1024, 784), bias: nothing
op: bias, weight: nothing, bias: (1024,)
op: relu, weight: nothing, bias: nothing
op: matmul, weight: (1024, 1024), bias: nothing
op: bias, weight: nothing, bias: (1024,)
op: relu, weight: nothing, bias: nothing
op: matmul, weight: (1024, 1024), bias: nothing
op: bias, weight: nothing, bias: (1024,)
op: relu, weight: nothing, bias: nothing
op: matmul, weight: (10, 1024), bias: nothing
op: bias, weight: nothing, bias: (10,)
op: relu, weight: nothing, bias: nothing
op: matmul, weight: (10, 10), bias: nothing
op: bias, weight: nothing, bias: (10,)
Found input X
op: matmul, weight: (1024, 784), bias: nothing
op: bias, weight: nothing, bias: (1024,)
op: relu, weight: nothing, bias: nothing
op: matmul, weight: (1024, 1024), bias: nothing
op: bias, weight: nothing, bias: (1024,)
op: relu, weight: nothing, bias: nothing
op: matmul, weight: (1024, 1024), bias: nothing
op: bias, weight: nothing, bias: (1024,)
op: relu, weight: nothing, bias: nothing
op: matmul, weight: (10, 1024), bias: nothing
op: bias, weight: nothing, bias: (10,)
op: relu, weight: nothing, bias: nothing
op: matmul, weight: (10, 10), bias: nothing
op: bias, weight: nothing, bias: (10,)
Distance: 1266.8815759184893
Distance: 2876.6944248261216
Distance: 2831.8843567411013
Distance: 34.033756025192815
Distance: 0.0
Running with 1 threads
[Thread 1] Time to first task: 0.01s
Zono Bounds:
[0.0, 0.0, 0.0, 0.0, 0.0, 0.0, 0.0, 0.0, 0.0, 0.0, 0.0, 0.0, 0.0, 0.0, 0.0, 0.0, 0.0, 0.0, 0.0, 0.0, 0.0, 0.0, 0.0, 0.0, 0.0, 0.0, 0.0, 0.0, 0.0, 0.0, 0.0, 0.0, 0.0, 0.0, 0.0, 0.0, 0.0, 0.0, 0.0, 0.0, 0.0, 0.0, 0.0, 0.0, 0.0, 0.0, 0.0, 0.0, 0.0, 0.0, 0.0, 0.0, 0.0, 0.0, 0.0, 0.0, 0.0, 0.0, 0.0, 0.0, 0.0, 0.0, 0.0, 0.0, 0.0, 0.0, 0.0, 0.0, 0.0, 0.0, 0.0, 0.0, 0.0, 0.0, 0.0, 0.0, 0.0, 0.0, 0.0, 0.0, 0.0, 0.0, 0.0, 0.0, 0.0, 0.0, 0.0, 0.0, 0.0, 0.0, 0.0, 0.0, 0.0, 0.0, 0.0, 0.0, 0.0, 0.0, 0.0, 0.0, 0.0, 0.0, 0.0, 0.0, 0.0, 0.0, 0.0, 0.0, 0.0, 0.0, 0.0, 0.0, 0.0, 0.0, 0.0, 0.0, 0.0, 0.0, 0.0, 0.0, 0.0, 0.0, 0.0, 0.0, 0.0, 0.0, 0.0, 0.0, 0.0, 0.0, 0.0, 0.0, 0.0, 0.0, 0.0, 0.0, 0.0, 0.0, 0.0, 0.0, 0.0, 0.0, 0.0, 0.0, 0.0, 0.0, 0.0, 0.0, 0.0, 0.0, 0.0, 0.0, 0.0, 0.0, 0.0, 0.0, 0.0, 0.0, 0.0, 0.0, 0.0, 0.0, 0.0, 0.0, 0.0, 0.0, 0.0, 0.0, 0.0, 0.0, 0.0, 0.0, 0.0, 0.0, 0.0, 0.0, 0.0, 0.0, 0.0, 0.0, 0.0, 0.0, 0.0, 0.0, 0.0, 0.0, 0.0, 0.0, 0.0, 0.0, 0.0, 0.0, 0.0, 0.0, 0.0, 0.0, 0.0, 0.0, 0.0, 0.0, 0.0, 0.0, 0.0, 0.0, 0.0, 0.0, 0.0, 0.0, 0.0, 0.0, 0.0, 0.0, 0.0, 0.0, 0.0, 0.0, 0.0, 0.0, 0.0, 0.0, 0.0, 0.0, 0.0, 0.0, 0.0, 0.0, 0.0, 0.0, 0.0, 0.0, 0.0, 0.0, 0.0, 0.0, 0.0, 0.0, 0.0, 0.0, 0.0, 0.0, 0.0, 0.0, 0.0, 0.0, 0.0, 0.0, 0.0, 0.0, 0.0, 0.0, 0.0, 0.0, 0.0, 0.0, 0.0, 0.0, 0.0, 0.0, 0.0, 0.0, 0.0, 0.0, 0.0, 0.0, 0.0, 0.0, 0.0, 0.0, 0.0, 0.0, 0.0, 0.0, 0.0, 0.0, 0.0, 0.0, 0.0, 0.0, 0.0, 0.0, 0.0, 0.0, 0.0, 0.0, 0.0, 0.0, 0.0, 0.0, 0.0, 0.0, 0.0, 0.0, 0.0, 0.0, 0.0, 0.0, 0.0, 0.0, 0.0, 0.0, 0.0, 0.0, 0.0, 0.0, 0.0, 0.0, 0.0, 0.0, 0.0, 0.0, 0.0, 0.0, 0.0, 0.0, 0.0, 0.0, 0.0, 0.0, 0.0, 0.0, 0.0, 0.0, 0.0, 0.0, 0.0, 0.0, 0.0, 0.0, 0.0, 0.0, 0.0, 0.0, 0.0, 0.0, 0.0, 0.0, 0.0, 0.0, 0.0, 0.0, 0.0, 0.0, 0.0, 0.0, 0.0, 0.0, 0.0, 0.0, 0.0, 0.0, 0.0, 0.0, 0.0, 0.0, 0.0, 0.0, 0.0, 0.0, 0.0, 0.0, 0.0, 0.0, 0.0, 0.0, 0.0, 0.0, 0.0, 0.0, 0.0, 0.0, 0.0, 0.0, 0.0, 0.0, 0.0, 0.0, 0.0, 0.0, 0.0, 0.0, 0.0, 0.0, 0.0, 0.0, 0.0, 0.0, 0.0, 0.0, 0.0, 0.0, 0.0, 0.0, 0.0, 0.0, 0.0, 0.0, 0.0, 0.0, 0.0, 0.0, 0.0, 0.0, 0.0, 0.0, 0.0, 0.0, 0.0, 0.0, 0.0, 0.0, 0.0, 0.0, 0.0, 0.0, 0.0, 0.0, 0.0, 0.0, 0.0, 0.0, 0.0, 0.0, 0.0, 0.0, 0.0, 0.0, 0.0, 0.0, 0.0, 0.0, 0.0, 0.0, 0.0, 0.0, 0.0, 0.0, 0.0, 0.0, 0.0, 0.0, 0.0, 0.0, 0.0, 0.0, 0.0, 0.0, 0.0, 0.0, 0.0, 0.0, 0.0, 0.0, 0.0, 0.0, 0.0, 0.0, 0.0, 0.0, 0.0, 0.0, 0.0, 0.0, 0.0, 0.0, 0.0, 0.0, 0.0, 0.0, 0.0, 0.0, 0.0, 0.0, 0.0, 0.0, 0.0, 0.0, 0.0, 0.0, 0.0, 0.0, 0.0, 0.0, 0.0, 0.0, 0.0, 0.0, 0.0, 0.0, 0.0, 0.0, 0.0, 0.0, 0.0, 0.0, 0.0, 0.0, 0.0, 0.0, 0.0, 0.0, 0.0, 0.0, 0.0, 0.0, 0.0, 0.0, 0.0, 0.0, 0.0, 0.0, 0.0, 0.0, 0.0, 0.0, 0.0, 0.0, 0.0, 0.0, 0.0, 0.0, 0.0, 0.0, 0.0, 0.0, 0.0, 0.0, 0.0, 0.0, 0.0, 0.0, 0.0, 0.0, 0.0, 0.0, 0.0, 0.0, 0.0, 0.0, 0.0, 0.0, 0.0, 0.0, 0.0, 0.0, 0.0, 0.0, 0.0, 0.0, 0.0, 0.0, 0.0, 0.0, 0.0, 0.0, 0.0, 0.0, 0.0, 0.0, 0.0, 0.0, 0.0, 0.0, 0.0, 0.0, 0.0, 0.0, 0.0, 0.0, 0.0, 0.0, 0.0, 0.0, 0.0, 0.0, 0.0, 0.0, 0.0, 0.0, 0.0, 0.0, 0.0, 0.0, 0.0, 0.0, 0.0, 0.0, 0.0, 0.0, 0.0, 0.0, 0.0, 0.0, 0.0, 0.0, 0.0, 0.0, 0.0, 0.0, 0.0, 0.0, 0.0, 0.0, 0.0, 0.0, 0.0, 0.0, 0.0, 0.0, 0.0, 0.0, 0.0, 0.0, 0.0, 0.0, 0.0, 0.0, 0.0, 0.0, 0.0, 0.0, 0.0, 0.0, 0.0, 0.0, 0.0, 0.0, 0.0, 0.0, 0.0, 0.0, 0.0, 0.0, 0.0, 0.0, 0.0, 0.0, 0.0, 0.0, 0.0, 0.0, 0.0, 0.0, 0.0, 0.0, 0.0, 0.0, 0.0, 0.0, 0.0, 0.0, 0.0, 0.0, 0.0, 0.0, 0.0, 0.0, 0.0, 0.0, 0.0, 0.0, 0.0, 0.0, 0.0, 0.0, 0.0, 0.0, 0.0, 0.0, 0.0, 0.0, 0.0, 0.0, 0.0, 0.0, 0.0, 0.0, 0.0, 0.0, 0.0, 0.0, 0.0, 0.0, 0.0, 0.0, 0.0, 0.0, 0.0, 0.0, 0.0, 0.0, 0.0, 0.0, 0.0, 0.0, 0.0, 0.0, 0.0, 0.0, 0.0, 0.0, 0.0, 0.0, 0.0, 0.0, 0.0, 0.0, 0.0, 0.0, 0.0, 0.0, 0.0, 0.0, 0.0, 0.0, 0.0, 0.0, 0.0, 0.0, 0.0, 0.0, 0.0, 0.0, 0.0, 0.0, 0.0, 0.0, 0.0, 0.0, 0.0, 0.0, 0.0, 0.0, 0.0, 0.0, 0.0, 0.0, 0.0, 0.0, 0.0, 0.0, 0.0, 0.0, 0.0, 0.0, 0.0, 0.0, 0.0, 0.0, 0.0, 0.0, 0.0, 0.0, 0.0, 0.0, 0.0, 0.0, 0.0, 0.0, 0.0, 0.0, 0.0, 0.0, 0.0, 0.0, 0.0, 0.0, 0.0, 0.0, 0.0, 0.0, 0.0, 0.0, 0.0, 0.0, 0.0, 0.0, 0.0, 0.0, 0.0, 0.0, 0.0, 0.0, 0.0, 0.0]
[0.0, 0.0, 0.0, 0.0, 0.0, 0.0, 0.0, 0.0, 0.0, 0.0, 0.0, 0.0, 0.0, 0.0, 0.0, 0.0, 0.0, 0.0, 0.0, 0.0, 0.0, 0.0, 0.0, 0.0, 0.0, 0.0, 0.0, 0.0, 0.0, 0.0, 0.0, 0.0, 0.0, 0.0, 0.0, 0.0, 0.0, 0.0, 0.0, 0.0, 0.0, 0.0, 0.0, 0.0, 0.0, 0.0, 0.0, 0.0, 0.0, 0.0, 0.0, 0.0, 0.0, 0.0, 0.0, 0.0, 0.0, 0.0, 0.0, 0.0, 0.0, 0.0, 0.0, 0.0, 0.0, 0.0, 0.0, 0.0, 0.0, 0.0, 0.0, 0.0, 0.0, 0.0, 0.0, 0.0, 0.0, 0.0, 0.0, 0.0, 0.0, 0.0, 0.0, 0.0, 0.0, 0.0, 0.0, 0.0, 0.0, 0.0, 0.0, 0.0, 0.0, 0.0, 0.0, 0.0, 0.0, 0.0, 0.0, 0.0, 0.0, 0.0, 0.0, 0.0, 0.0, 0.0, 0.0, 0.0, 0.0, 0.0, 0.0, 0.0, 0.0, 0.0, 0.0, 0.0, 0.0, 0.0, 0.0, 0.0, 0.0, 0.0, 0.0, 0.0, 0.0, 0.0, 0.0, 0.0, 0.0, 0.0, 0.0, 0.0, 0.0, 0.0, 0.0, 0.0, 0.0, 0.0, 0.0, 0.0, 0.0, 0.0, 0.0, 0.0, 0.0, 0.0, 0.0, 0.0, 0.0, 0.0, 0.0, 0.0, 0.0, 0.0, 0.0, 0.0, 0.0, 0.0, 0.0, 0.0, 0.0, 0.0, 0.0, 0.0, 0.0, 0.0, 0.0, 0.0, 0.0, 0.0, 0.0, 0.0, 0.0, 0.0, 0.0, 0.0, 0.0, 0.0, 0.0, 0.0, 0.0, 0.0, 0.0, 0.0, 0.0, 0.0, 0.0, 0.0, 0.0, 0.0, 0.0, 0.0, 0.0, 0.0, 0.0, 0.0, 0.0, 0.0, 0.0, 0.0, 0.0, 0.0, 0.0, 0.0, 0.0, 0.0, 0.0, 0.0, 0.0, 0.0, 0.0, 0.0, 0.0, 0.0, 0.0, 0.0, 0.0, 0.0, 0.0, 0.0, 0.0, 0.0, 0.0, 0.0, 0.0, 0.0, 0.0, 0.0, 0.0, 0.0, 0.0, 0.0, 0.0, 0.0, 0.0, 0.0, 0.0, 0.0, 0.0, 0.0, 0.0, 0.0, 0.0, 0.0, 0.0, 0.0, 0.0, 0.0, 0.0, 0.0, 0.0, 0.0, 0.0, 0.0, 0.0, 0.0, 0.0, 0.0, 0.0, 0.0, 0.0, 0.0, 0.0, 0.0, 0.0, 0.0, 0.0, 0.0, 0.0, 0.0, 0.0, 0.0, 0.0, 0.0, 0.0, 0.0, 0.0, 0.0, 0.0, 0.0, 0.0, 0.0, 0.0, 0.0, 0.0, 0.0, 0.0, 0.0, 0.0, 0.0, 0.0, 0.0, 0.0, 0.0, 0.0, 0.0, 0.0, 0.0, 0.0, 0.0, 0.0, 0.0, 0.0, 0.0, 0.0, 0.0, 0.0, 0.0, 0.0, 0.0, 0.0, 0.0, 0.0, 0.0, 0.0, 0.0, 0.0, 0.0, 0.0, 0.0, 0.0, 0.0, 0.0, 0.0, 0.0, 0.0, 0.0, 0.0, 0.0, 0.0, 0.0, 0.0, 0.0, 0.0, 0.0, 0.0, 0.0, 0.0, 0.0, 0.0, 0.0, 0.0, 0.0, 0.0, 0.0, 0.0, 0.0, 0.0, 0.0, 0.0, 0.0, 0.0, 0.0, 0.0, 0.0, 0.0, 0.0, 0.0, 0.0, 0.0, 0.0, 0.0, 0.0, 0.0, 0.0, 0.0, 0.0, 0.0, 0.0, 0.0, 0.0, 0.0, 0.0, 0.0, 0.0, 0.0, 0.0, 0.0, 0.0, 0.0, 0.0, 0.0, 0.0, 0.0, 0.0, 0.0, 0.0, 0.0, 0.0, 0.0, 0.0, 0.0, 0.0, 0.0, 0.0, 0.0, 0.0, 0.0, 0.0, 0.0, 0.0, 0.0, 0.0, 0.0, 0.0, 0.0, 0.0, 0.0, 0.0, 0.0, 0.0, 0.0, 0.0, 0.0, 0.0, 0.0, 0.0, 0.0, 0.0, 0.0, 0.0, 0.0, 0.0, 0.0, 0.0, 0.0, 0.0, 0.0, 0.0, 0.0, 0.0, 0.0, 0.0, 0.0, 0.0, 0.0, 0.0, 0.0, 0.0, 0.0, 0.0, 0.0, 0.0, 0.0, 0.0, 0.0, 0.0, 0.0, 0.0, 0.0, 0.0, 0.0, 0.0, 0.0, 0.0, 0.0, 0.0, 0.0, 0.0, 0.0, 0.0, 0.0, 0.0, 0.0, 0.0, 0.0, 0.0, 0.0, 0.0, 0.0, 0.0, 0.0, 0.0, 0.0, 0.0, 0.0, 0.0, 0.0, 0.0, 0.0, 0.0, 0.0, 0.0, 0.0, 0.0, 0.0, 0.0, 0.0, 0.0, 0.0, 0.0, 0.0, 0.0, 0.0, 0.0, 0.0, 0.0, 0.0, 0.0, 0.0, 0.0, 0.0, 0.0, 0.0, 0.0, 0.0, 0.0, 0.0, 0.0, 0.0, 0.0, 0.0, 0.0, 0.0, 0.0, 0.0, 0.0, 0.0, 0.0, 0.0, 0.0, 0.0, 0.0, 0.0, 0.0, 0.0, 0.0, 0.0, 0.0, 0.0, 0.0, 0.0, 0.0, 0.0, 0.0, 0.0, 0.0, 0.0, 0.0, 0.0, 0.0, 0.0, 0.0, 0.0, 0.0, 0.0, 0.0, 0.0, 0.0, 0.0, 0.0, 0.0, 0.0, 0.0, 0.0, 0.0, 0.0, 0.0, 0.0, 0.0, 0.0, 0.0, 0.0, 0.0, 0.0, 0.0, 0.0, 0.0, 0.0, 0.0, 0.0, 0.0, 0.0, 0.0, 0.0, 0.0, 0.0, 0.0, 0.0, 0.0, 0.0, 0.0, 0.0, 0.0, 0.0, 0.0, 0.0, 0.0, 0.0, 0.0, 0.0, 0.0, 0.0, 0.0, 0.0, 0.0, 0.0, 0.0, 0.0, 0.0, 0.0, 0.0, 0.0, 0.0, 0.0, 0.0, 0.0, 0.0, 0.0, 0.0, 0.0, 0.0, 0.0, 0.0, 0.0, 0.0, 0.0, 0.0, 0.0, 0.0, 0.0, 0.0, 0.0, 0.0, 0.0, 0.0, 0.0, 0.0, 0.0, 0.0, 0.0, 0.0, 0.0, 0.0, 0.0, 0.0, 0.0, 0.0, 0.0, 0.0, 0.0, 0.0, 0.0, 0.0, 0.0, 0.0, 0.0, 0.0, 0.0, 0.0, 0.0, 0.0, 0.0, 0.0, 0.0, 0.0, 0.0, 0.0, 0.0, 0.0, 0.0, 0.0, 0.0, 0.0, 0.0, 0.0, 0.0, 0.0, 0.0, 0.0, 0.0, 0.0, 0.0, 0.0, 0.0, 0.0, 0.0, 0.0, 0.0, 0.0, 0.0, 0.0, 0.0, 0.0, 0.0, 0.0, 0.0, 0.0, 0.0, 0.0, 0.0, 0.0, 0.0, 0.0, 0.0, 0.0, 0.0, 0.0, 0.0, 0.0, 0.0, 0.0, 0.0, 0.0, 0.0, 0.0, 0.0, 0.0, 0.0, 0.0, 0.0, 0.0, 0.0, 0.0, 0.0, 0.0, 0.0, 0.0, 0.0, 0.0, 0.0, 0.0, 0.0, 0.0, 0.0, 0.0, 0.0, 0.0, 0.0, 0.0, 0.0, 0.0, 0.0, 0.0, 0.0, 0.0, 0.0, 0.0, 0.0, 0.0, 0.0, 0.0, 0.0, 0.0, 0.0, 0.0, 0.0, 0.0, 0.0, 0.0, 0.0, 0.0, 0.0, 0.0, 0.0, 0.0, 0.0, 0.0, 0.0, 0.0, 0.0, 0.0, 0.0, 0.0, 0.0, 0.0, 0.0, 0.0, 0.0, 0.0, 0.0, 0.0, 0.0, 0.0, 0.0, 0.0, 0.0, 0.0, 0.0, 0.0, 0.0, 0.0, 0.0, 0.0]

Found counterexample: ([0.00980392, 0.00980392, 0.00980392, 0.00980392, 0.00980392, 0.00980392, 0.00980392, 0.00980392, 0.00980392, 0.00980392, 0.00980392, 0.00980392, 0.00980392, 0.00980392, 0.00980392, 0.00980392, 0.00980392, 0.00980392, 0.00980392, 0.00980392, 0.00980392, 0.00980392, 0.00980392, 0.00980392, 0.00980392, 0.00980392, 0.00980392, 0.00980392, 0.00980392, 0.00980392, 0.00980392, 0.00980392, 0.00980392, 0.00980392, 0.00980392, 0.00980392, 0.00980392, 0.00980392, 0.00980392, 0.00980392, 0.00980392, 0.00980392, 0.00980392, 0.00980392, 0.00980392, 0.00980392, 0.00980392, 0.00980392, 0.00980392, 0.00980392, 0.00980392, 0.00980392, 0.00980392, 0.00980392, 0.00980392, 0.00980392, 0.00980392, 0.00980392, 0.00980392, 0.00980392, 0.00980392, 0.00980392, 0.00980392, 0.00980392, 0.00980392, 0.00980392, 0.00980392, 0.00980392, 0.00980392, 0.00980392, 0.00980392, 0.00980392, 0.00980392, 0.00980392, 0.00980392, 0.00980392, 0.00980392, 0.00980392, 0.00980392, 0.00980392, 0.00980392, 0.00980392, 0.00980392, 0.00980392, 0.00980392, 0.00980392, 0.00980392, 0.00980392, 0.00980392, 0.00980392, 0.00980392, 0.00980392, 0.00980392, 0.00980392, 0.00980392, 0.00980392, 0.00980392, 0.00980392, 0.00980392, 0.00980392, 0.00980392, 0.00980392, 0.00980392, 0.00980392, 0.00980392, 0.00980392, 0.00980392, 0.00980392, 0.00980392, 0.00980392, 0.00980392, 0.00980392, 0.00980392, 0.00980392, 0.00980392, 0.00980392, 0.00980392, 0.00980392, 0.00980392, 0.00980392, 0.00980392, 0.00980392, 0.00980392, 0.00980392, 0.00980392, 0.00980392, 0.00980392, 0.00980392, 0.00980392, 0.00980392, 0.00980392, 0.00980392, 0.00980392, 0.00980392, 0.00980392, 0.00980392, 0.00980392, 0.00980392, 0.00980392, 0.00980392, 0.00980392, 0.00980392, 0.00980392, 0.00980392, 0.00980392, 0.00980392, 0.00980392, 0.00980392, 0.00980392, 0.00980392, 0.00980392, 0.00980392, 0.00980392, 0.00980392, 0.00980392, 0.00980392, 0.00980392, 0.00980392, 0.00980392, 0.00980392, 0.00980392, 0.00980392, 0.00980392, 0.00980392, 0.00980392, 0.00980392, 0.00980392, 0.00980392, 0.00980392, 0.00980392, 0.00980392, 0.00980392, 0.00980392, 0.00980392, 0.00980392, 0.00980392, 0.00980392, 0.00980392, 0.00980392, 0.00980392, 0.17647058999999998, 0.60392159, 0.815686285, 0.97254902, 0.90196079, 0.988235295, 0.99019608, 0.5411765, 0.00980392, 0.00980392, 0.00980392, 0.00980392, 0.00980392, 0.00980392, 0.00980392, 0.00980392, 0.00980392, 0.00980392, 0.00980392, 0.00980392, 0.00980392, 0.00980392, 0.00980392, 0.00980392, 0.00980392, 0.00980392, 0.00980392, 0.15686275, 0.8039215799999999, 0.988235295, 0.988235295, 0.988235295, 0.988235295, 0.988235295, 0.988235295, 0.8352941300000001, 0.121568635, 0.00980392, 0.00980392, 0.00980392, 0.00980392, 0.00980392, 0.00980392, 0.00980392, 0.00980392, 0.00980392, 0.00980392, 0.00980392, 0.00980392, 0.00980392, 0.00980392, 0.00980392, 0.00980392, 0.00980392, 0.066666665, 0.8235294200000001, 0.988235295, 0.988235295, 0.988235295, 0.988235295, 0.9254902, 0.988235295, 0.988235295, 0.988235295, 0.490196095, 0.00980392, 0.00980392, 0.00980392, 0.00980392, 0.00980392, 0.00980392, 0.00980392, 0.00980392, 0.00980392, 0.00980392, 0.00980392, 0.00980392, 0.00980392, 0.00980392, 0.00980392, 0.00980392, 0.00980392, 0.38431373, 0.988235295, 0.988235295, 0.988235295, 0.596078455, 0.15686275, 0.101960785, 0.59215689, 0.988235295, 0.988235295, 0.6588235499999999, 0.00980392, 0.00980392, 0.00980392, 0.00980392, 0.00980392, 0.00980392, 0.00980392, 0.00980392, 0.00980392, 0.00980392, 0.00980392, 0.00980392, 0.00980392, 0.00980392, 0.00980392, 0.00980392, 0.00980392, 0.6509804100000001, 0.988235295, 0.988235295, 0.792156875, 0.17254902500000002, 0.00980392, 0.039215685, 0.81176472, 0.988235295, 0.988235295, 0.8039215799999999, 0.00980392, 0.00980392, 0.00980392, 0.00980392, 0.00980392, 0.00980392, 0.00980392, 0.00980392, 0.00980392, 0.00980392, 0.00980392, 0.00980392, 0.00980392, 0.00980392, 0.00980392, 0.00980392, 0.00980392, 0.20784313999999998, 0.984313725, 0.988235295, 0.9490196099999999, 0.32549020500000003, 0.5333333600000001, 0.7058823700000001, 0.988235295, 0.988235295, 0.988235295, 0.490196095, 0.00980392, 0.00980392, 0.00980392, 0.00980392, 0.00980392, 0.00980392, 0.00980392, 0.00980392, 0.00980392, 0.00980392, 0.00980392, 0.00980392, 0.00980392, 0.00980392, 0.00980392, 0.00980392, 0.00980392, 0.00980392, 0.741176485, 0.988235295, 0.988235295, 0.988235295, 0.988235295, 0.988235295, 0.988235295, 0.988235295, 0.988235295, 0.24705883, 0.00980392, 0.00980392, 0.00980392, 0.00980392, 0.00980392, 0.00980392, 0.00980392, 0.00980392, 0.00980392, 0.00980392, 0.00980392, 0.00980392, 0.00980392, 0.00980392, 0.00980392, 0.00980392, 0.00980392, 0.00980392, 0.015686275, 0.21960784500000002, 0.819607855, 0.988235295, 0.988235295, 0.988235295, 0.988235295, 0.988235295, 0.7882353049999999, 0.011764705, 0.00980392, 0.00980392, 0.00980392, 0.00980392, 0.00980392, 0.00980392, 0.00980392, 0.00980392, 0.00980392, 0.00980392, 0.00980392, 0.00980392, 0.00980392, 0.00980392, 0.00980392, 0.00980392, 0.00980392, 0.00980392, 0.00980392, 0.00980392, 0.34509805, 0.8941176550000001, 0.988235295, 0.988235295, 0.988235295, 0.93333334, 0.36078432, 0.00980392, 0.00980392, 0.00980392, 0.00980392, 0.00980392, 0.00980392, 0.00980392, 0.00980392, 0.00980392, 0.00980392, 0.00980392, 0.00980392, 0.00980392, 0.00980392, 0.00980392, 0.00980392, 0.00980392, 0.00980392, 0.00980392, 0.00980392, 0.00980392, 0.40392157500000003, 0.97254902, 0.988235295, 0.988235295, 0.988235295, 0.23921569, 0.00980392, 0.00980392, 0.00980392, 0.00980392, 0.00980392, 0.00980392, 0.00980392, 0.00980392, 0.00980392, 0.00980392, 0.00980392, 0.00980392, 0.00980392, 0.00980392, 0.00980392, 0.00980392, 0.00980392, 0.00980392, 0.00980392, 0.00980392, 0.00980392, 0.356862755, 0.97254902, 0.988235295, 0.988235295, 0.98627451, 0.6509804100000001, 0.01372549, 0.00980392, 0.00980392, 0.00980392, 0.00980392, 0.00980392, 0.00980392, 0.00980392, 0.00980392, 0.00980392, 0.00980392, 0.00980392, 0.00980392, 0.00980392, 0.00980392, 0.00980392, 0.00980392, 0.00980392, 0.00980392, 0.00980392, 0.00980392, 0.39215687, 0.90196079, 0.988235295, 0.988235295, 0.666666685, 0.44313726, 0.00980392, 0.00980392, 0.00980392, 0.00980392, 0.00980392, 0.00980392, 0.00980392, 0.00980392, 0.00980392, 0.00980392, 0.00980392, 0.00980392, 0.00980392, 0.00980392, 0.00980392, 0.00980392, 0.00980392, 0.00980392, 0.00980392, 0.00980392, 0.00980392, 0.37254903, 0.98627451, 0.988235295, 0.988235295, 0.89803922, 0.0627451, 0.00980392, 0.00980392, 0.00980392, 0.00980392, 0.00980392, 0.00980392, 0.00980392, 0.00980392, 0.00980392, 0.00980392, 0.00980392, 0.00980392, 0.00980392, 0.00980392, 0.00980392, 0.00980392, 0.00980392, 0.00980392, 0.00980392, 0.00980392, 0.00980392, 0.37254903, 0.890196085, 0.988235295, 0.988235295, 0.988235295, 0.521568655, 0.00980392, 0.00980392, 0.00980392, 0.00980392, 0.00980392, 0.00980392, 0.00980392, 0.00980392, 0.00980392, 0.00980392, 0.00980392, 0.00980392, 0.00980392, 0.00980392, 0.00980392, 0.00980392, 0.00980392, 0.00980392, 0.00980392, 0.00980392, 0.00980392, 0.149019615, 0.8941176550000001, 0.988235295, 0.988235295, 0.988235295, 0.792156875, 0.078431375, 0.00980392, 0.00980392, 0.00980392, 0.00980392, 0.00980392, 0.00980392, 0.00980392, 0.00980392, 0.00980392, 0.00980392, 0.00980392, 0.00980392, 0.00980392, 0.00980392, 0.00980392, 0.00980392, 0.00980392, 0.00980392, 0.00980392, 0.00980392, 0.00980392, 0.75686276, 0.988235295, 0.988235295, 0.988235295, 0.792156875, 0.082352945, 0.00980392, 0.00980392, 0.00980392, 0.00980392, 0.00980392, 0.00980392, 0.00980392, 0.00980392, 0.00980392, 0.00980392, 0.00980392, 0.00980392, 0.00980392, 0.00980392, 0.00980392, 0.00980392, 0.00980392, 0.00980392, 0.00980392, 0.00980392, 0.00980392, 0.356862755, 0.964705885, 0.988235295, 0.988235295, 0.9490196099999999, 0.352941185, 0.00980392, 0.00980392, 0.00980392, 0.00980392, 0.00980392, 0.00980392, 0.00980392, 0.00980392, 0.00980392, 0.00980392, 0.00980392, 0.00980392, 0.00980392, 0.00980392, 0.00980392, 0.00980392, 0.00980392, 0.00980392, 0.00980392, 0.00980392, 0.00980392, 0.13725490499999998, 0.9490196099999999, 0.988235295, 0.988235295, 0.988235295, 0.552941205, 0.00980392, 0.00980392, 0.00980392, 0.00980392, 0.00980392, 0.00980392, 0.00980392, 0.00980392, 0.00980392, 0.00980392, 0.00980392, 0.00980392, 0.00980392, 0.00980392, 0.00980392, 0.00980392, 0.00980392, 0.00980392, 0.00980392, 0.00980392, 0.00980392, 0.00980392, 0.00980392, 0.839215695, 0.988235295, 0.988235295, 0.72549021, 0.09019608, 0.00980392, 0.00980392, 0.00980392, 0.00980392, 0.00980392, 0.00980392, 0.00980392, 0.00980392, 0.00980392, 0.00980392, 0.00980392, 0.00980392, 0.00980392, 0.00980392, 0.00980392, 0.00980392, 0.00980392, 0.00980392, 0.00980392, 0.00980392, 0.00980392, 0.00980392, 0.00980392, 0.717647075, 0.988235295, 0.9686274500000001, 0.09411765, 0.00980392, 0.00980392, 0.00980392, 0.00980392, 0.00980392, 0.00980392, 0.00980392, 0.00980392, 0.00980392, 0.00980392, 0.00980392, 0.00980392, 0.00980392, 0.00980392, 0.00980392, 0.00980392, 0.00980392, 0.00980392, 0.00980392, 0.00980392, 0.00980392, 0.00980392, 0.00980392, 0.00980392, 0.00980392, 0.00980392, 0.00980392, 0.00980392, 0.00980392, 0.00980392, 0.00980392, 0.00980392, 0.00980392, 0.00980392, 0.00980392, 0.00980392, 0.00980392, 0.00980392, 0.00980392, 0.00980392, 0.00980392, 0.00980392, 0.00980392, 0.00980392, 0.00980392, 0.00980392, 0.00980392, 0.00980392, 0.00980392, 0.00980392, 0.00980392, 0.00980392, 0.00980392, 0.00980392, 0.00980392, 0.00980392, 0.00980392, 0.00980392, 0.00980392, 0.00980392, 0.00980392, 0.00980392, 0.00980392, 0.00980392, 0.00980392, 0.00980392, 0.00980392, 0.00980392, 0.00980392, 0.00980392, 0.00980392, 0.00980392, 0.00980392], ([0.0, 12.772913752461971, 0.0, 8.013690121779836, 1.9070374072786989, 0.0, 0.0, 13.025939471715855, 2.2057991216669803, 16.80429386504154], [0.0, 11.324769005152573, 0.5307213978769535, 5.731542392098327, 0.5441141853739175, 0.0, 0.0, 10.338035784136574, 1.6551737005174896, 11.990608278927105], 4.813685586114435))
[Thread 1] Total splits: 0
Processed 1 zonotopes (Work Done: 0.0%); Generated 0 (1.624040214s/loop)
[Thread 1] Finished in 1.62s
 ────────────────────────────────────────────────────────────────────────────────
                                        Time                    Allocations      
                               ───────────────────────   ────────────────────────
       Tot / % measured:            1.65s / 100.0%            514MiB / 100.0%    

 Section               ncalls     time    %tot     avg     alloc    %tot      avg
 ────────────────────────────────────────────────────────────────────────────────
 Verify                     1    1.62s   98.5%   1.62s    487MiB   94.8%   487MiB
   Zonotope Loop            1    1.62s   98.5%   1.62s    487MiB   94.7%   487MiB
     Zonotope Propa...      1    1.60s   97.2%   1.60s    465MiB   90.5%   465MiB
       DiffZonotope...      4    1.14s   68.9%   284ms    408MiB   79.4%   102MiB
         Zonotope_R...      8    1.13s   68.7%   142ms    408MiB   79.4%  51.0MiB
           Influenc...      8    1.05s   63.8%   132ms    235MiB   45.8%  29.4MiB
             Multiply       8    762ms   46.2%  95.2ms    138MiB   26.8%  17.2MiB
             Alloca...      8    276ms   16.7%  34.5ms   97.8MiB   19.0%  12.2MiB
             Set Ma...      8   14.8ms    0.9%  1.85ms     0.00B    0.0%    0.00B
           Column M...      8   44.3ms    2.7%  5.54ms   86.0MiB   16.7%  10.7MiB
           Allocation       8   21.4ms    1.3%  2.67ms   86.0MiB   16.7%  10.7MiB
           Set Matrix       8   14.7ms    0.9%  1.84ms   98.8KiB    0.0%  12.4KiB
           Vectors          8    199μs    0.0%  24.9μs    272KiB    0.1%  34.0KiB
           Bounds           8   4.86μs    0.0%   607ns     0.00B    0.0%    0.00B
       DiffZonotope...      5    467ms   28.3%  93.4ms   56.8MiB   11.1%  11.4MiB
         Zonotope_D...     10    467ms   28.3%  46.7ms   56.8MiB   11.1%  5.68MiB
     Property Check         1   7.32ms    0.4%  7.32ms    780KiB    0.1%   780KiB
 Initialize                 1   25.5ms    1.5%  25.5ms   27.0MiB    5.2%  27.0MiB
 ────────────────────────────────────────────────────────────────────────────────
[VERYDIFF_TIMER] 1.777327838

[VERYDIFF_EXPERIMENT] NETWORK: /home/i57/steuber/NeuroDiff/repos/VeryDiffExperiments/src/../benchmarks/mnist-prune/specs/mnist_73_global_5.vnnlib
[VERYDIFF_EXPERIMENT] TIME: 123.169924427
