
[VERYDIFF_EXPERIMENT] Running on /home/i57/steuber/NeuroDiff/repos/VeryDiffExperiments/src/../benchmarks/mnist-prune/specs/mnist_34_global_4.vnnlib /home/i57/steuber/NeuroDiff/repos/VeryDiffExperiments/src/../benchmarks/mnist-prune/nets/mnist_relu_3_100.onnx
Loading /home/i57/steuber/NeuroDiff/repos/VeryDiffExperiments/src/../benchmarks/mnist-prune/nets/mnist_relu_3_100.onnx and /home/i57/steuber/NeuroDiff/repos/VeryDiffExperiments/src/../benchmarks/mnist-prune/nets_pruned/mnist_relu_3_100_0.77-old.onnx
INPUT SHAPE: 784
UNKNOWN
TIMEOUT
Refined: 43 | Refine Limit: 26 | Wrong: 0 | Right: 36 | Total: 36 | Total Zonos Considered: 79 | Expected 288996 (0.012456919818959432%)

time: 120.547070739

[VERYDIFF_TIMER] 120.583984688

[VERYDIFF_EXPERIMENT] NETWORK: /home/i57/steuber/NeuroDiff/repos/VeryDiffExperiments/src/../benchmarks/mnist-prune/specs/mnist_34_global_4.vnnlib
[VERYDIFF_EXPERIMENT] TIME: 120.874291387
