
[VERYDIFF_EXPERIMENT] Running on /home/i57/steuber/NeuroDiff/repos/VeryDiffExperiments/src/../benchmarks/mnist-prune/specs/mnist_64_local_18.vnnlib /home/i57/steuber/NeuroDiff/repos/VeryDiffExperiments/src/../benchmarks/mnist-prune/nets/mnist_relu_3_100.onnx
Found input X
op: matmul, weight: (100, 784), bias: nothing
op: bias, weight: nothing, bias: (100,)
op: relu, weight: nothing, bias: nothing
op: matmul, weight: (100, 100), bias: nothing
op: bias, weight: nothing, bias: (100,)
op: relu, weight: nothing, bias: nothing
op: matmul, weight: (10, 100), bias: nothing
op: bias, weight: nothing, bias: (10,)
op: relu, weight: nothing, bias: nothing
op: matmul, weight: (10, 10), bias: nothing
op: bias, weight: nothing, bias: (10,)
Found input X
op: gemm, weight: (100, 784), bias: (100,)
op: relu, weight: nothing, bias: nothing
op: gemm, weight: (100, 100), bias: (100,)
op: relu, weight: nothing, bias: nothing
op: gemm, weight: (10, 100), bias: (10,)
op: relu, weight: nothing, bias: nothing
op: gemm, weight: (10, 10), bias: (10,)
Distance: 1958.4889029213523
Distance: 144.28197153992141
Distance: 22.063573056613677
Distance: 0.8412832540489035
Running with 1 threads
[Thread 1] Time to first task: 0.0s
Instable Generators: 32
Instable Generators: 40
Instable Generators: 6
Zono Bounds:
[-0.03447251401854431, -4.451835761228355, -5.530012475536896, -4.90039397340837, -5.962692910244673, -5.548405096560881, -0.006750096574797284, -5.298588415756251, -4.981602429449218, -5.4604524343302385]
[-0.018298036606163783, 4.486562284988042, 5.268123529244672, 5.066196982646799, 6.00642198053923, 5.489695517057168, 0.003938403632414327, 4.798653411353008, 5.002748629413571, 5.745023374358241]
[Thread 1] Processed 100 zonotopes (Work Done: 0.0%; Expected Zonos: Inf)
[Thread 1] Processed 200 zonotopes (Work Done: 0.0%; Expected Zonos: Inf)
[Thread 1] Processed 300 zonotopes (Work Done: 0.0%; Expected Zonos: Inf)
[Thread 1] Processed 400 zonotopes (Work Done: 0.0%; Expected Zonos: Inf)
[Thread 1] Processed 500 zonotopes (Work Done: 0.0%; Expected Zonos: Inf)
[Thread 1] Processed 600 zonotopes (Work Done: 0.0%; Expected Zonos: Inf)
[Thread 1] Processed 700 zonotopes (Work Done: 0.0%; Expected Zonos: Inf)
[Thread 1] Processed 800 zonotopes (Work Done: 0.0%; Expected Zonos: Inf)
[Thread 1] Processed 900 zonotopes (Work Done: 0.0%; Expected Zonos: Inf)
[Thread 1] Processed 1000 zonotopes (Work Done: 0.0%; Expected Zonos: Inf)
[Thread 1] Processed 1100 zonotopes (Work Done: 0.0%; Expected Zonos: Inf)
[Thread 1] Processed 1200 zonotopes (Work Done: 0.0%; Expected Zonos: Inf)
[Thread 1] Processed 1300 zonotopes (Work Done: 0.0%; Expected Zonos: Inf)
[Thread 1] Processed 1400 zonotopes (Work Done: 0.0%; Expected Zonos: Inf)
[Thread 1] Processed 1500 zonotopes (Work Done: 0.0%; Expected Zonos: Inf)
[Thread 1] Processed 1600 zonotopes (Work Done: 0.0%; Expected Zonos: Inf)
[Thread 1] Processed 1700 zonotopes (Work Done: 0.0%; Expected Zonos: Inf)
[Thread 1] Processed 1800 zonotopes (Work Done: 0.0%; Expected Zonos: Inf)
[Thread 1] Processed 1900 zonotopes (Work Done: 0.0%; Expected Zonos: Inf)
[Thread 1] Processed 2000 zonotopes (Work Done: 0.0%; Expected Zonos: Inf)
[Thread 1] Processed 2100 zonotopes (Work Done: 0.0%; Expected Zonos: Inf)
[Thread 1] Processed 2200 zonotopes (Work Done: 0.0%; Expected Zonos: Inf)
[Thread 1] Processed 2300 zonotopes (Work Done: 0.0%; Expected Zonos: Inf)
[Thread 1] Processed 2400 zonotopes (Work Done: 0.0%; Expected Zonos: Inf)
[Thread 1] Processed 2500 zonotopes (Work Done: 0.0%; Expected Zonos: Inf)
[Thread 1] Processed 2600 zonotopes (Work Done: 0.0%; Expected Zonos: Inf)
[Thread 1] Processed 2700 zonotopes (Work Done: 0.0%; Expected Zonos: Inf)
[Thread 1] Processed 2800 zonotopes (Work Done: 0.0%; Expected Zonos: Inf)
[Thread 1] Processed 2900 zonotopes (Work Done: 0.0%; Expected Zonos: Inf)
[Thread 1] Processed 3000 zonotopes (Work Done: 0.0%; Expected Zonos: Inf)
[Thread 1] Processed 3100 zonotopes (Work Done: 0.0%; Expected Zonos: Inf)
[Thread 1] Processed 3200 zonotopes (Work Done: 0.0%; Expected Zonos: Inf)
[Thread 1] Processed 3300 zonotopes (Work Done: 0.0%; Expected Zonos: Inf)
[Thread 1] Processed 3400 zonotopes (Work Done: 0.0%; Expected Zonos: Inf)
[Thread 1] Processed 3500 zonotopes (Work Done: 0.0%; Expected Zonos: Inf)
[Thread 1] Processed 3600 zonotopes (Work Done: 0.0%; Expected Zonos: Inf)
[Thread 1] Processed 3700 zonotopes (Work Done: 0.0%; Expected Zonos: Inf)
[Thread 1] Processed 3800 zonotopes (Work Done: 0.0%; Expected Zonos: Inf)
[Thread 1] Processed 3900 zonotopes (Work Done: 0.0%; Expected Zonos: Inf)
[Thread 1] Processed 4000 zonotopes (Work Done: 0.0%; Expected Zonos: Inf)
[Thread 1] Processed 4100 zonotopes (Work Done: 0.0%; Expected Zonos: Inf)
[Thread 1] Processed 4200 zonotopes (Work Done: 0.0%; Expected Zonos: Inf)
[Thread 1] Processed 4300 zonotopes (Work Done: 0.0%; Expected Zonos: Inf)
[Thread 1] Processed 4400 zonotopes (Work Done: 0.0%; Expected Zonos: Inf)
[Thread 1] Processed 4500 zonotopes (Work Done: 0.0%; Expected Zonos: Inf)
[Thread 1] Processed 4600 zonotopes (Work Done: 0.0%; Expected Zonos: Inf)
[Thread 1] Processed 4700 zonotopes (Work Done: 0.0%; Expected Zonos: Inf)
[Thread 1] Processed 4800 zonotopes (Work Done: 0.0%; Expected Zonos: Inf)
[Thread 1] Processed 4900 zonotopes (Work Done: 0.0%; Expected Zonos: Inf)
[Thread 1] Processed 5000 zonotopes (Work Done: 0.0%; Expected Zonos: Inf)
[Thread 1] Processed 5100 zonotopes (Work Done: 0.0%; Expected Zonos: Inf)
[Thread 1] Processed 5200 zonotopes (Work Done: 0.0%; Expected Zonos: Inf)
[Thread 1] Processed 5300 zonotopes (Work Done: 0.0%; Expected Zonos: Inf)
[Thread 1] Processed 5400 zonotopes (Work Done: 0.0%; Expected Zonos: Inf)
[Thread 1] Processed 5500 zonotopes (Work Done: 0.0%; Expected Zonos: Inf)
[Thread 1] Processed 5600 zonotopes (Work Done: 0.0%; Expected Zonos: Inf)
[Thread 1] Processed 5700 zonotopes (Work Done: 0.0%; Expected Zonos: Inf)
[Thread 1] Processed 5800 zonotopes (Work Done: 0.0%; Expected Zonos: Inf)
[Thread 1] Processed 5900 zonotopes (Work Done: 0.0%; Expected Zonos: Inf)
[Thread 1] Processed 6000 zonotopes (Work Done: 0.0%; Expected Zonos: Inf)
[Thread 1] Processed 6100 zonotopes (Work Done: 0.0%; Expected Zonos: Inf)
[Thread 1] Processed 6200 zonotopes (Work Done: 0.0%; Expected Zonos: Inf)
[Thread 1] Processed 6300 zonotopes (Work Done: 0.0%; Expected Zonos: Inf)
[Thread 1] Processed 6400 zonotopes (Work Done: 0.0%; Expected Zonos: Inf)
[Thread 1] Processed 6500 zonotopes (Work Done: 0.0%; Expected Zonos: Inf)
[Thread 1] Processed 6600 zonotopes (Work Done: 0.0%; Expected Zonos: Inf)
[Thread 1] Processed 6700 zonotopes (Work Done: 0.0%; Expected Zonos: Inf)
[Thread 1] Processed 6800 zonotopes (Work Done: 0.0%; Expected Zonos: Inf)
[Thread 1] Processed 6900 zonotopes (Work Done: 0.0%; Expected Zonos: Inf)
[Thread 1] Processed 7000 zonotopes (Work Done: 0.0%; Expected Zonos: Inf)
[Thread 1] Processed 7100 zonotopes (Work Done: 0.0%; Expected Zonos: Inf)
[Thread 1] Processed 7200 zonotopes (Work Done: 0.0%; Expected Zonos: Inf)
[Thread 1] Processed 7300 zonotopes (Work Done: 0.0%; Expected Zonos: Inf)
[Thread 1] Processed 7400 zonotopes (Work Done: 0.0%; Expected Zonos: Inf)
[Thread 1] Processed 7500 zonotopes (Work Done: 0.0%; Expected Zonos: Inf)
[Thread 1] Processed 7600 zonotopes (Work Done: 0.0%; Expected Zonos: Inf)
[Thread 1] Processed 7700 zonotopes (Work Done: 0.0%; Expected Zonos: Inf)
[Thread 1] Processed 7800 zonotopes (Work Done: 0.0%; Expected Zonos: Inf)
[Thread 1] Processed 7900 zonotopes (Work Done: 0.0%; Expected Zonos: Inf)
[Thread 1] Processed 8000 zonotopes (Work Done: 0.0%; Expected Zonos: Inf)
[Thread 1] Processed 8100 zonotopes (Work Done: 0.0%; Expected Zonos: Inf)
[Thread 1] Processed 8200 zonotopes (Work Done: 0.0%; Expected Zonos: Inf)
[Thread 1] Processed 8300 zonotopes (Work Done: 0.0%; Expected Zonos: Inf)
[Thread 1] Processed 8400 zonotopes (Work Done: 0.0%; Expected Zonos: Inf)
[Thread 1] Processed 8500 zonotopes (Work Done: 0.0%; Expected Zonos: Inf)
[Thread 1] Processed 8600 zonotopes (Work Done: 0.0%; Expected Zonos: Inf)
[Thread 1] Processed 8700 zonotopes (Work Done: 0.0%; Expected Zonos: Inf)
[Thread 1] Processed 8800 zonotopes (Work Done: 0.0%; Expected Zonos: Inf)
[Thread 1] Processed 8900 zonotopes (Work Done: 0.0%; Expected Zonos: Inf)
[Thread 1] Processed 9000 zonotopes (Work Done: 0.0%; Expected Zonos: Inf)
[Thread 1] Processed 9100 zonotopes (Work Done: 0.0%; Expected Zonos: Inf)
[Thread 1] Processed 9200 zonotopes (Work Done: 0.0%; Expected Zonos: Inf)
[Thread 1] Processed 9300 zonotopes (Work Done: 0.0%; Expected Zonos: Inf)
[Thread 1] Processed 9400 zonotopes (Work Done: 0.0%; Expected Zonos: Inf)
[Thread 1] Processed 9500 zonotopes (Work Done: 0.0%; Expected Zonos: Inf)
[Thread 1] Processed 9600 zonotopes (Work Done: 0.0%; Expected Zonos: Inf)
[Thread 1] Processed 9700 zonotopes (Work Done: 0.0%; Expected Zonos: Inf)
[Thread 1] Processed 9800 zonotopes (Work Done: 0.0%; Expected Zonos: Inf)
[Thread 1] Processed 9900 zonotopes (Work Done: 0.0%; Expected Zonos: Inf)
[Thread 1] Processed 10000 zonotopes (Work Done: 0.0%; Expected Zonos: Inf)
[Thread 1] Processed 10100 zonotopes (Work Done: 0.0%; Expected Zonos: Inf)
[Thread 1] Processed 10200 zonotopes (Work Done: 0.0%; Expected Zonos: Inf)
[Thread 1] Processed 10300 zonotopes (Work Done: 0.0%; Expected Zonos: Inf)
[Thread 1] Processed 10400 zonotopes (Work Done: 0.0%; Expected Zonos: Inf)
[Thread 1] Processed 10500 zonotopes (Work Done: 0.0%; Expected Zonos: Inf)
[Thread 1] Processed 10600 zonotopes (Work Done: 0.0%; Expected Zonos: Inf)
[Thread 1] Processed 10700 zonotopes (Work Done: 0.0%; Expected Zonos: Inf)
[Thread 1] Processed 10800 zonotopes (Work Done: 0.0%; Expected Zonos: Inf)
[Thread 1] Processed 10900 zonotopes (Work Done: 0.0%; Expected Zonos: Inf)
[Thread 1] Processed 11000 zonotopes (Work Done: 0.0%; Expected Zonos: Inf)
[Thread 1] Processed 11100 zonotopes (Work Done: 0.0%; Expected Zonos: Inf)
[Thread 1] Processed 11200 zonotopes (Work Done: 0.0%; Expected Zonos: Inf)
[Thread 1] Processed 11300 zonotopes (Work Done: 0.0%; Expected Zonos: Inf)
[Thread 1] Processed 11400 zonotopes (Work Done: 0.0%; Expected Zonos: Inf)
[Thread 1] Processed 11500 zonotopes (Work Done: 0.0%; Expected Zonos: Inf)
[Thread 1] Processed 11600 zonotopes (Work Done: 0.0%; Expected Zonos: Inf)
[Thread 1] Processed 11700 zonotopes (Work Done: 0.0%; Expected Zonos: Inf)
[Thread 1] Processed 11800 zonotopes (Work Done: 0.0%; Expected Zonos: Inf)
[Thread 1] Processed 11900 zonotopes (Work Done: 0.0%; Expected Zonos: Inf)
[Thread 1] Processed 12000 zonotopes (Work Done: 0.0%; Expected Zonos: Inf)
[Thread 1] Processed 12100 zonotopes (Work Done: 0.0%; Expected Zonos: Inf)
[Thread 1] Processed 12200 zonotopes (Work Done: 0.0%; Expected Zonos: Inf)
[Thread 1] Processed 12300 zonotopes (Work Done: 0.0%; Expected Zonos: Inf)
[Thread 1] Processed 12400 zonotopes (Work Done: 0.0%; Expected Zonos: Inf)
[Thread 1] Processed 12500 zonotopes (Work Done: 0.0%; Expected Zonos: Inf)
[Thread 1] Processed 12600 zonotopes (Work Done: 0.0%; Expected Zonos: Inf)
[Thread 1] Processed 12700 zonotopes (Work Done: 0.0%; Expected Zonos: Inf)
[Thread 1] Processed 12800 zonotopes (Work Done: 0.0%; Expected Zonos: Inf)
[Thread 1] Processed 12900 zonotopes (Work Done: 0.0%; Expected Zonos: Inf)
[Thread 1] Processed 13000 zonotopes (Work Done: 0.0%; Expected Zonos: Inf)
[Thread 1] Processed 13100 zonotopes (Work Done: 0.0%; Expected Zonos: Inf)
[Thread 1] Processed 13200 zonotopes (Work Done: 0.0%; Expected Zonos: Inf)
[Thread 1] Processed 13300 zonotopes (Work Done: 0.0%; Expected Zonos: Inf)
[Thread 1] Processed 13400 zonotopes (Work Done: 0.0%; Expected Zonos: Inf)
[Thread 1] Processed 13500 zonotopes (Work Done: 0.0%; Expected Zonos: Inf)
[Thread 1] Processed 13600 zonotopes (Work Done: 0.0%; Expected Zonos: Inf)
[Thread 1] Processed 13700 zonotopes (Work Done: 0.0%; Expected Zonos: Inf)
[Thread 1] Processed 13800 zonotopes (Work Done: 0.0%; Expected Zonos: Inf)
[Thread 1] Processed 13900 zonotopes (Work Done: 0.0%; Expected Zonos: Inf)
[Thread 1] Processed 14000 zonotopes (Work Done: 0.0%; Expected Zonos: Inf)
[Thread 1] Processed 14100 zonotopes (Work Done: 0.0%; Expected Zonos: Inf)
[Thread 1] Processed 14200 zonotopes (Work Done: 0.0%; Expected Zonos: Inf)
[Thread 1] Processed 14300 zonotopes (Work Done: 0.0%; Expected Zonos: Inf)
[Thread 1] Processed 14400 zonotopes (Work Done: 0.0%; Expected Zonos: Inf)
[Thread 1] Processed 14500 zonotopes (Work Done: 0.0%; Expected Zonos: Inf)
[Thread 1] Processed 14600 zonotopes (Work Done: 0.0%; Expected Zonos: Inf)
[Thread 1] Processed 14700 zonotopes (Work Done: 0.0%; Expected Zonos: Inf)
[Thread 1] Processed 14800 zonotopes (Work Done: 0.0%; Expected Zonos: Inf)
[Thread 1] Processed 14900 zonotopes (Work Done: 0.0%; Expected Zonos: Inf)
[Thread 1] Processed 15000 zonotopes (Work Done: 0.0%; Expected Zonos: Inf)
[Thread 1] Processed 15100 zonotopes (Work Done: 0.0%; Expected Zonos: Inf)
[Thread 1] Processed 15200 zonotopes (Work Done: 0.0%; Expected Zonos: Inf)
[Thread 1] Processed 15300 zonotopes (Work Done: 0.0%; Expected Zonos: Inf)
[Thread 1] Processed 15400 zonotopes (Work Done: 0.0%; Expected Zonos: Inf)
[Thread 1] Processed 15500 zonotopes (Work Done: 0.0%; Expected Zonos: Inf)
[Thread 1] Processed 15600 zonotopes (Work Done: 0.0%; Expected Zonos: Inf)
[Thread 1] Processed 15700 zonotopes (Work Done: 0.0%; Expected Zonos: Inf)
[Thread 1] Processed 15800 zonotopes (Work Done: 0.0%; Expected Zonos: Inf)
[Thread 1] Processed 15900 zonotopes (Work Done: 0.0%; Expected Zonos: Inf)
[Thread 1] Processed 16000 zonotopes (Work Done: 0.0%; Expected Zonos: Inf)
[Thread 1] Processed 16100 zonotopes (Work Done: 0.0%; Expected Zonos: Inf)
[Thread 1] Processed 16200 zonotopes (Work Done: 0.0%; Expected Zonos: Inf)
[Thread 1] Processed 16300 zonotopes (Work Done: 0.0%; Expected Zonos: Inf)
[Thread 1] Processed 16400 zonotopes (Work Done: 0.0%; Expected Zonos: Inf)
[Thread 1] Processed 16500 zonotopes (Work Done: 0.0%; Expected Zonos: Inf)
[Thread 1] Processed 16600 zonotopes (Work Done: 0.0%; Expected Zonos: Inf)
[Thread 1] Processed 16700 zonotopes (Work Done: 0.0%; Expected Zonos: Inf)
[Thread 1] Processed 16800 zonotopes (Work Done: 0.0%; Expected Zonos: Inf)
[Thread 1] Processed 16900 zonotopes (Work Done: 0.0%; Expected Zonos: Inf)
[Thread 1] Processed 17000 zonotopes (Work Done: 0.0%; Expected Zonos: Inf)
[Thread 1] Processed 17100 zonotopes (Work Done: 0.0%; Expected Zonos: Inf)
[Thread 1] Processed 17200 zonotopes (Work Done: 0.0%; Expected Zonos: Inf)
[Thread 1] Processed 17300 zonotopes (Work Done: 0.0%; Expected Zonos: Inf)
[Thread 1] Processed 17400 zonotopes (Work Done: 0.0%; Expected Zonos: Inf)
[Thread 1] Processed 17500 zonotopes (Work Done: 0.0%; Expected Zonos: Inf)
[Thread 1] Processed 17600 zonotopes (Work Done: 0.0%; Expected Zonos: Inf)
[Thread 1] Processed 17700 zonotopes (Work Done: 0.0%; Expected Zonos: Inf)
[Thread 1] Processed 17800 zonotopes (Work Done: 0.0%; Expected Zonos: Inf)
[Thread 1] Processed 17900 zonotopes (Work Done: 0.0%; Expected Zonos: Inf)
[Thread 1] Processed 18000 zonotopes (Work Done: 0.0%; Expected Zonos: Inf)
[Thread 1] Processed 18100 zonotopes (Work Done: 0.0%; Expected Zonos: Inf)
[Thread 1] Processed 18200 zonotopes (Work Done: 0.0%; Expected Zonos: Inf)
[Thread 1] Processed 18300 zonotopes (Work Done: 0.0%; Expected Zonos: Inf)
[Thread 1] Processed 18400 zonotopes (Work Done: 0.0%; Expected Zonos: Inf)
[Thread 1] Processed 18500 zonotopes (Work Done: 0.0%; Expected Zonos: Inf)
[Thread 1] Processed 18600 zonotopes (Work Done: 0.0%; Expected Zonos: Inf)
[Thread 1] Processed 18700 zonotopes (Work Done: 0.0%; Expected Zonos: Inf)
[Thread 1] Processed 18800 zonotopes (Work Done: 0.0%; Expected Zonos: Inf)
[Thread 1] Processed 18900 zonotopes (Work Done: 0.0%; Expected Zonos: Inf)
[Thread 1] Processed 19000 zonotopes (Work Done: 0.0%; Expected Zonos: Inf)
[Thread 1] Processed 19100 zonotopes (Work Done: 0.0%; Expected Zonos: Inf)
[Thread 1] Processed 19200 zonotopes (Work Done: 0.0%; Expected Zonos: Inf)
[Thread 1] Processed 19300 zonotopes (Work Done: 0.0%; Expected Zonos: Inf)
[Thread 1] Processed 19400 zonotopes (Work Done: 0.0%; Expected Zonos: Inf)
[Thread 1] Processed 19500 zonotopes (Work Done: 0.0%; Expected Zonos: Inf)
[Thread 1] Processed 19600 zonotopes (Work Done: 0.0%; Expected Zonos: Inf)
[Thread 1] Processed 19700 zonotopes (Work Done: 0.0%; Expected Zonos: Inf)
[Thread 1] Processed 19800 zonotopes (Work Done: 0.0%; Expected Zonos: Inf)
[Thread 1] Processed 19900 zonotopes (Work Done: 0.0%; Expected Zonos: Inf)
[Thread 1] Processed 20000 zonotopes (Work Done: 0.0%; Expected Zonos: Inf)
[Thread 1] Processed 20100 zonotopes (Work Done: 0.0%; Expected Zonos: Inf)
[Thread 1] Processed 20200 zonotopes (Work Done: 0.0%; Expected Zonos: Inf)
[Thread 1] Processed 20300 zonotopes (Work Done: 0.0%; Expected Zonos: Inf)
[Thread 1] Processed 20400 zonotopes (Work Done: 0.0%; Expected Zonos: Inf)
[Thread 1] Processed 20500 zonotopes (Work Done: 0.0%; Expected Zonos: Inf)
[Thread 1] Processed 20600 zonotopes (Work Done: 0.0%; Expected Zonos: Inf)
[Thread 1] Processed 20700 zonotopes (Work Done: 0.0%; Expected Zonos: Inf)
[Thread 1] Processed 20800 zonotopes (Work Done: 0.0%; Expected Zonos: Inf)
[Thread 1] Processed 20900 zonotopes (Work Done: 0.0%; Expected Zonos: Inf)
[Thread 1] Processed 21000 zonotopes (Work Done: 0.0%; Expected Zonos: Inf)
[Thread 1] Processed 21100 zonotopes (Work Done: 0.0%; Expected Zonos: Inf)
[Thread 1] Processed 21200 zonotopes (Work Done: 0.0%; Expected Zonos: Inf)
[Thread 1] Processed 21300 zonotopes (Work Done: 0.0%; Expected Zonos: Inf)
[Thread 1] Processed 21400 zonotopes (Work Done: 0.0%; Expected Zonos: Inf)
[Thread 1] Processed 21500 zonotopes (Work Done: 0.0%; Expected Zonos: Inf)
[Thread 1] Processed 21600 zonotopes (Work Done: 0.0%; Expected Zonos: Inf)
[Thread 1] Processed 21700 zonotopes (Work Done: 0.0%; Expected Zonos: Inf)
[Thread 1] Processed 21800 zonotopes (Work Done: 0.0%; Expected Zonos: Inf)
[Thread 1] Processed 21900 zonotopes (Work Done: 0.0%; Expected Zonos: Inf)
[Thread 1] Processed 22000 zonotopes (Work Done: 0.0%; Expected Zonos: Inf)
[Thread 1] Processed 22100 zonotopes (Work Done: 0.0%; Expected Zonos: Inf)
[Thread 1] Processed 22200 zonotopes (Work Done: 0.0%; Expected Zonos: Inf)
[Thread 1] Processed 22300 zonotopes (Work Done: 0.0%; Expected Zonos: Inf)
[Thread 1] Processed 22400 zonotopes (Work Done: 0.0%; Expected Zonos: Inf)
[Thread 1] Processed 22500 zonotopes (Work Done: 0.0%; Expected Zonos: Inf)
[Thread 1] Processed 22600 zonotopes (Work Done: 0.0%; Expected Zonos: Inf)
[Thread 1] Processed 22700 zonotopes (Work Done: 0.0%; Expected Zonos: Inf)
[Thread 1] Processed 22800 zonotopes (Work Done: 0.0%; Expected Zonos: Inf)
[Thread 1] Processed 22900 zonotopes (Work Done: 0.0%; Expected Zonos: Inf)
[Thread 1] Processed 23000 zonotopes (Work Done: 0.0%; Expected Zonos: Inf)
[Thread 1] Processed 23100 zonotopes (Work Done: 0.0%; Expected Zonos: Inf)
[Thread 1] Processed 23200 zonotopes (Work Done: 0.0%; Expected Zonos: Inf)
[Thread 1] Processed 23300 zonotopes (Work Done: 0.0%; Expected Zonos: Inf)
[Thread 1] Processed 23400 zonotopes (Work Done: 0.0%; Expected Zonos: Inf)
[Thread 1] Processed 23500 zonotopes (Work Done: 0.0%; Expected Zonos: Inf)
[Thread 1] Processed 23600 zonotopes (Work Done: 0.0%; Expected Zonos: Inf)
[Thread 1] Processed 23700 zonotopes (Work Done: 0.0%; Expected Zonos: Inf)
[Thread 1] Processed 23800 zonotopes (Work Done: 0.0%; Expected Zonos: Inf)
[Thread 1] Processed 23900 zonotopes (Work Done: 0.0%; Expected Zonos: Inf)
[Thread 1] Processed 24000 zonotopes (Work Done: 0.0%; Expected Zonos: Inf)
[Thread 1] Processed 24100 zonotopes (Work Done: 0.0%; Expected Zonos: Inf)
[Thread 1] Processed 24200 zonotopes (Work Done: 0.0%; Expected Zonos: Inf)
[Thread 1] Processed 24300 zonotopes (Work Done: 0.0%; Expected Zonos: Inf)
[Thread 1] Processed 24400 zonotopes (Work Done: 0.0%; Expected Zonos: Inf)
[Thread 1] Processed 24500 zonotopes (Work Done: 0.0%; Expected Zonos: Inf)
[Thread 1] Processed 24600 zonotopes (Work Done: 0.0%; Expected Zonos: Inf)
[Thread 1] Processed 24700 zonotopes (Work Done: 0.0%; Expected Zonos: Inf)
[Thread 1] Processed 24800 zonotopes (Work Done: 0.0%; Expected Zonos: Inf)
[Thread 1] Processed 24900 zonotopes (Work Done: 0.0%; Expected Zonos: Inf)
[Thread 1] Processed 25000 zonotopes (Work Done: 0.0%; Expected Zonos: Inf)
[Thread 1] Processed 25100 zonotopes (Work Done: 0.0%; Expected Zonos: Inf)
[Thread 1] Processed 25200 zonotopes (Work Done: 0.0%; Expected Zonos: Inf)
[Thread 1] Processed 25300 zonotopes (Work Done: 0.0%; Expected Zonos: Inf)
[Thread 1] Processed 25400 zonotopes (Work Done: 0.0%; Expected Zonos: Inf)
[Thread 1] Processed 25500 zonotopes (Work Done: 0.0%; Expected Zonos: Inf)
[Thread 1] Processed 25600 zonotopes (Work Done: 0.0%; Expected Zonos: Inf)
[Thread 1] Processed 25700 zonotopes (Work Done: 0.0%; Expected Zonos: Inf)
[Thread 1] Processed 25800 zonotopes (Work Done: 0.0%; Expected Zonos: Inf)
[Thread 1] Processed 25900 zonotopes (Work Done: 0.0%; Expected Zonos: Inf)
[Thread 1] Processed 26000 zonotopes (Work Done: 0.0%; Expected Zonos: Inf)
[Thread 1] Processed 26100 zonotopes (Work Done: 0.0%; Expected Zonos: Inf)
[Thread 1] Processed 26200 zonotopes (Work Done: 0.0%; Expected Zonos: Inf)
[Thread 1] Processed 26300 zonotopes (Work Done: 0.0%; Expected Zonos: Inf)
[Thread 1] Processed 26400 zonotopes (Work Done: 0.0%; Expected Zonos: Inf)
[Thread 1] Processed 26500 zonotopes (Work Done: 0.0%; Expected Zonos: Inf)
[Thread 1] Processed 26600 zonotopes (Work Done: 0.0%; Expected Zonos: Inf)
[Thread 1] Processed 26700 zonotopes (Work Done: 0.0%; Expected Zonos: Inf)
[Thread 1] Processed 26800 zonotopes (Work Done: 0.0%; Expected Zonos: Inf)
[Thread 1] Processed 26900 zonotopes (Work Done: 0.0%; Expected Zonos: Inf)
[Thread 1] Processed 27000 zonotopes (Work Done: 0.0%; Expected Zonos: Inf)
[Thread 1] Processed 27100 zonotopes (Work Done: 0.0%; Expected Zonos: Inf)
[Thread 1] Processed 27200 zonotopes (Work Done: 0.0%; Expected Zonos: Inf)
[Thread 1] Processed 27300 zonotopes (Work Done: 0.0%; Expected Zonos: Inf)
[Thread 1] Processed 27400 zonotopes (Work Done: 0.0%; Expected Zonos: Inf)
[Thread 1] Processed 27500 zonotopes (Work Done: 0.0%; Expected Zonos: Inf)
[Thread 1] Processed 27600 zonotopes (Work Done: 0.0%; Expected Zonos: Inf)
[Thread 1] Processed 27700 zonotopes (Work Done: 0.0%; Expected Zonos: Inf)
[Thread 1] Processed 27800 zonotopes (Work Done: 0.0%; Expected Zonos: Inf)
[Thread 1] Processed 27900 zonotopes (Work Done: 0.0%; Expected Zonos: Inf)
[Thread 1] Processed 28000 zonotopes (Work Done: 0.0%; Expected Zonos: Inf)
[Thread 1] Processed 28100 zonotopes (Work Done: 0.0%; Expected Zonos: Inf)
[Thread 1] Processed 28200 zonotopes (Work Done: 0.0%; Expected Zonos: Inf)
[Thread 1] Processed 28300 zonotopes (Work Done: 0.0%; Expected Zonos: Inf)
[Thread 1] Processed 28400 zonotopes (Work Done: 0.0%; Expected Zonos: Inf)
[Thread 1] Processed 28500 zonotopes (Work Done: 0.0%; Expected Zonos: Inf)
[Thread 1] Processed 28600 zonotopes (Work Done: 0.0%; Expected Zonos: Inf)
[Thread 1] Processed 28700 zonotopes (Work Done: 0.0%; Expected Zonos: Inf)
[Thread 1] Processed 28800 zonotopes (Work Done: 0.0%; Expected Zonos: Inf)
[Thread 1] Processed 28900 zonotopes (Work Done: 0.0%; Expected Zonos: Inf)
[Thread 1] Processed 29000 zonotopes (Work Done: 0.0%; Expected Zonos: Inf)
[Thread 1] Processed 29100 zonotopes (Work Done: 0.0%; Expected Zonos: Inf)
[Thread 1] Processed 29200 zonotopes (Work Done: 0.0%; Expected Zonos: Inf)
[Thread 1] Processed 29300 zonotopes (Work Done: 0.0%; Expected Zonos: Inf)
[Thread 1] Processed 29400 zonotopes (Work Done: 0.0%; Expected Zonos: Inf)
[Thread 1] Processed 29500 zonotopes (Work Done: 0.0%; Expected Zonos: Inf)
[Thread 1] Processed 29600 zonotopes (Work Done: 0.0%; Expected Zonos: Inf)
[Thread 1] Processed 29700 zonotopes (Work Done: 0.0%; Expected Zonos: Inf)
[Thread 1] Processed 29800 zonotopes (Work Done: 0.0%; Expected Zonos: Inf)
[Thread 1] Processed 29900 zonotopes (Work Done: 0.0%; Expected Zonos: Inf)
[Thread 1] Processed 30000 zonotopes (Work Done: 0.0%; Expected Zonos: Inf)
[Thread 1] Processed 30100 zonotopes (Work Done: 0.0%; Expected Zonos: Inf)
[Thread 1] Processed 30200 zonotopes (Work Done: 0.0%; Expected Zonos: Inf)
[Thread 1] Processed 30300 zonotopes (Work Done: 0.0%; Expected Zonos: Inf)
[Thread 1] Processed 30400 zonotopes (Work Done: 0.0%; Expected Zonos: Inf)
[Thread 1] Processed 30500 zonotopes (Work Done: 0.0%; Expected Zonos: Inf)
[Thread 1] Processed 30600 zonotopes (Work Done: 0.0%; Expected Zonos: Inf)
[Thread 1] Processed 30700 zonotopes (Work Done: 0.0%; Expected Zonos: Inf)
[Thread 1] Processed 30800 zonotopes (Work Done: 0.0%; Expected Zonos: Inf)
[Thread 1] Processed 30900 zonotopes (Work Done: 0.0%; Expected Zonos: Inf)
[Thread 1] Processed 31000 zonotopes (Work Done: 0.0%; Expected Zonos: Inf)
[Thread 1] Processed 31100 zonotopes (Work Done: 0.0%; Expected Zonos: Inf)
[Thread 1] Processed 31200 zonotopes (Work Done: 0.0%; Expected Zonos: Inf)
[Thread 1] Processed 31300 zonotopes (Work Done: 0.0%; Expected Zonos: Inf)
[Thread 1] Processed 31400 zonotopes (Work Done: 0.0%; Expected Zonos: Inf)
[Thread 1] Processed 31500 zonotopes (Work Done: 0.0%; Expected Zonos: Inf)
[Thread 1] Processed 31600 zonotopes (Work Done: 0.0%; Expected Zonos: Inf)
[Thread 1] Processed 31700 zonotopes (Work Done: 0.0%; Expected Zonos: Inf)
[Thread 1] Processed 31800 zonotopes (Work Done: 0.0%; Expected Zonos: Inf)
[Thread 1] Processed 31900 zonotopes (Work Done: 0.0%; Expected Zonos: Inf)
[Thread 1] Processed 32000 zonotopes (Work Done: 0.0%; Expected Zonos: Inf)
[Thread 1] Processed 32100 zonotopes (Work Done: 0.0%; Expected Zonos: Inf)
[Thread 1] Processed 32200 zonotopes (Work Done: 0.0%; Expected Zonos: Inf)
[Thread 1] Processed 32300 zonotopes (Work Done: 0.0%; Expected Zonos: Inf)
[Thread 1] Processed 32400 zonotopes (Work Done: 0.0%; Expected Zonos: Inf)
[Thread 1] Processed 32500 zonotopes (Work Done: 0.0%; Expected Zonos: Inf)
[Thread 1] Processed 32600 zonotopes (Work Done: 0.0%; Expected Zonos: Inf)
[Thread 1] Processed 32700 zonotopes (Work Done: 0.0%; Expected Zonos: Inf)
[Thread 1] Processed 32800 zonotopes (Work Done: 0.0%; Expected Zonos: Inf)
[Thread 1] Processed 32900 zonotopes (Work Done: 0.0%; Expected Zonos: Inf)
[Thread 1] Processed 33000 zonotopes (Work Done: 0.0%; Expected Zonos: Inf)
[Thread 1] Processed 33100 zonotopes (Work Done: 0.0%; Expected Zonos: Inf)
[Thread 1] Processed 33200 zonotopes (Work Done: 0.0%; Expected Zonos: Inf)
[Thread 1] Processed 33300 zonotopes (Work Done: 0.0%; Expected Zonos: Inf)
[Thread 1] Processed 33400 zonotopes (Work Done: 0.0%; Expected Zonos: Inf)
[Thread 1] Processed 33500 zonotopes (Work Done: 0.0%; Expected Zonos: Inf)
[Thread 1] Processed 33600 zonotopes (Work Done: 0.0%; Expected Zonos: Inf)
[Thread 1] Processed 33700 zonotopes (Work Done: 0.0%; Expected Zonos: Inf)
[Thread 1] Processed 33800 zonotopes (Work Done: 0.0%; Expected Zonos: Inf)
[Thread 1] Processed 33900 zonotopes (Work Done: 0.0%; Expected Zonos: Inf)
[Thread 1] Processed 34000 zonotopes (Work Done: 0.0%; Expected Zonos: Inf)
[Thread 1] Processed 34100 zonotopes (Work Done: 0.0%; Expected Zonos: Inf)
[Thread 1] Processed 34200 zonotopes (Work Done: 0.0%; Expected Zonos: Inf)
[Thread 1] Processed 34300 zonotopes (Work Done: 0.0%; Expected Zonos: Inf)
[Thread 1] Processed 34400 zonotopes (Work Done: 0.0%; Expected Zonos: Inf)
[Thread 1] Processed 34500 zonotopes (Work Done: 0.0%; Expected Zonos: Inf)
[Thread 1] Processed 34600 zonotopes (Work Done: 0.0%; Expected Zonos: Inf)
[Thread 1] Processed 34700 zonotopes (Work Done: 0.0%; Expected Zonos: Inf)
[Thread 1] Processed 34800 zonotopes (Work Done: 0.0%; Expected Zonos: Inf)
[Thread 1] Processed 34900 zonotopes (Work Done: 0.0%; Expected Zonos: Inf)
[Thread 1] Processed 35000 zonotopes (Work Done: 0.0%; Expected Zonos: Inf)
[Thread 1] Processed 35100 zonotopes (Work Done: 0.0%; Expected Zonos: Inf)
[Thread 1] Processed 35200 zonotopes (Work Done: 0.0%; Expected Zonos: Inf)
[Thread 1] Processed 35300 zonotopes (Work Done: 0.0%; Expected Zonos: Inf)
[Thread 1] Processed 35400 zonotopes (Work Done: 0.0%; Expected Zonos: Inf)
[Thread 1] Processed 35500 zonotopes (Work Done: 0.0%; Expected Zonos: Inf)
[Thread 1] Processed 35600 zonotopes (Work Done: 0.0%; Expected Zonos: Inf)
[Thread 1] Processed 35700 zonotopes (Work Done: 0.0%; Expected Zonos: Inf)
[Thread 1] Processed 35800 zonotopes (Work Done: 0.0%; Expected Zonos: Inf)
[Thread 1] Processed 35900 zonotopes (Work Done: 0.0%; Expected Zonos: Inf)
[Thread 1] Processed 36000 zonotopes (Work Done: 0.0%; Expected Zonos: Inf)
[Thread 1] Processed 36100 zonotopes (Work Done: 0.0%; Expected Zonos: Inf)
[Thread 1] Processed 36200 zonotopes (Work Done: 0.0%; Expected Zonos: Inf)
[Thread 1] Processed 36300 zonotopes (Work Done: 0.0%; Expected Zonos: Inf)
[Thread 1] Processed 36400 zonotopes (Work Done: 0.0%; Expected Zonos: Inf)
[Thread 1] Processed 36500 zonotopes (Work Done: 0.0%; Expected Zonos: Inf)
[Thread 1] Processed 36600 zonotopes (Work Done: 0.0%; Expected Zonos: Inf)
[Thread 1] Processed 36700 zonotopes (Work Done: 0.0%; Expected Zonos: Inf)
[Thread 1] Processed 36800 zonotopes (Work Done: 0.0%; Expected Zonos: Inf)
[Thread 1] Processed 36900 zonotopes (Work Done: 0.0%; Expected Zonos: Inf)
[Thread 1] Processed 37000 zonotopes (Work Done: 0.0%; Expected Zonos: Inf)
[Thread 1] Processed 37100 zonotopes (Work Done: 0.0%; Expected Zonos: Inf)
[Thread 1] Processed 37200 zonotopes (Work Done: 0.0%; Expected Zonos: Inf)
[Thread 1] Processed 37300 zonotopes (Work Done: 0.0%; Expected Zonos: Inf)
[Thread 1] Processed 37400 zonotopes (Work Done: 0.0%; Expected Zonos: Inf)
[Thread 1] Processed 37500 zonotopes (Work Done: 0.0%; Expected Zonos: Inf)
[Thread 1] Processed 37600 zonotopes (Work Done: 0.0%; Expected Zonos: Inf)
[Thread 1] Processed 37700 zonotopes (Work Done: 0.0%; Expected Zonos: Inf)
[Thread 1] Processed 37800 zonotopes (Work Done: 0.0%; Expected Zonos: Inf)
[Thread 1] Processed 37900 zonotopes (Work Done: 0.0%; Expected Zonos: Inf)
[Thread 1] Processed 38000 zonotopes (Work Done: 0.0%; Expected Zonos: Inf)
[Thread 1] Processed 38100 zonotopes (Work Done: 0.0%; Expected Zonos: Inf)
[Thread 1] Processed 38200 zonotopes (Work Done: 0.0%; Expected Zonos: Inf)
[Thread 1] Processed 38300 zonotopes (Work Done: 0.0%; Expected Zonos: Inf)
[Thread 1] Processed 38400 zonotopes (Work Done: 0.0%; Expected Zonos: Inf)
[Thread 1] Processed 38500 zonotopes (Work Done: 0.0%; Expected Zonos: Inf)
[Thread 1] Processed 38600 zonotopes (Work Done: 0.0%; Expected Zonos: Inf)
[Thread 1] Processed 38700 zonotopes (Work Done: 0.0%; Expected Zonos: Inf)
[Thread 1] Processed 38800 zonotopes (Work Done: 0.0%; Expected Zonos: Inf)
[Thread 1] Processed 38900 zonotopes (Work Done: 0.0%; Expected Zonos: Inf)
[Thread 1] Processed 39000 zonotopes (Work Done: 0.0%; Expected Zonos: Inf)
[Thread 1] Processed 39100 zonotopes (Work Done: 0.0%; Expected Zonos: Inf)
[Thread 1] Processed 39200 zonotopes (Work Done: 0.0%; Expected Zonos: Inf)
[Thread 1] Processed 39300 zonotopes (Work Done: 0.0%; Expected Zonos: Inf)
[Thread 1] Processed 39400 zonotopes (Work Done: 0.0%; Expected Zonos: Inf)
[Thread 1] Processed 39500 zonotopes (Work Done: 0.0%; Expected Zonos: Inf)
[Thread 1] Processed 39600 zonotopes (Work Done: 0.0%; Expected Zonos: Inf)
[Thread 1] Processed 39700 zonotopes (Work Done: 0.0%; Expected Zonos: Inf)
[Thread 1] Processed 39800 zonotopes (Work Done: 0.0%; Expected Zonos: Inf)
[Thread 1] Processed 39900 zonotopes (Work Done: 0.0%; Expected Zonos: Inf)
[Thread 1] Processed 40000 zonotopes (Work Done: 0.0%; Expected Zonos: Inf)
[Thread 1] Processed 40100 zonotopes (Work Done: 0.0%; Expected Zonos: Inf)
[Thread 1] Processed 40200 zonotopes (Work Done: 0.0%; Expected Zonos: Inf)
[Thread 1] Processed 40300 zonotopes (Work Done: 0.0%; Expected Zonos: Inf)
[Thread 1] Processed 40400 zonotopes (Work Done: 0.0%; Expected Zonos: Inf)
[Thread 1] Processed 40500 zonotopes (Work Done: 0.0%; Expected Zonos: Inf)
[Thread 1] Processed 40600 zonotopes (Work Done: 0.0%; Expected Zonos: Inf)
[Thread 1] Processed 40700 zonotopes (Work Done: 0.0%; Expected Zonos: Inf)
[Thread 1] Processed 40800 zonotopes (Work Done: 0.0%; Expected Zonos: Inf)
[Thread 1] Processed 40900 zonotopes (Work Done: 0.0%; Expected Zonos: Inf)
[Thread 1] Processed 41000 zonotopes (Work Done: 0.0%; Expected Zonos: Inf)
[Thread 1] Processed 41100 zonotopes (Work Done: 0.0%; Expected Zonos: Inf)
[Thread 1] Processed 41200 zonotopes (Work Done: 0.0%; Expected Zonos: Inf)
[Thread 1] Processed 41300 zonotopes (Work Done: 0.0%; Expected Zonos: Inf)
[Thread 1] Processed 41400 zonotopes (Work Done: 0.0%; Expected Zonos: Inf)
[Thread 1] Processed 41500 zonotopes (Work Done: 0.0%; Expected Zonos: Inf)
[Thread 1] Processed 41600 zonotopes (Work Done: 0.0%; Expected Zonos: Inf)
[Thread 1] Processed 41700 zonotopes (Work Done: 0.0%; Expected Zonos: Inf)
[Thread 1] Processed 41800 zonotopes (Work Done: 0.0%; Expected Zonos: Inf)
[Thread 1] Processed 41900 zonotopes (Work Done: 0.0%; Expected Zonos: Inf)
[Thread 1] Processed 42000 zonotopes (Work Done: 0.0%; Expected Zonos: Inf)
[Thread 1] Processed 42100 zonotopes (Work Done: 0.0%; Expected Zonos: Inf)
[Thread 1] Processed 42200 zonotopes (Work Done: 0.0%; Expected Zonos: Inf)
[Thread 1] Processed 42300 zonotopes (Work Done: 0.0%; Expected Zonos: Inf)
[Thread 1] Processed 42400 zonotopes (Work Done: 0.0%; Expected Zonos: Inf)
[Thread 1] Processed 42500 zonotopes (Work Done: 0.0%; Expected Zonos: Inf)
[Thread 1] Processed 42600 zonotopes (Work Done: 0.0%; Expected Zonos: Inf)
[Thread 1] Processed 42700 zonotopes (Work Done: 0.0%; Expected Zonos: Inf)
[Thread 1] Processed 42800 zonotopes (Work Done: 0.0%; Expected Zonos: Inf)
[Thread 1] Processed 42900 zonotopes (Work Done: 0.0%; Expected Zonos: Inf)
[Thread 1] Processed 43000 zonotopes (Work Done: 0.0%; Expected Zonos: Inf)
[Thread 1] Processed 43100 zonotopes (Work Done: 0.0%; Expected Zonos: Inf)
[Thread 1] Processed 43200 zonotopes (Work Done: 0.0%; Expected Zonos: Inf)
[Thread 1] Processed 43300 zonotopes (Work Done: 0.0%; Expected Zonos: Inf)
[Thread 1] Processed 43400 zonotopes (Work Done: 0.0%; Expected Zonos: Inf)
[Thread 1] Processed 43500 zonotopes (Work Done: 0.0%; Expected Zonos: Inf)
[Thread 1] Processed 43600 zonotopes (Work Done: 0.0%; Expected Zonos: Inf)
[Thread 1] Processed 43700 zonotopes (Work Done: 0.0%; Expected Zonos: Inf)
[Thread 1] Processed 43800 zonotopes (Work Done: 0.0%; Expected Zonos: Inf)
[Thread 1] Processed 43900 zonotopes (Work Done: 0.0%; Expected Zonos: Inf)
[Thread 1] Processed 44000 zonotopes (Work Done: 0.0%; Expected Zonos: Inf)
[Thread 1] Processed 44100 zonotopes (Work Done: 0.0%; Expected Zonos: Inf)
[Thread 1] Processed 44200 zonotopes (Work Done: 0.0%; Expected Zonos: Inf)
[Thread 1] Processed 44300 zonotopes (Work Done: 0.0%; Expected Zonos: Inf)
[Thread 1] Processed 44400 zonotopes (Work Done: 0.0%; Expected Zonos: Inf)
[Thread 1] Processed 44500 zonotopes (Work Done: 0.0%; Expected Zonos: Inf)
[Thread 1] Processed 44600 zonotopes (Work Done: 0.0%; Expected Zonos: Inf)
[Thread 1] Processed 44700 zonotopes (Work Done: 0.0%; Expected Zonos: Inf)
[Thread 1] Processed 44800 zonotopes (Work Done: 0.0%; Expected Zonos: Inf)
[Thread 1] Processed 44900 zonotopes (Work Done: 0.0%; Expected Zonos: Inf)
[Thread 1] Processed 45000 zonotopes (Work Done: 0.0%; Expected Zonos: Inf)


TIMEOUT REACHED
UNKNOWN
[Thread 1] Total splits: 45045
Processed 45045 zonotopes (Work Done: 0.0%); Generated 90090 (0.0026640324266844267s/loop)
[Thread 1] Finished in 120.0s
 ────────────────────────────────────────────────────────────────────────────────
                                        Time                    Allocations      
                               ───────────────────────   ────────────────────────
       Tot / % measured:             120s / 100.0%           91.0GiB / 100.0%    

 Section               ncalls     time    %tot     avg     alloc    %tot      avg
 ────────────────────────────────────────────────────────────────────────────────
 Verify                     1     120s  100.0%    120s   91.0GiB  100.0%  91.0GiB
   Zonotope Loop            1     120s  100.0%    120s   91.0GiB  100.0%  91.0GiB
     Zonotope Propa...  45.0k    78.2s   65.2%  1.74ms   44.9GiB   49.3%  1.02MiB
       DiffZonotope...   180k    45.6s   38.0%   253μs   10.1GiB   11.1%  58.8KiB
         Zonotope_D...   360k    21.1s   17.6%  58.5μs   5.31GiB    5.8%  15.4KiB
       DiffZonotope...   135k    32.3s   26.9%   239μs   34.8GiB   38.2%   270KiB
         Zonotope_R...   270k    18.2s   15.2%  67.4μs   22.2GiB   24.3%  86.0KiB
           Influenc...   270k    5.75s    4.8%  21.3μs   5.51GiB    6.1%  21.4KiB
             Multiply    270k    4.93s    4.1%  18.2μs   3.33GiB    3.7%  12.9KiB
             Alloca...   270k    459ms    0.4%  1.70μs   2.18GiB    2.4%  8.45KiB
             Set Ma...   270k    211ms    0.2%   781ns     0.00B    0.0%    0.00B
           Column M...   270k    5.07s    4.2%  18.8μs   7.82GiB    8.6%  30.4KiB
           Allocation    270k    4.18s    3.5%  15.5μs   7.80GiB    8.6%  30.3KiB
           Vectors       270k    1.98s    1.6%  7.32μs    859MiB    0.9%  3.26KiB
           Set Matrix    270k    935ms    0.8%  3.46μs    183MiB    0.2%     710B
           Bounds        270k   64.2ms    0.1%   237ns     0.00B    0.0%    0.00B
     Property Check     45.0k    8.04s    6.7%   178μs   2.85GiB    3.1%  66.3KiB
     Compute Split      45.0k    5.95s    5.0%   132μs   6.89GiB    7.6%   160KiB
 Initialize                 1    317μs    0.0%   317μs    839KiB    0.0%   839KiB
 ────────────────────────────────────────────────────────────────────────────────
[VERYDIFF_TIMER] 120.050212619

[VERYDIFF_EXPERIMENT] NETWORK: /home/i57/steuber/NeuroDiff/repos/VeryDiffExperiments/src/../benchmarks/mnist-prune/specs/mnist_64_local_18.vnnlib
[VERYDIFF_EXPERIMENT] TIME: 120.666886572
