
[VERYDIFF_EXPERIMENT] Running on /home/i57/steuber/NeuroDiff/repos/VeryDiffExperiments/src/../benchmarks/mnist-prune/specs/mnist_7_global_6.vnnlib /home/i57/steuber/NeuroDiff/repos/VeryDiffExperiments/src/../benchmarks/mnist-prune/nets/mnist_relu_3_100.onnx
Found input X
op: matmul, weight: (100, 784), bias: nothing
op: bias, weight: nothing, bias: (100,)
op: relu, weight: nothing, bias: nothing
op: matmul, weight: (100, 100), bias: nothing
op: bias, weight: nothing, bias: (100,)
op: relu, weight: nothing, bias: nothing
op: matmul, weight: (10, 100), bias: nothing
op: bias, weight: nothing, bias: (10,)
op: relu, weight: nothing, bias: nothing
op: matmul, weight: (10, 10), bias: nothing
op: bias, weight: nothing, bias: (10,)
Found input X
op: gemm, weight: (100, 784), bias: (100,)
op: relu, weight: nothing, bias: nothing
op: gemm, weight: (100, 100), bias: (100,)
op: relu, weight: nothing, bias: nothing
op: gemm, weight: (10, 100), bias: (10,)
op: relu, weight: nothing, bias: nothing
op: gemm, weight: (10, 10), bias: (10,)
Distance: 368.62397500800625
Distance: 47.56803950402309
Distance: 2.8977568827249343
Distance: 0.01885471428334995
Running with 1 threads
[Thread 1] Time to first task: 0.0s
Instable Generators: 53
Instable Generators: 90
Instable Generators: 10
Zono Bounds:
[-2.6294657914896917, -2.781386139984872, -3.0343695795775907, -2.9626621574414016, -3.2079555810104963, -3.3234528017203537, -3.0768548901032324, -3.11318043655001, -2.7871483794927965, -2.9183896044104496]
[2.6296077043869626, 2.652238465643621, 3.0319666709584756, 2.952972661018386, 3.037551825532184, 3.3127159212681114, 3.0757661522640753, 2.9299873884605097, 2.70511066221804, 2.903077646670815]
[Thread 1] Processed 100 zonotopes (Work Done: 0.0%; Expected Zonos: Inf)
[Thread 1] Processed 200 zonotopes (Work Done: 0.0%; Expected Zonos: Inf)
[Thread 1] Processed 300 zonotopes (Work Done: 0.0%; Expected Zonos: Inf)
[Thread 1] Processed 400 zonotopes (Work Done: 0.0%; Expected Zonos: Inf)
[Thread 1] Processed 500 zonotopes (Work Done: 0.0%; Expected Zonos: Inf)


TIMEOUT REACHED
UNKNOWN
[Thread 1] Total splits: 549
Processed 549 zonotopes (Work Done: 0.0%); Generated 1098 (0.21899984330236794s/loop)
[Thread 1] Finished in 120.23s
 ────────────────────────────────────────────────────────────────────────────────
                                        Time                    Allocations      
                               ───────────────────────   ────────────────────────
       Tot / % measured:             120s / 100.0%           61.5GiB / 100.0%    

 Section               ncalls     time    %tot     avg     alloc    %tot      avg
 ────────────────────────────────────────────────────────────────────────────────
 Verify                     1     120s  100.0%    120s   61.5GiB  100.0%  61.5GiB
   Zonotope Loop            1     120s  100.0%    120s   61.5GiB  100.0%  61.5GiB
     Zonotope Propa...    549     112s   93.2%   204ms   42.0GiB   68.3%  78.4MiB
       DiffZonotope...  2.20k    76.9s   64.0%  35.0ms   2.29GiB    3.7%  1.07MiB
         Zonotope_D...  4.39k    71.9s   59.8%  16.4ms   1.48GiB    2.4%   354KiB
       DiffZonotope...  1.65k    35.1s   29.2%  21.3ms   39.7GiB   64.6%  24.7MiB
         Zonotope_R...  3.29k    34.6s   28.8%  10.5ms   38.8GiB   63.0%  12.0MiB
           Influenc...  3.29k    33.6s   27.9%  10.2ms   35.7GiB   58.0%  11.1MiB
             Alloca...  3.29k    18.2s   15.1%  5.52ms   17.3GiB   28.2%  5.39MiB
             Multiply   3.29k    12.9s   10.7%  3.91ms   18.4GiB   29.9%  5.71MiB
             Set Ma...  3.29k    2.50s    2.1%   759μs     0.00B    0.0%    0.00B
           Column M...  3.29k    459ms    0.4%   139μs   1.52GiB    2.5%   484KiB
           Allocation   3.29k    342ms    0.3%   104μs   1.52GiB    2.5%   484KiB
           Set Matrix   3.29k    193ms    0.2%  58.5μs   4.98MiB    0.0%  1.55KiB
           Vectors      3.29k   16.3ms    0.0%  4.95μs   10.5MiB    0.0%  3.26KiB
           Bounds       3.29k   2.35ms    0.0%   713ns     0.00B    0.0%    0.00B
     Compute Split        549    4.12s    3.4%  7.50ms   8.73GiB   14.2%  16.3MiB
     Property Check       549    601ms    0.5%  1.10ms   64.6MiB    0.1%   120KiB
 Initialize                 1    534μs    0.0%   534μs   5.41MiB    0.0%  5.41MiB
 ────────────────────────────────────────────────────────────────────────────────
[VERYDIFF_TIMER] 120.262025671

[VERYDIFF_EXPERIMENT] NETWORK: /home/i57/steuber/NeuroDiff/repos/VeryDiffExperiments/src/../benchmarks/mnist-prune/specs/mnist_7_global_6.vnnlib
[VERYDIFF_EXPERIMENT] TIME: 120.736565488
