
[VERYDIFF_EXPERIMENT] Running on /home/i57/steuber/NeuroDiff/repos/VeryDiffExperiments/src/../benchmarks/mnist-prune/specs/mnist_11_local_15.vnnlib /home/i57/steuber/NeuroDiff/repos/VeryDiffExperiments/src/../benchmarks/mnist-prune/nets/mnist_relu_3_100.onnx
Parsing /home/i57/steuber/NeuroDiff/repos/VeryDiffExperiments/src/../benchmarks/mnist-prune/nets/mnist_relu_3_100.onnx...
Found input X
op: matmul, weight: (100, 784), bias: nothing
op: bias, weight: nothing, bias: (100,)
op: relu, weight: nothing, bias: nothing
op: matmul, weight: (100, 100), bias: nothing
op: bias, weight: nothing, bias: (100,)
op: relu, weight: nothing, bias: nothing
op: matmul, weight: (10, 100), bias: nothing
op: bias, weight: nothing, bias: (10,)
op: relu, weight: nothing, bias: nothing
op: matmul, weight: (10, 10), bias: nothing
op: bias, weight: nothing, bias: (10,)
Parsing /home/i57/steuber/NeuroDiff/repos/VeryDiffExperiments/src/../benchmarks/mnist-prune/nets_pruned/mnist_relu_3_100_0.49-old.onnx...
Found input X
op: gemm, weight: (100, 784), bias: (100,)
op: relu, weight: nothing, bias: nothing
op: gemm, weight: (100, 100), bias: (100,)
op: relu, weight: nothing, bias: nothing
op: gemm, weight: (10, 100), bias: (10,)
op: relu, weight: nothing, bias: nothing
op: gemm, weight: (10, 10), bias: (10,)
Distance: 1623.4465197373434
Distance: 201.62056963066925
Distance: 13.962962507051998
Distance: 0.183768135302671
Running with 1 threads
[Thread 1] Time to first task: 0.0s
Instable Generators: 26
Instable Generators: 29
Instable Generators: 6
Zono Bounds:
[-2.4246941811334843, -2.0212313658324237, -2.9210105593060116, -0.010769622829431858, -3.0743248334888946, -2.98826668188176, -2.479310946211887, -0.0010923401471095557, -2.6835712658560715, -0.0042024557330546525]
[2.281508057732436, 1.736389061280341, 2.8874406169466718, 0.01187018712373123, 3.042401364238451, 2.6366813462847136, 3.2171546283182004, 0.0020181192936951304, 1.683417942870769, 0.002458517645595127]
[Thread 1] Total splits: 0
Processed 1 zonotopes (Work Done: 100.0%); Generated 0 (0.039814261s/loop)
[Thread 1] Finished in 0.04s
 ────────────────────────────────────────────────────────────────────────────────
                                        Time                    Allocations      
                               ───────────────────────   ────────────────────────
       Tot / % measured:           40.2ms / 100.0%           14.0MiB / 100.0%    

 Section               ncalls     time    %tot     avg     alloc    %tot      avg
 ────────────────────────────────────────────────────────────────────────────────
 Verify                     1   39.8ms   99.1%  39.8ms   13.2MiB   94.3%  13.2MiB
   Zonotope Loop            1   39.8ms   99.1%  39.8ms   13.1MiB   94.2%  13.1MiB
     Property Check         1   38.4ms   95.6%  38.4ms   11.3MiB   80.8%  11.3MiB
     Zonotope Propa...      1   1.27ms    3.2%  1.27ms   1.07MiB    7.7%  1.07MiB
       DiffZonotope...      4    886μs    2.2%   221μs    239KiB    1.7%  59.6KiB
         Zonotope_D...      8    391μs    1.0%  48.9μs    120KiB    0.8%  15.0KiB
       DiffZonotope...      3    378μs    0.9%   126μs    860KiB    6.0%   287KiB
         Zonotope_R...      6    182μs    0.5%  30.3μs    538KiB    3.8%  89.6KiB
           Column M...      6   62.8μs    0.2%  10.5μs    190KiB    1.3%  31.7KiB
           Influenc...      6   62.5μs    0.2%  10.4μs    130KiB    0.9%  21.6KiB
             Multiply       6   44.0μs    0.1%  7.34μs   81.8KiB    0.6%  13.6KiB
             Alloca...      6   9.36μs    0.0%  1.56μs   45.7KiB    0.3%  7.61KiB
             Set Ma...      6   4.62μs    0.0%   771ns     0.00B    0.0%    0.00B
           Set Matrix       6   19.1μs    0.0%  3.19μs   4.78KiB    0.0%     816B
           Vectors          6   16.8μs    0.0%  2.81μs   19.5KiB    0.1%  3.26KiB
           Allocation       6   11.3μs    0.0%  1.88μs    189KiB    1.3%  31.6KiB
           Bounds           6   1.80μs    0.0%   301ns     0.00B    0.0%    0.00B
 Initialize                 1    343μs    0.9%   343μs    821KiB    5.7%   821KiB
 ────────────────────────────────────────────────────────────────────────────────
[VERYDIFF_TIMER] 0.073786404

[VERYDIFF_EXPERIMENT] NETWORK: /home/i57/steuber/NeuroDiff/repos/VeryDiffExperiments/src/../benchmarks/mnist-prune/specs/mnist_11_local_15.vnnlib
[VERYDIFF_EXPERIMENT] TIME: 0.388675566
