
[VERYDIFF_EXPERIMENT] Running on /home/i57/steuber/NeuroDiff/repos/VeryDiffExperiments/src/../benchmarks/mnist-prune/specs/mnist_0_global_4.vnnlib /home/i57/steuber/NeuroDiff/repos/VeryDiffExperiments/src/../benchmarks/mnist-prune/nets/mnist_relu_4_1024.onnx
Found input X
op: matmul, weight: (1024, 784), bias: nothing
op: bias, weight: nothing, bias: (1024,)
op: relu, weight: nothing, bias: nothing
op: matmul, weight: (1024, 1024), bias: nothing
op: bias, weight: nothing, bias: (1024,)
op: relu, weight: nothing, bias: nothing
op: matmul, weight: (1024, 1024), bias: nothing
op: bias, weight: nothing, bias: (1024,)
op: relu, weight: nothing, bias: nothing
op: matmul, weight: (10, 1024), bias: nothing
op: bias, weight: nothing, bias: (10,)
op: relu, weight: nothing, bias: nothing
op: matmul, weight: (10, 10), bias: nothing
op: bias, weight: nothing, bias: (10,)
Found input X
op: gemm, weight: (1024, 784), bias: (1024,)
op: relu, weight: nothing, bias: nothing
op: gemm, weight: (1024, 1024), bias: (1024,)
op: relu, weight: nothing, bias: nothing
op: gemm, weight: (1024, 1024), bias: (1024,)
op: relu, weight: nothing, bias: nothing
op: gemm, weight: (10, 1024), bias: (10,)
op: relu, weight: nothing, bias: nothing
op: gemm, weight: (10, 10), bias: (10,)
Distance: 915.6394868631054
Distance: 1298.7052820973968
Distance: 1296.587532894263
Distance: 6.054483317080667
Distance: 0.04942679278974538
Running with 1 threads
[Thread 1] Time to first task: 0.01s
Instable Generators: 350
Instable Generators: 581
Instable Generators: 1002
Instable Generators: 10
Zono Bounds:
[-63.97493571986572, -64.9328231132789, -71.81568129424214, -71.6798732961561, -68.1736668399667, -72.7119955756208, -63.64944099222995, -66.88013631674224, -69.96278837537977, -72.54682724959909]
[63.97266552468336, 64.46049091368603, 71.53112716808529, 71.32212352233569, 68.14478418875044, 72.54772929955452, 63.272205179990074, 66.69104009430032, 69.99982343855515, 72.4768814437129]


TIMEOUT REACHED
UNKNOWN
[Thread 1] Total splits: 51
Processed 51 zonotopes (Work Done: 0.0%); Generated 102 (2.397000163254902s/loop)
[Thread 1] Finished in 122.25s
 ────────────────────────────────────────────────────────────────────────────────
                                        Time                    Allocations      
                               ───────────────────────   ────────────────────────
       Tot / % measured:             122s / 100.0%           33.6GiB / 100.0%    

 Section               ncalls     time    %tot     avg     alloc    %tot      avg
 ────────────────────────────────────────────────────────────────────────────────
 Verify                     1     122s  100.0%    122s   33.5GiB   99.9%  33.5GiB
   Zonotope Loop            1     122s  100.0%    122s   33.5GiB   99.9%  33.5GiB
     Zonotope Propa...     51     117s   95.3%   2.29s   30.6GiB   91.3%   615MiB
       DiffZonotope...    204    71.4s   58.4%   350ms   25.3GiB   75.4%   127MiB
         Zonotope_R...    408    67.6s   55.3%   166ms   20.6GiB   61.2%  51.6MiB
           Influenc...    408    49.6s   40.6%   122ms   11.9GiB   35.3%  29.8MiB
             Multiply     408    35.8s   29.3%  87.8ms   6.94GiB   20.7%  17.4MiB
             Alloca...    408    13.0s   10.6%  31.8ms   4.92GiB   14.7%  12.4MiB
             Set Ma...    408    779ms    0.6%  1.91ms     0.00B    0.0%    0.00B
           Allocation     408    12.2s   10.0%  30.0ms   4.34GiB   12.9%  10.9MiB
           Column M...    408    4.97s    4.1%  12.2ms   4.34GiB   12.9%  10.9MiB
           Set Matrix     408    790ms    0.6%  1.94ms   4.99MiB    0.0%  12.5KiB
           Vectors        408   13.8ms    0.0%  33.8μs   13.5MiB    0.0%  34.0KiB
           Bounds         408    308μs    0.0%   756ns     0.00B    0.0%    0.00B
       DiffZonotope...    255    45.2s   36.9%   177ms   5.33GiB   15.9%  21.4MiB
         Zonotope_D...    510    19.5s   16.0%  38.3ms   2.87GiB    8.6%  5.77MiB
     Compute Split         51    5.31s    4.3%   104ms   1.88GiB    5.6%  37.8MiB
     Property Check        51    190ms    0.2%  3.73ms   31.6MiB    0.1%   635KiB
 Initialize                 1   19.2ms    0.0%  19.2ms   27.0MiB    0.1%  27.0MiB
 ────────────────────────────────────────────────────────────────────────────────
[VERYDIFF_TIMER] 122.345573501

[VERYDIFF_EXPERIMENT] NETWORK: /home/i57/steuber/NeuroDiff/repos/VeryDiffExperiments/src/../benchmarks/mnist-prune/specs/mnist_0_global_4.vnnlib
[VERYDIFF_EXPERIMENT] TIME: 122.631372954
