[runlim] version:		2.0.0rc12
[runlim] host:			i57pool5
[runlim] time limit:		311040000 seconds
[runlim] real time limit:	120 seconds
[runlim] space limit:		15563 MB
[runlim] argv[0]:		/home/i57/steuber/.local/bin/Marabou
[runlim] argv[1]:		./mnist-prune/nets/product_mnist_relu_3_100_mnist_relu_3_100_pruned5_eps.onnx
[runlim] argv[2]:		./mnist-prune/specs/product_mnist_34_global_6_eps_1.0.vnnlib
[runlim] start:			Thu Oct  3 17:06:06 2024
[runlim] child:			604780
Network: ./mnist-prune/nets/product_mnist_relu_3_100_mnist_relu_3_100_pruned5_eps.onnx
Property: ./mnist-prune/specs/product_mnist_34_global_6_eps_1.0.vnnlib

Engine::processInputQuery: Input query (before preprocessing): 450 equations, 1654 variables
Engine::processInputQuery: Input query (after preprocessing): 830 equations, 1898 variables

Input bounds:
	x0: [ -0.0000,   0.0235] 
	x1: [ -0.0000,   0.0235] 
	x2: [ -0.0000,   0.0235] 
	x3: [ -0.0000,   0.0235] 
	x4: [ -0.0000,   0.0235] 
	x5: [ -0.0000,   0.0235] 
	x6: [ -0.0000,   0.0235] 
	x7: [ -0.0000,   0.0235] 
	x8: [ -0.0000,   0.0235] 
	x9: [ -0.0000,   0.0235] 
	x10: [ -0.0000,   0.0235] 
	x11: [ -0.0000,   0.0235] 
	x12: [ -0.0000,   0.0235] 
	x13: [ -0.0000,   0.0235] 
	x14: [ -0.0000,   0.0235] 
	x15: [ -0.0000,   0.0235] 
	x16: [ -0.0000,   0.0235] 
	x17: [ -0.0000,   0.0235] 
	x18: [ -0.0000,   0.0235] 
	x19: [ -0.0000,   0.0235] 
	x20: [ -0.0000,   0.0235] 
	x21: [ -0.0000,   0.0235] 
	x22: [ -0.0000,   0.0235] 
	x23: [ -0.0000,   0.0235] 
	x24: [ -0.0000,   0.0235] 
	x25: [ -0.0000,   0.0235] 
	x26: [ -0.0000,   0.0235] 
	x27: [ -0.0000,   0.0235] 
	x28: [ -0.0000,   0.0235] 
	x29: [ -0.0000,   0.0235] 
	x30: [ -0.0000,   0.0235] 
	x31: [ -0.0000,   0.0235] 
	x32: [ -0.0000,   0.0235] 
	x33: [ -0.0000,   0.0235] 
	x34: [ -0.0000,   0.0235] 
	x35: [ -0.0000,   0.0235] 
	x36: [ -0.0000,   0.0235] 
	x37: [ -0.0000,   0.0235] 
	x38: [ -0.0000,   0.0235] 
	x39: [ -0.0000,   0.0235] 
	x40: [ -0.0000,   0.0235] 
	x41: [ -0.0000,   0.0235] 
	x42: [ -0.0000,   0.0235] 
	x43: [ -0.0000,   0.0235] 
	x44: [ -0.0000,   0.0235] 
	x45: [ -0.0000,   0.0235] 
	x46: [ -0.0000,   0.0235] 
	x47: [ -0.0000,   0.0235] 
	x48: [ -0.0000,   0.0235] 
	x49: [ -0.0000,   0.0235] 
	x50: [ -0.0000,   0.0235] 
	x51: [ -0.0000,   0.0235] 
	x52: [ -0.0000,   0.0235] 
	x53: [ -0.0000,   0.0235] 
	x54: [ -0.0000,   0.0235] 
	x55: [ -0.0000,   0.0235] 
	x56: [ -0.0000,   0.0235] 
	x57: [ -0.0000,   0.0235] 
	x58: [ -0.0000,   0.0235] 
	x59: [ -0.0000,   0.0235] 
	x60: [ -0.0000,   0.0235] 
	x61: [ -0.0000,   0.0235] 
	x62: [ -0.0000,   0.0235] 
	x63: [ -0.0000,   0.0235] 
	x64: [ -0.0000,   0.0235] 
	x65: [ -0.0000,   0.0235] 
	x66: [ -0.0000,   0.0235] 
	x67: [ -0.0000,   0.0235] 
	x68: [ -0.0000,   0.0235] 
	x69: [ -0.0000,   0.0235] 
	x70: [ -0.0000,   0.0235] 
	x71: [ -0.0000,   0.0235] 
	x72: [ -0.0000,   0.0235] 
	x73: [ -0.0000,   0.0235] 
	x74: [ -0.0000,   0.0235] 
	x75: [ -0.0000,   0.0235] 
	x76: [ -0.0000,   0.0235] 
	x77: [ -0.0000,   0.0235] 
	x78: [ -0.0000,   0.0235] 
	x79: [ -0.0000,   0.0235] 
	x80: [ -0.0000,   0.0235] 
	x81: [ -0.0000,   0.0235] 
	x82: [ -0.0000,   0.0235] 
	x83: [ -0.0000,   0.0235] 
	x84: [ -0.0000,   0.0235] 
	x85: [ -0.0000,   0.0235] 
	x86: [ -0.0000,   0.0235] 
	x87: [ -0.0000,   0.0235] 
	x88: [ -0.0000,   0.0235] 
	x89: [ -0.0000,   0.0235] 
	x90: [ -0.0000,   0.0235] 
	x91: [ -0.0000,   0.0235] 
	x92: [ -0.0000,   0.0235] 
	x93: [ -0.0000,   0.0235] 
	x94: [ -0.0000,   0.0235] 
	x95: [ -0.0000,   0.0235] 
	x96: [ -0.0000,   0.0235] 
	x97: [ -0.0000,   0.0235] 
	x98: [ -0.0000,   0.0235] 
	x99: [ -0.0000,   0.0235] 
	x100: [ -0.0000,   0.0235] 
	x101: [ -0.0000,   0.0235] 
	x102: [ -0.0000,   0.0235] 
	x103: [ -0.0000,   0.0235] 
	x104: [ -0.0000,   0.0235] 
	x105: [ -0.0000,   0.0235] 
	x106: [ -0.0000,   0.0235] 
	x107: [ -0.0000,   0.0235] 
	x108: [ -0.0000,   0.0235] 
	x109: [ -0.0000,   0.0235] 
	x110: [ -0.0000,   0.0235] 
	x111: [ -0.0000,   0.0235] 
	x112: [ -0.0000,   0.0235] 
	x113: [ -0.0000,   0.0235] 
	x114: [ -0.0000,   0.0235] 
	x115: [ -0.0000,   0.0235] 
	x116: [ -0.0000,   0.0235] 
	x117: [ -0.0000,   0.0235] 
	x118: [ -0.0000,   0.0235] 
	x119: [ -0.0000,   0.0235] 
	x120: [ -0.0000,   0.0235] 
	x121: [ -0.0000,   0.0235] 
	x122: [ -0.0000,   0.0235] 
	x123: [ -0.0000,   0.0235] 
	x124: [ -0.0000,   0.0235] 
	x125: [ -0.0000,   0.0235] 
	x126: [ -0.0000,   0.0235] 
	x127: [ -0.0000,   0.0235] 
	x128: [ -0.0000,   0.0235] 
	x129: [ -0.0000,   0.0235] 
	x130: [ -0.0000,   0.0235] 
	x131: [ -0.0000,   0.0235] 
	x132: [ -0.0000,   0.0235] 
	x133: [ -0.0000,   0.0235] 
	x134: [ -0.0000,   0.0235] 
	x135: [ -0.0000,   0.0235] 
	x136: [ -0.0000,   0.0235] 
	x137: [ -0.0000,   0.0235] 
	x138: [ -0.0000,   0.0235] 
	x139: [ -0.0000,   0.0235] 
	x140: [ -0.0000,   0.0235] 
	x141: [ -0.0000,   0.0235] 
	x142: [ -0.0000,   0.0235] 
	x143: [ -0.0000,   0.0235] 
	x144: [ -0.0000,   0.0235] 
	x145: [ -0.0000,   0.0235] 
	x146: [ -0.0000,   0.0235] 
	x147: [ -0.0000,   0.0235] 
	x148: [ -0.0000,   0.0235] 
	x149: [ -0.0000,   0.0235] 
	x150: [ -0.0000,   0.0235] 
	x151: [ -0.0000,   0.0235] 
	x152: [ -0.0000,   0.0235] 
	x153: [ -0.0000,   0.0235] 
	x154: [ -0.0000,   0.0235] 
	x155: [ -0.0000,   0.0235] 
	x156: [ -0.0000,   0.0235] 
	x157: [ -0.0000,   0.0235] 
	x158: [ -0.0000,   0.0235] 
	x159: [ -0.0000,   0.0235] 
	x160: [ -0.0000,   0.0235] 
	x161: [ -0.0000,   0.0235] 
	x162: [ -0.0000,   0.0235] 
	x163: [ -0.0000,   0.0235] 
	x164: [ -0.0000,   0.0235] 
	x165: [ -0.0000,   0.0235] 
	x166: [ -0.0000,   0.0235] 
	x167: [ -0.0000,   0.0235] 
	x168: [ -0.0000,   0.0235] 
	x169: [ -0.0000,   0.0235] 
	x170: [ -0.0000,   0.0235] 
	x171: [ -0.0000,   0.0235] 
	x172: [ -0.0000,   0.0235] 
	x173: [ -0.0000,   0.0235] 
	x174: [ -0.0000,   0.0235] 
	x175: [  0.8706,   0.9176] 
	x176: [  0.8039,   0.8510] 
	x177: [  0.3255,   0.3725] 
	x178: [ -0.0000,   0.0235] 
	x179: [ -0.0000,   0.0235] 
	x180: [ -0.0000,   0.0235] 
	x181: [ -0.0000,   0.0235] 
	x182: [ -0.0000,   0.0235] 
	x183: [ -0.0000,   0.0235] 
	x184: [  0.1765,   0.2235] 
	x185: [  0.4510,   0.4980] 
	x186: [  0.4510,   0.4980] 
	x187: [  0.8627,   0.9098] 
	x188: [  0.9686,   1.0000] 
	x189: [  0.8863,   0.9333] 
	x190: [  0.1490,   0.1961] 
	x191: [ -0.0000,   0.0235] 
	x192: [ -0.0000,   0.0235] 
	x193: [ -0.0000,   0.0235] 
	x194: [ -0.0000,   0.0235] 
	x195: [ -0.0000,   0.0235] 
	x196: [ -0.0000,   0.0235] 
	x197: [ -0.0000,   0.0235] 
	x198: [ -0.0000,   0.0235] 
	x199: [ -0.0000,   0.0235] 
	x200: [ -0.0000,   0.0235] 
	x201: [ -0.0000,   0.0235] 
	x202: [ -0.0000,   0.0235] 
	x203: [  0.2157,   0.2627] 
	x204: [  0.8980,   0.9451] 
	x205: [  0.9529,   1.0000] 
	x206: [  0.9176,   0.9647] 
	x207: [  0.9176,   0.9647] 
	x208: [  0.9176,   0.9647] 
	x209: [  0.9176,   0.9647] 
	x210: [  0.9176,   0.9647] 
	x211: [  0.9216,   0.9686] 
	x212: [  0.9373,   0.9843] 
	x213: [  0.9647,   1.0000] 
	x214: [  0.9647,   1.0000] 
	x215: [  0.9647,   1.0000] 
	x216: [  0.9647,   1.0000] 
	x217: [  0.9647,   1.0000] 
	x218: [  0.3412,   0.3882] 
	x219: [ -0.0000,   0.0235] 
	x220: [ -0.0000,   0.0235] 
	x221: [ -0.0000,   0.0235] 
	x222: [ -0.0000,   0.0235] 
	x223: [ -0.0000,   0.0235] 
	x224: [ -0.0000,   0.0235] 
	x225: [ -0.0000,   0.0235] 
	x226: [ -0.0000,   0.0235] 
	x227: [ -0.0000,   0.0235] 
	x228: [ -0.0000,   0.0235] 
	x229: [ -0.0000,   0.0235] 
	x230: [ -0.0000,   0.0235] 
	x231: [ -0.0000,   0.0235] 
	x232: [  0.2275,   0.2745] 
	x233: [  0.6941,   0.7412] 
	x234: [  0.9647,   1.0000] 
	x235: [  0.9647,   1.0000] 
	x236: [  0.9647,   1.0000] 
	x237: [  0.9647,   1.0000] 
	x238: [  0.9647,   1.0000] 
	x239: [  0.9686,   1.0000] 
	x240: [  0.9647,   1.0000] 
	x241: [  0.9647,   1.0000] 
	x242: [  0.9647,   1.0000] 
	x243: [  0.9647,   1.0000] 
	x244: [  0.9647,   1.0000] 
	x245: [  0.9647,   1.0000] 
	x246: [  0.3412,   0.3882] 
	x247: [ -0.0000,   0.0235] 
	x248: [ -0.0000,   0.0235] 
	x249: [ -0.0000,   0.0235] 
	x250: [ -0.0000,   0.0235] 
	x251: [ -0.0000,   0.0235] 
	x252: [ -0.0000,   0.0235] 
	x253: [ -0.0000,   0.0235] 
	x254: [ -0.0000,   0.0235] 
	x255: [ -0.0000,   0.0235] 
	x256: [ -0.0000,   0.0235] 
	x257: [ -0.0000,   0.0235] 
	x258: [ -0.0000,   0.0235] 
	x259: [ -0.0000,   0.0235] 
	x260: [ -0.0000,   0.0235] 
	x261: [  0.0196,   0.0667] 
	x262: [  0.1294,   0.1765] 
	x263: [  0.1294,   0.1765] 
	x264: [  0.1843,   0.2314] 
	x265: [  0.3490,   0.3961] 
	x266: [  0.1294,   0.1765] 
	x267: [  0.1294,   0.1765] 
	x268: [  0.1294,   0.1765] 
	x269: [  0.1294,   0.1765] 
	x270: [  0.8353,   0.8824] 
	x271: [  0.9647,   1.0000] 
	x272: [  0.9647,   1.0000] 
	x273: [  0.7490,   0.7961] 
	x274: [  0.2235,   0.2706] 
	x275: [ -0.0000,   0.0235] 
	x276: [ -0.0000,   0.0235] 
	x277: [ -0.0000,   0.0235] 
	x278: [ -0.0000,   0.0235] 
	x279: [ -0.0000,   0.0235] 
	x280: [ -0.0000,   0.0235] 
	x281: [ -0.0000,   0.0235] 
	x282: [ -0.0000,   0.0235] 
	x283: [ -0.0000,   0.0235] 
	x284: [ -0.0000,   0.0235] 
	x285: [ -0.0000,   0.0235] 
	x286: [ -0.0000,   0.0235] 
	x287: [ -0.0000,   0.0235] 
	x288: [ -0.0000,   0.0235] 
	x289: [ -0.0000,   0.0235] 
	x290: [ -0.0000,   0.0235] 
	x291: [ -0.0000,   0.0235] 
	x292: [ -0.0000,   0.0235] 
	x293: [ -0.0000,   0.0235] 
	x294: [ -0.0000,   0.0235] 
	x295: [ -0.0000,   0.0235] 
	x296: [ -0.0000,   0.0235] 
	x297: [  0.2706,   0.3176] 
	x298: [  0.9333,   0.9804] 
	x299: [  0.9647,   1.0000] 
	x300: [  0.7961,   0.8431] 
	x301: [  0.0431,   0.0902] 
	x302: [ -0.0000,   0.0235] 
	x303: [ -0.0000,   0.0235] 
	x304: [ -0.0000,   0.0235] 
	x305: [ -0.0000,   0.0235] 
	x306: [ -0.0000,   0.0235] 
	x307: [ -0.0000,   0.0235] 
	x308: [ -0.0000,   0.0235] 
	x309: [ -0.0000,   0.0235] 
	x310: [ -0.0000,   0.0235] 
	x311: [ -0.0000,   0.0235] 
	x312: [ -0.0000,   0.0235] 
	x313: [ -0.0000,   0.0235] 
	x314: [ -0.0000,   0.0235] 
	x315: [ -0.0000,   0.0235] 
	x316: [ -0.0000,   0.0235] 
	x317: [ -0.0000,   0.0235] 
	x318: [ -0.0000,   0.0235] 
	x319: [ -0.0000,   0.0235] 
	x320: [ -0.0000,   0.0235] 
	x321: [ -0.0000,   0.0235] 
	x322: [ -0.0000,   0.0235] 
	x323: [ -0.0000,   0.0235] 
	x324: [ -0.0000,   0.0235] 
	x325: [  0.4549,   0.5020] 
	x326: [  0.9647,   1.0000] 
	x327: [  0.9647,   1.0000] 
	x328: [  0.7529,   0.8000] 
	x329: [ -0.0000,   0.0235] 
	x330: [ -0.0000,   0.0235] 
	x331: [ -0.0000,   0.0235] 
	x332: [ -0.0000,   0.0235] 
	x333: [ -0.0000,   0.0235] 
	x334: [ -0.0000,   0.0235] 
	x335: [ -0.0000,   0.0235] 
	x336: [ -0.0000,   0.0235] 
	x337: [ -0.0000,   0.0235] 
	x338: [ -0.0000,   0.0235] 
	x339: [ -0.0000,   0.0235] 
	x340: [ -0.0000,   0.0235] 
	x341: [ -0.0000,   0.0235] 
	x342: [ -0.0000,   0.0235] 
	x343: [ -0.0000,   0.0235] 
	x344: [ -0.0000,   0.0235] 
	x345: [ -0.0000,   0.0235] 
	x346: [ -0.0000,   0.0235] 
	x347: [ -0.0000,   0.0235] 
	x348: [ -0.0000,   0.0235] 
	x349: [ -0.0000,   0.0235] 
	x350: [ -0.0000,   0.0235] 
	x351: [ -0.0000,   0.0235] 
	x352: [  0.3490,   0.3961] 
	x353: [  0.9333,   0.9804] 
	x354: [  0.9647,   1.0000] 
	x355: [  0.9647,   1.0000] 
	x356: [  0.6706,   0.7176] 
	x357: [ -0.0000,   0.0235] 
	x358: [ -0.0000,   0.0235] 
	x359: [ -0.0000,   0.0235] 
	x360: [ -0.0000,   0.0235] 
	x361: [ -0.0000,   0.0235] 
	x362: [ -0.0000,   0.0235] 
	x363: [ -0.0000,   0.0235] 
	x364: [ -0.0000,   0.0235] 
	x365: [ -0.0000,   0.0235] 
	x366: [ -0.0000,   0.0235] 
	x367: [ -0.0000,   0.0235] 
	x368: [ -0.0000,   0.0235] 
	x369: [ -0.0000,   0.0235] 
	x370: [ -0.0000,   0.0235] 
	x371: [ -0.0000,   0.0235] 
	x372: [ -0.0000,   0.0235] 
	x373: [ -0.0000,   0.0235] 
	x374: [ -0.0000,   0.0235] 
	x375: [ -0.0000,   0.0235] 
	x376: [ -0.0000,   0.0235] 
	x377: [ -0.0000,   0.0235] 
	x378: [ -0.0000,   0.0235] 
	x379: [  0.0275,   0.0745] 
	x380: [  0.9216,   0.9686] 
	x381: [  0.9647,   1.0000] 
	x382: [  0.9647,   1.0000] 
	x383: [  0.4706,   0.5176] 
	x384: [  0.0706,   0.1176] 
	x385: [ -0.0000,   0.0235] 
	x386: [ -0.0000,   0.0235] 
	x387: [ -0.0000,   0.0235] 
	x388: [ -0.0000,   0.0235] 
	x389: [ -0.0000,   0.0235] 
	x390: [ -0.0000,   0.0235] 
	x391: [ -0.0000,   0.0235] 
	x392: [ -0.0000,   0.0235] 
	x393: [ -0.0000,   0.0235] 
	x394: [ -0.0000,   0.0235] 
	x395: [ -0.0000,   0.0235] 
	x396: [ -0.0000,   0.0235] 
	x397: [ -0.0000,   0.0235] 
	x398: [ -0.0000,   0.0235] 
	x399: [ -0.0000,   0.0235] 
	x400: [ -0.0000,   0.0235] 
	x401: [ -0.0000,   0.0235] 
	x402: [ -0.0000,   0.0235] 
	x403: [ -0.0000,   0.0235] 
	x404: [ -0.0000,   0.0235] 
	x405: [ -0.0000,   0.0235] 
	x406: [  0.0078,   0.0549] 
	x407: [  0.7490,   0.7961] 
	x408: [  0.9647,   1.0000] 
	x409: [  0.9647,   1.0000] 
	x410: [  0.9490,   0.9961] 
	x411: [  0.1725,   0.2196] 
	x412: [ -0.0000,   0.0235] 
	x413: [ -0.0000,   0.0235] 
	x414: [ -0.0000,   0.0235] 
	x415: [ -0.0000,   0.0235] 
	x416: [ -0.0000,   0.0235] 
	x417: [ -0.0000,   0.0235] 
	x418: [ -0.0000,   0.0235] 
	x419: [ -0.0000,   0.0235] 
	x420: [ -0.0000,   0.0235] 
	x421: [ -0.0000,   0.0235] 
	x422: [ -0.0000,   0.0235] 
	x423: [ -0.0000,   0.0235] 
	x424: [ -0.0000,   0.0235] 
	x425: [ -0.0000,   0.0235] 
	x426: [ -0.0000,   0.0235] 
	x427: [ -0.0000,   0.0235] 
	x428: [ -0.0000,   0.0235] 
	x429: [ -0.0000,   0.0235] 
	x430: [ -0.0000,   0.0235] 
	x431: [ -0.0000,   0.0235] 
	x432: [ -0.0000,   0.0235] 
	x433: [  0.0078,   0.0549] 
	x434: [  0.7451,   0.7922] 
	x435: [  0.9686,   1.0000] 
	x436: [  0.9647,   1.0000] 
	x437: [  0.9647,   1.0000] 
	x438: [  0.3765,   0.4235] 
	x439: [ -0.0000,   0.0235] 
	x440: [ -0.0000,   0.0235] 
	x441: [ -0.0000,   0.0235] 
	x442: [ -0.0000,   0.0235] 
	x443: [ -0.0000,   0.0235] 
	x444: [ -0.0000,   0.0235] 
	x445: [ -0.0000,   0.0235] 
	x446: [ -0.0000,   0.0235] 
	x447: [ -0.0000,   0.0235] 
	x448: [ -0.0000,   0.0235] 
	x449: [ -0.0000,   0.0235] 
	x450: [ -0.0000,   0.0235] 
	x451: [ -0.0000,   0.0235] 
	x452: [ -0.0000,   0.0235] 
	x453: [ -0.0000,   0.0235] 
	x454: [ -0.0000,   0.0235] 
	x455: [ -0.0000,   0.0235] 
	x456: [ -0.0000,   0.0235] 
	x457: [ -0.0000,   0.0235] 
	x458: [ -0.0000,   0.0235] 
	x459: [ -0.0000,   0.0235] 
	x460: [  0.0275,   0.0745] 
	x461: [  0.7490,   0.7961] 
	x462: [  0.9686,   1.0000] 
	x463: [  0.9765,   1.0000] 
	x464: [  0.9686,   1.0000] 
	x465: [  0.6000,   0.6471] 
	x466: [ -0.0000,   0.0235] 
	x467: [ -0.0000,   0.0235] 
	x468: [ -0.0000,   0.0235] 
	x469: [ -0.0000,   0.0235] 
	x470: [ -0.0000,   0.0235] 
	x471: [ -0.0000,   0.0235] 
	x472: [ -0.0000,   0.0235] 
	x473: [ -0.0000,   0.0235] 
	x474: [ -0.0000,   0.0235] 
	x475: [ -0.0000,   0.0235] 
	x476: [ -0.0000,   0.0235] 
	x477: [ -0.0000,   0.0235] 
	x478: [ -0.0000,   0.0235] 
	x479: [ -0.0000,   0.0235] 
	x480: [ -0.0000,   0.0235] 
	x481: [ -0.0000,   0.0235] 
	x482: [ -0.0000,   0.0235] 
	x483: [ -0.0000,   0.0235] 
	x484: [ -0.0000,   0.0235] 
	x485: [ -0.0000,   0.0235] 
	x486: [ -0.0000,   0.0235] 
	x487: [  0.0431,   0.0902] 
	x488: [  0.4588,   0.5059] 
	x489: [  0.9647,   1.0000] 
	x490: [  0.9647,   1.0000] 
	x491: [  0.9686,   1.0000] 
	x492: [  0.9647,   1.0000] 
	x493: [  0.3804,   0.4275] 
	x494: [ -0.0000,   0.0235] 
	x495: [ -0.0000,   0.0235] 
	x496: [ -0.0000,   0.0235] 
	x497: [ -0.0000,   0.0235] 
	x498: [ -0.0000,   0.0235] 
	x499: [ -0.0000,   0.0235] 
	x500: [ -0.0000,   0.0235] 
	x501: [ -0.0000,   0.0235] 
	x502: [ -0.0000,   0.0235] 
	x503: [ -0.0000,   0.0235] 
	x504: [ -0.0000,   0.0235] 
	x505: [ -0.0000,   0.0235] 
	x506: [ -0.0000,   0.0235] 
	x507: [ -0.0000,   0.0235] 
	x508: [ -0.0000,   0.0235] 
	x509: [ -0.0000,   0.0235] 
	x510: [ -0.0000,   0.0235] 
	x511: [ -0.0000,   0.0235] 
	x512: [ -0.0000,   0.0235] 
	x513: [ -0.0000,   0.0235] 
	x514: [ -0.0000,   0.0235] 
	x515: [  0.3294,   0.3765] 
	x516: [  0.9647,   1.0000] 
	x517: [  0.9647,   1.0000] 
	x518: [  0.9647,   1.0000] 
	x519: [  0.9686,   1.0000] 
	x520: [  0.1216,   0.1686] 
	x521: [ -0.0000,   0.0353] 
	x522: [ -0.0000,   0.0235] 
	x523: [ -0.0000,   0.0235] 
	x524: [ -0.0000,   0.0235] 
	x525: [ -0.0000,   0.0235] 
	x526: [ -0.0000,   0.0235] 
	x527: [ -0.0000,   0.0235] 
	x528: [ -0.0000,   0.0235] 
	x529: [ -0.0000,   0.0235] 
	x530: [ -0.0000,   0.0235] 
	x531: [ -0.0000,   0.0235] 
	x532: [ -0.0000,   0.0235] 
	x533: [ -0.0000,   0.0235] 
	x534: [ -0.0000,   0.0235] 
	x535: [ -0.0000,   0.0235] 
	x536: [ -0.0000,   0.0235] 
	x537: [ -0.0000,   0.0235] 
	x538: [ -0.0000,   0.0235] 
	x539: [ -0.0000,   0.0235] 
	x540: [ -0.0000,   0.0235] 
	x541: [ -0.0000,   0.0235] 
	x542: [  0.0431,   0.0902] 
	x543: [  0.7529,   0.8000] 
	x544: [  0.9647,   1.0000] 
	x545: [  0.9647,   1.0000] 
	x546: [  0.7961,   0.8431] 
	x547: [  0.4078,   0.4549] 
	x548: [ -0.0000,   0.0314] 
	x549: [ -0.0000,   0.0235] 
	x550: [ -0.0000,   0.0235] 
	x551: [ -0.0000,   0.0235] 
	x552: [ -0.0000,   0.0235] 
	x553: [ -0.0000,   0.0235] 
	x554: [ -0.0000,   0.0235] 
	x555: [ -0.0000,   0.0235] 
	x556: [ -0.0000,   0.0235] 
	x557: [ -0.0000,   0.0235] 
	x558: [ -0.0000,   0.0235] 
	x559: [ -0.0000,   0.0235] 
	x560: [ -0.0000,   0.0235] 
	x561: [ -0.0000,   0.0235] 
	x562: [ -0.0000,   0.0235] 
	x563: [ -0.0000,   0.0235] 
	x564: [ -0.0000,   0.0235] 
	x565: [ -0.0000,   0.0235] 
	x566: [ -0.0000,   0.0235] 
	x567: [ -0.0000,   0.0235] 
	x568: [ -0.0000,   0.0235] 
	x569: [  0.0471,   0.0941] 
	x570: [  0.6667,   0.7137] 
	x571: [  0.9647,   1.0000] 
	x572: [  0.9647,   1.0000] 
	x573: [  0.9490,   0.9961] 
	x574: [  0.3216,   0.3686] 
	x575: [ -0.0000,   0.0235] 
	x576: [ -0.0000,   0.0235] 
	x577: [ -0.0000,   0.0235] 
	x578: [ -0.0000,   0.0235] 
	x579: [ -0.0000,   0.0235] 
	x580: [ -0.0000,   0.0235] 
	x581: [ -0.0000,   0.0235] 
	x582: [ -0.0000,   0.0235] 
	x583: [ -0.0000,   0.0235] 
	x584: [ -0.0000,   0.0235] 
	x585: [ -0.0000,   0.0235] 
	x586: [ -0.0000,   0.0235] 
	x587: [ -0.0000,   0.0235] 
	x588: [ -0.0000,   0.0235] 
	x589: [ -0.0000,   0.0235] 
	x590: [ -0.0000,   0.0235] 
	x591: [ -0.0000,   0.0235] 
	x592: [ -0.0000,   0.0235] 
	x593: [ -0.0000,   0.0235] 
	x594: [ -0.0000,   0.0235] 
	x595: [ -0.0000,   0.0235] 
	x596: [  0.0431,   0.0902] 
	x597: [  0.3961,   0.4431] 
	x598: [  0.9647,   1.0000] 
	x599: [  0.9647,   1.0000] 
	x600: [  0.9647,   1.0000] 
	x601: [  0.5255,   0.5725] 
	x602: [ -0.0000,   0.0235] 
	x603: [ -0.0000,   0.0235] 
	x604: [ -0.0000,   0.0235] 
	x605: [ -0.0000,   0.0235] 
	x606: [ -0.0000,   0.0235] 
	x607: [ -0.0000,   0.0235] 
	x608: [ -0.0000,   0.0235] 
	x609: [ -0.0000,   0.0235] 
	x610: [ -0.0000,   0.0235] 
	x611: [ -0.0000,   0.0235] 
	x612: [ -0.0000,   0.0235] 
	x613: [ -0.0000,   0.0235] 
	x614: [ -0.0000,   0.0235] 
	x615: [ -0.0000,   0.0235] 
	x616: [ -0.0000,   0.0235] 
	x617: [ -0.0000,   0.0235] 
	x618: [ -0.0000,   0.0235] 
	x619: [ -0.0000,   0.0235] 
	x620: [ -0.0000,   0.0235] 
	x621: [ -0.0000,   0.0235] 
	x622: [ -0.0000,   0.0235] 
	x623: [ -0.0000,   0.0235] 
	x624: [  0.6471,   0.6941] 
	x625: [  0.9647,   1.0000] 
	x626: [  0.9647,   1.0000] 
	x627: [  0.9647,   1.0000] 
	x628: [  0.8902,   0.9373] 
	x629: [  0.1059,   0.1529] 
	x630: [ -0.0000,   0.0235] 
	x631: [ -0.0000,   0.0235] 
	x632: [ -0.0000,   0.0235] 
	x633: [ -0.0000,   0.0235] 
	x634: [ -0.0000,   0.0235] 
	x635: [ -0.0000,   0.0235] 
	x636: [ -0.0000,   0.0235] 
	x637: [ -0.0000,   0.0235] 
	x638: [ -0.0000,   0.0235] 
	x639: [ -0.0000,   0.0235] 
	x640: [ -0.0000,   0.0235] 
	x641: [ -0.0000,   0.0235] 
	x642: [ -0.0000,   0.0235] 
	x643: [ -0.0000,   0.0235] 
	x644: [ -0.0000,   0.0235] 
	x645: [ -0.0000,   0.0235] 
	x646: [ -0.0000,   0.0235] 
	x647: [ -0.0000,   0.0235] 
	x648: [ -0.0000,   0.0235] 
	x649: [ -0.0000,   0.0235] 
	x650: [ -0.0000,   0.0235] 
	x651: [  0.0157,   0.0627] 
	x652: [  0.8275,   0.8745] 
	x653: [  0.9647,   1.0000] 
	x654: [  0.9647,   1.0000] 
	x655: [  0.9647,   1.0000] 
	x656: [  0.5255,   0.5725] 
	x657: [ -0.0000,   0.0235] 
	x658: [ -0.0000,   0.0235] 
	x659: [ -0.0000,   0.0235] 
	x660: [ -0.0000,   0.0235] 
	x661: [ -0.0000,   0.0235] 
	x662: [ -0.0000,   0.0235] 
	x663: [ -0.0000,   0.0235] 
	x664: [ -0.0000,   0.0235] 
	x665: [ -0.0000,   0.0235] 
	x666: [ -0.0000,   0.0235] 
	x667: [ -0.0000,   0.0235] 
	x668: [ -0.0000,   0.0235] 
	x669: [ -0.0000,   0.0235] 
	x670: [ -0.0000,   0.0235] 
	x671: [ -0.0000,   0.0235] 
	x672: [ -0.0000,   0.0235] 
	x673: [ -0.0000,   0.0235] 
	x674: [ -0.0000,   0.0235] 
	x675: [ -0.0000,   0.0235] 
	x676: [ -0.0000,   0.0235] 
	x677: [ -0.0000,   0.0235] 
	x678: [ -0.0000,   0.0235] 
	x679: [  0.3255,   0.3725] 
	x680: [  0.9569,   1.0000] 
	x681: [  0.9647,   1.0000] 
	x682: [  0.9647,   1.0000] 
	x683: [  0.8431,   0.8902] 
	x684: [  0.1294,   0.1765] 
	x685: [ -0.0000,   0.0235] 
	x686: [ -0.0000,   0.0235] 
	x687: [ -0.0000,   0.0235] 
	x688: [ -0.0000,   0.0235] 
	x689: [ -0.0000,   0.0235] 
	x690: [ -0.0000,   0.0235] 
	x691: [ -0.0000,   0.0235] 
	x692: [ -0.0000,   0.0235] 
	x693: [ -0.0000,   0.0235] 
	x694: [ -0.0000,   0.0235] 
	x695: [ -0.0000,   0.0235] 
	x696: [ -0.0000,   0.0235] 
	x697: [ -0.0000,   0.0235] 
	x698: [ -0.0000,   0.0235] 
	x699: [ -0.0000,   0.0235] 
	x700: [ -0.0000,   0.0235] 
	x701: [ -0.0000,   0.0235] 
	x702: [ -0.0000,   0.0235] 
	x703: [ -0.0000,   0.0235] 
	x704: [ -0.0000,   0.0235] 
	x705: [ -0.0000,   0.0235] 
	x706: [ -0.0000,   0.0235] 
	x707: [ -0.0000,   0.0235] 
	x708: [  0.8118,   0.8588] 
	x709: [  0.8275,   0.8745] 
	x710: [  0.8275,   0.8745] 
	x711: [  0.2863,   0.3333] 
	x712: [ -0.0000,   0.0235] 
	x713: [ -0.0000,   0.0235] 
	x714: [ -0.0000,   0.0235] 
	x715: [ -0.0000,   0.0235] 
	x716: [ -0.0000,   0.0235] 
	x717: [ -0.0000,   0.0235] 
	x718: [ -0.0000,   0.0235] 
	x719: [ -0.0000,   0.0235] 
	x720: [ -0.0000,   0.0235] 
	x721: [ -0.0000,   0.0235] 
	x722: [ -0.0000,   0.0235] 
	x723: [ -0.0000,   0.0235] 
	x724: [ -0.0000,   0.0235] 
	x725: [ -0.0000,   0.0235] 
	x726: [ -0.0000,   0.0235] 
	x727: [ -0.0000,   0.0235] 
	x728: [ -0.0000,   0.0235] 
	x729: [ -0.0000,   0.0235] 
	x730: [ -0.0000,   0.0235] 
	x731: [ -0.0000,   0.0235] 
	x732: [ -0.0000,   0.0235] 
	x733: [ -0.0000,   0.0235] 
	x734: [ -0.0000,   0.0235] 
	x735: [ -0.0000,   0.0235] 
	x736: [ -0.0000,   0.0235] 
	x737: [ -0.0000,   0.0235] 
	x738: [ -0.0000,   0.0235] 
	x739: [ -0.0000,   0.0235] 
	x740: [ -0.0000,   0.0235] 
	x741: [ -0.0000,   0.0235] 
	x742: [ -0.0000,   0.0235] 
	x743: [ -0.0000,   0.0235] 
	x744: [ -0.0000,   0.0235] 
	x745: [ -0.0000,   0.0235] 
	x746: [ -0.0000,   0.0235] 
	x747: [ -0.0000,   0.0235] 
	x748: [ -0.0000,   0.0235] 
	x749: [ -0.0000,   0.0235] 
	x750: [ -0.0000,   0.0235] 
	x751: [ -0.0000,   0.0235] 
	x752: [ -0.0000,   0.0235] 
	x753: [ -0.0000,   0.0235] 
	x754: [ -0.0000,   0.0235] 
	x755: [ -0.0000,   0.0235] 
	x756: [ -0.0000,   0.0235] 
	x757: [ -0.0000,   0.0235] 
	x758: [ -0.0000,   0.0235] 
	x759: [ -0.0000,   0.0235] 
	x760: [ -0.0000,   0.0235] 
	x761: [ -0.0000,   0.0235] 
	x762: [ -0.0000,   0.0235] 
	x763: [ -0.0000,   0.0235] 
	x764: [ -0.0000,   0.0235] 
	x765: [ -0.0000,   0.0235] 
	x766: [ -0.0000,   0.0235] 
	x767: [ -0.0000,   0.0235] 
	x768: [ -0.0000,   0.0235] 
	x769: [ -0.0000,   0.0235] 
	x770: [ -0.0000,   0.0235] 
	x771: [ -0.0000,   0.0235] 
	x772: [ -0.0000,   0.0235] 
	x773: [ -0.0000,   0.0235] 
	x774: [ -0.0000,   0.0235] 
	x775: [ -0.0000,   0.0235] 
	x776: [ -0.0000,   0.0235] 
	x777: [ -0.0000,   0.0235] 
	x778: [ -0.0000,   0.0235] 
	x779: [ -0.0000,   0.0235] 
	x780: [ -0.0000,   0.0235] 
	x781: [ -0.0000,   0.0235] 
	x782: [ -0.0000,   0.0235] 
	x783: [ -0.0000,   0.0235] 

Branching heuristics set to PseudoImpact

Engine::solve: Initial statistics

17:06:13 Statistics update:
	--- Time Statistics ---
	Total time elapsed: 7110 milli (00:00:07)
		Main loop: 0 milli (00:00:00)
		Preprocessing time: 310 milli (00:00:00)
		Unknown: 6800 milli (00:00:06)
	Breakdown for main loop:
		[0.00%] Simplex steps: 0 milli
		[0.00%] Explicit-basis bound tightening: 0 milli
		[0.00%] Constraint-matrix bound tightening: 0 milli
		[0.00%] Degradation checking: 0 milli
		[0.00%] Precision restoration: 0 milli
		[0.00%] Statistics handling: 0 milli
		[0.00%] Constraint-fixing steps: 0 milli
		[0.00%] Valid case splits: 0 milli. Average per split: 0.00 milli
		[0.00%] Applying stored bound-tightening: 0 milli
		[0.00%] SMT core: 0 milli
		[0.00%] Symbolic Bound Tightening: 23 milli
		[0.00%] SoI-based local search: 0 milli
		[0.00%] SoI-based local search: 0 milli
		[0.00%] Unaccounted for: 0 milli
	--- Preprocessor Statistics ---
	Number of preprocessor bound-tightening loop iterations: 5
	Number of eliminated variables: 176
	Number of constraints removed due to variable elimination: 136
	Number of equations removed due to variable elimination: 0
	--- Engine Statistics ---
	Number of main loop iterations: 1
		0 iterations were simplex steps. Total time: 0 milli. Average: 0.00 milli.
		0 iterations were constraint-fixing steps. Total time: 0 milli. Average: 0.00 milli
	Number of active piecewise-linear constraints: 188 / 285
		Constraints disabled by valid splits: 97. By SMT-originated splits: 0
	Last reported degradation: 0.0000000000. Max degradation so[runlim] sample:		10.22 time, 10.01 real, 180 MB, 1.00 load
[runlim] sample:		20.22 time, 20.01 real, 180 MB, 1.00 load
[runlim] sample:		30.21 time, 30.01 real, 180 MB, 1.08 load
[runlim] sample:		40.21 time, 40.01 real, 180 MB, 1.06 load
[runlim] sample:		50.21 time, 50.01 real, 185 MB, 1.05 load
[runlim] sample:		60.20 time, 60.01 real, 185 MB, 1.05 load
[runlim] sample:		70.20 time, 70.01 real, 185 MB, 1.04 load
 far: 0.0000000000. Restorations so far: 0
	Number of simplex pivots we attempted to skip because of instability: 0.
	Unstable pivots performed anyway: 0
	--- Tableau Statistics ---
	Total number of pivots performed: 0
		Real pivots: 0. Degenerate: 0 (0.00%)
		Degenerate pivots by request (e.g., to fix a PL constraint): 0 (0.00%)
		Average time per pivot: 0.00 milli
	Total number of fake pivots performed: 0
	Total number of rows added: 0. Number of merged columns: 0
	Current tableau dimensions: M = 830, N = 2728
	--- SMT Core Statistics ---
	Total depth is 0. Total visited states: 1. Number of splits: 0. Number of pops: 0
	Max stack depth: 0
	--- Bound Tightening Statistics ---
	Number of tightened bounds: 0.
		Number of rows examined by row tightener: 0. Consequent tightenings: 0
		Number of explicit basis matrices examined by row tightener: 0. Consequent tightenings: 0
		Number of bound tightening rounds on the entire constraint matrix: 0. Consequent tightenings: 0
		Number of bound notifications sent to PL constraints: 1724. Tightenings proposed: 0
	--- Basis Factorization statistics ---
	Number of basis refactorizations: 2
	--- Projected Steepest Edge Statistics ---
	Number of iterations: 0.
	Number of resets to reference space: 1. Avg. iterations per reset: 0
	--- SBT ---
	Number of tightened bounds: 716
	--- SoI-based local search ---
	Number of proposed phase pattern update: 0. Number of accepted update: 0 [0.00%]
	Total time (% of local search time) updating SoI phase pattern : 0 milli [0.00%]
	Total time obtaining current assignment: 0 milli [0.00%]
	Total time getting SoI phase pattern : 0 milli [0.00%]
	--- Context dependent statistics ---
	Number of pushes / pops: 0 / 0
		[0.00%] Pre-Push hook: 0 milli
		[0.00%] Push : 0 milli
		[0.00%] Post-Pop hook: 0 milli
		[0.00%] Pop : 0 milli
		[0.00%] Total context-switching time: 0 milli
	--- Proof Certificate ---
	Number of certified leaves: 0
	Number of leaves to delegate: 0

---

17:06:49 Statistics update:
	--- Time Statistics ---
	Total time elapsed: 43257 milli (00:00:43)
		Main loop: 34256 milli (00:00:34)
		Preprocessing time: 310 milli (00:00:00)
		Unknown: 8690 milli (00:00:08)
	Breakdown for main loop:
		[86.28%] Simplex steps: 29557 milli
		[17.59%] Explicit-basis bound tightening: 6024 milli
		[0.00%] Constraint-matrix bound tightening: 0 milli
		[0.63%] Degradation checking: 217 milli
		[0.00%] Precision restoration: 0 milli
		[0.20%] Statistics handling: 67 milli
		[0.00%] Constraint-fixing steps: 0 milli
		[0.00%] Valid case splits: 0 milli. Average per split: 0.00 milli
		[0.00%] Applying stored bound-tightening: 1 milli
		[0.03%] SMT core: 9 milli
		[0.51%] Symbolic Bound Tightening: 175 milli
		[68.36%] SoI-based local search: 23418 milli
		[0.00%] SoI-based local search: 0 milli
		[53848227084360.64%] Unaccounted for: 0 milli
	--- Preprocessor Statistics ---
	Number of preprocessor bound-tightening loop iterations: 5
	Number of eliminated variables: 176
	Number of constraints removed due to variable elimination: 136
	Number of equations removed due to variable elimination: 0
	--- Engine Statistics ---
	Number of main loop iterations: 10000
		9974 iterations were simplex steps. Total time: 29557 milli. Average: 2.96 milli.
		0 iterations were constraint-fixing steps. Total time: 0 milli. Average: 0.00 milli
	Number of active piecewise-linear constraints: 177 / 285
		Constraints disabled by valid splits: 97. By SMT-originated splits: 11
	Last reported degradation: 0.0000000000. Max degradation so far: 0.0000000000. Restorations so far: 0
	Number of simplex pivots we attempted to skip because of instability: 6.
	Unstable pivots performed anyway: 0
	--- Tableau Statistics ---
	Total number of pivots performed: 9729
		Real pivots: 9725. Degenerate: 4 (0.04%)
		Degenerate pivots by request (e.g., to fix a PL constraint): 0 (0.00%)
		Average time per pivot: 0.17 milli
	Total number of fake pivots performed: 161
	Total number of rows added: 0. Number of merged columns: 0
	Current tableau dimensions: M = 830, N = 2728
	--- SMT Core Statistics ---
	Total depth is 11. Total visited states: 13. Number of splits: 11. Number of pops: 1
	Max stack depth: 11
	--- Bound Tightening Statistics ---
	Number of tightened bounds: 878.
		Number of rows examined by row tightener: 9729. Consequent tightenings: 0
		Number of explicit basis matrices examined by row tightener: 12. Consequent tightenings: 147
		Number of bound tightening rounds on the entire constraint matrix: 0. Consequent tightenings: 0
		Number of bound notifications sent to PL constraints: 4321. Tightenings proposed: 0
	--- Basis Factorization statistics ---
	Number of basis refactorizations: 92
	--- Projected Steepest Edge Statistics ---
	Number of iterations: 9896.
	Number of resets to reference space: 11. Avg. iterations per reset: 899
	--- SBT ---
	Number of tightened bounds: 1594
	--- SoI-based local search ---
	Number of proposed phase pattern update: 34. Number of accepted update: 33 [97.06%]
	Total time (% of local search time) updating SoI phase pattern : 6236 milli [0.03%]
	Total time obtaining current assignment: 14723 milli [0.06%]
	Total time getting SoI phase pattern : 3617 milli [0.01%]
	--- Context dependent statistics ---
	Number of pushes / pops: 13 / 2
		[0.00%] Pre-Push hook: 1 milli
		[0.00%] Push : 0 milli
		[0.00%] Post-Pop hook: 0 milli
		[0.00%] Pop : 0 milli
		[0.00%] Total context-switching time: 1 milli
	--- Proof Certificate ---
	Number of certified leaves: 0
	Number of leaves to delegate: 0

17:07:22 Statistics update:
	--- Time Statistics ---
	Total time elapsed: 76403 milli (00:01:16)
		Main loop: 66137 milli (00:01:06)
		Preprocessing time: 310 milli (00:00:00)
		Unknown: 9955 milli (00:00:09)
	Breakdown for main loop:
		[91.49%] Simplex steps: 60508 milli
		[11.55%] Explicit-basis bound tightening: 7642 milli
		[0.00%] Constraint-matrix bound tightening: 0 milli
		[0.67%] Degradation checking: 440 milli
		[0.00%] Precision restoration: 0 milli
		[0.20%] Statistics handling: 135 milli
		[0.00%] Constraint-fixing steps: 0 milli
		[0.00%] Valid case splits: 0 milli. Average per split: 0.00 milli
		[0.00%] Applying stored bound-tightening: 2 milli
		[0.02%] SMT core: 11 milli
		[0.51%] Symbolic Bound Tightening: 337 milli
		[71.92%] SoI-based local search: 47568 milli
		[0.00%] SoI-based local search: 0 milli
		[27891524330081.72%] Unaccounted for: 0 milli
	--- Preprocessor Statistics ---
	Number of preprocessor bound-tightening loop iterations: 5
	Number of eliminated variables: 176
	Number of constraints removed due to variable elimination: 136
	Number of equations removed due to variable elimination: 0
	--- Engine Statistics ---
	Number of main loop iterations: 20000
		19952 iterations were simplex steps. Total time: 60508 milli. Average: 3.03 milli.
		0 iterations were constraint-fixing steps. Total time: 0 milli. Average: 0.00 milli
	Number of active piecewise-linear constraints: 161 / 285
		Constraints disabled by valid splits: 104. By SMT-originated splits: 20
	Last reported degradation: 0.0000000000. Max degradation so far: 0.0000000000. Restorations so far: 0
	Number of simplex pivots we attempted to skip because of instability: 15.
	Unstable pivots performed anyway: 0
	--- Tableau Statistics ---
	Total number of pivots performed: 19577
		Real pivots: 19570. Degenerate: 7 (0.04%)
		Degenerate pivots by request (e.g., to fix a PL constraint): 0 (0.00%)
		Average time per pivot: 0.20 milli
	Total number of fake pivots performed: 181
	Total number of rows added: 0. Number of merged columns: 0
	Current tableau dimensions: M = 830, N = 2728
	--- SMT Core Statistics ---
	Total depth is 20. Total visited states: 22. Number of splits: 20. Number of pops: 1
	Max stack depth: 20
	--- Bound Tightening Statistics ---
	Number of tightened bounds: 1873.
		Number of rows examined by row tightener: 19577. Consequent tightenings: 0
		Number of explicit basis matrices examined by row tightener: 15. Consequent tightenings: 154
		Number of bound tightening rounds on the entire constraint matrix: 0. Consequent tightenings: 0
		Number of bound notifications sent to PL constraints: 5559. Tightenings propos[runlim] sample:		80.20 time, 80.01 real, 185 MB, 1.03 load
[runlim] sample:		90.20 time, 90.01 real, 192 MB, 1.03 load
[runlim] sample:		100.20 time, 100.01 real, 192 MB, 1.02 load
[runlim] sample:		110.20 time, 110.01 real, 192 MB, 1.02 load
[runlim] sample:		120.19 time, 120.01 real, 196 MB, 1.02 load
ed: 0
	--- Basis Factorization statistics ---
	Number of basis refactorizations: 187
	--- Projected Steepest Edge Statistics ---
	Number of iterations: 19773.
	Number of resets to reference space: 21. Avg. iterations per reset: 941
	--- SBT ---
	Number of tightened bounds: 2589
	--- SoI-based local search ---
	Number of proposed phase pattern update: 80. Number of accepted update: 69 [86.25%]
	Total time (% of local search time) updating SoI phase pattern : 12229 milli [0.03%]
	Total time obtaining current assignment: 33510 milli [0.07%]
	Total time getting SoI phase pattern : 7894 milli [0.01%]
	--- Context dependent statistics ---
	Number of pushes / pops: 22 / 2
		[0.00%] Pre-Push hook: 1 milli
		[0.00%] Push : 0 milli
		[0.00%] Post-Pop hook: 0 milli
		[0.00%] Pop : 0 milli
		[0.00%] Total context-switching time: 2 milli
	--- Proof Certificate ---
	Number of certified leaves: 0
	Number of leaves to delegate: 0

17:07:55 Statistics update:
	--- Time Statistics ---
	Total time elapsed: 109568 milli (00:01:49)
		Main loop: 100067 milli (00:01:40)
		Preprocessing time: 310 milli (00:00:00)
		Unknown: 9190 milli (00:00:09)
	Breakdown for main loop:
		[91.91%] Simplex steps: 91976 milli
		[8.73%] Explicit-basis bound tightening: 8733 milli
		[0.00%] Constraint-matrix bound tightening: 0 milli
		[0.65%] Degradation checking: 649 milli
		[0.00%] Precision restoration: 0 milli
		[0.20%] Statistics handling: 203 milli
		[0.00%] Constraint-fixing steps: 0 milli
		[0.00%] Valid case splits: 1 milli. Average per split: 0.00 milli
		[0.00%] Applying stored bound-tightening: 4 milli
		[0.01%] SMT core: 14 milli
		[0.49%] Symbolic Bound Tightening: 490 milli
		[72.48%] SoI-based local search: 72531 milli
		[0.00%] SoI-based local search: 0 milli
		[18434300183711.53%] Unaccounted for: 0 milli
	--- Preprocessor Statistics ---
	Number of preprocessor bound-tightening loop iterations: 5
	Number of eliminated variables: 176
	Number of constraints removed due to variable elimination: 136
	Number of equations removed due to variable elimination: 0
	--- Engine Statistics ---
	Number of main loop iterations: 30000
		29912 iterations were simplex steps. Total time: 91976 milli. Average: 3.07 milli.
		0 iterations were constraint-fixing steps. Total time: 0 milli. Average: 0.00 milli
	Number of active piecewise-linear constraints: 148 / 285
		Constraints disabled by valid splits: 106. By SMT-originated splits: 31
	Last reported degradation: 0.0000000000. Max degradation so far: 0.0000000000. Restorations so far: 0
	Number of simplex pivots we attempted to skip because of instability: 101.
	Unstable pivots performed anyway: 2
	--- Tableau Statistics ---
	Total number of pivots performed: 29330
		Real pivots: 29315. Degenerate: 15 (0.05%)
		Degenerate pivots by request (e.g., to fix a PL constraint): 0 (0.00%)
		Average time per pivot: 0.23 milli
	Total number of fake pivots performed: 241
	Total number of rows added: 0. Number of merged columns: 0
	Current tableau dimensions: M = 830, N = 2728
	--- SMT Core Statistics ---
	Total depth is 31. Total visited states: 33. Number of splits: 31. Number of pops: 1
	Max stack depth: 31
	--- Bound Tightening Statistics ---
	Number of tightened bounds: 3204.
		Number of rows examined by row tightener: 29330. Consequent tightenings: 0
		Number of explicit basis matrices examined by row tightener: 17. Consequent tightenings: 157
		Number of bound tightening rounds on the entire constraint matrix: 0. Consequent tightenings: 0
		Number of bound notifications sent to PL constraints: 7525. Tightenings proposed: 0
	--- Basis Factorization statistics ---
	Number of basis refactorizations: 281
	--- Projected Steepest Edge Statistics ---
	Number of iterations: 29670.
	Number of resets to reference space: 31. Avg. iterations per reset: 957
	--- SBT ---
	Number of tightened bounds: 3920
	--- SoI-based local search ---
	Number of proposed phase pattern update: 142. Number of accepted update: 120 [84.51%]
	Total time (% of local search time) updating SoI phase pattern : 23402 milli [0.03%]
	Total time obtaining current assignment: 60840 milli [0.08%]
	Total time getting SoI phase pattern : 13289 milli [0.01%]
	--- Context dependent statistics ---
	Number of pushes / pops: 33 / 2
		[0.00%] Pre-Push hook: 3 milli
		[0.00%] Push : 0 milli
		[0.00%] Post-Pop hook: 0 milli
		[0.00%] Pop : 0 milli
		[0.00%] Total context-switching time: 3 milli
	--- Proof Certificate ---
	Number of certified leaves: 0
	Number of leaves to delegate: 0


Engine: quitting due to external request...

Final statistics:

17:08:07 Statistics update:
	--- Time Statistics ---
	Total time elapsed: 120772 milli (00:02:00)
		Main loop: 113661 milli (00:01:53)
		Preprocessing time: 310 milli (00:00:00)
		Unknown: 6801 milli (00:00:06)
	Breakdown for main loop:
		[90.10%] Simplex steps: 102404 milli
		[8.16%] Explicit-basis bound tightening: 9273 milli
		[0.00%] Constraint-matrix bound tightening: 0 milli
		[0.63%] Degradation checking: 719 milli
		[0.00%] Precision restoration: 0 milli
		[0.20%] Statistics handling: 226 milli
		[0.00%] Constraint-fixing steps: 0 milli
		[0.00%] Valid case splits: 1 milli. Average per split: 0.00 milli
		[0.00%] Applying stored bound-tightening: 4 milli
		[0.01%] SMT core: 15 milli
		[0.47%] Symbolic Bound Tightening: 537 milli
		[70.73%] SoI-based local search: 80393 milli
		[0.00%] SoI-based local search: 0 milli
		[0.42%] Unaccounted for: 478 milli
	--- Preprocessor Statistics ---
	Number of preprocessor bound-tightening loop iterations: 5
	Number of eliminated variables: 176
	Number of constraints removed due to variable elimination: 136
	Number of equations removed due to variable elimination: 0
	--- Engine Statistics ---
	Number of main loop iterations: 33283
		33186 iterations were simplex steps. Total time: 102404 milli. Average: 3.09 milli.
		0 iterations were constraint-fixing steps. Total time: 0 milli. Average: 0.00 milli
	Number of active piecewise-linear constraints: 144 / 285
		Constraints disabled by valid splits: 107. By SMT-originated splits: 34
	Last reported degradation: 0.0000000000. Max degradation so far: 0.0000000000. Restorations so far: 0
	Number of simplex pivots we attempted to skip because of instability: 140.
	Unstable pivots performed anyway: 5
	--- Tableau Statistics ---
	Total number of pivots performed: 32551
		Real pivots: 32534. Degenerate: 17 (0.05%)
		Degenerate pivots by request (e.g., to fix a PL constraint): 0 (0.00%)
		Average time per pivot: 0.24 milli
	Total number of fake pivots performed: 251
	Total number of rows added: 0. Number of merged columns: 0
	Current tableau dimensions: M = 830, N = 2728
	--- SMT Core Statistics ---
	Total depth is 34. Total visited states: 36. Number of splits: 34. Number of pops: 1
	Max stack depth: 34
	--- Bound Tightening Statistics ---
	Number of tightened bounds: 3678.
		Number of rows examined by row tightener: 32551. Consequent tightenings: 0
		Number of explicit basis matrices examined by row tightener: 18. Consequent tightenings: 159
		Number of bound tightening rounds on the entire constraint matrix: 0. Consequent tightenings: 0
		Number of bound notifications sent to PL constraints: 8199. Tightenings proposed: 0
	--- Basis Factorization statistics ---
	Number of basis refactorizations: 315
	--- Projected Steepest Edge Statistics ---
	Number of iterations: 32937.
	Number of resets to reference space: 35. Avg. iterations per reset: 941
	--- SBT ---
	Number of tightened bounds: 4394
	--- SoI-based local search ---
	Number of proposed phase pattern update: 158. Number of accepted update: 133 [84.18%]
	Total time (% of local search time) updating SoI phase pattern : 26166 milli [0.03%]
	Total time obtaining current assignment: 68777 milli [0.09%]
	Total time getting SoI phase pattern : 14643 milli [0.01%]
	--- Context dependent statistics ---
	Number of pushes / pops: 36 / 2
		[0.00%] Pre-Push hook: 3 milli
		[0.00%] Push : 0 milli
		[0.00%] Post-Pop hook: 0 milli
		[0.00%] Pop : 0 milli
		[0.00%] Total context-switching time: 3 milli
	--- Proof Certificate ---
	Number of certified leaves: 0
	Number of leaves to delegate: 0
Unexpected exit code! (this should not happen)[runlim] end:			Thu Oct  3 17:08:07 2024
[runlim] status:		out of time
[runlim] result:		2
[runlim] children:		1
[runlim] processes:		2
[runlim] real:			121.10 seconds
[runlim] time:			120.19 seconds
[runlim] space:			196 MB
[runlim] load:			1.08 maximum
[runlim] samples:		1200

real	2m1,101s
user	2m1,905s
sys	0m3,646s
