
[VERYDIFF_EXPERIMENT] Running on /home/i57/steuber/NeuroDiff/repos/VeryDiffExperiments/src/../benchmarks/mnist-prune/specs/mnist_73_global_6.vnnlib /home/i57/steuber/NeuroDiff/repos/VeryDiffExperiments/src/../benchmarks/mnist-prune/nets/mnist_relu_3_100.onnx
Found input X
op: matmul, weight: (100, 784), bias: nothing
op: bias, weight: nothing, bias: (100,)
op: relu, weight: nothing, bias: nothing
op: matmul, weight: (100, 100), bias: nothing
op: bias, weight: nothing, bias: (100,)
op: relu, weight: nothing, bias: nothing
op: matmul, weight: (10, 100), bias: nothing
op: bias, weight: nothing, bias: (10,)
op: relu, weight: nothing, bias: nothing
op: matmul, weight: (10, 10), bias: nothing
op: bias, weight: nothing, bias: (10,)
Found input X
op: gemm, weight: (100, 784), bias: (100,)
op: relu, weight: nothing, bias: nothing
op: gemm, weight: (100, 100), bias: (100,)
op: relu, weight: nothing, bias: nothing
op: gemm, weight: (10, 100), bias: (10,)
op: relu, weight: nothing, bias: nothing
op: gemm, weight: (10, 10), bias: (10,)
Distance: 368.62397500800625
Distance: 47.56803950402309
Distance: 2.8977568827249343
Distance: 0.01885471428334995
Running with 1 threads
[Thread 1] Time to first task: 0.0s
Instable Generators: 41
Instable Generators: 50
Instable Generators: 5
Zono Bounds:
[0.0002409548063108712, -1.3945660667264774, -1.5631927612943033, -1.6134062233955329, -1.6551418374358433, -0.0009116114704411354, -0.0004976224314655418, -1.685133039571111, -1.4864432947690736, -1.4376628233771924]
[0.0008385654216848495, 1.3905248020780658, 1.5645756877633652, 1.5510369078843105, 1.654242332579091, 0.001643103716454911, 0.0006218811484217397, 1.595134360630235, 1.4019426061154014, 1.5615512826625906]
[Thread 1] Processed 100 zonotopes (Work Done: 0.0%; Expected Zonos: Inf)
[Thread 1] Processed 200 zonotopes (Work Done: 0.0%; Expected Zonos: Inf)
[Thread 1] Processed 300 zonotopes (Work Done: 0.0%; Expected Zonos: Inf)
[Thread 1] Processed 400 zonotopes (Work Done: 0.0%; Expected Zonos: Inf)
[Thread 1] Processed 500 zonotopes (Work Done: 0.0%; Expected Zonos: Inf)


TIMEOUT REACHED
UNKNOWN
[Thread 1] Total splits: 572
Processed 572 zonotopes (Work Done: 0.0%); Generated 1144 (0.21019488851923077s/loop)
[Thread 1] Finished in 120.23s
 ────────────────────────────────────────────────────────────────────────────────
                                        Time                    Allocations      
                               ───────────────────────   ────────────────────────
       Tot / % measured:             120s / 100.0%           61.5GiB / 100.0%    

 Section               ncalls     time    %tot     avg     alloc    %tot      avg
 ────────────────────────────────────────────────────────────────────────────────
 Verify                     1     120s  100.0%    120s   61.5GiB  100.0%  61.5GiB
   Zonotope Loop            1     120s  100.0%    120s   61.5GiB  100.0%  61.5GiB
     Zonotope Propa...    572    72.6s   60.4%   127ms   41.5GiB   67.5%  74.3MiB
       DiffZonotope...  1.72k    62.5s   52.0%  36.5ms   39.2GiB   63.7%  23.4MiB
         Zonotope_R...  3.43k    62.1s   51.6%  18.1ms   38.2GiB   62.2%  11.4MiB
           Influenc...  3.43k    54.2s   45.1%  15.8ms   35.2GiB   57.2%  10.5MiB
             Alloca...  3.43k    26.3s   21.9%  7.67ms   17.3GiB   28.1%  5.15MiB
             Multiply   3.43k    25.4s   21.1%  7.39ms   17.9GiB   29.2%  5.35MiB
             Set Ma...  3.43k    2.51s    2.1%   731μs     0.00B    0.0%    0.00B
           Allocation   3.43k    7.17s    6.0%  2.09ms   1.53GiB    2.5%   466KiB
           Column M...  3.43k    479ms    0.4%   139μs   1.53GiB    2.5%   466KiB
           Set Matrix   3.43k    193ms    0.2%  56.1μs   3.67MiB    0.0%  1.09KiB
           Vectors      3.43k   17.6ms    0.0%  5.12μs   10.9MiB    0.0%  3.26KiB
           Bounds       3.43k   2.43ms    0.0%   707ns     0.00B    0.0%    0.00B
       DiffZonotope...  2.29k    10.0s    8.3%  4.37ms   2.34GiB    3.8%  1.05MiB
         Zonotope_D...  4.58k    4.83s    4.0%  1.06ms   1.53GiB    2.5%   350KiB
     Compute Split        572    31.7s   26.4%  55.5ms   8.71GiB   14.2%  15.6MiB
     Property Check       572    113ms    0.1%   197μs    119MiB    0.2%   213KiB
 Initialize                 1    567μs    0.0%   567μs   5.41MiB    0.0%  5.41MiB
 ────────────────────────────────────────────────────────────────────────────────
[VERYDIFF_TIMER] 120.262984172

[VERYDIFF_EXPERIMENT] NETWORK: /home/i57/steuber/NeuroDiff/repos/VeryDiffExperiments/src/../benchmarks/mnist-prune/specs/mnist_73_global_6.vnnlib
[VERYDIFF_EXPERIMENT] TIME: 120.72460954
