
[VERYDIFF_EXPERIMENT] Running on /home/i57/steuber/NeuroDiff/repos/VeryDiffExperiments/src/../benchmarks/mnist-prune/specs/mnist_98_global_5.vnnlib /home/i57/steuber/NeuroDiff/repos/VeryDiffExperiments/src/../benchmarks/mnist-prune/nets/mnist_relu_3_100.onnx
Found input X
op: matmul, weight: (100, 784), bias: nothing
op: bias, weight: nothing, bias: (100,)
op: relu, weight: nothing, bias: nothing
op: matmul, weight: (100, 100), bias: nothing
op: bias, weight: nothing, bias: (100,)
op: relu, weight: nothing, bias: nothing
op: matmul, weight: (10, 100), bias: nothing
op: bias, weight: nothing, bias: (10,)
op: relu, weight: nothing, bias: nothing
op: matmul, weight: (10, 10), bias: nothing
op: bias, weight: nothing, bias: (10,)
Found input X
op: gemm, weight: (100, 784), bias: (100,)
op: relu, weight: nothing, bias: nothing
op: gemm, weight: (100, 100), bias: (100,)
op: relu, weight: nothing, bias: nothing
op: gemm, weight: (10, 100), bias: (10,)
op: relu, weight: nothing, bias: nothing
op: gemm, weight: (10, 10), bias: (10,)
Distance: 368.62397500800625
Distance: 47.56803950402309
Distance: 2.8977568827249343
Distance: 0.01885471428334995
Running with 1 threads
[Thread 1] Time to first task: 0.0s
Instable Generators: 44
Instable Generators: 56
Instable Generators: 7
Zono Bounds:
[-1.3904966913669004, -1.4810016201832237, -1.5116113600820746, -0.0016885002457098413, -1.7388602823498533, -1.8095895290844113, -1.371758329892116, -0.002368980215211252, -1.5661179437471433, -1.5038744641089383]
[1.3736695908104815, 1.3870980622371658, 1.328162646859492, 0.0004465751395438599, 1.737049829070043, 1.7596033791044796, 1.539174709391249, 0.0020297778139974154, 1.5058695111792528, 1.5017132860627236]
[Thread 1] Processed 100 zonotopes (Work Done: 0.0%; Expected Zonos: Inf)
[Thread 1] Processed 200 zonotopes (Work Done: 0.0%; Expected Zonos: Inf)
[Thread 1] Processed 300 zonotopes (Work Done: 0.0%; Expected Zonos: Inf)
[Thread 1] Processed 400 zonotopes (Work Done: 0.0%; Expected Zonos: Inf)
[Thread 1] Processed 500 zonotopes (Work Done: 0.0%; Expected Zonos: Inf)


TIMEOUT REACHED
UNKNOWN
[Thread 1] Total splits: 574
Processed 574 zonotopes (Work Done: 0.0%); Generated 1148 (0.20921830306445993s/loop)
[Thread 1] Finished in 120.09s
 ────────────────────────────────────────────────────────────────────────────────
                                        Time                    Allocations      
                               ───────────────────────   ────────────────────────
       Tot / % measured:             120s / 100.0%           62.1GiB / 100.0%    

 Section               ncalls     time    %tot     avg     alloc    %tot      avg
 ────────────────────────────────────────────────────────────────────────────────
 Verify                     1     120s  100.0%    120s   62.1GiB  100.0%  62.1GiB
   Zonotope Loop            1     120s  100.0%    120s   62.1GiB  100.0%  62.1GiB
     Zonotope Propa...    574    72.6s   60.5%   127ms   42.0GiB   67.6%  75.0MiB
       DiffZonotope...  1.72k    62.7s   52.2%  36.4ms   39.7GiB   63.9%  23.6MiB
         Zonotope_R...  3.44k    62.2s   51.8%  18.1ms   38.7GiB   62.3%  11.5MiB
           Influenc...  3.44k    57.9s   48.2%  16.8ms   35.6GiB   57.3%  10.6MiB
             Multiply   3.44k    29.2s   24.3%  8.49ms   18.2GiB   29.3%  5.41MiB
             Alloca...  3.44k    26.1s   21.7%  7.58ms   17.4GiB   28.1%  5.19MiB
             Set Ma...  3.44k    2.55s    2.1%   740μs     0.00B    0.0%    0.00B
           Allocation   3.44k    3.58s    3.0%  1.04ms   1.54GiB    2.5%   469KiB
           Column M...  3.44k    459ms    0.4%   133μs   1.54GiB    2.5%   469KiB
           Set Matrix   3.44k    192ms    0.2%  55.9μs   3.92MiB    0.0%  1.17KiB
           Vectors      3.44k   17.4ms    0.0%  5.06μs   10.9MiB    0.0%  3.26KiB
           Bounds       3.44k   2.33ms    0.0%   677ns     0.00B    0.0%    0.00B
       DiffZonotope...  2.30k    9.94s    8.3%  4.33ms   2.36GiB    3.8%  1.05MiB
         Zonotope_D...  4.59k    4.79s    4.0%  1.04ms   1.54GiB    2.5%   351KiB
     Compute Split        574    31.7s   26.4%  55.2ms   8.80GiB   14.2%  15.7MiB
     Property Check       574    110ms    0.1%   192μs    120MiB    0.2%   215KiB
 Initialize                 1    587μs    0.0%   587μs   5.41MiB    0.0%  5.41MiB
 ────────────────────────────────────────────────────────────────────────────────
[VERYDIFF_TIMER] 120.135042498

[VERYDIFF_EXPERIMENT] NETWORK: /home/i57/steuber/NeuroDiff/repos/VeryDiffExperiments/src/../benchmarks/mnist-prune/specs/mnist_98_global_5.vnnlib
[VERYDIFF_EXPERIMENT] TIME: 120.593293232
