
[VERYDIFF_EXPERIMENT] Running on /home/i57/steuber/NeuroDiff/repos/VeryDiffExperiments/src/../benchmarks/mnist-prune/specs/mnist_88_local_15.vnnlib /home/i57/steuber/NeuroDiff/repos/VeryDiffExperiments/src/../benchmarks/mnist-prune/nets/mnist_relu_2_512.onnx
Loading /home/i57/steuber/NeuroDiff/repos/VeryDiffExperiments/src/../benchmarks/mnist-prune/nets/mnist_relu_2_512.onnx and /home/i57/steuber/NeuroDiff/repos/VeryDiffExperiments/src/../benchmarks/mnist-prune/nets_pruned/mnist_relu_2_512_pruned5.onnx
INPUT SHAPE: 784

[NEQUIV] 54.05466041753527

[ -94.17572931 -107.53939711  -88.03436498 -124.89583397  -84.44195474
  -71.910288    -10.31180103 -124.27258674  -97.71014355 -145.40314218]
[ -90.75967022 -103.91085388  -79.86424213 -117.60728027  -80.23615442
  -70.27757765   -9.0962476  -118.04558341  -92.47330102 -136.68798601]
NETWORKS NOT EQUIVALENT
Refined: 0 | Refine Limit: -1 | Wrong: 0 | Right: 1 | Total: 1 | Total Zonos Considered: 1 | Expected 2 (50.0%)

time: 1.814907832

[VERYDIFF_TIMER] 1.838638839

[VERYDIFF_EXPERIMENT] Running on /home/i57/steuber/NeuroDiff/repos/VeryDiffExperiments/src/../benchmarks/mnist-prune/specs/mnist_88_local_15.vnnlib /home/i57/steuber/NeuroDiff/repos/VeryDiffExperiments/src/../benchmarks/mnist-prune/nets/mnist_relu_3_100.onnx
Loading /home/i57/steuber/NeuroDiff/repos/VeryDiffExperiments/src/../benchmarks/mnist-prune/nets/mnist_relu_3_100.onnx and /home/i57/steuber/NeuroDiff/repos/VeryDiffExperiments/src/../benchmarks/mnist-prune/nets_pruned/mnist_relu_3_100_pruned5.onnx
INPUT SHAPE: 784
Refined: 119 | Refine Limit: 18 | Wrong: 0 | Right: 158 | Total: 158 | Total Zonos Considered: 277 | Expected 80501 (0.19627085377821393%)Refined: 300 | Refine Limit: 28 | Wrong: 0 | Right: 431 | Total: 431 | Total Zonos Considered: 731 | Expected 219593 (0.19627219446885832%)Refined: 558 | Refine Limit: 26 | Wrong: 0 | Right: 876 | Total: 876 | Total Zonos Considered: 1434 | Expected 446319 (0.19627217304215147%)Refined: 857 | Refine Limit: 36 | Wrong: 0 | Right: 1391 | Total: 1391 | Total Zonos Considered: 2248 | Expected 708710 (0.19627210001269915%)Refined: 1147 | Refine Limit: 19 | Wrong: 0 | Right: 1892 | Total: 1892 | Total Zonos Considered: 3039 | Expected 963968 (0.19627207542159075%)Refined: 1430 | Refine Limit: 27 | Wrong: 0 | Right: 2352 | Total: 2352 | Total Zonos Considered: 3782 | Expected 1198336 (0.19627216406750697%)Refined: 1721 | Refine Limit: 32 | Wrong: 0 | Right: 2844 | Total: 2844 | Total Zonos Considered: 4565 | Expected 1449009 (0.19627207284426806%)Refined: 1979 | Refine Limit: 28 | Wrong: 0 | Right: 3322 | Total: 3322 | Total Zonos Considered: 5301 | Expected 1692548 (0.19627212935763122%)Refined: 2281 | Refine Limit: 36 | Wrong: 0 | Right: 3852 | Total: 3852 | Total Zonos Considered: 6133 | Expected 1962582 (0.19627205385558413%)Refined: 2585 | Refine Limit: 31 | Wrong: 0 | Right: 4396 | Total: 4396 | Total Zonos Considered: 6981 | Expected 2239748 (0.19627208060906853%)Refined: 2844 | Refine Limit: 28 | Wrong: 0 | Right: 4843 | Total: 4843 | Total Zonos Considered: 7687 | Expected 2467493 (0.1962720866887971%)Refined: 3089 | Refine Limit: 37 | Wrong: 0 | Right: 5238 | Total: 5238 | Total Zonos Considered: 8327 | Expected 2668744 (0.19627210403095988%)Refined: 3415 | Refine Limit: 27 | Wrong: 0 | Right: 5751 | Total: 5751 | Total Zonos Considered: 9166 | Expected 2930116 (0.19627209298198434%)Refined: 3673 | Refine Limit: 37 | Wrong: 0 | Right: 6176 | Total: 6176 | Total Zonos Considered: 9849 | Expected 3146652 (0.19627210126826863%)Refined: 3930 | Refine Limit: 31 | Wrong: 0 | Right: 6611 | Total: 6611 | Total Zonos Considered: 10541 | Expected 3368283 (0.1962721065896185%)Refined: 4266 | Refine Limit: 27 | Wrong: 0 | Right: 7179 | Total: 7179 | Total Zonos Considered: 11445 | Expected 3657677 (0.19627211478760975%)Refined: 4575 | Refine Limit: 34 | Wrong: 0 | Right: 7658 | Total: 7658 | Total Zonos Considered: 12233 | Expected 3901726 (0.19627211136814837%)Refined: 4852 | Refine Limit: 33 | Wrong: 0 | Right: 8148 | Total: 8148 | Total Zonos Considered: 13000 | Expected 4151379 (0.1962721302969447%)Refined: 5113 | Refine Limit: 33 | Wrong: 0 | Right: 8566 | Total: 8566 | Total Zonos Considered: 13679 | Expected 4364348 (0.19627215794890784%)Refined: 5425 | Refine Limit: 34 | Wrong: 0 | Right: 9102 | Total: 9102 | Total Zonos Considered: 14527 | Expected 4637438 (0.19627216579499282%)Refined: 5703 | Refine Limit: 26 | Wrong: 0 | Right: 9588 | Total: 9588 | Total Zonos Considered: 15291 | Expected 4885054 (0.19627213946867322%)Refined: 5910 | Refine Limit: 35 | Wrong: 0 | Right: 9919 | Total: 9919 | Total Zonos Considered: 15829 | Expected 5053697 (0.1962721548205205%)Refined: 6188 | Refine Limit: 36 | Wrong: 0 | Right: 10415 | Total: 10415 | Total Zonos Considered: 16603 | Expected 5306407 (0.1962721668352993%)UNKNOWN
TIMEOUT
Refined: 6243 | Refine Limit: 28 | Wrong: 0 | Right: 10538 | Total: 10538 | Total Zonos Considered: 16781 | Expected 5369075 (0.19627216978716075%)

time: 120.309207317

[VERYDIFF_TIMER] 120.333068373

[VERYDIFF_EXPERIMENT] Running on /home/i57/steuber/NeuroDiff/repos/VeryDiffExperiments/src/../benchmarks/mnist-prune/specs/mnist_88_local_15.vnnlib /home/i57/steuber/NeuroDiff/repos/VeryDiffExperiments/src/../benchmarks/mnist-prune/nets/mnist_relu_4_1024.onnx
Loading /home/i57/steuber/NeuroDiff/repos/VeryDiffExperiments/src/../benchmarks/mnist-prune/nets/mnist_relu_4_1024.onnx and /home/i57/steuber/NeuroDiff/repos/VeryDiffExperiments/src/../benchmarks/mnist-prune/nets_pruned/mnist_relu_4_1024_pruned5.onnx
INPUT SHAPE: 784

[NEQUIV] 367.1571746126493

[ 6.42870595  0.          0.          0.          3.02992903  0.
 27.36857047  0.          2.02019872  0.        ]
[ 5.40874893  0.          0.          0.          1.92597486  0.
 23.22706013  0.          2.41230868  0.        ]
NETWORKS NOT EQUIVALENT
Refined: 0 | Refine Limit: -1 | Wrong: 0 | Right: 1 | Total: 1 | Total Zonos Considered: 1 | Expected 2 (50.0%)

time: 25.324532441

[VERYDIFF_TIMER] 25.355931762

[VERYDIFF_EXPERIMENT] NETWORK: /home/i57/steuber/NeuroDiff/repos/VeryDiffExperiments/src/../benchmarks/mnist-prune/specs/mnist_88_local_15.vnnlib
[VERYDIFF_EXPERIMENT] TIME: 148.376170667
