
[VERYDIFF_EXPERIMENT] Running on /home/i57/steuber/NeuroDiff/repos/VeryDiffExperiments/src/../benchmarks/mnist-prune/specs/mnist_98_global_5.vnnlib /home/i57/steuber/NeuroDiff/repos/VeryDiffExperiments/src/../benchmarks/mnist-prune/nets/mnist_relu_3_100.onnx
Parsing /home/i57/steuber/NeuroDiff/repos/VeryDiffExperiments/src/../benchmarks/mnist-prune/nets/mnist_relu_3_100.onnx...
Found input X
op: matmul, weight: (100, 784), bias: nothing
op: bias, weight: nothing, bias: (100,)
op: relu, weight: nothing, bias: nothing
op: matmul, weight: (100, 100), bias: nothing
op: bias, weight: nothing, bias: (100,)
op: relu, weight: nothing, bias: nothing
op: matmul, weight: (10, 100), bias: nothing
op: bias, weight: nothing, bias: (10,)
op: relu, weight: nothing, bias: nothing
op: matmul, weight: (10, 10), bias: nothing
op: bias, weight: nothing, bias: (10,)
Parsing /home/i57/steuber/NeuroDiff/repos/VeryDiffExperiments/src/../benchmarks/mnist-prune/nets_pruned/mnist_relu_3_100_0.79_adam_1_stepsize-old.onnx...
Found input X
op: gemm, weight: (100, 784), bias: (100,)
op: relu, weight: nothing, bias: nothing
op: gemm, weight: (100, 100), bias: (100,)
op: relu, weight: nothing, bias: nothing
op: gemm, weight: (10, 100), bias: (10,)
op: relu, weight: nothing, bias: nothing
op: gemm, weight: (10, 10), bias: (10,)
Distance: 368.62397500800625
Distance: 47.56803950402309
Distance: 2.8977568827249343
Distance: 0.01885471428334995
Running with 1 threads
[Thread 1] Time to first task: 0.0s
Instable Generators: 44
Instable Generators: 56
Instable Generators: 7
Zono Bounds:
[-1.3904966913669004, -1.4810016201832237, -1.5116113600820746, -0.0016885002457098413, -1.7388602823498533, -1.8095895290844113, -1.371758329892116, -0.002368980215211252, -1.5661179437471433, -1.5038744641089383]
[1.3736695908104815, 1.3870980622371658, 1.328162646859492, 0.0004465751395438599, 1.737049829070043, 1.7596033791044796, 1.539174709391249, 0.0020297778139974154, 1.5058695111792528, 1.5017132860627236]
[Thread 1] Processed 100 zonotopes (Work Done: 0.0%; Expected Zonos: Inf)


TIMEOUT REACHED
UNKNOWN
[Thread 1] Total splits: 177
Processed 177 zonotopes (Work Done: 0.0%); Generated 354 (0.6806003942768362s/loop)
[Thread 1] Finished in 120.47s
 ────────────────────────────────────────────────────────────────────────────────
                                        Time                    Allocations      
                               ───────────────────────   ────────────────────────
       Tot / % measured:             120s / 100.0%           31.2GiB / 100.0%    

 Section               ncalls     time    %tot     avg     alloc    %tot      avg
 ────────────────────────────────────────────────────────────────────────────────
 Verify                     1     120s  100.0%    120s   31.2GiB  100.0%  31.2GiB
   Zonotope Loop            1     120s  100.0%    120s   31.2GiB  100.0%  31.2GiB
     Property Check       177    92.8s   77.0%   524ms   12.0GiB   38.6%  69.7MiB
     Zonotope Propa...    177    11.9s    9.9%  67.5ms   13.0GiB   41.6%  75.0MiB
       DiffZonotope...    531    9.12s    7.6%  17.2ms   12.2GiB   39.3%  23.6MiB
         Zonotope_R...  1.06k    8.97s    7.4%  8.45ms   11.9GiB   38.3%  11.5MiB
           Influenc...  1.06k    8.68s    7.2%  8.18ms   11.0GiB   35.3%  10.6MiB
             Multiply   1.06k    7.39s    6.1%  6.95ms   5.61GiB   18.0%  5.41MiB
             Set Ma...  1.06k    785ms    0.7%   739μs     0.00B    0.0%    0.00B
             Alloca...  1.06k    509ms    0.4%   479μs   5.38GiB   17.3%  5.19MiB
           Column M...  1.06k    194ms    0.2%   183μs    486MiB    1.5%   469KiB
           Set Matrix   1.06k   57.5ms    0.0%  54.1μs   1.22MiB    0.0%  1.17KiB
           Allocation   1.06k   27.8ms    0.0%  26.2μs    486MiB    1.5%   469KiB
           Vectors      1.06k   5.32ms    0.0%  5.01μs   3.38MiB    0.0%  3.26KiB
           Bounds       1.06k    724μs    0.0%   681ns     0.00B    0.0%    0.00B
       DiffZonotope...    708    2.81s    2.3%  3.97ms    744MiB    2.3%  1.05MiB
         Zonotope_D...  1.42k    1.38s    1.1%   973μs    485MiB    1.5%   351KiB
     Compute Split        177    1.09s    0.9%  6.18ms   2.72GiB    8.7%  15.7MiB
 Initialize                 1    540μs    0.0%   540μs   5.41MiB    0.0%  5.41MiB
 ────────────────────────────────────────────────────────────────────────────────
[VERYDIFF_TIMER] 120.496726142

[VERYDIFF_EXPERIMENT] NETWORK: /home/i57/steuber/NeuroDiff/repos/VeryDiffExperiments/src/../benchmarks/mnist-prune/specs/mnist_98_global_5.vnnlib
[VERYDIFF_EXPERIMENT] TIME: 120.86080075
