
[VERYDIFF_EXPERIMENT] Running on /home/i57/steuber/NeuroDiff/repos/VeryDiffExperiments/src/../benchmarks/mnist-prune/specs/mnist_57_global_6.vnnlib /home/i57/steuber/NeuroDiff/repos/VeryDiffExperiments/src/../benchmarks/mnist-prune/nets/mnist_relu_2_512.onnx
Found input X
op: matmul, weight: (512, 784), bias: nothing
op: bias, weight: nothing, bias: (512,)
op: relu, weight: nothing, bias: nothing
op: matmul, weight: (512, 512), bias: nothing
op: bias, weight: nothing, bias: (512,)
op: relu, weight: nothing, bias: nothing
op: matmul, weight: (10, 512), bias: nothing
op: bias, weight: nothing, bias: (10,)
Found input X
op: gemm, weight: (512, 784), bias: (512,)
op: relu, weight: nothing, bias: nothing
op: gemm, weight: (512, 512), bias: (512,)
op: relu, weight: nothing, bias: nothing
op: gemm, weight: (10, 512), bias: (10,)
Distance: 973.3044369037136
Distance: 481.63499746812613
Distance: 8.744412635378467
Running with 1 threads
[Thread 1] Time to first task: 0.01s
Instable Generators: 250
Instable Generators: 474
Zono Bounds:
[-25.856436200531885, -25.251589709424387, -22.545024391089626, -23.83575210260988, -24.376870508049365, -22.122643133870834, -24.085552870902884, -23.6729259690874, -20.777992865718765, -19.937005904407705]
[29.988541066171333, 29.52284952995131, 25.585274412482285, 26.017023794340176, 28.338168892009065, 24.488744645285845, 27.973135740398373, 27.341201548250638, 23.05439649453693, 21.657983784834663]
[Thread 1] Processed 100 zonotopes (Work Done: 0.0%; Expected Zonos: Inf)
[Thread 1] Processed 200 zonotopes (Work Done: 0.0%; Expected Zonos: Inf)


TIMEOUT REACHED
UNKNOWN
[Thread 1] Total splits: 227
Processed 227 zonotopes (Work Done: 0.0%); Generated 454 (0.5297627531806167s/loop)
[Thread 1] Finished in 120.26s
 ────────────────────────────────────────────────────────────────────────────────
                                        Time                    Allocations      
                               ───────────────────────   ────────────────────────
       Tot / % measured:             120s / 100.0%           43.3GiB / 100.0%    

 Section               ncalls     time    %tot     avg     alloc    %tot      avg
 ────────────────────────────────────────────────────────────────────────────────
 Verify                     1     120s  100.0%    120s   43.3GiB  100.0%  43.3GiB
   Zonotope Loop            1     120s  100.0%    120s   43.3GiB  100.0%  43.3GiB
     Zonotope Propa...    227    97.3s   80.9%   428ms   33.7GiB   77.9%   152MiB
       DiffZonotope...    454    68.8s   57.2%   151ms   28.5GiB   65.7%  64.3MiB
         Zonotope_R...    908    58.9s   49.0%  64.9ms   24.5GiB   56.5%  27.6MiB
           Influenc...    908    44.6s   37.1%  49.1ms   15.7GiB   36.3%  17.7MiB
             Multiply     908    29.0s   24.2%  32.0ms   9.00GiB   20.8%  10.2MiB
             Alloca...    908    14.6s   12.2%  16.1ms   6.71GiB   15.5%  7.57MiB
             Set Ma...    908    898ms    0.7%   989μs     0.00B    0.0%    0.00B
           Column M...    908    13.3s   11.1%  14.6ms   4.38GiB   10.1%  4.94MiB
           Set Matrix     908    657ms    0.5%   724μs   8.30MiB    0.0%  9.36KiB
           Allocation     908    342ms    0.3%   376μs   4.38GiB   10.1%  4.94MiB
           Vectors        908   26.9ms    0.0%  29.6μs   22.1MiB    0.0%  25.0KiB
           Bounds         908    680μs    0.0%   749ns     0.00B    0.0%    0.00B
       DiffZonotope...    681    28.5s   23.7%  41.8ms   5.26GiB   12.1%  7.90MiB
         Zonotope_D...  1.36k    12.9s   10.7%  9.48ms   3.20GiB    7.4%  2.41MiB
     Compute Split        227    21.4s   17.8%  94.5ms   5.12GiB   11.8%  23.1MiB
     Property Check       227    705ms    0.6%  3.11ms   55.8MiB    0.1%   252KiB
 Initialize                 1   2.26ms    0.0%  2.26ms   9.84MiB    0.0%  9.84MiB
 ────────────────────────────────────────────────────────────────────────────────
[VERYDIFF_TIMER] 120.311866184

[VERYDIFF_EXPERIMENT] NETWORK: /home/i57/steuber/NeuroDiff/repos/VeryDiffExperiments/src/../benchmarks/mnist-prune/specs/mnist_57_global_6.vnnlib
[VERYDIFF_EXPERIMENT] TIME: 120.640932251
