Network: ./acas-prune/nets/product_ACASXU_run2a_5_3_batch_2000_ACASXU_run2a_5_3_batch_2000_pruned10_eps.onnx
Property: ./acas-prune/specs/product_prop_4_eps_0.05.vnnlib

Engine::processInputQuery: Input query (before preprocessing): 615 equations, 1220 variables
Engine::processInputQuery: Input query (after preprocessing): 1149 equations, 1562 variables

Input bounds:
	x0: [ -0.3035,  -0.2986] 
	x1: [ -0.0095,   0.0095] 
	x2: [ -0.0000,  -0.0000] [FIXED]
	x3: [  0.3182,   0.5000] 
	x4: [  0.0833,   0.1667] 

Branching heuristics set to LargestInterval

Engine::solve: Initial statistics

05:11:13 Statistics update:
	--- Time Statistics ---
	Total time elapsed: 227 milli (00:00:00)
		Main loop: 0 milli (00:00:00)
		Preprocessing time: 160 milli (00:00:00)
		Unknown: 66 milli (00:00:00)
	Breakdown for main loop:
		[0.00%] Simplex steps: 0 milli
		[0.00%] Explicit-basis bound tightening: 0 milli
		[0.00%] Constraint-matrix bound tightening: 0 milli
		[0.00%] Degradation checking: 0 milli
		[0.00%] Precision restoration: 0 milli
		[0.00%] Statistics handling: 0 milli
		[0.00%] Constraint-fixing steps: 0 milli
		[0.00%] Valid case splits: 0 milli. Average per split: 0.00 milli
		[0.00%] Applying stored bound-tightening: 0 milli
		[0.00%] SMT core: 0 milli
		[0.00%] Symbolic Bound Tightening: 12 milli
		[0.00%] SoI-based local search: 0 milli
		[0.00%] SoI-based local search: 0 milli
		[0.00%] Unaccounted for: 0 milli
	--- Preprocessor Statistics ---
	Number of preprocessor bound-tightening loop iterations: 8
	Number of eliminated variables: 259
	Number of constraints removed due to variable elimination: 192
	Number of equations removed due to variable elimination: 0
	--- Engine Statistics ---
	Number of main loop iterations: 1
		0 iterations were simplex steps. Total time: 0 milli. Average: 0.00 milli.
		0 iterations were constraint-fixing steps. Total time: 0 milli. Average: 0.00 milli
	Number of active piecewise-linear constraints: 134 / 409
		Constraints disabled by valid splits: 275. By SMT-originated splits: 0
	Last reported degradation: 0.0000000000. Max degradation so far: 0.0000000000. Restorations so far: 0
	Number of simplex pivots we attempted to skip because of instability: 0.
	Unstable pivots performed anyway: 0
	--- Tableau Statistics ---
	Total number of pivots performed: 0
		Real pivots: 0. Degenerate: 0 (0.00%)
		Degenerate pivots by request (e.g., to fix a PL constraint): 0 (0.00%)
		Average time per pivot: 0.00 milli
	Total number of fake pivots performed: 0
	Total number of rows added: 0. Number of merged columns: 0
	Current tableau dimensions: M = 1149, N = 2711
	--- SMT Core Statistics ---
	Total depth is 0. Total visited states: 1. Number of splits: 0. Number of pops: 0
	Max stack depth: 0
	--- Bound Tightening Statistics ---
	Number of tightened bounds: 0.
		Number of rows examined by row tightener: 0. Consequent tightenings: 0
		Number of explicit basis matrices examined by row tightener: 0. Consequent tightenings: 0
		Number of bound tightening rounds on the entire constraint matrix: 0. Consequent tightenings: 0
		Number of bound notifications sent to PL constraints: 2458. Tightenings proposed: 0
	--- Basis Factorization statistics ---
	Number of basis refactorizations: 2
	--- Projected Steepest Edge Statistics ---
	Number of iterations: 0.
	Number of resets to reference space: 1. Avg. iterations per reset: 0
	--- SBT ---
	Number of tightened bounds: 1503
	--- SoI-based local search ---
	Number of proposed phase pattern update: 0. Number of accepted update: 0 [0.00%]
	Total time (% of local search time) updating SoI phase pattern : 0 milli [0.00%]
	Total time obtaining current assignment: 0 milli [0.00%]
	Total time getting SoI phase pattern : 0 milli [0.00%]
	--- Context dependent statistics ---
	Number of pushes / pops: 0 / 0
		[0.00%] Pre-Push hook: 0 milli
		[0.00%] Push : 0 milli
		[0.00%] Post-Pop hook: 0 milli
		[0.00%] Pop : 0 milli
		[0.00%] Total context-switching time: 0 milli
	--- Proof Certificate ---
	Number of certified leaves: 0
	Number of leaves to delegate: 0

---

Engine::solve: unsat query

05:11:17 Statistics update:
	--- Time Statistics ---
	Total time elapsed: 3592 milli (00:00:03)
		Main loop: 3364 milli (00:00:03)
		Preprocessing time: 160 milli (00:00:00)
		Unknown: 67 milli (00:00:00)
	Breakdown for main loop:
		[35.56%] Simplex steps: 1196 milli
		[37.34%] Explicit-basis bound tightening: 1256 milli
		[0.00%] Constraint-matrix bound tightening: 0 milli
		[0.31%] Degradation checking: 10 milli
		[0.00%] Precision restoration: 0 milli
		[0.18%] Statistics handling: 5 milli
		[0.00%] Constraint-fixing steps: 0 milli
		[0.09%] Valid case splits: 2 milli. Average per split: 0.00 milli
		[0.03%] Applying stored bound-tightening: 1 milli
		[3.04%] SMT core: 102 milli
		[14.04%] Symbolic Bound Tightening: 472 milli
		[15.18%] SoI-based local search: 510 milli
		[0.00%] SoI-based local search: 0 milli
		[9.42%] Unaccounted for: 316 milli
	--- Preprocessor Statistics ---
	Number of preprocessor bound-tightening loop iterations: 8
	Number of eliminated variables: 259
	Number of constraints removed due to variable elimination: 192
	Number of equations removed due to variable elimination: 0
	--- Engine Statistics ---
	Number of main loop iterations: 2562
		2494 iterations were simplex steps. Total time: 1196 milli. Average: 0.48 milli.
		0 iterations were constraint-fixing steps. Total time: 0 milli. Average: 0.00 milli
	Number of active piecewise-linear constraints: 42 / 409
		Constraints disabled by valid splits: 367. By SMT-originated splits: 0
	Last reported degradation: 0.0000000000. Max degradation so far: 0.0000000000. Restorations so far: 0
	Number of simplex pivots we attempted to skip because of instability: 0.
	Unstable pivots performed anyway: 0
	--- Tableau Statistics ---
	Total number of pivots performed: 2151
		Real pivots: 2127. Degenerate: 24 (1.12%)
		Degenerate pivots by request (e.g., to fix a PL constraint): 0 (0.00%)
		Average time per pivot: 0.19 milli
	Total number of fake pivots performed: 70
	Total number of rows added: 0. Number of merged columns: 0
	Current tableau dimensions: M = 1149, N = 2711
	--- SMT Core Statistics ---
	Total depth is 5. Total visited states: 46. Number of splits: 22. Number of pops: 23
	Max stack depth: 6
	--- Bound Tightening Statistics ---
	Number of tightened bounds: 57200.
		Number of rows examined by row tightener: 2151. Consequent tightenings: 8
		Number of explicit basis matrices examined by row tightener: 14. Consequent tightenings: 2384
		Number of bound tightening rounds on the entire constraint matrix: 0. Consequent tightenings: 0
		Number of bound notifications sent to PL constraints: 72758. Tightenings proposed: 0
	--- Basis Factorization statistics ---
	Number of basis refactorizations: 21
	--- Projected Steepest Edge Statistics ---
	Number of iterations: 2221.
	Number of resets to reference space: 23. Avg. iterations per reset: 96
	--- SBT ---
	Number of tightened bounds: 28988
	--- SoI-based local search ---
	Number of proposed phase pattern update: 125. Number of accepted update: 127 [101.60%]
	Total time (% of local search time) updating SoI phase pattern : 6239 milli [1.22%]
	Total time obtaining current assignment: 46132 milli [9.04%]
	Total time getting SoI phase pattern : 2161 milli [0.06%]
	--- Context dependent statistics ---
	Number of pushes / pops: 44 / 44
		[0.07%] Pre-Push hook: 2 milli
		[0.00%] Push : 0 milli
		[0.06%] Post-Pop hook: 1 milli
		[0.06%] Pop : 2 milli
		[0.19%] Total context-switching time: 6 milli
	--- Proof Certificate ---
	Number of certified leaves: 0
	Number of leaves to delegate: 0
unsat

real	0m3,639s
user	0m3,700s
sys	0m0,184s
