
[VERYDIFF_EXPERIMENT] Running on /home/i57/steuber/NeuroDiff/repos/VeryDiffExperiments/src/../benchmarks/mnist-prune/specs/mnist_95_local_24.vnnlib /home/i57/steuber/NeuroDiff/repos/VeryDiffExperiments/src/../benchmarks/mnist-prune/nets/mnist_relu_2_512.onnx
Found input X
op: matmul, weight: (512, 784), bias: nothing
op: bias, weight: nothing, bias: (512,)
op: relu, weight: nothing, bias: nothing
op: matmul, weight: (512, 512), bias: nothing
op: bias, weight: nothing, bias: (512,)
op: relu, weight: nothing, bias: nothing
op: matmul, weight: (10, 512), bias: nothing
op: bias, weight: nothing, bias: (10,)
Found input X
op: matmul, weight: (512, 784), bias: nothing
op: bias, weight: nothing, bias: (512,)
op: relu, weight: nothing, bias: nothing
op: matmul, weight: (512, 512), bias: nothing
op: bias, weight: nothing, bias: (512,)
op: relu, weight: nothing, bias: nothing
op: matmul, weight: (10, 512), bias: nothing
op: bias, weight: nothing, bias: (10,)
Distance: 1085.5985166831802
Distance: 1719.8468985003963
Distance: 31.228482716001736
Running with 1 threads
[Thread 1] Time to first task: 0.0s
Instable Generators: 135
Instable Generators: 396
Zono Bounds:
[-26.665761683929006, -23.91397528015776, -21.605454535569123, -15.422607362342115, -14.128075688264534, -15.714485504193638, -21.917356153365873, -23.3092616988962, -17.330207214530066, -12.796535066675931]
[25.803692143788098, 21.769044474720825, 16.898996048244783, 23.64197552353597, 25.28760686203591, 19.196910384506847, 22.68193750190897, 20.485414750920306, 17.242113987866663, 19.42155500614609]

Found counterexample: ([0.0, 0.0, 0.0, 0.0, 0.0, 0.0, 0.0, 0.0, 0.0, 0.0, 0.0, 0.0, 0.0, 0.0, 0.0, 0.0, 0.0, 0.0, 0.0, 0.0, 0.0, 0.0, 0.0, 0.0, 0.0, 0.0, 0.0, 0.0, 0.0, 0.0, 0.0, 0.0, 0.0, 0.0, 0.0, 0.0, 0.0, 0.0, 0.0, 0.0, 0.0, 0.0, 0.0, 0.0, 0.0, 0.0, 0.0, 0.0, 0.0, 0.0, 0.0, 0.0, 0.0, 0.0, 0.0, 0.0, 0.0, 0.0, 0.0, 0.0, 0.0, 0.0, 0.0, 0.0, 0.0, 0.0, 0.0, 0.0, 0.0, 0.0, 0.0, 0.0, 0.0, 0.0, 0.0, 0.0, 0.0, 0.0, 0.0, 0.0, 0.0, 0.0, 0.0, 0.0, 0.0, 0.0, 0.0, 0.0, 0.0, 0.0, 0.0, 0.0, 0.0, 0.0, 0.0, 0.0, 0.0, 0.0, 0.0, 0.0, 0.0, 0.0, 0.0, 0.0, 0.0, 0.0, 0.0, 0.0, 0.0, 0.0, 0.0, 0.0, 0.0, 0.0, 0.0, 1.0, 0.0, 0.0, 0.0, 0.0, 0.0, 0.0, 0.0, 0.0, 0.0, 0.0, 0.0, 0.0, 0.0, 0.0, 0.0, 0.0, 0.0, 0.0, 0.0, 0.0, 0.0, 0.0, 0.0, 0.0, 0.0, 0.0, 0.0, 0.0, 0.0, 0.0, 0.0, 0.0, 0.0, 0.0, 0.0, 0.0, 0.0, 0.0, 0.0, 0.0, 0.0, 0.0, 0.14509805, 0.99215686, 1.0, 0.99215686, 0.28235295, 1.0, 0.0, 0.0, 0.0, 0.0, 0.0, 0.0, 1.0, 0.0, 0.0, 0.0, 0.0, 0.0, 0.0, 0.0, 0.0, 0.0, 0.0, 0.24705882, 0.24705882, 0.0, 0.0, 0.24705882, 0.70980394, 0.98823529, 0.99215686, 0.98823529, 0.27843139, 0.0, 0.0, 0.0, 0.0, 0.0, 0.0, 0.0, 0.0, 0.0, 0.0, 0.0, 0.0, 0.0, 0.0, 0.0, 0.0, 0.0, 0.71372551, 0.94901961, 0.84313726, 0.0, 0.0627451, 0.87058824, 0.98823529, 0.98823529, 0.92941177, 0.68235296, 0.07843138, 0.0, 0.0, 0.0, 0.0, 0.0, 0.0, 0.0, 0.0, 0.0, 0.0, 0.0, 0.0, 0.0, 0.0, 0.0, 0.08235294, 0.56470591, 0.99215686, 0.82352942, 0.36078432, 0.00392157, 0.74901962, 0.98823529, 0.98823529, 0.98823529, 0.56470591, 0.0, 0.0, 0.0, 0.0, 0.0, 0.0, 0.0, 0.0, 0.0, 0.0, 0.0, 0.0, 0.0, 0.0, 0.0, 0.0, 0.36862746, 0.0, 0.98823529, 0.80784315, 0.07843138, 0.0, 0.56470591, 0.99215686, 0.98823529, 0.98823529, 0.42352942, 0.0, 0.0, 0.0, 0.0, 0.0, 0.0, 0.0, 0.0, 0.0, 0.0, 1.0, 0.0, 0.0, 0.0, 0.0, 0.0, 0.1254902, 0.89019608, 0.98823529, 0.98823529, 0.07843138, 0.0, 0.1254902, 0.92941177, 0.99215686, 0.98823529, 0.86274511, 0.05882353, 0.0, 0.0, 0.0, 0.0, 0.0, 0.0, 0.0, 0.0, 0.0, 0.0, 0.0, 0.0, 0.0, 0.0, 0.02352941, 0.14509805, 0.82745099, 0.98823529, 0.96470588, 0.51764709, 0.0, 0.04313726, 0.58823532, 0.98823529, 0.99215686, 0.98823529, 0.7647059, 0.0, 0.0, 0.08235294, 0.0, 0.0, 0.0, 0.0, 0.0, 0.0, 0.0, 0.0, 0.0, 0.0, 0.0, 0.0, 0.14509805, 0.98823529, 0.98823529, 0.98823529, 0.51764709, 0.0, 0.0, 0.28627452, 0.98823529, 0.98823529, 0.99215686, 0.98823529, 0.27843139, 0.0, 0.56862748, 0.80784315, 0.16078432, 0.0, 0.0, 0.0, 0.0, 0.0, 0.0, 0.0, 0.0, 0.0, 0.0, 0.0, 0.71372551, 0.99215686, 0.99215686, 0.99215686, 0.28235295, 0.0, 0.0, 0.28627452, 0.99215686, 0.99215686, 1.0, 0.82745099, 0.42745098, 0.74901962, 1.0, 0.99215686, 0.28235295, 0.0, 1.0, 0.0, 0.0, 0.0, 0.0, 0.0, 0.0, 0.0, 0.0, 0.24705882, 0.94901961, 0.98823529, 0.98823529, 0.98823529, 0.48627451, 0.28627452, 0.16470589, 0.4509804, 0.98823529, 0.98823529, 0.99215686, 0.98823529, 0.98823529, 0.98823529, 0.99215686, 0.90588236, 0.2, 0.0, 0.0, 0.0, 0.0, 0.0, 0.0, 0.0, 0.0, 0.0, 0.0, 0.28627452, 0.98823529, 0.98823529, 0.98823529, 0.98823529, 1.0, 0.98823529, 0.87058824, 0.94901961, 0.98823529, 0.98823529, 0.99215686, 0.98823529, 0.98823529, 0.98823529, 0.92941177, 0.60000002, 0.0, 0.0, 0.0, 0.0, 0.0, 0.0, 0.0, 0.0, 0.0, 0.0, 0.0, 0.28627452, 0.98823529, 0.98823529, 0.98823529, 0.98823529, 0.98823529, 0.98823529, 0.99215686, 0.98823529, 0.98823529, 0.98823529, 0.99215686, 0.98823529, 0.98823529, 0.98823529, 0.56470591, 0.0, 0.0, 0.0, 0.0, 0.0, 0.0, 0.0, 0.0, 0.0, 0.0, 0.0, 0.0, 0.16470589, 0.627451, 1.0, 0.99215686, 0.99215686, 0.99215686, 0.99215686, 1.0, 0.99215686, 0.99215686, 0.99215686, 1.0, 0.99215686, 0.92941177, 0.56470591, 0.0, 0.0, 0.0, 0.0, 0.0, 0.0, 0.0, 0.0, 0.0, 0.0, 0.0, 0.0, 0.0, 0.0, 0.01960784, 0.46666667, 0.82352942, 0.74117649, 0.90588236, 0.98823529, 0.99215686, 0.98823529, 0.98823529, 0.98823529, 0.87058824, 0.5411765, 0.11764706, 0.0, 0.0, 0.0, 0.0, 0.0, 0.0, 0.0, 0.0, 0.0, 0.0, 0.0, 0.0, 0.0, 1.0, 0.0, 0.0, 0.0, 0.12156863, 0.03921569, 0.2, 0.60392159, 0.99215686, 0.98823529, 0.98823529, 0.98823529, 0.627451, 0.01960784, 0.0, 0.0, 0.0, 0.0, 0.0, 0.0, 0.0, 0.0, 0.0, 0.0, 0.0, 0.0, 0.0, 0.0, 0.0, 0.0, 0.0, 0.0, 0.0, 0.0, 0.0, 0.0, 0.99215686, 0.98823529, 0.98823529, 0.98823529, 0.99215686, 0.46666667, 0.0, 0.0, 0.0, 0.0, 0.0, 0.0, 0.0, 0.0, 0.0, 0.0, 0.0, 0.0, 0.0, 0.0, 0.0, 0.0, 0.0, 0.0, 0.0, 0.0, 0.0, 0.0, 0.75294119, 0.99215686, 0.99215686, 0.99215686, 1.0, 0.99215686, 0.52156866, 0.0, 0.0, 0.0, 0.0, 0.0, 0.0, 0.0, 0.0, 0.0, 0.0, 0.0, 0.0, 0.0, 0.0, 0.0, 0.0, 0.0, 0.0, 0.0, 0.0, 0.0, 0.30588236, 0.0, 0.98823529, 0.98823529, 0.99215686, 0.98823529, 0.68235296, 0.0, 0.0, 0.0, 0.0, 0.0, 0.0, 0.0, 0.0, 0.0, 0.0, 0.0, 0.0, 0.0, 0.0, 0.0, 0.0, 0.0, 0.0, 0.0, 0.0, 0.0, 0.0, 0.40392157, 0.86666667, 0.98823529, 0.99215686, 0.86274511, 0.23921569, 0.0, 0.0, 0.0, 0.0, 0.0, 0.0, 0.0, 0.0, 0.0, 0.0, 0.0, 0.0, 0.0, 0.0, 0.0, 0.0, 0.0, 0.0, 0.0, 0.0, 0.0, 0.0, 0.0, 0.0627451, 0.74509805, 0.42352942, 0.05882353, 0.0, 0.0, 0.0, 0.0, 0.0, 0.0, 0.0, 0.0, 0.0, 0.0, 0.0, 0.0, 0.0, 0.0, 0.0, 0.0, 0.0, 0.0, 0.0, 0.0, 0.0, 1.0, 0.0, 0.0, 1.0, 0.0, 0.0, 0.0, 0.0, 0.0, 0.0, 0.0, 0.0, 0.0, 0.0, 0.0, 0.0, 0.0, 0.0, 0.0, 0.0, 0.0, 0.0, 0.0, 0.0, 0.0, 0.0, 0.0, 0.0, 0.0, 0.0, 0.0, 0.0, 1.0, 0.0, 0.0, 0.0, 0.0, 0.0, 0.0, 0.0, 0.0, 0.0, 0.0, 0.0, 0.0, 0.0, 0.0, 0.0, 0.0, 0.0, 0.0, 0.0, 0.0, 0.0, 0.0, 0.0, 1.0, 0.0, 0.0, 0.0, 0.0, 0.0, 0.0, 0.0, 0.0, 0.0, 0.0, 0.0, 0.0, 0.0, 0.0, 0.0, 0.0], ([-65.82002973919413, -63.609574890754516, -58.128978695828714, -64.73343212193171, 9.470024434746835, -47.46900779563494, -46.855188948067756, -45.20057096417371, -50.70640102537405, -27.880957749630205], [-56.82706621890517, -55.892831957044834, -50.112402873049774, -61.9427521319183, 7.822414335097573, -45.37135717103146, -40.60985772104276, -36.76337577055961, -44.50488017257027, -26.537132150013257], 8.992963520288953))
[Thread 1] Total splits: 0
Processed 1 zonotopes (Work Done: 0.0%); Generated 0 (0.03571061s/loop)
[Thread 1] Finished in 0.04s
 ────────────────────────────────────────────────────────────────────────────────
                                        Time                    Allocations      
                               ───────────────────────   ────────────────────────
       Tot / % measured:           37.7ms / 100.0%           31.9MiB / 100.0%    

 Section               ncalls     time    %tot     avg     alloc    %tot      avg
 ────────────────────────────────────────────────────────────────────────────────
 Verify                     1   35.7ms   94.7%  35.7ms   26.7MiB   83.5%  26.7MiB
   Zonotope Loop            1   35.7ms   94.7%  35.7ms   26.7MiB   83.5%  26.7MiB
     Zonotope Propa...      1   32.9ms   87.4%  32.9ms   25.1MiB   78.6%  25.1MiB
       DiffZonotope...      3   27.0ms   71.6%  9.00ms   3.50MiB   11.0%  1.17MiB
         Zonotope_D...      6   7.64ms   20.2%  1.27ms   1.57MiB    4.9%   268KiB
       DiffZonotope...      2   5.91ms   15.7%  2.96ms   21.6MiB   67.7%  10.8MiB
         Zonotope_R...      4   3.13ms    8.3%   784μs   13.1MiB   41.0%  3.27MiB
           Column M...      4   1.47ms    3.9%   369μs   5.68MiB   17.8%  1.42MiB
           Influenc...      4    750μs    2.0%   187μs   1.59MiB    5.0%   408KiB
             Multiply       4    673μs    1.8%   168μs   1.32MiB    4.1%   339KiB
             Alloca...      4   61.1μs    0.2%  15.3μs    273KiB    0.8%  68.2KiB
             Set Ma...      4   10.4μs    0.0%  2.59μs     0.00B    0.0%    0.00B
           Set Matrix       4    558μs    1.5%   140μs   29.2KiB    0.1%  7.30KiB
           Allocation       4    274μs    0.7%  68.5μs   5.68MiB   17.8%  1.42MiB
           Vectors          4   65.6μs    0.2%  16.4μs    100KiB    0.3%  25.0KiB
           Bounds           4   1.74μs    0.0%   434ns     0.00B    0.0%    0.00B
     Property Check         1   2.27ms    6.0%  2.27ms    192KiB    0.6%   192KiB
 Initialize                 1   1.98ms    5.3%  1.98ms   5.28MiB   16.5%  5.28MiB
 ────────────────────────────────────────────────────────────────────────────────
[VERYDIFF_TIMER] 0.066734085

[VERYDIFF_EXPERIMENT] Running on /home/i57/steuber/NeuroDiff/repos/VeryDiffExperiments/src/../benchmarks/mnist-prune/specs/mnist_95_local_24.vnnlib /home/i57/steuber/NeuroDiff/repos/VeryDiffExperiments/src/../benchmarks/mnist-prune/nets/mnist_relu_3_100.onnx
Found input X
op: matmul, weight: (100, 784), bias: nothing
op: bias, weight: nothing, bias: (100,)
op: relu, weight: nothing, bias: nothing
op: matmul, weight: (100, 100), bias: nothing
op: bias, weight: nothing, bias: (100,)
op: relu, weight: nothing, bias: nothing
op: matmul, weight: (10, 100), bias: nothing
op: bias, weight: nothing, bias: (10,)
op: relu, weight: nothing, bias: nothing
op: matmul, weight: (10, 10), bias: nothing
op: bias, weight: nothing, bias: (10,)
Found input X
op: matmul, weight: (100, 784), bias: nothing
op: bias, weight: nothing, bias: (100,)
op: relu, weight: nothing, bias: nothing
op: matmul, weight: (100, 100), bias: nothing
op: bias, weight: nothing, bias: (100,)
op: relu, weight: nothing, bias: nothing
op: matmul, weight: (10, 100), bias: nothing
op: bias, weight: nothing, bias: (10,)
op: relu, weight: nothing, bias: nothing
op: matmul, weight: (10, 10), bias: nothing
op: bias, weight: nothing, bias: (10,)
Distance: 296.6600370998244
Distance: 77.24290861755458
Distance: 5.7170369567975285
Distance: 0.0
Running with 1 threads
[Thread 1] Time to first task: 0.0s
Instable Generators: 26
Instable Generators: 60
Instable Generators: 9
Zono Bounds:
[-0.25181279873920137, -0.42950242499139957, -0.4319529391139663, -0.3617589712081836, -0.47636797653245266, -0.7209353561607885, -0.6161112751804869, -0.40497503979986615, -0.38482894034732607, -0.4545285639397334]
[0.24724471820152144, 0.397672285617486, 0.3450136337767031, 0.2963396194940667, 0.552499802482209, 0.7209353561607885, 0.6161112751804869, 0.3337466836015729, 0.38482894034732607, 0.338293314931958]
[Thread 1] Total splits: 0
Processed 1 zonotopes (Work Done: 100.0%); Generated 0 (0.001877195s/loop)
[Thread 1] Finished in 0.0s
 ────────────────────────────────────────────────────────────────────────────────
                                        Time                    Allocations      
                               ───────────────────────   ────────────────────────
       Tot / % measured:           2.27ms /  99.7%           3.34MiB / 100.0%    

 Section               ncalls     time    %tot     avg     alloc    %tot      avg
 ────────────────────────────────────────────────────────────────────────────────
 Verify                     1   1.90ms   83.8%  1.90ms   2.48MiB   74.4%  2.48MiB
   Zonotope Loop            1   1.88ms   82.9%  1.88ms   2.48MiB   74.2%  2.48MiB
     Zonotope Propa...      1   1.72ms   75.9%  1.72ms   1.56MiB   46.7%  1.56MiB
       DiffZonotope...      4   1.09ms   48.2%   273μs    311KiB    9.1%  77.8KiB
         Zonotope_D...      8    486μs   21.5%  60.8μs    162KiB    4.7%  20.2KiB
       DiffZonotope...      3    615μs   27.2%   205μs   1.25MiB   37.5%   427KiB
         Zonotope_R...      6    320μs   14.1%  53.4μs    868KiB   25.4%   145KiB
           Influenc...      6    123μs    5.4%  20.5μs    292KiB    8.6%  48.7KiB
             Multiply       6   93.6μs    4.1%  15.6μs    184KiB    5.4%  30.6KiB
             Alloca...      6   15.2μs    0.7%  2.54μs    106KiB    3.1%  17.7KiB
             Set Ma...      6   8.83μs    0.4%  1.47μs     0.00B    0.0%    0.00B
           Column M...      6   89.2μs    3.9%  14.9μs    273KiB    8.0%  45.5KiB
           Allocation       6   43.9μs    1.9%  7.32μs    272KiB    8.0%  45.4KiB
           Set Matrix       6   34.1μs    1.5%  5.69μs   6.38KiB    0.2%  1.06KiB
           Vectors          6   19.2μs    0.8%  3.19μs   19.5KiB    0.6%  3.26KiB
           Bounds           6   2.41μs    0.1%   402ns     0.00B    0.0%    0.00B
     Property Check         1   5.27μs    0.2%  5.27μs   1.23KiB    0.0%  1.23KiB
 Initialize                 1    366μs   16.2%   366μs    876KiB   25.6%   876KiB
 ────────────────────────────────────────────────────────────────────────────────
[VERYDIFF_TIMER] 0.027290103

[VERYDIFF_EXPERIMENT] Running on /home/i57/steuber/NeuroDiff/repos/VeryDiffExperiments/src/../benchmarks/mnist-prune/specs/mnist_95_local_24.vnnlib /home/i57/steuber/NeuroDiff/repos/VeryDiffExperiments/src/../benchmarks/mnist-prune/nets/mnist_relu_4_1024.onnx
Found input X
op: matmul, weight: (1024, 784), bias: nothing
op: bias, weight: nothing, bias: (1024,)
op: relu, weight: nothing, bias: nothing
op: matmul, weight: (1024, 1024), bias: nothing
op: bias, weight: nothing, bias: (1024,)
op: relu, weight: nothing, bias: nothing
op: matmul, weight: (1024, 1024), bias: nothing
op: bias, weight: nothing, bias: (1024,)
op: relu, weight: nothing, bias: nothing
op: matmul, weight: (10, 1024), bias: nothing
op: bias, weight: nothing, bias: (10,)
op: relu, weight: nothing, bias: nothing
op: matmul, weight: (10, 10), bias: nothing
op: bias, weight: nothing, bias: (10,)
Found input X
op: matmul, weight: (1024, 784), bias: nothing
op: bias, weight: nothing, bias: (1024,)
op: relu, weight: nothing, bias: nothing
op: matmul, weight: (1024, 1024), bias: nothing
op: bias, weight: nothing, bias: (1024,)
op: relu, weight: nothing, bias: nothing
op: matmul, weight: (1024, 1024), bias: nothing
op: bias, weight: nothing, bias: (1024,)
op: relu, weight: nothing, bias: nothing
op: matmul, weight: (10, 1024), bias: nothing
op: bias, weight: nothing, bias: (10,)
op: relu, weight: nothing, bias: nothing
op: matmul, weight: (10, 10), bias: nothing
op: bias, weight: nothing, bias: (10,)
Distance: 1266.8815759184893
Distance: 2876.6944248261216
Distance: 2831.8843567411013
Distance: 34.033756025192815
Distance: 0.0
Running with 1 threads
[Thread 1] Time to first task: 0.0s
Instable Generators: 375
Instable Generators: 769
Instable Generators: 973
Instable Generators: 10
Zono Bounds:
[-102.77699531174736, -105.90016309712392, -118.17936128647102, -114.860474525858, -114.38006997290927, -119.48161450865402, -105.33585884416442, -111.9283129149672, -112.42466742547307, -118.92169602706181]
[102.19604885442882, 105.90016309712392, 112.80105809524119, 114.860474525858, 114.38006997290927, 114.1506841865461, 104.1477194425211, 111.9283129149672, 110.73450825977378, 118.92169602706181]

Found counterexample: ([0.0, 0.0, 0.0, 0.0, 0.0, 0.0, 0.0, 0.0, 0.0, 0.0, 0.0, 0.0, 0.0, 0.0, 0.0, 0.0, 0.0, 0.0, 0.0, 0.0, 0.0, 0.0, 0.0, 0.0, 0.0, 0.0, 0.0, 0.0, 0.0, 0.0, 0.0, 0.0, 0.0, 0.0, 0.0, 0.0, 0.0, 0.0, 0.0, 0.0, 0.0, 0.0, 0.0, 0.0, 0.0, 0.0, 0.0, 0.0, 0.0, 0.0, 0.0, 0.0, 0.0, 0.0, 0.0, 0.0, 0.0, 0.0, 0.0, 0.0, 0.0, 0.0, 0.0, 0.0, 0.0, 0.0, 0.0, 0.0, 0.0, 0.0, 0.0, 0.0, 0.0, 0.0, 0.0, 0.0, 0.0, 0.0, 0.0, 0.0, 0.0, 0.0, 0.0, 0.0, 0.0, 0.0, 0.0, 0.0, 0.0, 0.0, 0.0, 0.0, 0.0, 0.0, 0.0, 0.0, 0.0, 0.0, 0.0, 0.0, 0.0, 0.0, 0.0, 0.0, 0.0, 0.0, 0.0, 0.0, 0.0, 0.0, 0.0, 0.0, 0.0, 0.0, 0.0, 1.0, 0.0, 0.0, 0.0, 0.0, 0.0, 0.0, 0.0, 0.0, 0.0, 0.0, 0.0, 0.0, 0.0, 0.0, 0.0, 0.0, 0.0, 0.0, 0.0, 0.0, 0.0, 0.0, 0.0, 0.0, 0.0, 0.0, 0.0, 0.0, 0.0, 0.0, 0.0, 0.0, 0.0, 0.0, 0.0, 0.0, 0.0, 0.0, 0.0, 0.0, 0.0, 0.0, 0.14509805, 0.99215686, 1.0, 0.99215686, 0.28235295, 0.0, 0.0, 0.0, 0.0, 0.0, 0.0, 0.0, 1.0, 0.0, 0.0, 0.0, 0.0, 0.0, 0.0, 0.0, 0.0, 0.0, 0.0, 0.24705882, 0.24705882, 0.0, 0.0, 0.24705882, 0.70980394, 0.98823529, 0.99215686, 0.98823529, 0.27843139, 0.0, 0.0, 0.0, 0.0, 0.0, 0.0, 0.0, 0.0, 0.0, 0.0, 0.0, 0.0, 0.0, 0.0, 0.0, 0.0, 0.0, 0.71372551, 0.94901961, 0.84313726, 0.0, 0.0627451, 0.87058824, 0.98823529, 0.98823529, 0.92941177, 0.68235296, 0.07843138, 0.0, 0.0, 0.0, 0.0, 0.0, 0.0, 0.0, 0.0, 0.0, 0.0, 0.0, 0.0, 0.0, 0.0, 0.0, 0.08235294, 0.56470591, 0.99215686, 0.82352942, 0.36078432, 0.00392157, 0.74901962, 0.98823529, 0.98823529, 0.98823529, 0.56470591, 0.0, 0.0, 0.0, 0.0, 0.0, 0.0, 0.0, 0.0, 0.0, 0.0, 0.0, 1.0, 0.0, 0.0, 0.0, 0.0, 0.36862746, 1.0, 0.98823529, 0.80784315, 0.07843138, 0.0, 0.56470591, 0.99215686, 0.98823529, 0.98823529, 0.42352942, 0.0, 0.0, 0.0, 0.0, 0.0, 0.0, 0.0, 0.0, 0.0, 0.0, 1.0, 0.0, 0.0, 0.0, 0.0, 0.0, 0.1254902, 0.89019608, 0.98823529, 0.98823529, 0.07843138, 0.0, 0.1254902, 0.92941177, 0.99215686, 0.98823529, 0.86274511, 0.05882353, 0.0, 0.0, 0.0, 0.0, 0.0, 0.0, 0.0, 0.0, 0.0, 0.0, 0.0, 0.0, 0.0, 0.0, 0.02352941, 0.14509805, 0.82745099, 0.98823529, 0.96470588, 0.51764709, 0.0, 0.04313726, 0.58823532, 0.98823529, 0.99215686, 0.98823529, 0.7647059, 0.0, 0.0, 0.08235294, 0.0, 0.0, 0.0, 0.0, 0.0, 0.0, 0.0, 0.0, 0.0, 0.0, 0.0, 0.0, 0.14509805, 0.98823529, 0.98823529, 0.98823529, 0.51764709, 0.0, 0.0, 0.28627452, 0.98823529, 0.98823529, 0.99215686, 0.98823529, 0.27843139, 0.0, 0.56862748, 0.80784315, 0.16078432, 0.0, 0.0, 0.0, 0.0, 0.0, 0.0, 0.0, 0.0, 0.0, 0.0, 0.0, 0.71372551, 0.99215686, 0.99215686, 0.99215686, 0.28235295, 0.0, 0.0, 0.28627452, 0.99215686, 0.99215686, 1.0, 0.82745099, 0.42745098, 0.74901962, 1.0, 0.99215686, 0.28235295, 0.0, 0.0, 0.0, 0.0, 0.0, 0.0, 0.0, 0.0, 0.0, 0.0, 0.24705882, 0.94901961, 0.98823529, 0.98823529, 0.98823529, 0.48627451, 0.28627452, 0.16470589, 0.4509804, 0.98823529, 0.98823529, 0.99215686, 0.98823529, 0.98823529, 0.98823529, 0.99215686, 0.90588236, 0.2, 0.0, 0.0, 0.0, 0.0, 0.0, 0.0, 0.0, 0.0, 0.0, 0.0, 0.28627452, 0.98823529, 0.98823529, 0.98823529, 0.98823529, 0.0, 0.98823529, 0.87058824, 0.94901961, 0.98823529, 0.98823529, 0.99215686, 0.98823529, 0.98823529, 0.98823529, 0.92941177, 0.60000002, 0.0, 0.0, 0.0, 0.0, 0.0, 0.0, 0.0, 0.0, 0.0, 0.0, 0.0, 0.28627452, 0.98823529, 0.98823529, 0.98823529, 0.98823529, 0.98823529, 0.98823529, 0.99215686, 0.98823529, 0.98823529, 0.98823529, 0.99215686, 0.98823529, 0.98823529, 0.98823529, 0.56470591, 0.0, 0.0, 0.0, 0.0, 0.0, 0.0, 0.0, 0.0, 0.0, 0.0, 0.0, 0.0, 0.16470589, 0.627451, 0.0, 0.99215686, 0.99215686, 0.99215686, 0.99215686, 1.0, 0.99215686, 0.99215686, 0.99215686, 1.0, 0.99215686, 0.92941177, 0.56470591, 0.0, 0.0, 0.0, 0.0, 0.0, 0.0, 0.0, 0.0, 0.0, 0.0, 0.0, 0.0, 0.0, 0.0, 0.01960784, 0.46666667, 0.82352942, 0.74117649, 0.90588236, 0.98823529, 0.99215686, 0.98823529, 0.98823529, 0.98823529, 0.87058824, 0.5411765, 0.11764706, 0.0, 0.0, 0.0, 0.0, 0.0, 0.0, 0.0, 0.0, 0.0, 0.0, 0.0, 0.0, 0.0, 1.0, 0.0, 0.0, 0.0, 0.12156863, 0.03921569, 0.2, 0.60392159, 0.99215686, 0.98823529, 0.98823529, 0.98823529, 0.627451, 0.01960784, 0.0, 0.0, 0.0, 0.0, 0.0, 0.0, 0.0, 0.0, 0.0, 0.0, 0.0, 0.0, 0.0, 0.0, 1.0, 0.0, 0.0, 0.0, 0.0, 0.0, 0.0, 0.0, 0.99215686, 0.98823529, 0.98823529, 0.98823529, 0.99215686, 0.46666667, 0.0, 0.0, 0.0, 0.0, 0.0, 0.0, 0.0, 0.0, 0.0, 0.0, 0.0, 0.0, 0.0, 0.0, 0.0, 0.0, 0.0, 0.0, 0.0, 0.0, 0.0, 0.0, 0.75294119, 0.99215686, 0.99215686, 0.99215686, 1.0, 0.99215686, 0.52156866, 0.0, 0.0, 0.0, 0.0, 0.0, 0.0, 0.0, 0.0, 0.0, 0.0, 0.0, 0.0, 0.0, 0.0, 0.0, 0.0, 0.0, 0.0, 0.0, 0.0, 0.0, 0.30588236, 0.0, 0.98823529, 0.98823529, 0.99215686, 0.98823529, 0.68235296, 0.0, 1.0, 0.0, 0.0, 0.0, 0.0, 0.0, 0.0, 0.0, 0.0, 0.0, 0.0, 0.0, 0.0, 0.0, 0.0, 0.0, 0.0, 0.0, 0.0, 0.0, 0.0, 0.40392157, 0.86666667, 0.98823529, 0.99215686, 0.86274511, 0.23921569, 0.0, 0.0, 0.0, 0.0, 0.0, 0.0, 0.0, 0.0, 0.0, 0.0, 0.0, 0.0, 0.0, 0.0, 0.0, 0.0, 0.0, 0.0, 0.0, 0.0, 0.0, 0.0, 0.0, 0.0627451, 0.74509805, 0.42352942, 0.05882353, 0.0, 0.0, 0.0, 0.0, 0.0, 0.0, 0.0, 0.0, 0.0, 0.0, 0.0, 0.0, 0.0, 0.0, 0.0, 0.0, 0.0, 0.0, 0.0, 0.0, 0.0, 0.0, 0.0, 0.0, 1.0, 0.0, 0.0, 0.0, 0.0, 0.0, 0.0, 0.0, 0.0, 0.0, 0.0, 0.0, 0.0, 0.0, 0.0, 0.0, 0.0, 0.0, 0.0, 0.0, 0.0, 0.0, 0.0, 0.0, 0.0, 0.0, 0.0, 0.0, 0.0, 1.0, 0.0, 0.0, 0.0, 0.0, 0.0, 0.0, 0.0, 0.0, 0.0, 0.0, 0.0, 0.0, 0.0, 0.0, 0.0, 0.0, 0.0, 0.0, 0.0, 0.0, 0.0, 0.0, 0.0, 1.0, 0.0, 0.0, 0.0, 0.0, 0.0, 0.0, 0.0, 0.0, 0.0, 0.0, 0.0, 0.0, 0.0, 0.0, 0.0, 0.0], ([0.0, 5.7727033291053145, 0.0, 0.0, 16.984273557776174, 0.0, 0.0, 13.355807575617211, 0.0, 9.540753602238452], [0.0, 3.2326752635656044, 0.0, 0.3527718184136883, 10.650545467181084, 0.0, 0.0, 10.517291281507418, 0.0, 7.9050308784734495], 6.3337280905950895))
[Thread 1] Total splits: 0
Processed 1 zonotopes (Work Done: 0.0%); Generated 0 (1.266630253s/loop)
[Thread 1] Finished in 1.27s
 ────────────────────────────────────────────────────────────────────────────────
                                        Time                    Allocations      
                               ───────────────────────   ────────────────────────
       Tot / % measured:            1.28s / 100.0%            326MiB / 100.0%    

 Section               ncalls     time    %tot     avg     alloc    %tot      avg
 ────────────────────────────────────────────────────────────────────────────────
 Verify                     1    1.27s   99.0%   1.27s    303MiB   93.1%   303MiB
   Zonotope Loop            1    1.27s   99.0%   1.27s    303MiB   93.1%   303MiB
     Zonotope Propa...      1    1.26s   98.1%   1.26s    302MiB   92.5%   302MiB
       DiffZonotope...      4    710ms   55.5%   178ms    237MiB   72.9%  59.3MiB
         Zonotope_R...      8    385ms   30.1%  48.1ms    148MiB   45.5%  18.5MiB
           Column M...      8    267ms   20.9%  33.4ms   59.8MiB   18.4%  7.48MiB
           Allocation       8   94.0ms    7.3%  11.7ms   59.8MiB   18.4%  7.48MiB
           Influenc...      8   14.1ms    1.1%  1.76ms   28.2MiB    8.6%  3.52MiB
             Multiply       8   13.5ms    1.1%  1.69ms   26.0MiB    8.0%  3.24MiB
             Alloca...      8    377μs    0.0%  47.2μs   2.20MiB    0.7%   282KiB
             Set Ma...      8    143μs    0.0%  17.9μs     0.00B    0.0%    0.00B
           Set Matrix       8   9.73ms    0.8%  1.22ms    112KiB    0.0%  14.0KiB
           Vectors          8    197μs    0.0%  24.7μs    272KiB    0.1%  34.0KiB
           Bounds           8   5.43μs    0.0%   679ns     0.00B    0.0%    0.00B
       DiffZonotope...      5    545ms   42.6%   109ms   64.2MiB   19.7%  12.8MiB
         Zonotope_D...     10    159ms   12.4%  15.9ms   26.3MiB    8.1%  2.63MiB
     Property Check         1   10.8ms    0.8%  10.8ms    538KiB    0.2%   538KiB
 Initialize                 1   12.6ms    1.0%  12.6ms   22.4MiB    6.9%  22.4MiB
 ────────────────────────────────────────────────────────────────────────────────
[VERYDIFF_TIMER] 1.348301384

[VERYDIFF_EXPERIMENT] NETWORK: /home/i57/steuber/NeuroDiff/repos/VeryDiffExperiments/src/../benchmarks/mnist-prune/specs/mnist_95_local_24.vnnlib
[VERYDIFF_EXPERIMENT] TIME: 2.363237936
