
[VERYDIFF_EXPERIMENT] Running on /home/i57/steuber/NeuroDiff/repos/VeryDiffExperiments/src/../benchmarks/mnist-prune/specs/mnist_22_global_4.vnnlib /home/i57/steuber/NeuroDiff/repos/VeryDiffExperiments/src/../benchmarks/mnist-prune/nets/mnist_relu_3_100.onnx
Parsing /home/i57/steuber/NeuroDiff/repos/VeryDiffExperiments/src/../benchmarks/mnist-prune/nets/mnist_relu_3_100.onnx...
Found input X
op: matmul, weight: (100, 784), bias: nothing
op: bias, weight: nothing, bias: (100,)
op: relu, weight: nothing, bias: nothing
op: matmul, weight: (100, 100), bias: nothing
op: bias, weight: nothing, bias: (100,)
op: relu, weight: nothing, bias: nothing
op: matmul, weight: (10, 100), bias: nothing
op: bias, weight: nothing, bias: (10,)
op: relu, weight: nothing, bias: nothing
op: matmul, weight: (10, 10), bias: nothing
op: bias, weight: nothing, bias: (10,)
Parsing /home/i57/steuber/NeuroDiff/repos/VeryDiffExperiments/src/../benchmarks/mnist-prune/nets_pruned/mnist_relu_3_100_0.77-old.onnx...
Found input X
op: gemm, weight: (100, 784), bias: (100,)
op: relu, weight: nothing, bias: nothing
op: gemm, weight: (100, 100), bias: (100,)
op: relu, weight: nothing, bias: nothing
op: gemm, weight: (10, 100), bias: (10,)
op: relu, weight: nothing, bias: nothing
op: gemm, weight: (10, 10), bias: (10,)
Distance: 1958.4889029213523
Distance: 144.28197153992141
Distance: 22.063573056613677
Distance: 0.8412832540489035
Running with 1 threads
[Thread 1] Time to first task: 0.0s
Instable Generators: 24
Instable Generators: 25
Instable Generators: 5
Zono Bounds:
[-2.135768450904999, -2.0603431830372037, -2.586723864452057, -0.02470919849260042, -2.6140984825663014, -1.8899984188009016, -2.5755351403731126, -2.0847241032562813, -0.09775770949480356, 0.008003537069785842]
[1.7957645449706088, 1.7976774654639793, 2.2414936548921696, -0.016125068360549562, 2.7989798482245214, 1.7274063274905165, 1.817809960916627, 2.068178876209645, 0.16448075949845814, 0.020160939800408915]
[Thread 1] Total splits: 0
Processed 1 zonotopes (Work Done: 100.0%); Generated 0 (0.130087177s/loop)
[Thread 1] Finished in 0.13s
 ────────────────────────────────────────────────────────────────────────────────
                                        Time                    Allocations      
                               ───────────────────────   ────────────────────────
       Tot / % measured:            131ms / 100.0%            152MiB / 100.0%    

 Section               ncalls     time    %tot     avg     alloc    %tot      avg
 ────────────────────────────────────────────────────────────────────────────────
 Verify                     1    130ms   99.6%   130ms    147MiB   96.4%   147MiB
   Zonotope Loop            1    130ms   99.6%   130ms    147MiB   96.4%   147MiB
     Property Check         1   77.7ms   59.5%  77.7ms   55.9MiB   36.7%  55.9MiB
     Zonotope Propa...      1   49.0ms   37.5%  49.0ms   71.1MiB   46.6%  71.1MiB
       DiffZonotope...      3   25.0ms   19.1%  8.32ms   67.0MiB   44.0%  22.3MiB
         Zonotope_R...      6   24.0ms   18.3%  3.99ms   65.4MiB   42.9%  10.9MiB
           Influenc...      6   22.7ms   17.4%  3.78ms   60.1MiB   39.5%  10.0MiB
             Multiply       6   17.3ms   13.2%  2.89ms   30.4MiB   20.0%  5.07MiB
             Set Ma...      6   4.07ms    3.1%   678μs     0.00B    0.0%    0.00B
             Alloca...      6   1.28ms    1.0%   213μs   29.7MiB   19.5%  4.95MiB
           Column M...      6    766μs    0.6%   128μs   2.64MiB    1.7%   450KiB
           Set Matrix       6    327μs    0.3%  54.5μs   4.45KiB    0.0%     760B
           Allocation       6    126μs    0.1%  21.1μs   2.64MiB    1.7%   450KiB
           Vectors          6   28.1μs    0.0%  4.69μs   19.5KiB    0.0%  3.26KiB
           Bounds           6   3.91μs    0.0%   652ns     0.00B    0.0%    0.00B
       DiffZonotope...      4   24.0ms   18.4%  6.01ms   4.09MiB    2.7%  1.02MiB
         Zonotope_D...      8   9.14ms    7.0%  1.14ms   2.70MiB    1.8%   345KiB
 Initialize                 1    545μs    0.4%   545μs   5.41MiB    3.6%  5.41MiB
 ────────────────────────────────────────────────────────────────────────────────
[VERYDIFF_TIMER] 0.156998145

[VERYDIFF_EXPERIMENT] NETWORK: /home/i57/steuber/NeuroDiff/repos/VeryDiffExperiments/src/../benchmarks/mnist-prune/specs/mnist_22_global_4.vnnlib
[VERYDIFF_EXPERIMENT] TIME: 0.460947913
