
[VERYDIFF_EXPERIMENT] Running on /home/i57/steuber/NeuroDiff/repos/VeryDiffExperiments/src/../benchmarks/mnist-prune/specs/mnist_4_global_6.vnnlib /home/i57/steuber/NeuroDiff/repos/VeryDiffExperiments/src/../benchmarks/mnist-prune/nets/mnist_relu_3_100.onnx
Found input X
op: matmul, weight: (100, 784), bias: nothing
op: bias, weight: nothing, bias: (100,)
op: relu, weight: nothing, bias: nothing
op: matmul, weight: (100, 100), bias: nothing
op: bias, weight: nothing, bias: (100,)
op: relu, weight: nothing, bias: nothing
op: matmul, weight: (10, 100), bias: nothing
op: bias, weight: nothing, bias: (10,)
op: relu, weight: nothing, bias: nothing
op: matmul, weight: (10, 10), bias: nothing
op: bias, weight: nothing, bias: (10,)
Found input X
op: gemm, weight: (100, 784), bias: (100,)
op: relu, weight: nothing, bias: nothing
op: gemm, weight: (100, 100), bias: (100,)
op: relu, weight: nothing, bias: nothing
op: gemm, weight: (10, 100), bias: (10,)
op: relu, weight: nothing, bias: nothing
op: gemm, weight: (10, 10), bias: (10,)
Distance: 1958.4889029213523
Distance: 144.28197153992141
Distance: 22.063573056613677
Distance: 0.8412832540489035
Running with 1 threads
[Thread 1] Time to first task: 0.0s
Instable Generators: 33
Instable Generators: 55
Instable Generators: 7
Zono Bounds:
[-5.4904365672085875, -0.005719952757122036, -6.725694047585926, -0.007467511881086507, -6.4861128180344725, -7.066796304401843, -7.2234985560742215, -7.142269066842203, -6.495418981892145, -7.461185939355351]
[5.4972289446746805, 0.029702434112763538, 6.777957133236417, 0.005803383622534228, 6.874483044902355, 7.161872441068046, 7.320701618783743, 7.21222068265124, 6.485492367996349, 7.276286287335818]
[Thread 1] Processed 100 zonotopes (Work Done: 0.0%; Expected Zonos: Inf)
[Thread 1] Processed 200 zonotopes (Work Done: 0.0%; Expected Zonos: Inf)
[Thread 1] Processed 300 zonotopes (Work Done: 0.0%; Expected Zonos: Inf)
[Thread 1] Processed 400 zonotopes (Work Done: 0.0%; Expected Zonos: Inf)
[Thread 1] Processed 500 zonotopes (Work Done: 0.0%; Expected Zonos: Inf)


TIMEOUT REACHED
UNKNOWN
[Thread 1] Total splits: 567
Processed 567 zonotopes (Work Done: 0.0%); Generated 1134 (0.21164257100352732s/loop)
[Thread 1] Finished in 120.0s
 ────────────────────────────────────────────────────────────────────────────────
                                        Time                    Allocations      
                               ───────────────────────   ────────────────────────
       Tot / % measured:             120s / 100.0%           60.8GiB / 100.0%    

 Section               ncalls     time    %tot     avg     alloc    %tot      avg
 ────────────────────────────────────────────────────────────────────────────────
 Verify                     1     120s  100.0%    120s   60.8GiB  100.0%  60.8GiB
   Zonotope Loop            1     120s  100.0%    120s   60.8GiB  100.0%  60.8GiB
     Zonotope Propa...    567    72.4s   60.3%   128ms   41.0GiB   67.5%  74.1MiB
       DiffZonotope...  1.70k    62.5s   52.1%  36.7ms   38.7GiB   63.7%  23.3MiB
         Zonotope_R...  3.40k    61.8s   51.5%  18.2ms   37.8GiB   62.1%  11.4MiB
           Influenc...  3.40k    54.0s   45.0%  15.9ms   34.8GiB   57.2%  10.5MiB
             Alloca...  3.40k    26.1s   21.8%  7.67ms   17.1GiB   28.0%  5.13MiB
             Multiply   3.40k    25.4s   21.2%  7.48ms   17.7GiB   29.1%  5.34MiB
             Set Ma...  3.40k    2.47s    2.1%   727μs     0.00B    0.0%    0.00B
           Column M...  3.40k    3.95s    3.3%  1.16ms   1.51GiB    2.5%   464KiB
           Allocation   3.40k    3.56s    3.0%  1.05ms   1.50GiB    2.5%   464KiB
           Set Matrix   3.40k    190ms    0.2%  55.7μs   3.56MiB    0.0%  1.07KiB
           Vectors      3.40k   17.6ms    0.0%  5.19μs   10.8MiB    0.0%  3.26KiB
           Bounds       3.40k   2.46ms    0.0%   725ns     0.00B    0.0%    0.00B
       DiffZonotope...  2.27k    9.91s    8.3%  4.37ms   2.30GiB    3.8%  1.04MiB
         Zonotope_D...  4.54k    4.79s    4.0%  1.06ms   1.51GiB    2.5%   348KiB
     Compute Split        567    31.8s   26.5%  56.1ms   8.64GiB   14.2%  15.6MiB
     Property Check       567    111ms    0.1%   196μs    118MiB    0.2%   213KiB
 Initialize                 1    563μs    0.0%   563μs   5.41MiB    0.0%  5.41MiB
 ────────────────────────────────────────────────────────────────────────────────
[VERYDIFF_TIMER] 120.044669464

[VERYDIFF_EXPERIMENT] NETWORK: /home/i57/steuber/NeuroDiff/repos/VeryDiffExperiments/src/../benchmarks/mnist-prune/specs/mnist_4_global_6.vnnlib
[VERYDIFF_EXPERIMENT] TIME: 120.51108687
