
[VERYDIFF_EXPERIMENT] Running on /home/i57/steuber/NeuroDiff/repos/VeryDiffExperiments/src/../benchmarks/mnist-prune/specs/mnist_93_local_21.vnnlib /home/i57/steuber/NeuroDiff/repos/VeryDiffExperiments/src/../benchmarks/mnist-prune/nets/mnist_relu_2_512.onnx
Loading /home/i57/steuber/NeuroDiff/repos/VeryDiffExperiments/src/../benchmarks/mnist-prune/nets/mnist_relu_2_512.onnx and /home/i57/steuber/NeuroDiff/repos/VeryDiffExperiments/src/../benchmarks/mnist-prune/nets_pruned/mnist_relu_2_512_pruned5.onnx
INPUT SHAPE: 784

[NEQUIV] 154.0517697809912

[ -71.91815279  -66.73320525  -47.68136481   15.22131132  -77.76738679
  -16.13944396 -111.43315959  -51.31166174  -48.40211554   -9.90834878]
[ -69.26572968  -61.58380636  -45.31905912   14.7004037   -71.82190808
  -13.71642212 -104.86569355  -47.42017453  -48.98637215  -10.64239852]
NETWORKS NOT EQUIVALENT
Refined: 0 | Refine Limit: -1 | Wrong: 0 | Right: 1 | Total: 1 | Total Zonos Considered: 1 | Expected 2 (50.0%)

time: 2.104990365

[VERYDIFF_TIMER] 2.128722894

[VERYDIFF_EXPERIMENT] Running on /home/i57/steuber/NeuroDiff/repos/VeryDiffExperiments/src/../benchmarks/mnist-prune/specs/mnist_93_local_21.vnnlib /home/i57/steuber/NeuroDiff/repos/VeryDiffExperiments/src/../benchmarks/mnist-prune/nets/mnist_relu_3_100.onnx
Loading /home/i57/steuber/NeuroDiff/repos/VeryDiffExperiments/src/../benchmarks/mnist-prune/nets/mnist_relu_3_100.onnx and /home/i57/steuber/NeuroDiff/repos/VeryDiffExperiments/src/../benchmarks/mnist-prune/nets_pruned/mnist_relu_3_100_pruned5.onnx
INPUT SHAPE: 784
Refined: 38 | Refine Limit: 13 | Wrong: 0 | Right: 50 | Total: 50 | Total Zonos Considered: 88 | Expected 1257470 (0.00397623800170183%)Refined: 127 | Refine Limit: 32 | Wrong: 0 | Right: 182 | Total: 182 | Total Zonos Considered: 309 | Expected 4576979 (0.003976422002373181%)Refined: 207 | Refine Limit: 28 | Wrong: 0 | Right: 342 | Total: 342 | Total Zonos Considered: 549 | Expected 8600697 (0.003976421910921871%)Refined: 302 | Refine Limit: 35 | Wrong: 0 | Right: 506 | Total: 506 | Total Zonos Considered: 808 | Expected 12725008 (0.0039764218615815404%)Refined: 399 | Refine Limit: 35 | Wrong: 0 | Right: 666 | Total: 666 | Total Zonos Considered: 1065 | Expected 16748726 (0.003976421848443876%)Refined: 491 | Refine Limit: 34 | Wrong: 0 | Right: 829 | Total: 829 | Total Zonos Considered: 1320 | Expected 20847889 (0.003976421785438325%)Refined: 578 | Refine Limit: 36 | Wrong: 0 | Right: 988 | Total: 988 | Total Zonos Considered: 1566 | Expected 24846459 (0.003976421750882087%)Refined: 663 | Refine Limit: 37 | Wrong: 0 | Right: 1145 | Total: 1145 | Total Zonos Considered: 1808 | Expected 28794733 (0.003976421660169587%)Refined: 754 | Refine Limit: 35 | Wrong: 0 | Right: 1318 | Total: 1318 | Total Zonos Considered: 2072 | Expected 33145378 (0.003976421689926119%)Refined: 843 | Refine Limit: 28 | Wrong: 0 | Right: 1485 | Total: 1485 | Total Zonos Considered: 2328 | Expected 37345134 (0.003976421667144105%)Refined: 930 | Refine Limit: 25 | Wrong: 0 | Right: 1644 | Total: 1644 | Total Zonos Considered: 2574 | Expected 41343704 (0.003976421657817596%)Refined: 1014 | Refine Limit: 31 | Wrong: 0 | Right: 1786 | Total: 1786 | Total Zonos Considered: 2800 | Expected 44914748 (0.003976422176519837%)Refined: 1101 | Refine Limit: 36 | Wrong: 0 | Right: 1944 | Total: 1944 | Total Zonos Considered: 3045 | Expected 48888163 (0.003976422677203068%)Refined: 1195 | Refine Limit: 25 | Wrong: 0 | Right: 2117 | Total: 2117 | Total Zonos Considered: 3312 | Expected 53238807 (0.003976422687307775%)Refined: 1275 | Refine Limit: 27 | Wrong: 0 | Right: 2255 | Total: 2255 | Total Zonos Considered: 3530 | Expected 56709242 (0.003976424160280612%)Refined: 1331 | Refine Limit: 21 | Wrong: 0 | Right: 2380 | Total: 2380 | Total Zonos Considered: 3711 | Expected 59852747 (0.0039764256768365204%)Refined: 1410 | Refine Limit: 29 | Wrong: 0 | Right: 2501 | Total: 2501 | Total Zonos Considered: 3911 | Expected 62895669 (0.0039764264213486625%)Refined: 1505 | Refine Limit: 32 | Wrong: 0 | Right: 2650 | Total: 2650 | Total Zonos Considered: 4155 | Expected 66642752 (0.0039764264236867046%)Refined: 1583 | Refine Limit: 39 | Wrong: 0 | Right: 2771 | Total: 2771 | Total Zonos Considered: 4354 | Expected 69685686 (0.00397642637829525%)UNKNOWN
TIMEOUT
Refined: 1589 | Refine Limit: 35 | Wrong: 0 | Right: 2786 | Total: 2786 | Total Zonos Considered: 4375 | Expected 70062909 (0.003976426385607255%)

time: 120.308637631

[VERYDIFF_TIMER] 120.332585481

[VERYDIFF_EXPERIMENT] Running on /home/i57/steuber/NeuroDiff/repos/VeryDiffExperiments/src/../benchmarks/mnist-prune/specs/mnist_93_local_21.vnnlib /home/i57/steuber/NeuroDiff/repos/VeryDiffExperiments/src/../benchmarks/mnist-prune/nets/mnist_relu_4_1024.onnx
Loading /home/i57/steuber/NeuroDiff/repos/VeryDiffExperiments/src/../benchmarks/mnist-prune/nets/mnist_relu_4_1024.onnx and /home/i57/steuber/NeuroDiff/repos/VeryDiffExperiments/src/../benchmarks/mnist-prune/nets_pruned/mnist_relu_4_1024_pruned5.onnx
INPUT SHAPE: 784

[NEQUIV] 740.2588741268146

[ 0.         12.82737381  0.         39.94464453  0.         12.9039676
  0.          0.          0.         11.82036884]
[ 0.         11.77578196  0.         32.32255927  0.         13.29691411
  0.          0.          0.          8.36547152]
NETWORKS NOT EQUIVALENT
Refined: 0 | Refine Limit: -1 | Wrong: 0 | Right: 1 | Total: 1 | Total Zonos Considered: 1 | Expected 2 (50.0%)

time: 27.974616083

[VERYDIFF_TIMER] 28.010547211

[VERYDIFF_EXPERIMENT] NETWORK: /home/i57/steuber/NeuroDiff/repos/VeryDiffExperiments/src/../benchmarks/mnist-prune/specs/mnist_93_local_21.vnnlib
[VERYDIFF_EXPERIMENT] TIME: 151.321964891
