Network: ./acas-prune/nets/product_ACASXU_run2a_2_7_batch_2000_ACASXU_run2a_2_7_batch_2000_pruned30_eps.onnx
Property: ./acas-prune/specs/product_prop_3_eps_0.05.vnnlib

Engine::processInputQuery: Input query (before preprocessing): 615 equations, 1220 variables
Engine::processInputQuery: Input query (after preprocessing): 1061 equations, 1458 variables

Input bounds:
	x0: [ -0.3035,  -0.2986] 
	x1: [ -0.0095,   0.0095] 
	x2: [  0.4934,   0.5000] 
	x3: [  0.3000,   0.5000] 
	x4: [  0.3000,   0.5000] 

Branching heuristics set to LargestInterval

Engine::solve: Initial statistics

03:08:35 Statistics update:
	--- Time Statistics ---
	Total time elapsed: 199 milli (00:00:00)
		Main loop: 0 milli (00:00:00)
		Preprocessing time: 141 milli (00:00:00)
		Unknown: 57 milli (00:00:00)
	Breakdown for main loop:
		[0.00%] Simplex steps: 0 milli
		[0.00%] Explicit-basis bound tightening: 0 milli
		[0.00%] Constraint-matrix bound tightening: 0 milli
		[0.00%] Degradation checking: 0 milli
		[0.00%] Precision restoration: 0 milli
		[0.00%] Statistics handling: 0 milli
		[0.00%] Constraint-fixing steps: 0 milli
		[0.00%] Valid case splits: 1 milli. Average per split: 0.00 milli
		[0.00%] Applying stored bound-tightening: 0 milli
		[0.00%] SMT core: 0 milli
		[0.00%] Symbolic Bound Tightening: 14 milli
		[0.00%] SoI-based local search: 0 milli
		[0.00%] SoI-based local search: 0 milli
		[0.00%] Unaccounted for: 0 milli
	--- Preprocessor Statistics ---
	Number of preprocessor bound-tightening loop iterations: 8
	Number of eliminated variables: 362
	Number of constraints removed due to variable elimination: 208
	Number of equations removed due to variable elimination: 0
	--- Engine Statistics ---
	Number of main loop iterations: 1
		0 iterations were simplex steps. Total time: 0 milli. Average: 0.00 milli.
		0 iterations were constraint-fixing steps. Total time: 0 milli. Average: 0.00 milli
	Number of active piecewise-linear constraints: 80 / 393
		Constraints disabled by valid splits: 313. By SMT-originated splits: 0
	Last reported degradation: 0.0000000000. Max degradation so far: 0.0000000000. Restorations so far: 0
	Number of simplex pivots we attempted to skip because of instability: 0.
	Unstable pivots performed anyway: 0
	--- Tableau Statistics ---
	Total number of pivots performed: 0
		Real pivots: 0. Degenerate: 0 (0.00%)
		Degenerate pivots by request (e.g., to fix a PL constraint): 0 (0.00%)
		Average time per pivot: 0.00 milli
	Total number of fake pivots performed: 0
	Total number of rows added: 0. Number of merged columns: 0
	Current tableau dimensions: M = 1061, N = 2519
	--- SMT Core Statistics ---
	Total depth is 0. Total visited states: 1. Number of splits: 0. Number of pops: 0
	Max stack depth: 0
	--- Bound Tightening Statistics ---
	Number of tightened bounds: 0.
		Number of rows examined by row tightener: 0. Consequent tightenings: 0
		Number of explicit basis matrices examined by row tightener: 0. Consequent tightenings: 0
		Number of bound tightening rounds on the entire constraint matrix: 0. Consequent tightenings: 0
		Number of bound notifications sent to PL constraints: 2362. Tightenings proposed: 0
	--- Basis Factorization statistics ---
	Number of basis refactorizations: 2
	--- Projected Steepest Edge Statistics ---
	Number of iterations: 0.
	Number of resets to reference space: 1. Avg. iterations per reset: 0
	--- SBT ---
	Number of tightened bounds: 1366
	--- SoI-based local search ---
	Number of proposed phase pattern update: 0. Number of accepted update: 0 [0.00%]
	Total time (% of local search time) updating SoI phase pattern : 0 milli [0.00%]
	Total time obtaining current assignment: 0 milli [0.00%]
	Total time getting SoI phase pattern : 0 milli [0.00%]
	--- Context dependent statistics ---
	Number of pushes / pops: 0 / 0
		[0.00%] Pre-Push hook: 0 milli
		[0.00%] Push : 0 milli
		[0.00%] Post-Pop hook: 0 milli
		[0.00%] Pop : 0 milli
		[0.00%] Total context-switching time: 0 milli
	--- Proof Certificate ---
	Number of certified leaves: 0
	Number of leaves to delegate: 0

---

Engine::solve: sat assignment found

03:08:35 Statistics update:
	--- Time Statistics ---
	Total time elapsed: 886 milli (00:00:00)
		Main loop: 686 milli (00:00:00)
		Preprocessing time: 141 milli (00:00:00)
		Unknown: 57 milli (00:00:00)
	Breakdown for main loop:
		[35.07%] Simplex steps: 240 milli
		[62.12%] Explicit-basis bound tightening: 426 milli
		[0.00%] Constraint-matrix bound tightening: 0 milli
		[0.31%] Degradation checking: 2 milli
		[0.00%] Precision restoration: 0 milli
		[0.19%] Statistics handling: 1 milli
		[0.00%] Constraint-fixing steps: 0 milli
		[0.16%] Valid case splits: 1 milli. Average per split: 0.00 milli
		[0.00%] Applying stored bound-tightening: 0 milli
		[0.00%] SMT core: 0 milli
		[3.90%] Symbolic Bound Tightening: 26 milli
		[4.80%] SoI-based local search: 32 milli
		[0.00%] SoI-based local search: 0 milli
		[2685995278469591.50%] Unaccounted for: 0 milli
	--- Preprocessor Statistics ---
	Number of preprocessor bound-tightening loop iterations: 8
	Number of eliminated variables: 362
	Number of constraints removed due to variable elimination: 208
	Number of equations removed due to variable elimination: 0
	--- Engine Statistics ---
	Number of main loop iterations: 646
		644 iterations were simplex steps. Total time: 240 milli. Average: 0.37 milli.
		0 iterations were constraint-fixing steps. Total time: 0 milli. Average: 0.00 milli
	Number of active piecewise-linear constraints: 80 / 393
		Constraints disabled by valid splits: 313. By SMT-originated splits: 0
	Last reported degradation: 0.0000000002. Max degradation so far: 0.0000000002. Restorations so far: 0
	Number of simplex pivots we attempted to skip because of instability: 0.
	Unstable pivots performed anyway: 0
	--- Tableau Statistics ---
	Total number of pivots performed: 629
		Real pivots: 600. Degenerate: 29 (4.61%)
		Degenerate pivots by request (e.g., to fix a PL constraint): 0 (0.00%)
		Average time per pivot: 0.11 milli
	Total number of fake pivots performed: 9
	Total number of rows added: 0. Number of merged columns: 0
	Current tableau dimensions: M = 1061, N = 2519
	--- SMT Core Statistics ---
	Total depth is 0. Total visited states: 1. Number of splits: 0. Number of pops: 0
	Max stack depth: 0
	--- Bound Tightening Statistics ---
	Number of tightened bounds: 417.
		Number of rows examined by row tightener: 629. Consequent tightenings: 1
		Number of explicit basis matrices examined by row tightener: 6. Consequent tightenings: 733
		Number of bound tightening rounds on the entire constraint matrix: 0. Consequent tightenings: 0
		Number of bound notifications sent to PL constraints: 5776. Tightenings proposed: 0
	--- Basis Factorization statistics ---
	Number of basis refactorizations: 7
	--- Projected Steepest Edge Statistics ---
	Number of iterations: 638.
	Number of resets to reference space: 1. Avg. iterations per reset: 638
	--- SBT ---
	Number of tightened bounds: 1783
	--- SoI-based local search ---
	Number of proposed phase pattern update: 2. Number of accepted update: 3 [150.00%]
	Total time (% of local search time) updating SoI phase pattern : 308 milli [0.93%]
	Total time obtaining current assignment: 771 milli [2.34%]
	Total time getting SoI phase pattern : 109 milli [0.02%]
	--- Context dependent statistics ---
	Number of pushes / pops: 0 / 0
		[0.00%] Pre-Push hook: 0 milli
		[0.00%] Push : 0 milli
		[0.00%] Post-Pop hook: 0 milli
		[0.00%] Pop : 0 milli
		[0.00%] Total context-switching time: 0 milli
	--- Proof Certificate ---
	Number of certified leaves: 0
	Number of leaves to delegate: 0
sat
Input assignment:
	x0 = -0.300849
	x1 = -0.005784
	x2 = 0.500000
	x3 = 0.378531
	x4 = 0.399616

Output:
	y0 = 0.061783
	y1 = -0.002157
	y2 = -0.000951
	y3 = -0.000523
	y4 = 0.000679


real	0m0,933s
user	0m0,983s
sys	0m0,197s
