
[VERYDIFF_EXPERIMENT] Running on /home/i57/steuber/NeuroDiff/repos/VeryDiffExperiments/src/../benchmarks/mnist-prune/specs/mnist_80_local_15.vnnlib /home/i57/steuber/NeuroDiff/repos/VeryDiffExperiments/src/../benchmarks/mnist-prune/nets/mnist_relu_2_512.onnx
Loading /home/i57/steuber/NeuroDiff/repos/VeryDiffExperiments/src/../benchmarks/mnist-prune/nets/mnist_relu_2_512.onnx and /home/i57/steuber/NeuroDiff/repos/VeryDiffExperiments/src/../benchmarks/mnist-prune/nets_pruned/mnist_relu_2_512_pruned5.onnx
INPUT SHAPE: 784

[NEQUIV] 113.96308957722508

[-40.76883063 -58.06688182 -43.78978209 -51.12485312 -56.02493077
 -33.90422781 -71.84421825  11.81385081 -65.9001678  -23.32829836]
[-35.49918531 -55.82346959 -39.20626497 -47.29716491 -50.90986303
 -28.96350151 -67.80877429   8.31237116 -60.37240085 -18.15282386]
NETWORKS NOT EQUIVALENT
Refined: 0 | Refine Limit: -1 | Wrong: 0 | Right: 1 | Total: 1 | Total Zonos Considered: 1 | Expected 2 (50.0%)

time: 2.05993592

[VERYDIFF_TIMER] 2.083450097

[VERYDIFF_EXPERIMENT] Running on /home/i57/steuber/NeuroDiff/repos/VeryDiffExperiments/src/../benchmarks/mnist-prune/specs/mnist_80_local_15.vnnlib /home/i57/steuber/NeuroDiff/repos/VeryDiffExperiments/src/../benchmarks/mnist-prune/nets/mnist_relu_3_100.onnx
Loading /home/i57/steuber/NeuroDiff/repos/VeryDiffExperiments/src/../benchmarks/mnist-prune/nets/mnist_relu_3_100.onnx and /home/i57/steuber/NeuroDiff/repos/VeryDiffExperiments/src/../benchmarks/mnist-prune/nets_pruned/mnist_relu_3_100_pruned5.onnx
INPUT SHAPE: 784
Refined: 106 | Refine Limit: 22 | Wrong: 0 | Right: 154 | Total: 154 | Total Zonos Considered: 260 | Expected 9851 (1.5632930666937366%)Refined: 220 | Refine Limit: 26 | Wrong: 0 | Right: 359 | Total: 359 | Total Zonos Considered: 579 | Expected 22965 (1.563248421510995%)Refined: 346 | Refine Limit: 22 | Wrong: 0 | Right: 595 | Total: 595 | Total Zonos Considered: 941 | Expected 38063 (1.563197856185797%)Refined: 460 | Refine Limit: 18 | Wrong: 0 | Right: 816 | Total: 816 | Total Zonos Considered: 1276 | Expected 52199 (1.563248338090768%)Refined: 547 | Refine Limit: 11 | Wrong: 0 | Right: 975 | Total: 975 | Total Zonos Considered: 1522 | Expected 62353 (1.5636777701153113%)Refined: 667 | Refine Limit: 20 | Wrong: 0 | Right: 1192 | Total: 1192 | Total Zonos Considered: 1859 | Expected 76231 (1.5636683239102203%)Refined: 791 | Refine Limit: 26 | Wrong: 0 | Right: 1405 | Total: 1405 | Total Zonos Considered: 2196 | Expected 89853 (1.5636650974369246%)Refined: 897 | Refine Limit: 32 | Wrong: 0 | Right: 1589 | Total: 1589 | Total Zonos Considered: 2486 | Expected 101620 (1.5636685691792953%)Refined: 1009 | Refine Limit: 31 | Wrong: 0 | Right: 1798 | Total: 1798 | Total Zonos Considered: 2807 | Expected 114986 (1.5636686205277164%)Refined: 1140 | Refine Limit: 27 | Wrong: 0 | Right: 2041 | Total: 2041 | Total Zonos Considered: 3181 | Expected 130526 (1.563673137918882%)Refined: 1258 | Refine Limit: 26 | Wrong: 0 | Right: 2249 | Total: 2249 | Total Zonos Considered: 3507 | Expected 143828 (1.563673276413494%)Refined: 1387 | Refine Limit: 31 | Wrong: 0 | Right: 2472 | Total: 2472 | Total Zonos Considered: 3859 | Expected 158090 (1.5636662660509837%)Refined: 1502 | Refine Limit: 20 | Wrong: 0 | Right: 2694 | Total: 2694 | Total Zonos Considered: 4196 | Expected 172287 (1.5636699228612723%)Refined: 1620 | Refine Limit: 22 | Wrong: 0 | Right: 2897 | Total: 2897 | Total Zonos Considered: 4517 | Expected 185269 (1.5636722819252005%)Refined: 1713 | Refine Limit: 13 | Wrong: 0 | Right: 3070 | Total: 3070 | Total Zonos Considered: 4783 | Expected 195929 (1.5668941300164856%)Refined: 1818 | Refine Limit: 27 | Wrong: 0 | Right: 3242 | Total: 3242 | Total Zonos Considered: 5060 | Expected 206905 (1.566902684807037%)Refined: 1916 | Refine Limit: 22 | Wrong: 0 | Right: 3434 | Total: 3434 | Total Zonos Considered: 5350 | Expected 219120 (1.567177802117561%)Refined: 2012 | Refine Limit: 28 | Wrong: 0 | Right: 3604 | Total: 3604 | Total Zonos Considered: 5616 | Expected 229936 (1.5673926657852622%)Refined: 2114 | Refine Limit: 23 | Wrong: 0 | Right: 3784 | Total: 3784 | Total Zonos Considered: 5898 | Expected 241420 (1.5673929251926104%)Refined: 2221 | Refine Limit: 24 | Wrong: 0 | Right: 3961 | Total: 3961 | Total Zonos Considered: 6182 | Expected 252712 (1.5673968786602932%)Refined: 2300 | Refine Limit: 22 | Wrong: 0 | Right: 4096 | Total: 4096 | Total Zonos Considered: 6396 | Expected 260151 (1.5744702115309956%)Refined: 2378 | Refine Limit: 19 | Wrong: 0 | Right: 4251 | Total: 4251 | Total Zonos Considered: 6629 | Expected 268702 (1.5820500033494354%)Refined: 2502 | Refine Limit: 18 | Wrong: 0 | Right: 4472 | Total: 4472 | Total Zonos Considered: 6974 | Expected 280255 (1.5956896397923321%)Refined: 2612 | Refine Limit: 32 | Wrong: 0 | Right: 4663 | Total: 4663 | Total Zonos Considered: 7275 | Expected 292059 (1.5965952085023918%)Refined: 2725 | Refine Limit: 20 | Wrong: 0 | Right: 4893 | Total: 4893 | Total Zonos Considered: 7618 | Expected 306463 (1.5966038314576312%)UNKNOWN
TIMEOUT
Refined: 2779 | Refine Limit: 19 | Wrong: 0 | Right: 4988 | Total: 4988 | Total Zonos Considered: 7767 | Expected 312329 (1.5970338969484101%)

time: 120.308693343

[VERYDIFF_TIMER] 120.332623251

[VERYDIFF_EXPERIMENT] Running on /home/i57/steuber/NeuroDiff/repos/VeryDiffExperiments/src/../benchmarks/mnist-prune/specs/mnist_80_local_15.vnnlib /home/i57/steuber/NeuroDiff/repos/VeryDiffExperiments/src/../benchmarks/mnist-prune/nets/mnist_relu_4_1024.onnx
Loading /home/i57/steuber/NeuroDiff/repos/VeryDiffExperiments/src/../benchmarks/mnist-prune/nets/mnist_relu_4_1024.onnx and /home/i57/steuber/NeuroDiff/repos/VeryDiffExperiments/src/../benchmarks/mnist-prune/nets_pruned/mnist_relu_4_1024_pruned5.onnx
INPUT SHAPE: 784

[NEQUIV] 506.61328418216607

[ 0.          2.69532074  0.          0.          0.          3.65400277
  0.         25.29696334  0.         11.32103654]
[ 0.          2.89532863  0.          0.          0.          6.06593617
  0.         21.21605576  0.          9.64922341]
NETWORKS NOT EQUIVALENT
Refined: 0 | Refine Limit: -1 | Wrong: 0 | Right: 1 | Total: 1 | Total Zonos Considered: 1 | Expected 2 (50.0%)

time: 27.119868187

[VERYDIFF_TIMER] 27.150449605

[VERYDIFF_EXPERIMENT] NETWORK: /home/i57/steuber/NeuroDiff/repos/VeryDiffExperiments/src/../benchmarks/mnist-prune/specs/mnist_80_local_15.vnnlib
[VERYDIFF_EXPERIMENT] TIME: 150.415305879
