
[VERYDIFF_EXPERIMENT] Running on /home/i57/steuber/NeuroDiff/repos/VeryDiffExperiments/src/../benchmarks/mnist-prune/specs/mnist_43_local_15.vnnlib /home/i57/steuber/NeuroDiff/repos/VeryDiffExperiments/src/../benchmarks/mnist-prune/nets/mnist_relu_3_100.onnx
Parsing /home/i57/steuber/NeuroDiff/repos/VeryDiffExperiments/src/../benchmarks/mnist-prune/nets/mnist_relu_3_100.onnx...
Found input X
op: matmul, weight: (100, 784), bias: nothing
op: bias, weight: nothing, bias: (100,)
op: relu, weight: nothing, bias: nothing
op: matmul, weight: (100, 100), bias: nothing
op: bias, weight: nothing, bias: (100,)
op: relu, weight: nothing, bias: nothing
op: matmul, weight: (10, 100), bias: nothing
op: bias, weight: nothing, bias: (10,)
op: relu, weight: nothing, bias: nothing
op: matmul, weight: (10, 10), bias: nothing
op: bias, weight: nothing, bias: (10,)
Parsing /home/i57/steuber/NeuroDiff/repos/VeryDiffExperiments/src/../benchmarks/mnist-prune/nets_pruned/mnist_relu_3_100_0.49-old.onnx...
Found input X
op: gemm, weight: (100, 784), bias: (100,)
op: relu, weight: nothing, bias: nothing
op: gemm, weight: (100, 100), bias: (100,)
op: relu, weight: nothing, bias: nothing
op: gemm, weight: (10, 100), bias: (10,)
op: relu, weight: nothing, bias: nothing
op: gemm, weight: (10, 10), bias: (10,)
Distance: 1623.4465197373434
Distance: 201.62056963066925
Distance: 13.962962507051998
Distance: 0.183768135302671
Running with 1 threads
[Thread 1] Time to first task: 0.0s
Instable Generators: 34
Instable Generators: 41
Instable Generators: 6
Zono Bounds:
[-0.005075435053591341, -3.82575379649745, -3.7201033681651485, -3.7893421463693304, -4.037019258289921, -3.624888389761218, -4.250208927640678, -4.105160096760392, -3.3727601176418327, -0.0038362713555695756]
[0.003188179933852193, 3.3907745648486154, 4.060056138026779, 3.7944628810698324, 4.004659812548463, 4.658170105876557, 4.2360950677877, 3.4522975329283145, 3.056962056942516, 0.0016945241915880221]
[Thread 1] Processed 100 zonotopes (Work Done: 0.0%; Expected Zonos: Inf)
[Thread 1] Processed 200 zonotopes (Work Done: 28.51562%; Expected Zonos: 701.3698630136986)
[Thread 1] Processed 300 zonotopes (Work Done: 46.875%; Expected Zonos: 640.0)
[Thread 1] Total splits: 192
Processed 385 zonotopes (Work Done: 100.0%); Generated 384 (0.021140655433766233s/loop)
[Thread 1] Finished in 8.14s
 ────────────────────────────────────────────────────────────────────────────────
                                        Time                    Allocations      
                               ───────────────────────   ────────────────────────
       Tot / % measured:            8.14s / 100.0%           4.62GiB / 100.0%    

 Section               ncalls     time    %tot     avg     alloc    %tot      avg
 ────────────────────────────────────────────────────────────────────────────────
 Verify                     1    8.14s  100.0%   8.14s   4.62GiB  100.0%  4.62GiB
   Zonotope Loop            1    8.14s  100.0%   8.14s   4.62GiB  100.0%  4.62GiB
     Property Check       385    7.49s   92.0%  19.4ms   3.89GiB   84.2%  10.3MiB
     Zonotope Propa...    385    565ms    6.9%  1.47ms    414MiB    8.8%  1.07MiB
       DiffZonotope...  1.54k    396ms    4.9%   257μs   91.2MiB    1.9%  60.7KiB
         Zonotope_D...  3.08k    166ms    2.0%  53.8μs   46.1MiB    1.0%  15.3KiB
       DiffZonotope...  1.16k    165ms    2.0%   143μs    322MiB    6.8%   286KiB
         Zonotope_R...  2.31k   80.1ms    1.0%  34.7μs    200MiB    4.2%  88.6KiB
           Influenc...  2.31k   33.5ms    0.4%  14.5μs   46.7MiB    1.0%  20.7KiB
             Multiply   2.31k   25.8ms    0.3%  11.2μs   29.6MiB    0.6%  13.1KiB
             Alloca...  2.31k   4.47ms    0.1%  1.94μs   17.1MiB    0.4%  7.57KiB
             Set Ma...  2.31k   1.66ms    0.0%   718ns     0.00B    0.0%    0.00B
           Column M...  2.31k   25.0ms    0.3%  10.8μs   72.1MiB    1.5%  32.0KiB
           Set Matrix   2.31k   7.65ms    0.1%  3.31μs   1.75MiB    0.0%     796B
           Vectors      2.31k   6.52ms    0.1%  2.82μs   7.34MiB    0.2%  3.26KiB
           Allocation   2.31k   4.68ms    0.1%  2.03μs   71.9MiB    1.5%  31.9KiB
           Bounds       2.31k    654μs    0.0%   283ns     0.00B    0.0%    0.00B
     Compute Split        192   19.4ms    0.2%   101μs   27.6MiB    0.6%   147KiB
 Initialize                 1    328μs    0.0%   328μs    821KiB    0.0%   821KiB
 ────────────────────────────────────────────────────────────────────────────────
[VERYDIFF_TIMER] 8.168610113

[VERYDIFF_EXPERIMENT] NETWORK: /home/i57/steuber/NeuroDiff/repos/VeryDiffExperiments/src/../benchmarks/mnist-prune/specs/mnist_43_local_15.vnnlib
[VERYDIFF_EXPERIMENT] TIME: 8.474741321
