
[VERYDIFF_EXPERIMENT] Running on /home/i57/steuber/NeuroDiff/repos/VeryDiffExperiments/src/../benchmarks/mnist-prune/specs/mnist_32_local_15.vnnlib /home/i57/steuber/NeuroDiff/repos/VeryDiffExperiments/src/../benchmarks/mnist-prune/nets/mnist_relu_3_100.onnx
Found input X
op: matmul, weight: (100, 784), bias: nothing
op: bias, weight: nothing, bias: (100,)
op: relu, weight: nothing, bias: nothing
op: matmul, weight: (100, 100), bias: nothing
op: bias, weight: nothing, bias: (100,)
op: relu, weight: nothing, bias: nothing
op: matmul, weight: (10, 100), bias: nothing
op: bias, weight: nothing, bias: (10,)
op: relu, weight: nothing, bias: nothing
op: matmul, weight: (10, 10), bias: nothing
op: bias, weight: nothing, bias: (10,)
Found input X
op: gemm, weight: (100, 784), bias: (100,)
op: relu, weight: nothing, bias: nothing
op: gemm, weight: (100, 100), bias: (100,)
op: relu, weight: nothing, bias: nothing
op: gemm, weight: (10, 100), bias: (10,)
op: relu, weight: nothing, bias: nothing
op: gemm, weight: (10, 10), bias: (10,)
Distance: 1623.4465197373434
Distance: 201.62056963066925
Distance: 13.962962507051998
Distance: 0.183768135302671
Running with 1 threads
[Thread 1] Time to first task: 0.0s
Instable Generators: 20
Instable Generators: 26
Instable Generators: 5
Zono Bounds:
[-0.0028762693941426273, -1.7675623806282492, -2.2274031125717597, -1.937343753437614, -2.4611613633781864, -2.6421336066347942, -0.001224454059005434, 0.0015578728624556551, -2.0046404416676746, -2.3156270163802644]
[-0.00022229282420398178, 1.62912511321464, 2.216556262141319, 2.339432887772648, 2.3740782197222354, 2.533798576810593, -0.00034377816032465935, 0.0044196448432772435, 1.5843379558834663, 2.055898265339028]
[Thread 1] Processed 100 zonotopes (Work Done: 0.0%; Expected Zonos: Inf)
[Thread 1] Processed 200 zonotopes (Work Done: 0.0%; Expected Zonos: Inf)
[Thread 1] Processed 300 zonotopes (Work Done: 0.0%; Expected Zonos: Inf)
[Thread 1] Processed 400 zonotopes (Work Done: 0.58594%; Expected Zonos: 68266.66666666667)
[Thread 1] Processed 500 zonotopes (Work Done: 2.58789%; Expected Zonos: 19320.754716981133)
[Thread 1] Processed 600 zonotopes (Work Done: 3.51562%; Expected Zonos: 17066.666666666668)
[Thread 1] Processed 700 zonotopes (Work Done: 4.54102%; Expected Zonos: 15415.053763440861)
[Thread 1] Processed 800 zonotopes (Work Done: 6.10352%; Expected Zonos: 13107.2)
[Thread 1] Processed 900 zonotopes (Work Done: 9.42383%; Expected Zonos: 9550.259067357512)
[Thread 1] Processed 1000 zonotopes (Work Done: 14.16016%; Expected Zonos: 7062.068965517241)
[Thread 1] Processed 1100 zonotopes (Work Done: 20.41016%; Expected Zonos: 5389.473684210527)
[Thread 1] Processed 1200 zonotopes (Work Done: 26.51367%; Expected Zonos: 4525.96685082873)
[Thread 1] Processed 1300 zonotopes (Work Done: 33.93555%; Expected Zonos: 3830.7913669064747)
[Thread 1] Processed 1400 zonotopes (Work Done: 41.65039%; Expected Zonos: 3361.3130128956623)
[Thread 1] Processed 1500 zonotopes (Work Done: 49.58496%; Expected Zonos: 3025.1107828655836)
[Thread 1] Processed 1600 zonotopes (Work Done: 56.03027%; Expected Zonos: 2855.599128540305)
[Thread 1] Processed 1700 zonotopes (Work Done: 65.25879%; Expected Zonos: 2605.0130939019828)
[Thread 1] Processed 1800 zonotopes (Work Done: 73.36426%; Expected Zonos: 2453.5108153078204)
[Thread 1] Processed 1900 zonotopes (Work Done: 79.66309%; Expected Zonos: 2385.0444376340793)
[Thread 1] Processed 2000 zonotopes (Work Done: 87.47559%; Expected Zonos: 2286.3522188110524)
[Thread 1] Processed 2100 zonotopes (Work Done: 95.09277%; Expected Zonos: 2208.369704749679)
[Thread 1] Total splits: 1085
Processed 2171 zonotopes (Work Done: 100.0%); Generated 2170 (0.001503587070935053s/loop)
[Thread 1] Finished in 3.26s
 ────────────────────────────────────────────────────────────────────────────────
                                        Time                    Allocations      
                               ───────────────────────   ────────────────────────
       Tot / % measured:            3.26s / 100.0%           3.37GiB / 100.0%    

 Section               ncalls     time    %tot     avg     alloc    %tot      avg
 ────────────────────────────────────────────────────────────────────────────────
 Verify                     1    3.26s  100.0%   3.26s   3.37GiB  100.0%  3.37GiB
   Zonotope Loop            1    3.26s  100.0%   3.26s   3.37GiB  100.0%  3.37GiB
     Zonotope Propa...  2.17k    2.77s   84.8%  1.27ms   1.50GiB   44.5%   725KiB
       DiffZonotope...  8.68k    1.67s   51.1%   192μs    355MiB   10.3%  41.8KiB
         Zonotope_D...  17.4k    777ms   23.8%  44.7μs    197MiB    5.7%  11.6KiB
       DiffZonotope...  6.51k    1.09s   33.4%   167μs   1.15GiB   34.2%   186KiB
         Zonotope_R...  13.0k    798ms   24.4%  61.3μs    724MiB   21.0%  56.9KiB
           Allocation   13.0k    331ms   10.1%  25.4μs    260MiB    7.5%  20.5KiB
           Column M...  13.0k   82.4ms    2.5%  6.33μs    262MiB    7.6%  20.6KiB
           Influenc...  13.0k   75.7ms    2.3%  5.81μs    153MiB    4.4%  12.0KiB
             Multiply   13.0k   49.4ms    1.5%  3.79μs   91.1MiB    2.6%  7.16KiB
             Alloca...  13.0k   14.0ms    0.4%  1.07μs   61.5MiB    1.8%  4.83KiB
             Set Ma...  13.0k   6.32ms    0.2%   485ns     0.00B    0.0%    0.00B
           Vectors      13.0k   27.8ms    0.9%  2.13μs   41.4MiB    1.2%  3.26KiB
           Set Matrix   13.0k   27.0ms    0.8%  2.07μs   6.96MiB    0.2%     560B
           Bounds       13.0k   2.51ms    0.1%   193ns     0.00B    0.0%    0.00B
     Property Check     2.17k    129ms    3.9%  59.3μs   69.2MiB    2.0%  32.7KiB
     Compute Split      1.08k   45.1ms    1.4%  41.6μs    138MiB    4.0%   130KiB
 Initialize                 1    347μs    0.0%   347μs    821KiB    0.0%   821KiB
 ────────────────────────────────────────────────────────────────────────────────
[VERYDIFF_TIMER] 3.296657391

[VERYDIFF_EXPERIMENT] NETWORK: /home/i57/steuber/NeuroDiff/repos/VeryDiffExperiments/src/../benchmarks/mnist-prune/specs/mnist_32_local_15.vnnlib
[VERYDIFF_EXPERIMENT] TIME: 3.599449064
