
[VERYDIFF_EXPERIMENT] Running on /home/i57/steuber/NeuroDiff/repos/VeryDiffExperiments/src/../benchmarks/mnist-prune/specs/mnist_10_local_15.vnnlib /home/i57/steuber/NeuroDiff/repos/VeryDiffExperiments/src/../benchmarks/mnist-prune/nets/mnist_relu_4_1024.onnx
Found input X
op: matmul, weight: (1024, 784), bias: nothing
op: bias, weight: nothing, bias: (1024,)
op: relu, weight: nothing, bias: nothing
op: matmul, weight: (1024, 1024), bias: nothing
op: bias, weight: nothing, bias: (1024,)
op: relu, weight: nothing, bias: nothing
op: matmul, weight: (1024, 1024), bias: nothing
op: bias, weight: nothing, bias: (1024,)
op: relu, weight: nothing, bias: nothing
op: matmul, weight: (10, 1024), bias: nothing
op: bias, weight: nothing, bias: (10,)
op: relu, weight: nothing, bias: nothing
op: matmul, weight: (10, 10), bias: nothing
op: bias, weight: nothing, bias: (10,)
Found input X
op: gemm, weight: (1024, 784), bias: (1024,)
op: relu, weight: nothing, bias: nothing
op: gemm, weight: (1024, 1024), bias: (1024,)
op: relu, weight: nothing, bias: nothing
op: gemm, weight: (1024, 1024), bias: (1024,)
op: relu, weight: nothing, bias: nothing
op: gemm, weight: (10, 1024), bias: (10,)
op: relu, weight: nothing, bias: nothing
op: gemm, weight: (10, 10), bias: (10,)
Distance: 915.6394868631054
Distance: 1298.7052820973968
Distance: 1296.587532894263
Distance: 6.054483317080667
Distance: 0.04942679278974538
Running with 1 threads
[Thread 1] Time to first task: 0.0s
Instable Generators: 310
Instable Generators: 549
Instable Generators: 985
Instable Generators: 10
Zono Bounds:
[-63.186179661975714, -66.2988849256723, -72.81503298370515, -72.97918441305764, -69.50616971477606, -73.43273939136934, -65.76376016159743, -68.23681938357107, -70.26831167671827, -73.54028650770165]
[63.1418546963494, 65.75274537953655, 72.76542667470201, 72.0091606822517, 69.49554681543296, 73.00409024859361, 65.79553664038455, 67.97404194693685, 69.51948361795758, 73.50464979004646]
[Thread 1] Processed 100 zonotopes (Work Done: 0.0%; Expected Zonos: Inf)
[Thread 1] Processed 200 zonotopes (Work Done: 0.0%; Expected Zonos: Inf)


TIMEOUT REACHED
UNKNOWN
[Thread 1] Total splits: 224
Processed 224 zonotopes (Work Done: 0.0%); Generated 448 (0.5374874587410714s/loop)
[Thread 1] Finished in 120.4s
 ────────────────────────────────────────────────────────────────────────────────
                                        Time                    Allocations      
                               ───────────────────────   ────────────────────────
       Tot / % measured:             120s / 100.0%           38.6GiB / 100.0%    

 Section               ncalls     time    %tot     avg     alloc    %tot      avg
 ────────────────────────────────────────────────────────────────────────────────
 Verify                     1     120s  100.0%    120s   38.5GiB   99.9%  38.5GiB
   Zonotope Loop            1     120s  100.0%    120s   38.5GiB   99.9%  38.5GiB
     Zonotope Propa...    224     116s   96.7%   520ms   38.1GiB   98.8%   174MiB
       DiffZonotope...  1.12k    63.6s   52.8%  56.8ms   7.99GiB   20.7%  7.30MiB
         Zonotope_D...  2.24k    22.0s   18.3%  9.83ms   3.27GiB    8.5%  1.50MiB
       DiffZonotope...    896    52.8s   43.9%  59.0ms   30.1GiB   78.1%  34.4MiB
         Zonotope_R...  1.79k    35.9s   29.8%  20.0ms   18.2GiB   47.2%  10.4MiB
           Allocation   1.79k    16.6s   13.8%  9.28ms   7.88GiB   20.4%  4.50MiB
           Column M...  1.79k    15.0s   12.5%  8.39ms   7.88GiB   20.4%  4.50MiB
           Influenc...  1.79k    2.89s    2.4%  1.61ms   2.37GiB    6.1%  1.35MiB
             Multiply   1.79k    2.84s    2.4%  1.58ms   2.18GiB    5.7%  1.25MiB
             Alloca...  1.79k   35.1ms    0.0%  19.6μs    189MiB    0.5%   108KiB
             Set Ma...  1.79k   13.8ms    0.0%  7.68μs     0.00B    0.0%    0.00B
           Set Matrix   1.79k    1.06s    0.9%   591μs   16.2MiB    0.0%  9.26KiB
           Vectors      1.79k    295ms    0.2%   165μs   59.5MiB    0.2%  34.0KiB
           Bounds       1.79k   1.23ms    0.0%   686ns     0.00B    0.0%    0.00B
     Property Check       224    2.37s    2.0%  10.6ms    115MiB    0.3%   525KiB
     Compute Split        224    584ms    0.5%  2.61ms    143MiB    0.4%   655KiB
 Initialize                 1   14.3ms    0.0%  14.3ms   22.3MiB    0.1%  22.3MiB
 ────────────────────────────────────────────────────────────────────────────────
[VERYDIFF_TIMER] 120.491336044

[VERYDIFF_EXPERIMENT] NETWORK: /home/i57/steuber/NeuroDiff/repos/VeryDiffExperiments/src/../benchmarks/mnist-prune/specs/mnist_10_local_15.vnnlib
[VERYDIFF_EXPERIMENT] TIME: 120.799708725
