
[VERYDIFF_EXPERIMENT] Running on /home/i57/steuber/NeuroDiff/repos/VeryDiffExperiments/src/../benchmarks/mnist-prune/specs/mnist_33_global_6.vnnlib /home/i57/steuber/NeuroDiff/repos/VeryDiffExperiments/src/../benchmarks/mnist-prune/nets/mnist_relu_3_100.onnx
Loading /home/i57/steuber/NeuroDiff/repos/VeryDiffExperiments/src/../benchmarks/mnist-prune/nets/mnist_relu_3_100.onnx and /home/i57/steuber/NeuroDiff/repos/VeryDiffExperiments/src/../benchmarks/mnist-prune/nets_pruned/mnist_relu_3_100_0.49-old.onnx
INPUT SHAPE: 784
UNKNOWN
TIMEOUT
Refined: 36 | Refine Limit: 24 | Wrong: 0 | Right: 21 | Total: 21 | Total Zonos Considered: 57 | Expected 43622484949630 (4.814031118183266e-11%)

time: 120.676146316

[VERYDIFF_TIMER] 120.701504119

[VERYDIFF_EXPERIMENT] NETWORK: /home/i57/steuber/NeuroDiff/repos/VeryDiffExperiments/src/../benchmarks/mnist-prune/specs/mnist_33_global_6.vnnlib
[VERYDIFF_EXPERIMENT] TIME: 121.004806788
