Parsing new_benchmarks/rice-1-retrained/nets/2_40.onnx...
Found input onnx::Gemm_0
op: gemm, weight: (40, 7), bias: (40,)
op: relu, weight: nothing, bias: nothing
op: gemm, weight: (40, 40), bias: (40,)
op: relu, weight: nothing, bias: nothing
op: gemm, weight: (2, 40), bias: (2,)
Parsing new_benchmarks/rice-1-retrained/nets_pruned/2_40-0.7.onnx...
Found input onnx::Gemm_0
op: gemm, weight: (40, 7), bias: (40,)
op: relu, weight: nothing, bias: nothing
op: gemm, weight: (40, 40), bias: (40,)
op: relu, weight: nothing, bias: nothing
op: gemm, weight: (2, 40), bias: (2,)
Distance: 45.2166960365721
Distance: 153.91667636848
Distance: 8.146173525765285
Running with 1 threads
[Thread 1] Time to first task: 0.0s
Zono Bounds:
[0.0, 0.0, 0.0, 0.0, 0.0, 0.0, 0.0]
[0.0, 0.0, 0.0, 0.0, 0.0, 0.0, 0.0]
[TOP-1] required confidence (1.0≥0.5) is feasible for index 1
Found cex
N1 Probability: 0.8658504470122056 >= 0.5

Found counterexample: ([1.9999999999999996, 0.0, 0.19999999999999996, -2.6, 0.8874999999999997, -1.3375000000000001, 0.22499999999999987], (2, 1))
[Thread 1] Total splits: 13
Processed 14 zonotopes (Work Done: 0.0%); Generated 26 (0.0021028584285714283s/loop)
[Thread 1] Finished in 0.03s
 ────────────────────────────────────────────────────────────────────────────────
                                        Time                    Allocations      
                               ───────────────────────   ────────────────────────
       Tot / % measured:           29.5ms / 100.0%           9.07MiB / 100.0%    

 Section               ncalls     time    %tot     avg     alloc    %tot      avg
 ────────────────────────────────────────────────────────────────────────────────
 Verify                     1   29.5ms   99.9%  29.5ms   9.05MiB   99.8%  9.05MiB
   Zonotope Loop            1   29.4ms   99.8%  29.4ms   9.05MiB   99.7%  9.05MiB
     Property Check        14   27.8ms   94.4%  1.99ms   5.97MiB   65.8%   436KiB
     Zonotope Propa...     14   1.30ms    4.4%  92.9μs   2.87MiB   31.6%   210KiB
       DiffZonotope...     28    920μs    3.1%  32.8μs   2.44MiB   26.8%  89.1KiB
         Zonotope_R...     56    836μs    2.8%  14.9μs   2.33MiB   25.6%  42.5KiB
           Influenc...     56    298μs    1.0%  5.32μs    589KiB    6.3%  10.5KiB
             Multiply      56    223μs    0.8%  3.98μs    440KiB    4.7%  7.85KiB
             Alloca...     56   29.7μs    0.1%   530ns    147KiB    1.6%  2.63KiB
             Set Ma...     56   15.4μs    0.1%   275ns     0.00B    0.0%    0.00B
           Column M...     56    181μs    0.6%  3.23μs    815KiB    8.8%  14.5KiB
           Set Matrix      56    146μs    0.5%  2.61μs   49.9KiB    0.5%     912B
           Vectors         56   92.1μs    0.3%  1.64μs    115KiB    1.2%  2.05KiB
           Allocation      56   63.8μs    0.2%  1.14μs    807KiB    8.7%  14.4KiB
           Bounds          56   9.34μs    0.0%   167ns     0.00B    0.0%    0.00B
       DiffZonotope...     42    310μs    1.1%  7.38μs    439KiB    4.7%  10.5KiB
         Zonotope_D...     84    296μs    1.0%  3.53μs    436KiB    4.7%  5.19KiB
     Compute Split         13    192μs    0.7%  14.8μs    166KiB    1.8%  12.8KiB
 Initialize                 1   43.9μs    0.1%  43.9μs   20.8KiB    0.2%  20.8KiB
 ────────────────────────────────────────────────────────────────────────────────[VERYDIFF_TIMER] 0.033376477
