
[VERYDIFF_EXPERIMENT] Running on /home/i57/steuber/NeuroDiff/repos/VeryDiffExperiments/src/../benchmarks/mnist-prune/specs/mnist_3_local_15.vnnlib /home/i57/steuber/NeuroDiff/repos/VeryDiffExperiments/src/../benchmarks/mnist-prune/nets/mnist_relu_4_1024.onnx
Loading /home/i57/steuber/NeuroDiff/repos/VeryDiffExperiments/src/../benchmarks/mnist-prune/nets/mnist_relu_4_1024.onnx and /home/i57/steuber/NeuroDiff/repos/VeryDiffExperiments/src/../benchmarks/mnist-prune/nets_pruned/mnist_relu_4_1024_0.79-old.onnx
INPUT SHAPE: 784
Refined: 22 | Refine Limit: 18 | Wrong: 0 | Right: 11 | Total: 11 | Total Zonos Considered: 33 | Expected 907085754 (1.2126747610678493e-06%)Refined: 34 | Refine Limit: 25 | Wrong: 0 | Right: 25 | Total: 25 | Total Zonos Considered: 59 | Expected 2006176270 (1.2461517152727561e-06%)UNKNOWN
TIMEOUT
Refined: 43 | Refine Limit: 32 | Wrong: 0 | Right: 34 | Total: 34 | Total Zonos Considered: 77 | Expected 2728399723 (1.2461517171910372e-06%)

time: 123.440359365

[VERYDIFF_TIMER] 123.466492668

[VERYDIFF_EXPERIMENT] NETWORK: /home/i57/steuber/NeuroDiff/repos/VeryDiffExperiments/src/../benchmarks/mnist-prune/specs/mnist_3_local_15.vnnlib
[VERYDIFF_EXPERIMENT] TIME: 123.693738792
