Network: ./acas-prune/nets/product_ACASXU_run2a_5_5_batch_2000_ACASXU_run2a_5_5_batch_2000_pruned10_eps.onnx
Property: ./acas-prune/specs/product_prop_2_eps_0.05.vnnlib

Engine::processInputQuery: Input query (before preprocessing): 615 equations, 1220 variables
Engine::processInputQuery: Input query (after preprocessing): 1151 equations, 1678 variables

Input bounds:
	x0: [  0.6000,   0.6799] 
	x1: [ -0.5000,   0.5000] 
	x2: [ -0.5000,   0.5000] 
	x3: [  0.4500,   0.5000] 
	x4: [ -0.5000,  -0.4500] 

Branching heuristics set to LargestInterval

Engine::solve: Initial statistics

05:23:17 Statistics update:
	--- Time Statistics ---
	Total time elapsed: 230 milli (00:00:00)
		Main loop: 0 milli (00:00:00)
		Preprocessing time: 167 milli (00:00:00)
		Unknown: 62 milli (00:00:00)
	Breakdown for main loop:
		[0.00%] Simplex steps: 0 milli
		[0.00%] Explicit-basis bound tightening: 0 milli
		[0.00%] Constraint-matrix bound tightening: 0 milli
		[0.00%] Degradation checking: 0 milli
		[0.00%] Precision restoration: 0 milli
		[0.00%] Statistics handling: 0 milli
		[0.00%] Constraint-fixing steps: 0 milli
		[0.00%] Valid case splits: 0 milli. Average per split: 0.00 milli
		[0.00%] Applying stored bound-tightening: 0 milli
		[0.00%] SMT core: 0 milli
		[0.00%] Symbolic Bound Tightening: 18 milli
		[0.00%] SoI-based local search: 0 milli
		[0.00%] SoI-based local search: 0 milli
		[0.00%] Unaccounted for: 0 milli
	--- Preprocessor Statistics ---
	Number of preprocessor bound-tightening loop iterations: 8
	Number of eliminated variables: 142
	Number of constraints removed due to variable elimination: 78
	Number of equations removed due to variable elimination: 0
	--- Engine Statistics ---
	Number of main loop iterations: 1
		0 iterations were simplex steps. Total time: 0 milli. Average: 0.00 milli.
		0 iterations were constraint-fixing steps. Total time: 0 milli. Average: 0.00 milli
	Number of active piecewise-linear constraints: 505 / 523
		Constraints disabled by valid splits: 18. By SMT-originated splits: 0
	Last reported degradation: 0.0000000000. Max degradation so far: 0.0000000000. Restorations so far: 0
	Number of simplex pivots we attempted to skip because of instability: 0.
	Unstable pivots performed anyway: 0
	--- Tableau Statistics ---
	Total number of pivots performed: 0
		Real pivots: 0. Degenerate: 0 (0.00%)
		Degenerate pivots by request (e.g., to fix a PL constraint): 0 (0.00%)
		Average time per pivot: 0.00 milli
	Total number of fake pivots performed: 0
	Total number of rows added: 0. Number of merged columns: 0
	Current tableau dimensions: M = 1151, N = 2829
	--- SMT Core Statistics ---
	Total depth is 0. Total visited states: 1. Number of splits: 0. Number of pops: 0
	Max stack depth: 0
	--- Bound Tightening Statistics ---
	Number of tightened bounds: 0.
		Number of rows examined by row tightener: 0. Consequent tightenings: 0
		Number of explicit basis matrices examined by row tightener: 0. Consequent tightenings: 0
		Number of bound tightening rounds on the entire constraint matrix: 0. Consequent tightenings: 0
		Number of bound notifications sent to PL constraints: 3142. Tightenings proposed: 0
	--- Basis Factorization statistics ---
	Number of basis refactorizations: 2
	--- Projected Steepest Edge Statistics ---
	Number of iterations: 0.
	Number of resets to reference space: 1. Avg. iterations per reset: 0
	--- SBT ---
	Number of tightened bounds: 1436
	--- SoI-based local search ---
	Number of proposed phase pattern update: 0. Number of accepted update: 0 [0.00%]
	Total time (% of local search time) updating SoI phase pattern : 0 milli [0.00%]
	Total time obtaining current assignment: 0 milli [0.00%]
	Total time getting SoI phase pattern : 0 milli [0.00%]
	--- Context dependent statistics ---
	Number of pushes / pops: 0 / 0
		[0.00%] Pre-Push hook: 0 milli
		[0.00%] Push : 0 milli
		[0.00%] Post-Pop hook: 0 milli
		[0.00%] Pop : 0 milli
		[0.00%] Total context-switching time: 0 milli
	--- Proof Certificate ---
	Number of certified leaves: 0
	Number of leaves to delegate: 0

---

05:23:31 Statistics update:
	--- Time Statistics ---
	Total time elapsed: 15003 milli (00:00:15)
		Main loop: 14769 milli (00:00:14)
		Preprocessing time: 167 milli (00:00:00)
		Unknown: 65 milli (00:00:00)
	Breakdown for main loop:
		[34.80%] Simplex steps: 5140 milli
		[39.66%] Explicit-basis bound tightening: 5857 milli
		[0.00%] Constraint-matrix bound tightening: 0 milli
		[0.30%] Degradation checking: 44 milli
		[0.00%] Precision restoration: 0 milli
		[0.22%] Statistics handling: 32 milli
		[0.00%] Constraint-fixing steps: 0 milli
		[0.09%] Valid case splits: 12 milli. Average per split: 0.00 milli
		[0.02%] Applying stored bound-tightening: 3 milli
		[4.28%] SMT core: 632 milli
		[13.60%] Symbolic Bound Tightening: 2008 milli
		[15.98%] SoI-based local search: 2360 milli
		[0.00%] SoI-based local search: 0 milli
		[7.02%] Unaccounted for: 1037 milli
	--- Preprocessor Statistics ---
	Number of preprocessor bound-tightening loop iterations: 8
	Number of eliminated variables: 142
	Number of constraints removed due to variable elimination: 78
	Number of equations removed due to variable elimination: 0
	--- Engine Statistics ---
	Number of main loop iterations: 10000
		9783 iterations were simplex steps. Total time: 5140 milli. Average: 0.53 milli.
		0 iterations were constraint-fixing steps. Total time: 0 milli. Average: 0.00 milli
	Number of active piecewise-linear constraints: 60 / 523
		Constraints disabled by valid splits: 462. By SMT-originated splits: 1
	Last reported degradation: 0.0000000000. Max degradation so far: 0.0000000677. Restorations so far: 0
	Number of simplex pivots we attempted to skip because of instability: 21.
	Unstable pivots performed anyway: 1
	--- Tableau Statistics ---
	Total number of pivots performed: 8733
		Real pivots: 8710. Degenerate: 23 (0.26%)
		Degenerate pivots by request (e.g., to fix a PL constraint): 0 (0.00%)
		Average time per pivot: 0.17 milli
	Total number of fake pivots performed: 573
	Total number of rows added: 0. Number of merged columns: 0
	Current tableau dimensions: M = 1151, N = 2829
	--- SMT Core Statistics ---
	Total depth is 11. Total visited states: 162. Number of splits: 75. Number of pops: 86
	Max stack depth: 13
	--- Bound Tightening Statistics ---
	Number of tightened bounds: 147904.
		Number of rows examined by row tightener: 8733. Consequent tightenings: 74
		Number of explicit basis matrices examined by row tightener: 54. Consequent tightenings: 6012
		Number of bound tightening rounds on the entire constraint matrix: 0. Consequent tightenings: 0
		Number of bound notifications sent to PL constraints: 226622. Tightenings proposed: 0
	--- Basis Factorization statistics ---
	Number of basis refactorizations: 81
	--- Projected Steepest Edge Statistics ---
	Number of iterations: 9326.
	Number of resets to reference space: 135. Avg. iterations per reset: 69
	--- SBT ---
	Number of tightened bounds: 76852
	--- SoI-based local search ---
	Number of proposed phase pattern update: 150. Number of accepted update: 162 [108.00%]
	Total time (% of local search time) updating SoI phase pattern : 24194 milli [1.02%]
	Total time obtaining current assignment: 76619 milli [3.25%]
	Total time getting SoI phase pattern : 7245 milli [0.05%]
	--- Context dependent statistics ---
	Number of pushes / pops: 207 / 196
		[0.07%] Pre-Push hook: 10 milli
		[0.00%] Push : 0 milli
		[0.09%] Post-Pop hook: 13 milli
		[0.04%] Pop : 6 milli
		[0.20%] Total context-switching time: 30 milli
	--- Proof Certificate ---
	Number of certified leaves: 0
	Number of leaves to delegate: 0

Engine::solve: sat assignment found

05:23:46 Statistics update:
	--- Time Statistics ---
	Total time elapsed: 29169 milli (00:00:29)
		Main loop: 28934 milli (00:00:28)
		Preprocessing time: 167 milli (00:00:00)
		Unknown: 67 milli (00:00:00)
	Breakdown for main loop:
		[35.74%] Simplex steps: 10342 milli
		[37.67%] Explicit-basis bound tightening: 10899 milli
		[0.00%] Constraint-matrix bound tightening: 0 milli
		[0.32%] Degradation checking: 91 milli
		[0.00%] Precision restoration: 0 milli
		[0.22%] Statistics handling: 65 milli
		[0.00%] Constraint-fixing steps: 0 milli
		[0.09%] Valid case splits: 25 milli. Average per split: 0.00 milli
		[0.03%] Applying stored bound-tightening: 7 milli
		[4.40%] SMT core: 1271 milli
		[13.62%] Symbolic Bound Tightening: 3942 milli
		[17.07%] SoI-based local search: 4939 milli
		[0.00%] SoI-based local search: 0 milli
		[7.91%] Unaccounted for: 2289 milli
	--- Preprocessor Statistics ---
	Number of preprocessor bound-tightening loop iterations: 8
	Number of eliminated variables: 142
	Number of constraints removed due to variable elimination: 78
	Number of equations removed due to variable elimination: 0
	--- Engine Statistics ---
	Number of main loop iterations: 19937
		19450 iterations were simplex steps. Total time: 10342 milli. Average: 0.53 milli.
		0 iterations were constraint-fixing steps. Total time: 0 milli. Average: 0.00 milli
	Number of active piecewise-linear constraints: 218 / 523
		Constraints disabled by valid splits: 304. By SMT-originated splits: 1
	Last reported degradation: 0.0000000000. Max degradation so far: 0.0000002640. Restorations so far: 0
	Number of simplex pivots we attempted to skip because of instability: 24.
	Unstable pivots performed anyway: 1
	--- Tableau Statistics ---
	Total number of pivots performed: 17057
		Real pivots: 17024. Degenerate: 33 (0.19%)
		Degenerate pivots by request (e.g., to fix a PL constraint): 0 (0.00%)
		Average time per pivot: 0.16 milli
	Total number of fake pivots performed: 1286
	Total number of rows added: 0. Number of merged columns: 0
	Current tableau dimensions: M = 1151, N = 2829
	--- SMT Core Statistics ---
	Total depth is 10. Total visited states: 352. Number of splits: 155. Number of pops: 196
	Max stack depth: 14
	--- Bound Tightening Statistics ---
	Number of tightened bounds: 320252.
		Number of rows examined by row tightener: 17057. Consequent tightenings: 231
		Number of explicit basis matrices examined by row tightener: 99. Consequent tightenings: 10733
		Number of bound tightening rounds on the entire constraint matrix: 0. Consequent tightenings: 0
		Number of bound notifications sent to PL constraints: 431561. Tightenings proposed: 0
	--- Basis Factorization statistics ---
	Number of basis refactorizations: 155
	--- Projected Steepest Edge Statistics ---
	Number of iterations: 18366.
	Number of resets to reference space: 264. Avg. iterations per reset: 69
	--- SBT ---
	Number of tightened bounds: 148371
	--- SoI-based local search ---
	Number of proposed phase pattern update: 388. Number of accepted update: 377 [97.16%]
	Total time (% of local search time) updating SoI phase pattern : 52629 milli [1.07%]
	Total time obtaining current assignment: 199961 milli [4.05%]
	Total time getting SoI phase pattern : 20331 milli [0.07%]
	--- Context dependent statistics ---
	Number of pushes / pops: 416 / 406
		[0.07%] Pre-Push hook: 21 milli
		[0.00%] Push : 0 milli
		[0.10%] Post-Pop hook: 28 milli
		[0.05%] Pop : 15 milli
		[0.22%] Total context-switching time: 64 milli
	--- Proof Certificate ---
	Number of certified leaves: 0
	Number of leaves to delegate: 0
sat
Input assignment:
	x0 = 0.639929
	x1 = -0.010610
	x2 = -0.464190
	x3 = 0.450000
	x4 = -0.480154

Output:
	y0 = 0.057349
	y1 = 0.002029
	y2 = 0.001792
	y3 = 0.001281
	y4 = 0.002868


real	0m29,224s
user	0m29,269s
sys	0m0,196s
