
[VERYDIFF_EXPERIMENT] Running on /home/i57/steuber/NeuroDiff/repos/VeryDiffExperiments/src/../benchmarks/mnist-prune/specs/mnist_49_global_3.vnnlib /home/i57/steuber/NeuroDiff/repos/VeryDiffExperiments/src/../benchmarks/mnist-prune/nets/mnist_relu_3_100.onnx
Loading /home/i57/steuber/NeuroDiff/repos/VeryDiffExperiments/src/../benchmarks/mnist-prune/nets/mnist_relu_3_100.onnx and /home/i57/steuber/NeuroDiff/repos/VeryDiffExperiments/src/../benchmarks/mnist-prune/nets_pruned/mnist_relu_3_100_0.79_adam_1_stepsize-old.onnx
INPUT SHAPE: 784
UNKNOWN
TIMEOUT
Refined: 35 | Refine Limit: 19 | Wrong: 0 | Right: 33 | Total: 33 | Total Zonos Considered: 68 | Expected 1051 (3.139866793529972%)

time: 120.857932128

[VERYDIFF_TIMER] 120.884001264

[VERYDIFF_EXPERIMENT] NETWORK: /home/i57/steuber/NeuroDiff/repos/VeryDiffExperiments/src/../benchmarks/mnist-prune/specs/mnist_49_global_3.vnnlib
[VERYDIFF_EXPERIMENT] TIME: 121.172873468
