
[VERYDIFF_EXPERIMENT] Running on /home/i57/steuber/NeuroDiff/repos/VeryDiffExperiments/src/../benchmarks/mnist-prune/specs/mnist_43_local_18.vnnlib /home/i57/steuber/NeuroDiff/repos/VeryDiffExperiments/src/../benchmarks/mnist-prune/nets/mnist_relu_4_1024.onnx
Found input X
op: matmul, weight: (1024, 784), bias: nothing
op: bias, weight: nothing, bias: (1024,)
op: relu, weight: nothing, bias: nothing
op: matmul, weight: (1024, 1024), bias: nothing
op: bias, weight: nothing, bias: (1024,)
op: relu, weight: nothing, bias: nothing
op: matmul, weight: (1024, 1024), bias: nothing
op: bias, weight: nothing, bias: (1024,)
op: relu, weight: nothing, bias: nothing
op: matmul, weight: (10, 1024), bias: nothing
op: bias, weight: nothing, bias: (10,)
op: relu, weight: nothing, bias: nothing
op: matmul, weight: (10, 10), bias: nothing
op: bias, weight: nothing, bias: (10,)
Found input X
op: gemm, weight: (1024, 784), bias: (1024,)
op: relu, weight: nothing, bias: nothing
op: gemm, weight: (1024, 1024), bias: (1024,)
op: relu, weight: nothing, bias: nothing
op: gemm, weight: (1024, 1024), bias: (1024,)
op: relu, weight: nothing, bias: nothing
op: gemm, weight: (10, 1024), bias: (10,)
op: relu, weight: nothing, bias: nothing
op: gemm, weight: (10, 10), bias: (10,)
Distance: 915.6394868631054
Distance: 1298.7052820973968
Distance: 1296.587532894263
Distance: 6.054483317080667
Distance: 0.04942679278974538
Running with 1 threads
[Thread 1] Time to first task: 0.0s
Instable Generators: 477
Instable Generators: 869
Instable Generators: 1024
Instable Generators: 10
Zono Bounds:
[-127.19016385652269, -129.9133529319115, -143.2073568956106, -142.26217856523607, -137.28383068832323, -144.53289151907398, -129.64464287410055, -135.03159216098297, -138.11206699555595, -143.85836965791415]
[127.14054257445655, 129.750896044103, 143.02614931683854, 141.70487246037948, 137.20768366457418, 144.17334958907685, 129.63318767576504, 134.4332929339253, 137.74510786900447, 143.32387647054875]
[Thread 1] Processed 100 zonotopes (Work Done: 0.0%; Expected Zonos: Inf)


TIMEOUT REACHED
UNKNOWN
[Thread 1] Total splits: 136
Processed 136 zonotopes (Work Done: 0.0%); Generated 272 (0.8883278976102942s/loop)
[Thread 1] Finished in 120.81s
 ────────────────────────────────────────────────────────────────────────────────
                                        Time                    Allocations      
                               ───────────────────────   ────────────────────────
       Tot / % measured:             121s / 100.0%           40.8GiB / 100.0%    

 Section               ncalls     time    %tot     avg     alloc    %tot      avg
 ────────────────────────────────────────────────────────────────────────────────
 Verify                     1     121s  100.0%    121s   40.8GiB   99.9%  40.8GiB
   Zonotope Loop            1     121s  100.0%    121s   40.8GiB   99.9%  40.8GiB
     Zonotope Propa...    136     120s   99.5%   884ms   40.4GiB   99.2%   304MiB
       DiffZonotope...    680    63.2s   52.3%  93.0ms   8.64GiB   21.2%  13.0MiB
         Zonotope_D...  1.36k    21.9s   18.2%  16.1ms   3.51GiB    8.6%  2.64MiB
       DiffZonotope...    544    57.0s   47.2%   105ms   31.8GiB   78.0%  59.9MiB
         Zonotope_R...  1.09k    16.5s   13.7%  15.2ms   19.7GiB   48.4%  18.6MiB
           Column M...  1.09k    7.02s    5.8%  6.45ms   8.01GiB   19.7%  7.54MiB
           Allocation   1.09k    6.16s    5.1%  5.66ms   8.01GiB   19.7%  7.54MiB
           Influenc...  1.09k    1.90s    1.6%  1.74ms   3.65GiB    9.0%  3.44MiB
             Multiply   1.09k    1.86s    1.5%  1.71ms   3.43GiB    8.4%  3.23MiB
             Alloca...  1.09k   24.9ms    0.0%  22.9μs    227MiB    0.5%   213KiB
             Set Ma...  1.09k   14.6ms    0.0%  13.5μs     0.00B    0.0%    0.00B
           Set Matrix   1.09k    1.42s    1.2%  1.30ms   15.0MiB    0.0%  14.1KiB
           Vectors      1.09k   31.9ms    0.0%  29.4μs   36.1MiB    0.1%  34.0KiB
           Bounds       1.09k    708μs    0.0%   651ns     0.00B    0.0%    0.00B
     Property Check       136    498ms    0.4%  3.66ms   66.4MiB    0.2%   500KiB
     Compute Split        136   54.2ms    0.0%   399μs    147MiB    0.4%  1.08MiB
 Initialize                 1   14.6ms    0.0%  14.6ms   22.4MiB    0.1%  22.4MiB
 ────────────────────────────────────────────────────────────────────────────────
[VERYDIFF_TIMER] 120.903539742

[VERYDIFF_EXPERIMENT] NETWORK: /home/i57/steuber/NeuroDiff/repos/VeryDiffExperiments/src/../benchmarks/mnist-prune/specs/mnist_43_local_18.vnnlib
[VERYDIFF_EXPERIMENT] TIME: 121.221984692
