
[VERYDIFF_EXPERIMENT] Running on /home/i57/steuber/NeuroDiff/repos/VeryDiffExperiments/src/../benchmarks/mnist-prune/specs/mnist_89_global_3.vnnlib /home/i57/steuber/NeuroDiff/repos/VeryDiffExperiments/src/../benchmarks/mnist-prune/nets/mnist_relu_2_512.onnx
Found input X
op: matmul, weight: (512, 784), bias: nothing
op: bias, weight: nothing, bias: (512,)
op: relu, weight: nothing, bias: nothing
op: matmul, weight: (512, 512), bias: nothing
op: bias, weight: nothing, bias: (512,)
op: relu, weight: nothing, bias: nothing
op: matmul, weight: (10, 512), bias: nothing
op: bias, weight: nothing, bias: (10,)
Found input X
op: gemm, weight: (512, 784), bias: (512,)
op: relu, weight: nothing, bias: nothing
op: gemm, weight: (512, 512), bias: (512,)
op: relu, weight: nothing, bias: nothing
op: gemm, weight: (10, 512), bias: (10,)
Distance: 973.3044369037136
Distance: 481.63499746812613
Distance: 8.744412635378467
Running with 1 threads
[Thread 1] Time to first task: 0.01s
Instable Generators: 110
Instable Generators: 205
Zono Bounds:
[-6.218958543992693, -5.354976382930577, -4.730439639309023, -5.567144347634034, -4.810527839510129, -4.700780417038923, -4.98896715218428, -5.0370894275558316, -4.721444538126009, -4.280007848916085]
[7.085401338053279, 6.455593923625306, 5.7129580021271, 5.3700667416734635, 6.0821974351228665, 4.930641666852405, 5.938649424193889, 6.300486719414873, 5.228942469177912, 4.9778839234103085]
[Thread 1] Processed 100 zonotopes (Work Done: 0.0%; Expected Zonos: Inf)
[Thread 1] Processed 200 zonotopes (Work Done: 0.0%; Expected Zonos: Inf)


TIMEOUT REACHED
UNKNOWN
[Thread 1] Total splits: 295
Processed 295 zonotopes (Work Done: 0.0%); Generated 590 (0.408008526979661s/loop)
[Thread 1] Finished in 120.36s
 ────────────────────────────────────────────────────────────────────────────────
                                        Time                    Allocations      
                               ───────────────────────   ────────────────────────
       Tot / % measured:             120s / 100.0%           44.2GiB / 100.0%    

 Section               ncalls     time    %tot     avg     alloc    %tot      avg
 ────────────────────────────────────────────────────────────────────────────────
 Verify                     1     120s  100.0%    120s   44.2GiB  100.0%  44.2GiB
   Zonotope Loop            1     120s  100.0%    120s   44.2GiB  100.0%  44.2GiB
     Zonotope Propa...    295    98.2s   81.6%   333ms   33.2GiB   75.0%   115MiB
       DiffZonotope...    590    58.4s   48.5%  99.0ms   27.2GiB   61.4%  47.1MiB
         Zonotope_R...  1.18k    44.0s   36.5%  37.3ms   23.8GiB   53.9%  20.7MiB
           Influenc...  1.18k    39.4s   32.7%  33.4ms   14.9GiB   33.6%  12.9MiB
             Multiply   1.18k    28.3s   23.5%  24.0ms   8.02GiB   18.1%  6.96MiB
             Alloca...  1.18k    10.1s    8.4%  8.60ms   6.85GiB   15.5%  5.94MiB
             Set Ma...  1.18k    923ms    0.8%   782μs     0.00B    0.0%    0.00B
           Column M...  1.18k    3.69s    3.1%  3.13ms   4.47GiB   10.1%  3.88MiB
           Set Matrix   1.18k    572ms    0.5%   485μs   5.40MiB    0.0%  4.69KiB
           Allocation   1.18k    286ms    0.2%   242μs   4.47GiB   10.1%  3.88MiB
           Vectors      1.18k   23.1ms    0.0%  19.6μs   28.8MiB    0.1%  25.0KiB
           Bounds       1.18k    928μs    0.0%   787ns     0.00B    0.0%    0.00B
       DiffZonotope...    885    39.8s   33.1%  45.0ms   6.00GiB   13.6%  6.94MiB
         Zonotope_D...  1.77k    22.7s   18.9%  12.8ms   3.83GiB    8.7%  2.21MiB
     Compute Split        295    10.8s    8.9%  36.5ms   5.24GiB   11.8%  18.2MiB
     Property Check       295    264ms    0.2%   895μs   82.0MiB    0.2%   285KiB
 Initialize                 1   2.21ms    0.0%  2.21ms   9.84MiB    0.0%  9.84MiB
 ────────────────────────────────────────────────────────────────────────────────
[VERYDIFF_TIMER] 120.40249999

[VERYDIFF_EXPERIMENT] NETWORK: /home/i57/steuber/NeuroDiff/repos/VeryDiffExperiments/src/../benchmarks/mnist-prune/specs/mnist_89_global_3.vnnlib
[VERYDIFF_EXPERIMENT] TIME: 120.809272487
