
[VERYDIFF_EXPERIMENT] Running on /home/i57/steuber/NeuroDiff/repos/VeryDiffExperiments/src/../benchmarks/mnist-prune/specs/mnist_24_global_5.vnnlib /home/i57/steuber/NeuroDiff/repos/VeryDiffExperiments/src/../benchmarks/mnist-prune/nets/mnist_relu_4_1024.onnx
Found input X
op: matmul, weight: (1024, 784), bias: nothing
op: bias, weight: nothing, bias: (1024,)
op: relu, weight: nothing, bias: nothing
op: matmul, weight: (1024, 1024), bias: nothing
op: bias, weight: nothing, bias: (1024,)
op: relu, weight: nothing, bias: nothing
op: matmul, weight: (1024, 1024), bias: nothing
op: bias, weight: nothing, bias: (1024,)
op: relu, weight: nothing, bias: nothing
op: matmul, weight: (10, 1024), bias: nothing
op: bias, weight: nothing, bias: (10,)
op: relu, weight: nothing, bias: nothing
op: matmul, weight: (10, 10), bias: nothing
op: bias, weight: nothing, bias: (10,)
Found input X
op: gemm, weight: (1024, 784), bias: (1024,)
op: relu, weight: nothing, bias: nothing
op: gemm, weight: (1024, 1024), bias: (1024,)
op: relu, weight: nothing, bias: nothing
op: gemm, weight: (1024, 1024), bias: (1024,)
op: relu, weight: nothing, bias: nothing
op: gemm, weight: (10, 1024), bias: (10,)
op: relu, weight: nothing, bias: nothing
op: gemm, weight: (10, 10), bias: (10,)
Distance: 915.6394868631054
Distance: 1298.7052820973968
Distance: 1296.587532894263
Distance: 6.054483317080667
Distance: 0.04942679278974538
Running with 1 threads
[Thread 1] Time to first task: 0.0s
Instable Generators: 561
Instable Generators: 1000
Instable Generators: 1024
Instable Generators: 10
Zono Bounds:
[-155.7796000790006, -159.01870239921917, -175.25940924155185, -174.03881850735743, -167.563996418191, -177.18717179444926, -158.27064827865595, -165.49941967457946, -169.20736590785722, -176.32566213159956]
[155.65541017784983, 158.601935696528, 174.4896454412533, 173.5236385019467, 167.44261600915556, 177.054263500936, 158.25456968933221, 164.63051667716692, 169.3037308119183, 176.13683679577778]


TIMEOUT REACHED
UNKNOWN
[Thread 1] Total splits: 40
Processed 40 zonotopes (Work Done: 0.0%); Generated 80 (3.069835266475s/loop)
[Thread 1] Finished in 122.79s
 ────────────────────────────────────────────────────────────────────────────────
                                        Time                    Allocations      
                               ───────────────────────   ────────────────────────
       Tot / % measured:             123s / 100.0%           34.0GiB / 100.0%    

 Section               ncalls     time    %tot     avg     alloc    %tot      avg
 ────────────────────────────────────────────────────────────────────────────────
 Verify                     1     123s  100.0%    123s   34.0GiB   99.9%  34.0GiB
   Zonotope Loop            1     123s  100.0%    123s   34.0GiB   99.9%  34.0GiB
     Zonotope Propa...     40     121s   98.3%   3.02s   31.4GiB   92.3%   804MiB
       DiffZonotope...    160    72.1s   58.7%   451ms   25.9GiB   76.2%   166MiB
         Zonotope_R...    320    64.0s   52.1%   200ms   20.9GiB   61.3%  66.8MiB
           Influenc...    320    46.2s   37.6%   144ms   12.2GiB   35.9%  39.1MiB
             Alloca...    320    29.0s   23.6%  90.6ms   4.86GiB   14.3%  15.6MiB
             Multiply     320    16.4s   13.4%  51.4ms   7.36GiB   21.6%  23.6MiB
             Set Ma...    320    781ms    0.6%  2.44ms     0.00B    0.0%    0.00B
           Column M...    320    11.6s    9.5%  36.3ms   4.31GiB   12.7%  13.8MiB
           Allocation     320    5.37s    4.4%  16.8ms   4.31GiB   12.7%  13.8MiB
           Set Matrix     320    827ms    0.7%  2.58ms   5.10MiB    0.0%  16.3KiB
           Vectors        320   8.22ms    0.0%  25.7μs   10.6MiB    0.0%  34.0KiB
           Bounds         320    225μs    0.0%   702ns     0.00B    0.0%    0.00B
       DiffZonotope...    200    48.6s   39.6%   243ms   5.46GiB   16.1%  28.0MiB
         Zonotope_D...    400    25.1s   20.4%  62.8ms   2.76GiB    8.1%  7.08MiB
     Compute Split         40    1.76s    1.4%  43.9ms   1.79GiB    5.3%  45.7MiB
     Property Check        40    153ms    0.1%  3.82ms   28.8MiB    0.1%   738KiB
 Initialize                 1   17.1ms    0.0%  17.1ms   27.0MiB    0.1%  27.0MiB
 ────────────────────────────────────────────────────────────────────────────────
[VERYDIFF_TIMER] 122.890517188

[VERYDIFF_EXPERIMENT] NETWORK: /home/i57/steuber/NeuroDiff/repos/VeryDiffExperiments/src/../benchmarks/mnist-prune/specs/mnist_24_global_5.vnnlib
[VERYDIFF_EXPERIMENT] TIME: 123.236418994
