
[VERYDIFF_EXPERIMENT] Running on /home/i57/steuber/NeuroDiff/repos/VeryDiffExperiments/src/../benchmarks/mnist-prune/specs/mnist_75_local_15.vnnlib /home/i57/steuber/NeuroDiff/repos/VeryDiffExperiments/src/../benchmarks/mnist-prune/nets/mnist_relu_3_100.onnx
Found input X
op: matmul, weight: (100, 784), bias: nothing
op: bias, weight: nothing, bias: (100,)
op: relu, weight: nothing, bias: nothing
op: matmul, weight: (100, 100), bias: nothing
op: bias, weight: nothing, bias: (100,)
op: relu, weight: nothing, bias: nothing
op: matmul, weight: (10, 100), bias: nothing
op: bias, weight: nothing, bias: (10,)
op: relu, weight: nothing, bias: nothing
op: matmul, weight: (10, 10), bias: nothing
op: bias, weight: nothing, bias: (10,)
Found input X
op: gemm, weight: (100, 784), bias: (100,)
op: relu, weight: nothing, bias: nothing
op: gemm, weight: (100, 100), bias: (100,)
op: relu, weight: nothing, bias: nothing
op: gemm, weight: (10, 100), bias: (10,)
op: relu, weight: nothing, bias: nothing
op: gemm, weight: (10, 10), bias: (10,)
Distance: 368.62397500800625
Distance: 47.56803950402309
Distance: 2.8977568827249343
Distance: 0.01885471428334995
Running with 1 threads
[Thread 1] Time to first task: 0.0s
Instable Generators: 34
Instable Generators: 34
Instable Generators: 3
Zono Bounds:
[0.00029888699020515566, -0.7624162342500093, -0.8595006072160711, -0.8110293043159482, -0.997071202238, -0.0008906110177800603, 0.00013393602525190888, -1.056760153905787, -0.8683444140213105, -0.9421396677668562]
[0.0006490358654954539, 0.8718660234747092, 0.7258519696756724, 0.7793478922961625, 0.9990223529652661, 0.00042971230248823786, 0.0006410098093278128, 0.9576118661950064, 0.8662455586425638, 0.8967537844033714]
[Thread 1] Processed 100 zonotopes (Work Done: 0.0%; Expected Zonos: Inf)
[Thread 1] Processed 200 zonotopes (Work Done: 0.0%; Expected Zonos: Inf)
[Thread 1] Processed 300 zonotopes (Work Done: 0.0%; Expected Zonos: Inf)
[Thread 1] Processed 400 zonotopes (Work Done: 0.0%; Expected Zonos: Inf)
[Thread 1] Processed 500 zonotopes (Work Done: 0.0%; Expected Zonos: Inf)
[Thread 1] Processed 600 zonotopes (Work Done: 0.0%; Expected Zonos: Inf)
[Thread 1] Processed 700 zonotopes (Work Done: 0.0%; Expected Zonos: Inf)
[Thread 1] Processed 800 zonotopes (Work Done: 0.0%; Expected Zonos: Inf)
[Thread 1] Processed 900 zonotopes (Work Done: 0.0%; Expected Zonos: Inf)
[Thread 1] Processed 1000 zonotopes (Work Done: 0.0%; Expected Zonos: Inf)
[Thread 1] Processed 1100 zonotopes (Work Done: 0.0%; Expected Zonos: Inf)
[Thread 1] Processed 1200 zonotopes (Work Done: 0.0%; Expected Zonos: Inf)
[Thread 1] Processed 1300 zonotopes (Work Done: 0.0%; Expected Zonos: Inf)
[Thread 1] Processed 1400 zonotopes (Work Done: 0.0%; Expected Zonos: Inf)
[Thread 1] Processed 1500 zonotopes (Work Done: 0.0%; Expected Zonos: Inf)
[Thread 1] Processed 1600 zonotopes (Work Done: 0.0%; Expected Zonos: Inf)
[Thread 1] Processed 1700 zonotopes (Work Done: 0.0%; Expected Zonos: Inf)
[Thread 1] Processed 1800 zonotopes (Work Done: 0.0%; Expected Zonos: Inf)
[Thread 1] Processed 1900 zonotopes (Work Done: 0.0%; Expected Zonos: Inf)
[Thread 1] Processed 2000 zonotopes (Work Done: 0.0%; Expected Zonos: Inf)
[Thread 1] Processed 2100 zonotopes (Work Done: 0.0%; Expected Zonos: Inf)
[Thread 1] Processed 2200 zonotopes (Work Done: 0.0%; Expected Zonos: Inf)
[Thread 1] Processed 2300 zonotopes (Work Done: 0.0%; Expected Zonos: Inf)
[Thread 1] Processed 2400 zonotopes (Work Done: 0.0%; Expected Zonos: Inf)
[Thread 1] Processed 2500 zonotopes (Work Done: 0.0%; Expected Zonos: Inf)
[Thread 1] Processed 2600 zonotopes (Work Done: 0.0%; Expected Zonos: Inf)
[Thread 1] Processed 2700 zonotopes (Work Done: 0.0%; Expected Zonos: Inf)
[Thread 1] Processed 2800 zonotopes (Work Done: 0.0%; Expected Zonos: Inf)
[Thread 1] Processed 2900 zonotopes (Work Done: 0.0%; Expected Zonos: Inf)
[Thread 1] Processed 3000 zonotopes (Work Done: 0.0%; Expected Zonos: Inf)
[Thread 1] Processed 3100 zonotopes (Work Done: 0.0%; Expected Zonos: Inf)
[Thread 1] Processed 3200 zonotopes (Work Done: 0.0%; Expected Zonos: Inf)
[Thread 1] Processed 3300 zonotopes (Work Done: 0.0%; Expected Zonos: Inf)
[Thread 1] Processed 3400 zonotopes (Work Done: 0.0%; Expected Zonos: Inf)
[Thread 1] Processed 3500 zonotopes (Work Done: 0.0%; Expected Zonos: Inf)
[Thread 1] Processed 3600 zonotopes (Work Done: 0.0%; Expected Zonos: Inf)
[Thread 1] Processed 3700 zonotopes (Work Done: 0.0%; Expected Zonos: Inf)
[Thread 1] Processed 3800 zonotopes (Work Done: 0.0%; Expected Zonos: Inf)
[Thread 1] Processed 3900 zonotopes (Work Done: 0.0%; Expected Zonos: Inf)
[Thread 1] Processed 4000 zonotopes (Work Done: 0.0%; Expected Zonos: Inf)
[Thread 1] Processed 4100 zonotopes (Work Done: 0.0%; Expected Zonos: Inf)
[Thread 1] Processed 4200 zonotopes (Work Done: 0.0%; Expected Zonos: Inf)
[Thread 1] Processed 4300 zonotopes (Work Done: 0.0%; Expected Zonos: Inf)
[Thread 1] Processed 4400 zonotopes (Work Done: 0.0%; Expected Zonos: Inf)
[Thread 1] Processed 4500 zonotopes (Work Done: 0.0%; Expected Zonos: Inf)
[Thread 1] Processed 4600 zonotopes (Work Done: 0.0%; Expected Zonos: Inf)
[Thread 1] Processed 4700 zonotopes (Work Done: 0.0%; Expected Zonos: Inf)
[Thread 1] Processed 4800 zonotopes (Work Done: 0.0%; Expected Zonos: Inf)
[Thread 1] Processed 4900 zonotopes (Work Done: 0.0%; Expected Zonos: Inf)
[Thread 1] Processed 5000 zonotopes (Work Done: 0.0%; Expected Zonos: Inf)
[Thread 1] Processed 5100 zonotopes (Work Done: 0.0%; Expected Zonos: Inf)
[Thread 1] Processed 5200 zonotopes (Work Done: 0.0%; Expected Zonos: Inf)
[Thread 1] Processed 5300 zonotopes (Work Done: 0.0%; Expected Zonos: Inf)
[Thread 1] Processed 5400 zonotopes (Work Done: 0.0%; Expected Zonos: Inf)
[Thread 1] Processed 5500 zonotopes (Work Done: 0.02441%; Expected Zonos: 2.2528e7)
[Thread 1] Processed 5600 zonotopes (Work Done: 0.03662%; Expected Zonos: 1.5291733333333334e7)
[Thread 1] Processed 5700 zonotopes (Work Done: 0.03662%; Expected Zonos: 1.55648e7)
[Thread 1] Processed 5800 zonotopes (Work Done: 0.03662%; Expected Zonos: 1.5837866666666666e7)
[Thread 1] Processed 5900 zonotopes (Work Done: 0.04883%; Expected Zonos: 1.20832e7)
[Thread 1] Processed 6000 zonotopes (Work Done: 0.06104%; Expected Zonos: 9.8304e6)
[Thread 1] Processed 6100 zonotopes (Work Done: 0.08545%; Expected Zonos: 7.138742857142857e6)
[Thread 1] Processed 6200 zonotopes (Work Done: 0.08545%; Expected Zonos: 7.255771428571428e6)
[Thread 1] Processed 6300 zonotopes (Work Done: 0.08545%; Expected Zonos: 7.3728e6)
[Thread 1] Processed 6400 zonotopes (Work Done: 0.10986%; Expected Zonos: 5.825422222222222e6)
[Thread 1] Processed 6500 zonotopes (Work Done: 0.10986%; Expected Zonos: 5.916444444444444e6)
[Thread 1] Processed 6600 zonotopes (Work Done: 0.13428%; Expected Zonos: 4.9152e6)
[Thread 1] Processed 6700 zonotopes (Work Done: 0.18311%; Expected Zonos: 3.6590933333333335e6)
[Thread 1] Processed 6800 zonotopes (Work Done: 0.24414%; Expected Zonos: 2.78528e6)
[Thread 1] Processed 6900 zonotopes (Work Done: 0.29297%; Expected Zonos: 2.3552e6)
[Thread 1] Processed 7000 zonotopes (Work Done: 0.31738%; Expected Zonos: 2.2055384615384615e6)
[Thread 1] Processed 7100 zonotopes (Work Done: 0.41504%; Expected Zonos: 1.7106823529411764e6)
[Thread 1] Processed 7200 zonotopes (Work Done: 0.46387%; Expected Zonos: 1.5521684210526317e6)
[Thread 1] Processed 7300 zonotopes (Work Done: 0.56152%; Expected Zonos: 1.3000347826086956e6)
[Thread 1] Processed 7400 zonotopes (Work Done: 0.73853%; Expected Zonos: 1.001996694214876e6)
[Thread 1] Processed 7500 zonotopes (Work Done: 0.83618%; Expected Zonos: 896934.3065693431)
[Thread 1] Processed 7600 zonotopes (Work Done: 0.92773%; Expected Zonos: 819200.0)
[Thread 1] Processed 7700 zonotopes (Work Done: 1.00098%; Expected Zonos: 769248.7804878049)
[Thread 1] Processed 7800 zonotopes (Work Done: 1.12915%; Expected Zonos: 690784.8648648649)
[Thread 1] Processed 7900 zonotopes (Work Done: 1.2146%; Expected Zonos: 650420.1005025125)
[Thread 1] Processed 8000 zonotopes (Work Done: 1.32446%; Expected Zonos: 604018.4331797234)
[Thread 1] Processed 8100 zonotopes (Work Done: 1.50146%; Expected Zonos: 539473.1707317074)
[Thread 1] Processed 8200 zonotopes (Work Done: 1.64795%; Expected Zonos: 497588.14814814815)
[Thread 1] Processed 8300 zonotopes (Work Done: 1.85547%; Expected Zonos: 447326.3157894737)
[Thread 1] Processed 8400 zonotopes (Work Done: 1.94092%; Expected Zonos: 432784.90566037735)
[Thread 1] Processed 8500 zonotopes (Work Done: 2.13013%; Expected Zonos: 399037.2492836676)
[Thread 1] Processed 8600 zonotopes (Work Done: 2.23999%; Expected Zonos: 383930.24523160764)
[Thread 1] Processed 8700 zonotopes (Work Done: 2.47192%; Expected Zonos: 351952.5925925926)
[Thread 1] Processed 8800 zonotopes (Work Done: 2.70996%; Expected Zonos: 324727.9279279279)
[Thread 1] Processed 8900 zonotopes (Work Done: 2.98462%; Expected Zonos: 298195.50102249486)
[Thread 1] Processed 9000 zonotopes (Work Done: 3.23486%; Expected Zonos: 278218.8679245283)
[Thread 1] Processed 9100 zonotopes (Work Done: 3.56445%; Expected Zonos: 255298.6301369863)
[Thread 1] Processed 9200 zonotopes (Work Done: 3.86963%; Expected Zonos: 237748.89589905363)
[Thread 1] Processed 9300 zonotopes (Work Done: 4.20532%; Expected Zonos: 221148.33091436865)
[Thread 1] Processed 9400 zonotopes (Work Done: 4.43726%; Expected Zonos: 211842.64099037138)
[Thread 1] Processed 9500 zonotopes (Work Done: 4.63867%; Expected Zonos: 204800.0)
[Thread 1] Processed 9600 zonotopes (Work Done: 4.83398%; Expected Zonos: 198593.9393939394)
[Thread 1] Processed 9700 zonotopes (Work Done: 5.17578%; Expected Zonos: 187411.320754717)
[Thread 1] Processed 9800 zonotopes (Work Done: 5.53589%; Expected Zonos: 177026.68136714443)
[Thread 1] Processed 9900 zonotopes (Work Done: 5.9082%; Expected Zonos: 167563.63636363635)
[Thread 1] Processed 10000 zonotopes (Work Done: 6.28052%; Expected Zonos: 159222.54616132166)
[Thread 1] Processed 10100 zonotopes (Work Done: 6.64062%; Expected Zonos: 152094.11764705883)
[Thread 1] Processed 10200 zonotopes (Work Done: 7.05566%; Expected Zonos: 144564.70588235295)
[Thread 1] Processed 10300 zonotopes (Work Done: 7.54395%; Expected Zonos: 136533.33333333334)
[Thread 1] Processed 10400 zonotopes (Work Done: 7.91016%; Expected Zonos: 131476.54320987655)
[Thread 1] Processed 10500 zonotopes (Work Done: 8.37402%; Expected Zonos: 125387.75510204081)
[Thread 1] Processed 10600 zonotopes (Work Done: 8.8501%; Expected Zonos: 119772.68965517242)
[Thread 1] Processed 10700 zonotopes (Work Done: 9.23462%; Expected Zonos: 115868.34104428288)
[Thread 1] Processed 10800 zonotopes (Work Done: 9.77173%; Expected Zonos: 110522.92317301687)
[Thread 1] Processed 10900 zonotopes (Work Done: 10.27832%; Expected Zonos: 106048.45605700712)
[Thread 1] Processed 11000 zonotopes (Work Done: 10.92529%; Expected Zonos: 100683.79888268157)
[Thread 1] Processed 11100 zonotopes (Work Done: 11.49292%; Expected Zonos: 96581.20021242698)
[Thread 1] Processed 11200 zonotopes (Work Done: 12.12769%; Expected Zonos: 92350.67941620534)
[Thread 1] Processed 11300 zonotopes (Work Done: 12.76245%; Expected Zonos: 88540.98517455763)
[Thread 1] Processed 11400 zonotopes (Work Done: 13.32397%; Expected Zonos: 85560.05497022446)
[Thread 1] Processed 11500 zonotopes (Work Done: 14.00757%; Expected Zonos: 82098.47494553377)
[Thread 1] Processed 11600 zonotopes (Work Done: 14.73389%; Expected Zonos: 78730.07456503728)
[Thread 1] Processed 11700 zonotopes (Work Done: 15.42969%; Expected Zonos: 75827.84810126582)
[Thread 1] Processed 11800 zonotopes (Work Done: 16.22314%; Expected Zonos: 72735.59066967644)
[Thread 1] Processed 11900 zonotopes (Work Done: 17.03491%; Expected Zonos: 69856.53887495521)
[Thread 1] Processed 12000 zonotopes (Work Done: 17.91382%; Expected Zonos: 66987.39352640545)
[Thread 1] Processed 12100 zonotopes (Work Done: 18.68896%; Expected Zonos: 64744.088830829525)
[Thread 1] Processed 12200 zonotopes (Work Done: 19.47632%; Expected Zonos: 62640.17549357568)
[Thread 1] Processed 12300 zonotopes (Work Done: 20.28198%; Expected Zonos: 60644.95937405959)
[Thread 1] Processed 12400 zonotopes (Work Done: 21.19751%; Expected Zonos: 58497.43737402822)
[Thread 1] Processed 12500 zonotopes (Work Done: 21.96045%; Expected Zonos: 56920.51139521957)
[Thread 1] Processed 12600 zonotopes (Work Done: 22.80884%; Expected Zonos: 55241.74471501204)
[Thread 1] Processed 12700 zonotopes (Work Done: 23.63892%; Expected Zonos: 53724.967725277565)
[Thread 1] Processed 12800 zonotopes (Work Done: 24.45679%; Expected Zonos: 52337.20988270527)
[Thread 1] Processed 12900 zonotopes (Work Done: 25.39673%; Expected Zonos: 50793.943763518386)
[Thread 1] Processed 13000 zonotopes (Work Done: 26.37939%; Expected Zonos: 49280.888477556684)
[Thread 1] Processed 13100 zonotopes (Work Done: 27.2583%; Expected Zonos: 48058.755038065385)
[Thread 1] Processed 13200 zonotopes (Work Done: 28.08838%; Expected Zonos: 46994.52411994785)
[Thread 1] Processed 13300 zonotopes (Work Done: 29.03442%; Expected Zonos: 45807.69392474248)
[Thread 1] Processed 13400 zonotopes (Work Done: 29.88281%; Expected Zonos: 44841.83006535948)
[Thread 1] Processed 13500 zonotopes (Work Done: 30.84717%; Expected Zonos: 43764.14721013059)
[Thread 1] Processed 13600 zonotopes (Work Done: 31.70166%; Expected Zonos: 42899.96149403157)
[Thread 1] Processed 13700 zonotopes (Work Done: 32.69043%; Expected Zonos: 41908.28976848394)
[Thread 1] Processed 13800 zonotopes (Work Done: 33.6731%; Expected Zonos: 40982.27297444263)
[Thread 1] Processed 13900 zonotopes (Work Done: 34.58252%; Expected Zonos: 40193.716907871516)
[Thread 1] Processed 14000 zonotopes (Work Done: 35.54688%; Expected Zonos: 39384.61538461538)
[Thread 1] Processed 14100 zonotopes (Work Done: 36.47461%; Expected Zonos: 38657.0281124498)
[Thread 1] Processed 14200 zonotopes (Work Done: 37.45117%; Expected Zonos: 37916.036505867014)
[Thread 1] Processed 14300 zonotopes (Work Done: 38.34839%; Expected Zonos: 37289.70237147859)
[Thread 1] Processed 14400 zonotopes (Work Done: 39.25171%; Expected Zonos: 36686.30073083502)
[Thread 1] Processed 14500 zonotopes (Work Done: 40.25879%; Expected Zonos: 36016.97998787144)
[Thread 1] Processed 14600 zonotopes (Work Done: 41.19263%; Expected Zonos: 35443.23603496814)
[Thread 1] Processed 14700 zonotopes (Work Done: 42.21191%; Expected Zonos: 34824.29149797571)
[Thread 1] Processed 14800 zonotopes (Work Done: 43.2251%; Expected Zonos: 34239.36741033606)
[Thread 1] Processed 14900 zonotopes (Work Done: 44.20471%; Expected Zonos: 33706.813945460824)
[Thread 1] Processed 15000 zonotopes (Work Done: 45.17212%; Expected Zonos: 33206.32346980138)
[Thread 1] Processed 15100 zonotopes (Work Done: 46.14258%; Expected Zonos: 32724.656084656086)
[Thread 1] Processed 15200 zonotopes (Work Done: 47.11914%; Expected Zonos: 32258.65284974093)
[Thread 1] Processed 15300 zonotopes (Work Done: 47.93091%; Expected Zonos: 31920.947408633645)
[Thread 1] Processed 15400 zonotopes (Work Done: 48.85254%; Expected Zonos: 31523.43828085957)
[Thread 1] Processed 15500 zonotopes (Work Done: 49.6582%; Expected Zonos: 31213.3726647001)
[Thread 1] Processed 15600 zonotopes (Work Done: 50.57678%; Expected Zonos: 30844.19236106921)
[Thread 1] Processed 15700 zonotopes (Work Done: 51.4801%; Expected Zonos: 30497.21975220819)
[Thread 1] Processed 15800 zonotopes (Work Done: 52.35596%; Expected Zonos: 30178.036838423875)
[Thread 1] Processed 15900 zonotopes (Work Done: 53.22571%; Expected Zonos: 29872.782523937847)
[Thread 1] Processed 16000 zonotopes (Work Done: 54.12903%; Expected Zonos: 29559.00095844844)
[Thread 1] Processed 16100 zonotopes (Work Done: 55.06287%; Expected Zonos: 29239.306102089453)
[Thread 1] Processed 16200 zonotopes (Work Done: 55.96619%; Expected Zonos: 28946.049402911827)
[Thread 1] Processed 16300 zonotopes (Work Done: 56.8512%; Expected Zonos: 28671.34038327339)
[Thread 1] Processed 16400 zonotopes (Work Done: 57.73621%; Expected Zonos: 28405.05312120091)
[Thread 1] Processed 16500 zonotopes (Work Done: 58.61511%; Expected Zonos: 28149.737075024732)
[Thread 1] Processed 16600 zonotopes (Work Done: 59.54895%; Expected Zonos: 27876.22610567314)
[Thread 1] Processed 16700 zonotopes (Work Done: 60.40955%; Expected Zonos: 27644.63753473099)
[Thread 1] Processed 16800 zonotopes (Work Done: 61.1969%; Expected Zonos: 27452.371216276868)
[Thread 1] Processed 16900 zonotopes (Work Done: 61.95374%; Expected Zonos: 27278.419782276735)
[Thread 1] Processed 17000 zonotopes (Work Done: 62.81433%; Expected Zonos: 27063.88767429432)
[Thread 1] Processed 17100 zonotopes (Work Done: 63.55286%; Expected Zonos: 26906.737094837936)
[Thread 1] Processed 17200 zonotopes (Work Done: 64.46838%; Expected Zonos: 26679.744378698226)
[Thread 1] Processed 17300 zonotopes (Work Done: 65.34729%; Expected Zonos: 26473.93639377948)
[Thread 1] Processed 17400 zonotopes (Work Done: 66.07971%; Expected Zonos: 26331.83392601487)
[Thread 1] Processed 17500 zonotopes (Work Done: 66.97083%; Expected Zonos: 26130.781499202552)
[Thread 1] Processed 17600 zonotopes (Work Done: 67.76428%; Expected Zonos: 25972.384598063498)
[Thread 1] Processed 17700 zonotopes (Work Done: 68.60046%; Expected Zonos: 25801.574803149608)
[Thread 1] Processed 17800 zonotopes (Work Done: 69.3573%; Expected Zonos: 25664.205570466846)
[Thread 1] Processed 17900 zonotopes (Work Done: 70.16296%; Expected Zonos: 25512.035144186855)
[Thread 1] Processed 18000 zonotopes (Work Done: 71.03577%; Expected Zonos: 25339.34785410491)
[Thread 1] Processed 18100 zonotopes (Work Done: 71.81702%; Expected Zonos: 25202.940551565887)
[Thread 1] Processed 18200 zonotopes (Work Done: 72.57385%; Expected Zonos: 25077.90252722762)
[Thread 1] Processed 18300 zonotopes (Work Done: 73.36121%; Expected Zonos: 24945.06427056034)
[Thread 1] Processed 18400 zonotopes (Work Done: 74.07532%; Expected Zonos: 24839.58307584559)
[Thread 1] Processed 18500 zonotopes (Work Done: 74.88098%; Expected Zonos: 24705.87276358153)
[Thread 1] Processed 18600 zonotopes (Work Done: 75.66223%; Expected Zonos: 24582.93873270681)
[Thread 1] Processed 18700 zonotopes (Work Done: 76.50757%; Expected Zonos: 24442.0263262864)
[Thread 1] Processed 18800 zonotopes (Work Done: 77.15759%; Expected Zonos: 24365.71609381798)
[Thread 1] Processed 18900 zonotopes (Work Done: 77.88086%; Expected Zonos: 24267.83699059561)
[Thread 1] Processed 19000 zonotopes (Work Done: 78.64075%; Expected Zonos: 24160.502929876984)
[Thread 1] Processed 19100 zonotopes (Work Done: 79.37317%; Expected Zonos: 24063.54723364989)
[Thread 1] Processed 19200 zonotopes (Work Done: 80.2002%; Expected Zonos: 23940.091324200912)
[Thread 1] Processed 19300 zonotopes (Work Done: 80.96008%; Expected Zonos: 23838.908364431376)
[Thread 1] Processed 19400 zonotopes (Work Done: 81.71692%; Expected Zonos: 23740.493707286103)
[Thread 1] Processed 19500 zonotopes (Work Done: 82.39746%; Expected Zonos: 23665.777777777777)
[Thread 1] Processed 19600 zonotopes (Work Done: 83.11462%; Expected Zonos: 23581.89094914632)
[Thread 1] Processed 19700 zonotopes (Work Done: 83.77991%; Expected Zonos: 23513.99118493425)
[Thread 1] Processed 19800 zonotopes (Work Done: 84.52454%; Expected Zonos: 23425.150738347114)
[Thread 1] Processed 19900 zonotopes (Work Done: 85.19287%; Expected Zonos: 23358.762000286573)
[Thread 1] Processed 20000 zonotopes (Work Done: 85.94666%; Expected Zonos: 23270.24819799027)
[Thread 1] Processed 20100 zonotopes (Work Done: 86.72485%; Expected Zonos: 23176.747132099375)
[Thread 1] Processed 20200 zonotopes (Work Done: 87.39319%; Expected Zonos: 23113.92953172469)
[Thread 1] Processed 20300 zonotopes (Work Done: 88.14392%; Expected Zonos: 23030.5162206142)
[Thread 1] Processed 20400 zonotopes (Work Done: 88.88855%; Expected Zonos: 22950.087547636213)
[Thread 1] Processed 20500 zonotopes (Work Done: 89.60266%; Expected Zonos: 22878.784782534654)
[Thread 1] Processed 20600 zonotopes (Work Done: 90.39001%; Expected Zonos: 22790.12795840508)
[Thread 1] Processed 20700 zonotopes (Work Done: 91.05835%; Expected Zonos: 22732.676452845364)
[Thread 1] Processed 20800 zonotopes (Work Done: 91.72668%; Expected Zonos: 22676.062148584355)
[Thread 1] Processed 20900 zonotopes (Work Done: 92.41028%; Expected Zonos: 22616.531818632146)
[Thread 1] Processed 21000 zonotopes (Work Done: 93.12439%; Expected Zonos: 22550.483368835)
[Thread 1] Processed 21100 zonotopes (Work Done: 93.74084%; Expected Zonos: 22508.864797994596)
[Thread 1] Processed 21200 zonotopes (Work Done: 94.41528%; Expected Zonos: 22453.991854677097)
[Thread 1] Processed 21300 zonotopes (Work Done: 95.01648%; Expected Zonos: 22417.163963385257)
[Thread 1] Processed 21400 zonotopes (Work Done: 95.68176%; Expected Zonos: 22365.808694542786)
[Thread 1] Processed 21500 zonotopes (Work Done: 96.39282%; Expected Zonos: 22304.565313746596)
[Thread 1] Processed 21600 zonotopes (Work Done: 97.00317%; Expected Zonos: 22267.31265336941)
[Thread 1] Processed 21700 zonotopes (Work Done: 97.58301%; Expected Zonos: 22237.478108581436)
[Thread 1] Processed 21800 zonotopes (Work Done: 98.16895%; Expected Zonos: 22206.615269833375)
[Thread 1] Processed 21900 zonotopes (Work Done: 98.76709%; Expected Zonos: 22173.377827215423)
[Thread 1] Processed 22000 zonotopes (Work Done: 99.38965%; Expected Zonos: 22135.101940555145)
[Thread 1] Total splits: 11046
Processed 22093 zonotopes (Work Done: 100.0%); Generated 22092 (0.001673317833567193s/loop)
[Thread 1] Finished in 36.97s
 ────────────────────────────────────────────────────────────────────────────────
                                        Time                    Allocations      
                               ───────────────────────   ────────────────────────
       Tot / % measured:            37.0s / 100.0%           37.0GiB / 100.0%    

 Section               ncalls     time    %tot     avg     alloc    %tot      avg
 ────────────────────────────────────────────────────────────────────────────────
 Verify                     1    37.0s  100.0%   37.0s   37.0GiB  100.0%  37.0GiB
   Zonotope Loop            1    37.0s  100.0%   37.0s   37.0GiB  100.0%  37.0GiB
     Zonotope Propa...  22.1k    29.2s   79.0%  1.32ms   18.2GiB   49.2%   863KiB
       DiffZonotope...  88.4k    18.9s   51.2%   214μs   4.28GiB   11.6%  50.8KiB
         Zonotope_D...   177k    8.84s   23.9%  50.0μs   2.24GiB    6.1%  13.3KiB
       DiffZonotope...  66.3k    10.1s   27.4%   153μs   13.9GiB   37.6%   220KiB
         Zonotope_R...   133k    5.07s   13.7%  38.2μs   8.56GiB   23.2%  67.7KiB
           Column M...   133k    2.06s    5.6%  15.6μs   3.13GiB    8.5%  24.7KiB
           Influenc...   133k    1.14s    3.1%  8.60μs   1.83GiB    4.9%  14.4KiB
             Multiply    133k    801ms    2.2%  6.04μs   1.10GiB    3.0%  8.73KiB
             Alloca...   133k    203ms    0.5%  1.53μs    741MiB    2.0%  5.72KiB
             Set Ma...   133k   72.8ms    0.2%   550ns     0.00B    0.0%    0.00B
           Allocation    133k    716ms    1.9%  5.40μs   3.11GiB    8.4%  24.6KiB
           Set Matrix    133k    338ms    0.9%  2.55μs   78.3MiB    0.2%     619B
           Vectors       133k    334ms    0.9%  2.52μs    421MiB    1.1%  3.26KiB
           Bounds        133k   27.4ms    0.1%   206ns     0.00B    0.0%    0.00B
     Compute Split      11.0k    922ms    2.5%  83.4μs   1.40GiB    3.8%   133KiB
     Property Check     22.1k    638ms    1.7%  28.9μs    395MiB    1.0%  18.3KiB
 Initialize                 1    342μs    0.0%   342μs    821KiB    0.0%   821KiB
 ────────────────────────────────────────────────────────────────────────────────
[VERYDIFF_TIMER] 37.00064477

[VERYDIFF_EXPERIMENT] NETWORK: /home/i57/steuber/NeuroDiff/repos/VeryDiffExperiments/src/../benchmarks/mnist-prune/specs/mnist_75_local_15.vnnlib
[VERYDIFF_EXPERIMENT] TIME: 37.312860434
