[VERYDIFF_EXPERIMENT] Sigma: 0.1
Parsing new_benchmarks/lhc/nets/2_20-1.onnx...
Found input X
WARNING: Operation Softmax is not supported
WE ARE IGNORING THIS OPERATION -- IF YOU DO NOT KNOW WHAT YOU ARE DOING THIS MAY BE UNSOUND!
op: gemm, weight: (20, 16), bias: (20,)
op: relu, weight: nothing, bias: nothing
op: gemm, weight: (20, 20), bias: (20,)
op: relu, weight: nothing, bias: nothing
op: gemm, weight: (5, 20), bias: (5,)
Parsing new_benchmarks/lhc/nets_pruned/2_20-1-0.3.onnx...
Found input X
WARNING: Operation Softmax is not supported
WE ARE IGNORING THIS OPERATION -- IF YOU DO NOT KNOW WHAT YOU ARE DOING THIS MAY BE UNSOUND!
op: gemm, weight: (20, 16), bias: (20,)
op: relu, weight: nothing, bias: nothing
op: gemm, weight: (20, 20), bias: (20,)
op: relu, weight: nothing, bias: nothing
op: gemm, weight: (5, 20), bias: (5,)
Distance: 66.54304583626799
Distance: 115.57397115119966
Distance: 16.742789182811975
Running with 1 threads
[Thread 1] Time to first task: 0.0s
Zono Bounds:
[0.0, 0.0, 0.0, 0.0, 0.0, 0.0, 0.0, 0.0, 0.0, 0.0, 0.0, 0.0, 0.0, 0.0, 0.0, 0.0]
[0.0, 0.0, 0.0, 0.0, 0.0, 0.0, 0.0, 0.0, 0.0, 0.0, 0.0, 0.0, 0.0, 0.0, 0.0, 0.0]
[TOP-1] required confidence (0.9858269700860005≥0.9) is feasible for index 2
Found spurious cex
N1 Probability: 0.838544277330948 < 0.9
but difference 2.275165996145085 >= 2.1972245773362196 (approximate bound)
[Thread 1] Processed 100 zonotopes (Work Done: 0.0%; Expected Zonos: Inf)
Found spurious cex
N1 Probability: 0.8736085351312973 < 0.9
but difference 2.4139241610650264 >= 2.1972245773362196 (approximate bound)
Found spurious cex
N1 Probability: 0.8650596547336757 < 0.9
but difference 2.507293338506804 >= 2.1972245773362196 (approximate bound)
Found cex
N1 Probability: 0.905009879900636 >= 0.9

Found counterexample: ([0.05, 0.05, 0.05, 0.05, 0.05, 0.0, 0.0, 0.0, 0.0, 0.05, 0.0, 0.0, -0.05, 0.0, -0.07500000000000001, 0.0], (3, 2))
[Thread 1] Total splits: 157
Processed 158 zonotopes (Work Done: 0.0%); Generated 314 (0.005115541405063291s/loop)
[Thread 1] Finished in 0.81s
 ────────────────────────────────────────────────────────────────────────────────
                                        Time                    Allocations      
                               ───────────────────────   ────────────────────────
       Tot / % measured:            808ms / 100.0%            135MiB / 100.0%    

 Section               ncalls     time    %tot     avg     alloc    %tot      avg
 ────────────────────────────────────────────────────────────────────────────────
 Verify                     1    808ms  100.0%   808ms    135MiB  100.0%   135MiB
   Zonotope Loop            1    808ms  100.0%   808ms    135MiB  100.0%   135MiB
     Property Check       158    793ms   98.1%  5.02ms    117MiB   86.4%   757KiB
     Zonotope Propa...    158   10.6ms    1.3%  67.3μs   14.1MiB   10.4%  91.4KiB
       DiffZonotope...    316   7.63ms    0.9%  24.1μs   11.3MiB    8.4%  36.8KiB
         Zonotope_R...    632   6.54ms    0.8%  10.4μs   10.6MiB    7.9%  17.2KiB
           Influenc...    632   2.67ms    0.3%  4.22μs   4.62MiB    3.4%  7.48KiB
             Multiply     632   1.61ms    0.2%  2.55μs   2.62MiB    1.9%  4.25KiB
             Alloca...    632    492μs    0.1%   778ns   2.00MiB    1.5%  3.23KiB
             Set Ma...    632    206μs    0.0%   327ns     0.00B    0.0%    0.00B
           Column M...    632   1.11ms    0.1%  1.76μs   2.54MiB    1.9%  4.12KiB
           Vectors        632    891μs    0.1%  1.41μs    750KiB    0.5%  1.19KiB
           Set Matrix     632    712μs    0.1%  1.13μs    239KiB    0.2%     387B
           Allocation     632    541μs    0.1%   856ns   2.48MiB    1.8%  4.02KiB
           Bounds         632    123μs    0.0%   194ns     0.00B    0.0%    0.00B
       DiffZonotope...    474   2.22ms    0.3%  4.68μs   2.72MiB    2.0%  5.87KiB
         Zonotope_D...    948   2.05ms    0.3%  2.17μs   2.69MiB    2.0%  2.90KiB
     Compute Split        157   3.34ms    0.4%  21.3μs   2.75MiB    2.0%  17.9KiB
 Initialize                 1   33.4μs    0.0%  33.4μs   13.7KiB    0.0%  13.7KiB
 ────────────────────────────────────────────────────────────────────────────────[VERYDIFF_TIMER] 0.809972118
[VERYDIFF_EXPERIMENT] Sigma: 0.5
Parsing new_benchmarks/lhc/nets/2_20-1.onnx...
Found input X
WARNING: Operation Softmax is not supported
WE ARE IGNORING THIS OPERATION -- IF YOU DO NOT KNOW WHAT YOU ARE DOING THIS MAY BE UNSOUND!
op: gemm, weight: (20, 16), bias: (20,)
op: relu, weight: nothing, bias: nothing
op: gemm, weight: (20, 20), bias: (20,)
op: relu, weight: nothing, bias: nothing
op: gemm, weight: (5, 20), bias: (5,)
Parsing new_benchmarks/lhc/nets_pruned/2_20-1-0.3.onnx...
Found input X
WARNING: Operation Softmax is not supported
WE ARE IGNORING THIS OPERATION -- IF YOU DO NOT KNOW WHAT YOU ARE DOING THIS MAY BE UNSOUND!
op: gemm, weight: (20, 16), bias: (20,)
op: relu, weight: nothing, bias: nothing
op: gemm, weight: (20, 20), bias: (20,)
op: relu, weight: nothing, bias: nothing
op: gemm, weight: (5, 20), bias: (5,)
Distance: 66.54304583626799
Distance: 115.57397115119966
Distance: 16.742789182811975
Running with 1 threads
[Thread 1] Time to first task: 0.0s
Zono Bounds:
[0.0, 0.0, 0.0, 0.0, 0.0, 0.0, 0.0, 0.0, 0.0, 0.0, 0.0, 0.0, 0.0, 0.0, 0.0, 0.0]
[0.0, 0.0, 0.0, 0.0, 0.0, 0.0, 0.0, 0.0, 0.0, 0.0, 0.0, 0.0, 0.0, 0.0, 0.0, 0.0]
[TOP-1] required confidence (0.9882646959999019≥0.9) is feasible for index 5
Found cex
N1: 0.9999999592217536 (vs. 4.077824512947997e-8)
N2: 0.8840133376633692
N1 Probability: 0.9999999592217536 >= 0.9

Found counterexample: ([-0.5, -0.5, 0.5, 0.5, 0.5, -0.5, 0.5, -0.5, -0.5, -0.5, -0.5, 0.5, -0.5, 0.5, 0.5, -0.5], (4, 3))
[Thread 1] Total splits: 0
Processed 1 zonotopes (Work Done: 0.0%); Generated 0 (0.001497246s/loop)
[Thread 1] Finished in 0.0s
 ────────────────────────────────────────────────────────────────────────────────
                                        Time                    Allocations      
                               ───────────────────────   ────────────────────────
       Tot / % measured:           1.55ms /  99.8%            506KiB /  99.7%    

 Section               ncalls     time    %tot     avg     alloc    %tot      avg
 ────────────────────────────────────────────────────────────────────────────────
 Verify                     1   1.51ms   98.0%  1.51ms    491KiB   97.3%   491KiB
   Zonotope Loop            1   1.50ms   97.1%  1.50ms    487KiB   96.6%   487KiB
     Property Check         1   1.36ms   87.9%  1.36ms    294KiB   58.3%   294KiB
     Zonotope Propa...      1   91.7μs    5.9%  91.7μs    155KiB   30.7%   155KiB
       DiffZonotope...      2   68.4μs    4.4%  34.2μs    130KiB   25.7%  64.9KiB
         Zonotope_R...      4   62.3μs    4.0%  15.6μs    124KiB   24.7%  31.1KiB
           Influenc...      4   27.0μs    1.8%  6.76μs   59.4KiB   11.8%  14.8KiB
             Multiply       4   15.5μs    1.0%  3.88μs   36.1KiB    7.2%  9.02KiB
             Alloca...      4   7.57μs    0.5%  1.89μs   21.1KiB    4.2%  5.28KiB
             Set Ma...      4   1.20μs    0.1%   299ns     0.00B    0.0%    0.00B
           Column M...      4   10.6μs    0.7%  2.64μs   26.8KiB    5.3%  6.70KiB
           Allocation       4   7.62μs    0.5%  1.91μs   26.3KiB    5.2%  6.58KiB
           Set Matrix       4   6.66μs    0.4%  1.66μs   2.61KiB    0.5%     668B
           Vectors          4   4.79μs    0.3%  1.20μs   4.75KiB    0.9%  1.19KiB
           Bounds           4    730ns    0.0%   182ns     0.00B    0.0%    0.00B
       DiffZonotope...      3   18.8μs    1.2%  6.28μs   23.1KiB    4.6%  7.71KiB
         Zonotope_D...      6   17.7μs    1.1%  2.94μs   22.2KiB    4.4%  3.70KiB
 Initialize                 1   30.2μs    2.0%  30.2μs   13.7KiB    2.7%  13.7KiB
 ────────────────────────────────────────────────────────────────────────────────[VERYDIFF_TIMER] 0.00316273
[VERYDIFF_EXPERIMENT] Sigma: 1.0
Parsing new_benchmarks/lhc/nets/2_20-1.onnx...
Found input X
WARNING: Operation Softmax is not supported
WE ARE IGNORING THIS OPERATION -- IF YOU DO NOT KNOW WHAT YOU ARE DOING THIS MAY BE UNSOUND!
op: gemm, weight: (20, 16), bias: (20,)
op: relu, weight: nothing, bias: nothing
op: gemm, weight: (20, 20), bias: (20,)
op: relu, weight: nothing, bias: nothing
op: gemm, weight: (5, 20), bias: (5,)
Parsing new_benchmarks/lhc/nets_pruned/2_20-1-0.3.onnx...
Found input X
WARNING: Operation Softmax is not supported
WE ARE IGNORING THIS OPERATION -- IF YOU DO NOT KNOW WHAT YOU ARE DOING THIS MAY BE UNSOUND!
op: gemm, weight: (20, 16), bias: (20,)
op: relu, weight: nothing, bias: nothing
op: gemm, weight: (20, 20), bias: (20,)
op: relu, weight: nothing, bias: nothing
op: gemm, weight: (5, 20), bias: (5,)
Distance: 66.54304583626799
Distance: 115.57397115119966
Distance: 16.742789182811975
Running with 1 threads
[Thread 1] Time to first task: 0.0s
Zono Bounds:
[0.0, 0.0, 0.0, 0.0, 0.0, 0.0, 0.0, 0.0, 0.0, 0.0, 0.0, 0.0, 0.0, 0.0, 0.0, 0.0]
[0.0, 0.0, 0.0, 0.0, 0.0, 0.0, 0.0, 0.0, 0.0, 0.0, 0.0, 0.0, 0.0, 0.0, 0.0, 0.0]
[TOP-1] did not find required confidence yet.
[TOP-1] required confidence (0.9990245655317669≥0.9) is feasible for index 2
Found cex
N1: 0.9999999999847229 (vs. 1.0198714507488187e-11)
N2: 0.8330157993545008
N1 Probability: 0.9999999999847229 >= 0.9

Found counterexample: ([1.0, 1.0, -1.0, -1.0, -1.0, 1.0, -1.0, 1.0, 1.0, 1.0, 1.0, -1.0, 1.0, -1.0, -1.0, 1.0], (1, 3))
[Thread 1] Total splits: 0
Processed 1 zonotopes (Work Done: 0.0%); Generated 0 (0.00326648s/loop)
[Thread 1] Finished in 0.0s
 ────────────────────────────────────────────────────────────────────────────────
                                        Time                    Allocations      
                               ───────────────────────   ────────────────────────
       Tot / % measured:           3.31ms /  99.9%            865KiB /  99.8%    

 Section               ncalls     time    %tot     avg     alloc    %tot      avg
 ────────────────────────────────────────────────────────────────────────────────
 Verify                     1   3.28ms   99.2%  3.28ms    850KiB   98.4%   850KiB
   Zonotope Loop            1   3.27ms   98.7%  3.27ms    846KiB   98.0%   846KiB
     Property Check         1   3.13ms   94.5%  3.13ms    652KiB   75.5%   652KiB
     Zonotope Propa...      1   91.2μs    2.8%  91.2μs    156KiB   18.0%   156KiB
       DiffZonotope...      2   67.5μs    2.0%  33.7μs    131KiB   15.1%  65.3KiB
         Zonotope_R...      4   61.0μs    1.8%  15.3μs    125KiB   14.5%  31.3KiB
           Influenc...      4   26.4μs    0.8%  6.61μs   60.0KiB    7.0%  15.0KiB
             Multiply       4   16.3μs    0.5%  4.07μs   36.5KiB    4.2%  9.14KiB
             Alloca...      4   5.86μs    0.2%  1.47μs   21.2KiB    2.5%  5.31KiB
             Set Ma...      4   1.32μs    0.0%   329ns     0.00B    0.0%    0.00B
           Column M...      4   11.4μs    0.3%  2.84μs   26.9KiB    3.1%  6.73KiB
           Set Matrix       4   6.29μs    0.2%  1.57μs   2.66KiB    0.3%     680B
           Vectors          4   5.83μs    0.2%  1.46μs   4.75KiB    0.6%  1.19KiB
           Allocation       4   5.68μs    0.2%  1.42μs   26.4KiB    3.1%  6.61KiB
           Bounds           4    809ns    0.0%   202ns     0.00B    0.0%    0.00B
       DiffZonotope...      3   18.7μs    0.6%  6.25μs   23.3KiB    2.7%  7.78KiB
         Zonotope_D...      6   17.6μs    0.5%  2.93μs   22.4KiB    2.6%  3.74KiB
 Initialize                 1   26.6μs    0.8%  26.6μs   13.7KiB    1.6%  13.7KiB
 ────────────────────────────────────────────────────────────────────────────────[VERYDIFF_TIMER] 0.004795699
[VERYDIFF_EXPERIMENT] Sigma: 2.0
Parsing new_benchmarks/lhc/nets/2_20-1.onnx...
Found input X
WARNING: Operation Softmax is not supported
WE ARE IGNORING THIS OPERATION -- IF YOU DO NOT KNOW WHAT YOU ARE DOING THIS MAY BE UNSOUND!
op: gemm, weight: (20, 16), bias: (20,)
op: relu, weight: nothing, bias: nothing
op: gemm, weight: (20, 20), bias: (20,)
op: relu, weight: nothing, bias: nothing
op: gemm, weight: (5, 20), bias: (5,)
Parsing new_benchmarks/lhc/nets_pruned/2_20-1-0.3.onnx...
Found input X
WARNING: Operation Softmax is not supported
WE ARE IGNORING THIS OPERATION -- IF YOU DO NOT KNOW WHAT YOU ARE DOING THIS MAY BE UNSOUND!
op: gemm, weight: (20, 16), bias: (20,)
op: relu, weight: nothing, bias: nothing
op: gemm, weight: (20, 20), bias: (20,)
op: relu, weight: nothing, bias: nothing
op: gemm, weight: (5, 20), bias: (5,)
Distance: 66.54304583626799
Distance: 115.57397115119966
Distance: 16.742789182811975
Running with 1 threads
[Thread 1] Time to first task: 0.0s
Zono Bounds:
[0.0, 0.0, 0.0, 0.0, 0.0, 0.0, 0.0, 0.0, 0.0, 0.0, 0.0, 0.0, 0.0, 0.0, 0.0, 0.0]
[0.0, 0.0, 0.0, 0.0, 0.0, 0.0, 0.0, 0.0, 0.0, 0.0, 0.0, 0.0, 0.0, 0.0, 0.0, 0.0]
[TOP-1] required confidence (0.9999949026792413≥0.9) is feasible for index 1
Found cex
N1: 1.0 (vs. 7.818285368076656e-23)
N2: 0.9999999999582738
N1 Probability: 1.0 >= 0.9

Found counterexample: ([2.0, 2.0, -2.0, -2.0, -2.0, -2.0, -2.0, 2.0, -2.0, 2.0, 2.0, -2.0, 2.0, -2.0, -2.0, 2.0], (1, 3))
[Thread 1] Total splits: 0
Processed 1 zonotopes (Work Done: 0.0%); Generated 0 (0.003238992s/loop)
[Thread 1] Finished in 0.0s
 ────────────────────────────────────────────────────────────────────────────────
                                        Time                    Allocations      
                               ───────────────────────   ────────────────────────
       Tot / % measured:           3.29ms /  99.9%            856KiB /  99.8%    

 Section               ncalls     time    %tot     avg     alloc    %tot      avg
 ────────────────────────────────────────────────────────────────────────────────
 Verify                     1   3.26ms   99.1%  3.26ms    841KiB   98.4%   841KiB
   Zonotope Loop            1   3.24ms   98.6%  3.24ms    837KiB   98.0%   837KiB
     Property Check         1   3.09ms   94.2%  3.09ms    643KiB   75.3%   643KiB
     Zonotope Propa...      1   95.9μs    2.9%  95.9μs    156KiB   18.2%   156KiB
       DiffZonotope...      2   71.5μs    2.2%  35.7μs    131KiB   15.3%  65.3KiB
         Zonotope_R...      4   65.2μs    2.0%  16.3μs    125KiB   14.7%  31.3KiB
           Influenc...      4   28.0μs    0.9%  7.01μs   60.0KiB    7.0%  15.0KiB
             Multiply       4   16.3μs    0.5%  4.08μs   36.5KiB    4.3%  9.14KiB
             Alloca...      4   7.39μs    0.2%  1.85μs   21.2KiB    2.5%  5.31KiB
             Set Ma...      4   1.39μs    0.0%   347ns     0.00B    0.0%    0.00B
           Column M...      4   10.3μs    0.3%  2.56μs   26.9KiB    3.2%  6.73KiB
           Set Matrix       4   7.26μs    0.2%  1.82μs   2.66KiB    0.3%     680B
           Allocation       4   7.08μs    0.2%  1.77μs   26.4KiB    3.1%  6.61KiB
           Vectors          4   6.60μs    0.2%  1.65μs   4.75KiB    0.6%  1.19KiB
           Bounds           4    950ns    0.0%   238ns     0.00B    0.0%    0.00B
       DiffZonotope...      3   19.5μs    0.6%  6.48μs   23.3KiB    2.7%  7.78KiB
         Zonotope_D...      6   18.1μs    0.6%  3.01μs   22.4KiB    2.6%  3.74KiB
 Initialize                 1   29.1μs    0.9%  29.1μs   13.7KiB    1.6%  13.7KiB
 ────────────────────────────────────────────────────────────────────────────────[VERYDIFF_TIMER] 0.004608885
[VERYDIFF_EXPERIMENT] Sigma: 3.0
Parsing new_benchmarks/lhc/nets/2_20-1.onnx...
Found input X
WARNING: Operation Softmax is not supported
WE ARE IGNORING THIS OPERATION -- IF YOU DO NOT KNOW WHAT YOU ARE DOING THIS MAY BE UNSOUND!
op: gemm, weight: (20, 16), bias: (20,)
op: relu, weight: nothing, bias: nothing
op: gemm, weight: (20, 20), bias: (20,)
op: relu, weight: nothing, bias: nothing
op: gemm, weight: (5, 20), bias: (5,)
Parsing new_benchmarks/lhc/nets_pruned/2_20-1-0.3.onnx...
Found input X
WARNING: Operation Softmax is not supported
WE ARE IGNORING THIS OPERATION -- IF YOU DO NOT KNOW WHAT YOU ARE DOING THIS MAY BE UNSOUND!
op: gemm, weight: (20, 16), bias: (20,)
op: relu, weight: nothing, bias: nothing
op: gemm, weight: (20, 20), bias: (20,)
op: relu, weight: nothing, bias: nothing
op: gemm, weight: (5, 20), bias: (5,)
Distance: 66.54304583626799
Distance: 115.57397115119966
Distance: 16.742789182811975
Running with 1 threads
[Thread 1] Time to first task: 0.0s
Zono Bounds:
[0.0, 0.0, 0.0, 0.0, 0.0, 0.0, 0.0, 0.0, 0.0, 0.0, 0.0, 0.0, 0.0, 0.0, 0.0, 0.0]
[0.0, 0.0, 0.0, 0.0, 0.0, 0.0, 0.0, 0.0, 0.0, 0.0, 0.0, 0.0, 0.0, 0.0, 0.0, 0.0]
[TOP-1] required confidence (0.9999999999130004≥0.9) is feasible for index 1
Found cex
N1: 1.0 (vs. 1.0002347284951318e-33)
N2: 0.9999999999994398
N1 Probability: 1.0 >= 0.9

Found counterexample: ([3.0, 3.0, -3.0, -3.0, -3.0, -3.0, -3.0, 3.0, -3.0, 3.0, 3.0, -3.0, 3.0, -3.0, -3.0, 3.0], (1, 3))
[Thread 1] Total splits: 0
Processed 1 zonotopes (Work Done: 0.0%); Generated 0 (0.003270806s/loop)
[Thread 1] Finished in 0.0s
 ────────────────────────────────────────────────────────────────────────────────
                                        Time                    Allocations      
                               ───────────────────────   ────────────────────────
       Tot / % measured:           3.32ms /  99.9%            856KiB /  99.8%    

 Section               ncalls     time    %tot     avg     alloc    %tot      avg
 ────────────────────────────────────────────────────────────────────────────────
 Verify                     1   3.29ms   99.2%  3.29ms    841KiB   98.4%   841KiB
   Zonotope Loop            1   3.27ms   98.6%  3.27ms    838KiB   98.0%   838KiB
     Property Check         1   3.12ms   94.2%  3.12ms    644KiB   75.3%   644KiB
     Zonotope Propa...      1   96.2μs    2.9%  96.2μs    156KiB   18.2%   156KiB
       DiffZonotope...      2   70.4μs    2.1%  35.2μs    131KiB   15.3%  65.3KiB
         Zonotope_R...      4   64.1μs    1.9%  16.0μs    125KiB   14.7%  31.3KiB
           Influenc...      4   26.7μs    0.8%  6.67μs   60.0KiB    7.0%  15.0KiB
             Multiply       4   15.8μs    0.5%  3.95μs   36.5KiB    4.3%  9.14KiB
             Alloca...      4   6.72μs    0.2%  1.68μs   21.2KiB    2.5%  5.31KiB
             Set Ma...      4   1.35μs    0.0%   336ns     0.00B    0.0%    0.00B
           Column M...      4   10.9μs    0.3%  2.72μs   26.9KiB    3.2%  6.73KiB
           Allocation       4   7.52μs    0.2%  1.88μs   26.4KiB    3.1%  6.61KiB
           Set Matrix       4   7.06μs    0.2%  1.77μs   2.66KiB    0.3%     680B
           Vectors          4   5.76μs    0.2%  1.44μs   4.75KiB    0.6%  1.19KiB
           Bounds           4    730ns    0.0%   182ns     0.00B    0.0%    0.00B
       DiffZonotope...      3   20.6μs    0.6%  6.86μs   23.3KiB    2.7%  7.78KiB
         Zonotope_D...      6   19.1μs    0.6%  3.18μs   22.4KiB    2.6%  3.74KiB
 Initialize                 1   27.8μs    0.8%  27.8μs   13.7KiB    1.6%  13.7KiB
 ────────────────────────────────────────────────────────────────────────────────[VERYDIFF_TIMER] 0.004617764
