
[VERYDIFF_EXPERIMENT] Running on /home/i57/steuber/NeuroDiff/repos/VeryDiffExperiments/src/../benchmarks/mnist-prune/specs/mnist_11_global_5.vnnlib /home/i57/steuber/NeuroDiff/repos/VeryDiffExperiments/src/../benchmarks/mnist-prune/nets/mnist_relu_3_100.onnx
Found input X
op: matmul, weight: (100, 784), bias: nothing
op: bias, weight: nothing, bias: (100,)
op: relu, weight: nothing, bias: nothing
op: matmul, weight: (100, 100), bias: nothing
op: bias, weight: nothing, bias: (100,)
op: relu, weight: nothing, bias: nothing
op: matmul, weight: (10, 100), bias: nothing
op: bias, weight: nothing, bias: (10,)
op: relu, weight: nothing, bias: nothing
op: matmul, weight: (10, 10), bias: nothing
op: bias, weight: nothing, bias: (10,)
Found input X
op: gemm, weight: (100, 784), bias: (100,)
op: relu, weight: nothing, bias: nothing
op: gemm, weight: (100, 100), bias: (100,)
op: relu, weight: nothing, bias: nothing
op: gemm, weight: (10, 100), bias: (10,)
op: relu, weight: nothing, bias: nothing
op: gemm, weight: (10, 10), bias: (10,)
Distance: 1623.4465197373434
Distance: 201.62056963066925
Distance: 13.962962507051998
Distance: 0.183768135302671
Running with 1 threads
[Thread 1] Time to first task: 0.0s
Instable Generators: 29
Instable Generators: 45
Instable Generators: 6
Zono Bounds:
[-3.7635583816556046, -3.3495247108699218, -4.21887476775117, -0.2911888836350119, -4.6977793832777275, -4.902407573908437, -3.945460833914151, -0.41195192767468686, -4.303696631965505, -0.005951802687607998]
[3.713994273851956, 3.0331700187120045, 4.1846867738694735, 0.31022774170075, 4.6606374228051015, 4.535219022520792, 4.882339712906132, 0.45017912936070975, 3.3101682722058903, 0.005004107227901392]
[Thread 1] Processed 100 zonotopes (Work Done: 0.0%; Expected Zonos: Inf)
[Thread 1] Processed 200 zonotopes (Work Done: 0.0%; Expected Zonos: Inf)
[Thread 1] Processed 300 zonotopes (Work Done: 0.0%; Expected Zonos: Inf)
[Thread 1] Processed 400 zonotopes (Work Done: 0.0%; Expected Zonos: Inf)
[Thread 1] Processed 500 zonotopes (Work Done: 0.0%; Expected Zonos: Inf)


TIMEOUT REACHED
UNKNOWN
[Thread 1] Total splits: 572
Processed 572 zonotopes (Work Done: 0.0%); Generated 1144 (0.2100738378146853s/loop)
[Thread 1] Finished in 120.16s
 ────────────────────────────────────────────────────────────────────────────────
                                        Time                    Allocations      
                               ───────────────────────   ────────────────────────
       Tot / % measured:             120s / 100.0%           60.7GiB / 100.0%    

 Section               ncalls     time    %tot     avg     alloc    %tot      avg
 ────────────────────────────────────────────────────────────────────────────────
 Verify                     1     120s  100.0%    120s   60.7GiB  100.0%  60.7GiB
   Zonotope Loop            1     120s  100.0%    120s   60.7GiB  100.0%  60.7GiB
     Zonotope Propa...    572    90.4s   75.2%   158ms   40.8GiB   67.3%  73.1MiB
       DiffZonotope...  1.72k    80.3s   66.9%  46.8ms   38.5GiB   63.5%  23.0MiB
         Zonotope_R...  3.43k    79.6s   66.3%  23.2ms   37.6GiB   61.9%  11.2MiB
           Influenc...  3.43k    73.0s   60.7%  21.3ms   34.6GiB   56.9%  10.3MiB
             Multiply   3.43k    40.0s   33.3%  11.7ms   17.6GiB   28.9%  5.24MiB
             Alloca...  3.43k    30.5s   25.3%  8.88ms   17.0GiB   28.0%  5.07MiB
             Set Ma...  3.43k    2.48s    2.1%   724μs     0.00B    0.0%    0.00B
           Column M...  3.43k    6.35s    5.3%  1.85ms   1.50GiB    2.5%   459KiB
           Set Matrix   3.43k    189ms    0.2%  55.1μs   3.26MiB    0.0%     998B
           Allocation   3.43k   89.5ms    0.1%  26.1μs   1.50GiB    2.5%   459KiB
           Vectors      3.43k   17.9ms    0.0%  5.21μs   10.9MiB    0.0%  3.26KiB
           Bounds       3.43k   2.55ms    0.0%   743ns     0.00B    0.0%    0.00B
       DiffZonotope...  2.29k    10.0s    8.3%  4.38ms   2.31GiB    3.8%  1.03MiB
         Zonotope_D...  4.58k    4.85s    4.0%  1.06ms   1.52GiB    2.5%   347KiB
     Compute Split        572    27.5s   22.9%  48.1ms   8.62GiB   14.2%  15.4MiB
     Property Check       572    113ms    0.1%   197μs    118MiB    0.2%   211KiB
 Initialize                 1    519μs    0.0%   519μs   5.41MiB    0.0%  5.41MiB
 ────────────────────────────────────────────────────────────────────────────────
[VERYDIFF_TIMER] 120.199592663

[VERYDIFF_EXPERIMENT] NETWORK: /home/i57/steuber/NeuroDiff/repos/VeryDiffExperiments/src/../benchmarks/mnist-prune/specs/mnist_11_global_5.vnnlib
[VERYDIFF_EXPERIMENT] TIME: 120.664663091
