
[VERYDIFF_EXPERIMENT] Running on /home/i57/steuber/NeuroDiff/repos/VeryDiffExperiments/src/../benchmarks/mnist-prune/specs/mnist_27_global_6.vnnlib /home/i57/steuber/NeuroDiff/repos/VeryDiffExperiments/src/../benchmarks/mnist-prune/nets/mnist_relu_3_100.onnx
Found input X
op: matmul, weight: (100, 784), bias: nothing
op: bias, weight: nothing, bias: (100,)
op: relu, weight: nothing, bias: nothing
op: matmul, weight: (100, 100), bias: nothing
op: bias, weight: nothing, bias: (100,)
op: relu, weight: nothing, bias: nothing
op: matmul, weight: (10, 100), bias: nothing
op: bias, weight: nothing, bias: (10,)
op: relu, weight: nothing, bias: nothing
op: matmul, weight: (10, 10), bias: nothing
op: bias, weight: nothing, bias: (10,)
Found input X
op: gemm, weight: (100, 784), bias: (100,)
op: relu, weight: nothing, bias: nothing
op: gemm, weight: (100, 100), bias: (100,)
op: relu, weight: nothing, bias: nothing
op: gemm, weight: (10, 100), bias: (10,)
op: relu, weight: nothing, bias: nothing
op: gemm, weight: (10, 10), bias: (10,)
Distance: 1623.4465197373434
Distance: 201.62056963066925
Distance: 13.962962507051998
Distance: 0.183768135302671
Running with 1 threads
[Thread 1] Time to first task: 0.0s
Instable Generators: 37
Instable Generators: 58
Instable Generators: 7
Zono Bounds:
[-6.426784247992434, -0.6029327585229046, -7.44950499810528, -0.012657975842864247, -6.4171179343304505, -7.31592662970345, -7.533039310344043, -7.168522973753389, -6.298858435016225, -6.62219571761791]
[6.1590425611133375, 0.6501595810559347, 7.385121444516968, 0.03043519489411737, 7.719703633758257, 6.155580366159865, 6.958889907982315, 7.135238884935636, 5.909579695344398, 6.298647164706198]
[Thread 1] Processed 100 zonotopes (Work Done: 0.0%; Expected Zonos: Inf)
[Thread 1] Processed 200 zonotopes (Work Done: 0.0%; Expected Zonos: Inf)
[Thread 1] Processed 300 zonotopes (Work Done: 0.0%; Expected Zonos: Inf)
[Thread 1] Processed 400 zonotopes (Work Done: 0.0%; Expected Zonos: Inf)
[Thread 1] Processed 500 zonotopes (Work Done: 0.0%; Expected Zonos: Inf)


TIMEOUT REACHED
UNKNOWN
[Thread 1] Total splits: 564
Processed 564 zonotopes (Work Done: 0.0%); Generated 1128 (0.21318883290070922s/loop)
[Thread 1] Finished in 120.24s
 ────────────────────────────────────────────────────────────────────────────────
                                        Time                    Allocations      
                               ───────────────────────   ────────────────────────
       Tot / % measured:             120s / 100.0%           60.8GiB / 100.0%    

 Section               ncalls     time    %tot     avg     alloc    %tot      avg
 ────────────────────────────────────────────────────────────────────────────────
 Verify                     1     120s  100.0%    120s   60.8GiB  100.0%  60.8GiB
   Zonotope Loop            1     120s  100.0%    120s   60.8GiB  100.0%  60.8GiB
     Zonotope Propa...    564    72.4s   60.2%   128ms   41.2GiB   67.6%  74.7MiB
       DiffZonotope...  1.69k    62.4s   51.9%  36.9ms   38.9GiB   63.9%  23.5MiB
         Zonotope_R...  3.38k    61.7s   51.3%  18.2ms   37.9GiB   62.3%  11.5MiB
           Influenc...  3.38k    54.0s   44.9%  16.0ms   34.9GiB   57.3%  10.6MiB
             Alloca...  3.38k    26.1s   21.7%  7.71ms   17.1GiB   28.1%  5.17MiB
             Multiply   3.38k    25.4s   21.1%  7.51ms   17.8GiB   29.3%  5.39MiB
             Set Ma...  3.38k    2.49s    2.1%   735μs     0.00B    0.0%    0.00B
           Allocation   3.38k    7.03s    5.8%  2.08ms   1.51GiB    2.5%   467KiB
           Column M...  3.38k    462ms    0.4%   137μs   1.51GiB    2.5%   467KiB
           Set Matrix   3.38k    193ms    0.2%  56.9μs   3.77MiB    0.0%  1.14KiB
           Vectors      3.38k   17.9ms    0.0%  5.28μs   10.8MiB    0.0%  3.26KiB
           Bounds       3.38k   2.44ms    0.0%   721ns     0.00B    0.0%    0.00B
       DiffZonotope...  2.26k    9.93s    8.3%  4.40ms   2.30GiB    3.8%  1.05MiB
         Zonotope_D...  4.51k    4.79s    4.0%  1.06ms   1.50GiB    2.5%   349KiB
     Compute Split        564    31.6s   26.3%  56.0ms   8.64GiB   14.2%  15.7MiB
     Property Check       564    621ms    0.5%  1.10ms   64.9MiB    0.1%   118KiB
 Initialize                 1    569μs    0.0%   569μs   5.41MiB    0.0%  5.41MiB
 ────────────────────────────────────────────────────────────────────────────────
[VERYDIFF_TIMER] 120.28461121

[VERYDIFF_EXPERIMENT] NETWORK: /home/i57/steuber/NeuroDiff/repos/VeryDiffExperiments/src/../benchmarks/mnist-prune/specs/mnist_27_global_6.vnnlib
[VERYDIFF_EXPERIMENT] TIME: 120.749801304
