
[VERYDIFF_EXPERIMENT] Running on /home/i57/steuber/NeuroDiff/repos/VeryDiffExperiments/src/../benchmarks/mnist-prune/specs/mnist_36_global_6.vnnlib /home/i57/steuber/NeuroDiff/repos/VeryDiffExperiments/src/../benchmarks/mnist-prune/nets/mnist_relu_3_100.onnx
Found input X
op: matmul, weight: (100, 784), bias: nothing
op: bias, weight: nothing, bias: (100,)
op: relu, weight: nothing, bias: nothing
op: matmul, weight: (100, 100), bias: nothing
op: bias, weight: nothing, bias: (100,)
op: relu, weight: nothing, bias: nothing
op: matmul, weight: (10, 100), bias: nothing
op: bias, weight: nothing, bias: (10,)
op: relu, weight: nothing, bias: nothing
op: matmul, weight: (10, 10), bias: nothing
op: bias, weight: nothing, bias: (10,)
Found input X
op: gemm, weight: (100, 784), bias: (100,)
op: relu, weight: nothing, bias: nothing
op: gemm, weight: (100, 100), bias: (100,)
op: relu, weight: nothing, bias: nothing
op: gemm, weight: (10, 100), bias: (10,)
op: relu, weight: nothing, bias: nothing
op: gemm, weight: (10, 10), bias: (10,)
Distance: 1958.4889029213523
Distance: 144.28197153992141
Distance: 22.063573056613677
Distance: 0.8412832540489035
Running with 1 threads
[Thread 1] Time to first task: 0.0s
Instable Generators: 34
Instable Generators: 45
Instable Generators: 5
Zono Bounds:
[-0.0320946493673519, -5.025434592121002, -5.845787658385058, -6.053229177800461, -0.0093217286851143, -6.105628733804057, -0.009989606385671115, -6.299506322665711, -5.206347452038686, -5.982718636671963]
[-0.013720450814694609, 5.1122020464080045, 5.4706266298256665, 5.507049886887308, 0.01028448160679489, 6.055073847870251, 0.0002802213375503347, 5.374463954049133, 5.244861832236277, 5.383025175470925]
[Thread 1] Processed 100 zonotopes (Work Done: 0.0%; Expected Zonos: Inf)
[Thread 1] Processed 200 zonotopes (Work Done: 0.0%; Expected Zonos: Inf)
[Thread 1] Processed 300 zonotopes (Work Done: 0.0%; Expected Zonos: Inf)
[Thread 1] Processed 400 zonotopes (Work Done: 0.0%; Expected Zonos: Inf)
[Thread 1] Processed 500 zonotopes (Work Done: 0.0%; Expected Zonos: Inf)


TIMEOUT REACHED
UNKNOWN
[Thread 1] Total splits: 572
Processed 572 zonotopes (Work Done: 0.0%); Generated 1144 (0.2104164527185315s/loop)
[Thread 1] Finished in 120.36s
 ────────────────────────────────────────────────────────────────────────────────
                                        Time                    Allocations      
                               ───────────────────────   ────────────────────────
       Tot / % measured:             120s / 100.0%           60.9GiB / 100.0%    

 Section               ncalls     time    %tot     avg     alloc    %tot      avg
 ────────────────────────────────────────────────────────────────────────────────
 Verify                     1     120s  100.0%    120s   60.9GiB  100.0%  60.9GiB
   Zonotope Loop            1     120s  100.0%    120s   60.9GiB  100.0%  60.9GiB
     Zonotope Propa...    572    79.3s   65.9%   139ms   41.0GiB   67.3%  73.4MiB
       DiffZonotope...  1.72k    69.3s   57.6%  40.4ms   38.7GiB   63.5%  23.1MiB
         Zonotope_R...  3.43k    68.6s   57.0%  20.0ms   37.7GiB   62.0%  11.3MiB
           Influenc...  3.43k    67.6s   56.2%  19.7ms   34.7GiB   57.0%  10.4MiB
             Alloca...  3.43k    45.2s   37.5%  13.2ms   17.1GiB   28.0%  5.09MiB
             Multiply   3.43k    20.0s   16.6%  5.82ms   17.6GiB   29.0%  5.26MiB
             Set Ma...  3.43k    2.49s    2.1%   724μs     0.00B    0.0%    0.00B
           Column M...  3.43k    676ms    0.6%   197μs   1.51GiB    2.5%   461KiB
           Set Matrix   3.43k    192ms    0.2%  56.0μs   3.33MiB    0.0%  0.99KiB
           Allocation   3.43k   85.7ms    0.1%  25.0μs   1.51GiB    2.5%   461KiB
           Vectors      3.43k   18.0ms    0.0%  5.23μs   10.9MiB    0.0%  3.26KiB
           Bounds       3.43k   2.51ms    0.0%   732ns     0.00B    0.0%    0.00B
       DiffZonotope...  2.29k    10.1s    8.4%  4.39ms   2.32GiB    3.8%  1.04MiB
         Zonotope_D...  4.58k    4.86s    4.0%  1.06ms   1.52GiB    2.5%   348KiB
     Compute Split        572    38.8s   32.2%  67.7ms   8.63GiB   14.2%  15.4MiB
     Property Check       572    112ms    0.1%   196μs    118MiB    0.2%   212KiB
 Initialize                 1    554μs    0.0%   554μs   5.41MiB    0.0%  5.41MiB
 ────────────────────────────────────────────────────────────────────────────────
[VERYDIFF_TIMER] 120.398059626

[VERYDIFF_EXPERIMENT] NETWORK: /home/i57/steuber/NeuroDiff/repos/VeryDiffExperiments/src/../benchmarks/mnist-prune/specs/mnist_36_global_6.vnnlib
[VERYDIFF_EXPERIMENT] TIME: 120.869763286
