
[VERYDIFF_EXPERIMENT] Running on /home/i57/steuber/NeuroDiff/repos/VeryDiffExperiments/src/../benchmarks/mnist-prune/specs/mnist_78_global_5.vnnlib /home/i57/steuber/NeuroDiff/repos/VeryDiffExperiments/src/../benchmarks/mnist-prune/nets/mnist_relu_3_100.onnx
Parsing /home/i57/steuber/NeuroDiff/repos/VeryDiffExperiments/src/../benchmarks/mnist-prune/nets/mnist_relu_3_100.onnx...
Found input X
op: matmul, weight: (100, 784), bias: nothing
op: bias, weight: nothing, bias: (100,)
op: relu, weight: nothing, bias: nothing
op: matmul, weight: (100, 100), bias: nothing
op: bias, weight: nothing, bias: (100,)
op: relu, weight: nothing, bias: nothing
op: matmul, weight: (10, 100), bias: nothing
op: bias, weight: nothing, bias: (10,)
op: relu, weight: nothing, bias: nothing
op: matmul, weight: (10, 10), bias: nothing
op: bias, weight: nothing, bias: (10,)
Parsing /home/i57/steuber/NeuroDiff/repos/VeryDiffExperiments/src/../benchmarks/mnist-prune/nets_pruned/mnist_relu_3_100_0.79_adam_1_stepsize-old.onnx...
Found input X
op: gemm, weight: (100, 784), bias: (100,)
op: relu, weight: nothing, bias: nothing
op: gemm, weight: (100, 100), bias: (100,)
op: relu, weight: nothing, bias: nothing
op: gemm, weight: (10, 100), bias: (10,)
op: relu, weight: nothing, bias: nothing
op: gemm, weight: (10, 10), bias: (10,)
Distance: 368.62397500800625
Distance: 47.56803950402309
Distance: 2.8977568827249343
Distance: 0.01885471428334995
Running with 1 threads
[Thread 1] Time to first task: 0.0s
Instable Generators: 42
Instable Generators: 61
Instable Generators: 7
Zono Bounds:
[7.831534652590506e-5, -1.335333974392435, -1.5294741769836266, -1.583039119759678, -1.8545445578070763, -1.7911098902972005, -0.0008228271396911522, -1.6003075176505908, -1.5716710574890504, -1.4992535112980305]
[0.0007233881184833984, 1.280070498585367, 1.529625544262913, 1.4698936940953007, 1.8504992901891075, 1.6756223915216792, 0.0004857765485475941, 1.5131463862467505, 1.4752098406398184, 1.5330236978194884]
[Thread 1] Processed 100 zonotopes (Work Done: 0.0%; Expected Zonos: Inf)


TIMEOUT REACHED
UNKNOWN
[Thread 1] Total splits: 116
Processed 116 zonotopes (Work Done: 0.0%); Generated 232 (1.0418964005603448s/loop)
[Thread 1] Finished in 120.86s
 ────────────────────────────────────────────────────────────────────────────────
                                        Time                    Allocations      
                               ───────────────────────   ────────────────────────
       Tot / % measured:             121s / 100.0%           21.5GiB / 100.0%    

 Section               ncalls     time    %tot     avg     alloc    %tot      avg
 ────────────────────────────────────────────────────────────────────────────────
 Verify                     1     121s  100.0%    121s   21.5GiB  100.0%  21.5GiB
   Zonotope Loop            1     121s  100.0%    121s   21.5GiB  100.0%  21.5GiB
     Property Check       116     104s   86.0%   896ms   8.93GiB   41.5%  78.9MiB
     Zonotope Propa...    116    11.5s    9.5%  98.9ms   8.52GiB   39.6%  75.2MiB
       DiffZonotope...    348    9.67s    8.0%  27.8ms   8.05GiB   37.4%  23.7MiB
         Zonotope_R...    696    9.54s    7.9%  13.7ms   7.85GiB   36.5%  11.6MiB
           Influenc...    696    8.53s    7.1%  12.3ms   7.23GiB   33.6%  10.6MiB
             Multiply     696    4.25s    3.5%  6.11ms   3.69GiB   17.2%  5.43MiB
             Alloca...    696    3.78s    3.1%  5.43ms   3.54GiB   16.4%  5.20MiB
             Set Ma...    696    502ms    0.4%   722μs     0.00B    0.0%    0.00B
           Column M...    696    948ms    0.8%  1.36ms    319MiB    1.4%   470KiB
           Set Matrix     696   36.5ms    0.0%  52.4μs    816KiB    0.0%  1.17KiB
           Allocation     696   20.2ms    0.0%  29.1μs    319MiB    1.4%   470KiB
           Vectors        696   3.37ms    0.0%  4.84μs   2.21MiB    0.0%  3.26KiB
           Bounds         696    458μs    0.0%   658ns     0.00B    0.0%    0.00B
       DiffZonotope...    464    1.80s    1.5%  3.88ms    487MiB    2.2%  1.05MiB
         Zonotope_D...    928    880ms    0.7%   948μs    318MiB    1.4%   350KiB
     Compute Split        116    1.64s    1.4%  14.2ms   1.79GiB    8.3%  15.8MiB
 Initialize                 1    583μs    0.0%   583μs   5.41MiB    0.0%  5.41MiB
 ────────────────────────────────────────────────────────────────────────────────
[VERYDIFF_TIMER] 120.88992168

[VERYDIFF_EXPERIMENT] NETWORK: /home/i57/steuber/NeuroDiff/repos/VeryDiffExperiments/src/../benchmarks/mnist-prune/specs/mnist_78_global_5.vnnlib
[VERYDIFF_EXPERIMENT] TIME: 121.236545923
