
[VERYDIFF_EXPERIMENT] Running on /home/i57/steuber/NeuroDiff/repos/VeryDiffExperiments/src/../benchmarks/mnist-prune/specs/mnist_28_global_5.vnnlib /home/i57/steuber/NeuroDiff/repos/VeryDiffExperiments/src/../benchmarks/mnist-prune/nets/mnist_relu_2_512.onnx
Loading /home/i57/steuber/NeuroDiff/repos/VeryDiffExperiments/src/../benchmarks/mnist-prune/nets/mnist_relu_2_512.onnx and /home/i57/steuber/NeuroDiff/repos/VeryDiffExperiments/src/../benchmarks/mnist-prune/nets_pruned/mnist_relu_2_512_pruned5.onnx
INPUT SHAPE: 784

[NEQUIV] 113.08966662417379

[  13.92016726 -104.10156813  -33.72250645  -60.34250597  -91.43148522
  -64.94112913  -62.68376267  -65.52978067  -85.21785587  -55.84348551]
[  12.88106526 -102.33173557  -31.62778281  -57.32206345  -85.84299844
  -59.56326378  -57.54592064  -62.46980469  -79.12138824  -50.08571551]
NETWORKS NOT EQUIVALENT
Refined: 0 | Refine Limit: -1 | Wrong: 0 | Right: 1 | Total: 1 | Total Zonos Considered: 1 | Expected 2 (50.0%)

time: 3.470888139

[VERYDIFF_TIMER] 3.495882523

[VERYDIFF_EXPERIMENT] Running on /home/i57/steuber/NeuroDiff/repos/VeryDiffExperiments/src/../benchmarks/mnist-prune/specs/mnist_28_global_5.vnnlib /home/i57/steuber/NeuroDiff/repos/VeryDiffExperiments/src/../benchmarks/mnist-prune/nets/mnist_relu_3_100.onnx
Loading /home/i57/steuber/NeuroDiff/repos/VeryDiffExperiments/src/../benchmarks/mnist-prune/nets/mnist_relu_3_100.onnx and /home/i57/steuber/NeuroDiff/repos/VeryDiffExperiments/src/../benchmarks/mnist-prune/nets_pruned/mnist_relu_3_100_pruned5.onnx
INPUT SHAPE: 784

[NEQUIV] 8.745012889457772

[10.84410249  0.          5.42654633  0.          0.          1.52585502
  0.          0.          0.          0.56850131]
[10.34271043  0.          3.64088207  0.          0.          1.08347087
  0.          0.          0.          0.9945293 ]
NETWORKS NOT EQUIVALENT
Refined: 0 | Refine Limit: -1 | Wrong: 0 | Right: 1 | Total: 1 | Total Zonos Considered: 1 | Expected 2 (50.0%)

time: 0.573664452

[VERYDIFF_TIMER] 0.597942731

[VERYDIFF_EXPERIMENT] Running on /home/i57/steuber/NeuroDiff/repos/VeryDiffExperiments/src/../benchmarks/mnist-prune/specs/mnist_28_global_5.vnnlib /home/i57/steuber/NeuroDiff/repos/VeryDiffExperiments/src/../benchmarks/mnist-prune/nets/mnist_relu_4_1024.onnx
Loading /home/i57/steuber/NeuroDiff/repos/VeryDiffExperiments/src/../benchmarks/mnist-prune/nets/mnist_relu_4_1024.onnx and /home/i57/steuber/NeuroDiff/repos/VeryDiffExperiments/src/../benchmarks/mnist-prune/nets_pruned/mnist_relu_4_1024_pruned5.onnx
INPUT SHAPE: 784

[NEQUIV] 489.84224421118057

[34.78876192  0.         15.70714933  1.60641686  0.          0.
  0.          0.20530564  0.          0.21453585]
[29.79931231  0.         11.59641471  1.56465167  0.          0.
  0.          0.43928832  0.          0.        ]
NETWORKS NOT EQUIVALENT
Refined: 0 | Refine Limit: -1 | Wrong: 0 | Right: 1 | Total: 1 | Total Zonos Considered: 1 | Expected 2 (50.0%)

time: 40.113014771

[VERYDIFF_TIMER] 40.136806899

[VERYDIFF_EXPERIMENT] NETWORK: /home/i57/steuber/NeuroDiff/repos/VeryDiffExperiments/src/../benchmarks/mnist-prune/specs/mnist_28_global_5.vnnlib
[VERYDIFF_EXPERIMENT] TIME: 45.076542941
