Network: ./acas-prune/nets/product_ACASXU_run2a_3_4_batch_2000_ACASXU_run2a_3_4_batch_2000_pruned10_eps.onnx
Property: ./acas-prune/specs/product_prop_1_eps_0.05.vnnlib

Engine::processInputQuery: Input query (before preprocessing): 615 equations, 1220 variables
Engine::processInputQuery: Input query (after preprocessing): 1147 equations, 1660 variables

Input bounds:
	x0: [  0.6000,   0.6799] 
	x1: [ -0.5000,   0.5000] 
	x2: [ -0.5000,   0.5000] 
	x3: [  0.4500,   0.5000] 
	x4: [ -0.5000,  -0.4500] 

Branching heuristics set to LargestInterval

Engine::solve: Initial statistics

03:50:13 Statistics update:
	--- Time Statistics ---
	Total time elapsed: 246 milli (00:00:00)
		Main loop: 0 milli (00:00:00)
		Preprocessing time: 163 milli (00:00:00)
		Unknown: 83 milli (00:00:00)
	Breakdown for main loop:
		[0.00%] Simplex steps: 0 milli
		[0.00%] Explicit-basis bound tightening: 0 milli
		[0.00%] Constraint-matrix bound tightening: 0 milli
		[0.00%] Degradation checking: 0 milli
		[0.00%] Precision restoration: 0 milli
		[0.00%] Statistics handling: 0 milli
		[0.00%] Constraint-fixing steps: 0 milli
		[0.00%] Valid case splits: 0 milli. Average per split: 0.00 milli
		[0.00%] Applying stored bound-tightening: 0 milli
		[0.00%] SMT core: 0 milli
		[0.00%] Symbolic Bound Tightening: 17 milli
		[0.00%] SoI-based local search: 0 milli
		[0.00%] SoI-based local search: 0 milli
		[0.00%] Unaccounted for: 0 milli
	--- Preprocessor Statistics ---
	Number of preprocessor bound-tightening loop iterations: 8
	Number of eliminated variables: 160
	Number of constraints removed due to variable elimination: 92
	Number of equations removed due to variable elimination: 0
	--- Engine Statistics ---
	Number of main loop iterations: 1
		0 iterations were simplex steps. Total time: 0 milli. Average: 0.00 milli.
		0 iterations were constraint-fixing steps. Total time: 0 milli. Average: 0.00 milli
	Number of active piecewise-linear constraints: 477 / 509
		Constraints disabled by valid splits: 32. By SMT-originated splits: 0
	Last reported degradation: 0.0000000000. Max degradation so far: 0.0000000000. Restorations so far: 0
	Number of simplex pivots we attempted to skip because of instability: 0.
	Unstable pivots performed anyway: 0
	--- Tableau Statistics ---
	Total number of pivots performed: 0
		Real pivots: 0. Degenerate: 0 (0.00%)
		Degenerate pivots by request (e.g., to fix a PL constraint): 0 (0.00%)
		Average time per pivot: 0.00 milli
	Total number of fake pivots performed: 0
	Total number of rows added: 0. Number of merged columns: 0
	Current tableau dimensions: M = 1147, N = 2807
	--- SMT Core Statistics ---
	Total depth is 0. Total visited states: 1. Number of splits: 0. Number of pops: 0
	Max stack depth: 0
	--- Bound Tightening Statistics ---
	Number of tightened bounds: 0.
		Number of rows examined by row tightener: 0. Consequent tightenings: 0
		Number of explicit basis matrices examined by row tightener: 0. Consequent tightenings: 0
		Number of bound tightening rounds on the entire constraint matrix: 0. Consequent tightenings: 0
		Number of bound notifications sent to PL constraints: 3058. Tightenings proposed: 0
	--- Basis Factorization statistics ---
	Number of basis refactorizations: 2
	--- Projected Steepest Edge Statistics ---
	Number of iterations: 0.
	Number of resets to reference space: 1. Avg. iterations per reset: 0
	--- SBT ---
	Number of tightened bounds: 1420
	--- SoI-based local search ---
	Number of proposed phase pattern update: 0. Number of accepted update: 0 [0.00%]
	Total time (% of local search time) updating SoI phase pattern : 0 milli [0.00%]
	Total time obtaining current assignment: 0 milli [0.00%]
	Total time getting SoI phase pattern : 0 milli [0.00%]
	--- Context dependent statistics ---
	Number of pushes / pops: 0 / 0
		[0.00%] Pre-Push hook: 0 milli
		[0.00%] Push : 0 milli
		[0.00%] Post-Pop hook: 0 milli
		[0.00%] Pop : 0 milli
		[0.00%] Total context-switching time: 0 milli
	--- Proof Certificate ---
	Number of certified leaves: 0
	Number of leaves to delegate: 0

---

03:50:28 Statistics update:
	--- Time Statistics ---
	Total time elapsed: 15289 milli (00:00:15)
		Main loop: 15031 milli (00:00:15)
		Preprocessing time: 163 milli (00:00:00)
		Unknown: 95 milli (00:00:00)
	Breakdown for main loop:
		[33.14%] Simplex steps: 4981 milli
		[44.74%] Explicit-basis bound tightening: 6724 milli
		[0.00%] Constraint-matrix bound tightening: 0 milli
		[0.29%] Degradation checking: 43 milli
		[0.00%] Precision restoration: 0 milli
		[0.21%] Statistics handling: 31 milli
		[0.00%] Constraint-fixing steps: 0 milli
		[0.07%] Valid case splits: 10 milli. Average per split: 0.00 milli
		[0.03%] Applying stored bound-tightening: 4 milli
		[2.93%] SMT core: 439 milli
		[11.97%] Symbolic Bound Tightening: 1798 milli
		[12.31%] SoI-based local search: 1850 milli
		[0.00%] SoI-based local search: 0 milli
		[6.63%] Unaccounted for: 997 milli
	--- Preprocessor Statistics ---
	Number of preprocessor bound-tightening loop iterations: 8
	Number of eliminated variables: 160
	Number of constraints removed due to variable elimination: 92
	Number of equations removed due to variable elimination: 0
	--- Engine Statistics ---
	Number of main loop iterations: 10000
		9797 iterations were simplex steps. Total time: 4981 milli. Average: 0.51 milli.
		0 iterations were constraint-fixing steps. Total time: 0 milli. Average: 0.00 milli
	Number of active piecewise-linear constraints: 36 / 509
		Constraints disabled by valid splits: 472. By SMT-originated splits: 1
	Last reported degradation: 0.0000000000. Max degradation so far: 0.0000000315. Restorations so far: 0
	Number of simplex pivots we attempted to skip because of instability: 15.
	Unstable pivots performed anyway: 0
	--- Tableau Statistics ---
	Total number of pivots performed: 8713
		Real pivots: 8678. Degenerate: 35 (0.40%)
		Degenerate pivots by request (e.g., to fix a PL constraint): 0 (0.00%)
		Average time per pivot: 0.15 milli
	Total number of fake pivots performed: 374
	Total number of rows added: 0. Number of merged columns: 0
	Current tableau dimensions: M = 1147, N = 2807
	--- SMT Core Statistics ---
	Total depth is 16. Total visited states: 135. Number of splits: 70. Number of pops: 64
	Max stack depth: 20
	--- Bound Tightening Statistics ---
	Number of tightened bounds: 134013.
		Number of rows examined by row tightener: 8713. Consequent tightenings: 382
		Number of explicit basis matrices examined by row tightener: 66. Consequent tightenings: 11893
		Number of bound tightening rounds on the entire constraint matrix: 0. Consequent tightenings: 0
		Number of bound notifications sent to PL constraints: 218452. Tightenings proposed: 0
	--- Basis Factorization statistics ---
	Number of basis refactorizations: 82
	--- Projected Steepest Edge Statistics ---
	Number of iterations: 9102.
	Number of resets to reference space: 94. Avg. iterations per reset: 96
	--- SBT ---
	Number of tightened bounds: 84691
	--- SoI-based local search ---
	Number of proposed phase pattern update: 285. Number of accepted update: 268 [94.04%]
	Total time (% of local search time) updating SoI phase pattern : 23053 milli [1.25%]
	Total time obtaining current assignment: 125960 milli [6.81%]
	Total time getting SoI phase pattern : 8705 milli [0.06%]
	--- Context dependent statistics ---
	Number of pushes / pops: 162 / 146
		[0.05%] Pre-Push hook: 8 milli
		[0.00%] Push : 0 milli
		[0.06%] Post-Pop hook: 9 milli
		[0.04%] Pop : 5 milli
		[0.15%] Total context-switching time: 23 milli
	--- Proof Certificate ---
	Number of certified leaves: 0
	Number of leaves to delegate: 0

03:50:43 Statistics update:
	--- Time Statistics ---
	Total time elapsed: 30097 milli (00:00:30)
		Main loop: 29796 milli (00:00:29)
		Preprocessing time: 163 milli (00:00:00)
		Unknown: 137 milli (00:00:00)
	Breakdown for main loop:
		[34.76%] Simplex steps: 10357 milli
		[46.26%] Explicit-basis bound tightening: 13784 milli
		[0.00%] Constraint-matrix bound tightening: 0 milli
		[0.30%] Degradation checking: 89 milli
		[0.00%] Precision restoration: 0 milli
		[0.21%] Statistics handling: 63 milli
		[0.00%] Constraint-fixing steps: 0 milli
		[0.05%] Valid case splits: 15 milli. Average per split: 0.00 milli
		[0.02%] Applying stored bound-tightening: 6 milli
		[2.41%] SMT core: 718 milli
		[10.68%] Symbolic Bound Tightening: 3183 milli
		[12.20%] SoI-based local search: 3634 milli
		[0.00%] SoI-based local search: 0 milli
		[5.30%] Unaccounted for: 1578 milli
	--- Preprocessor Statistics ---
	Number of preprocessor bound-tightening loop iterations: 8
	Number of eliminated variables: 160
	Number of constraints removed due to variable elimination: 92
	Number of equations removed due to variable elimination: 0
	--- Engine Statistics ---
	Number of main loop iterations: 20000
		19642 iterations were simplex steps. Total time: 10357 milli. Average: 0.53 milli.
		0 iterations were constraint-fixing steps. Total time: 0 milli. Average: 0.00 milli
	Number of active piecewise-linear constraints: 40 / 509
		Constraints disabled by valid splits: 468. By SMT-originated splits: 1
	Last reported degradation: 0.0000000000. Max degradation so far: 0.0000000315. Restorations so far: 0
	Number of simplex pivots we attempted to skip because of instability: 16.
	Unstable pivots performed anyway: 0
	--- Tableau Statistics ---
	Total number of pivots performed: 17287
		Real pivots: 17207. Degenerate: 80 (0.46%)
		Degenerate pivots by request (e.g., to fix a PL constraint): 0 (0.00%)
		Average time per pivot: 0.15 milli
	Total number of fake pivots performed: 744
	Total number of rows added: 0. Number of merged columns: 0
	Current tableau dimensions: M = 1147, N = 2807
	--- SMT Core Statistics ---
	Total depth is 13. Total visited states: 241. Number of splits: 122. Number of pops: 118
	Max stack depth: 22
	--- Bound Tightening Statistics ---
	Number of tightened bounds: 234408.
		Number of rows examined by row tightener: 17287. Consequent tightenings: 706
		Number of explicit basis matrices examined by row tightener: 129. Consequent tightenings: 28622
		Number of bound tightening rounds on the entire constraint matrix: 0. Consequent tightenings: 0
		Number of bound notifications sent to PL constraints: 389675. Tightenings proposed: 0
	--- Basis Factorization statistics ---
	Number of basis refactorizations: 160
	--- Projected Steepest Edge Statistics ---
	Number of iterations: 18047.
	Number of resets to reference space: 148. Avg. iterations per reset: 121
	--- SBT ---
	Number of tightened bounds: 153944
	--- SoI-based local search ---
	Number of proposed phase pattern update: 685. Number of accepted update: 615 [89.78%]
	Total time (% of local search time) updating SoI phase pattern : 41022 milli [1.13%]
	Total time obtaining current assignment: 300740 milli [8.27%]
	Total time getting SoI phase pattern : 15912 milli [0.05%]
	--- Context dependent statistics ---
	Number of pushes / pops: 268 / 255
		[0.05%] Pre-Push hook: 14 milli
		[0.00%] Push : 0 milli
		[0.05%] Post-Pop hook: 14 milli
		[0.04%] Pop : 11 milli
		[0.14%] Total context-switching time: 40 milli
	--- Proof Certificate ---
	Number of certified leaves: 0
	Number of leaves to delegate: 0

03:50:57 Statistics update:
	--- Time Statistics ---
	Total time elapsed: 43825 milli (00:00:43)
		Main loop: 43570 milli (00:00:43)
		Preprocessing time: 163 milli (00:00:00)
		Unknown: 91 milli (00:00:00)
	Breakdown for main loop:
		[35.45%] Simplex steps: 15443 milli
		[42.87%] Explicit-basis bound tightening: 18677 milli
		[0.00%] Constraint-matrix bound tightening: 0 milli
		[0.31%] Degradation checking: 134 milli
		[0.00%] Precision restoration: 0 milli
		[0.22%] Statistics handling: 96 milli
		[0.00%] Constraint-fixing steps: 0 milli
		[0.05%] Valid case splits: 21 milli. Average per split: 0.00 milli
		[0.03%] Applying stored bound-tightening: 12 milli
		[2.70%] SMT core: 1175 milli
		[11.71%] Symbolic Bound Tightening: 5102 milli
		[13.98%] SoI-based local search: 6090 milli
		[0.00%] SoI-based local search: 0 milli
		[6.67%] Unaccounted for: 2906 milli
	--- Preprocessor Statistics ---
	Number of preprocessor bound-tightening loop iterations: 8
	Number of eliminated variables: 160
	Number of constraints removed due to variable elimination: 92
	Number of equations removed due to variable elimination: 0
	--- Engine Statistics ---
	Number of main loop iterations: 30000
		29375 iterations were simplex steps. Total time: 15443 milli. Average: 0.53 milli.
		0 iterations were constraint-fixing steps. Total time: 0 milli. Average: 0.00 milli
	Number of active piecewise-linear constraints: 28 / 509
		Constraints disabled by valid splits: 479. By SMT-originated splits: 2
	Last reported degradation: 0.0000000000. Max degradation so far: 0.0000000315. Restorations so far: 0
	Number of simplex pivots we attempted to skip because of instability: 32.
	Unstable pivots performed anyway: 1
	--- Tableau Statistics ---
	Total number of pivots performed: 25237
		Real pivots: 25142. Degenerate: 95 (0.38%)
		Degenerate pivots by request (e.g., to fix a PL constraint): 0 (0.00%)
		Average time per pivot: 0.15 milli
	Total number of fake pivots performed: 1139
	Total number of rows added: 0. Number of merged columns: 0
	Current tableau dimensions: M = 1147, N = 2807
	--- SMT Core Statistics ---
	Total depth is 21. Total visited states: 422. Number of splits: 214. Number of pops: 207
	Max stack depth: 22
	--- Bound Tightening Statistics ---
	Number of tightened bounds: 415434.
		Number of rows examined by row tightener: 25237. Consequent tightenings: 1030
		Number of explicit basis matrices examined by row tightener: 173. Consequent tightenings: 42467
		Number of bound tightening rounds on the entire constraint matrix: 0. Consequent tightenings: 0
		Number of bound notifications sent to PL constraints: 637871. Tightenings proposed: 0
	--- Basis Factorization statistics ---
	Number of basis refactorizations: 230
	--- Projected Steepest Edge Statistics ---
	Number of iterations: 26407.
	Number of resets to reference space: 237. Avg. iterations per reset: 111
	--- SBT ---
	Number of tightened bounds: 252615
	--- SoI-based local search ---
	Number of proposed phase pattern update: 1325. Number of accepted update: 1164 [87.85%]
	Total time (% of local search time) updating SoI phase pattern : 68434 milli [1.12%]
	Total time obtaining current assignment: 589501 milli [9.68%]
	Total time getting SoI phase pattern : 28374 milli [0.07%]
	--- Context dependent statistics ---
	Number of pushes / pops: 449 / 428
		[0.06%] Pre-Push hook: 24 milli
		[0.00%] Push : 0 milli
		[0.06%] Post-Pop hook: 24 milli
		[0.05%] Pop : 19 milli
		[0.16%] Total context-switching time: 68 milli
	--- Proof Certificate ---
	Number of certified leaves: 0
	Number of leaves to delegate: 0

03:51:11 Statistics update:
	--- Time Statistics ---
	Total time elapsed: 57805 milli (00:00:57)
		Main loop: 57510 milli (00:00:57)
		Preprocessing time: 163 milli (00:00:00)
		Unknown: 131 milli (00:00:00)
	Breakdown for main loop:
		[35.93%] Simplex steps: 20661 milli
		[41.43%] Explicit-basis bound tightening: 23826 milli
		[0.00%] Constraint-matrix bound tightening: 0 milli
		[0.31%] Degradation checking: 180 milli
		[0.00%] Precision restoration: 0 milli
		[0.22%] Statistics handling: 128 milli
		[0.00%] Constraint-fixing steps: 0 milli
		[0.06%] Valid case splits: 32 milli. Average per split: 0.00 milli
		[0.03%] Applying stored bound-tightening: 16 milli
		[2.72%] SMT core: 1561 milli
		[12.74%] Symbolic Bound Tightening: 7328 milli
		[14.55%] SoI-based local search: 8367 milli
		[0.00%] SoI-based local search: 0 milli
		[6.56%] Unaccounted for: 3773 milli
	--- Preprocessor Statistics ---
	Number of preprocessor bound-tightening loop iterations: 8
	Number of eliminated variables: 160
	Number of constraints removed due to variable elimination: 92
	Number of equations removed due to variable elimination: 0
	--- Engine Statistics ---
	Number of main loop iterations: 40000
		39178 iterations were simplex steps. Total time: 20661 milli. Average: 0.53 milli.
		0 iterations were constraint-fixing steps. Total time: 0 milli. Average: 0.00 milli
	Number of active piecewise-linear constraints: 25 / 509
		Constraints disabled by valid splits: 483. By SMT-originated splits: 1
	Last reported degradation: 0.0000000000. Max degradation so far: 0.0000000315. Restorations so far: 0
	Number of simplex pivots we attempted to skip because of instability: 34.
	Unstable pivots performed anyway: 1
	--- Tableau Statistics ---
	Total number of pivots performed: 33477
		Real pivots: 33346. Degenerate: 131 (0.39%)
		Degenerate pivots by request (e.g., to fix a PL constraint): 0 (0.00%)
		Average time per pivot: 0.15 milli
	Total number of fake pivots performed: 1629
	Total number of rows added: 0. Number of merged columns: 0
	Current tableau dimensions: M = 1147, N = 2807
	--- SMT Core Statistics ---
	Total depth is 19. Total visited states: 562. Number of splits: 279. Number of pops: 282
	Max stack depth: 22
	--- Bound Tightening Statistics ---
	Number of tightened bounds: 556365.
		Number of rows examined by row tightener: 33477. Consequent tightenings: 1199
		Number of explicit basis matrices examined by row tightener: 222. Consequent tightenings: 55063
		Number of bound tightening rounds on the entire constraint matrix: 0. Consequent tightenings: 0
		Number of bound notifications sent to PL constraints: 844705. Tightenings proposed: 0
	--- Basis Factorization statistics ---
	Number of basis refactorizations: 303
	--- Projected Steepest Edge Statistics ---
	Number of iterations: 35139.
	Number of resets to reference space: 312. Avg. iterations per reset: 112
	--- SBT ---
	Number of tightened bounds: 365713
	--- SoI-based local search ---
	Number of proposed phase pattern update: 1809. Number of accepted update: 1584 [87.56%]
	Total time (% of local search time) updating SoI phase pattern : 89759 milli [1.07%]
	Total time obtaining current assignment: 808389 milli [9.66%]
	Total time getting SoI phase pattern : 42780 milli [0.07%]
	--- Context dependent statistics ---
	Number of pushes / pops: 589 / 570
		[0.06%] Pre-Push hook: 32 milli
		[0.00%] Push : 0 milli
		[0.06%] Post-Pop hook: 33 milli
		[0.05%] Pop : 27 milli
		[0.16%] Total context-switching time: 92 milli
	--- Proof Certificate ---
	Number of certified leaves: 0
	Number of leaves to delegate: 0

03:51:25 Statistics update:
	--- Time Statistics ---
	Total time elapsed: 71825 milli (00:01:11)
		Main loop: 71521 milli (00:01:11)
		Preprocessing time: 163 milli (00:00:00)
		Unknown: 140 milli (00:00:00)
	Breakdown for main loop:
		[36.06%] Simplex steps: 25794 milli
		[41.02%] Explicit-basis bound tightening: 29340 milli
		[0.00%] Constraint-matrix bound tightening: 0 milli
		[0.32%] Degradation checking: 226 milli
		[0.00%] Precision restoration: 0 milli
		[0.22%] Statistics handling: 160 milli
		[0.00%] Constraint-fixing steps: 0 milli
		[0.05%] Valid case splits: 38 milli. Average per split: 0.00 milli
		[0.03%] Applying stored bound-tightening: 20 milli
		[2.70%] SMT core: 1929 milli
		[12.60%] Symbolic Bound Tightening: 9012 milli
		[15.53%] SoI-based local search: 11108 milli
		[0.00%] SoI-based local search: 0 milli
		[6.99%] Unaccounted for: 4999 milli
	--- Preprocessor Statistics ---
	Number of preprocessor bound-tightening loop iterations: 8
	Number of eliminated variables: 160
	Number of constraints removed due to variable elimination: 92
	Number of equations removed due to variable elimination: 0
	--- Engine Statistics ---
	Number of main loop iterations: 50000
		48966 iterations were simplex steps. Total time: 25794 milli. Average: 0.53 milli.
		0 iterations were constraint-fixing steps. Total time: 0 milli. Average: 0.00 milli
	Number of active piecewise-linear constraints: 28 / 509
		Constraints disabled by valid splits: 479. By SMT-originated splits: 2
	Last reported degradation: 0.0000000000. Max degradation so far: 0.0000000315. Restorations so far: 0
	Number of simplex pivots we attempted to skip because of instability: 35.
	Unstable pivots performed anyway: 1
	--- Tableau Statistics ---
	Total number of pivots performed: 41306
		Real pivots: 41150. Degenerate: 156 (0.38%)
		Degenerate pivots by request (e.g., to fix a PL constraint): 0 (0.00%)
		Average time per pivot: 0.15 milli
	Total number of fake pivots performed: 2046
	Total number of rows added: 0. Number of merged columns: 0
	Current tableau dimensions: M = 1147, N = 2807
	--- SMT Core Statistics ---
	Total depth is 20. Total visited states: 704. Number of splits: 350. Number of pops: 353
	Max stack depth: 22
	--- Bound Tightening Statistics ---
	Number of tightened bounds: 684619.
		Number of rows examined by row tightener: 41306. Consequent tightenings: 1569
		Number of explicit basis matrices examined by row tightener: 274. Consequent tightenings: 73515
		Number of bound tightening rounds on the entire constraint matrix: 0. Consequent tightenings: 0
		Number of bound notifications sent to PL constraints: 1037401. Tightenings proposed: 0
	--- Basis Factorization statistics ---
	Number of basis refactorizations: 371
	--- Projected Steepest Edge Statistics ---
	Number of iterations: 43386.
	Number of resets to reference space: 383. Avg. iterations per reset: 113
	--- SBT ---
	Number of tightened bounds: 451092
	--- SoI-based local search ---
	Number of proposed phase pattern update: 2531. Number of accepted update: 2233 [88.23%]
	Total time (% of local search time) updating SoI phase pattern : 112679 milli [1.01%]
	Total time obtaining current assignment: 1128337 milli [10.16%]
	Total time getting SoI phase pattern : 53917 milli [0.08%]
	--- Context dependent statistics ---
	Number of pushes / pops: 731 / 711
		[0.06%] Pre-Push hook: 40 milli
		[0.00%] Push : 0 milli
		[0.06%] Post-Pop hook: 40 milli
		[0.05%] Pop : 35 milli
		[0.16%] Total context-switching time: 116 milli
	--- Proof Certificate ---
	Number of certified leaves: 0
	Number of leaves to delegate: 0

03:51:39 Statistics update:
	--- Time Statistics ---
	Total time elapsed: 86435 milli (00:01:26)
		Main loop: 86167 milli (00:01:26)
		Preprocessing time: 163 milli (00:00:00)
		Unknown: 104 milli (00:00:00)
	Breakdown for main loop:
		[36.06%] Simplex steps: 31068 milli
		[40.39%] Explicit-basis bound tightening: 34805 milli
		[0.00%] Constraint-matrix bound tightening: 0 milli
		[0.32%] Degradation checking: 271 milli
		[0.00%] Precision restoration: 0 milli
		[0.22%] Statistics handling: 192 milli
		[0.00%] Constraint-fixing steps: 0 milli
		[0.06%] Valid case splits: 49 milli. Average per split: 0.00 milli
		[0.03%] Applying stored bound-tightening: 25 milli
		[2.80%] SMT core: 2416 milli
		[12.95%] Symbolic Bound Tightening: 11156 milli
		[15.66%] SoI-based local search: 13490 milli
		[0.00%] SoI-based local search: 0 milli
		[7.17%] Unaccounted for: 6181 milli
	--- Preprocessor Statistics ---
	Number of preprocessor bound-tightening loop iterations: 8
	Number of eliminated variables: 160
	Number of constraints removed due to variable elimination: 92
	Number of equations removed due to variable elimination: 0
	--- Engine Statistics ---
	Number of main loop iterations: 60000
		58706 iterations were simplex steps. Total time: 31068 milli. Average: 0.53 milli.
		0 iterations were constraint-fixing steps. Total time: 0 milli. Average: 0.00 milli
	Number of active piecewise-linear constraints: 177 / 509
		Constraints disabled by valid splits: 332. By SMT-originated splits: 0
	Last reported degradation: 0.0000000000. Max degradation so far: 0.0000001685. Restorations so far: 0
	Number of simplex pivots we attempted to skip because of instability: 37.
	Unstable pivots performed anyway: 1
	--- Tableau Statistics ---
	Total number of pivots performed: 49294
		Real pivots: 49132. Degenerate: 162 (0.33%)
		Degenerate pivots by request (e.g., to fix a PL constraint): 0 (0.00%)
		Average time per pivot: 0.15 milli
	Total number of fake pivots performed: 2572
	Total number of rows added: 0. Number of merged columns: 0
	Current tableau dimensions: M = 1147, N = 2807
	--- SMT Core Statistics ---
	Total depth is 8. Total visited states: 879. Number of splits: 431. Number of pops: 447
	Max stack depth: 22
	--- Bound Tightening Statistics ---
	Number of tightened bounds: 855175.
		Number of rows examined by row tightener: 49294. Consequent tightenings: 1705
		Number of explicit basis matrices examined by row tightener: 324. Consequent tightenings: 82242
		Number of bound tightening rounds on the entire constraint matrix: 0. Consequent tightenings: 0
		Number of bound notifications sent to PL constraints: 1265250. Tightenings proposed: 0
	--- Basis Factorization statistics ---
	Number of basis refactorizations: 441
	--- Projected Steepest Edge Statistics ---
	Number of iterations: 51902.
	Number of resets to reference space: 477. Avg. iterations per reset: 108
	--- SBT ---
	Number of tightened bounds: 560239
	--- SoI-based local search ---
	Number of proposed phase pattern update: 3099. Number of accepted update: 2721 [87.80%]
	Total time (% of local search time) updating SoI phase pattern : 138863 milli [1.03%]
	Total time obtaining current assignment: 1390579 milli [10.31%]
	Total time getting SoI phase pattern : 67239 milli [0.08%]
	--- Context dependent statistics ---
	Number of pushes / pops: 906 / 898
		[0.06%] Pre-Push hook: 50 milli
		[0.00%] Push : 0 milli
		[0.06%] Post-Pop hook: 51 milli
		[0.05%] Pop : 44 milli
		[0.17%] Total context-switching time: 146 milli
	--- Proof Certificate ---
	Number of certified leaves: 0
	Number of leaves to delegate: 0

03:51:53 Statistics update:
	--- Time Statistics ---
	Total time elapsed: 100119 milli (00:01:40)
		Main loop: 99846 milli (00:01:39)
		Preprocessing time: 163 milli (00:00:00)
		Unknown: 108 milli (00:00:00)
	Breakdown for main loop:
		[36.13%] Simplex steps: 36072 milli
		[40.08%] Explicit-basis bound tightening: 40020 milli
		[0.00%] Constraint-matrix bound tightening: 0 milli
		[0.32%] Degradation checking: 317 milli
		[0.00%] Precision restoration: 0 milli
		[0.22%] Statistics handling: 224 milli
		[0.00%] Constraint-fixing steps: 0 milli
		[0.06%] Valid case splits: 55 milli. Average per split: 0.00 milli
		[0.03%] Applying stored bound-tightening: 30 milli
		[2.75%] SMT core: 2745 milli
		[12.96%] Symbolic Bound Tightening: 12935 milli
		[16.07%] SoI-based local search: 16048 milli
		[0.00%] SoI-based local search: 0 milli
		[7.46%] Unaccounted for: 7445 milli
	--- Preprocessor Statistics ---
	Number of preprocessor bound-tightening loop iterations: 8
	Number of eliminated variables: 160
	Number of constraints removed due to variable elimination: 92
	Number of equations removed due to variable elimination: 0
	--- Engine Statistics ---
	Number of main loop iterations: 70000
		68514 iterations were simplex steps. Total time: 36072 milli. Average: 0.53 milli.
		0 iterations were constraint-fixing steps. Total time: 0 milli. Average: 0.00 milli
	Number of active piecewise-linear constraints: 31 / 509
		Constraints disabled by valid splits: 477. By SMT-originated splits: 1
	Last reported degradation: 0.0000000000. Max degradation so far: 0.0000001685. Restorations so far: 0
	Number of simplex pivots we attempted to skip because of instability: 48.
	Unstable pivots performed anyway: 1
	--- Tableau Statistics ---
	Total number of pivots performed: 57130
		Real pivots: 56941. Degenerate: 189 (0.33%)
		Degenerate pivots by request (e.g., to fix a PL constraint): 0 (0.00%)
		Average time per pivot: 0.15 milli
	Total number of fake pivots performed: 3062
	Total number of rows added: 0. Number of merged columns: 0
	Current tableau dimensions: M = 1147, N = 2807
	--- SMT Core Statistics ---
	Total depth is 19. Total visited states: 1013. Number of splits: 501. Number of pops: 511
	Max stack depth: 22
	--- Bound Tightening Statistics ---
	Number of tightened bounds: 981518.
		Number of rows examined by row tightener: 57130. Consequent tightenings: 1984
		Number of explicit basis matrices examined by row tightener: 376. Consequent tightenings: 98727
		Number of bound tightening rounds on the entire constraint matrix: 0. Consequent tightenings: 0
		Number of bound notifications sent to PL constraints: 1462615. Tightenings proposed: 0
	--- Basis Factorization statistics ---
	Number of basis refactorizations: 508
	--- Projected Steepest Edge Statistics ---
	Number of iterations: 60239.
	Number of resets to reference space: 541. Avg. iterations per reset: 111
	--- SBT ---
	Number of tightened bounds: 652152
	--- SoI-based local search ---
	Number of proposed phase pattern update: 3782. Number of accepted update: 3337 [88.23%]
	Total time (% of local search time) updating SoI phase pattern : 161170 milli [1.00%]
	Total time obtaining current assignment: 1696441 milli [10.57%]
	Total time getting SoI phase pattern : 78023 milli [0.08%]
	--- Context dependent statistics ---
	Number of pushes / pops: 1040 / 1021
		[0.06%] Pre-Push hook: 57 milli
		[0.00%] Push : 0 milli
		[0.06%] Post-Pop hook: 58 milli
		[0.05%] Pop : 51 milli
		[0.17%] Total context-switching time: 167 milli
	--- Proof Certificate ---
	Number of certified leaves: 0
	Number of leaves to delegate: 0

03:52:07 Statistics update:
	--- Time Statistics ---
	Total time elapsed: 114108 milli (00:01:54)
		Main loop: 113829 milli (00:01:53)
		Preprocessing time: 163 milli (00:00:00)
		Unknown: 115 milli (00:00:00)
	Breakdown for main loop:
		[36.21%] Simplex steps: 41212 milli
		[39.61%] Explicit-basis bound tightening: 45083 milli
		[0.00%] Constraint-matrix bound tightening: 0 milli
		[0.32%] Degradation checking: 363 milli
		[0.00%] Precision restoration: 0 milli
		[0.23%] Statistics handling: 256 milli
		[0.00%] Constraint-fixing steps: 0 milli
		[0.05%] Valid case splits: 60 milli. Average per split: 0.00 milli
		[0.03%] Applying stored bound-tightening: 35 milli
		[2.78%] SMT core: 3159 milli
		[13.00%] Symbolic Bound Tightening: 14793 milli
		[16.59%] SoI-based local search: 18886 milli
		[0.00%] SoI-based local search: 0 milli
		[7.79%] Unaccounted for: 8864 milli
	--- Preprocessor Statistics ---
	Number of preprocessor bound-tightening loop iterations: 8
	Number of eliminated variables: 160
	Number of constraints removed due to variable elimination: 92
	Number of equations removed due to variable elimination: 0
	--- Engine Statistics ---
	Number of main loop iterations: 80000
		78289 iterations were simplex steps. Total time: 41212 milli. Average: 0.53 milli.
		0 iterations were constraint-fixing steps. Total time: 0 milli. Average: 0.00 milli
	Number of active piecewise-linear constraints: 55 / 509
		Constraints disabled by valid splits: 453. By SMT-originated splits: 1
	Last reported degradation: 0.0000000000. Max degradation so far: 0.0000001685. Restorations so far: 0
	Number of simplex pivots we attempted to skip because of instability: 52.
	Unstable pivots performed anyway: 1
	--- Tableau Statistics ---
	Total number of pivots performed: 64895
		Real pivots: 64685. Degenerate: 210 (0.32%)
		Degenerate pivots by request (e.g., to fix a PL constraint): 0 (0.00%)
		Average time per pivot: 0.15 milli
	Total number of fake pivots performed: 3440
	Total number of rows added: 0. Number of merged columns: 0
	Current tableau dimensions: M = 1147, N = 2807
	--- SMT Core Statistics ---
	Total depth is 15. Total visited states: 1170. Number of splits: 578. Number of pops: 591
	Max stack depth: 22
	--- Bound Tightening Statistics ---
	Number of tightened bounds: 1123054.
		Number of rows examined by row tightener: 64895. Consequent tightenings: 2492
		Number of explicit basis matrices examined by row tightener: 426. Consequent tightenings: 113251
		Number of bound tightening rounds on the entire constraint matrix: 0. Consequent tightenings: 0
		Number of bound notifications sent to PL constraints: 1674539. Tightenings proposed: 0
	--- Basis Factorization statistics ---
	Number of basis refactorizations: 575
	--- Projected Steepest Edge Statistics ---
	Number of iterations: 68386.
	Number of resets to reference space: 621. Avg. iterations per reset: 110
	--- SBT ---
	Number of tightened bounds: 744941
	--- SoI-based local search ---
	Number of proposed phase pattern update: 4546. Number of accepted update: 4022 [88.47%]
	Total time (% of local search time) updating SoI phase pattern : 185171 milli [0.98%]
	Total time obtaining current assignment: 2040337 milli [10.80%]
	Total time getting SoI phase pattern : 88877 milli [0.08%]
	--- Context dependent statistics ---
	Number of pushes / pops: 1197 / 1182
		[0.06%] Pre-Push hook: 66 milli
		[0.00%] Push : 0 milli
		[0.06%] Post-Pop hook: 67 milli
		[0.05%] Pop : 59 milli
		[0.17%] Total context-switching time: 193 milli
	--- Proof Certificate ---
	Number of certified leaves: 0
	Number of leaves to delegate: 0


Engine: quitting due to timeout...

Final statistics:

03:52:13 Statistics update:
	--- Time Statistics ---
	Total time elapsed: 120002 milli (00:02:00)
		Main loop: 119735 milli (00:01:59)
		Preprocessing time: 163 milli (00:00:00)
		Unknown: 104 milli (00:00:00)
	Breakdown for main loop:
		[36.25%] Simplex steps: 43408 milli
		[39.88%] Explicit-basis bound tightening: 47754 milli
		[0.00%] Constraint-matrix bound tightening: 0 milli
		[0.32%] Degradation checking: 381 milli
		[0.00%] Precision restoration: 0 milli
		[0.23%] Statistics handling: 269 milli
		[0.00%] Constraint-fixing steps: 0 milli
		[0.05%] Valid case splits: 62 milli. Average per split: 0.00 milli
		[0.03%] Applying stored bound-tightening: 36 milli
		[2.71%] SMT core: 3248 milli
		[12.75%] Symbolic Bound Tightening: 15268 milli
		[16.41%] SoI-based local search: 19650 milli
		[0.00%] SoI-based local search: 0 milli
		[7.77%] Unaccounted for: 9305 milli
	--- Preprocessor Statistics ---
	Number of preprocessor bound-tightening loop iterations: 8
	Number of eliminated variables: 160
	Number of constraints removed due to variable elimination: 92
	Number of equations removed due to variable elimination: 0
	--- Engine Statistics ---
	Number of main loop iterations: 83953
		82193 iterations were simplex steps. Total time: 43408 milli. Average: 0.53 milli.
		0 iterations were constraint-fixing steps. Total time: 0 milli. Average: 0.00 milli
	Number of active piecewise-linear constraints: 20 / 509
		Constraints disabled by valid splits: 488. By SMT-originated splits: 1
	Last reported degradation: 0.0000000000. Max degradation so far: 0.0000022547. Restorations so far: 0
	Number of simplex pivots we attempted to skip because of instability: 55.
	Unstable pivots performed anyway: 1
	--- Tableau Statistics ---
	Total number of pivots performed: 68197
		Real pivots: 67987. Degenerate: 210 (0.31%)
		Degenerate pivots by request (e.g., to fix a PL constraint): 0 (0.00%)
		Average time per pivot: 0.15 milli
	Total number of fake pivots performed: 3583
	Total number of rows added: 0. Number of merged columns: 0
	Current tableau dimensions: M = 1147, N = 2807
	--- SMT Core Statistics ---
	Total depth is 19. Total visited states: 1206. Number of splits: 597. Number of pops: 608
	Max stack depth: 22
	--- Bound Tightening Statistics ---
	Number of tightened bounds: 1157552.
		Number of rows examined by row tightener: 68197. Consequent tightenings: 2708
		Number of explicit basis matrices examined by row tightener: 452. Consequent tightenings: 119941
		Number of bound tightening rounds on the entire constraint matrix: 0. Consequent tightenings: 0
		Number of bound notifications sent to PL constraints: 1731141. Tightenings proposed: 0
	--- Basis Factorization statistics ---
	Number of basis refactorizations: 605
	--- Projected Steepest Edge Statistics ---
	Number of iterations: 71834.
	Number of resets to reference space: 638. Avg. iterations per reset: 112
	--- SBT ---
	Number of tightened bounds: 768869
	--- SoI-based local search ---
	Number of proposed phase pattern update: 4762. Number of accepted update: 4219 [88.60%]
	Total time (% of local search time) updating SoI phase pattern : 190620 milli [0.97%]
	Total time obtaining current assignment: 2135261 milli [10.87%]
	Total time getting SoI phase pattern : 91914 milli [0.08%]
	--- Context dependent statistics ---
	Number of pushes / pops: 1233 / 1214
		[0.06%] Pre-Push hook: 68 milli
		[0.00%] Push : 0 milli
		[0.06%] Post-Pop hook: 69 milli
		[0.05%] Pop : 61 milli
		[0.17%] Total context-switching time: 199 milli
	--- Proof Certificate ---
	Number of certified leaves: 0
	Number of leaves to delegate: 0
Timeout

real	2m0,077s
user	1m59,995s
sys	0m0,264s
