
[VERYDIFF_EXPERIMENT] Running on /home/i57/steuber/NeuroDiff/repos/VeryDiffExperiments/src/../benchmarks/mnist-prune/specs/mnist_91_global_3.vnnlib /home/i57/steuber/NeuroDiff/repos/VeryDiffExperiments/src/../benchmarks/mnist-prune/nets/mnist_relu_3_100.onnx
Found input X
op: matmul, weight: (100, 784), bias: nothing
op: bias, weight: nothing, bias: (100,)
op: relu, weight: nothing, bias: nothing
op: matmul, weight: (100, 100), bias: nothing
op: bias, weight: nothing, bias: (100,)
op: relu, weight: nothing, bias: nothing
op: matmul, weight: (10, 100), bias: nothing
op: bias, weight: nothing, bias: (10,)
op: relu, weight: nothing, bias: nothing
op: matmul, weight: (10, 10), bias: nothing
op: bias, weight: nothing, bias: (10,)
Found input X
op: gemm, weight: (100, 784), bias: (100,)
op: relu, weight: nothing, bias: nothing
op: gemm, weight: (100, 100), bias: (100,)
op: relu, weight: nothing, bias: nothing
op: gemm, weight: (10, 100), bias: (10,)
op: relu, weight: nothing, bias: nothing
op: gemm, weight: (10, 10), bias: (10,)
Distance: 368.62397500800625
Distance: 47.56803950402309
Distance: 2.8977568827249343
Distance: 0.01885471428334995
Running with 1 threads
[Thread 1] Time to first task: 0.0s
Instable Generators: 27
Instable Generators: 27
Instable Generators: 4
Zono Bounds:
[-0.47694821725136755, -0.0002665493414067844, -0.514274891400524, -0.0006237623626235973, -0.41506464073131305, -0.4674721895092151, -0.3925848221536885, -0.0005987142310532052, -0.4599699837834386, 0.00010519993140772259]
[0.47203323286752247, 0.0001246285904533467, 0.41153461419831805, 2.7371412495332263e-6, 0.4119785569518672, 0.4647354135952029, 0.415467624794178, 0.0005397236420526148, 0.4276610281078665, 0.0012561776806122365]
[Thread 1] Total splits: 0
Processed 1 zonotopes (Work Done: 100.0%); Generated 0 (0.058743721s/loop)
[Thread 1] Finished in 0.06s
 ────────────────────────────────────────────────────────────────────────────────
                                        Time                    Allocations      
                               ───────────────────────   ────────────────────────
       Tot / % measured:           59.3ms / 100.0%           96.7MiB / 100.0%    

 Section               ncalls     time    %tot     avg     alloc    %tot      avg
 ────────────────────────────────────────────────────────────────────────────────
 Verify                     1   58.8ms   99.1%  58.8ms   91.3MiB   94.4%  91.3MiB
   Zonotope Loop            1   58.7ms   99.1%  58.7ms   91.3MiB   94.4%  91.3MiB
     Zonotope Propa...      1   55.6ms   93.8%  55.6ms   71.3MiB   73.8%  71.3MiB
       DiffZonotope...      3   33.5ms   56.5%  11.2ms   67.2MiB   69.5%  22.4MiB
         Zonotope_R...      6   32.8ms   55.3%  5.46ms   65.7MiB   67.9%  10.9MiB
           Influenc...      6   31.6ms   53.3%  5.27ms   60.4MiB   62.4%  10.1MiB
             Multiply       6   20.6ms   34.8%  3.43ms   30.5MiB   31.6%  5.09MiB
             Alloca...      6   6.95ms   11.7%  1.16ms   29.8MiB   30.8%  4.97MiB
             Set Ma...      6   4.05ms    6.8%   675μs     0.00B    0.0%    0.00B
           Column M...      6    683μs    1.2%   114μs   2.65MiB    2.7%   452KiB
           Set Matrix       6    288μs    0.5%  48.0μs   4.55KiB    0.0%     776B
           Allocation       6    118μs    0.2%  19.6μs   2.65MiB    2.7%   452KiB
           Vectors          6   28.0μs    0.0%  4.66μs   19.5KiB    0.0%  3.26KiB
           Bounds           6   3.65μs    0.0%   608ns     0.00B    0.0%    0.00B
       DiffZonotope...      4   22.0ms   37.2%  5.51ms   4.11MiB    4.2%  1.03MiB
         Zonotope_D...      8   8.00ms   13.5%  1.00ms   2.70MiB    2.8%   345KiB
     Property Check         1   9.61μs    0.0%  9.61μs   1.23KiB    0.0%  1.23KiB
 Initialize                 1    504μs    0.9%   504μs   5.41MiB    5.6%  5.41MiB
 ────────────────────────────────────────────────────────────────────────────────
[VERYDIFF_TIMER] 0.089247904

[VERYDIFF_EXPERIMENT] NETWORK: /home/i57/steuber/NeuroDiff/repos/VeryDiffExperiments/src/../benchmarks/mnist-prune/specs/mnist_91_global_3.vnnlib
[VERYDIFF_EXPERIMENT] TIME: 0.392008638
