
[VERYDIFF_EXPERIMENT] Running on /home/i57/steuber/NeuroDiff/repos/VeryDiffExperiments/src/../benchmarks/mnist-prune/specs/mnist_13_global_4.vnnlib /home/i57/steuber/NeuroDiff/repos/VeryDiffExperiments/src/../benchmarks/mnist-prune/nets/mnist_relu_2_512.onnx
Loading /home/i57/steuber/NeuroDiff/repos/VeryDiffExperiments/src/../benchmarks/mnist-prune/nets/mnist_relu_2_512.onnx and /home/i57/steuber/NeuroDiff/repos/VeryDiffExperiments/src/../benchmarks/mnist-prune/nets_pruned/mnist_relu_2_512_pruned5.onnx
INPUT SHAPE: 784

[NEQUIV] 67.91962502903247

[   6.02350763 -106.77833014  -48.1171495   -70.73327217  -72.83457023
  -68.53172766  -58.22555593  -52.54949291  -84.57479707  -51.77968741]
[   7.67362164 -103.65951365  -42.57135135  -69.05899223  -68.96376448
  -65.72123602  -53.99909657  -50.13512561  -75.57061923  -45.49081626]
NETWORKS NOT EQUIVALENT
Refined: 0 | Refine Limit: -1 | Wrong: 0 | Right: 1 | Total: 1 | Total Zonos Considered: 1 | Expected 2 (50.0%)

time: 3.075264685

[VERYDIFF_TIMER] 3.09970398

[VERYDIFF_EXPERIMENT] Running on /home/i57/steuber/NeuroDiff/repos/VeryDiffExperiments/src/../benchmarks/mnist-prune/specs/mnist_13_global_4.vnnlib /home/i57/steuber/NeuroDiff/repos/VeryDiffExperiments/src/../benchmarks/mnist-prune/nets/mnist_relu_3_100.onnx
Loading /home/i57/steuber/NeuroDiff/repos/VeryDiffExperiments/src/../benchmarks/mnist-prune/nets/mnist_relu_3_100.onnx and /home/i57/steuber/NeuroDiff/repos/VeryDiffExperiments/src/../benchmarks/mnist-prune/nets_pruned/mnist_relu_3_100_pruned5.onnx
INPUT SHAPE: 784
UNKNOWN
TIMEOUT
Refined: 43 | Refine Limit: 35 | Wrong: 0 | Right: 16 | Total: 16 | Total Zonos Considered: 59 | Expected 8589410335 (1.862758836285122e-07%)

time: 120.614622279

[VERYDIFF_TIMER] 120.639165217

[VERYDIFF_EXPERIMENT] Running on /home/i57/steuber/NeuroDiff/repos/VeryDiffExperiments/src/../benchmarks/mnist-prune/specs/mnist_13_global_4.vnnlib /home/i57/steuber/NeuroDiff/repos/VeryDiffExperiments/src/../benchmarks/mnist-prune/nets/mnist_relu_4_1024.onnx
Loading /home/i57/steuber/NeuroDiff/repos/VeryDiffExperiments/src/../benchmarks/mnist-prune/nets/mnist_relu_4_1024.onnx and /home/i57/steuber/NeuroDiff/repos/VeryDiffExperiments/src/../benchmarks/mnist-prune/nets_pruned/mnist_relu_4_1024_pruned5.onnx
INPUT SHAPE: 784

[NEQUIV] 362.79048368375715

[31.95529795  0.          5.73235214  0.          0.          0.
  0.          1.25121146  0.          5.1230121 ]
[2.77166870e+01 0.00000000e+00 3.68637447e+00 0.00000000e+00
 0.00000000e+00 0.00000000e+00 2.57379929e-02 2.04444033e+00
 0.00000000e+00 3.42658392e+00]
NETWORKS NOT EQUIVALENT
Refined: 0 | Refine Limit: -1 | Wrong: 0 | Right: 1 | Total: 1 | Total Zonos Considered: 1 | Expected 2 (50.0%)

time: 36.297385255

[VERYDIFF_TIMER] 36.329163803

[VERYDIFF_EXPERIMENT] NETWORK: /home/i57/steuber/NeuroDiff/repos/VeryDiffExperiments/src/../benchmarks/mnist-prune/specs/mnist_13_global_4.vnnlib
[VERYDIFF_EXPERIMENT] TIME: 160.907052511
