
[VERYDIFF_EXPERIMENT] Running on /home/i57/steuber/NeuroDiff/repos/VeryDiffExperiments/src/../benchmarks/mnist-prune/specs/mnist_62_local_24.vnnlib /home/i57/steuber/NeuroDiff/repos/VeryDiffExperiments/src/../benchmarks/mnist-prune/nets/mnist_relu_2_512.onnx
Found input X
op: matmul, weight: (512, 784), bias: nothing
op: bias, weight: nothing, bias: (512,)
op: relu, weight: nothing, bias: nothing
op: matmul, weight: (512, 512), bias: nothing
op: bias, weight: nothing, bias: (512,)
op: relu, weight: nothing, bias: nothing
op: matmul, weight: (10, 512), bias: nothing
op: bias, weight: nothing, bias: (10,)
Found input X
op: gemm, weight: (512, 784), bias: (512,)
op: relu, weight: nothing, bias: nothing
op: gemm, weight: (512, 512), bias: (512,)
op: relu, weight: nothing, bias: nothing
op: gemm, weight: (10, 512), bias: (10,)
Distance: 973.3044369037136
Distance: 481.63499746812613
Distance: 8.744412635378467
Running with 1 threads
[Thread 1] Time to first task: 0.0s
Instable Generators: 301
Instable Generators: 512
Zono Bounds:
[-39.756915531204605, -39.218488720310546, -33.93750358676111, -35.91020215827023, -38.22856696899918, -35.13950280156184, -37.56283832908792, -36.580945112823514, -31.82173992273561, -31.12643840278555]
[45.07769773541525, 43.37138440058567, 38.30146422831287, 41.042601827161796, 42.52928245637097, 38.30195494020844, 41.495135999620864, 41.35073877434287, 36.06311519908461, 35.37264249835387]

Found counterexample: ([0.0, 0.0, 0.0, 0.0, 0.0, 0.0, 0.0, 0.0, 0.0, 0.0, 0.0, 0.0, 0.0, 0.0, 0.0, 0.0, 0.0, 0.0, 0.0, 0.0, 0.0, 0.0, 0.0, 0.0, 0.0, 1.0, 0.0, 0.0, 0.0, 0.0, 0.0, 0.0, 0.0, 0.0, 0.0, 0.0, 0.0, 0.0, 0.0, 0.0, 0.0, 0.0, 0.0, 0.0, 0.0, 0.0, 0.0, 0.0, 0.0, 0.0, 0.0, 0.0, 0.0, 1.0, 0.0, 0.0, 0.0, 0.0, 0.0, 0.0, 0.0, 1.0, 0.0, 0.0, 0.0, 0.0, 0.0, 0.0, 0.0, 0.0, 0.0, 0.0, 0.0, 0.0, 0.0, 0.0, 0.0, 0.0, 0.0, 0.0, 0.0, 0.0, 0.0, 0.0, 0.0, 0.0, 0.0, 0.0, 0.0, 0.0, 0.0, 0.0, 0.0, 0.0, 0.0, 0.0, 0.0, 0.0, 0.0, 0.0, 0.0, 0.0, 1.0, 0.0, 0.0, 0.0, 0.0, 0.0, 0.0, 0.0, 0.0, 0.0, 0.0, 0.0, 0.0, 0.0, 0.0, 0.0, 0.0, 0.0, 0.0, 0.0, 0.0, 0.0, 0.0, 0.0, 0.0, 0.0, 0.0, 0.0, 0.0, 0.0, 0.0, 0.0, 0.0, 0.0, 0.0, 0.0, 0.0, 0.0, 0.0, 0.0, 0.0, 0.0, 0.0, 0.0, 0.0, 0.0, 0.0, 0.0, 0.0, 0.0, 0.0, 0.0, 0.0, 0.0, 0.0, 0.0, 0.0, 0.0, 0.0, 0.0, 0.0, 0.0, 0.0, 0.0, 0.0, 0.0, 0.0, 0.0, 0.0, 0.0, 0.0, 0.0, 0.0, 0.0, 0.0, 0.0, 0.55686277, 0.99607843, 0.80000001, 0.67450982, 0.78039217, 1.0, 0.35686275, 0.10588235, 0.00784314, 0.0, 0.0, 0.0, 0.0, 0.0, 0.0, 0.0, 0.0, 0.0, 0.0, 0.0, 0.0, 0.0, 0.0, 0.0, 0.0, 0.0, 0.0, 0.26666668, 0.87058824, 0.31764707, 0.29019609, 0.60000002, 0.72549021, 0.0, 0.92941177, 0.98039216, 0.76078433, 0.11372549, 0.0, 0.0, 0.0, 0.0, 0.0, 0.0, 0.0, 0.0, 0.0, 0.0, 0.0, 0.0, 0.0, 0.0, 0.0, 0.0, 0.0, 0.65098041, 0.76862746, 0.0, 0.0, 0.0, 0.0, 0.0, 0.0, 0.4509804, 0.31764707, 0.04313726, 0.0, 0.0, 0.0, 0.0, 0.0, 0.0, 0.0, 0.0, 0.0, 0.0, 0.0, 0.0, 0.0, 0.0, 0.0, 0.0, 0.0, 0.83529413, 0.62352943, 0.0, 0.0, 0.0, 0.0, 0.0, 0.0, 0.0, 0.0, 0.0, 0.0, 0.0, 0.0, 0.0, 0.0, 0.0, 0.0, 0.0, 0.0, 0.0, 0.0, 0.0, 0.0, 0.0, 0.0, 0.0, 0.02745098, 0.86274511, 0.4509804, 0.0, 0.0, 0.0, 0.0, 0.0, 0.0, 0.0, 0.0, 0.0, 0.0, 0.0, 0.0, 0.0, 0.0, 0.0, 0.0, 0.0, 0.0, 0.0, 0.0, 0.0, 0.0, 0.0, 0.0, 0.0, 0.13333334, 0.96470588, 0.50980395, 0.0, 0.0, 0.5, 0.0, 0.0, 0.0, 0.0, 0.0, 0.0, 0.0, 0.0, 0.0, 0.0, 0.0, 0.0, 0.0, 0.0, 0.0, 0.0, 0.0, 0.0, 0.0, 0.0, 0.0, 0.0, 0.0, 0.65882355, 0.96470588, 0.08235294, 0.0, 0.0, 0.0, 0.0, 0.5411765, 0.27058825, 0.0, 0.5, 0.0, 0.0, 0.0, 0.0, 0.0, 0.0, 0.0, 0.0, 0.0, 0.0, 0.0, 0.0, 0.0, 0.0, 0.0, 0.0, 0.0, 0.51372552, 0.99607843, 0.3882353, 0.0, 0.0, 0.0, 0.0, 0.74117649, 0.54509807, 0.0, 0.0, 0.0, 0.0, 0.0, 0.0, 0.0, 0.0, 0.0, 0.0, 0.0, 0.0, 0.0, 0.0, 0.0, 0.0, 0.0, 0.0, 0.0, 0.32156864, 0.99607843, 0.41960785, 0.0, 0.0, 0.0, 0.33333334, 0.89803922, 0.34901962, 0.0, 0.0, 0.0, 0.0, 0.0, 0.0, 0.0, 0.0, 0.0, 0.0, 0.0, 0.0, 0.0, 0.0, 0.0, 0.0, 0.0, 0.0, 0.0, 0.00784314, 0.76862746, 0.89411765, 0.04313726, 0.0, 0.0, 0.60392159, 0.99607843, 0.22352941, 0.0, 0.0, 0.0, 0.0, 0.0, 0.0, 0.0, 0.0, 0.0, 0.0, 0.0, 0.0, 0.0, 0.0, 0.0, 0.0, 0.0, 0.0, 0.0, 0.0, 1.0, 0.99607843, 0.50588238, 0.00392157, 0.03529412, 0.81176472, 1.0, 0.22352941, 0.0, 0.0, 0.0, 0.0, 0.0, 0.0, 0.0, 0.0, 0.0, 0.0, 0.0, 0.0, 0.0, 0.0, 0.0, 0.0, 0.0, 0.0, 0.0, 0.0, 0.0, 0.75686276, 0.99607843, 0.71764708, 0.73725492, 0.68627453, 0.99607843, 0.22352941, 0.0, 0.0, 0.0, 0.0, 0.0, 0.0, 0.0, 0.0, 0.0, 0.0, 0.0, 0.0, 0.0, 0.0, 0.0, 0.0, 0.0, 0.0, 0.0, 0.0, 0.0, 0.06666667, 0.45490196, 0.0, 0.08627451, 0.57254905, 0.99607843, 0.22352941, 0.0, 0.0, 0.0, 0.0, 0.0, 0.0, 0.0, 0.0, 0.0, 0.0, 0.0, 0.0, 0.0, 0.0, 0.0, 0.0, 0.0, 0.0, 0.0, 0.0, 0.0, 0.0, 0.0, 0.0, 0.0, 0.3882353, 0.99607843, 0.22352941, 0.0, 0.0, 0.0, 0.0, 0.0, 0.0, 0.0, 0.0, 0.0, 0.0, 0.0, 0.0, 0.0, 0.0, 0.0, 0.0, 0.0, 0.0, 0.0, 0.0, 0.0, 0.0, 0.0, 0.0, 0.0, 0.3882353, 0.99607843, 0.22352941, 0.0, 0.0, 0.0, 0.0, 0.0, 0.0, 0.0, 0.0, 0.0, 0.0, 0.0, 0.0, 0.0, 0.0, 0.0, 0.0, 0.0, 0.0, 0.0, 0.0, 0.0, 0.0, 0.0, 0.0, 0.0, 0.65490198, 0.99607843, 0.22352941, 0.0, 0.0, 0.0, 0.0, 0.0, 0.0, 0.0, 0.0, 0.0, 0.0, 0.0, 0.0, 0.0, 0.0, 0.0, 0.0, 0.0, 0.0, 0.0, 0.0, 0.0, 0.0, 0.0, 0.0, 0.0, 0.52941179, 0.0, 0.03137255, 0.0, 0.0, 0.0, 0.0, 0.0, 0.0, 0.0, 0.0, 0.0, 0.0, 0.0, 0.0, 0.0, 0.0, 0.0, 0.0, 0.0, 1.0, 0.0, 0.0, 0.0, 0.0, 0.0, 0.0, 0.0, 0.3882353, 0.98431373, 0.20392157, 0.0, 0.0, 0.0, 0.0, 0.0, 0.0, 0.0, 0.0, 0.0, 0.0, 0.0, 0.0, 1.0, 0.0, 0.0, 0.0, 0.0, 0.0, 0.0, 0.0, 0.0, 0.0, 0.0, 0.0, 0.0, 0.3882353, 0.96470588, 0.16078432, 0.0, 0.0, 0.0, 0.0, 0.0, 0.0, 0.0, 0.0, 0.0, 0.0, 0.0, 0.0, 0.0, 0.0, 0.0, 0.0, 0.0, 0.0, 0.0, 0.0, 0.0, 0.0, 0.0, 0.0, 0.0, 0.49411765, 0.89803922, 0.0, 0.0, 0.0, 0.0, 0.0, 0.0, 0.0, 0.0, 0.0, 0.0, 0.0, 0.0, 0.0, 0.0, 0.0, 0.0, 0.0, 1.0, 0.0, 0.5, 0.0, 0.0, 0.0, 0.0, 0.0, 0.0, 0.0, 0.0, 0.0, 0.0, 0.0, 0.0, 0.0, 0.0, 0.0, 0.0, 0.0, 0.0, 0.0, 0.0, 0.0, 0.0, 0.0, 0.0, 0.0, 0.0, 0.0, 0.0, 0.0, 0.0, 0.0, 0.0, 0.0, 0.0, 0.0, 0.0, 0.0, 0.0, 0.0, 0.0, 0.0, 0.0, 0.0, 0.0, 0.0, 0.0, 0.0], ([-55.877840318925216, -55.172369035150815, -39.39837048065774, -37.441521911715675, -41.41851934387245, -14.793683686134711, -39.32495290812511, -31.895477681973706, -21.631055450887718, -2.7931603181325615], [-54.847117622782726, -54.5916032389344, -39.5819495728566, -37.48945743720155, -41.28882670548833, -14.954367061696571, -38.55447162709087, -31.541797978244492, -21.784603816124413, -2.6059466552677333], 1.0307226961424902))
[Thread 1] Total splits: 11
Processed 12 zonotopes (Work Done: 0.0%); Generated 22 (0.04160567025s/loop)
[Thread 1] Finished in 0.5s
 ────────────────────────────────────────────────────────────────────────────────
                                        Time                    Allocations      
                               ───────────────────────   ────────────────────────
       Tot / % measured:            501ms / 100.0%            523MiB / 100.0%    

 Section               ncalls     time    %tot     avg     alloc    %tot      avg
 ────────────────────────────────────────────────────────────────────────────────
 Verify                     1    499ms   99.6%   499ms    518MiB   99.0%   518MiB
   Zonotope Loop            1    499ms   99.6%   499ms    518MiB   99.0%   518MiB
     Zonotope Propa...     12    468ms   93.4%  39.0ms    497MiB   95.1%  41.4MiB
       DiffZonotope...     36    356ms   71.1%  9.90ms   79.3MiB   15.2%  2.20MiB
         Zonotope_D...     72    128ms   25.6%  1.78ms   33.8MiB    6.5%   480KiB
       DiffZonotope...     24    111ms   22.2%  4.64ms    418MiB   79.9%  17.4MiB
         Zonotope_R...     48   70.8ms   14.1%  1.47ms    257MiB   49.2%  5.36MiB
           Column M...     48   31.2ms    6.2%   651μs    107MiB   20.5%  2.23MiB
           Influenc...     48   19.5ms    3.9%   407μs   41.1MiB    7.9%   877KiB
             Multiply      48   18.6ms    3.7%   388μs   36.1MiB    6.9%   769KiB
             Alloca...     48    653μs    0.1%  13.6μs   5.03MiB    1.0%   107KiB
             Set Ma...     48    188μs    0.0%  3.92μs     0.00B    0.0%    0.00B
           Set Matrix      48   12.8ms    2.5%   266μs    499KiB    0.1%  10.4KiB
           Allocation      48   6.06ms    1.2%   126μs    107MiB   20.5%  2.23MiB
           Vectors         48   1.01ms    0.2%  21.1μs   1.17MiB    0.2%  25.0KiB
           Bounds          48   43.5μs    0.0%   906ns     0.00B    0.0%    0.00B
     Property Check        12   27.5ms    5.5%  2.29ms   2.49MiB    0.5%   212KiB
     Compute Split         11   2.20ms    0.4%   200μs   6.54MiB    1.2%   608KiB
 Initialize                 1   1.96ms    0.4%  1.96ms   5.28MiB    1.0%  5.28MiB
 ────────────────────────────────────────────────────────────────────────────────
[VERYDIFF_TIMER] 0.532178699

[VERYDIFF_EXPERIMENT] NETWORK: /home/i57/steuber/NeuroDiff/repos/VeryDiffExperiments/src/../benchmarks/mnist-prune/specs/mnist_62_local_24.vnnlib
[VERYDIFF_EXPERIMENT] TIME: 0.831916473
