
[VERYDIFF_EXPERIMENT] Running on /home/i57/steuber/NeuroDiff/repos/VeryDiffExperiments/src/../benchmarks/mnist-prune/specs/mnist_51_global_5.vnnlib /home/i57/steuber/NeuroDiff/repos/VeryDiffExperiments/src/../benchmarks/mnist-prune/nets/mnist_relu_2_512.onnx
Parsing /home/i57/steuber/NeuroDiff/repos/VeryDiffExperiments/src/../benchmarks/mnist-prune/nets/mnist_relu_2_512.onnx...
Found input X
op: matmul, weight: (512, 784), bias: nothing
op: bias, weight: nothing, bias: (512,)
op: relu, weight: nothing, bias: nothing
op: matmul, weight: (512, 512), bias: nothing
op: bias, weight: nothing, bias: (512,)
op: relu, weight: nothing, bias: nothing
op: matmul, weight: (10, 512), bias: nothing
op: bias, weight: nothing, bias: (10,)
Parsing /home/i57/steuber/NeuroDiff/repos/VeryDiffExperiments/src/../benchmarks/mnist-prune/nets_pruned/mnist_relu_2_512_pruned5.onnx...
Found input X
op: matmul, weight: (512, 784), bias: nothing
op: bias, weight: nothing, bias: (512,)
op: relu, weight: nothing, bias: nothing
op: matmul, weight: (512, 512), bias: nothing
op: bias, weight: nothing, bias: (512,)
op: relu, weight: nothing, bias: nothing
op: matmul, weight: (10, 512), bias: nothing
op: bias, weight: nothing, bias: (10,)
Distance: 1085.5985166831802
Distance: 1719.8468985003963
Distance: 31.228482716001736
Running with 1 threads
[Thread 1] Time to first task: 0.01s
Instable Generators: 84
Instable Generators: 166
Zono Bounds:
[-8.068686039086392, -6.836399989511179, -5.892129020039111, -2.5749058398936193, -7.199151329719951, -7.839822874809343, -10.24487214398932, -7.159715304263222, -2.735942554270806, -6.249291389985364]
[5.99657319968916, 8.748154268341969, 5.314333324529113, 6.865183605577101, 6.08539076217337, 3.5519672912236513, 4.344313845862366, 4.861281707871226, 7.354733525935724, 3.767459824530959]
[Thread 1] Total splits: 0
Processed 1 zonotopes (Work Done: 100.0%); Generated 0 (0.603728128s/loop)
[Thread 1] Finished in 0.6s
 ────────────────────────────────────────────────────────────────────────────────
                                        Time                    Allocations      
                               ───────────────────────   ────────────────────────
       Tot / % measured:            606ms / 100.0%            215MiB / 100.0%    

 Section               ncalls     time    %tot     avg     alloc    %tot      avg
 ────────────────────────────────────────────────────────────────────────────────
 Verify                     1    604ms   99.6%   604ms    205MiB   95.4%   205MiB
   Zonotope Loop            1    604ms   99.6%   604ms    205MiB   95.4%   205MiB
     Property Check         1    388ms   64.1%   388ms   74.9MiB   34.9%  74.9MiB
     Zonotope Propa...      1    207ms   34.1%   207ms    110MiB   51.3%   110MiB
       DiffZonotope...      2    105ms   17.4%  52.6ms   89.8MiB   41.8%  44.9MiB
         Zonotope_R...      4   97.7ms   16.1%  24.4ms   79.1MiB   36.8%  19.8MiB
           Allocation       4   60.6ms   10.0%  15.1ms   14.9MiB    7.0%  3.74MiB
           Influenc...      4   30.0ms    5.0%  7.51ms   49.1MiB   22.9%  12.3MiB
             Multiply       4   24.8ms    4.1%  6.19ms   26.2MiB   12.2%  6.56MiB
             Set Ma...      4   2.93ms    0.5%   732μs     0.00B    0.0%    0.00B
             Alloca...      4   2.31ms    0.4%   578μs   22.9MiB   10.7%  5.72MiB
           Column M...      4   5.23ms    0.9%  1.31ms   14.9MiB    7.0%  3.74MiB
           Set Matrix       4   1.79ms    0.3%   447μs   15.9KiB    0.0%  3.98KiB
           Vectors          4   79.7μs    0.0%  19.9μs    100KiB    0.0%  25.0KiB
           Bounds           4   2.76μs    0.0%   690ns     0.00B    0.0%    0.00B
       DiffZonotope...      3    101ms   16.7%  33.8ms   20.4MiB    9.5%  6.79MiB
         Zonotope_D...      6   48.2ms    8.0%  8.03ms   13.1MiB    6.1%  2.19MiB
 Initialize                 1   2.17ms    0.4%  2.17ms   9.84MiB    4.6%  9.84MiB
 ────────────────────────────────────────────────────────────────────────────────
[VERYDIFF_TIMER] 0.635967205

[VERYDIFF_EXPERIMENT] Running on /home/i57/steuber/NeuroDiff/repos/VeryDiffExperiments/src/../benchmarks/mnist-prune/specs/mnist_51_global_5.vnnlib /home/i57/steuber/NeuroDiff/repos/VeryDiffExperiments/src/../benchmarks/mnist-prune/nets/mnist_relu_3_100.onnx
Parsing /home/i57/steuber/NeuroDiff/repos/VeryDiffExperiments/src/../benchmarks/mnist-prune/nets/mnist_relu_3_100.onnx...
Found input X
op: matmul, weight: (100, 784), bias: nothing
op: bias, weight: nothing, bias: (100,)
op: relu, weight: nothing, bias: nothing
op: matmul, weight: (100, 100), bias: nothing
op: bias, weight: nothing, bias: (100,)
op: relu, weight: nothing, bias: nothing
op: matmul, weight: (10, 100), bias: nothing
op: bias, weight: nothing, bias: (10,)
op: relu, weight: nothing, bias: nothing
op: matmul, weight: (10, 10), bias: nothing
op: bias, weight: nothing, bias: (10,)
Parsing /home/i57/steuber/NeuroDiff/repos/VeryDiffExperiments/src/../benchmarks/mnist-prune/nets_pruned/mnist_relu_3_100_pruned5.onnx...
Found input X
op: matmul, weight: (100, 784), bias: nothing
op: bias, weight: nothing, bias: (100,)
op: relu, weight: nothing, bias: nothing
op: matmul, weight: (100, 100), bias: nothing
op: bias, weight: nothing, bias: (100,)
op: relu, weight: nothing, bias: nothing
op: matmul, weight: (10, 100), bias: nothing
op: bias, weight: nothing, bias: (10,)
op: relu, weight: nothing, bias: nothing
op: matmul, weight: (10, 10), bias: nothing
op: bias, weight: nothing, bias: (10,)
Distance: 296.6600370998244
Distance: 77.24290861755458
Distance: 5.7170369567975285
Distance: 0.0
Running with 1 threads
[Thread 1] Time to first task: 0.0s
Instable Generators: 34
Instable Generators: 52
Instable Generators: 7
Zono Bounds:
[0.0, -0.6032455786242945, -1.233636338991961, -0.48655073007715977, -0.9381106995983108, -1.1643903380400138, 0.0, -1.0411525782938122, -0.7331414040702147, -0.774126594971333]
[0.0, 0.6032455786242945, 1.233636338991961, 1.1605055102415562, 0.6358521889258113, 0.5962775243443137, 0.0, 1.0411525782938122, 0.7331414040702149, 0.774126594971333]
[Thread 1] Total splits: 0
Processed 1 zonotopes (Work Done: 100.0%); Generated 0 (0.140432198s/loop)
[Thread 1] Finished in 0.14s
 ────────────────────────────────────────────────────────────────────────────────
                                        Time                    Allocations      
                               ───────────────────────   ────────────────────────
       Tot / % measured:            141ms / 100.0%            160MiB / 100.0%    

 Section               ncalls     time    %tot     avg     alloc    %tot      avg
 ────────────────────────────────────────────────────────────────────────────────
 Verify                     1    140ms   99.6%   140ms    154MiB   96.6%   154MiB
   Zonotope Loop            1    140ms   99.6%   140ms    154MiB   96.6%   154MiB
     Property Check         1   88.0ms   62.4%  88.0ms   60.2MiB   37.7%  60.2MiB
     Zonotope Propa...      1   49.1ms   34.8%  49.1ms   74.0MiB   46.4%  74.0MiB
       DiffZonotope...      3   27.7ms   19.6%  9.22ms   69.8MiB   43.8%  23.3MiB
         Zonotope_R...      6   26.7ms   19.0%  4.46ms   68.2MiB   42.7%  11.4MiB
           Influenc...      6   25.5ms   18.1%  4.24ms   62.7MiB   39.3%  10.4MiB
             Multiply       6   19.9ms   14.1%  3.32ms   31.9MiB   20.0%  5.32MiB
             Set Ma...      6   4.16ms    3.0%   694μs     0.00B    0.0%    0.00B
             Alloca...      6   1.35ms    1.0%   226μs   30.8MiB   19.3%  5.13MiB
           Column M...      6    752μs    0.5%   125μs   2.72MiB    1.7%   464KiB
           Set Matrix       6    318μs    0.2%  53.1μs   6.38KiB    0.0%  1.06KiB
           Allocation       6    151μs    0.1%  25.2μs   2.72MiB    1.7%   463KiB
           Vectors          6   29.3μs    0.0%  4.88μs   19.5KiB    0.0%  3.26KiB
           Bounds           6   3.67μs    0.0%   611ns     0.00B    0.0%    0.00B
       DiffZonotope...      4   21.4ms   15.2%  5.34ms   4.16MiB    2.6%  1.04MiB
         Zonotope_D...      8   8.38ms    5.9%  1.05ms   2.72MiB    1.7%   348KiB
 Initialize                 1    552μs    0.4%   552μs   5.41MiB    3.4%  5.41MiB
 ────────────────────────────────────────────────────────────────────────────────
[VERYDIFF_TIMER] 0.16593072

[VERYDIFF_EXPERIMENT] NETWORK: /home/i57/steuber/NeuroDiff/repos/VeryDiffExperiments/src/../benchmarks/mnist-prune/specs/mnist_51_global_5.vnnlib
[VERYDIFF_EXPERIMENT] TIME: 1.403018945
