
[VERYDIFF_EXPERIMENT] Running on /home/i57/steuber/NeuroDiff/repos/VeryDiffExperiments/src/../benchmarks/mnist-prune/specs/mnist_3_local_24.vnnlib /home/i57/steuber/NeuroDiff/repos/VeryDiffExperiments/src/../benchmarks/mnist-prune/nets/mnist_relu_3_100.onnx
Total difference: 419.1098
Average difference: 0.0047
Initial output delta:
[-1.493848 -1.307091 -1.416004 -1.428865 -1.673034 -1.593077 -1.554301 -1.865148 -1.179416 -1.415847 ]
[1.498682 1.370939 1.376577 1.544034 1.495851 1.580841 1.714953 1.740162 1.414128 1.407581 ]

No adv!
time: 10.511458 


numSplits: 37
setenv(`timeout -k 5 120 ../NeuroDiff/DiffNN-Code/delta_network_test 403 /home/i57/steuber/NeuroDiff/repos/VeryDiffExperiments/src/../benchmarks/mnist-prune/nets/mnist_relu_3_100.nnet /home/i57/steuber/NeuroDiff/repos/VeryDiffExperiments/src/../benchmarks/mnist-prune/nets_pruned/mnist_relu_3_100_0.79_adam_1_stepsize.nnet 1.0 -x 24`,["OMP_NUM_THREADS=1"])
[VERYDIFF_TIMER] 10.563756362

[VERYDIFF_EXPERIMENT] NETWORK: /home/i57/steuber/NeuroDiff/repos/VeryDiffExperiments/src/../benchmarks/mnist-prune/specs/mnist_3_local_24.vnnlib
[VERYDIFF_EXPERIMENT] TIME: 10.91640187
