
[VERYDIFF_EXPERIMENT] Running on /home/i57/steuber/NeuroDiff/repos/VeryDiffExperiments/src/../benchmarks/mnist-prune/specs/mnist_86_global_5.vnnlib /home/i57/steuber/NeuroDiff/repos/VeryDiffExperiments/src/../benchmarks/mnist-prune/nets/mnist_relu_4_1024.onnx
Found input X
op: matmul, weight: (1024, 784), bias: nothing
op: bias, weight: nothing, bias: (1024,)
op: relu, weight: nothing, bias: nothing
op: matmul, weight: (1024, 1024), bias: nothing
op: bias, weight: nothing, bias: (1024,)
op: relu, weight: nothing, bias: nothing
op: matmul, weight: (1024, 1024), bias: nothing
op: bias, weight: nothing, bias: (1024,)
op: relu, weight: nothing, bias: nothing
op: matmul, weight: (10, 1024), bias: nothing
op: bias, weight: nothing, bias: (10,)
op: relu, weight: nothing, bias: nothing
op: matmul, weight: (10, 10), bias: nothing
op: bias, weight: nothing, bias: (10,)
Found input X
op: gemm, weight: (1024, 784), bias: (1024,)
op: relu, weight: nothing, bias: nothing
op: gemm, weight: (1024, 1024), bias: (1024,)
op: relu, weight: nothing, bias: nothing
op: gemm, weight: (1024, 1024), bias: (1024,)
op: relu, weight: nothing, bias: nothing
op: gemm, weight: (10, 1024), bias: (10,)
op: relu, weight: nothing, bias: nothing
op: gemm, weight: (10, 10), bias: (10,)
Distance: 915.6394868631054
Distance: 1298.7052820973968
Distance: 1296.587532894263
Distance: 6.054483317080667
Distance: 0.04942679278974538
Running with 1 threads
[Thread 1] Time to first task: 0.01s
Instable Generators: 360
Instable Generators: 564
Instable Generators: 1002
Instable Generators: 10
Zono Bounds:
[-75.38457139363007, -76.60057321631432, -84.43681780120761, -84.13449487650787, -81.04871372970501, -86.51327985119619, -75.2455112277151, -79.27510178818915, -82.3134245240716, -84.96481326456386]
[75.38172676885824, 76.43800918627655, 84.14491470385491, 83.76303997533655, 81.00814089098904, 85.9526887090652, 75.25273119505351, 79.04109189753348, 82.35698063439484, 84.80604857686426]


TIMEOUT REACHED
UNKNOWN
[Thread 1] Total splits: 51
Processed 51 zonotopes (Work Done: 0.0%); Generated 102 (2.3984037885686273s/loop)
[Thread 1] Finished in 122.32s
 ────────────────────────────────────────────────────────────────────────────────
                                        Time                    Allocations      
                               ───────────────────────   ────────────────────────
       Tot / % measured:             122s / 100.0%           33.4GiB / 100.0%    

 Section               ncalls     time    %tot     avg     alloc    %tot      avg
 ────────────────────────────────────────────────────────────────────────────────
 Verify                     1     122s  100.0%    122s   33.4GiB   99.9%  33.4GiB
   Zonotope Loop            1     122s  100.0%    122s   33.4GiB   99.9%  33.4GiB
     Zonotope Propa...     51     117s   95.3%   2.29s   30.5GiB   91.3%   613MiB
       DiffZonotope...    204    71.6s   58.5%   351ms   25.2GiB   75.4%   127MiB
         Zonotope_R...    408    67.9s   55.5%   166ms   20.5GiB   61.2%  51.4MiB
           Influenc...    408    49.7s   40.7%   122ms   11.8GiB   35.3%  29.6MiB
             Multiply     408    35.8s   29.3%  87.9ms   6.90GiB   20.6%  17.3MiB
             Alloca...    408    13.1s   10.7%  32.2ms   4.90GiB   14.7%  12.3MiB
             Set Ma...    408    775ms    0.6%  1.90ms     0.00B    0.0%    0.00B
           Allocation     408    12.3s   10.1%  30.2ms   4.32GiB   12.9%  10.8MiB
           Column M...    408    4.99s    4.1%  12.2ms   4.32GiB   12.9%  10.8MiB
           Set Matrix     408    787ms    0.6%  1.93ms   4.96MiB    0.0%  12.5KiB
           Vectors        408   12.9ms    0.0%  31.5μs   13.5MiB    0.0%  34.0KiB
           Bounds         408    312μs    0.0%   766ns     0.00B    0.0%    0.00B
       DiffZonotope...    255    45.0s   36.8%   176ms   5.31GiB   15.9%  21.3MiB
         Zonotope_D...    510    19.5s   15.9%  38.3ms   2.86GiB    8.6%  5.75MiB
     Compute Split         51    5.35s    4.4%   105ms   1.88GiB    5.6%  37.7MiB
     Property Check        51    191ms    0.2%  3.74ms   31.5MiB    0.1%   633KiB
 Initialize                 1   14.8ms    0.0%  14.8ms   27.0MiB    0.1%  27.0MiB
 ────────────────────────────────────────────────────────────────────────────────
[VERYDIFF_TIMER] 122.41588775

[VERYDIFF_EXPERIMENT] NETWORK: /home/i57/steuber/NeuroDiff/repos/VeryDiffExperiments/src/../benchmarks/mnist-prune/specs/mnist_86_global_5.vnnlib
[VERYDIFF_EXPERIMENT] TIME: 122.705722292
