
[VERYDIFF_EXPERIMENT] Running on /home/i57/steuber/NeuroDiff/repos/VeryDiffExperiments/src/../benchmarks/mnist-prune/specs/mnist_38_global_3.vnnlib /home/i57/steuber/NeuroDiff/repos/VeryDiffExperiments/src/../benchmarks/mnist-prune/nets/mnist_relu_4_1024.onnx
Found input X
op: matmul, weight: (1024, 784), bias: nothing
op: bias, weight: nothing, bias: (1024,)
op: relu, weight: nothing, bias: nothing
op: matmul, weight: (1024, 1024), bias: nothing
op: bias, weight: nothing, bias: (1024,)
op: relu, weight: nothing, bias: nothing
op: matmul, weight: (1024, 1024), bias: nothing
op: bias, weight: nothing, bias: (1024,)
op: relu, weight: nothing, bias: nothing
op: matmul, weight: (10, 1024), bias: nothing
op: bias, weight: nothing, bias: (10,)
op: relu, weight: nothing, bias: nothing
op: matmul, weight: (10, 10), bias: nothing
op: bias, weight: nothing, bias: (10,)
Found input X
op: gemm, weight: (1024, 784), bias: (1024,)
op: relu, weight: nothing, bias: nothing
op: gemm, weight: (1024, 1024), bias: (1024,)
op: relu, weight: nothing, bias: nothing
op: gemm, weight: (1024, 1024), bias: (1024,)
op: relu, weight: nothing, bias: nothing
op: gemm, weight: (10, 1024), bias: (10,)
op: relu, weight: nothing, bias: nothing
op: gemm, weight: (10, 10), bias: (10,)
Distance: 915.6394868631054
Distance: 1298.7052820973968
Distance: 1296.587532894263
Distance: 6.054483317080667
Distance: 0.04942679278974538
Running with 1 threads
[Thread 1] Time to first task: 0.0s
Instable Generators: 247
Instable Generators: 418
Instable Generators: 735
Instable Generators: 6
Zono Bounds:
[-23.81622607942785, -24.92548854054364, -26.620247339889943, -27.24703110889785, -0.004661884715547225, -27.51504822210969, -2.1692422895678156, -24.879985319775837, -26.64822081514276, -27.248576063908153]
[23.669278520415112, 24.899388539095995, 26.553798843973873, 27.418333914765462, 0.002263526807340358, 27.336521307852955, 2.377149808188853, 24.887880671814646, 26.416300262861686, 26.96234221021296]


TIMEOUT REACHED
UNKNOWN
[Thread 1] Total splits: 64
Processed 64 zonotopes (Work Done: 0.0%); Generated 128 (1.888036270453125s/loop)
[Thread 1] Finished in 120.83s
 ────────────────────────────────────────────────────────────────────────────────
                                        Time                    Allocations      
                               ───────────────────────   ────────────────────────
       Tot / % measured:             121s / 100.0%           34.7GiB / 100.0%    

 Section               ncalls     time    %tot     avg     alloc    %tot      avg
 ────────────────────────────────────────────────────────────────────────────────
 Verify                     1     121s  100.0%    121s   34.7GiB   99.9%  34.7GiB
   Zonotope Loop            1     121s  100.0%    121s   34.7GiB   99.9%  34.7GiB
     Zonotope Propa...     64     118s   97.7%   1.84s   31.4GiB   90.6%   503MiB
       DiffZonotope...    256    60.0s   49.7%   234ms   25.6GiB   74.0%   103MiB
         Zonotope_R...    512    33.7s   27.9%  65.9ms   21.0GiB   60.6%  42.0MiB
           Influenc...    512    30.2s   25.0%  58.9ms   11.8GiB   34.2%  23.7MiB
             Multiply     512    29.0s   24.0%  56.6ms   6.73GiB   19.4%  13.5MiB
             Set Ma...    512    800ms    0.7%  1.56ms     0.00B    0.0%    0.00B
             Alloca...    512    394ms    0.3%   769μs   5.11GiB   14.7%  10.2MiB
           Column M...    512    1.99s    1.6%  3.89ms   4.57GiB   13.2%  9.13MiB
           Set Matrix     512    793ms    0.7%  1.55ms   4.68MiB    0.0%  9.36KiB
           Allocation     512    749ms    0.6%  1.46ms   4.57GiB   13.2%  9.13MiB
           Vectors        512   15.0ms    0.0%  29.3μs   17.0MiB    0.0%  34.0KiB
           Bounds         512    365μs    0.0%   713ns     0.00B    0.0%    0.00B
       DiffZonotope...    320    58.0s   48.0%   181ms   5.76GiB   16.6%  18.4MiB
         Zonotope_D...    640    33.5s   27.7%  52.4ms   3.23GiB    9.3%  5.17MiB
     Compute Split         64    1.82s    1.5%  28.5ms   1.96GiB    5.7%  31.4MiB
     Property Check        64    728ms    0.6%  11.4ms   35.5MiB    0.1%   568KiB
 Initialize                 1   15.4ms    0.0%  15.4ms   27.0MiB    0.1%  27.0MiB
 ────────────────────────────────────────────────────────────────────────────────
[VERYDIFF_TIMER] 120.930176555

[VERYDIFF_EXPERIMENT] NETWORK: /home/i57/steuber/NeuroDiff/repos/VeryDiffExperiments/src/../benchmarks/mnist-prune/specs/mnist_38_global_3.vnnlib
[VERYDIFF_EXPERIMENT] TIME: 121.284422513
