
[VERYDIFF_EXPERIMENT] Running on /home/i57/steuber/NeuroDiff/repos/VeryDiffExperiments/src/../benchmarks/mnist-prune/specs/mnist_15_local_15.vnnlib /home/i57/steuber/NeuroDiff/repos/VeryDiffExperiments/src/../benchmarks/mnist-prune/nets/mnist_relu_4_1024.onnx
Found input X
op: matmul, weight: (1024, 784), bias: nothing
op: bias, weight: nothing, bias: (1024,)
op: relu, weight: nothing, bias: nothing
op: matmul, weight: (1024, 1024), bias: nothing
op: bias, weight: nothing, bias: (1024,)
op: relu, weight: nothing, bias: nothing
op: matmul, weight: (1024, 1024), bias: nothing
op: bias, weight: nothing, bias: (1024,)
op: relu, weight: nothing, bias: nothing
op: matmul, weight: (10, 1024), bias: nothing
op: bias, weight: nothing, bias: (10,)
op: relu, weight: nothing, bias: nothing
op: matmul, weight: (10, 10), bias: nothing
op: bias, weight: nothing, bias: (10,)
Found input X
op: gemm, weight: (1024, 784), bias: (1024,)
op: relu, weight: nothing, bias: nothing
op: gemm, weight: (1024, 1024), bias: (1024,)
op: relu, weight: nothing, bias: nothing
op: gemm, weight: (1024, 1024), bias: (1024,)
op: relu, weight: nothing, bias: nothing
op: gemm, weight: (10, 1024), bias: (10,)
op: relu, weight: nothing, bias: nothing
op: gemm, weight: (10, 10), bias: (10,)
Distance: 915.6394868631054
Distance: 1298.7052820973968
Distance: 1296.587532894263
Distance: 6.054483317080667
Distance: 0.04942679278974538
Running with 1 threads
[Thread 1] Time to first task: 0.0s
Instable Generators: 415
Instable Generators: 851
Instable Generators: 1024
Instable Generators: 10
Zono Bounds:
[-113.53901136761276, -115.79678027367012, -127.98636335604361, -126.99578591244779, -121.93228931644246, -129.2996026102275, -115.29907001223744, -120.60450827461496, -123.39585272962496, -128.5569126742315]
[113.505696413714, 115.46389802791006, 127.09639179590185, 126.67440367739155, 121.88597082061482, 129.17215703588943, 115.28536057653828, 119.97954338237194, 123.21584617019396, 128.29231441774232]
[Thread 1] Processed 100 zonotopes (Work Done: 0.0%; Expected Zonos: Inf)


TIMEOUT REACHED
UNKNOWN
[Thread 1] Total splits: 145
Processed 145 zonotopes (Work Done: 0.0%); Generated 290 (0.8318973016s/loop)
[Thread 1] Finished in 120.63s
 ────────────────────────────────────────────────────────────────────────────────
                                        Time                    Allocations      
                               ───────────────────────   ────────────────────────
       Tot / % measured:             121s / 100.0%           38.2GiB / 100.0%    

 Section               ncalls     time    %tot     avg     alloc    %tot      avg
 ────────────────────────────────────────────────────────────────────────────────
 Verify                     1     121s  100.0%    121s   38.2GiB   99.9%  38.2GiB
   Zonotope Loop            1     121s  100.0%    121s   38.2GiB   99.9%  38.2GiB
     Zonotope Propa...    145     120s   99.5%   828ms   37.9GiB   99.1%   268MiB
       DiffZonotope...    580    61.1s   50.6%   105ms   30.0GiB   78.6%  53.0MiB
         Zonotope_R...  1.16k    18.8s   15.6%  16.2ms   18.5GiB   48.5%  16.4MiB
           Allocation   1.16k    10.0s    8.2%  8.58ms   7.64GiB   20.0%  6.74MiB
           Column M...  1.16k    5.07s    4.2%  4.37ms   7.64GiB   20.0%  6.74MiB
           Influenc...  1.16k    2.45s    2.0%  2.11ms   3.20GiB    8.4%  2.83MiB
             Multiply   1.16k    2.15s    1.8%  1.86ms   3.02GiB    7.9%  2.67MiB
             Alloca...  1.16k    286ms    0.2%   247μs    182MiB    0.5%   161KiB
             Set Ma...  1.16k   11.8ms    0.0%  10.1μs     0.00B    0.0%    0.00B
           Set Matrix   1.16k    1.25s    1.0%  1.08ms   14.9MiB    0.0%  13.2KiB
           Vectors      1.16k   30.7ms    0.0%  26.4μs   38.5MiB    0.1%  34.0KiB
           Bounds       1.16k    759μs    0.0%   654ns     0.00B    0.0%    0.00B
       DiffZonotope...    725    58.9s   48.9%  81.3ms   7.87GiB   20.6%  11.1MiB
         Zonotope_D...  1.45k    20.4s   16.9%  14.1ms   3.19GiB    8.4%  2.26MiB
     Property Check       145    527ms    0.4%  3.63ms   67.0MiB    0.2%   473KiB
     Compute Split        145   53.2ms    0.0%   367μs    130MiB    0.3%   915KiB
 Initialize                 1   14.4ms    0.0%  14.4ms   22.3MiB    0.1%  22.3MiB
 ────────────────────────────────────────────────────────────────────────────────
[VERYDIFF_TIMER] 120.717474883

[VERYDIFF_EXPERIMENT] NETWORK: /home/i57/steuber/NeuroDiff/repos/VeryDiffExperiments/src/../benchmarks/mnist-prune/specs/mnist_15_local_15.vnnlib
[VERYDIFF_EXPERIMENT] TIME: 121.035741367
