
[VERYDIFF_EXPERIMENT] Running on /home/i57/steuber/NeuroDiff/repos/VeryDiffExperiments/src/../benchmarks/mnist-prune/specs/mnist_40_local_18.vnnlib /home/i57/steuber/NeuroDiff/repos/VeryDiffExperiments/src/../benchmarks/mnist-prune/nets/mnist_relu_4_1024.onnx
Found input X
op: matmul, weight: (1024, 784), bias: nothing
op: bias, weight: nothing, bias: (1024,)
op: relu, weight: nothing, bias: nothing
op: matmul, weight: (1024, 1024), bias: nothing
op: bias, weight: nothing, bias: (1024,)
op: relu, weight: nothing, bias: nothing
op: matmul, weight: (1024, 1024), bias: nothing
op: bias, weight: nothing, bias: (1024,)
op: relu, weight: nothing, bias: nothing
op: matmul, weight: (10, 1024), bias: nothing
op: bias, weight: nothing, bias: (10,)
op: relu, weight: nothing, bias: nothing
op: matmul, weight: (10, 10), bias: nothing
op: bias, weight: nothing, bias: (10,)
Found input X
op: gemm, weight: (1024, 784), bias: (1024,)
op: relu, weight: nothing, bias: nothing
op: gemm, weight: (1024, 1024), bias: (1024,)
op: relu, weight: nothing, bias: nothing
op: gemm, weight: (1024, 1024), bias: (1024,)
op: relu, weight: nothing, bias: nothing
op: gemm, weight: (10, 1024), bias: (10,)
op: relu, weight: nothing, bias: nothing
op: gemm, weight: (10, 10), bias: (10,)
Distance: 915.6394868631054
Distance: 1298.7052820973968
Distance: 1296.587532894263
Distance: 6.054483317080667
Distance: 0.04942679278974538
Running with 1 threads
[Thread 1] Time to first task: 0.0s
Instable Generators: 660
Instable Generators: 1019
Instable Generators: 1024
Instable Generators: 10
Zono Bounds:
[-168.22416157270334, -171.72783561023053, -189.21967397805818, -187.74436857460776, -180.65625427771664, -191.12434234572902, -170.8153192461057, -178.71723443420893, -182.69912685435483, -190.49676264085645]
[167.8387183152629, 171.41996963758518, 188.5556955173126, 187.32867537948343, 180.52226873006447, 190.74342731703297, 170.77119287033847, 177.81932141775923, 182.83790407335673, 190.2373980664965]


TIMEOUT REACHED
UNKNOWN
[Thread 1] Total splits: 83
Processed 83 zonotopes (Work Done: 0.0%); Generated 166 (1.4477207820120483s/loop)
[Thread 1] Finished in 120.16s
 ────────────────────────────────────────────────────────────────────────────────
                                        Time                    Allocations      
                               ───────────────────────   ────────────────────────
       Tot / % measured:             120s / 100.0%           32.4GiB / 100.0%    

 Section               ncalls     time    %tot     avg     alloc    %tot      avg
 ────────────────────────────────────────────────────────────────────────────────
 Verify                     1     120s  100.0%    120s   32.3GiB   99.9%  32.3GiB
   Zonotope Loop            1     120s  100.0%    120s   32.3GiB   99.9%  32.3GiB
     Zonotope Propa...     83     120s   99.7%   1.44s   32.1GiB   99.3%   396MiB
       DiffZonotope...    415    75.2s   62.6%   181ms   7.21GiB   22.3%  17.8MiB
         Zonotope_D...    830    22.8s   19.0%  27.5ms   2.92GiB    9.0%  3.60MiB
       DiffZonotope...    332    44.6s   37.1%   134ms   24.9GiB   77.0%  76.8MiB
         Zonotope_R...    664    29.0s   24.1%  43.7ms   15.6GiB   48.2%  24.1MiB
           Allocation     664    23.1s   19.2%  34.7ms   6.19GiB   19.1%  9.55MiB
           Column M...    664    2.68s    2.2%  4.04ms   6.19GiB   19.1%  9.55MiB
           Influenc...    664    2.12s    1.8%  3.20ms   3.19GiB    9.8%  4.91MiB
             Multiply     664    2.08s    1.7%  3.13ms   3.02GiB    9.3%  4.65MiB
             Alloca...    664   29.2ms    0.0%  44.0μs    171MiB    0.5%   264KiB
             Set Ma...    664   11.3ms    0.0%  17.1μs     0.00B    0.0%    0.00B
           Set Matrix     664    1.10s    0.9%  1.66ms   10.8MiB    0.0%  16.6KiB
           Vectors        664   16.6ms    0.0%  25.0μs   22.0MiB    0.1%  34.0KiB
           Bounds         664    431μs    0.0%   648ns     0.00B    0.0%    0.00B
     Property Check        83    307ms    0.3%  3.70ms   45.8MiB    0.1%   565KiB
     Compute Split         83   42.2ms    0.0%   508μs    104MiB    0.3%  1.26MiB
 Initialize                 1   14.3ms    0.0%  14.3ms   22.4MiB    0.1%  22.4MiB
 ────────────────────────────────────────────────────────────────────────────────
[VERYDIFF_TIMER] 120.25340937

[VERYDIFF_EXPERIMENT] NETWORK: /home/i57/steuber/NeuroDiff/repos/VeryDiffExperiments/src/../benchmarks/mnist-prune/specs/mnist_40_local_18.vnnlib
[VERYDIFF_EXPERIMENT] TIME: 120.506133574
