
[VERYDIFF_EXPERIMENT] Running on /home/i57/steuber/NeuroDiff/repos/VeryDiffExperiments/src/../benchmarks/mnist-prune/specs/mnist_83_global_4.vnnlib /home/i57/steuber/NeuroDiff/repos/VeryDiffExperiments/src/../benchmarks/mnist-prune/nets/mnist_relu_2_512.onnx
Found input X
op: matmul, weight: (512, 784), bias: nothing
op: bias, weight: nothing, bias: (512,)
op: relu, weight: nothing, bias: nothing
op: matmul, weight: (512, 512), bias: nothing
op: bias, weight: nothing, bias: (512,)
op: relu, weight: nothing, bias: nothing
op: matmul, weight: (10, 512), bias: nothing
op: bias, weight: nothing, bias: (10,)
Found input X
op: matmul, weight: (512, 784), bias: nothing
op: bias, weight: nothing, bias: (512,)
op: relu, weight: nothing, bias: nothing
op: matmul, weight: (512, 512), bias: nothing
op: bias, weight: nothing, bias: (512,)
op: relu, weight: nothing, bias: nothing
op: matmul, weight: (10, 512), bias: nothing
op: bias, weight: nothing, bias: (10,)
Distance: 1085.5985166831802
Distance: 1719.8468985003963
Distance: 31.228482716001736
Running with 1 threads
[Thread 1] Time to first task: 0.02s
Zono Bounds:
[0.0, 0.0, 0.0, 0.0, 0.0, 0.0, 0.0, 0.0, 0.0, 0.0, 0.0, 0.0, 0.0, 0.0, 0.0, 0.0, 0.0, 0.0, 0.0, 0.0, 0.0, 0.0, 0.0, 0.0, 0.0, 0.0, 0.0, 0.0, 0.0, 0.0, 0.0, 0.0, 0.0, 0.0, 0.0, 0.0, 0.0, 0.0, 0.0, 0.0, 0.0, 0.0, 0.0, 0.0, 0.0, 0.0, 0.0, 0.0, 0.0, 0.0, 0.0, 0.0, 0.0, 0.0, 0.0, 0.0, 0.0, 0.0, 0.0, 0.0, 0.0, 0.0, 0.0, 0.0, 0.0, 0.0, 0.0, 0.0, 0.0, 0.0, 0.0, 0.0, 0.0, 0.0, 0.0, 0.0, 0.0, 0.0, 0.0, 0.0, 0.0, 0.0, 0.0, 0.0, 0.0, 0.0, 0.0, 0.0, 0.0, 0.0, 0.0, 0.0, 0.0, 0.0, 0.0, 0.0, 0.0, 0.0, 0.0, 0.0, 0.0, 0.0, 0.0, 0.0, 0.0, 0.0, 0.0, 0.0, 0.0, 0.0, 0.0, 0.0, 0.0, 0.0, 0.0, 0.0, 0.0, 0.0, 0.0, 0.0, 0.0, 0.0, 0.0, 0.0, 0.0, 0.0, 0.0, 0.0, 0.0, 0.0, 0.0, 0.0, 0.0, 0.0, 0.0, 0.0, 0.0, 0.0, 0.0, 0.0, 0.0, 0.0, 0.0, 0.0, 0.0, 0.0, 0.0, 0.0, 0.0, 0.0, 0.0, 0.0, 0.0, 0.0, 0.0, 0.0, 0.0, 0.0, 0.0, 0.0, 0.0, 0.0, 0.0, 0.0, 0.0, 0.0, 0.0, 0.0, 0.0, 0.0, 0.0, 0.0, 0.0, 0.0, 0.0, 0.0, 0.0, 0.0, 0.0, 0.0, 0.0, 0.0, 0.0, 0.0, 0.0, 0.0, 0.0, 0.0, 0.0, 0.0, 0.0, 0.0, 0.0, 0.0, 0.0, 0.0, 0.0, 0.0, 0.0, 0.0, 0.0, 0.0, 0.0, 0.0, 0.0, 0.0, 0.0, 0.0, 0.0, 0.0, 0.0, 0.0, 0.0, 0.0, 0.0, 0.0, 0.0, 0.0, 0.0, 0.0, 0.0, 0.0, 0.0, 0.0, 0.0, 0.0, 0.0, 0.0, 0.0, 0.0, 0.0, 0.0, 0.0, 0.0, 0.0, 0.0, 0.0, 0.0, 0.0, 0.0, 0.0, 0.0, 0.0, 0.0, 0.0, 0.0, 0.0, 0.0, 0.0, 0.0, 0.0, 0.0, 0.0, 0.0, 0.0, 0.0, 0.0, 0.0, 0.0, 0.0, 0.0, 0.0, 0.0, 0.0, 0.0, 0.0, 0.0, 0.0, 0.0, 0.0, 0.0, 0.0, 0.0, 0.0, 0.0, 0.0, 0.0, 0.0, 0.0, 0.0, 0.0, 0.0, 0.0, 0.0, 0.0, 0.0, 0.0, 0.0, 0.0, 0.0, 0.0, 0.0, 0.0, 0.0, 0.0, 0.0, 0.0, 0.0, 0.0, 0.0, 0.0, 0.0, 0.0, 0.0, 0.0, 0.0, 0.0, 0.0, 0.0, 0.0, 0.0, 0.0, 0.0, 0.0, 0.0, 0.0, 0.0, 0.0, 0.0, 0.0, 0.0, 0.0, 0.0, 0.0, 0.0, 0.0, 0.0, 0.0, 0.0, 0.0, 0.0, 0.0, 0.0, 0.0, 0.0, 0.0, 0.0, 0.0, 0.0, 0.0, 0.0, 0.0, 0.0, 0.0, 0.0, 0.0, 0.0, 0.0, 0.0, 0.0, 0.0, 0.0, 0.0, 0.0, 0.0, 0.0, 0.0, 0.0, 0.0, 0.0, 0.0, 0.0, 0.0, 0.0, 0.0, 0.0, 0.0, 0.0, 0.0, 0.0, 0.0, 0.0, 0.0, 0.0, 0.0, 0.0, 0.0, 0.0, 0.0, 0.0, 0.0, 0.0, 0.0, 0.0, 0.0, 0.0, 0.0, 0.0, 0.0, 0.0, 0.0, 0.0, 0.0, 0.0, 0.0, 0.0, 0.0, 0.0, 0.0, 0.0, 0.0, 0.0, 0.0, 0.0, 0.0, 0.0, 0.0, 0.0, 0.0, 0.0, 0.0, 0.0, 0.0, 0.0, 0.0, 0.0, 0.0, 0.0, 0.0, 0.0, 0.0, 0.0, 0.0, 0.0, 0.0, 0.0, 0.0, 0.0, 0.0, 0.0, 0.0, 0.0, 0.0, 0.0, 0.0, 0.0, 0.0, 0.0, 0.0, 0.0, 0.0, 0.0, 0.0, 0.0, 0.0, 0.0, 0.0, 0.0, 0.0, 0.0, 0.0, 0.0, 0.0, 0.0, 0.0, 0.0, 0.0, 0.0, 0.0, 0.0, 0.0, 0.0, 0.0, 0.0, 0.0, 0.0, 0.0, 0.0, 0.0, 0.0, 0.0, 0.0, 0.0, 0.0, 0.0, 0.0, 0.0, 0.0, 0.0, 0.0, 0.0, 0.0, 0.0, 0.0, 0.0, 0.0, 0.0, 0.0, 0.0, 0.0, 0.0, 0.0, 0.0, 0.0, 0.0, 0.0, 0.0, 0.0, 0.0, 0.0, 0.0, 0.0, 0.0, 0.0, 0.0, 0.0, 0.0, 0.0, 0.0, 0.0, 0.0, 0.0, 0.0, 0.0, 0.0, 0.0, 0.0, 0.0, 0.0, 0.0, 0.0, 0.0, 0.0, 0.0, 0.0, 0.0, 0.0, 0.0, 0.0, 0.0, 0.0, 0.0, 0.0, 0.0, 0.0, 0.0, 0.0, 0.0, 0.0, 0.0, 0.0, 0.0, 0.0, 0.0, 0.0, 0.0, 0.0, 0.0, 0.0, 0.0, 0.0, 0.0, 0.0, 0.0, 0.0, 0.0, 0.0, 0.0, 0.0, 0.0, 0.0, 0.0, 0.0, 0.0, 0.0, 0.0, 0.0, 0.0, 0.0, 0.0, 0.0, 0.0, 0.0, 0.0, 0.0, 0.0, 0.0, 0.0, 0.0, 0.0, 0.0, 0.0, 0.0, 0.0, 0.0, 0.0, 0.0, 0.0, 0.0, 0.0, 0.0, 0.0, 0.0, 0.0, 0.0, 0.0, 0.0, 0.0, 0.0, 0.0, 0.0, 0.0, 0.0, 0.0, 0.0, 0.0, 0.0, 0.0, 0.0, 0.0, 0.0, 0.0, 0.0, 0.0, 0.0, 0.0, 0.0, 0.0, 0.0, 0.0, 0.0, 0.0, 0.0, 0.0, 0.0, 0.0, 0.0, 0.0, 0.0, 0.0, 0.0, 0.0, 0.0, 0.0, 0.0, 0.0, 0.0, 0.0, 0.0, 0.0, 0.0, 0.0, 0.0, 0.0, 0.0, 0.0, 0.0, 0.0, 0.0, 0.0, 0.0, 0.0, 0.0, 0.0, 0.0, 0.0, 0.0, 0.0, 0.0, 0.0, 0.0, 0.0, 0.0, 0.0, 0.0, 0.0, 0.0, 0.0, 0.0, 0.0, 0.0, 0.0, 0.0, 0.0, 0.0, 0.0, 0.0, 0.0, 0.0, 0.0, 0.0, 0.0, 0.0, 0.0, 0.0, 0.0, 0.0, 0.0, 0.0, 0.0, 0.0, 0.0, 0.0, 0.0, 0.0, 0.0, 0.0, 0.0, 0.0, 0.0, 0.0, 0.0, 0.0, 0.0, 0.0, 0.0, 0.0, 0.0, 0.0, 0.0, 0.0, 0.0, 0.0, 0.0, 0.0, 0.0, 0.0, 0.0, 0.0, 0.0, 0.0, 0.0, 0.0, 0.0, 0.0, 0.0, 0.0, 0.0, 0.0, 0.0, 0.0, 0.0, 0.0, 0.0, 0.0, 0.0, 0.0, 0.0, 0.0, 0.0, 0.0, 0.0, 0.0, 0.0, 0.0, 0.0, 0.0, 0.0, 0.0, 0.0, 0.0, 0.0, 0.0, 0.0, 0.0, 0.0, 0.0, 0.0, 0.0, 0.0, 0.0, 0.0, 0.0, 0.0, 0.0, 0.0, 0.0, 0.0, 0.0, 0.0, 0.0, 0.0, 0.0, 0.0, 0.0, 0.0, 0.0, 0.0, 0.0, 0.0, 0.0, 0.0, 0.0, 0.0]
[0.0, 0.0, 0.0, 0.0, 0.0, 0.0, 0.0, 0.0, 0.0, 0.0, 0.0, 0.0, 0.0, 0.0, 0.0, 0.0, 0.0, 0.0, 0.0, 0.0, 0.0, 0.0, 0.0, 0.0, 0.0, 0.0, 0.0, 0.0, 0.0, 0.0, 0.0, 0.0, 0.0, 0.0, 0.0, 0.0, 0.0, 0.0, 0.0, 0.0, 0.0, 0.0, 0.0, 0.0, 0.0, 0.0, 0.0, 0.0, 0.0, 0.0, 0.0, 0.0, 0.0, 0.0, 0.0, 0.0, 0.0, 0.0, 0.0, 0.0, 0.0, 0.0, 0.0, 0.0, 0.0, 0.0, 0.0, 0.0, 0.0, 0.0, 0.0, 0.0, 0.0, 0.0, 0.0, 0.0, 0.0, 0.0, 0.0, 0.0, 0.0, 0.0, 0.0, 0.0, 0.0, 0.0, 0.0, 0.0, 0.0, 0.0, 0.0, 0.0, 0.0, 0.0, 0.0, 0.0, 0.0, 0.0, 0.0, 0.0, 0.0, 0.0, 0.0, 0.0, 0.0, 0.0, 0.0, 0.0, 0.0, 0.0, 0.0, 0.0, 0.0, 0.0, 0.0, 0.0, 0.0, 0.0, 0.0, 0.0, 0.0, 0.0, 0.0, 0.0, 0.0, 0.0, 0.0, 0.0, 0.0, 0.0, 0.0, 0.0, 0.0, 0.0, 0.0, 0.0, 0.0, 0.0, 0.0, 0.0, 0.0, 0.0, 0.0, 0.0, 0.0, 0.0, 0.0, 0.0, 0.0, 0.0, 0.0, 0.0, 0.0, 0.0, 0.0, 0.0, 0.0, 0.0, 0.0, 0.0, 0.0, 0.0, 0.0, 0.0, 0.0, 0.0, 0.0, 0.0, 0.0, 0.0, 0.0, 0.0, 0.0, 0.0, 0.0, 0.0, 0.0, 0.0, 0.0, 0.0, 0.0, 0.0, 0.0, 0.0, 0.0, 0.0, 0.0, 0.0, 0.0, 0.0, 0.0, 0.0, 0.0, 0.0, 0.0, 0.0, 0.0, 0.0, 0.0, 0.0, 0.0, 0.0, 0.0, 0.0, 0.0, 0.0, 0.0, 0.0, 0.0, 0.0, 0.0, 0.0, 0.0, 0.0, 0.0, 0.0, 0.0, 0.0, 0.0, 0.0, 0.0, 0.0, 0.0, 0.0, 0.0, 0.0, 0.0, 0.0, 0.0, 0.0, 0.0, 0.0, 0.0, 0.0, 0.0, 0.0, 0.0, 0.0, 0.0, 0.0, 0.0, 0.0, 0.0, 0.0, 0.0, 0.0, 0.0, 0.0, 0.0, 0.0, 0.0, 0.0, 0.0, 0.0, 0.0, 0.0, 0.0, 0.0, 0.0, 0.0, 0.0, 0.0, 0.0, 0.0, 0.0, 0.0, 0.0, 0.0, 0.0, 0.0, 0.0, 0.0, 0.0, 0.0, 0.0, 0.0, 0.0, 0.0, 0.0, 0.0, 0.0, 0.0, 0.0, 0.0, 0.0, 0.0, 0.0, 0.0, 0.0, 0.0, 0.0, 0.0, 0.0, 0.0, 0.0, 0.0, 0.0, 0.0, 0.0, 0.0, 0.0, 0.0, 0.0, 0.0, 0.0, 0.0, 0.0, 0.0, 0.0, 0.0, 0.0, 0.0, 0.0, 0.0, 0.0, 0.0, 0.0, 0.0, 0.0, 0.0, 0.0, 0.0, 0.0, 0.0, 0.0, 0.0, 0.0, 0.0, 0.0, 0.0, 0.0, 0.0, 0.0, 0.0, 0.0, 0.0, 0.0, 0.0, 0.0, 0.0, 0.0, 0.0, 0.0, 0.0, 0.0, 0.0, 0.0, 0.0, 0.0, 0.0, 0.0, 0.0, 0.0, 0.0, 0.0, 0.0, 0.0, 0.0, 0.0, 0.0, 0.0, 0.0, 0.0, 0.0, 0.0, 0.0, 0.0, 0.0, 0.0, 0.0, 0.0, 0.0, 0.0, 0.0, 0.0, 0.0, 0.0, 0.0, 0.0, 0.0, 0.0, 0.0, 0.0, 0.0, 0.0, 0.0, 0.0, 0.0, 0.0, 0.0, 0.0, 0.0, 0.0, 0.0, 0.0, 0.0, 0.0, 0.0, 0.0, 0.0, 0.0, 0.0, 0.0, 0.0, 0.0, 0.0, 0.0, 0.0, 0.0, 0.0, 0.0, 0.0, 0.0, 0.0, 0.0, 0.0, 0.0, 0.0, 0.0, 0.0, 0.0, 0.0, 0.0, 0.0, 0.0, 0.0, 0.0, 0.0, 0.0, 0.0, 0.0, 0.0, 0.0, 0.0, 0.0, 0.0, 0.0, 0.0, 0.0, 0.0, 0.0, 0.0, 0.0, 0.0, 0.0, 0.0, 0.0, 0.0, 0.0, 0.0, 0.0, 0.0, 0.0, 0.0, 0.0, 0.0, 0.0, 0.0, 0.0, 0.0, 0.0, 0.0, 0.0, 0.0, 0.0, 0.0, 0.0, 0.0, 0.0, 0.0, 0.0, 0.0, 0.0, 0.0, 0.0, 0.0, 0.0, 0.0, 0.0, 0.0, 0.0, 0.0, 0.0, 0.0, 0.0, 0.0, 0.0, 0.0, 0.0, 0.0, 0.0, 0.0, 0.0, 0.0, 0.0, 0.0, 0.0, 0.0, 0.0, 0.0, 0.0, 0.0, 0.0, 0.0, 0.0, 0.0, 0.0, 0.0, 0.0, 0.0, 0.0, 0.0, 0.0, 0.0, 0.0, 0.0, 0.0, 0.0, 0.0, 0.0, 0.0, 0.0, 0.0, 0.0, 0.0, 0.0, 0.0, 0.0, 0.0, 0.0, 0.0, 0.0, 0.0, 0.0, 0.0, 0.0, 0.0, 0.0, 0.0, 0.0, 0.0, 0.0, 0.0, 0.0, 0.0, 0.0, 0.0, 0.0, 0.0, 0.0, 0.0, 0.0, 0.0, 0.0, 0.0, 0.0, 0.0, 0.0, 0.0, 0.0, 0.0, 0.0, 0.0, 0.0, 0.0, 0.0, 0.0, 0.0, 0.0, 0.0, 0.0, 0.0, 0.0, 0.0, 0.0, 0.0, 0.0, 0.0, 0.0, 0.0, 0.0, 0.0, 0.0, 0.0, 0.0, 0.0, 0.0, 0.0, 0.0, 0.0, 0.0, 0.0, 0.0, 0.0, 0.0, 0.0, 0.0, 0.0, 0.0, 0.0, 0.0, 0.0, 0.0, 0.0, 0.0, 0.0, 0.0, 0.0, 0.0, 0.0, 0.0, 0.0, 0.0, 0.0, 0.0, 0.0, 0.0, 0.0, 0.0, 0.0, 0.0, 0.0, 0.0, 0.0, 0.0, 0.0, 0.0, 0.0, 0.0, 0.0, 0.0, 0.0, 0.0, 0.0, 0.0, 0.0, 0.0, 0.0, 0.0, 0.0, 0.0, 0.0, 0.0, 0.0, 0.0, 0.0, 0.0, 0.0, 0.0, 0.0, 0.0, 0.0, 0.0, 0.0, 0.0, 0.0, 0.0, 0.0, 0.0, 0.0, 0.0, 0.0, 0.0, 0.0, 0.0, 0.0, 0.0, 0.0, 0.0, 0.0, 0.0, 0.0, 0.0, 0.0, 0.0, 0.0, 0.0, 0.0, 0.0, 0.0, 0.0, 0.0, 0.0, 0.0, 0.0, 0.0, 0.0, 0.0, 0.0, 0.0, 0.0, 0.0, 0.0, 0.0, 0.0, 0.0, 0.0, 0.0, 0.0, 0.0, 0.0, 0.0, 0.0, 0.0, 0.0, 0.0, 0.0, 0.0, 0.0, 0.0, 0.0, 0.0, 0.0, 0.0, 0.0, 0.0, 0.0, 0.0, 0.0, 0.0, 0.0, 0.0, 0.0, 0.0, 0.0, 0.0, 0.0, 0.0, 0.0, 0.0, 0.0, 0.0, 0.0, 0.0, 0.0, 0.0, 0.0, 0.0, 0.0, 0.0, 0.0, 0.0, 0.0, 0.0, 0.0, 0.0, 0.0, 0.0, 0.0, 0.0, 0.0, 0.0, 0.0, 0.0, 0.0, 0.0, 0.0, 0.0, 0.0, 0.0, 0.0, 0.0, 0.0, 0.0, 0.0, 0.0, 0.0, 0.0, 0.0, 0.0, 0.0, 0.0, 0.0, 0.0, 0.0, 0.0, 0.0, 0.0, 0.0, 0.0, 0.0, 0.0, 0.0, 0.0]

Found counterexample: ([0.00784314, 0.00784314, 0.00784314, 0.00784314, 0.00784314, 0.00784314, 0.00784314, 0.00784314, 0.00784314, 0.00784314, 0.00784314, 0.00784314, 0.00784314, 0.00784314, 0.00784314, 0.00784314, 0.00784314, 0.00784314, 0.00784314, 0.00784314, 0.00784314, 0.00784314, 0.00784314, 0.00784314, 0.00784314, 0.00784314, 0.00784314, 0.00784314, 0.00784314, 0.00784314, 0.00784314, 0.00784314, 0.00784314, 0.00784314, 0.00784314, 0.00784314, 0.00784314, 0.00784314, 0.00784314, 0.00784314, 0.00784314, 0.00784314, 0.00784314, 0.00784314, 0.00784314, 0.00784314, 0.00784314, 0.00784314, 0.00784314, 0.00784314, 0.00784314, 0.00784314, 0.00784314, 0.00784314, 0.00784314, 0.00784314, 0.00784314, 0.00784314, 0.00784314, 0.00784314, 0.00784314, 0.00784314, 0.00784314, 0.00784314, 0.00784314, 0.00784314, 0.00784314, 0.00784314, 0.00784314, 0.00784314, 0.00784314, 0.00784314, 0.00784314, 0.00784314, 0.00784314, 0.00784314, 0.00784314, 0.00784314, 0.00784314, 0.00784314, 0.00784314, 0.00784314, 0.00784314, 0.00784314, 0.00784314, 0.00784314, 0.00784314, 0.00784314, 0.00784314, 0.00784314, 0.00784314, 0.00784314, 0.00784314, 0.00784314, 0.00784314, 0.00784314, 0.00784314, 0.00784314, 0.00784314, 0.00784314, 0.00784314, 0.00784314, 0.00784314, 0.00784314, 0.00784314, 0.00784314, 0.00784314, 0.00784314, 0.00784314, 0.00784314, 0.00784314, 0.00784314, 0.00784314, 0.00784314, 0.00784314, 0.00784314, 0.00784314, 0.00784314, 0.00784314, 0.00784314, 0.00784314, 0.00784314, 0.00784314, 0.00784314, 0.00784314, 0.00784314, 0.00784314, 0.00784314, 0.00784314, 0.00784314, 0.00784314, 0.00784314, 0.00784314, 0.00784314, 0.00784314, 0.00784314, 0.00784314, 0.00784314, 0.00784314, 0.00784314, 0.00784314, 0.00784314, 0.00784314, 0.00784314, 0.00784314, 0.00784314, 0.00784314, 0.00784314, 0.00784314, 0.00784314, 0.00784314, 0.00784314, 0.00784314, 0.00784314, 0.00784314, 0.00784314, 0.00784314, 0.00784314, 0.00784314, 0.00784314, 0.00784314, 0.00784314, 0.00784314, 0.00784314, 0.00784314, 0.00784314, 0.00784314, 0.00784314, 0.00784314, 0.00784314, 0.00784314, 0.00784314, 0.00784314, 0.00784314, 0.00784314, 0.00784314, 0.00784314, 0.00784314, 0.00784314, 0.00784314, 0.00784314, 0.00784314, 0.00784314, 0.00784314, 0.00784314, 0.00784314, 0.00784314, 0.00784314, 0.00784314, 0.00784314, 0.00784314, 0.00784314, 0.00784314, 0.00784314, 0.00784314, 0.00784314, 0.00784314, 0.00784314, 0.00784314, 0.00784314, 0.00784314, 0.00784314, 0.00784314, 0.00784314, 0.356862755, 0.7372549150000001, 0.2509804, 0.152941185, 0.117647065, 0.00784314, 0.066666665, 0.00784314, 0.066666665, 0.00784314, 0.00784314, 0.00784314, 0.00784314, 0.00784314, 0.00784314, 0.00784314, 0.00784314, 0.00784314, 0.00784314, 0.00784314, 0.00784314, 0.00784314, 0.00784314, 0.00784314, 0.00784314, 0.00784314, 0.00784314, 0.00784314, 0.768627465, 0.99019608, 0.99019608, 0.99019608, 0.941176475, 0.725490215, 0.843137265, 0.725490215, 0.843137265, 0.725490215, 0.725490215, 0.12156863000000001, 0.00784314, 0.00784314, 0.00784314, 0.00784314, 0.00784314, 0.00784314, 0.00784314, 0.00784314, 0.00784314, 0.00784314, 0.00784314, 0.00784314, 0.00784314, 0.00784314, 0.00784314, 0.00784314, 0.470588235, 0.99019608, 0.835294125, 0.941176475, 0.886274515, 0.70588237, 0.97647059, 0.97647059, 0.97647059, 0.99019608, 0.99019608, 0.53725493, 0.00784314, 0.00784314, 0.00784314, 0.00784314, 0.00784314, 0.00784314, 0.00784314, 0.00784314, 0.00784314, 0.00784314, 0.00784314, 0.00784314, 0.00784314, 0.00784314, 0.00784314, 0.00784314, 0.725490215, 0.99019608, 0.23137255, 0.00784314, 0.00784314, 0.00784314, 0.00784314, 0.00784314, 0.00784314, 0.9607843149999999, 0.99019608, 0.5921568850000001, 0.00784314, 0.00784314, 0.00784314, 0.00784314, 0.00784314, 0.00784314, 0.00784314, 0.00784314, 0.00784314, 0.00784314, 0.00784314, 0.00784314, 0.00784314, 0.00784314, 0.00784314, 0.24313726000000002, 0.97254902, 0.717647075, 0.058823534999999996, 0.00784314, 0.00784314, 0.00784314, 0.00784314, 0.00784314, 0.29019609, 0.98627451, 0.99019608, 0.27450981500000005, 0.00784314, 0.00784314, 0.00784314, 0.00784314, 0.00784314, 0.00784314, 0.00784314, 0.00784314, 0.00784314, 0.00784314, 0.00784314, 0.00784314, 0.00784314, 0.00784314, 0.082352945, 0.819607855, 0.97647059, 0.20392157, 0.00784314, 0.00784314, 0.00784314, 0.00784314, 0.00784314, 0.00784314, 0.3882353, 0.99019608, 0.99019608, 0.168627455, 0.00784314, 0.00784314, 0.00784314, 0.00784314, 0.00784314, 0.00784314, 0.00784314, 0.00784314, 0.00784314, 0.00784314, 0.00784314, 0.00784314, 0.00784314, 0.00784314, 0.356862755, 0.99019608, 0.690196095, 0.00784314, 0.00784314, 0.00784314, 0.00784314, 0.00784314, 0.00784314, 0.00784314, 0.470588235, 0.99019608, 0.94901961, 0.137254905, 0.00784314, 0.00784314, 0.00784314, 0.00784314, 0.00784314, 0.00784314, 0.00784314, 0.00784314, 0.00784314, 0.00784314, 0.00784314, 0.00784314, 0.00784314, 0.00784314, 0.043137255, 0.36862746, 0.168627455, 0.00784314, 0.00784314, 0.00784314, 0.00784314, 0.00784314, 0.00784314, 0.00784314, 0.811764715, 0.99019608, 0.741176485, 0.00784314, 0.00784314, 0.00784314, 0.00784314, 0.00784314, 0.00784314, 0.00784314, 0.00784314, 0.00784314, 0.00784314, 0.00784314, 0.00784314, 0.00784314, 0.00784314, 0.00784314, 0.00784314, 0.00784314, 0.00784314, 0.00784314, 0.00784314, 0.00784314, 0.00784314, 0.00784314, 0.00784314, 0.00784314, 0.811764715, 0.99019608, 0.713725505, 0.00784314, 0.00784314, 0.00784314, 0.00784314, 0.00784314, 0.00784314, 0.00784314, 0.00784314, 0.00784314, 0.00784314, 0.00784314, 0.00784314, 0.00784314, 0.00784314, 0.00784314, 0.00784314, 0.00784314, 0.00784314, 0.00784314, 0.00784314, 0.00784314, 0.00784314, 0.00784314, 0.00784314, 0.00784314, 0.811764715, 0.99019608, 0.31764707, 0.00784314, 0.00784314, 0.00784314, 0.00784314, 0.00784314, 0.00784314, 0.00784314, 0.00784314, 0.00784314, 0.00784314, 0.00784314, 0.00784314, 0.00784314, 0.00784314, 0.00784314, 0.00784314, 0.00784314, 0.00784314, 0.00784314, 0.00784314, 0.00784314, 0.00784314, 0.00784314, 0.00784314, 0.00784314, 0.811764715, 0.99019608, 0.31764707, 0.00784314, 0.00784314, 0.00784314, 0.00784314, 0.00784314, 0.00784314, 0.00784314, 0.00784314, 0.00784314, 0.00784314, 0.00784314, 0.00784314, 0.00784314, 0.00784314, 0.00784314, 0.00784314, 0.00784314, 0.00784314, 0.00784314, 0.00784314, 0.00784314, 0.00784314, 0.00784314, 0.00784314, 0.00784314, 0.811764715, 0.99019608, 0.31764707, 0.00784314, 0.00784314, 0.00784314, 0.00784314, 0.00784314, 0.00784314, 0.00784314, 0.00784314, 0.00784314, 0.00784314, 0.00784314, 0.00784314, 0.00784314, 0.00784314, 0.00784314, 0.00784314, 0.00784314, 0.00784314, 0.00784314, 0.00784314, 0.00784314, 0.00784314, 0.00784314, 0.00784314, 0.058823534999999996, 0.85490197, 0.97254902, 0.24313726000000002, 0.00784314, 0.00784314, 0.00784314, 0.00784314, 0.00784314, 0.00784314, 0.00784314, 0.00784314, 0.00784314, 0.00784314, 0.00784314, 0.00784314, 0.00784314, 0.00784314, 0.00784314, 0.00784314, 0.00784314, 0.00784314, 0.00784314, 0.00784314, 0.00784314, 0.00784314, 0.00784314, 0.00784314, 0.235294125, 0.99019608, 0.890196085, 0.00784314, 0.00784314, 0.00784314, 0.00784314, 0.00784314, 0.00784314, 0.00784314, 0.00784314, 0.00784314, 0.00784314, 0.00784314, 0.00784314, 0.00784314, 0.00784314, 0.00784314, 0.00784314, 0.00784314, 0.00784314, 0.00784314, 0.00784314, 0.00784314, 0.00784314, 0.00784314, 0.00784314, 0.00784314, 0.643137275, 0.99019608, 0.890196085, 0.00784314, 0.00784314, 0.00784314, 0.00784314, 0.00784314, 0.00784314, 0.00784314, 0.00784314, 0.00784314, 0.00784314, 0.00784314, 0.00784314, 0.00784314, 0.00784314, 0.00784314, 0.00784314, 0.00784314, 0.00784314, 0.00784314, 0.00784314, 0.00784314, 0.00784314, 0.00784314, 0.00784314, 0.00784314, 0.65882355, 0.99019608, 0.890196085, 0.00784314, 0.00784314, 0.00784314, 0.00784314, 0.00784314, 0.00784314, 0.00784314, 0.00784314, 0.00784314, 0.00784314, 0.00784314, 0.00784314, 0.00784314, 0.00784314, 0.00784314, 0.00784314, 0.00784314, 0.00784314, 0.00784314, 0.00784314, 0.00784314, 0.00784314, 0.00784314, 0.00784314, 0.00784314, 0.65882355, 0.99019608, 0.890196085, 0.00784314, 0.00784314, 0.00784314, 0.00784314, 0.00784314, 0.00784314, 0.00784314, 0.00784314, 0.00784314, 0.00784314, 0.00784314, 0.00784314, 0.00784314, 0.00784314, 0.00784314, 0.00784314, 0.00784314, 0.00784314, 0.00784314, 0.00784314, 0.00784314, 0.00784314, 0.00784314, 0.00784314, 0.050980395, 0.847058835, 0.99019608, 0.65490198, 0.00784314, 0.00784314, 0.00784314, 0.00784314, 0.00784314, 0.00784314, 0.00784314, 0.00784314, 0.00784314, 0.00784314, 0.00784314, 0.00784314, 0.00784314, 0.00784314, 0.00784314, 0.00784314, 0.00784314, 0.00784314, 0.00784314, 0.00784314, 0.00784314, 0.00784314, 0.00784314, 0.00784314, 0.086274515, 0.99019608, 0.99019608, 0.46666667, 0.00784314, 0.00784314, 0.00784314, 0.00784314, 0.00784314, 0.00784314, 0.00784314, 0.00784314, 0.00784314, 0.00784314, 0.00784314, 0.00784314, 0.00784314, 0.00784314, 0.00784314, 0.00784314, 0.00784314, 0.00784314, 0.00784314, 0.00784314, 0.00784314, 0.00784314, 0.00784314, 0.00784314, 0.015686275, 0.70980394, 0.835294125, 0.086274515, 0.00784314, 0.00784314, 0.00784314, 0.00784314, 0.00784314, 0.00784314, 0.00784314, 0.00784314, 0.00784314, 0.00784314, 0.00784314, 0.00784314, 0.00784314, 0.00784314, 0.00784314, 0.00784314, 0.00784314, 0.00784314, 0.00784314, 0.00784314, 0.00784314, 0.00784314, 0.00784314, 0.00784314, 0.00784314, 0.00784314, 0.00784314, 0.00784314, 0.00784314, 0.00784314, 0.00784314, 0.00784314, 0.00784314, 0.00784314, 0.00784314, 0.00784314, 0.00784314, 0.00784314], ([-55.56383594253841, -59.91446229013215, -46.0537751704608, -50.91583261041695, -65.01148181286011, -53.761014394746475, -79.44443723300212, 21.878960788219008, -83.69013034989587, -30.179336163032964], [-50.92142640728252, -58.7596953866397, -43.5378237855085, -49.55655429985534, -59.22717792508365, -48.942424928411405, -75.88781652577086, 19.299849547511066, -80.26891475688907, -26.00578463371272], 5.78430388777646))
[Thread 1] Total splits: 0
Processed 1 zonotopes (Work Done: 0.0%); Generated 0 (0.21282317s/loop)
[Thread 1] Finished in 0.21s
 ────────────────────────────────────────────────────────────────────────────────
                                        Time                    Allocations      
                               ───────────────────────   ────────────────────────
       Tot / % measured:            215ms / 100.0%            129MiB / 100.0%    

 Section               ncalls     time    %tot     avg     alloc    %tot      avg
 ────────────────────────────────────────────────────────────────────────────────
 Verify                     1    213ms   99.0%   213ms    120MiB   92.4%   120MiB
   Zonotope Loop            1    213ms   99.0%   213ms    120MiB   92.4%   120MiB
     Zonotope Propa...      1    186ms   86.4%   186ms   98.1MiB   75.8%  98.1MiB
       DiffZonotope...      2    128ms   59.7%  64.2ms   84.7MiB   65.5%  42.3MiB
         Zonotope_R...      4    127ms   59.3%  31.9ms   84.6MiB   65.4%  21.2MiB
           Column M...      4   71.0ms   33.0%  17.7ms   15.8MiB   12.2%  3.96MiB
           Influenc...      4   49.6ms   23.1%  12.4ms   52.8MiB   40.8%  13.2MiB
             Multiply       4   35.2ms   16.4%  8.80ms   28.6MiB   22.1%  7.15MiB
             Alloca...      4   11.3ms    5.2%  2.81ms   24.2MiB   18.7%  6.06MiB
             Set Ma...      4   3.17ms    1.5%   792μs     0.00B    0.0%    0.00B
           Allocation       4   4.73ms    2.2%  1.18ms   15.8MiB   12.2%  3.96MiB
           Set Matrix       4   1.99ms    0.9%   497μs   19.5KiB    0.0%  4.86KiB
           Vectors          4    108μs    0.1%  27.1μs    100KiB    0.1%  25.0KiB
           Bounds           4   2.92μs    0.0%   729ns     0.00B    0.0%    0.00B
       DiffZonotope...      3   57.3ms   26.6%  19.1ms   13.4MiB   10.4%  4.48MiB
         Zonotope_D...      6   57.3ms   26.6%  9.55ms   13.4MiB   10.4%  2.24MiB
     Property Check         1   1.68ms    0.8%  1.68ms    338KiB    0.3%   338KiB
 Initialize                 1   2.16ms    1.0%  2.16ms   9.84MiB    7.6%  9.84MiB
 ────────────────────────────────────────────────────────────────────────────────
[VERYDIFF_TIMER] 0.26808346

[VERYDIFF_EXPERIMENT] Running on /home/i57/steuber/NeuroDiff/repos/VeryDiffExperiments/src/../benchmarks/mnist-prune/specs/mnist_83_global_4.vnnlib /home/i57/steuber/NeuroDiff/repos/VeryDiffExperiments/src/../benchmarks/mnist-prune/nets/mnist_relu_3_100.onnx
Found input X
op: matmul, weight: (100, 784), bias: nothing
op: bias, weight: nothing, bias: (100,)
op: relu, weight: nothing, bias: nothing
op: matmul, weight: (100, 100), bias: nothing
op: bias, weight: nothing, bias: (100,)
op: relu, weight: nothing, bias: nothing
op: matmul, weight: (10, 100), bias: nothing
op: bias, weight: nothing, bias: (10,)
op: relu, weight: nothing, bias: nothing
op: matmul, weight: (10, 10), bias: nothing
op: bias, weight: nothing, bias: (10,)
Found input X
op: matmul, weight: (100, 784), bias: nothing
op: bias, weight: nothing, bias: (100,)
op: relu, weight: nothing, bias: nothing
op: matmul, weight: (100, 100), bias: nothing
op: bias, weight: nothing, bias: (100,)
op: relu, weight: nothing, bias: nothing
op: matmul, weight: (10, 100), bias: nothing
op: bias, weight: nothing, bias: (10,)
op: relu, weight: nothing, bias: nothing
op: matmul, weight: (10, 10), bias: nothing
op: bias, weight: nothing, bias: (10,)
Distance: 296.6600370998244
Distance: 77.24290861755458
Distance: 5.7170369567975285
Distance: 0.0
Running with 1 threads
[Thread 1] Time to first task: 0.0s
Zono Bounds:
[0.0, 0.0, 0.0, 0.0, 0.0, 0.0, 0.0, 0.0, 0.0, 0.0, 0.0, 0.0, 0.0, 0.0, 0.0, 0.0, 0.0, 0.0, 0.0, 0.0, 0.0, 0.0, 0.0, 0.0, 0.0, 0.0, 0.0, 0.0, 0.0, 0.0, 0.0, 0.0, 0.0, 0.0, 0.0, 0.0, 0.0, 0.0, 0.0, 0.0, 0.0, 0.0, 0.0, 0.0, 0.0, 0.0, 0.0, 0.0, 0.0, 0.0, 0.0, 0.0, 0.0, 0.0, 0.0, 0.0, 0.0, 0.0, 0.0, 0.0, 0.0, 0.0, 0.0, 0.0, 0.0, 0.0, 0.0, 0.0, 0.0, 0.0, 0.0, 0.0, 0.0, 0.0, 0.0, 0.0, 0.0, 0.0, 0.0, 0.0, 0.0, 0.0, 0.0, 0.0, 0.0, 0.0, 0.0, 0.0, 0.0, 0.0, 0.0, 0.0, 0.0, 0.0, 0.0, 0.0, 0.0, 0.0, 0.0, 0.0, 0.0, 0.0, 0.0, 0.0, 0.0, 0.0, 0.0, 0.0, 0.0, 0.0, 0.0, 0.0, 0.0, 0.0, 0.0, 0.0, 0.0, 0.0, 0.0, 0.0, 0.0, 0.0, 0.0, 0.0, 0.0, 0.0, 0.0, 0.0, 0.0, 0.0, 0.0, 0.0, 0.0, 0.0, 0.0, 0.0, 0.0, 0.0, 0.0, 0.0, 0.0, 0.0, 0.0, 0.0, 0.0, 0.0, 0.0, 0.0, 0.0, 0.0, 0.0, 0.0, 0.0, 0.0, 0.0, 0.0, 0.0, 0.0, 0.0, 0.0, 0.0, 0.0, 0.0, 0.0, 0.0, 0.0, 0.0, 0.0, 0.0, 0.0, 0.0, 0.0, 0.0, 0.0, 0.0, 0.0, 0.0, 0.0, 0.0, 0.0, 0.0, 0.0, 0.0, 0.0, 0.0, 0.0, 0.0, 0.0, 0.0, 0.0, 0.0, 0.0, 0.0, 0.0, 0.0, 0.0, 0.0, 0.0, 0.0, 0.0, 0.0, 0.0, 0.0, 0.0, 0.0, 0.0, 0.0, 0.0, 0.0, 0.0, 0.0, 0.0, 0.0, 0.0, 0.0, 0.0, 0.0, 0.0, 0.0, 0.0, 0.0, 0.0, 0.0, 0.0, 0.0, 0.0, 0.0, 0.0, 0.0, 0.0, 0.0, 0.0, 0.0, 0.0, 0.0, 0.0, 0.0, 0.0, 0.0, 0.0, 0.0, 0.0, 0.0, 0.0, 0.0, 0.0, 0.0, 0.0, 0.0, 0.0, 0.0, 0.0, 0.0, 0.0, 0.0, 0.0, 0.0, 0.0, 0.0, 0.0, 0.0, 0.0, 0.0, 0.0, 0.0, 0.0, 0.0, 0.0, 0.0, 0.0, 0.0, 0.0, 0.0, 0.0, 0.0, 0.0, 0.0, 0.0, 0.0, 0.0, 0.0, 0.0, 0.0, 0.0, 0.0, 0.0, 0.0, 0.0, 0.0, 0.0, 0.0, 0.0, 0.0, 0.0, 0.0, 0.0, 0.0, 0.0, 0.0, 0.0, 0.0, 0.0, 0.0, 0.0, 0.0, 0.0, 0.0, 0.0, 0.0, 0.0, 0.0, 0.0, 0.0, 0.0, 0.0, 0.0, 0.0, 0.0, 0.0, 0.0, 0.0, 0.0, 0.0, 0.0, 0.0, 0.0, 0.0, 0.0, 0.0, 0.0, 0.0, 0.0, 0.0, 0.0, 0.0, 0.0, 0.0, 0.0, 0.0, 0.0, 0.0, 0.0, 0.0, 0.0, 0.0, 0.0, 0.0, 0.0, 0.0, 0.0, 0.0, 0.0, 0.0, 0.0, 0.0, 0.0, 0.0, 0.0, 0.0, 0.0, 0.0, 0.0, 0.0, 0.0, 0.0, 0.0, 0.0, 0.0, 0.0, 0.0, 0.0, 0.0, 0.0, 0.0, 0.0, 0.0, 0.0, 0.0, 0.0, 0.0, 0.0, 0.0, 0.0, 0.0, 0.0, 0.0, 0.0, 0.0, 0.0, 0.0, 0.0, 0.0, 0.0, 0.0, 0.0, 0.0, 0.0, 0.0, 0.0, 0.0, 0.0, 0.0, 0.0, 0.0, 0.0, 0.0, 0.0, 0.0, 0.0, 0.0, 0.0, 0.0, 0.0, 0.0, 0.0, 0.0, 0.0, 0.0, 0.0, 0.0, 0.0, 0.0, 0.0, 0.0, 0.0, 0.0, 0.0, 0.0, 0.0, 0.0, 0.0, 0.0, 0.0, 0.0, 0.0, 0.0, 0.0, 0.0, 0.0, 0.0, 0.0, 0.0, 0.0, 0.0, 0.0, 0.0, 0.0, 0.0, 0.0, 0.0, 0.0, 0.0, 0.0, 0.0, 0.0, 0.0, 0.0, 0.0, 0.0, 0.0, 0.0, 0.0, 0.0, 0.0, 0.0, 0.0, 0.0, 0.0, 0.0, 0.0, 0.0, 0.0, 0.0, 0.0, 0.0, 0.0, 0.0, 0.0, 0.0, 0.0, 0.0, 0.0, 0.0, 0.0, 0.0, 0.0, 0.0, 0.0, 0.0, 0.0, 0.0, 0.0, 0.0, 0.0, 0.0, 0.0, 0.0, 0.0, 0.0, 0.0, 0.0, 0.0, 0.0, 0.0, 0.0, 0.0, 0.0, 0.0, 0.0, 0.0, 0.0, 0.0, 0.0, 0.0, 0.0, 0.0, 0.0, 0.0, 0.0, 0.0, 0.0, 0.0, 0.0, 0.0, 0.0, 0.0, 0.0, 0.0, 0.0, 0.0, 0.0, 0.0, 0.0, 0.0, 0.0, 0.0, 0.0, 0.0, 0.0, 0.0, 0.0, 0.0, 0.0, 0.0, 0.0, 0.0, 0.0, 0.0, 0.0, 0.0, 0.0, 0.0, 0.0, 0.0, 0.0, 0.0, 0.0, 0.0, 0.0, 0.0, 0.0, 0.0, 0.0, 0.0, 0.0, 0.0, 0.0, 0.0, 0.0, 0.0, 0.0, 0.0, 0.0, 0.0, 0.0, 0.0, 0.0, 0.0, 0.0, 0.0, 0.0, 0.0, 0.0, 0.0, 0.0, 0.0, 0.0, 0.0, 0.0, 0.0, 0.0, 0.0, 0.0, 0.0, 0.0, 0.0, 0.0, 0.0, 0.0, 0.0, 0.0, 0.0, 0.0, 0.0, 0.0, 0.0, 0.0, 0.0, 0.0, 0.0, 0.0, 0.0, 0.0, 0.0, 0.0, 0.0, 0.0, 0.0, 0.0, 0.0, 0.0, 0.0, 0.0, 0.0, 0.0, 0.0, 0.0, 0.0, 0.0, 0.0, 0.0, 0.0, 0.0, 0.0, 0.0, 0.0, 0.0, 0.0, 0.0, 0.0, 0.0, 0.0, 0.0, 0.0, 0.0, 0.0, 0.0, 0.0, 0.0, 0.0, 0.0, 0.0, 0.0, 0.0, 0.0, 0.0, 0.0, 0.0, 0.0, 0.0, 0.0, 0.0, 0.0, 0.0, 0.0, 0.0, 0.0, 0.0, 0.0, 0.0, 0.0, 0.0, 0.0, 0.0, 0.0, 0.0, 0.0, 0.0, 0.0, 0.0, 0.0, 0.0, 0.0, 0.0, 0.0, 0.0, 0.0, 0.0, 0.0, 0.0, 0.0, 0.0, 0.0, 0.0, 0.0, 0.0, 0.0, 0.0, 0.0, 0.0, 0.0, 0.0, 0.0, 0.0, 0.0, 0.0, 0.0, 0.0, 0.0, 0.0, 0.0, 0.0, 0.0, 0.0, 0.0, 0.0, 0.0, 0.0, 0.0, 0.0, 0.0, 0.0, 0.0, 0.0, 0.0, 0.0, 0.0, 0.0, 0.0, 0.0, 0.0, 0.0, 0.0, 0.0, 0.0, 0.0, 0.0, 0.0, 0.0, 0.0, 0.0, 0.0, 0.0, 0.0, 0.0, 0.0, 0.0, 0.0, 0.0, 0.0, 0.0, 0.0, 0.0, 0.0, 0.0, 0.0, 0.0, 0.0, 0.0, 0.0, 0.0, 0.0, 0.0, 0.0, 0.0, 0.0, 0.0, 0.0, 0.0, 0.0, 0.0, 0.0, 0.0, 0.0, 0.0, 0.0, 0.0, 0.0, 0.0, 0.0, 0.0, 0.0, 0.0, 0.0]
[0.0, 0.0, 0.0, 0.0, 0.0, 0.0, 0.0, 0.0, 0.0, 0.0, 0.0, 0.0, 0.0, 0.0, 0.0, 0.0, 0.0, 0.0, 0.0, 0.0, 0.0, 0.0, 0.0, 0.0, 0.0, 0.0, 0.0, 0.0, 0.0, 0.0, 0.0, 0.0, 0.0, 0.0, 0.0, 0.0, 0.0, 0.0, 0.0, 0.0, 0.0, 0.0, 0.0, 0.0, 0.0, 0.0, 0.0, 0.0, 0.0, 0.0, 0.0, 0.0, 0.0, 0.0, 0.0, 0.0, 0.0, 0.0, 0.0, 0.0, 0.0, 0.0, 0.0, 0.0, 0.0, 0.0, 0.0, 0.0, 0.0, 0.0, 0.0, 0.0, 0.0, 0.0, 0.0, 0.0, 0.0, 0.0, 0.0, 0.0, 0.0, 0.0, 0.0, 0.0, 0.0, 0.0, 0.0, 0.0, 0.0, 0.0, 0.0, 0.0, 0.0, 0.0, 0.0, 0.0, 0.0, 0.0, 0.0, 0.0, 0.0, 0.0, 0.0, 0.0, 0.0, 0.0, 0.0, 0.0, 0.0, 0.0, 0.0, 0.0, 0.0, 0.0, 0.0, 0.0, 0.0, 0.0, 0.0, 0.0, 0.0, 0.0, 0.0, 0.0, 0.0, 0.0, 0.0, 0.0, 0.0, 0.0, 0.0, 0.0, 0.0, 0.0, 0.0, 0.0, 0.0, 0.0, 0.0, 0.0, 0.0, 0.0, 0.0, 0.0, 0.0, 0.0, 0.0, 0.0, 0.0, 0.0, 0.0, 0.0, 0.0, 0.0, 0.0, 0.0, 0.0, 0.0, 0.0, 0.0, 0.0, 0.0, 0.0, 0.0, 0.0, 0.0, 0.0, 0.0, 0.0, 0.0, 0.0, 0.0, 0.0, 0.0, 0.0, 0.0, 0.0, 0.0, 0.0, 0.0, 0.0, 0.0, 0.0, 0.0, 0.0, 0.0, 0.0, 0.0, 0.0, 0.0, 0.0, 0.0, 0.0, 0.0, 0.0, 0.0, 0.0, 0.0, 0.0, 0.0, 0.0, 0.0, 0.0, 0.0, 0.0, 0.0, 0.0, 0.0, 0.0, 0.0, 0.0, 0.0, 0.0, 0.0, 0.0, 0.0, 0.0, 0.0, 0.0, 0.0, 0.0, 0.0, 0.0, 0.0, 0.0, 0.0, 0.0, 0.0, 0.0, 0.0, 0.0, 0.0, 0.0, 0.0, 0.0, 0.0, 0.0, 0.0, 0.0, 0.0, 0.0, 0.0, 0.0, 0.0, 0.0, 0.0, 0.0, 0.0, 0.0, 0.0, 0.0, 0.0, 0.0, 0.0, 0.0, 0.0, 0.0, 0.0, 0.0, 0.0, 0.0, 0.0, 0.0, 0.0, 0.0, 0.0, 0.0, 0.0, 0.0, 0.0, 0.0, 0.0, 0.0, 0.0, 0.0, 0.0, 0.0, 0.0, 0.0, 0.0, 0.0, 0.0, 0.0, 0.0, 0.0, 0.0, 0.0, 0.0, 0.0, 0.0, 0.0, 0.0, 0.0, 0.0, 0.0, 0.0, 0.0, 0.0, 0.0, 0.0, 0.0, 0.0, 0.0, 0.0, 0.0, 0.0, 0.0, 0.0, 0.0, 0.0, 0.0, 0.0, 0.0, 0.0, 0.0, 0.0, 0.0, 0.0, 0.0, 0.0, 0.0, 0.0, 0.0, 0.0, 0.0, 0.0, 0.0, 0.0, 0.0, 0.0, 0.0, 0.0, 0.0, 0.0, 0.0, 0.0, 0.0, 0.0, 0.0, 0.0, 0.0, 0.0, 0.0, 0.0, 0.0, 0.0, 0.0, 0.0, 0.0, 0.0, 0.0, 0.0, 0.0, 0.0, 0.0, 0.0, 0.0, 0.0, 0.0, 0.0, 0.0, 0.0, 0.0, 0.0, 0.0, 0.0, 0.0, 0.0, 0.0, 0.0, 0.0, 0.0, 0.0, 0.0, 0.0, 0.0, 0.0, 0.0, 0.0, 0.0, 0.0, 0.0, 0.0, 0.0, 0.0, 0.0, 0.0, 0.0, 0.0, 0.0, 0.0, 0.0, 0.0, 0.0, 0.0, 0.0, 0.0, 0.0, 0.0, 0.0, 0.0, 0.0, 0.0, 0.0, 0.0, 0.0, 0.0, 0.0, 0.0, 0.0, 0.0, 0.0, 0.0, 0.0, 0.0, 0.0, 0.0, 0.0, 0.0, 0.0, 0.0, 0.0, 0.0, 0.0, 0.0, 0.0, 0.0, 0.0, 0.0, 0.0, 0.0, 0.0, 0.0, 0.0, 0.0, 0.0, 0.0, 0.0, 0.0, 0.0, 0.0, 0.0, 0.0, 0.0, 0.0, 0.0, 0.0, 0.0, 0.0, 0.0, 0.0, 0.0, 0.0, 0.0, 0.0, 0.0, 0.0, 0.0, 0.0, 0.0, 0.0, 0.0, 0.0, 0.0, 0.0, 0.0, 0.0, 0.0, 0.0, 0.0, 0.0, 0.0, 0.0, 0.0, 0.0, 0.0, 0.0, 0.0, 0.0, 0.0, 0.0, 0.0, 0.0, 0.0, 0.0, 0.0, 0.0, 0.0, 0.0, 0.0, 0.0, 0.0, 0.0, 0.0, 0.0, 0.0, 0.0, 0.0, 0.0, 0.0, 0.0, 0.0, 0.0, 0.0, 0.0, 0.0, 0.0, 0.0, 0.0, 0.0, 0.0, 0.0, 0.0, 0.0, 0.0, 0.0, 0.0, 0.0, 0.0, 0.0, 0.0, 0.0, 0.0, 0.0, 0.0, 0.0, 0.0, 0.0, 0.0, 0.0, 0.0, 0.0, 0.0, 0.0, 0.0, 0.0, 0.0, 0.0, 0.0, 0.0, 0.0, 0.0, 0.0, 0.0, 0.0, 0.0, 0.0, 0.0, 0.0, 0.0, 0.0, 0.0, 0.0, 0.0, 0.0, 0.0, 0.0, 0.0, 0.0, 0.0, 0.0, 0.0, 0.0, 0.0, 0.0, 0.0, 0.0, 0.0, 0.0, 0.0, 0.0, 0.0, 0.0, 0.0, 0.0, 0.0, 0.0, 0.0, 0.0, 0.0, 0.0, 0.0, 0.0, 0.0, 0.0, 0.0, 0.0, 0.0, 0.0, 0.0, 0.0, 0.0, 0.0, 0.0, 0.0, 0.0, 0.0, 0.0, 0.0, 0.0, 0.0, 0.0, 0.0, 0.0, 0.0, 0.0, 0.0, 0.0, 0.0, 0.0, 0.0, 0.0, 0.0, 0.0, 0.0, 0.0, 0.0, 0.0, 0.0, 0.0, 0.0, 0.0, 0.0, 0.0, 0.0, 0.0, 0.0, 0.0, 0.0, 0.0, 0.0, 0.0, 0.0, 0.0, 0.0, 0.0, 0.0, 0.0, 0.0, 0.0, 0.0, 0.0, 0.0, 0.0, 0.0, 0.0, 0.0, 0.0, 0.0, 0.0, 0.0, 0.0, 0.0, 0.0, 0.0, 0.0, 0.0, 0.0, 0.0, 0.0, 0.0, 0.0, 0.0, 0.0, 0.0, 0.0, 0.0, 0.0, 0.0, 0.0, 0.0, 0.0, 0.0, 0.0, 0.0, 0.0, 0.0, 0.0, 0.0, 0.0, 0.0, 0.0, 0.0, 0.0, 0.0, 0.0, 0.0, 0.0, 0.0, 0.0, 0.0, 0.0, 0.0, 0.0, 0.0, 0.0, 0.0, 0.0, 0.0, 0.0, 0.0, 0.0, 0.0, 0.0, 0.0, 0.0, 0.0, 0.0, 0.0, 0.0, 0.0, 0.0, 0.0, 0.0, 0.0, 0.0, 0.0, 0.0, 0.0, 0.0, 0.0, 0.0, 0.0, 0.0, 0.0, 0.0, 0.0, 0.0, 0.0, 0.0, 0.0, 0.0, 0.0, 0.0, 0.0, 0.0, 0.0, 0.0, 0.0, 0.0, 0.0, 0.0, 0.0, 0.0, 0.0, 0.0, 0.0, 0.0, 0.0, 0.0, 0.0, 0.0, 0.0, 0.0, 0.0, 0.0, 0.0, 0.0, 0.0, 0.0, 0.0, 0.0, 0.0, 0.0, 0.0, 0.0, 0.0, 0.0, 0.0, 0.0, 0.0, 0.0, 0.0, 0.0, 0.0, 0.0, 0.0, 0.0, 0.0, 0.0, 0.0, 0.0, 0.0, 0.0]
[Thread 1] Processed 100 zonotopes (Work Done: 0.0%; Expected Zonos: Inf)
[Thread 1] Processed 200 zonotopes (Work Done: 0.0%; Expected Zonos: Inf)
[Thread 1] Processed 300 zonotopes (Work Done: 0.0%; Expected Zonos: Inf)
[Thread 1] Processed 400 zonotopes (Work Done: 0.0%; Expected Zonos: Inf)
[Thread 1] Processed 500 zonotopes (Work Done: 0.0%; Expected Zonos: Inf)
[Thread 1] Processed 600 zonotopes (Work Done: 0.0%; Expected Zonos: Inf)


TIMEOUT REACHED
UNKNOWN
[Thread 1] Total splits: 601
Processed 601 zonotopes (Work Done: 0.0%); Generated 1202 (0.20009483706322795s/loop)
[Thread 1] Finished in 120.26s
 ────────────────────────────────────────────────────────────────────────────────
                                        Time                    Allocations      
                               ───────────────────────   ────────────────────────
       Tot / % measured:             120s / 100.0%           61.5GiB / 100.0%    

 Section               ncalls     time    %tot     avg     alloc    %tot      avg
 ────────────────────────────────────────────────────────────────────────────────
 Verify                     1     120s  100.0%    120s   61.5GiB  100.0%  61.5GiB
   Zonotope Loop            1     120s  100.0%    120s   61.5GiB  100.0%  61.5GiB
     Zonotope Propa...    601    71.7s   59.6%   119ms   40.7GiB   66.2%  69.3MiB
       DiffZonotope...  1.80k    63.5s   52.8%  35.2ms   39.1GiB   63.6%  22.2MiB
         Zonotope_R...  3.61k    63.4s   52.8%  17.6ms   39.1GiB   63.6%  11.1MiB
           Influenc...  3.61k    62.6s   52.0%  17.4ms   35.9GiB   58.4%  10.2MiB
             Multiply   3.61k    37.2s   31.0%  10.3ms   18.2GiB   29.6%  5.17MiB
             Alloca...  3.61k    22.7s   18.9%  6.30ms   17.7GiB   28.8%  5.03MiB
             Set Ma...  3.61k    2.65s    2.2%   734μs     0.00B    0.0%    0.00B
           Column M...  3.61k    516ms    0.4%   143μs   1.57GiB    2.6%   456KiB
           Set Matrix   3.61k    202ms    0.2%  56.1μs   3.09MiB    0.0%     897B
           Allocation   3.61k   95.5ms    0.1%  26.5μs   1.57GiB    2.6%   456KiB
           Vectors      3.61k   18.4ms    0.0%  5.09μs   11.5MiB    0.0%  3.26KiB
           Bounds       3.61k   1.87ms    0.0%   517ns     0.00B    0.0%    0.00B
       DiffZonotope...  2.40k    8.20s    6.8%  3.41ms   1.59GiB    2.6%   694KiB
         Zonotope_D...  4.81k    8.19s    6.8%  1.70ms   1.59GiB    2.6%   347KiB
     Compute Split        601    15.0s   12.4%  24.9ms   8.97GiB   14.6%  15.3MiB
     Property Check       601    135ms    0.1%   225μs    123MiB    0.2%   210KiB
 Initialize                 1    530μs    0.0%   530μs   5.41MiB    0.0%  5.41MiB
 ────────────────────────────────────────────────────────────────────────────────
[VERYDIFF_TIMER] 120.287107378

[VERYDIFF_EXPERIMENT] Running on /home/i57/steuber/NeuroDiff/repos/VeryDiffExperiments/src/../benchmarks/mnist-prune/specs/mnist_83_global_4.vnnlib /home/i57/steuber/NeuroDiff/repos/VeryDiffExperiments/src/../benchmarks/mnist-prune/nets/mnist_relu_4_1024.onnx
Found input X
op: matmul, weight: (1024, 784), bias: nothing
op: bias, weight: nothing, bias: (1024,)
op: relu, weight: nothing, bias: nothing
op: matmul, weight: (1024, 1024), bias: nothing
op: bias, weight: nothing, bias: (1024,)
op: relu, weight: nothing, bias: nothing
op: matmul, weight: (1024, 1024), bias: nothing
op: bias, weight: nothing, bias: (1024,)
op: relu, weight: nothing, bias: nothing
op: matmul, weight: (10, 1024), bias: nothing
op: bias, weight: nothing, bias: (10,)
op: relu, weight: nothing, bias: nothing
op: matmul, weight: (10, 10), bias: nothing
op: bias, weight: nothing, bias: (10,)
Found input X
op: matmul, weight: (1024, 784), bias: nothing
op: bias, weight: nothing, bias: (1024,)
op: relu, weight: nothing, bias: nothing
op: matmul, weight: (1024, 1024), bias: nothing
op: bias, weight: nothing, bias: (1024,)
op: relu, weight: nothing, bias: nothing
op: matmul, weight: (1024, 1024), bias: nothing
op: bias, weight: nothing, bias: (1024,)
op: relu, weight: nothing, bias: nothing
op: matmul, weight: (10, 1024), bias: nothing
op: bias, weight: nothing, bias: (10,)
op: relu, weight: nothing, bias: nothing
op: matmul, weight: (10, 10), bias: nothing
op: bias, weight: nothing, bias: (10,)
Distance: 1266.8815759184893
Distance: 2876.6944248261216
Distance: 2831.8843567411013
Distance: 34.033756025192815
Distance: 0.0
Running with 1 threads
[Thread 1] Time to first task: 0.01s
Zono Bounds:
[0.0, 0.0, 0.0, 0.0, 0.0, 0.0, 0.0, 0.0, 0.0, 0.0, 0.0, 0.0, 0.0, 0.0, 0.0, 0.0, 0.0, 0.0, 0.0, 0.0, 0.0, 0.0, 0.0, 0.0, 0.0, 0.0, 0.0, 0.0, 0.0, 0.0, 0.0, 0.0, 0.0, 0.0, 0.0, 0.0, 0.0, 0.0, 0.0, 0.0, 0.0, 0.0, 0.0, 0.0, 0.0, 0.0, 0.0, 0.0, 0.0, 0.0, 0.0, 0.0, 0.0, 0.0, 0.0, 0.0, 0.0, 0.0, 0.0, 0.0, 0.0, 0.0, 0.0, 0.0, 0.0, 0.0, 0.0, 0.0, 0.0, 0.0, 0.0, 0.0, 0.0, 0.0, 0.0, 0.0, 0.0, 0.0, 0.0, 0.0, 0.0, 0.0, 0.0, 0.0, 0.0, 0.0, 0.0, 0.0, 0.0, 0.0, 0.0, 0.0, 0.0, 0.0, 0.0, 0.0, 0.0, 0.0, 0.0, 0.0, 0.0, 0.0, 0.0, 0.0, 0.0, 0.0, 0.0, 0.0, 0.0, 0.0, 0.0, 0.0, 0.0, 0.0, 0.0, 0.0, 0.0, 0.0, 0.0, 0.0, 0.0, 0.0, 0.0, 0.0, 0.0, 0.0, 0.0, 0.0, 0.0, 0.0, 0.0, 0.0, 0.0, 0.0, 0.0, 0.0, 0.0, 0.0, 0.0, 0.0, 0.0, 0.0, 0.0, 0.0, 0.0, 0.0, 0.0, 0.0, 0.0, 0.0, 0.0, 0.0, 0.0, 0.0, 0.0, 0.0, 0.0, 0.0, 0.0, 0.0, 0.0, 0.0, 0.0, 0.0, 0.0, 0.0, 0.0, 0.0, 0.0, 0.0, 0.0, 0.0, 0.0, 0.0, 0.0, 0.0, 0.0, 0.0, 0.0, 0.0, 0.0, 0.0, 0.0, 0.0, 0.0, 0.0, 0.0, 0.0, 0.0, 0.0, 0.0, 0.0, 0.0, 0.0, 0.0, 0.0, 0.0, 0.0, 0.0, 0.0, 0.0, 0.0, 0.0, 0.0, 0.0, 0.0, 0.0, 0.0, 0.0, 0.0, 0.0, 0.0, 0.0, 0.0, 0.0, 0.0, 0.0, 0.0, 0.0, 0.0, 0.0, 0.0, 0.0, 0.0, 0.0, 0.0, 0.0, 0.0, 0.0, 0.0, 0.0, 0.0, 0.0, 0.0, 0.0, 0.0, 0.0, 0.0, 0.0, 0.0, 0.0, 0.0, 0.0, 0.0, 0.0, 0.0, 0.0, 0.0, 0.0, 0.0, 0.0, 0.0, 0.0, 0.0, 0.0, 0.0, 0.0, 0.0, 0.0, 0.0, 0.0, 0.0, 0.0, 0.0, 0.0, 0.0, 0.0, 0.0, 0.0, 0.0, 0.0, 0.0, 0.0, 0.0, 0.0, 0.0, 0.0, 0.0, 0.0, 0.0, 0.0, 0.0, 0.0, 0.0, 0.0, 0.0, 0.0, 0.0, 0.0, 0.0, 0.0, 0.0, 0.0, 0.0, 0.0, 0.0, 0.0, 0.0, 0.0, 0.0, 0.0, 0.0, 0.0, 0.0, 0.0, 0.0, 0.0, 0.0, 0.0, 0.0, 0.0, 0.0, 0.0, 0.0, 0.0, 0.0, 0.0, 0.0, 0.0, 0.0, 0.0, 0.0, 0.0, 0.0, 0.0, 0.0, 0.0, 0.0, 0.0, 0.0, 0.0, 0.0, 0.0, 0.0, 0.0, 0.0, 0.0, 0.0, 0.0, 0.0, 0.0, 0.0, 0.0, 0.0, 0.0, 0.0, 0.0, 0.0, 0.0, 0.0, 0.0, 0.0, 0.0, 0.0, 0.0, 0.0, 0.0, 0.0, 0.0, 0.0, 0.0, 0.0, 0.0, 0.0, 0.0, 0.0, 0.0, 0.0, 0.0, 0.0, 0.0, 0.0, 0.0, 0.0, 0.0, 0.0, 0.0, 0.0, 0.0, 0.0, 0.0, 0.0, 0.0, 0.0, 0.0, 0.0, 0.0, 0.0, 0.0, 0.0, 0.0, 0.0, 0.0, 0.0, 0.0, 0.0, 0.0, 0.0, 0.0, 0.0, 0.0, 0.0, 0.0, 0.0, 0.0, 0.0, 0.0, 0.0, 0.0, 0.0, 0.0, 0.0, 0.0, 0.0, 0.0, 0.0, 0.0, 0.0, 0.0, 0.0, 0.0, 0.0, 0.0, 0.0, 0.0, 0.0, 0.0, 0.0, 0.0, 0.0, 0.0, 0.0, 0.0, 0.0, 0.0, 0.0, 0.0, 0.0, 0.0, 0.0, 0.0, 0.0, 0.0, 0.0, 0.0, 0.0, 0.0, 0.0, 0.0, 0.0, 0.0, 0.0, 0.0, 0.0, 0.0, 0.0, 0.0, 0.0, 0.0, 0.0, 0.0, 0.0, 0.0, 0.0, 0.0, 0.0, 0.0, 0.0, 0.0, 0.0, 0.0, 0.0, 0.0, 0.0, 0.0, 0.0, 0.0, 0.0, 0.0, 0.0, 0.0, 0.0, 0.0, 0.0, 0.0, 0.0, 0.0, 0.0, 0.0, 0.0, 0.0, 0.0, 0.0, 0.0, 0.0, 0.0, 0.0, 0.0, 0.0, 0.0, 0.0, 0.0, 0.0, 0.0, 0.0, 0.0, 0.0, 0.0, 0.0, 0.0, 0.0, 0.0, 0.0, 0.0, 0.0, 0.0, 0.0, 0.0, 0.0, 0.0, 0.0, 0.0, 0.0, 0.0, 0.0, 0.0, 0.0, 0.0, 0.0, 0.0, 0.0, 0.0, 0.0, 0.0, 0.0, 0.0, 0.0, 0.0, 0.0, 0.0, 0.0, 0.0, 0.0, 0.0, 0.0, 0.0, 0.0, 0.0, 0.0, 0.0, 0.0, 0.0, 0.0, 0.0, 0.0, 0.0, 0.0, 0.0, 0.0, 0.0, 0.0, 0.0, 0.0, 0.0, 0.0, 0.0, 0.0, 0.0, 0.0, 0.0, 0.0, 0.0, 0.0, 0.0, 0.0, 0.0, 0.0, 0.0, 0.0, 0.0, 0.0, 0.0, 0.0, 0.0, 0.0, 0.0, 0.0, 0.0, 0.0, 0.0, 0.0, 0.0, 0.0, 0.0, 0.0, 0.0, 0.0, 0.0, 0.0, 0.0, 0.0, 0.0, 0.0, 0.0, 0.0, 0.0, 0.0, 0.0, 0.0, 0.0, 0.0, 0.0, 0.0, 0.0, 0.0, 0.0, 0.0, 0.0, 0.0, 0.0, 0.0, 0.0, 0.0, 0.0, 0.0, 0.0, 0.0, 0.0, 0.0, 0.0, 0.0, 0.0, 0.0, 0.0, 0.0, 0.0, 0.0, 0.0, 0.0, 0.0, 0.0, 0.0, 0.0, 0.0, 0.0, 0.0, 0.0, 0.0, 0.0, 0.0, 0.0, 0.0, 0.0, 0.0, 0.0, 0.0, 0.0, 0.0, 0.0, 0.0, 0.0, 0.0, 0.0, 0.0, 0.0, 0.0, 0.0, 0.0, 0.0, 0.0, 0.0, 0.0, 0.0, 0.0, 0.0, 0.0, 0.0, 0.0, 0.0, 0.0, 0.0, 0.0, 0.0, 0.0, 0.0, 0.0, 0.0, 0.0, 0.0, 0.0, 0.0, 0.0, 0.0, 0.0, 0.0, 0.0, 0.0, 0.0, 0.0, 0.0, 0.0, 0.0, 0.0, 0.0, 0.0, 0.0, 0.0, 0.0, 0.0, 0.0, 0.0, 0.0, 0.0, 0.0, 0.0, 0.0, 0.0, 0.0, 0.0, 0.0, 0.0, 0.0, 0.0, 0.0, 0.0, 0.0, 0.0, 0.0, 0.0, 0.0, 0.0, 0.0, 0.0, 0.0, 0.0, 0.0, 0.0, 0.0, 0.0, 0.0, 0.0, 0.0, 0.0, 0.0, 0.0, 0.0, 0.0, 0.0, 0.0, 0.0, 0.0, 0.0, 0.0, 0.0, 0.0, 0.0, 0.0, 0.0, 0.0, 0.0, 0.0, 0.0, 0.0, 0.0, 0.0, 0.0, 0.0, 0.0, 0.0, 0.0, 0.0, 0.0, 0.0, 0.0, 0.0, 0.0, 0.0, 0.0, 0.0, 0.0, 0.0, 0.0, 0.0, 0.0]
[0.0, 0.0, 0.0, 0.0, 0.0, 0.0, 0.0, 0.0, 0.0, 0.0, 0.0, 0.0, 0.0, 0.0, 0.0, 0.0, 0.0, 0.0, 0.0, 0.0, 0.0, 0.0, 0.0, 0.0, 0.0, 0.0, 0.0, 0.0, 0.0, 0.0, 0.0, 0.0, 0.0, 0.0, 0.0, 0.0, 0.0, 0.0, 0.0, 0.0, 0.0, 0.0, 0.0, 0.0, 0.0, 0.0, 0.0, 0.0, 0.0, 0.0, 0.0, 0.0, 0.0, 0.0, 0.0, 0.0, 0.0, 0.0, 0.0, 0.0, 0.0, 0.0, 0.0, 0.0, 0.0, 0.0, 0.0, 0.0, 0.0, 0.0, 0.0, 0.0, 0.0, 0.0, 0.0, 0.0, 0.0, 0.0, 0.0, 0.0, 0.0, 0.0, 0.0, 0.0, 0.0, 0.0, 0.0, 0.0, 0.0, 0.0, 0.0, 0.0, 0.0, 0.0, 0.0, 0.0, 0.0, 0.0, 0.0, 0.0, 0.0, 0.0, 0.0, 0.0, 0.0, 0.0, 0.0, 0.0, 0.0, 0.0, 0.0, 0.0, 0.0, 0.0, 0.0, 0.0, 0.0, 0.0, 0.0, 0.0, 0.0, 0.0, 0.0, 0.0, 0.0, 0.0, 0.0, 0.0, 0.0, 0.0, 0.0, 0.0, 0.0, 0.0, 0.0, 0.0, 0.0, 0.0, 0.0, 0.0, 0.0, 0.0, 0.0, 0.0, 0.0, 0.0, 0.0, 0.0, 0.0, 0.0, 0.0, 0.0, 0.0, 0.0, 0.0, 0.0, 0.0, 0.0, 0.0, 0.0, 0.0, 0.0, 0.0, 0.0, 0.0, 0.0, 0.0, 0.0, 0.0, 0.0, 0.0, 0.0, 0.0, 0.0, 0.0, 0.0, 0.0, 0.0, 0.0, 0.0, 0.0, 0.0, 0.0, 0.0, 0.0, 0.0, 0.0, 0.0, 0.0, 0.0, 0.0, 0.0, 0.0, 0.0, 0.0, 0.0, 0.0, 0.0, 0.0, 0.0, 0.0, 0.0, 0.0, 0.0, 0.0, 0.0, 0.0, 0.0, 0.0, 0.0, 0.0, 0.0, 0.0, 0.0, 0.0, 0.0, 0.0, 0.0, 0.0, 0.0, 0.0, 0.0, 0.0, 0.0, 0.0, 0.0, 0.0, 0.0, 0.0, 0.0, 0.0, 0.0, 0.0, 0.0, 0.0, 0.0, 0.0, 0.0, 0.0, 0.0, 0.0, 0.0, 0.0, 0.0, 0.0, 0.0, 0.0, 0.0, 0.0, 0.0, 0.0, 0.0, 0.0, 0.0, 0.0, 0.0, 0.0, 0.0, 0.0, 0.0, 0.0, 0.0, 0.0, 0.0, 0.0, 0.0, 0.0, 0.0, 0.0, 0.0, 0.0, 0.0, 0.0, 0.0, 0.0, 0.0, 0.0, 0.0, 0.0, 0.0, 0.0, 0.0, 0.0, 0.0, 0.0, 0.0, 0.0, 0.0, 0.0, 0.0, 0.0, 0.0, 0.0, 0.0, 0.0, 0.0, 0.0, 0.0, 0.0, 0.0, 0.0, 0.0, 0.0, 0.0, 0.0, 0.0, 0.0, 0.0, 0.0, 0.0, 0.0, 0.0, 0.0, 0.0, 0.0, 0.0, 0.0, 0.0, 0.0, 0.0, 0.0, 0.0, 0.0, 0.0, 0.0, 0.0, 0.0, 0.0, 0.0, 0.0, 0.0, 0.0, 0.0, 0.0, 0.0, 0.0, 0.0, 0.0, 0.0, 0.0, 0.0, 0.0, 0.0, 0.0, 0.0, 0.0, 0.0, 0.0, 0.0, 0.0, 0.0, 0.0, 0.0, 0.0, 0.0, 0.0, 0.0, 0.0, 0.0, 0.0, 0.0, 0.0, 0.0, 0.0, 0.0, 0.0, 0.0, 0.0, 0.0, 0.0, 0.0, 0.0, 0.0, 0.0, 0.0, 0.0, 0.0, 0.0, 0.0, 0.0, 0.0, 0.0, 0.0, 0.0, 0.0, 0.0, 0.0, 0.0, 0.0, 0.0, 0.0, 0.0, 0.0, 0.0, 0.0, 0.0, 0.0, 0.0, 0.0, 0.0, 0.0, 0.0, 0.0, 0.0, 0.0, 0.0, 0.0, 0.0, 0.0, 0.0, 0.0, 0.0, 0.0, 0.0, 0.0, 0.0, 0.0, 0.0, 0.0, 0.0, 0.0, 0.0, 0.0, 0.0, 0.0, 0.0, 0.0, 0.0, 0.0, 0.0, 0.0, 0.0, 0.0, 0.0, 0.0, 0.0, 0.0, 0.0, 0.0, 0.0, 0.0, 0.0, 0.0, 0.0, 0.0, 0.0, 0.0, 0.0, 0.0, 0.0, 0.0, 0.0, 0.0, 0.0, 0.0, 0.0, 0.0, 0.0, 0.0, 0.0, 0.0, 0.0, 0.0, 0.0, 0.0, 0.0, 0.0, 0.0, 0.0, 0.0, 0.0, 0.0, 0.0, 0.0, 0.0, 0.0, 0.0, 0.0, 0.0, 0.0, 0.0, 0.0, 0.0, 0.0, 0.0, 0.0, 0.0, 0.0, 0.0, 0.0, 0.0, 0.0, 0.0, 0.0, 0.0, 0.0, 0.0, 0.0, 0.0, 0.0, 0.0, 0.0, 0.0, 0.0, 0.0, 0.0, 0.0, 0.0, 0.0, 0.0, 0.0, 0.0, 0.0, 0.0, 0.0, 0.0, 0.0, 0.0, 0.0, 0.0, 0.0, 0.0, 0.0, 0.0, 0.0, 0.0, 0.0, 0.0, 0.0, 0.0, 0.0, 0.0, 0.0, 0.0, 0.0, 0.0, 0.0, 0.0, 0.0, 0.0, 0.0, 0.0, 0.0, 0.0, 0.0, 0.0, 0.0, 0.0, 0.0, 0.0, 0.0, 0.0, 0.0, 0.0, 0.0, 0.0, 0.0, 0.0, 0.0, 0.0, 0.0, 0.0, 0.0, 0.0, 0.0, 0.0, 0.0, 0.0, 0.0, 0.0, 0.0, 0.0, 0.0, 0.0, 0.0, 0.0, 0.0, 0.0, 0.0, 0.0, 0.0, 0.0, 0.0, 0.0, 0.0, 0.0, 0.0, 0.0, 0.0, 0.0, 0.0, 0.0, 0.0, 0.0, 0.0, 0.0, 0.0, 0.0, 0.0, 0.0, 0.0, 0.0, 0.0, 0.0, 0.0, 0.0, 0.0, 0.0, 0.0, 0.0, 0.0, 0.0, 0.0, 0.0, 0.0, 0.0, 0.0, 0.0, 0.0, 0.0, 0.0, 0.0, 0.0, 0.0, 0.0, 0.0, 0.0, 0.0, 0.0, 0.0, 0.0, 0.0, 0.0, 0.0, 0.0, 0.0, 0.0, 0.0, 0.0, 0.0, 0.0, 0.0, 0.0, 0.0, 0.0, 0.0, 0.0, 0.0, 0.0, 0.0, 0.0, 0.0, 0.0, 0.0, 0.0, 0.0, 0.0, 0.0, 0.0, 0.0, 0.0, 0.0, 0.0, 0.0, 0.0, 0.0, 0.0, 0.0, 0.0, 0.0, 0.0, 0.0, 0.0, 0.0, 0.0, 0.0, 0.0, 0.0, 0.0, 0.0, 0.0, 0.0, 0.0, 0.0, 0.0, 0.0, 0.0, 0.0, 0.0, 0.0, 0.0, 0.0, 0.0, 0.0, 0.0, 0.0, 0.0, 0.0, 0.0, 0.0, 0.0, 0.0, 0.0, 0.0, 0.0, 0.0, 0.0, 0.0, 0.0, 0.0, 0.0, 0.0, 0.0, 0.0, 0.0, 0.0, 0.0, 0.0, 0.0, 0.0, 0.0, 0.0, 0.0, 0.0, 0.0, 0.0, 0.0, 0.0, 0.0, 0.0, 0.0, 0.0, 0.0, 0.0, 0.0, 0.0, 0.0, 0.0, 0.0, 0.0, 0.0, 0.0, 0.0, 0.0, 0.0, 0.0, 0.0, 0.0, 0.0, 0.0, 0.0, 0.0, 0.0, 0.0, 0.0, 0.0, 0.0, 0.0, 0.0, 0.0, 0.0, 0.0, 0.0, 0.0, 0.0, 0.0, 0.0, 0.0, 0.0, 0.0, 0.0, 0.0, 0.0, 0.0, 0.0, 0.0, 0.0, 0.0, 0.0, 0.0, 0.0, 0.0, 0.0, 0.0]

Found counterexample: ([0.00784314, 0.00784314, 0.00784314, 0.00784314, 0.00784314, 0.00784314, 0.00784314, 0.00784314, 0.00784314, 0.00784314, 0.00784314, 0.00784314, 0.00784314, 0.00784314, 0.00784314, 0.00784314, 0.00784314, 0.00784314, 0.00784314, 0.00784314, 0.00784314, 0.00784314, 0.00784314, 0.00784314, 0.00784314, 0.00784314, 0.00784314, 0.00784314, 0.00784314, 0.00784314, 0.00784314, 0.00784314, 0.00784314, 0.00784314, 0.00784314, 0.00784314, 0.00784314, 0.00784314, 0.00784314, 0.00784314, 0.00784314, 0.00784314, 0.00784314, 0.00784314, 0.00784314, 0.00784314, 0.00784314, 0.00784314, 0.00784314, 0.00784314, 0.00784314, 0.00784314, 0.00784314, 0.00784314, 0.00784314, 0.00784314, 0.00784314, 0.00784314, 0.00784314, 0.00784314, 0.00784314, 0.00784314, 0.00784314, 0.00784314, 0.00784314, 0.00784314, 0.00784314, 0.00784314, 0.00784314, 0.00784314, 0.00784314, 0.00784314, 0.00784314, 0.00784314, 0.00784314, 0.00784314, 0.00784314, 0.00784314, 0.00784314, 0.00784314, 0.00784314, 0.00784314, 0.00784314, 0.00784314, 0.00784314, 0.00784314, 0.00784314, 0.00784314, 0.00784314, 0.00784314, 0.00784314, 0.00784314, 0.00784314, 0.00784314, 0.00784314, 0.00784314, 0.00784314, 0.00784314, 0.00784314, 0.00784314, 0.00784314, 0.00784314, 0.00784314, 0.00784314, 0.00784314, 0.00784314, 0.00784314, 0.00784314, 0.00784314, 0.00784314, 0.00784314, 0.00784314, 0.00784314, 0.00784314, 0.00784314, 0.00784314, 0.00784314, 0.00784314, 0.00784314, 0.00784314, 0.00784314, 0.00784314, 0.00784314, 0.00784314, 0.00784314, 0.00784314, 0.00784314, 0.00784314, 0.00784314, 0.00784314, 0.00784314, 0.00784314, 0.00784314, 0.00784314, 0.00784314, 0.00784314, 0.00784314, 0.00784314, 0.00784314, 0.00784314, 0.00784314, 0.00784314, 0.00784314, 0.00784314, 0.00784314, 0.00784314, 0.00784314, 0.00784314, 0.00784314, 0.00784314, 0.00784314, 0.00784314, 0.00784314, 0.00784314, 0.00784314, 0.00784314, 0.00784314, 0.00784314, 0.00784314, 0.00784314, 0.00784314, 0.00784314, 0.00784314, 0.00784314, 0.00784314, 0.00784314, 0.00784314, 0.00784314, 0.00784314, 0.00784314, 0.00784314, 0.00784314, 0.00784314, 0.00784314, 0.00784314, 0.00784314, 0.00784314, 0.00784314, 0.00784314, 0.00784314, 0.00784314, 0.00784314, 0.00784314, 0.00784314, 0.00784314, 0.00784314, 0.00784314, 0.00784314, 0.00784314, 0.00784314, 0.00784314, 0.00784314, 0.00784314, 0.00784314, 0.00784314, 0.00784314, 0.00784314, 0.00784314, 0.00784314, 0.00784314, 0.00784314, 0.00784314, 0.00784314, 0.00784314, 0.356862755, 0.7372549150000001, 0.2509804, 0.152941185, 0.117647065, 0.00784314, 0.066666665, 0.00784314, 0.066666665, 0.00784314, 0.00784314, 0.00784314, 0.00784314, 0.00784314, 0.00784314, 0.00784314, 0.00784314, 0.00784314, 0.00784314, 0.00784314, 0.00784314, 0.00784314, 0.00784314, 0.00784314, 0.00784314, 0.00784314, 0.00784314, 0.00784314, 0.768627465, 0.99019608, 0.99019608, 0.99019608, 0.941176475, 0.725490215, 0.843137265, 0.725490215, 0.843137265, 0.725490215, 0.725490215, 0.12156863000000001, 0.00784314, 0.00784314, 0.00784314, 0.00784314, 0.00784314, 0.00784314, 0.00784314, 0.00784314, 0.00784314, 0.00784314, 0.00784314, 0.00784314, 0.00784314, 0.00784314, 0.00784314, 0.00784314, 0.470588235, 0.99019608, 0.835294125, 0.941176475, 0.886274515, 0.70588237, 0.97647059, 0.97647059, 0.97647059, 0.99019608, 0.99019608, 0.53725493, 0.00784314, 0.00784314, 0.00784314, 0.00784314, 0.00784314, 0.00784314, 0.00784314, 0.00784314, 0.00784314, 0.00784314, 0.00784314, 0.00784314, 0.00784314, 0.00784314, 0.00784314, 0.00784314, 0.725490215, 0.99019608, 0.23137255, 0.00784314, 0.00784314, 0.00784314, 0.00784314, 0.00784314, 0.00784314, 0.9607843149999999, 0.99019608, 0.5921568850000001, 0.00784314, 0.00784314, 0.00784314, 0.00784314, 0.00784314, 0.00784314, 0.00784314, 0.00784314, 0.00784314, 0.00784314, 0.00784314, 0.00784314, 0.00784314, 0.00784314, 0.00784314, 0.24313726000000002, 0.97254902, 0.717647075, 0.058823534999999996, 0.00784314, 0.00784314, 0.00784314, 0.00784314, 0.00784314, 0.29019609, 0.98627451, 0.99019608, 0.27450981500000005, 0.00784314, 0.00784314, 0.00784314, 0.00784314, 0.00784314, 0.00784314, 0.00784314, 0.00784314, 0.00784314, 0.00784314, 0.00784314, 0.00784314, 0.00784314, 0.00784314, 0.082352945, 0.819607855, 0.97647059, 0.20392157, 0.00784314, 0.00784314, 0.00784314, 0.00784314, 0.00784314, 0.00784314, 0.3882353, 0.99019608, 0.99019608, 0.168627455, 0.00784314, 0.00784314, 0.00784314, 0.00784314, 0.00784314, 0.00784314, 0.00784314, 0.00784314, 0.00784314, 0.00784314, 0.00784314, 0.00784314, 0.00784314, 0.00784314, 0.356862755, 0.99019608, 0.690196095, 0.00784314, 0.00784314, 0.00784314, 0.00784314, 0.00784314, 0.00784314, 0.00784314, 0.470588235, 0.99019608, 0.94901961, 0.137254905, 0.00784314, 0.00784314, 0.00784314, 0.00784314, 0.00784314, 0.00784314, 0.00784314, 0.00784314, 0.00784314, 0.00784314, 0.00784314, 0.00784314, 0.00784314, 0.00784314, 0.043137255, 0.36862746, 0.168627455, 0.00784314, 0.00784314, 0.00784314, 0.00784314, 0.00784314, 0.00784314, 0.00784314, 0.811764715, 0.99019608, 0.741176485, 0.00784314, 0.00784314, 0.00784314, 0.00784314, 0.00784314, 0.00784314, 0.00784314, 0.00784314, 0.00784314, 0.00784314, 0.00784314, 0.00784314, 0.00784314, 0.00784314, 0.00784314, 0.00784314, 0.00784314, 0.00784314, 0.00784314, 0.00784314, 0.00784314, 0.00784314, 0.00784314, 0.00784314, 0.00784314, 0.811764715, 0.99019608, 0.713725505, 0.00784314, 0.00784314, 0.00784314, 0.00784314, 0.00784314, 0.00784314, 0.00784314, 0.00784314, 0.00784314, 0.00784314, 0.00784314, 0.00784314, 0.00784314, 0.00784314, 0.00784314, 0.00784314, 0.00784314, 0.00784314, 0.00784314, 0.00784314, 0.00784314, 0.00784314, 0.00784314, 0.00784314, 0.00784314, 0.811764715, 0.99019608, 0.31764707, 0.00784314, 0.00784314, 0.00784314, 0.00784314, 0.00784314, 0.00784314, 0.00784314, 0.00784314, 0.00784314, 0.00784314, 0.00784314, 0.00784314, 0.00784314, 0.00784314, 0.00784314, 0.00784314, 0.00784314, 0.00784314, 0.00784314, 0.00784314, 0.00784314, 0.00784314, 0.00784314, 0.00784314, 0.00784314, 0.811764715, 0.99019608, 0.31764707, 0.00784314, 0.00784314, 0.00784314, 0.00784314, 0.00784314, 0.00784314, 0.00784314, 0.00784314, 0.00784314, 0.00784314, 0.00784314, 0.00784314, 0.00784314, 0.00784314, 0.00784314, 0.00784314, 0.00784314, 0.00784314, 0.00784314, 0.00784314, 0.00784314, 0.00784314, 0.00784314, 0.00784314, 0.00784314, 0.811764715, 0.99019608, 0.31764707, 0.00784314, 0.00784314, 0.00784314, 0.00784314, 0.00784314, 0.00784314, 0.00784314, 0.00784314, 0.00784314, 0.00784314, 0.00784314, 0.00784314, 0.00784314, 0.00784314, 0.00784314, 0.00784314, 0.00784314, 0.00784314, 0.00784314, 0.00784314, 0.00784314, 0.00784314, 0.00784314, 0.00784314, 0.058823534999999996, 0.85490197, 0.97254902, 0.24313726000000002, 0.00784314, 0.00784314, 0.00784314, 0.00784314, 0.00784314, 0.00784314, 0.00784314, 0.00784314, 0.00784314, 0.00784314, 0.00784314, 0.00784314, 0.00784314, 0.00784314, 0.00784314, 0.00784314, 0.00784314, 0.00784314, 0.00784314, 0.00784314, 0.00784314, 0.00784314, 0.00784314, 0.00784314, 0.235294125, 0.99019608, 0.890196085, 0.00784314, 0.00784314, 0.00784314, 0.00784314, 0.00784314, 0.00784314, 0.00784314, 0.00784314, 0.00784314, 0.00784314, 0.00784314, 0.00784314, 0.00784314, 0.00784314, 0.00784314, 0.00784314, 0.00784314, 0.00784314, 0.00784314, 0.00784314, 0.00784314, 0.00784314, 0.00784314, 0.00784314, 0.00784314, 0.643137275, 0.99019608, 0.890196085, 0.00784314, 0.00784314, 0.00784314, 0.00784314, 0.00784314, 0.00784314, 0.00784314, 0.00784314, 0.00784314, 0.00784314, 0.00784314, 0.00784314, 0.00784314, 0.00784314, 0.00784314, 0.00784314, 0.00784314, 0.00784314, 0.00784314, 0.00784314, 0.00784314, 0.00784314, 0.00784314, 0.00784314, 0.00784314, 0.65882355, 0.99019608, 0.890196085, 0.00784314, 0.00784314, 0.00784314, 0.00784314, 0.00784314, 0.00784314, 0.00784314, 0.00784314, 0.00784314, 0.00784314, 0.00784314, 0.00784314, 0.00784314, 0.00784314, 0.00784314, 0.00784314, 0.00784314, 0.00784314, 0.00784314, 0.00784314, 0.00784314, 0.00784314, 0.00784314, 0.00784314, 0.00784314, 0.65882355, 0.99019608, 0.890196085, 0.00784314, 0.00784314, 0.00784314, 0.00784314, 0.00784314, 0.00784314, 0.00784314, 0.00784314, 0.00784314, 0.00784314, 0.00784314, 0.00784314, 0.00784314, 0.00784314, 0.00784314, 0.00784314, 0.00784314, 0.00784314, 0.00784314, 0.00784314, 0.00784314, 0.00784314, 0.00784314, 0.00784314, 0.050980395, 0.847058835, 0.99019608, 0.65490198, 0.00784314, 0.00784314, 0.00784314, 0.00784314, 0.00784314, 0.00784314, 0.00784314, 0.00784314, 0.00784314, 0.00784314, 0.00784314, 0.00784314, 0.00784314, 0.00784314, 0.00784314, 0.00784314, 0.00784314, 0.00784314, 0.00784314, 0.00784314, 0.00784314, 0.00784314, 0.00784314, 0.00784314, 0.086274515, 0.99019608, 0.99019608, 0.46666667, 0.00784314, 0.00784314, 0.00784314, 0.00784314, 0.00784314, 0.00784314, 0.00784314, 0.00784314, 0.00784314, 0.00784314, 0.00784314, 0.00784314, 0.00784314, 0.00784314, 0.00784314, 0.00784314, 0.00784314, 0.00784314, 0.00784314, 0.00784314, 0.00784314, 0.00784314, 0.00784314, 0.00784314, 0.015686275, 0.70980394, 0.835294125, 0.086274515, 0.00784314, 0.00784314, 0.00784314, 0.00784314, 0.00784314, 0.00784314, 0.00784314, 0.00784314, 0.00784314, 0.00784314, 0.00784314, 0.00784314, 0.00784314, 0.00784314, 0.00784314, 0.00784314, 0.00784314, 0.00784314, 0.00784314, 0.00784314, 0.00784314, 0.00784314, 0.00784314, 0.00784314, 0.00784314, 0.00784314, 0.00784314, 0.00784314, 0.00784314, 0.00784314, 0.00784314, 0.00784314, 0.00784314, 0.00784314, 0.00784314, 0.00784314, 0.00784314, 0.00784314], ([0.0, 0.7315630866398236, 0.0, 0.0, 0.0, 0.0, 0.0, 28.319180952195747, 0.0, 13.648395787784535], [0.0, 1.2538545424869185, 0.0, 0.0, 0.0, 0.0, 0.0, 23.998981178140266, 0.0, 11.674036986004474], 4.320199774055482))
[Thread 1] Total splits: 0
Processed 1 zonotopes (Work Done: 0.0%); Generated 0 (1.637292676s/loop)
[Thread 1] Finished in 1.64s
 ────────────────────────────────────────────────────────────────────────────────
                                        Time                    Allocations      
                               ───────────────────────   ────────────────────────
       Tot / % measured:            1.66s / 100.0%            509MiB / 100.0%    

 Section               ncalls     time    %tot     avg     alloc    %tot      avg
 ────────────────────────────────────────────────────────────────────────────────
 Verify                     1    1.64s   98.5%   1.64s    482MiB   94.7%   482MiB
   Zonotope Loop            1    1.64s   98.5%   1.64s    482MiB   94.7%   482MiB
     Zonotope Propa...      1    1.62s   97.2%   1.62s    460MiB   90.4%   460MiB
       DiffZonotope...      4    1.15s   68.9%   287ms    403MiB   79.2%   101MiB
         Zonotope_R...      8    1.14s   68.7%   143ms    403MiB   79.2%  50.4MiB
           Influenc...      8    989ms   59.5%   124ms    232MiB   45.6%  29.0MiB
             Multiply       8    942ms   56.6%   118ms    135MiB   26.6%  16.9MiB
             Alloca...      8   31.9ms    1.9%  3.99ms   96.7MiB   19.0%  12.1MiB
             Set Ma...      8   14.8ms    0.9%  1.85ms     0.00B    0.0%    0.00B
           Allocation       8   95.8ms    5.8%  12.0ms   85.3MiB   16.8%  10.7MiB
           Column M...      8   42.3ms    2.5%  5.29ms   85.3MiB   16.8%  10.7MiB
           Set Matrix       8   14.8ms    0.9%  1.85ms   97.0KiB    0.0%  12.1KiB
           Vectors          8    230μs    0.0%  28.8μs    272KiB    0.1%  34.0KiB
           Bounds           8   5.15μs    0.0%   644ns     0.00B    0.0%    0.00B
       DiffZonotope...      5    471ms   28.3%  94.1ms   56.8MiB   11.2%  11.4MiB
         Zonotope_D...     10    471ms   28.3%  47.1ms   56.8MiB   11.2%  5.68MiB
     Property Check         1   7.40ms    0.4%  7.40ms    773KiB    0.1%   773KiB
 Initialize                 1   25.6ms    1.5%  25.6ms   27.0MiB    5.3%  27.0MiB
 ────────────────────────────────────────────────────────────────────────────────
[VERYDIFF_TIMER] 1.75053679

[VERYDIFF_EXPERIMENT] NETWORK: /home/i57/steuber/NeuroDiff/repos/VeryDiffExperiments/src/../benchmarks/mnist-prune/specs/mnist_83_global_4.vnnlib
[VERYDIFF_EXPERIMENT] TIME: 123.365792243
