
[VERYDIFF_EXPERIMENT] Running on /home/i57/steuber/NeuroDiff/repos/VeryDiffExperiments/src/../benchmarks/mnist-prune/specs/mnist_81_global_4.vnnlib /home/i57/steuber/NeuroDiff/repos/VeryDiffExperiments/src/../benchmarks/mnist-prune/nets/mnist_relu_3_100.onnx
Found input X
op: matmul, weight: (100, 784), bias: nothing
op: bias, weight: nothing, bias: (100,)
op: relu, weight: nothing, bias: nothing
op: matmul, weight: (100, 100), bias: nothing
op: bias, weight: nothing, bias: (100,)
op: relu, weight: nothing, bias: nothing
op: matmul, weight: (10, 100), bias: nothing
op: bias, weight: nothing, bias: (10,)
op: relu, weight: nothing, bias: nothing
op: matmul, weight: (10, 10), bias: nothing
op: bias, weight: nothing, bias: (10,)
Found input X
op: gemm, weight: (100, 784), bias: (100,)
op: relu, weight: nothing, bias: nothing
op: gemm, weight: (100, 100), bias: (100,)
op: relu, weight: nothing, bias: nothing
op: gemm, weight: (10, 100), bias: (10,)
op: relu, weight: nothing, bias: nothing
op: gemm, weight: (10, 10), bias: (10,)
Distance: 1958.4889029213523
Distance: 144.28197153992141
Distance: 22.063573056613677
Distance: 0.8412832540489035
Running with 1 threads
[Thread 1] Time to first task: 0.0s
Instable Generators: 30
Instable Generators: 41
Instable Generators: 7
Zono Bounds:
[-3.3381297625942845, -3.427591450098783, -3.2739827018345045, -0.020442312620147826, -3.9372729870626095, -4.0218942295154205, -3.549950806432969, -0.01419482143026165, -3.24064511863107, -3.7204350891821196]
[3.3530831894512496, 3.078882067769459, 3.342234335761961, -0.009359010657159703, 3.9372463296549896, 3.651950372411475, 3.6697415215457245, -0.00045483821953947075, 3.2873069733722176, 3.5432245973240937]
[Thread 1] Processed 100 zonotopes (Work Done: 0.0%; Expected Zonos: Inf)
[Thread 1] Processed 200 zonotopes (Work Done: 0.0%; Expected Zonos: Inf)
[Thread 1] Processed 300 zonotopes (Work Done: 0.0%; Expected Zonos: Inf)
[Thread 1] Processed 400 zonotopes (Work Done: 0.0%; Expected Zonos: Inf)
[Thread 1] Processed 500 zonotopes (Work Done: 0.0%; Expected Zonos: Inf)


TIMEOUT REACHED
UNKNOWN
[Thread 1] Total splits: 574
Processed 574 zonotopes (Work Done: 0.0%); Generated 1148 (0.20913928829965156s/loop)
[Thread 1] Finished in 120.05s
 ────────────────────────────────────────────────────────────────────────────────
                                        Time                    Allocations      
                               ───────────────────────   ────────────────────────
       Tot / % measured:             120s / 100.0%           60.6GiB / 100.0%    

 Section               ncalls     time    %tot     avg     alloc    %tot      avg
 ────────────────────────────────────────────────────────────────────────────────
 Verify                     1     120s  100.0%    120s   60.6GiB  100.0%  60.6GiB
   Zonotope Loop            1     120s  100.0%    120s   60.6GiB  100.0%  60.6GiB
     Zonotope Propa...    574    90.1s   75.0%   157ms   40.7GiB   67.2%  72.7MiB
       DiffZonotope...  1.72k    80.1s   66.7%  46.5ms   38.4GiB   63.4%  22.8MiB
         Zonotope_R...  3.44k    79.4s   66.2%  23.1ms   37.5GiB   61.9%  11.2MiB
           Influenc...  3.44k    72.8s   60.6%  21.1ms   34.5GiB   56.9%  10.3MiB
             Multiply   3.44k    40.0s   33.3%  11.6ms   17.5GiB   28.9%  5.21MiB
             Alloca...  3.44k    30.3s   25.3%  8.81ms   17.0GiB   28.0%  5.05MiB
             Set Ma...  3.44k    2.46s    2.1%   715μs     0.00B    0.0%    0.00B
           Column M...  3.44k    6.34s    5.3%  1.84ms   1.50GiB    2.5%   457KiB
           Set Matrix   3.44k    188ms    0.2%  54.5μs   3.10MiB    0.0%     945B
           Allocation   3.44k   82.6ms    0.1%  24.0μs   1.50GiB    2.5%   457KiB
           Vectors      3.44k   17.9ms    0.0%  5.20μs   10.9MiB    0.0%  3.26KiB
           Bounds       3.44k   2.53ms    0.0%   734ns     0.00B    0.0%    0.00B
       DiffZonotope...  2.30k    10.0s    8.3%  4.36ms   2.31GiB    3.8%  1.03MiB
         Zonotope_D...  4.59k    4.84s    4.0%  1.05ms   1.52GiB    2.5%   347KiB
     Compute Split        574    27.7s   23.1%  48.3ms   8.61GiB   14.2%  15.4MiB
     Property Check       574    112ms    0.1%   195μs    118MiB    0.2%   210KiB
 Initialize                 1    570μs    0.0%   570μs   5.41MiB    0.0%  5.41MiB
 ────────────────────────────────────────────────────────────────────────────────
[VERYDIFF_TIMER] 120.076281219

[VERYDIFF_EXPERIMENT] NETWORK: /home/i57/steuber/NeuroDiff/repos/VeryDiffExperiments/src/../benchmarks/mnist-prune/specs/mnist_81_global_4.vnnlib
[VERYDIFF_EXPERIMENT] TIME: 120.53980165
