
[VERYDIFF_EXPERIMENT] Running on /home/i57/steuber/NeuroDiff/repos/VeryDiffExperiments/src/../benchmarks/mnist-prune/specs/mnist_83_global_3.vnnlib /home/i57/steuber/NeuroDiff/repos/VeryDiffExperiments/src/../benchmarks/mnist-prune/nets/mnist_relu_3_100.onnx
Found input X
op: matmul, weight: (100, 784), bias: nothing
op: bias, weight: nothing, bias: (100,)
op: relu, weight: nothing, bias: nothing
op: matmul, weight: (100, 100), bias: nothing
op: bias, weight: nothing, bias: (100,)
op: relu, weight: nothing, bias: nothing
op: matmul, weight: (10, 100), bias: nothing
op: bias, weight: nothing, bias: (10,)
op: relu, weight: nothing, bias: nothing
op: matmul, weight: (10, 10), bias: nothing
op: bias, weight: nothing, bias: (10,)
Found input X
op: gemm, weight: (100, 784), bias: (100,)
op: relu, weight: nothing, bias: nothing
op: gemm, weight: (100, 100), bias: (100,)
op: relu, weight: nothing, bias: nothing
op: gemm, weight: (10, 100), bias: (10,)
op: relu, weight: nothing, bias: nothing
op: gemm, weight: (10, 10), bias: (10,)
Distance: 368.62397500800625
Distance: 47.56803950402309
Distance: 2.8977568827249343
Distance: 0.01885471428334995
Running with 1 threads
[Thread 1] Time to first task: 0.0s
Instable Generators: 26
Instable Generators: 26
Instable Generators: 4
Zono Bounds:
[0.0005294134924727752, -0.00040463891491273284, -0.4082673376830959, -0.40527373769328345, -0.4922396509663093, -0.5185324829383797, 0.0003841254547719677, -0.4198898009338968, -0.0006634860590112136, -0.44453565022919717]
[0.0007664777082406899, 0.00011267605047225705, 0.3673004633301437, 0.40186332362978694, 0.49288908970613043, 0.4696349798577167, 0.0006101554271012254, 0.5094111737738709, -0.00022330194415837818, 0.4286768232267746]
[Thread 1] Processed 100 zonotopes (Work Done: 0.0%; Expected Zonos: Inf)
[Thread 1] Processed 200 zonotopes (Work Done: 0.0%; Expected Zonos: Inf)
[Thread 1] Processed 300 zonotopes (Work Done: 0.0%; Expected Zonos: Inf)
[Thread 1] Processed 400 zonotopes (Work Done: 0.0%; Expected Zonos: Inf)
[Thread 1] Processed 500 zonotopes (Work Done: 0.0%; Expected Zonos: Inf)


TIMEOUT REACHED
UNKNOWN
[Thread 1] Total splits: 582
Processed 582 zonotopes (Work Done: 0.0%); Generated 1164 (0.2067927604484536s/loop)
[Thread 1] Finished in 120.35s
 ────────────────────────────────────────────────────────────────────────────────
                                        Time                    Allocations      
                               ───────────────────────   ────────────────────────
       Tot / % measured:             120s / 100.0%           60.5GiB / 100.0%    

 Section               ncalls     time    %tot     avg     alloc    %tot      avg
 ────────────────────────────────────────────────────────────────────────────────
 Verify                     1     120s  100.0%    120s   60.5GiB  100.0%  60.5GiB
   Zonotope Loop            1     120s  100.0%    120s   60.5GiB  100.0%  60.5GiB
     Zonotope Propa...    582    90.3s   75.0%   155ms   40.5GiB   66.9%  71.2MiB
       DiffZonotope...  1.75k    80.0s   66.4%  45.8ms   38.1GiB   63.0%  22.4MiB
         Zonotope_R...  3.49k    73.5s   61.1%  21.1ms   37.3GiB   61.6%  10.9MiB
           Influenc...  3.49k    72.8s   60.5%  20.8ms   34.2GiB   56.6%  10.0MiB
             Multiply   3.49k    39.5s   32.8%  11.3ms   17.3GiB   28.6%  5.08MiB
             Alloca...  3.49k    30.8s   25.6%  8.82ms   16.9GiB   28.0%  4.96MiB
             Set Ma...  3.49k    2.46s    2.0%   704μs     0.00B    0.0%    0.00B
           Column M...  3.49k    463ms    0.4%   132μs   1.50GiB    2.5%   451KiB
           Set Matrix   3.49k    189ms    0.2%  54.1μs   2.55MiB    0.0%     765B
           Allocation   3.49k   78.4ms    0.1%  22.4μs   1.50GiB    2.5%   451KiB
           Vectors      3.49k   17.5ms    0.0%  5.01μs   11.1MiB    0.0%  3.26KiB
           Bounds       3.49k   2.57ms    0.0%   735ns     0.00B    0.0%    0.00B
       DiffZonotope...  2.33k    10.3s    8.6%  4.42ms   2.33GiB    3.9%  1.03MiB
         Zonotope_D...  4.66k    5.02s    4.2%  1.08ms   1.53GiB    2.5%   345KiB
     Compute Split        582    4.43s    3.7%  7.62ms   8.59GiB   14.2%  15.1MiB
     Property Check       582    114ms    0.1%   196μs    118MiB    0.2%   207KiB
 Initialize                 1    530μs    0.0%   530μs   5.41MiB    0.0%  5.41MiB
 ────────────────────────────────────────────────────────────────────────────────
[VERYDIFF_TIMER] 120.387685182

[VERYDIFF_EXPERIMENT] NETWORK: /home/i57/steuber/NeuroDiff/repos/VeryDiffExperiments/src/../benchmarks/mnist-prune/specs/mnist_83_global_3.vnnlib
[VERYDIFF_EXPERIMENT] TIME: 120.856394056
