%!PS-Adobe-3.0 EPSF-3.0
%%Title: rice_difference_speedup.eps
%%Creator: Matplotlib v3.6.0, https://matplotlib.org/
%%CreationDate: Wed Oct  9 18:15:41 2024
%%Orientation: portrait
%%BoundingBox: 135 247 477 545
%%HiResBoundingBox: 135.373537 247.550500 476.626463 544.449500
%%EndComments
%%BeginProlog
/mpldict 11 dict def
mpldict begin
/_d { bind def } bind def
/m { moveto } _d
/l { lineto } _d
/r { rlineto } _d
/c { curveto } _d
/cl { closepath } _d
/ce { closepath eofill } _d
/box {
      m
      1 index 0 r
      0 exch r
      neg 0 r
      cl
    } _d
/clipbox {
      box
      clip
      newpath
    } _d
/sc { setcachedevice } _d
%!PS-Adobe-3.0 Resource-Font
%%Creator: Converted from TrueType to Type 3 by Matplotlib.
10 dict begin
/FontName /DejaVuSans def
/PaintType 0 def
/FontMatrix [0.00048828125 0 0 0.00048828125 0 0] def
/FontBBox [-2090 -948 3673 2524] def
/FontType 3 def
/Encoding [/space /ampersand /period /zero /one /two /three /four /five /D /M /O /P /Q /R /S /W /Z /a /c /d /e /f /g /h /i /l /n /o /p /r /s /t /u /y] def
/CharStrings 36 dict dup begin
/.notdef 0 def
/space{651 0 0 0 0 0 sc
ce} _d
/ampersand{1597 0 129 -29 1534 1520 sc
498 803 m
437 749 393 695 364 641 c
336 588 322 532 322 473 c
322 376 357 295 428 230 c
499 165 587 133 694 133 c
757 133 817 143 872 164 c
927 185 979 217 1028 260 c
498 803 l

639 915 m
1147 395 l
1186 454 1217 518 1239 585 c
1261 653 1274 725 1278 801 c
1464 801 l
1456 713 1435 626 1400 540 c
1365 454 1317 369 1255 285 c
1534 0 l
1282 0 l
1139 147 l
1070 88 997 43 921 14 c
845 -15 763 -29 676 -29 c
515 -29 384 17 282 108 c
180 200 129 318 129 461 c
129 546 151 626 196 701 c
241 776 308 847 397 913 c
365 955 341 997 324 1038 c
307 1080 299 1121 299 1161 c
299 1269 336 1356 410 1421 c
484 1487 582 1520 705 1520 c
760 1520 815 1514 870 1502 c
925 1490 981 1472 1038 1448 c
1038 1266 l
980 1297 925 1321 872 1337 c
819 1354 770 1362 725 1362 c
655 1362 598 1343 554 1306 c
511 1269 489 1222 489 1163 c
489 1129 499 1095 518 1060 c
538 1026 578 978 639 915 c

ce} _d
/period{651 0 219 0 430 254 sc
219 254 m
430 254 l
430 0 l
219 0 l
219 254 l

ce} _d
/zero{1303 0 135 -29 1167 1520 sc
651 1360 m
547 1360 469 1309 416 1206 c
364 1104 338 950 338 745 c
338 540 364 387 416 284 c
469 182 547 131 651 131 c
756 131 834 182 886 284 c
939 387 965 540 965 745 c
965 950 939 1104 886 1206 c
834 1309 756 1360 651 1360 c

651 1520 m
818 1520 946 1454 1034 1321 c
1123 1189 1167 997 1167 745 c
1167 494 1123 302 1034 169 c
946 37 818 -29 651 -29 c
484 -29 356 37 267 169 c
179 302 135 494 135 745 c
135 997 179 1189 267 1321 c
356 1454 484 1520 651 1520 c

ce} _d
/one{1303 0 225 0 1114 1493 sc
254 170 m
584 170 l
584 1309 l
225 1237 l
225 1421 l
582 1493 l
784 1493 l
784 170 l
1114 170 l
1114 0 l
254 0 l
254 170 l

ce} _d
/two{1303 0 150 0 1098 1520 sc
393 170 m
1098 170 l
1098 0 l
150 0 l
150 170 l
227 249 331 356 463 489 c
596 623 679 709 713 748 c
778 821 823 882 848 932 c
874 983 887 1032 887 1081 c
887 1160 859 1225 803 1275 c
748 1325 675 1350 586 1350 c
523 1350 456 1339 385 1317 c
315 1295 240 1262 160 1217 c
160 1421 l
241 1454 317 1478 388 1495 c
459 1512 523 1520 582 1520 c
737 1520 860 1481 952 1404 c
1044 1327 1090 1223 1090 1094 c
1090 1033 1078 974 1055 919 c
1032 864 991 800 930 725 c
913 706 860 650 771 557 c
682 465 556 336 393 170 c

ce} _d
/three{1303 0 156 -29 1139 1520 sc
831 805 m
928 784 1003 741 1057 676 c
1112 611 1139 530 1139 434 c
1139 287 1088 173 987 92 c
886 11 742 -29 555 -29 c
492 -29 428 -23 361 -10 c
295 2 227 20 156 45 c
156 240 l
212 207 273 183 340 166 c
407 149 476 141 549 141 c
676 141 772 166 838 216 c
905 266 938 339 938 434 c
938 522 907 591 845 640 c
784 690 698 715 588 715 c
414 715 l
414 881 l
596 881 l
695 881 771 901 824 940 c
877 980 903 1037 903 1112 c
903 1189 876 1247 821 1288 c
767 1329 689 1350 588 1350 c
533 1350 473 1344 410 1332 c
347 1320 277 1301 201 1276 c
201 1456 l
278 1477 349 1493 416 1504 c
483 1515 547 1520 606 1520 c
759 1520 881 1485 970 1415 c
1059 1346 1104 1252 1104 1133 c
1104 1050 1080 980 1033 923 c
986 866 918 827 831 805 c

ce} _d
/four{1303 0 100 0 1188 1493 sc
774 1317 m
264 520 l
774 520 l
774 1317 l

721 1493 m
975 1493 l
975 520 l
1188 520 l
1188 352 l
975 352 l
975 0 l
774 0 l
774 352 l
100 352 l
100 547 l
721 1493 l

ce} _d
/five{1303 0 158 -29 1124 1493 sc
221 1493 m
1014 1493 l
1014 1323 l
406 1323 l
406 957 l
435 967 465 974 494 979 c
523 984 553 987 582 987 c
749 987 881 941 978 850 c
1075 759 1124 635 1124 479 c
1124 318 1074 193 974 104 c
874 15 733 -29 551 -29 c
488 -29 424 -24 359 -13 c
294 -2 227 14 158 35 c
158 238 l
218 205 280 181 344 165 c
408 149 476 141 547 141 c
662 141 754 171 821 232 c
888 293 922 375 922 479 c
922 583 888 665 821 726 c
754 787 662 817 547 817 c
493 817 439 811 385 799 c
332 787 277 768 221 743 c
221 1493 l

ce} _d
/D{1577 0 201 0 1456 1493 sc
403 1327 m
403 166 l
647 166 l
853 166 1004 213 1099 306 c
1195 399 1243 547 1243 748 c
1243 948 1195 1094 1099 1187 c
1004 1280 853 1327 647 1327 c
403 1327 l

201 1493 m
616 1493 l
905 1493 1118 1433 1253 1312 c
1388 1192 1456 1004 1456 748 c
1456 491 1388 302 1252 181 c
1116 60 904 0 616 0 c
201 0 l
201 1493 l

ce} _d
/M{1767 0 201 0 1567 1493 sc
201 1493 m
502 1493 l
883 477 l
1266 1493 l
1567 1493 l
1567 0 l
1370 0 l
1370 1311 l
985 287 l
782 287 l
397 1311 l
397 0 l
201 0 l
201 1493 l

ce} _d
/O{1612 0 115 -29 1497 1520 sc
807 1356 m
660 1356 544 1301 457 1192 c
371 1083 328 934 328 745 c
328 557 371 408 457 299 c
544 190 660 135 807 135 c
954 135 1070 190 1155 299 c
1241 408 1284 557 1284 745 c
1284 934 1241 1083 1155 1192 c
1070 1301 954 1356 807 1356 c

807 1520 m
1016 1520 1184 1450 1309 1309 c
1434 1169 1497 981 1497 745 c
1497 510 1434 322 1309 181 c
1184 41 1016 -29 807 -29 c
597 -29 429 41 303 181 c
178 321 115 509 115 745 c
115 981 178 1169 303 1309 c
429 1450 597 1520 807 1520 c

ce} _d
/P{1235 0 201 0 1165 1493 sc
403 1327 m
403 766 l
657 766 l
751 766 824 790 875 839 c
926 888 952 957 952 1047 c
952 1136 926 1205 875 1254 c
824 1303 751 1327 657 1327 c
403 1327 l

201 1493 m
657 1493 l
824 1493 951 1455 1036 1379 c
1122 1304 1165 1193 1165 1047 c
1165 900 1122 788 1036 713 c
951 638 824 600 657 600 c
403 600 l
403 0 l
201 0 l
201 1493 l

ce} _d
/Q{1612 0 115 -264 1497 1520 sc
807 1356 m
660 1356 544 1301 457 1192 c
371 1083 328 934 328 745 c
328 557 371 408 457 299 c
544 190 660 135 807 135 c
954 135 1070 190 1155 299 c
1241 408 1284 557 1284 745 c
1284 934 1241 1083 1155 1192 c
1070 1301 954 1356 807 1356 c

1090 27 m
1356 -264 l
1112 -264 l
891 -25 l
869 -26 852 -27 840 -28 c
829 -29 818 -29 807 -29 c
597 -29 429 41 303 181 c
178 322 115 510 115 745 c
115 981 178 1169 303 1309 c
429 1450 597 1520 807 1520 c
1016 1520 1184 1450 1309 1309 c
1434 1169 1497 981 1497 745 c
1497 572 1462 423 1392 300 c
1323 177 1222 86 1090 27 c

ce} _d
/R{1423 0 201 0 1364 1493 sc
909 700 m
952 685 994 654 1035 606 c
1076 558 1118 492 1159 408 c
1364 0 l
1147 0 l
956 383 l
907 483 859 549 812 582 c
766 615 703 631 623 631 c
403 631 l
403 0 l
201 0 l
201 1493 l
657 1493 l
828 1493 955 1457 1039 1386 c
1123 1315 1165 1207 1165 1063 c
1165 969 1143 891 1099 829 c
1056 767 992 724 909 700 c

403 1327 m
403 797 l
657 797 l
754 797 828 819 877 864 c
927 909 952 976 952 1063 c
952 1150 927 1216 877 1260 c
828 1305 754 1327 657 1327 c
403 1327 l

ce} _d
/S{1300 0 135 -29 1186 1520 sc
1096 1444 m
1096 1247 l
1019 1284 947 1311 879 1329 c
811 1347 745 1356 682 1356 c
572 1356 487 1335 427 1292 c
368 1249 338 1189 338 1110 c
338 1044 358 994 397 960 c
437 927 512 900 623 879 c
745 854 l
896 825 1007 775 1078 702 c
1150 630 1186 533 1186 412 c
1186 267 1137 158 1040 83 c
943 8 801 -29 614 -29 c
543 -29 468 -21 388 -5 c
309 11 226 35 141 66 c
141 274 l
223 228 303 193 382 170 c
461 147 538 135 614 135 c
729 135 818 158 881 203 c
944 248 975 313 975 397 c
975 470 952 528 907 569 c
862 610 789 641 686 662 c
563 686 l
412 716 303 763 236 827 c
169 891 135 980 135 1094 c
135 1226 181 1330 274 1406 c
367 1482 496 1520 659 1520 c
729 1520 800 1514 873 1501 c
946 1488 1020 1469 1096 1444 c

ce} _d
/W{2025 0 68 0 1958 1493 sc
68 1493 m
272 1493 l
586 231 l
899 1493 l
1126 1493 l
1440 231 l
1753 1493 l
1958 1493 l
1583 0 l
1329 0 l
1014 1296 l
696 0 l
442 0 l
68 1493 l

ce} _d
/Z{1403 0 92 0 1311 1493 sc
115 1493 m
1288 1493 l
1288 1339 l
344 170 l
1311 170 l
1311 0 l
92 0 l
92 154 l
1036 1323 l
115 1323 l
115 1493 l

ce} _d
/a{1255 0 123 -29 1069 1147 sc
702 563 m
553 563 450 546 393 512 c
336 478 307 420 307 338 c
307 273 328 221 371 182 c
414 144 473 125 547 125 c
649 125 731 161 792 233 c
854 306 885 402 885 522 c
885 563 l
702 563 l

1069 639 m
1069 0 l
885 0 l
885 170 l
843 102 791 52 728 19 c
665 -13 589 -29 498 -29 c
383 -29 292 3 224 67 c
157 132 123 218 123 326 c
123 452 165 547 249 611 c
334 675 460 707 627 707 c
885 707 l
885 725 l
885 810 857 875 801 921 c
746 968 668 991 567 991 c
503 991 441 983 380 968 c
319 953 261 930 205 899 c
205 1069 l
272 1095 338 1114 401 1127 c
464 1140 526 1147 586 1147 c
748 1147 869 1105 949 1021 c
1029 937 1069 810 1069 639 c

ce} _d
/c{1126 0 113 -29 999 1147 sc
999 1077 m
999 905 l
947 934 895 955 842 969 c
790 984 737 991 684 991 c
565 991 472 953 406 877 c
340 802 307 696 307 559 c
307 422 340 316 406 240 c
472 165 565 127 684 127 c
737 127 790 134 842 148 c
895 163 947 184 999 213 c
999 43 l
948 19 894 1 839 -11 c
784 -23 726 -29 664 -29 c
495 -29 361 24 262 130 c
163 236 113 379 113 559 c
113 742 163 885 263 990 c
364 1095 501 1147 676 1147 c
733 1147 788 1141 842 1129 c
896 1118 948 1100 999 1077 c

ce} _d
/d{1300 0 113 -29 1114 1556 sc
930 950 m
930 1556 l
1114 1556 l
1114 0 l
930 0 l
930 168 l
891 101 842 52 783 19 c
724 -13 654 -29 571 -29 c
436 -29 325 25 240 133 c
155 241 113 383 113 559 c
113 735 155 877 240 985 c
325 1093 436 1147 571 1147 c
654 1147 724 1131 783 1098 c
842 1066 891 1017 930 950 c

303 559 m
303 424 331 317 386 240 c
442 163 519 125 616 125 c
713 125 790 163 846 240 c
902 317 930 424 930 559 c
930 694 902 800 846 877 c
790 954 713 993 616 993 c
519 993 442 954 386 877 c
331 800 303 694 303 559 c

ce} _d
/e{1260 0 113 -29 1151 1147 sc
1151 606 m
1151 516 l
305 516 l
313 389 351 293 419 226 c
488 160 583 127 705 127 c
776 127 844 136 910 153 c
977 170 1043 196 1108 231 c
1108 57 l
1042 29 974 8 905 -7 c
836 -22 765 -29 694 -29 c
515 -29 374 23 269 127 c
165 231 113 372 113 549 c
113 732 162 878 261 985 c
360 1093 494 1147 662 1147 c
813 1147 932 1098 1019 1001 c
1107 904 1151 773 1151 606 c

967 660 m
966 761 937 841 882 901 c
827 961 755 991 664 991 c
561 991 479 962 417 904 c
356 846 320 764 311 659 c
967 660 l

ce} _d
/f{721 0 47 0 760 1556 sc
760 1556 m
760 1403 l
584 1403 l
518 1403 472 1390 446 1363 c
421 1336 408 1288 408 1219 c
408 1120 l
711 1120 l
711 977 l
408 977 l
408 0 l
223 0 l
223 977 l
47 977 l
47 1120 l
223 1120 l
223 1198 l
223 1323 252 1413 310 1470 c
368 1527 460 1556 586 1556 c
760 1556 l

ce} _d
/g{1300 0 113 -426 1114 1147 sc
930 573 m
930 706 902 810 847 883 c
792 956 715 993 616 993 c
517 993 440 956 385 883 c
330 810 303 706 303 573 c
303 440 330 337 385 264 c
440 191 517 154 616 154 c
715 154 792 191 847 264 c
902 337 930 440 930 573 c

1114 139 m
1114 -52 1072 -193 987 -286 c
902 -379 773 -426 598 -426 c
533 -426 472 -421 415 -411 c
358 -402 302 -387 248 -367 c
248 -188 l
302 -217 355 -239 408 -253 c
461 -267 514 -274 569 -274 c
690 -274 780 -242 840 -179 c
900 -116 930 -21 930 106 c
930 197 l
892 131 843 82 784 49 c
725 16 654 0 571 0 c
434 0 323 52 239 157 c
155 262 113 400 113 573 c
113 746 155 885 239 990 c
323 1095 434 1147 571 1147 c
654 1147 725 1131 784 1098 c
843 1065 892 1016 930 950 c
930 1120 l
1114 1120 l
1114 139 l

ce} _d
/h{1298 0 186 0 1124 1556 sc
1124 676 m
1124 0 l
940 0 l
940 670 l
940 776 919 855 878 908 c
837 961 775 987 692 987 c
593 987 514 955 457 892 c
400 829 371 742 371 633 c
371 0 l
186 0 l
186 1556 l
371 1556 l
371 946 l
415 1013 467 1064 526 1097 c
586 1130 655 1147 733 1147 c
862 1147 959 1107 1025 1027 c
1091 948 1124 831 1124 676 c

ce} _d
/i{569 0 193 0 377 1556 sc
193 1120 m
377 1120 l
377 0 l
193 0 l
193 1120 l

193 1556 m
377 1556 l
377 1323 l
193 1323 l
193 1556 l

ce} _d
/l{569 0 193 0 377 1556 sc
193 1556 m
377 1556 l
377 0 l
193 0 l
193 1556 l

ce} _d
/n{1298 0 186 0 1124 1147 sc
1124 676 m
1124 0 l
940 0 l
940 670 l
940 776 919 855 878 908 c
837 961 775 987 692 987 c
593 987 514 955 457 892 c
400 829 371 742 371 633 c
371 0 l
186 0 l
186 1120 l
371 1120 l
371 946 l
415 1013 467 1064 526 1097 c
586 1130 655 1147 733 1147 c
862 1147 959 1107 1025 1027 c
1091 948 1124 831 1124 676 c

ce} _d
/o{1253 0 113 -29 1141 1147 sc
627 991 m
528 991 450 952 393 875 c
336 798 307 693 307 559 c
307 425 335 319 392 242 c
449 165 528 127 627 127 c
725 127 803 166 860 243 c
917 320 946 426 946 559 c
946 692 917 797 860 874 c
803 952 725 991 627 991 c

627 1147 m
787 1147 913 1095 1004 991 c
1095 887 1141 743 1141 559 c
1141 376 1095 232 1004 127 c
913 23 787 -29 627 -29 c
466 -29 340 23 249 127 c
158 232 113 376 113 559 c
113 743 158 887 249 991 c
340 1095 466 1147 627 1147 c

ce} _d
/p{1300 0 186 -426 1188 1147 sc
371 168 m
371 -426 l
186 -426 l
186 1120 l
371 1120 l
371 950 l
410 1017 458 1066 517 1098 c
576 1131 647 1147 729 1147 c
865 1147 975 1093 1060 985 c
1145 877 1188 735 1188 559 c
1188 383 1145 241 1060 133 c
975 25 865 -29 729 -29 c
647 -29 576 -13 517 19 c
458 52 410 101 371 168 c

997 559 m
997 694 969 800 913 877 c
858 954 781 993 684 993 c
587 993 510 954 454 877 c
399 800 371 694 371 559 c
371 424 399 317 454 240 c
510 163 587 125 684 125 c
781 125 858 163 913 240 c
969 317 997 424 997 559 c

ce} _d
/r{842 0 186 0 842 1147 sc
842 948 m
821 960 799 969 774 974 c
750 980 723 983 694 983 c
590 983 510 949 454 881 c
399 814 371 717 371 590 c
371 0 l
186 0 l
186 1120 l
371 1120 l
371 946 l
410 1014 460 1064 522 1097 c
584 1130 659 1147 748 1147 c
761 1147 775 1146 790 1144 c
805 1143 822 1140 841 1137 c
842 948 l

ce} _d
/s{1067 0 111 -29 967 1147 sc
907 1087 m
907 913 l
855 940 801 960 745 973 c
689 986 631 993 571 993 c
480 993 411 979 365 951 c
320 923 297 881 297 825 c
297 782 313 749 346 724 c
379 700 444 677 543 655 c
606 641 l
737 613 829 573 884 522 c
939 471 967 400 967 309 c
967 205 926 123 843 62 c
761 1 648 -29 504 -29 c
444 -29 381 -23 316 -11 c
251 0 183 18 111 41 c
111 231 l
179 196 246 169 312 151 c
378 134 443 125 508 125 c
595 125 661 140 708 169 c
755 199 778 241 778 295 c
778 345 761 383 727 410 c
694 437 620 462 506 487 c
442 502 l
328 526 246 563 195 612 c
144 662 119 730 119 817 c
119 922 156 1004 231 1061 c
306 1118 412 1147 549 1147 c
617 1147 681 1142 741 1132 c
801 1122 856 1107 907 1087 c

ce} _d
/t{803 0 55 0 754 1438 sc
375 1438 m
375 1120 l
754 1120 l
754 977 l
375 977 l
375 369 l
375 278 387 219 412 193 c
437 167 488 154 565 154 c
754 154 l
754 0 l
565 0 l
423 0 325 26 271 79 c
217 132 190 229 190 369 c
190 977 l
55 977 l
55 1120 l
190 1120 l
190 1438 l
375 1438 l

ce} _d
/u{1298 0 174 -29 1112 1147 sc
174 442 m
174 1120 l
358 1120 l
358 449 l
358 343 379 263 420 210 c
461 157 523 131 606 131 c
705 131 784 163 841 226 c
899 289 928 376 928 485 c
928 1120 l
1112 1120 l
1112 0 l
928 0 l
928 172 l
883 104 831 53 772 20 c
713 -13 645 -29 567 -29 c
438 -29 341 11 274 91 c
207 171 174 288 174 442 c

637 1147 m
637 1147 l

ce} _d
/y{1212 0 61 -426 1151 1120 sc
659 -104 m
607 -237 556 -324 507 -365 c
458 -406 392 -426 309 -426 c
162 -426 l
162 -272 l
270 -272 l
321 -272 360 -260 388 -236 c
416 -212 447 -155 481 -66 c
514 18 l
61 1120 l
256 1120 l
606 244 l
956 1120 l
1151 1120 l
659 -104 l

ce} _d
end readonly def

/BuildGlyph {
 exch begin
 CharStrings exch
 2 copy known not {pop /.notdef} if
 true 3 1 roll get exec
 end
} _d

/BuildChar {
 1 index /Encoding get exch get
 1 index /BuildGlyph get exec
} _d

FontName currentdict end definefont pop
end
%%EndProlog
mpldict begin
135.374 247.551 translate
341.253 296.899 0 0 clipbox
gsave
0 0 m
341.252925 0 l
341.252925 296.899 l
0 296.899 l
cl
1.000 setgray
fill
grestore
gsave
43.2 149.7815 m
320.177726 149.7815 l
320.177726 269.2615 l
43.2 269.2615 l
cl
1.000 setgray
fill
grestore
1.000 setlinewidth
1 setlinejoin
0 setlinecap
[] 0 setdash
0.678 0.847 0.902 setrgbcolor
gsave
276.978 119.48 43.2 149.781 clipbox
/o {
gsave
newpath
translate
1.0 setlinewidth
1 setlinejoin

0 setlinecap

130.889967 201.808139 m
130.889967 188.244112 l
156.86938 176.067719 l
173.316547 169.652337 l
184.27032 167.713031 l
191.547122 175.03205 l
193.270661 162.931615 l
200.227343 162.03469 l
206.118025 160.996162 l
211.192497 161.024074 l
212.603646 165.32706 l
214.710417 160.941875 l
224.289754 164.446211 l
233.406012 164.567964 l
240.787942 164.171221 l
245.63817 172.519387 l
248.815581 162.161903 l
254.715825 160.432293 l
259.453192 160.292323 l
261.280726 158.318059 l
261.682059 167.319381 l
262.468292 160.722017 l
266.933494 158.47617 l
273.234712 165.394289 l
275.624613 158.6577 l
280.884712 158.782331 l
283.216486 164.212119 l
286.717386 158.800638 l
290.751618 162.398338 l
291.455864 158.792181 l
295.984509 160.574482 l
296.071759 159.453073 l
298.471543 158.834299 l
300.383499 159.814638 l
301.005111 159.595459 l
305.057254 159.73466 l
307.587829 160.034097 l
307.587829 160.299578 l
307.587829 160.299578 l
305.057254 160.210139 l
301.005111 160.230344 l
300.383499 160.16763 l
298.471543 159.04461 l
296.071759 159.477152 l
295.984509 161.601696 l
291.455864 158.9799 l
290.751618 164.09755 l
286.717386 158.832507 l
283.216486 166.810301 l
280.884712 158.830224 l
275.624613 158.805834 l
273.234712 168.952717 l
266.933494 158.494618 l
262.468292 161.455351 l
261.682059 172.348895 l
261.280726 158.38101 l
259.453192 160.785987 l
254.715825 160.574793 l
248.815581 162.86876 l
245.63817 177.385484 l
240.787942 165.514896 l
233.406012 166.138673 l
224.289754 165.642617 l
214.710417 161.253287 l
212.603646 166.210294 l
211.192497 161.960845 l
206.118025 161.627034 l
200.227343 162.634154 l
193.270661 163.600953 l
191.547122 177.205287 l
184.27032 170.779352 l
173.316547 173.607065 l
156.86938 182.149446 l
130.889967 201.808139 l
cl

gsave
0.678 0.847 0.902 setrgbcolor
fill
grestore
stroke
grestore
} bind def
0 0 o
grestore
0.565 0.933 0.565 setrgbcolor
gsave
276.978 119.48 43.2 149.781 clipbox
/o {
gsave
newpath
translate
1.0 setlinewidth
1 setlinejoin

0 setlinecap

55.789897 249.379568 m
55.789897 205.817564 l
85.601638 211.533831 l
112.240853 201.965022 l
129.704616 209.349336 l
129.785804 218.475917 l
137.783982 180.620161 l
146.591456 202.531859 l
158.672018 172.866833 l
172.169253 161.345555 l
178.846377 188.815852 l
179.832602 199.40086 l
184.822003 172.948077 l
199.876949 172.001805 l
214.796954 180.532051 l
215.319925 162.279922 l
215.426896 159.92409 l
235.448942 159.136719 l
239.524118 166.493084 l
250.608776 159.467421 l
255.921544 160.026129 l
255.921544 160.750798 l
255.921544 160.750798 l
250.608776 159.746145 l
239.524118 171.627235 l
235.448942 159.49715 l
215.426896 160.699644 l
215.319925 165.004744 l
214.796954 186.526975 l
199.876949 177.089246 l
184.822003 175.981401 l
179.832602 211.12329 l
178.846377 196.562903 l
172.169253 167.180873 l
158.672018 174.663513 l
146.591456 221.366356 l
137.783982 183.666912 l
129.785804 247.272874 l
129.704616 212.289798 l
112.240853 211.846896 l
85.601638 240.09527 l
55.789897 249.379568 l
cl

gsave
0.565 0.933 0.565 setrgbcolor
fill
grestore
stroke
grestore
} bind def
0 0 o
grestore
0.255 0.412 0.882 setrgbcolor
gsave
276.978 119.48 43.2 149.781 clipbox
/o {
gsave
newpath
translate
1.0 setlinewidth
1 setlinejoin

0 setlinecap

0 -1 m
0.265203 -1 0.51958 -0.894634 0.707107 -0.707107 c
0.894634 -0.51958 1 -0.265203 1 0 c
1 0.265203 0.894634 0.51958 0.707107 0.707107 c
0.51958 0.894634 0.265203 1 0 1 c
-0.265203 1 -0.51958 0.894634 -0.707107 0.707107 c
-0.894634 0.51958 -1 0.265203 -1 0 c
-1 -0.265203 -0.894634 -0.51958 -0.707107 -0.707107 c
-0.51958 -0.894634 -0.265203 -1 0 -1 c
cl

gsave
0.255 0.412 0.882 setrgbcolor
fill
grestore
stroke
grestore
} bind def
259.453 160.294 o
259.453 160.403 o
275.625 158.879 o
307.588 160.107 o
191.547 178.639 o
191.547 175.379 o
214.71 161.144 o
214.71 161.204 o
273.235 170.028 o
273.235 166.059 o
191.547 185.026 o
191.547 177.205 o
191.547 171.292 o
184.27 173.161 o
184.27 170.735 o
184.27 167.969 o
305.057 160.26 o
305.057 159.794 o
193.271 163.001 o
193.271 162.958 o
212.604 165.099 o
212.604 165.327 o
206.118 159.567 o
206.118 160.973 o
206.118 161.093 o
233.406 166.232 o
233.406 164.938 o
193.271 160.947 o
193.271 163.116 o
248.816 163.072 o
307.588 161.316 o
307.588 159.952 o
212.604 166.21 o
212.604 164.164 o
240.788 165.582 o
130.89 185.315 o
254.716 160.42 o
291.456 158.768 o
156.869 176.266 o
245.638 171.171 o
211.192 161.506 o
233.406 166.044 o
233.406 164.36 o
296.072 159.441 o
224.29 165.913 o
224.29 164.56 o
296.072 159.489 o
206.118 161.255 o
206.118 161.748 o
254.716 160.822 o
254.716 160.489 o
173.317 169.379 o
273.235 168.565 o
273.235 164.186 o
261.682 166.437 o
262.468 161.995 o
307.588 160.037 o
233.406 166.931 o
211.192 161.417 o
211.192 159.973 o
211.192 161.039 o
261.281 158.412 o
233.406 165.836 o
301.005 161.218 o
301.005 159.492 o
301.005 159.874 o
191.547 175.032 o
156.869 184.082 o
156.869 182.314 o
156.869 176.16 o
283.216 163.341 o
273.235 165.951 o
266.933 158.504 o
200.227 159.304 o
200.227 162.263 o
200.227 162.451 o
191.547 176.061 o
191.547 175.424 o
191.547 169.534 o
290.752 162.262 o
184.27 170.825 o
184.27 170.824 o
184.27 168.136 o
184.27 166.967 o
184.27 164.956 o
184.27 172.787 o
184.27 168.949 o
184.27 167.735 o
298.472 159.071 o
156.869 178.171 o
156.869 175.785 o
290.752 165.074 o
290.752 162.95 o
305.057 160.21 o
305.057 159.828 o
254.716 160.436 o
193.271 162.932 o
193.271 165.224 o
193.271 162.989 o
193.271 161.981 o
280.885 158.758 o
283.216 166.81 o
283.216 164.56 o
259.453 160.105 o
259.453 161.059 o
200.227 163.061 o
200.227 162.739 o
200.227 162.169 o
200.227 162.009 o
200.227 162.06 o
200.227 163.282 o
261.682 167.998 o
214.71 160.816 o
214.71 161.298 o
290.752 164.074 o
290.752 162.199 o
184.27 172.223 o
184.27 168.726 o
184.27 167.053 o
173.317 174.995 o
173.317 174.17 o
173.317 170.32 o
245.638 176.229 o
245.638 172.134 o
130.89 182.579 o
130.89 205.282 o
130.89 191.426 o
262.468 160.899 o
248.816 162.951 o
248.816 162.423 o
262.468 161.677 o
295.985 161.3 o
295.985 160.862 o
130.89 170.454 o
130.89 201.759 o
130.89 204.241 o
130.89 195.363 o
224.29 164.757 o
273.235 162.98 o
245.638 170.895 o
156.869 166.314 o
156.869 186.868 o
156.869 179.232 o
156.869 176.424 o
301.005 159.737 o
301.005 159.595 o
291.456 159.141 o
191.547 175.251 o
191.547 172.638 o
173.317 162.378 o
173.317 175.412 o
173.317 172.007 o
173.317 170.238 o
233.406 167.347 o
233.406 164.672 o
275.625 158.583 o
286.717 158.842 o
262.468 161.228 o
262.468 160.542 o
259.453 161.383 o
254.716 161.661 o
254.716 160.483 o
300.383 159.633 o
214.71 155.212 o
214.71 161.695 o
214.71 161.208 o
206.118 161.124 o
206.118 161.067 o
206.118 161.068 o
184.27 168.043 o
286.717 159.069 o
130.89 201.953 o
130.89 196.672 o
305.057 159.73 o
305.057 160.186 o
245.638 181.5 o
245.638 174.914 o
305.057 159.197 o
305.057 159.735 o
191.547 181.046 o
191.547 175.033 o
291.456 158.816 o
295.985 161.766 o
295.985 160.918 o
130.89 169.701 o
130.89 210.175 o
130.89 200.367 o
130.89 192.963 o
211.192 162.187 o
211.192 160.977 o
295.985 161.641 o
240.788 165.184 o
248.816 162.079 o
193.271 164.954 o
259.453 160.286 o
259.453 160.693 o
261.682 173.428 o
261.682 168.033 o
305.057 160.679 o
290.752 164.098 o
290.752 162.398 o
298.472 159.018 o
211.192 164.262 o
211.192 161.269 o
156.869 169.986 o
156.869 189.282 o
156.869 181.245 o
156.869 178.051 o
286.717 158.514 o
286.717 158.815 o
233.406 164.463 o
233.406 165.176 o
233.406 162.551 o
173.317 176.693 o
173.317 171.498 o
173.317 169.424 o
211.192 160.552 o
211.192 161.068 o
240.788 166.364 o
240.788 164.165 o
240.788 165.447 o
240.788 164.118 o
290.752 164.943 o
290.752 162.936 o
307.588 160.027 o
307.588 160.353 o
283.216 167.176 o
283.216 164.212 o
259.453 160.595 o
130.89 195.243 o
130.89 189.046 o
298.472 158.647 o
261.682 172.06 o
261.682 165.711 o
295.985 159.612 o
295.985 160.432 o
224.29 164.781 o
224.29 163.493 o
245.638 179.173 o
245.638 174.114 o
211.192 162.264 o
211.192 161.961 o
211.192 161.024 o
261.281 158.286 o
240.788 164.958 o
240.788 164.177 o
184.27 167.397 o
184.27 167.691 o
261.682 173.166 o
261.682 167.596 o
130.89 172.09 o
130.89 207.972 o
130.89 195.188 o
130.89 189.14 o
214.71 160.769 o
214.71 161.33 o
214.71 161.159 o
301.005 159.027 o
301.005 159.758 o
173.317 173.008 o
173.317 170.094 o
200.227 163.044 o
248.816 163.538 o
248.816 162.05 o
224.29 166.637 o
224.29 163.934 o
254.716 159.513 o
254.716 160.491 o
173.317 170.003 o
173.317 169.863 o
262.468 159.224 o
262.468 160.928 o
206.118 162.087 o
300.383 160.339 o
240.788 167.263 o
240.788 164.579 o
240.788 162.516 o
200.227 158.749 o
200.227 162.528 o
266.933 158.467 o
245.638 177.741 o
245.638 173.588 o
193.271 163.392 o
193.271 163.164 o
280.885 158.854 o
283.216 168.588 o
283.216 164.271 o
156.869 182.094 o
156.869 177.46 o
212.604 167.639 o
212.604 165.888 o
206.118 161.818 o
206.118 160.637 o
206.118 160.846 o
173.317 161.352 o
173.317 177.001 o
173.317 171.187 o
173.317 169.436 o
248.816 161.124 o
248.816 162.407 o
286.717 158.787 o
224.29 167.19 o
224.29 164.51 o
273.235 170.212 o
273.235 165.764 o
212.604 167.825 o
212.604 165.978 o
248.816 162.616 o
248.816 162.426 o
286.717 158.822 o
286.717 158.823 o
193.271 164.645 o
193.271 163.601 o
193.271 162.25 o
295.985 161.602 o
295.985 160.574 o
307.588 160.282 o
307.588 160.197 o
184.27 170.36 o
184.27 168.342 o
283.216 166.467 o
283.216 162.585 o
214.71 161.066 o
156.869 175.574 o
156.869 186.834 o
156.869 177.616 o
156.869 174.198 o
301.005 160.23 o
301.005 160.311 o
212.604 165.435 o
193.271 163.568 o
193.271 164.802 o
193.271 162.796 o
200.227 155.939 o
200.227 162.212 o
200.227 162.286 o
206.118 162.961 o
206.118 161.118 o
224.29 164.425 o
grestore
0.133 0.545 0.133 setrgbcolor
gsave
276.978 119.48 43.2 149.781 clipbox
/o {
gsave
newpath
translate
1.0 setlinewidth
1 setlinejoin

0 setlinecap

0 -1 m
0.265203 -1 0.51958 -0.894634 0.707107 -0.707107 c
0.894634 -0.51958 1 -0.265203 1 0 c
1 0.265203 0.894634 0.51958 0.707107 0.707107 c
0.51958 0.894634 0.265203 1 0 1 c
-0.265203 1 -0.51958 0.894634 -0.707107 0.707107 c
-0.894634 0.51958 -1 0.265203 -1 0 c
-1 -0.265203 -0.894634 -0.51958 -0.707107 -0.707107 c
-0.51958 -0.894634 -0.265203 -1 0 -1 c
cl

gsave
0.133 0.545 0.133 setrgbcolor
fill
grestore
stroke
grestore
} bind def
215.427 160.832 o
215.427 159.895 o
85.6016 202.196 o
85.6016 238.753 o
85.6016 239.383 o
214.797 188.077 o
214.797 185.947 o
85.6016 181.779 o
85.6016 219.24 o
85.6016 253.387 o
158.672 170.355 o
158.672 172.867 o
158.672 171.358 o
146.591 176.367 o
146.591 221.366 o
146.591 215.729 o
199.877 177.033 o
199.877 169.563 o
172.169 160.55 o
146.591 210.586 o
146.591 215.314 o
55.7899 234.275 o
129.786 230.413 o
129.786 247.416 o
184.822 175.188 o
199.877 172.357 o
178.846 196.059 o
178.846 189.498 o
214.797 184.846 o
214.797 178.82 o
179.833 206.855 o
129.705 211.994 o
129.705 209.322 o
199.877 171.247 o
235.449 160.393 o
85.6016 238.444 o
112.241 185.466 o
112.241 210 o
112.241 204.146 o
214.797 181.039 o
184.822 176.132 o
184.822 174.423 o
85.6016 192.191 o
85.6016 230.368 o
85.6016 254.453 o
158.672 176.158 o
158.672 176.771 o
158.672 173.231 o
158.672 174.181 o
158.672 180.624 o
158.672 173.755 o
112.241 207.088 o
112.241 202.763 o
255.922 160.218 o
255.922 160.638 o
172.169 159.84 o
172.169 167.515 o
235.449 158.948 o
235.449 159.491 o
239.524 172.455 o
239.524 168.013 o
215.427 160.565 o
179.833 217.578 o
179.833 202.748 o
255.922 159.961 o
158.672 174.157 o
158.672 173.791 o
137.784 182.966 o
137.784 185.927 o
137.784 178.429 o
129.786 220.151 o
129.786 255.875 o
55.7899 193.775 o
55.7899 233.074 o
55.7899 251.57 o
184.822 171.803 o
55.7899 176.902 o
55.7899 209.566 o
55.7899 243.712 o
55.7899 261.602 o
214.797 176.924 o
129.786 247.225 o
112.241 181.149 o
112.241 217.438 o
112.241 212.389 o
112.241 203.721 o
215.427 159.997 o
85.6016 221.824 o
85.6016 240.321 o
137.784 175.799 o
137.784 190.774 o
137.784 181.414 o
146.591 203.607 o
199.877 184.124 o
199.877 172.24 o
215.427 159.869 o
215.427 160.836 o
215.427 159.953 o
250.609 159.231 o
250.609 159.742 o
235.449 159.148 o
55.7899 199.419 o
55.7899 244.542 o
129.786 194.208 o
129.786 232.48 o
129.786 263.831 o
85.6016 206.284 o
85.6016 248.458 o
55.7899 183.01 o
55.7899 218.271 o
55.7899 250.145 o
55.7899 252.932 o
179.833 186.398 o
179.833 216.309 o
179.833 201.103 o
255.922 161.683 o
255.922 160.788 o
129.705 211.716 o
112.241 177.315 o
112.241 208.6 o
112.241 214.125 o
112.241 204.976 o
250.609 160.175 o
250.609 159.358 o
199.877 177.257 o
199.877 175.574 o
137.784 183.73 o
137.784 181.921 o
215.32 161.68 o
215.32 165.371 o
215.32 163.81 o
255.922 159.591 o
239.524 168.577 o
55.7899 219.689 o
55.7899 248.546 o
179.833 207.456 o
179.833 208.478 o
178.846 197.487 o
129.786 197.73 o
129.786 238.089 o
129.705 200.012 o
129.705 212.576 o
215.32 161.736 o
179.833 194.011 o
179.833 213.179 o
179.833 197.314 o
55.7899 189.815 o
55.7899 226.541 o
55.7899 257.999 o
137.784 183.475 o
137.784 182.333 o
178.846 185.19 o
178.846 200.993 o
137.784 183.047 o
215.32 171.334 o
215.32 163.743 o
184.822 177.192 o
184.822 173.243 o
184.822 175.931 o
184.822 172.003 o
129.786 210.111 o
129.786 246.709 o
129.705 209.376 o
235.449 159.516 o
235.449 159.218 o
239.524 173.147 o
239.524 165.925 o
112.241 201.683 o
112.241 214.26 o
146.591 201.427 o
146.591 223.497 o
137.784 177.81 o
137.784 187.848 o
137.784 180.34 o
250.609 159.75 o
178.846 187.937 o
178.846 196.233 o
214.797 196.471 o
214.797 182.633 o
146.591 191.646 o
146.591 229.751 o
146.591 209.816 o
250.609 159.725 o
250.609 159.576 o
172.169 163.389 o
129.705 212.659 o
235.449 159.103 o
235.449 159.277 o
158.672 172.414 o
158.672 174.664 o
239.524 164.995 o
112.241 185.496 o
112.241 218.269 o
112.241 207.577 o
146.591 222.573 o
146.591 202.532 o
172.169 168.815 o
172.169 166.101 o
178.846 189.091 o
grestore
0.800 setlinewidth
0.000 setgray
gsave
/o {
gsave
newpath
translate
0.8 setlinewidth
1 setlinejoin

0 setlinecap

0 0 m
0 -3.5 l

gsave
0.000 setgray
fill
grestore
stroke
grestore
} bind def
85.7476 149.781 o
grestore
gsave
75.2476 130.625 translate
0 rotate
/DejaVuSans 16.0 selectfont
0 0.125 moveto
/one glyphshow
10.1797 0.125 moveto
/zero glyphshow
grestore
gsave
/o {
gsave
newpath
translate
0.8 setlinewidth
1 setlinejoin

0 setlinecap

0 0 m
0 -3.5 l

gsave
0.000 setgray
fill
grestore
stroke
grestore
} bind def
175.454 149.781 o
grestore
gsave
164.954 130.625 translate
0 rotate
/DejaVuSans 16.0 selectfont
0 0.125 moveto
/five glyphshow
10.1797 0.125 moveto
/zero glyphshow
grestore
gsave
/o {
gsave
newpath
translate
0.8 setlinewidth
1 setlinejoin

0 setlinecap

0 0 m
0 -3.5 l

gsave
0.000 setgray
fill
grestore
stroke
grestore
} bind def
214.089 149.781 o
grestore
gsave
198.589 130.625 translate
0 rotate
/DejaVuSans 16.0 selectfont
0 0.125 moveto
/one glyphshow
10.1797 0.125 moveto
/zero glyphshow
20.3594 0.125 moveto
/zero glyphshow
grestore
gsave
/o {
gsave
newpath
translate
0.8 setlinewidth
1 setlinejoin

0 setlinecap

0 0 m
0 -3.5 l

gsave
0.000 setgray
fill
grestore
stroke
grestore
} bind def
303.795 149.781 o
grestore
gsave
288.295 130.625 translate
0 rotate
/DejaVuSans 16.0 selectfont
0 0.125 moveto
/five glyphshow
10.1797 0.125 moveto
/zero glyphshow
20.3594 0.125 moveto
/zero glyphshow
grestore
0.600 setlinewidth
gsave
/o {
gsave
newpath
translate
0.6 setlinewidth
1 setlinejoin

0 setlinecap

0 0 m
0 -2 l

gsave
0.000 setgray
fill
grestore
stroke
grestore
} bind def
47.1131 149.781 o
grestore
gsave
/o {
gsave
newpath
translate
0.6 setlinewidth
1 setlinejoin

0 setlinecap

0 0 m
0 -2 l

gsave
0.000 setgray
fill
grestore
stroke
grestore
} bind def
57.2753 149.781 o
grestore
gsave
/o {
gsave
newpath
translate
0.6 setlinewidth
1 setlinejoin

0 setlinecap

0 0 m
0 -2 l

gsave
0.000 setgray
fill
grestore
stroke
grestore
} bind def
65.8674 149.781 o
grestore
gsave
/o {
gsave
newpath
translate
0.6 setlinewidth
1 setlinejoin

0 setlinecap

0 0 m
0 -2 l

gsave
0.000 setgray
fill
grestore
stroke
grestore
} bind def
73.3101 149.781 o
grestore
gsave
/o {
gsave
newpath
translate
0.6 setlinewidth
1 setlinejoin

0 setlinecap

0 0 m
0 -2 l

gsave
0.000 setgray
fill
grestore
stroke
grestore
} bind def
79.8751 149.781 o
grestore
gsave
/o {
gsave
newpath
translate
0.6 setlinewidth
1 setlinejoin

0 setlinecap

0 0 m
0 -2 l

gsave
0.000 setgray
fill
grestore
stroke
grestore
} bind def
124.382 149.781 o
grestore
gsave
/o {
gsave
newpath
translate
0.6 setlinewidth
1 setlinejoin

0 setlinecap

0 0 m
0 -2 l

gsave
0.000 setgray
fill
grestore
stroke
grestore
} bind def
146.982 149.781 o
grestore
gsave
/o {
gsave
newpath
translate
0.6 setlinewidth
1 setlinejoin

0 setlinecap

0 0 m
0 -2 l

gsave
0.000 setgray
fill
grestore
stroke
grestore
} bind def
163.017 149.781 o
grestore
gsave
/o {
gsave
newpath
translate
0.6 setlinewidth
1 setlinejoin

0 setlinecap

0 0 m
0 -2 l

gsave
0.000 setgray
fill
grestore
stroke
grestore
} bind def
185.616 149.781 o
grestore
gsave
/o {
gsave
newpath
translate
0.6 setlinewidth
1 setlinejoin

0 setlinecap

0 0 m
0 -2 l

gsave
0.000 setgray
fill
grestore
stroke
grestore
} bind def
194.208 149.781 o
grestore
gsave
/o {
gsave
newpath
translate
0.6 setlinewidth
1 setlinejoin

0 setlinecap

0 0 m
0 -2 l

gsave
0.000 setgray
fill
grestore
stroke
grestore
} bind def
201.651 149.781 o
grestore
gsave
/o {
gsave
newpath
translate
0.6 setlinewidth
1 setlinejoin

0 setlinecap

0 0 m
0 -2 l

gsave
0.000 setgray
fill
grestore
stroke
grestore
} bind def
208.216 149.781 o
grestore
gsave
/o {
gsave
newpath
translate
0.6 setlinewidth
1 setlinejoin

0 setlinecap

0 0 m
0 -2 l

gsave
0.000 setgray
fill
grestore
stroke
grestore
} bind def
252.723 149.781 o
grestore
gsave
/o {
gsave
newpath
translate
0.6 setlinewidth
1 setlinejoin

0 setlinecap

0 0 m
0 -2 l

gsave
0.000 setgray
fill
grestore
stroke
grestore
} bind def
275.323 149.781 o
grestore
gsave
/o {
gsave
newpath
translate
0.6 setlinewidth
1 setlinejoin

0 setlinecap

0 0 m
0 -2 l

gsave
0.000 setgray
fill
grestore
stroke
grestore
} bind def
291.358 149.781 o
grestore
gsave
/o {
gsave
newpath
translate
0.6 setlinewidth
1 setlinejoin

0 setlinecap

0 0 m
0 -2 l

gsave
0.000 setgray
fill
grestore
stroke
grestore
} bind def
313.957 149.781 o
grestore
/DejaVuSans 16.000 selectfont
gsave

109.861 111.141 translate
0 rotate
0 0 m /W glyphshow
14.9453 0 m /e glyphshow
24.7891 0 m /i glyphshow
29.2344 0 m /g glyphshow
39.3906 0 m /h glyphshow
49.5312 0 m /t glyphshow
55.8047 0 m /space glyphshow
60.8906 0 m /D glyphshow
73.2109 0 m /i glyphshow
77.6562 0 m /f glyphshow
83.2891 0 m /f glyphshow
88.9219 0 m /e glyphshow
98.7656 0 m /r glyphshow
104.969 0 m /e glyphshow
114.812 0 m /n glyphshow
124.953 0 m /c glyphshow
133.75 0 m /e glyphshow
grestore
0.800 setlinewidth
gsave
/o {
gsave
newpath
translate
0.8 setlinewidth
1 setlinejoin

0 setlinecap

-0 0 m
-3.5 0 l

gsave
0.000 setgray
fill
grestore
stroke
grestore
} bind def
43.2 162.835 o
grestore
gsave
7.2 156.5 translate
0 rotate
/DejaVuSans 16.0 selectfont
0 0.5625 moveto
/one glyphshow
10.1797 0.5625 moveto
/zero glyphshow
/DejaVuSans 11.2 selectfont
20.5125 6.6875 moveto
/zero glyphshow
grestore
gsave
/o {
gsave
newpath
translate
0.8 setlinewidth
1 setlinejoin

0 setlinecap

-0 0 m
-3.5 0 l

gsave
0.000 setgray
fill
grestore
stroke
grestore
} bind def
43.2 184.16 o
grestore
gsave
7.2 177.824 translate
0 rotate
/DejaVuSans 16.0 selectfont
0 0.704688 moveto
/one glyphshow
10.1797 0.704688 moveto
/zero glyphshow
/DejaVuSans 11.2 selectfont
20.5125 6.82969 moveto
/one glyphshow
grestore
gsave
/o {
gsave
newpath
translate
0.8 setlinewidth
1 setlinejoin

0 setlinecap

-0 0 m
-3.5 0 l

gsave
0.000 setgray
fill
grestore
stroke
grestore
} bind def
43.2 205.484 o
grestore
gsave
7.2 199.149 translate
0 rotate
/DejaVuSans 16.0 selectfont
0 0.5625 moveto
/one glyphshow
10.1797 0.5625 moveto
/zero glyphshow
/DejaVuSans 11.2 selectfont
20.5125 6.6875 moveto
/two glyphshow
grestore
gsave
/o {
gsave
newpath
translate
0.8 setlinewidth
1 setlinejoin

0 setlinecap

-0 0 m
-3.5 0 l

gsave
0.000 setgray
fill
grestore
stroke
grestore
} bind def
43.2 226.809 o
grestore
gsave
7.2 220.473 translate
0 rotate
/DejaVuSans 16.0 selectfont
0 0.5625 moveto
/one glyphshow
10.1797 0.5625 moveto
/zero glyphshow
/DejaVuSans 11.2 selectfont
20.5125 6.6875 moveto
/three glyphshow
grestore
gsave
/o {
gsave
newpath
translate
0.8 setlinewidth
1 setlinejoin

0 setlinecap

-0 0 m
-3.5 0 l

gsave
0.000 setgray
fill
grestore
stroke
grestore
} bind def
43.2 248.134 o
grestore
gsave
7.2 241.798 translate
0 rotate
/DejaVuSans 16.0 selectfont
0 0.704688 moveto
/one glyphshow
10.1797 0.704688 moveto
/zero glyphshow
/DejaVuSans 11.2 selectfont
20.5125 6.82969 moveto
/four glyphshow
grestore
1.500 setlinewidth
[5.55 2.4] 0 setdash
gsave
276.978 119.48 43.2 149.781 clipbox
-1 162.835442 m
307.587829 162.835442 l
stroke
grestore
2 setlinecap
[] 0 setdash
0.255 0.412 0.882 setrgbcolor
gsave
276.978 119.48 43.2 149.781 clipbox
130.889967 195.21575 m
156.86938 177.835941 l
173.316547 170.31993 l
184.27032 168.341662 l
191.547122 175.379421 l
193.270661 163.116089 l
200.227343 162.262976 l
206.118025 161.105439 l
211.192497 161.26866 l
212.603646 165.888283 l
214.710417 161.159239 l
224.289754 164.658887 l
233.406012 165.176026 l
240.787942 164.957922 l
245.63817 174.522547 l
248.815581 162.424363 l
254.715825 160.486007 l
259.453192 160.499617 l
261.280726 158.349588 l
261.682059 168.015618 l
262.468292 160.927544 l
266.933494 158.485398 l
273.234712 166.004934 l
275.624613 158.732063 l
280.884712 158.806309 l
283.216486 164.560367 l
286.717386 158.822092 l
290.751618 162.950434 l
291.455864 158.815889 l
295.984509 160.917641 l
296.071759 159.465121 l
298.471543 159.018119 l
300.383499 159.992816 l
301.005111 159.757744 l
305.057254 159.827967 l
307.587829 160.151678 l
stroke
grestore
0.133 0.545 0.133 setrgbcolor
gsave
276.978 119.48 43.2 149.781 clipbox
55.789897 233.07423 m
85.601638 235.259885 l
112.240853 206.092133 l
129.704616 211.716064 l
129.785804 235.702502 l
137.783982 182.654862 l
146.591456 210.586275 l
158.672018 173.791152 l
172.169253 164.843971 l
178.846377 193.347797 l
179.832602 206.854634 l
184.822003 174.813421 l
199.876949 174.104074 l
214.796954 183.805588 l
215.319925 163.776783 l
215.426896 159.996812 l
235.448942 159.247155 l
239.524118 168.299565 l
250.608776 159.724651 l
255.921544 160.430093 l
stroke
grestore
0.800 setlinewidth
0 setlinejoin
0.000 setgray
gsave
43.2 149.7815 m
43.2 269.2615 l
stroke
grestore
gsave
320.177726 149.7815 m
320.177726 269.2615 l
stroke
grestore
gsave
43.2 149.7815 m
320.177726 149.7815 l
stroke
grestore
gsave
43.2 269.2615 m
320.177726 269.2615 l
stroke
grestore
/DejaVuSans 19.200 selectfont
gsave

70.2826 275.262 translate
0 rotate
0 0 m /S glyphshow
12.2192 0 m /p glyphshow
24.4385 0 m /e glyphshow
36.2817 0 m /e glyphshow
48.125 0 m /d glyphshow
60.3442 0 m /u glyphshow
72.5447 0 m /p glyphshow
84.7639 0 m /space glyphshow
90.8829 0 m /f glyphshow
97.6599 0 m /o glyphshow
109.437 0 m /r glyphshow
117.352 0 m /space glyphshow
123.471 0 m /D glyphshow
138.294 0 m /i glyphshow
143.642 0 m /f glyphshow
150.419 0 m /f glyphshow
155.821 0 m /period glyphshow
161.94 0 m /space glyphshow
168.059 0 m /Z glyphshow
181.246 0 m /o glyphshow
193.024 0 m /n glyphshow
205.224 0 m /o glyphshow
216.627 0 m /period glyphshow
grestore
1.000 setlinewidth
0 setlinecap
0.800 setgray
gsave
32.5248 7.2 m
330.852925 7.2 l
332.986259 7.2 334.052925 8.266667 334.052925 10.4 c
334.052925 102.7375 l
334.052925 104.870833 332.986259 105.9375 330.852925 105.9375 c
32.5248 105.9375 l
30.391467 105.9375 29.3248 104.870833 29.3248 102.7375 c
29.3248 10.4 l
29.3248 8.266667 30.391467 7.2 32.5248 7.2 c
cl
gsave
1.000 setgray
fill
grestore
stroke
grestore
0.000 setgray
/DejaVuSans 16.000 selectfont
gsave

146.462 87.3813 translate
0 rotate
0 0 m /S glyphshow
10.1562 0 m /p glyphshow
20.3125 0 m /e glyphshow
30.1562 0 m /e glyphshow
40 0 m /d glyphshow
50.1562 0 m /u glyphshow
60.2969 0 m /p glyphshow
grestore
/DejaVuSans 16.000 selectfont
gsave

48.5248 63.8969 translate
0 rotate
0 0 m /P glyphshow
9.39844 0 m /r glyphshow
15.9766 0 m /u glyphshow
26.1172 0 m /n glyphshow
36.2578 0 m /e glyphshow
46.1016 0 m /space glyphshow
51.1875 0 m /ampersand glyphshow
63.6641 0 m /space glyphshow
68.75 0 m /R glyphshow
79.1172 0 m /e glyphshow
88.9609 0 m /t glyphshow
95.2344 0 m /r glyphshow
101.812 0 m /a glyphshow
111.617 0 m /i glyphshow
116.062 0 m /n glyphshow
grestore
1.500 setlinewidth
1 setlinejoin
2 setlinecap
0.255 0.412 0.882 setrgbcolor
gsave
35.7248 46.0125 m
51.7248 46.0125 l
67.7248 46.0125 l
stroke
grestore
0.000 setgray
/DejaVuSans 16.000 selectfont
gsave

80.5248 40.4125 translate
0 rotate
0 0 m /M glyphshow
13.8047 0 m /e glyphshow
23.6484 0 m /d glyphshow
33.8047 0 m /i glyphshow
38.25 0 m /a glyphshow
48.0547 0 m /n glyphshow
grestore
1.000 setlinewidth
0 setlinejoin
0 setlinecap
0.678 0.847 0.902 setrgbcolor
gsave
35.7248 16.928125 m
67.7248 16.928125 l
67.7248 28.128125 l
35.7248 28.128125 l
cl
gsave
fill
grestore
stroke
grestore
0.000 setgray
/DejaVuSans 16.000 selectfont
gsave

80.5248 16.9281 translate
0 rotate
0 0 m /Q glyphshow
12.5938 0 m /u glyphshow
22.7344 0 m /a glyphshow
32.5391 0 m /n glyphshow
42.6797 0 m /t glyphshow
48.9531 0 m /i glyphshow
53.3984 0 m /l glyphshow
57.8438 0 m /e glyphshow
67.6875 0 m /s glyphshow
grestore
/DejaVuSans 16.000 selectfont
gsave

219.59 63.8969 translate
0 rotate
0 0 m /P glyphshow
9.39844 0 m /r glyphshow
15.9766 0 m /u glyphshow
26.1172 0 m /n glyphshow
36.2578 0 m /e glyphshow
46.1016 0 m /space glyphshow
51.1875 0 m /O glyphshow
63.7812 0 m /n glyphshow
73.9219 0 m /l glyphshow
78.3672 0 m /y glyphshow
grestore
1.500 setlinewidth
1 setlinejoin
2 setlinecap
0.133 0.545 0.133 setrgbcolor
gsave
206.790425 46.0125 m
222.790425 46.0125 l
238.790425 46.0125 l
stroke
grestore
0.000 setgray
/DejaVuSans 16.000 selectfont
gsave

251.59 40.4125 translate
0 rotate
0 0 m /M glyphshow
13.8047 0 m /e glyphshow
23.6484 0 m /d glyphshow
33.8047 0 m /i glyphshow
38.25 0 m /a glyphshow
48.0547 0 m /n glyphshow
grestore
1.000 setlinewidth
0 setlinejoin
0 setlinecap
0.565 0.933 0.565 setrgbcolor
gsave
206.790425 16.928125 m
238.790425 16.928125 l
238.790425 28.128125 l
206.790425 28.128125 l
cl
gsave
fill
grestore
stroke
grestore
0.000 setgray
/DejaVuSans 16.000 selectfont
gsave

251.59 16.9281 translate
0 rotate
0 0 m /Q glyphshow
12.5938 0 m /u glyphshow
22.7344 0 m /a glyphshow
32.5391 0 m /n glyphshow
42.6797 0 m /t glyphshow
48.9531 0 m /i glyphshow
53.3984 0 m /l glyphshow
57.8438 0 m /e glyphshow
67.6875 0 m /s glyphshow
grestore

end
showpage
