
[VERYDIFF_EXPERIMENT] Running on /home/i57/steuber/NeuroDiff/repos/VeryDiffExperiments/src/../benchmarks/mnist-prune/specs/mnist_53_global_5.vnnlib /home/i57/steuber/NeuroDiff/repos/VeryDiffExperiments/src/../benchmarks/mnist-prune/nets/mnist_relu_3_100.onnx
Parsing /home/i57/steuber/NeuroDiff/repos/VeryDiffExperiments/src/../benchmarks/mnist-prune/nets/mnist_relu_3_100.onnx...
Found input X
op: matmul, weight: (100, 784), bias: nothing
op: bias, weight: nothing, bias: (100,)
op: relu, weight: nothing, bias: nothing
op: matmul, weight: (100, 100), bias: nothing
op: bias, weight: nothing, bias: (100,)
op: relu, weight: nothing, bias: nothing
op: matmul, weight: (10, 100), bias: nothing
op: bias, weight: nothing, bias: (10,)
op: relu, weight: nothing, bias: nothing
op: matmul, weight: (10, 10), bias: nothing
op: bias, weight: nothing, bias: (10,)
Parsing /home/i57/steuber/NeuroDiff/repos/VeryDiffExperiments/src/../benchmarks/mnist-prune/nets_pruned/mnist_relu_3_100_0.79_adam_1_stepsize-old.onnx...
Found input X
op: gemm, weight: (100, 784), bias: (100,)
op: relu, weight: nothing, bias: nothing
op: gemm, weight: (100, 100), bias: (100,)
op: relu, weight: nothing, bias: nothing
op: gemm, weight: (10, 100), bias: (10,)
op: relu, weight: nothing, bias: nothing
op: gemm, weight: (10, 10), bias: (10,)
Distance: 368.62397500800625
Distance: 47.56803950402309
Distance: 2.8977568827249343
Distance: 0.01885471428334995
Running with 1 threads
[Thread 1] Time to first task: 0.0s
Instable Generators: 42
Instable Generators: 64
Instable Generators: 9
Zono Bounds:
[-1.6460848500989627, -1.5929105575995541, -1.7041016915184561, -1.5797489654685775, -1.90128043092048, -1.8211038486432432, -1.8072680756565158, -1.715433599694863, -1.6060224148916082, -1.6599229365123676]
[1.645617500178424, 1.4851180642494735, 1.6227624727412586, 1.5737756781340493, 1.830976262245215, 1.9315385701368202, 1.803685161829272, 1.5133764740395756, 1.6023217150049638, 1.6526062973771904]
[Thread 1] Processed 100 zonotopes (Work Done: 0.0%; Expected Zonos: Inf)


TIMEOUT REACHED
UNKNOWN
[Thread 1] Total splits: 172
Processed 172 zonotopes (Work Done: 0.0%); Generated 344 (0.6981644685930233s/loop)
[Thread 1] Finished in 120.08s
 ────────────────────────────────────────────────────────────────────────────────
                                        Time                    Allocations      
                               ───────────────────────   ────────────────────────
       Tot / % measured:             120s / 100.0%           34.1GiB / 100.0%    

 Section               ncalls     time    %tot     avg     alloc    %tot      avg
 ────────────────────────────────────────────────────────────────────────────────
 Verify                     1     120s  100.0%    120s   34.1GiB  100.0%  34.1GiB
   Zonotope Loop            1     120s  100.0%    120s   34.1GiB  100.0%  34.1GiB
     Property Check       172     104s   86.9%   607ms   15.4GiB   45.2%  91.9MiB
     Zonotope Propa...    172    12.8s   10.7%  74.7ms   12.7GiB   37.1%  75.4MiB
       DiffZonotope...    516    10.3s    8.6%  20.0ms   12.0GiB   35.1%  23.7MiB
         Zonotope_R...  1.03k    10.2s    8.5%  9.87ms   11.7GiB   34.2%  11.6MiB
           Influenc...  1.03k    9.84s    8.2%  9.54ms   10.7GiB   31.5%  10.7MiB
             Multiply   1.03k    8.49s    7.1%  8.23ms   5.49GiB   16.1%  5.45MiB
             Set Ma...  1.03k    745ms    0.6%   722μs     0.00B    0.0%    0.00B
             Alloca...  1.03k    602ms    0.5%   583μs   5.25GiB   15.4%  5.21MiB
           Column M...  1.03k    255ms    0.2%   247μs    474MiB    1.4%   470KiB
           Set Matrix   1.03k   52.3ms    0.0%  50.7μs   1.24MiB    0.0%  1.23KiB
           Allocation   1.03k   24.8ms    0.0%  24.1μs    474MiB    1.4%   470KiB
           Vectors      1.03k   4.94ms    0.0%  4.79μs   3.28MiB    0.0%  3.26KiB
           Bounds       1.03k    681μs    0.0%   660ns     0.00B    0.0%    0.00B
       DiffZonotope...    688    2.51s    2.1%  3.65ms    722MiB    2.1%  1.05MiB
         Zonotope_D...  1.38k    1.23s    1.0%   894μs    471MiB    1.3%   350KiB
     Compute Split        172    1.61s    1.3%  9.35ms   2.66GiB    7.8%  15.8MiB
 Initialize                 1    543μs    0.0%   543μs   5.41MiB    0.0%  5.41MiB
 ────────────────────────────────────────────────────────────────────────────────
[VERYDIFF_TIMER] 120.115732322

[VERYDIFF_EXPERIMENT] NETWORK: /home/i57/steuber/NeuroDiff/repos/VeryDiffExperiments/src/../benchmarks/mnist-prune/specs/mnist_53_global_5.vnnlib
[VERYDIFF_EXPERIMENT] TIME: 120.477744103
