
[VERYDIFF_EXPERIMENT] Running on /home/i57/steuber/NeuroDiff/repos/VeryDiffExperiments/src/../benchmarks/mnist-prune/specs/mnist_50_local_18.vnnlib /home/i57/steuber/NeuroDiff/repos/VeryDiffExperiments/src/../benchmarks/mnist-prune/nets/mnist_relu_3_100.onnx
Loading /home/i57/steuber/NeuroDiff/repos/VeryDiffExperiments/src/../benchmarks/mnist-prune/nets/mnist_relu_3_100.onnx and /home/i57/steuber/NeuroDiff/repos/VeryDiffExperiments/src/../benchmarks/mnist-prune/nets_pruned/mnist_relu_3_100_0.77-old.onnx
INPUT SHAPE: 784
Refined: 59 | Refine Limit: 28 | Wrong: 0 | Right: 48 | Total: 48 | Total Zonos Considered: 107 | Expected 1647280827576 (2.9138929559832714e-09%)Refined: 137 | Refine Limit: 28 | Wrong: 0 | Right: 178 | Total: 178 | Total Zonos Considered: 315 | Expected 5634961174439 (3.1588505136012968e-09%)Refined: 207 | Refine Limit: 23 | Wrong: 0 | Right: 309 | Total: 309 | Total Zonos Considered: 516 | Expected 9738979066391 (3.1728171699880954e-09%)Refined: 265 | Refine Limit: 25 | Wrong: 0 | Right: 412 | Total: 412 | Total Zonos Considered: 677 | Expected 2027523435053 (2.032035698710581e-08%)Refined: 331 | Refine Limit: 30 | Wrong: 0 | Right: 518 | Total: 518 | Total Zonos Considered: 849 | Expected 1926037866788 (2.689459064809843e-08%)Refined: 403 | Refine Limit: 31 | Wrong: 0 | Right: 629 | Total: 629 | Total Zonos Considered: 1032 | Expected 2338706507040 (2.689520887322019e-08%)Refined: 471 | Refine Limit: 33 | Wrong: 0 | Right: 726 | Total: 726 | Total Zonos Considered: 1197 | Expected 2699309552413 (2.689576671008352e-08%)Refined: 534 | Refine Limit: 31 | Wrong: 0 | Right: 839 | Total: 839 | Total Zonos Considered: 1373 | Expected 3119423412348 (2.6895996121555104e-08%)Refined: 611 | Refine Limit: 33 | Wrong: 0 | Right: 941 | Total: 941 | Total Zonos Considered: 1552 | Expected 3497163226569 (2.690752301325086e-08%)Refined: 678 | Refine Limit: 30 | Wrong: 0 | Right: 1062 | Total: 1062 | Total Zonos Considered: 1740 | Expected 3946721980946 (2.6908406650560332e-08%)Refined: 748 | Refine Limit: 36 | Wrong: 0 | Right: 1189 | Total: 1189 | Total Zonos Considered: 1937 | Expected 4418621817681 (2.690884282611034e-08%)Refined: 811 | Refine Limit: 35 | Wrong: 0 | Right: 1310 | Total: 1310 | Total Zonos Considered: 2121 | Expected 4868194450317 (2.6909360613454895e-08%)Refined: 874 | Refine Limit: 40 | Wrong: 0 | Right: 1420 | Total: 1420 | Total Zonos Considered: 2294 | Expected 5276876801838 (2.6909856972696368e-08%)Refined: 929 | Refine Limit: 24 | Wrong: 0 | Right: 1542 | Total: 1542 | Total Zonos Considered: 2471 | Expected 5705323327693 (2.7027390235980226e-08%)Refined: 1004 | Refine Limit: 33 | Wrong: 0 | Right: 1646 | Total: 1646 | Total Zonos Considered: 2650 | Expected 6040592286617 (2.724898357478507e-08%)Refined: 1073 | Refine Limit: 37 | Wrong: 0 | Right: 1772 | Total: 1772 | Total Zonos Considered: 2845 | Expected 6502766577496 (2.7249940142897433e-08%)Refined: 1141 | Refine Limit: 33 | Wrong: 0 | Right: 1892 | Total: 1892 | Total Zonos Considered: 3033 | Expected 6942852606285 (2.7251046612847172e-08%)Refined: 1213 | Refine Limit: 34 | Wrong: 0 | Right: 2002 | Total: 2002 | Total Zonos Considered: 3215 | Expected 7346263990344 (2.7251947420232217e-08%)Refined: 1277 | Refine Limit: 34 | Wrong: 0 | Right: 2115 | Total: 2115 | Total Zonos Considered: 3392 | Expected 7760603993923 (2.725303341925663e-08%)Refined: 1340 | Refine Limit: 37 | Wrong: 0 | Right: 2219 | Total: 2219 | Total Zonos Considered: 3559 | Expected 8141939170467 (2.7253949624788513e-08%)Refined: 1402 | Refine Limit: 26 | Wrong: 0 | Right: 2326 | Total: 2326 | Total Zonos Considered: 3728 | Expected 8520261096713 (2.7299632882111313e-08%)Refined: 1470 | Refine Limit: 28 | Wrong: 0 | Right: 2441 | Total: 2441 | Total Zonos Considered: 3911 | Expected 8940678160722 (2.7302179500474025e-08%)Refined: 1538 | Refine Limit: 35 | Wrong: 0 | Right: 2547 | Total: 2547 | Total Zonos Considered: 4085 | Expected 9328612001493 (2.7303097176647124e-08%)Refined: 1611 | Refine Limit: 37 | Wrong: 0 | Right: 2669 | Total: 2669 | Total Zonos Considered: 4280 | Expected 9775296833391 (2.7303518711402008e-08%)Refined: 1672 | Refine Limit: 30 | Wrong: 0 | Right: 2792 | Total: 2792 | Total Zonos Considered: 4464 | Expected 10225193046058 (2.7305107956630388e-08%)Refined: 1743 | Refine Limit: 33 | Wrong: 0 | Right: 2908 | Total: 2908 | Total Zonos Considered: 4651 | Expected 10649559557098 (2.7306293602178123e-08%)UNKNOWN
TIMEOUT
Refined: 1772 | Refine Limit: 34 | Wrong: 0 | Right: 2951 | Total: 2951 | Total Zonos Considered: 4723 | Expected 10806725276465 (2.7307069667318357e-08%)

time: 120.167960755

[VERYDIFF_TIMER] 120.19216911

[VERYDIFF_EXPERIMENT] NETWORK: /home/i57/steuber/NeuroDiff/repos/VeryDiffExperiments/src/../benchmarks/mnist-prune/specs/mnist_50_local_18.vnnlib
[VERYDIFF_EXPERIMENT] TIME: 120.482396171
