
[VERYDIFF_EXPERIMENT] Running on /home/i57/steuber/NeuroDiff/repos/VeryDiffExperiments/src/../benchmarks/mnist-prune/specs/mnist_43_global_6.vnnlib /home/i57/steuber/NeuroDiff/repos/VeryDiffExperiments/src/../benchmarks/mnist-prune/nets/mnist_relu_3_100.onnx
Loading /home/i57/steuber/NeuroDiff/repos/VeryDiffExperiments/src/../benchmarks/mnist-prune/nets/mnist_relu_3_100.onnx and /home/i57/steuber/NeuroDiff/repos/VeryDiffExperiments/src/../benchmarks/mnist-prune/nets_pruned/mnist_relu_3_100_0.49-old.onnx
INPUT SHAPE: 784
UNKNOWN
TIMEOUT
Refined: 18 | Refine Limit: 17 | Wrong: 0 | Right: 1 | Total: 1 | Total Zonos Considered: 19 | Expected 137438953472 (7.275957614183426e-10%)

time: 120.751245691

[VERYDIFF_TIMER] 120.789603795

[VERYDIFF_EXPERIMENT] NETWORK: /home/i57/steuber/NeuroDiff/repos/VeryDiffExperiments/src/../benchmarks/mnist-prune/specs/mnist_43_global_6.vnnlib
[VERYDIFF_EXPERIMENT] TIME: 121.091669996
