
[VERYDIFF_EXPERIMENT] Running on /home/i57/steuber/NeuroDiff/repos/VeryDiffExperiments/src/../benchmarks/mnist-prune/specs/mnist_87_local_15.vnnlib /home/i57/steuber/NeuroDiff/repos/VeryDiffExperiments/src/../benchmarks/mnist-prune/nets/mnist_relu_3_100.onnx
Found input X
op: matmul, weight: (100, 784), bias: nothing
op: bias, weight: nothing, bias: (100,)
op: relu, weight: nothing, bias: nothing
op: matmul, weight: (100, 100), bias: nothing
op: bias, weight: nothing, bias: (100,)
op: relu, weight: nothing, bias: nothing
op: matmul, weight: (10, 100), bias: nothing
op: bias, weight: nothing, bias: (10,)
op: relu, weight: nothing, bias: nothing
op: matmul, weight: (10, 10), bias: nothing
op: bias, weight: nothing, bias: (10,)
Found input X
op: gemm, weight: (100, 784), bias: (100,)
op: relu, weight: nothing, bias: nothing
op: gemm, weight: (100, 100), bias: (100,)
op: relu, weight: nothing, bias: nothing
op: gemm, weight: (10, 100), bias: (10,)
op: relu, weight: nothing, bias: nothing
op: gemm, weight: (10, 10), bias: (10,)
Distance: 368.62397500800625
Distance: 47.56803950402309
Distance: 2.8977568827249343
Distance: 0.01885471428334995
Running with 1 threads
[Thread 1] Time to first task: 0.0s
Instable Generators: 21
Instable Generators: 39
Instable Generators: 5
Zono Bounds:
[-0.0002427772215795937, -0.6258719455850936, -0.7944339517810386, -0.6709017754630433, 0.0005343466699590136, -0.7450825519181831, -0.7767738666372959, -0.7879697932844227, -0.0017398428933318734, -0.7334669965267082]
[0.00023690489026087345, 0.6837782027057064, 0.7259879016736601, 0.796243718096955, 0.0017870613246830553, 0.7225946597230163, 0.7770562123621494, 0.6074665128604988, -0.0010376751518826476, 0.629052027234225]
[Thread 1] Total splits: 0
Processed 1 zonotopes (Work Done: 100.0%); Generated 0 (0.00144786s/loop)
[Thread 1] Finished in 0.0s
 ────────────────────────────────────────────────────────────────────────────────
                                        Time                    Allocations      
                               ───────────────────────   ────────────────────────
       Tot / % measured:           1.80ms /  99.7%           2.67MiB /  99.9%    

 Section               ncalls     time    %tot     avg     alloc    %tot      avg
 ────────────────────────────────────────────────────────────────────────────────
 Verify                     1   1.47ms   82.0%  1.47ms   1.86MiB   69.9%  1.86MiB
   Zonotope Loop            1   1.45ms   80.9%  1.45ms   1.86MiB   69.8%  1.86MiB
     Zonotope Propa...      1   1.33ms   74.4%  1.33ms   1.06MiB   39.8%  1.06MiB
       DiffZonotope...      4    942μs   52.6%   236μs    225KiB    8.2%  56.2KiB
         Zonotope_D...      8    424μs   23.7%  53.0μs    115KiB    4.2%  14.4KiB
       DiffZonotope...      3    381μs   21.3%   127μs    859KiB   31.5%   286KiB
         Zonotope_R...      6    185μs   10.4%  30.9μs    541KiB   19.8%  90.2KiB
           Influenc...      6   63.4μs    3.5%  10.6μs    132KiB    4.8%  22.0KiB
             Multiply       6   40.3μs    2.3%  6.72μs   83.3KiB    3.1%  13.9KiB
             Alloca...      6   13.9μs    0.8%  2.32μs   46.4KiB    1.7%  7.74KiB
             Set Ma...      6   4.90μs    0.3%   817ns     0.00B    0.0%    0.00B
           Column M...      6   57.7μs    3.2%  9.62μs    191KiB    7.0%  31.8KiB
           Allocation       6   20.4μs    1.1%  3.40μs    190KiB    7.0%  31.6KiB
           Set Matrix       6   19.2μs    1.1%  3.20μs   4.88KiB    0.2%     832B
           Vectors          6   15.7μs    0.9%  2.62μs   19.5KiB    0.7%  3.26KiB
           Bounds           6   1.86μs    0.1%   309ns     0.00B    0.0%    0.00B
     Property Check         1   4.53μs    0.3%  4.53μs   1.23KiB    0.0%  1.23KiB
 Initialize                 1    323μs   18.0%   323μs    821KiB   30.1%   821KiB
 ────────────────────────────────────────────────────────────────────────────────
[VERYDIFF_TIMER] 0.035683525

[VERYDIFF_EXPERIMENT] NETWORK: /home/i57/steuber/NeuroDiff/repos/VeryDiffExperiments/src/../benchmarks/mnist-prune/specs/mnist_87_local_15.vnnlib
[VERYDIFF_EXPERIMENT] TIME: 0.339880095
