
[VERYDIFF_EXPERIMENT] Running on /home/i57/steuber/NeuroDiff/repos/VeryDiffExperiments/src/../benchmarks/mnist-prune/specs/mnist_44_global_3.vnnlib /home/i57/steuber/NeuroDiff/repos/VeryDiffExperiments/src/../benchmarks/mnist-prune/nets/mnist_relu_2_512.onnx
Loading /home/i57/steuber/NeuroDiff/repos/VeryDiffExperiments/src/../benchmarks/mnist-prune/nets/mnist_relu_2_512.onnx and /home/i57/steuber/NeuroDiff/repos/VeryDiffExperiments/src/../benchmarks/mnist-prune/nets_pruned/mnist_relu_2_512_0.79-old.onnx
INPUT SHAPE: 784
UNKNOWN
TIMEOUT
Refined: 24 | Refine Limit: 21 | Wrong: 0 | Right: 1 | Total: 1 | Total Zonos Considered: 25 | Expected 35184372088832 (2.8421709430404007e-12%)

time: 121.249995837

[VERYDIFF_TIMER] 121.273461204

[VERYDIFF_EXPERIMENT] NETWORK: /home/i57/steuber/NeuroDiff/repos/VeryDiffExperiments/src/../benchmarks/mnist-prune/specs/mnist_44_global_3.vnnlib
[VERYDIFF_EXPERIMENT] TIME: 121.559022438
