
[VERYDIFF_EXPERIMENT] Running on /home/i57/steuber/NeuroDiff/repos/VeryDiffExperiments/src/../benchmarks/mnist-prune/specs/mnist_32_local_21.vnnlib /home/i57/steuber/NeuroDiff/repos/VeryDiffExperiments/src/../benchmarks/mnist-prune/nets/mnist_relu_2_512.onnx
Loading /home/i57/steuber/NeuroDiff/repos/VeryDiffExperiments/src/../benchmarks/mnist-prune/nets/mnist_relu_2_512.onnx and /home/i57/steuber/NeuroDiff/repos/VeryDiffExperiments/src/../benchmarks/mnist-prune/nets_pruned/mnist_relu_2_512_0.79-old.onnx
INPUT SHAPE: 784
Refined: 4 | Refine Limit: 1 | Wrong: 0 | Right: 1 | Total: 1 | Total Zonos Considered: 5 | Expected 32 (3.125%)Refined: 9 | Refine Limit: 7 | Wrong: 0 | Right: 2 | Total: 2 | Total Zonos Considered: 11 | Expected 63 (3.1746031746031744%)Refined: 12 | Refine Limit: 8 | Wrong: 0 | Right: 11 | Total: 11 | Total Zonos Considered: 23 | Expected 351 (3.133903133903134%)Refined: 17 | Refine Limit: 7 | Wrong: 0 | Right: 12 | Total: 12 | Total Zonos Considered: 29 | Expected 383 (3.1331592689295036%)Refined: 22 | Refine Limit: 15 | Wrong: 0 | Right: 15 | Total: 15 | Total Zonos Considered: 37 | Expected 479 (3.1315240083507305%)Refined: 25 | Refine Limit: 19 | Wrong: 0 | Right: 19 | Total: 19 | Total Zonos Considered: 44 | Expected 607 (3.130148270181219%)Refined: 26 | Refine Limit: 10 | Wrong: 0 | Right: 33 | Total: 33 | Total Zonos Considered: 59 | Expected 1054 (3.130929791271347%)Refined: 31 | Refine Limit: 13 | Wrong: 0 | Right: 34 | Total: 34 | Total Zonos Considered: 65 | Expected 1086 (3.1307550644567224%)Refined: 35 | Refine Limit: 19 | Wrong: 0 | Right: 37 | Total: 37 | Total Zonos Considered: 72 | Expected 1182 (3.1302876480541455%)Refined: 38 | Refine Limit: 21 | Wrong: 0 | Right: 40 | Total: 40 | Total Zonos Considered: 78 | Expected 1278 (3.1298904538341157%)Refined: 39 | Refine Limit: 16 | Wrong: 0 | Right: 49 | Total: 49 | Total Zonos Considered: 88 | Expected 1565 (3.1309904153354635%)Refined: 43 | Refine Limit: 20 | Wrong: 0 | Right: 51 | Total: 51 | Total Zonos Considered: 94 | Expected 1629 (3.1307550644567224%)Refined: 49 | Refine Limit: 23 | Wrong: 0 | Right: 52 | Total: 52 | Total Zonos Considered: 101 | Expected 1661 (3.13064419024684%)Refined: 53 | Refine Limit: 29 | Wrong: 0 | Right: 58 | Total: 58 | Total Zonos Considered: 111 | Expected 1853 (3.130059363194819%)Refined: 57 | Refine Limit: 31 | Wrong: 0 | Right: 62 | Total: 62 | Total Zonos Considered: 119 | Expected 1981 (3.1297324583543666%)Refined: 58 | Refine Limit: 24 | Wrong: 0 | Right: 77 | Total: 77 | Total Zonos Considered: 135 | Expected 2460 (3.1300813008130084%)Refined: 63 | Refine Limit: 23 | Wrong: 0 | Right: 79 | Total: 79 | Total Zonos Considered: 142 | Expected 2524 (3.1299524564183834%)Refined: 68 | Refine Limit: 31 | Wrong: 0 | Right: 82 | Total: 82 | Total Zonos Considered: 150 | Expected 2620 (3.1297709923664123%)Refined: 70 | Refine Limit: 28 | Wrong: 0 | Right: 91 | Total: 91 | Total Zonos Considered: 161 | Expected 2908 (3.1292984869325995%)Refined: 70 | Refine Limit: 22 | Wrong: 0 | Right: 104 | Total: 104 | Total Zonos Considered: 174 | Expected 3323 (3.129702076436955%)Refined: 73 | Refine Limit: 20 | Wrong: 0 | Right: 108 | Total: 108 | Total Zonos Considered: 181 | Expected 3451 (3.1295276731382207%)Refined: 78 | Refine Limit: 23 | Wrong: 0 | Right: 109 | Total: 109 | Total Zonos Considered: 187 | Expected 3483 (3.1294860752225095%)Refined: 82 | Refine Limit: 31 | Wrong: 0 | Right: 112 | Total: 112 | Total Zonos Considered: 194 | Expected 3579 (3.1293657446214027%)Refined: 88 | Refine Limit: 35 | Wrong: 0 | Right: 113 | Total: 113 | Total Zonos Considered: 201 | Expected 3611 (3.129327056217114%)Refined: 90 | Refine Limit: 36 | Wrong: 0 | Right: 122 | Total: 122 | Total Zonos Considered: 212 | Expected 3898 (3.129810159055926%)Refined: 90 | Refine Limit: 28 | Wrong: 0 | Right: 134 | Total: 134 | Total Zonos Considered: 224 | Expected 4282 (3.1293787949556284%)Refined: 96 | Refine Limit: 31 | Wrong: 0 | Right: 136 | Total: 136 | Total Zonos Considered: 232 | Expected 4346 (3.1293143120110445%)Refined: 101 | Refine Limit: 37 | Wrong: 0 | Right: 138 | Total: 138 | Total Zonos Considered: 239 | Expected 4410 (3.1292517006802725%)Refined: 101 | Refine Limit: 31 | Wrong: 0 | Right: 152 | Total: 152 | Total Zonos Considered: 253 | Expected 4857 (3.129503808935557%)Refined: 107 | Refine Limit: 35 | Wrong: 0 | Right: 154 | Total: 154 | Total Zonos Considered: 261 | Expected 4921 (3.1294452347083923%)Refined: 111 | Refine Limit: 40 | Wrong: 0 | Right: 157 | Total: 157 | Total Zonos Considered: 268 | Expected 5017 (3.1293601754036273%)Refined: 116 | Refine Limit: 44 | Wrong: 0 | Right: 160 | Total: 160 | Total Zonos Considered: 276 | Expected 5113 (3.129278310189713%)Refined: 116 | Refine Limit: 34 | Wrong: 0 | Right: 178 | Total: 178 | Total Zonos Considered: 294 | Expected 5688 (3.1293952180028133%)Refined: 118 | Refine Limit: 29 | Wrong: 0 | Right: 187 | Total: 187 | Total Zonos Considered: 305 | Expected 5975 (3.1297071129707117%)UNKNOWN
TIMEOUT
Refined: 118 | Refine Limit: 26 | Wrong: 0 | Right: 194 | Total: 194 | Total Zonos Considered: 312 | Expected 6199 (3.1295370221003385%)

time: 120.988403091

[VERYDIFF_TIMER] 121.016319428

[VERYDIFF_EXPERIMENT] NETWORK: /home/i57/steuber/NeuroDiff/repos/VeryDiffExperiments/src/../benchmarks/mnist-prune/specs/mnist_32_local_21.vnnlib
[VERYDIFF_EXPERIMENT] TIME: 121.306462606
