
[VERYDIFF_EXPERIMENT] Running on /home/i57/steuber/NeuroDiff/repos/VeryDiffExperiments/src/../benchmarks/mnist-prune/specs/mnist_97_global_6.vnnlib /home/i57/steuber/NeuroDiff/repos/VeryDiffExperiments/src/../benchmarks/mnist-prune/nets/mnist_relu_2_512.onnx
Found input X
op: matmul, weight: (512, 784), bias: nothing
op: bias, weight: nothing, bias: (512,)
op: relu, weight: nothing, bias: nothing
op: matmul, weight: (512, 512), bias: nothing
op: bias, weight: nothing, bias: (512,)
op: relu, weight: nothing, bias: nothing
op: matmul, weight: (10, 512), bias: nothing
op: bias, weight: nothing, bias: (10,)
Found input X
op: matmul, weight: (512, 784), bias: nothing
op: bias, weight: nothing, bias: (512,)
op: relu, weight: nothing, bias: nothing
op: matmul, weight: (512, 512), bias: nothing
op: bias, weight: nothing, bias: (512,)
op: relu, weight: nothing, bias: nothing
op: matmul, weight: (10, 512), bias: nothing
op: bias, weight: nothing, bias: (10,)
Distance: 1085.5985166831802
Distance: 1719.8468985003963
Distance: 31.228482716001736
Running with 1 threads
[Thread 1] Time to first task: 0.02s
Zono Bounds:
[0.0, 0.0, 0.0, 0.0, 0.0, 0.0, 0.0, 0.0, 0.0, 0.0, 0.0, 0.0, 0.0, 0.0, 0.0, 0.0, 0.0, 0.0, 0.0, 0.0, 0.0, 0.0, 0.0, 0.0, 0.0, 0.0, 0.0, 0.0, 0.0, 0.0, 0.0, 0.0, 0.0, 0.0, 0.0, 0.0, 0.0, 0.0, 0.0, 0.0, 0.0, 0.0, 0.0, 0.0, 0.0, 0.0, 0.0, 0.0, 0.0, 0.0, 0.0, 0.0, 0.0, 0.0, 0.0, 0.0, 0.0, 0.0, 0.0, 0.0, 0.0, 0.0, 0.0, 0.0, 0.0, 0.0, 0.0, 0.0, 0.0, 0.0, 0.0, 0.0, 0.0, 0.0, 0.0, 0.0, 0.0, 0.0, 0.0, 0.0, 0.0, 0.0, 0.0, 0.0, 0.0, 0.0, 0.0, 0.0, 0.0, 0.0, 0.0, 0.0, 0.0, 0.0, 0.0, 0.0, 0.0, 0.0, 0.0, 0.0, 0.0, 0.0, 0.0, 0.0, 0.0, 0.0, 0.0, 0.0, 0.0, 0.0, 0.0, 0.0, 0.0, 0.0, 0.0, 0.0, 0.0, 0.0, 0.0, 0.0, 0.0, 0.0, 0.0, 0.0, 0.0, 0.0, 0.0, 0.0, 0.0, 0.0, 0.0, 0.0, 0.0, 0.0, 0.0, 0.0, 0.0, 0.0, 0.0, 0.0, 0.0, 0.0, 0.0, 0.0, 0.0, 0.0, 0.0, 0.0, 0.0, 0.0, 0.0, 0.0, 0.0, 0.0, 0.0, 0.0, 0.0, 0.0, 0.0, 0.0, 0.0, 0.0, 0.0, 0.0, 0.0, 0.0, 0.0, 0.0, 0.0, 0.0, 0.0, 0.0, 0.0, 0.0, 0.0, 0.0, 0.0, 0.0, 0.0, 0.0, 0.0, 0.0, 0.0, 0.0, 0.0, 0.0, 0.0, 0.0, 0.0, 0.0, 0.0, 0.0, 0.0, 0.0, 0.0, 0.0, 0.0, 0.0, 0.0, 0.0, 0.0, 0.0, 0.0, 0.0, 0.0, 0.0, 0.0, 0.0, 0.0, 0.0, 0.0, 0.0, 0.0, 0.0, 0.0, 0.0, 0.0, 0.0, 0.0, 0.0, 0.0, 0.0, 0.0, 0.0, 0.0, 0.0, 0.0, 0.0, 0.0, 0.0, 0.0, 0.0, 0.0, 0.0, 0.0, 0.0, 0.0, 0.0, 0.0, 0.0, 0.0, 0.0, 0.0, 0.0, 0.0, 0.0, 0.0, 0.0, 0.0, 0.0, 0.0, 0.0, 0.0, 0.0, 0.0, 0.0, 0.0, 0.0, 0.0, 0.0, 0.0, 0.0, 0.0, 0.0, 0.0, 0.0, 0.0, 0.0, 0.0, 0.0, 0.0, 0.0, 0.0, 0.0, 0.0, 0.0, 0.0, 0.0, 0.0, 0.0, 0.0, 0.0, 0.0, 0.0, 0.0, 0.0, 0.0, 0.0, 0.0, 0.0, 0.0, 0.0, 0.0, 0.0, 0.0, 0.0, 0.0, 0.0, 0.0, 0.0, 0.0, 0.0, 0.0, 0.0, 0.0, 0.0, 0.0, 0.0, 0.0, 0.0, 0.0, 0.0, 0.0, 0.0, 0.0, 0.0, 0.0, 0.0, 0.0, 0.0, 0.0, 0.0, 0.0, 0.0, 0.0, 0.0, 0.0, 0.0, 0.0, 0.0, 0.0, 0.0, 0.0, 0.0, 0.0, 0.0, 0.0, 0.0, 0.0, 0.0, 0.0, 0.0, 0.0, 0.0, 0.0, 0.0, 0.0, 0.0, 0.0, 0.0, 0.0, 0.0, 0.0, 0.0, 0.0, 0.0, 0.0, 0.0, 0.0, 0.0, 0.0, 0.0, 0.0, 0.0, 0.0, 0.0, 0.0, 0.0, 0.0, 0.0, 0.0, 0.0, 0.0, 0.0, 0.0, 0.0, 0.0, 0.0, 0.0, 0.0, 0.0, 0.0, 0.0, 0.0, 0.0, 0.0, 0.0, 0.0, 0.0, 0.0, 0.0, 0.0, 0.0, 0.0, 0.0, 0.0, 0.0, 0.0, 0.0, 0.0, 0.0, 0.0, 0.0, 0.0, 0.0, 0.0, 0.0, 0.0, 0.0, 0.0, 0.0, 0.0, 0.0, 0.0, 0.0, 0.0, 0.0, 0.0, 0.0, 0.0, 0.0, 0.0, 0.0, 0.0, 0.0, 0.0, 0.0, 0.0, 0.0, 0.0, 0.0, 0.0, 0.0, 0.0, 0.0, 0.0, 0.0, 0.0, 0.0, 0.0, 0.0, 0.0, 0.0, 0.0, 0.0, 0.0, 0.0, 0.0, 0.0, 0.0, 0.0, 0.0, 0.0, 0.0, 0.0, 0.0, 0.0, 0.0, 0.0, 0.0, 0.0, 0.0, 0.0, 0.0, 0.0, 0.0, 0.0, 0.0, 0.0, 0.0, 0.0, 0.0, 0.0, 0.0, 0.0, 0.0, 0.0, 0.0, 0.0, 0.0, 0.0, 0.0, 0.0, 0.0, 0.0, 0.0, 0.0, 0.0, 0.0, 0.0, 0.0, 0.0, 0.0, 0.0, 0.0, 0.0, 0.0, 0.0, 0.0, 0.0, 0.0, 0.0, 0.0, 0.0, 0.0, 0.0, 0.0, 0.0, 0.0, 0.0, 0.0, 0.0, 0.0, 0.0, 0.0, 0.0, 0.0, 0.0, 0.0, 0.0, 0.0, 0.0, 0.0, 0.0, 0.0, 0.0, 0.0, 0.0, 0.0, 0.0, 0.0, 0.0, 0.0, 0.0, 0.0, 0.0, 0.0, 0.0, 0.0, 0.0, 0.0, 0.0, 0.0, 0.0, 0.0, 0.0, 0.0, 0.0, 0.0, 0.0, 0.0, 0.0, 0.0, 0.0, 0.0, 0.0, 0.0, 0.0, 0.0, 0.0, 0.0, 0.0, 0.0, 0.0, 0.0, 0.0, 0.0, 0.0, 0.0, 0.0, 0.0, 0.0, 0.0, 0.0, 0.0, 0.0, 0.0, 0.0, 0.0, 0.0, 0.0, 0.0, 0.0, 0.0, 0.0, 0.0, 0.0, 0.0, 0.0, 0.0, 0.0, 0.0, 0.0, 0.0, 0.0, 0.0, 0.0, 0.0, 0.0, 0.0, 0.0, 0.0, 0.0, 0.0, 0.0, 0.0, 0.0, 0.0, 0.0, 0.0, 0.0, 0.0, 0.0, 0.0, 0.0, 0.0, 0.0, 0.0, 0.0, 0.0, 0.0, 0.0, 0.0, 0.0, 0.0, 0.0, 0.0, 0.0, 0.0, 0.0, 0.0, 0.0, 0.0, 0.0, 0.0, 0.0, 0.0, 0.0, 0.0, 0.0, 0.0, 0.0, 0.0, 0.0, 0.0, 0.0, 0.0, 0.0, 0.0, 0.0, 0.0, 0.0, 0.0, 0.0, 0.0, 0.0, 0.0, 0.0, 0.0, 0.0, 0.0, 0.0, 0.0, 0.0, 0.0, 0.0, 0.0, 0.0, 0.0, 0.0, 0.0, 0.0, 0.0, 0.0, 0.0, 0.0, 0.0, 0.0, 0.0, 0.0, 0.0, 0.0, 0.0, 0.0, 0.0, 0.0, 0.0, 0.0, 0.0, 0.0, 0.0, 0.0, 0.0, 0.0, 0.0, 0.0, 0.0, 0.0, 0.0, 0.0, 0.0, 0.0, 0.0, 0.0, 0.0, 0.0, 0.0, 0.0, 0.0, 0.0, 0.0, 0.0, 0.0, 0.0, 0.0, 0.0, 0.0, 0.0, 0.0, 0.0, 0.0, 0.0, 0.0, 0.0, 0.0, 0.0, 0.0, 0.0, 0.0, 0.0, 0.0, 0.0, 0.0, 0.0, 0.0, 0.0, 0.0, 0.0, 0.0, 0.0, 0.0, 0.0, 0.0, 0.0, 0.0, 0.0, 0.0, 0.0, 0.0, 0.0, 0.0, 0.0, 0.0, 0.0, 0.0, 0.0, 0.0, 0.0, 0.0, 0.0, 0.0, 0.0, 0.0, 0.0, 0.0, 0.0, 0.0, 0.0, 0.0, 0.0, 0.0, 0.0, 0.0, 0.0, 0.0, 0.0, 0.0, 0.0, 0.0, 0.0, 0.0, 0.0, 0.0, 0.0]
[0.0, 0.0, 0.0, 0.0, 0.0, 0.0, 0.0, 0.0, 0.0, 0.0, 0.0, 0.0, 0.0, 0.0, 0.0, 0.0, 0.0, 0.0, 0.0, 0.0, 0.0, 0.0, 0.0, 0.0, 0.0, 0.0, 0.0, 0.0, 0.0, 0.0, 0.0, 0.0, 0.0, 0.0, 0.0, 0.0, 0.0, 0.0, 0.0, 0.0, 0.0, 0.0, 0.0, 0.0, 0.0, 0.0, 0.0, 0.0, 0.0, 0.0, 0.0, 0.0, 0.0, 0.0, 0.0, 0.0, 0.0, 0.0, 0.0, 0.0, 0.0, 0.0, 0.0, 0.0, 0.0, 0.0, 0.0, 0.0, 0.0, 0.0, 0.0, 0.0, 0.0, 0.0, 0.0, 0.0, 0.0, 0.0, 0.0, 0.0, 0.0, 0.0, 0.0, 0.0, 0.0, 0.0, 0.0, 0.0, 0.0, 0.0, 0.0, 0.0, 0.0, 0.0, 0.0, 0.0, 0.0, 0.0, 0.0, 0.0, 0.0, 0.0, 0.0, 0.0, 0.0, 0.0, 0.0, 0.0, 0.0, 0.0, 0.0, 0.0, 0.0, 0.0, 0.0, 0.0, 0.0, 0.0, 0.0, 0.0, 0.0, 0.0, 0.0, 0.0, 0.0, 0.0, 0.0, 0.0, 0.0, 0.0, 0.0, 0.0, 0.0, 0.0, 0.0, 0.0, 0.0, 0.0, 0.0, 0.0, 0.0, 0.0, 0.0, 0.0, 0.0, 0.0, 0.0, 0.0, 0.0, 0.0, 0.0, 0.0, 0.0, 0.0, 0.0, 0.0, 0.0, 0.0, 0.0, 0.0, 0.0, 0.0, 0.0, 0.0, 0.0, 0.0, 0.0, 0.0, 0.0, 0.0, 0.0, 0.0, 0.0, 0.0, 0.0, 0.0, 0.0, 0.0, 0.0, 0.0, 0.0, 0.0, 0.0, 0.0, 0.0, 0.0, 0.0, 0.0, 0.0, 0.0, 0.0, 0.0, 0.0, 0.0, 0.0, 0.0, 0.0, 0.0, 0.0, 0.0, 0.0, 0.0, 0.0, 0.0, 0.0, 0.0, 0.0, 0.0, 0.0, 0.0, 0.0, 0.0, 0.0, 0.0, 0.0, 0.0, 0.0, 0.0, 0.0, 0.0, 0.0, 0.0, 0.0, 0.0, 0.0, 0.0, 0.0, 0.0, 0.0, 0.0, 0.0, 0.0, 0.0, 0.0, 0.0, 0.0, 0.0, 0.0, 0.0, 0.0, 0.0, 0.0, 0.0, 0.0, 0.0, 0.0, 0.0, 0.0, 0.0, 0.0, 0.0, 0.0, 0.0, 0.0, 0.0, 0.0, 0.0, 0.0, 0.0, 0.0, 0.0, 0.0, 0.0, 0.0, 0.0, 0.0, 0.0, 0.0, 0.0, 0.0, 0.0, 0.0, 0.0, 0.0, 0.0, 0.0, 0.0, 0.0, 0.0, 0.0, 0.0, 0.0, 0.0, 0.0, 0.0, 0.0, 0.0, 0.0, 0.0, 0.0, 0.0, 0.0, 0.0, 0.0, 0.0, 0.0, 0.0, 0.0, 0.0, 0.0, 0.0, 0.0, 0.0, 0.0, 0.0, 0.0, 0.0, 0.0, 0.0, 0.0, 0.0, 0.0, 0.0, 0.0, 0.0, 0.0, 0.0, 0.0, 0.0, 0.0, 0.0, 0.0, 0.0, 0.0, 0.0, 0.0, 0.0, 0.0, 0.0, 0.0, 0.0, 0.0, 0.0, 0.0, 0.0, 0.0, 0.0, 0.0, 0.0, 0.0, 0.0, 0.0, 0.0, 0.0, 0.0, 0.0, 0.0, 0.0, 0.0, 0.0, 0.0, 0.0, 0.0, 0.0, 0.0, 0.0, 0.0, 0.0, 0.0, 0.0, 0.0, 0.0, 0.0, 0.0, 0.0, 0.0, 0.0, 0.0, 0.0, 0.0, 0.0, 0.0, 0.0, 0.0, 0.0, 0.0, 0.0, 0.0, 0.0, 0.0, 0.0, 0.0, 0.0, 0.0, 0.0, 0.0, 0.0, 0.0, 0.0, 0.0, 0.0, 0.0, 0.0, 0.0, 0.0, 0.0, 0.0, 0.0, 0.0, 0.0, 0.0, 0.0, 0.0, 0.0, 0.0, 0.0, 0.0, 0.0, 0.0, 0.0, 0.0, 0.0, 0.0, 0.0, 0.0, 0.0, 0.0, 0.0, 0.0, 0.0, 0.0, 0.0, 0.0, 0.0, 0.0, 0.0, 0.0, 0.0, 0.0, 0.0, 0.0, 0.0, 0.0, 0.0, 0.0, 0.0, 0.0, 0.0, 0.0, 0.0, 0.0, 0.0, 0.0, 0.0, 0.0, 0.0, 0.0, 0.0, 0.0, 0.0, 0.0, 0.0, 0.0, 0.0, 0.0, 0.0, 0.0, 0.0, 0.0, 0.0, 0.0, 0.0, 0.0, 0.0, 0.0, 0.0, 0.0, 0.0, 0.0, 0.0, 0.0, 0.0, 0.0, 0.0, 0.0, 0.0, 0.0, 0.0, 0.0, 0.0, 0.0, 0.0, 0.0, 0.0, 0.0, 0.0, 0.0, 0.0, 0.0, 0.0, 0.0, 0.0, 0.0, 0.0, 0.0, 0.0, 0.0, 0.0, 0.0, 0.0, 0.0, 0.0, 0.0, 0.0, 0.0, 0.0, 0.0, 0.0, 0.0, 0.0, 0.0, 0.0, 0.0, 0.0, 0.0, 0.0, 0.0, 0.0, 0.0, 0.0, 0.0, 0.0, 0.0, 0.0, 0.0, 0.0, 0.0, 0.0, 0.0, 0.0, 0.0, 0.0, 0.0, 0.0, 0.0, 0.0, 0.0, 0.0, 0.0, 0.0, 0.0, 0.0, 0.0, 0.0, 0.0, 0.0, 0.0, 0.0, 0.0, 0.0, 0.0, 0.0, 0.0, 0.0, 0.0, 0.0, 0.0, 0.0, 0.0, 0.0, 0.0, 0.0, 0.0, 0.0, 0.0, 0.0, 0.0, 0.0, 0.0, 0.0, 0.0, 0.0, 0.0, 0.0, 0.0, 0.0, 0.0, 0.0, 0.0, 0.0, 0.0, 0.0, 0.0, 0.0, 0.0, 0.0, 0.0, 0.0, 0.0, 0.0, 0.0, 0.0, 0.0, 0.0, 0.0, 0.0, 0.0, 0.0, 0.0, 0.0, 0.0, 0.0, 0.0, 0.0, 0.0, 0.0, 0.0, 0.0, 0.0, 0.0, 0.0, 0.0, 0.0, 0.0, 0.0, 0.0, 0.0, 0.0, 0.0, 0.0, 0.0, 0.0, 0.0, 0.0, 0.0, 0.0, 0.0, 0.0, 0.0, 0.0, 0.0, 0.0, 0.0, 0.0, 0.0, 0.0, 0.0, 0.0, 0.0, 0.0, 0.0, 0.0, 0.0, 0.0, 0.0, 0.0, 0.0, 0.0, 0.0, 0.0, 0.0, 0.0, 0.0, 0.0, 0.0, 0.0, 0.0, 0.0, 0.0, 0.0, 0.0, 0.0, 0.0, 0.0, 0.0, 0.0, 0.0, 0.0, 0.0, 0.0, 0.0, 0.0, 0.0, 0.0, 0.0, 0.0, 0.0, 0.0, 0.0, 0.0, 0.0, 0.0, 0.0, 0.0, 0.0, 0.0, 0.0, 0.0, 0.0, 0.0, 0.0, 0.0, 0.0, 0.0, 0.0, 0.0, 0.0, 0.0, 0.0, 0.0, 0.0, 0.0, 0.0, 0.0, 0.0, 0.0, 0.0, 0.0, 0.0, 0.0, 0.0, 0.0, 0.0, 0.0, 0.0, 0.0, 0.0, 0.0, 0.0, 0.0, 0.0, 0.0, 0.0, 0.0, 0.0, 0.0, 0.0, 0.0, 0.0, 0.0, 0.0, 0.0, 0.0, 0.0, 0.0, 0.0, 0.0, 0.0, 0.0, 0.0, 0.0, 0.0, 0.0, 0.0, 0.0, 0.0, 0.0, 0.0, 0.0, 0.0, 0.0, 0.0, 0.0, 0.0, 0.0, 0.0, 0.0, 0.0, 0.0, 0.0, 0.0, 0.0, 0.0, 0.0, 0.0, 0.0, 0.0, 0.0, 0.0, 0.0, 0.0, 0.0, 0.0, 0.0, 0.0, 0.0, 0.0, 0.0, 0.0, 0.0, 0.0, 0.0, 0.0, 0.0]

Found counterexample: ([0.011764705, 0.011764705, 0.011764705, 0.011764705, 0.011764705, 0.011764705, 0.011764705, 0.011764705, 0.011764705, 0.011764705, 0.011764705, 0.011764705, 0.011764705, 0.011764705, 0.011764705, 0.011764705, 0.011764705, 0.011764705, 0.011764705, 0.011764705, 0.011764705, 0.011764705, 0.011764705, 0.011764705, 0.011764705, 0.011764705, 0.011764705, 0.011764705, 0.011764705, 0.011764705, 0.011764705, 0.011764705, 0.011764705, 0.011764705, 0.011764705, 0.011764705, 0.011764705, 0.011764705, 0.011764705, 0.011764705, 0.011764705, 0.011764705, 0.011764705, 0.011764705, 0.011764705, 0.011764705, 0.011764705, 0.011764705, 0.011764705, 0.011764705, 0.011764705, 0.011764705, 0.011764705, 0.011764705, 0.011764705, 0.011764705, 0.011764705, 0.011764705, 0.011764705, 0.011764705, 0.011764705, 0.011764705, 0.011764705, 0.011764705, 0.011764705, 0.011764705, 0.011764705, 0.011764705, 0.011764705, 0.011764705, 0.011764705, 0.011764705, 0.011764705, 0.011764705, 0.011764705, 0.011764705, 0.011764705, 0.011764705, 0.011764705, 0.011764705, 0.011764705, 0.011764705, 0.011764705, 0.011764705, 0.011764705, 0.011764705, 0.011764705, 0.011764705, 0.011764705, 0.011764705, 0.011764705, 0.011764705, 0.011764705, 0.011764705, 0.011764705, 0.011764705, 0.011764705, 0.011764705, 0.011764705, 0.011764705, 0.011764705, 0.011764705, 0.011764705, 0.011764705, 0.011764705, 0.011764705, 0.011764705, 0.011764705, 0.011764705, 0.011764705, 0.011764705, 0.011764705, 0.011764705, 0.011764705, 0.011764705, 0.011764705, 0.011764705, 0.011764705, 0.011764705, 0.011764705, 0.011764705, 0.011764705, 0.011764705, 0.011764705, 0.011764705, 0.011764705, 0.011764705, 0.011764705, 0.011764705, 0.011764705, 0.011764705, 0.011764705, 0.011764705, 0.011764705, 0.011764705, 0.011764705, 0.011764705, 0.011764705, 0.011764705, 0.011764705, 0.011764705, 0.011764705, 0.011764705, 0.011764705, 0.011764705, 0.011764705, 0.011764705, 0.011764705, 0.011764705, 0.011764705, 0.011764705, 0.011764705, 0.011764705, 0.011764705, 0.011764705, 0.011764705, 0.011764705, 0.011764705, 0.011764705, 0.011764705, 0.011764705, 0.011764705, 0.011764705, 0.011764705, 0.011764705, 0.011764705, 0.011764705, 0.011764705, 0.011764705, 0.011764705, 0.011764705, 0.011764705, 0.011764705, 0.011764705, 0.011764705, 0.10588235500000001, 0.53333336, 0.22352941, 0.070588235, 0.070588235, 0.070588235, 0.070588235, 0.070588235, 0.14901961, 0.53333336, 0.17647059, 0.01764706, 0.011764705, 0.011764705, 0.011764705, 0.011764705, 0.011764705, 0.011764705, 0.011764705, 0.011764705, 0.011764705, 0.011764705, 0.011764705, 0.011764705, 0.011764705, 0.011764705, 0.011764705, 0.011764705, 0.98627451, 0.984313725, 0.984313725, 0.984313725, 0.984313725, 0.984313725, 0.984313725, 0.984313725, 0.984313725, 0.984313725, 0.984313725, 0.16078432, 0.011764705, 0.011764705, 0.011764705, 0.011764705, 0.011764705, 0.011764705, 0.011764705, 0.011764705, 0.011764705, 0.011764705, 0.011764705, 0.011764705, 0.011764705, 0.011764705, 0.011764705, 0.011764705, 0.988235295, 0.984313725, 0.984313725, 0.984313725, 0.984313725, 0.984313725, 0.984313725, 0.984313725, 0.984313725, 0.984313725, 0.984313725, 0.16078432, 0.011764705, 0.011764705, 0.011764705, 0.011764705, 0.011764705, 0.011764705, 0.011764705, 0.011764705, 0.011764705, 0.011764705, 0.011764705, 0.011764705, 0.011764705, 0.011764705, 0.011764705, 0.011764705, 0.28627452, 0.71372551, 0.6156863, 0.25490197000000003, 0.63137257, 0.8313725599999999, 0.984313725, 0.984313725, 0.984313725, 0.984313725, 0.90980393, 0.117647065, 0.011764705, 0.011764705, 0.011764705, 0.011764705, 0.011764705, 0.011764705, 0.011764705, 0.011764705, 0.011764705, 0.011764705, 0.011764705, 0.011764705, 0.011764705, 0.011764705, 0.011764705, 0.011764705, 0.011764705, 0.011764705, 0.011764705, 0.011764705, 0.011764705, 0.22352941, 0.97254902, 0.984313725, 0.984313725, 0.913725495, 0.23529412500000002, 0.011764705, 0.011764705, 0.011764705, 0.011764705, 0.011764705, 0.011764705, 0.011764705, 0.011764705, 0.011764705, 0.011764705, 0.011764705, 0.011764705, 0.011764705, 0.011764705, 0.011764705, 0.011764705, 0.011764705, 0.011764705, 0.011764705, 0.011764705, 0.011764705, 0.011764705, 0.047058825, 0.95686275, 0.984313725, 0.984313725, 0.9686274500000001, 0.20392157, 0.011764705, 0.011764705, 0.011764705, 0.011764705, 0.011764705, 0.011764705, 0.011764705, 0.011764705, 0.011764705, 0.011764705, 0.011764705, 0.011764705, 0.011764705, 0.011764705, 0.011764705, 0.011764705, 0.011764705, 0.011764705, 0.011764705, 0.011764705, 0.011764705, 0.011764705, 0.011764705, 0.73333335, 0.984313725, 0.984313725, 0.76078433, 0.01764706, 0.011764705, 0.011764705, 0.011764705, 0.011764705, 0.011764705, 0.011764705, 0.011764705, 0.011764705, 0.011764705, 0.011764705, 0.011764705, 0.011764705, 0.011764705, 0.011764705, 0.011764705, 0.011764705, 0.011764705, 0.011764705, 0.019607845, 0.09411765, 0.44313726, 0.55686277, 0.55686277, 0.97647059, 0.984313725, 0.984313725, 0.36470589, 0.09411765, 0.09411765, 0.09411765, 0.09411765, 0.09411765, 0.09411765, 0.09411765, 0.09411765, 0.09411765, 0.050980395, 0.011764705, 0.011764705, 0.011764705, 0.011764705, 0.011764705, 0.011764705, 0.011764705, 0.011764705, 0.011764705, 0.117647065, 0.94117647, 0.984313725, 0.984313725, 0.984313725, 0.984313725, 0.984313725, 0.984313725, 0.984313725, 0.984313725, 0.984313725, 0.984313725, 0.984313725, 0.984313725, 0.984313725, 0.984313725, 0.984313725, 0.92941177, 0.6588235499999999, 0.011764705, 0.011764705, 0.011764705, 0.011764705, 0.011764705, 0.011764705, 0.011764705, 0.011764705, 0.011764705, 0.011764705, 0.20392157, 0.43137254999999997, 0.84313726, 0.984313725, 0.984313725, 0.984313725, 0.984313725, 0.984313725, 0.984313725, 0.984313725, 0.984313725, 0.984313725, 0.984313725, 0.84313726, 0.76078433, 0.60784316, 0.18039216, 0.011764705, 0.011764705, 0.011764705, 0.011764705, 0.011764705, 0.011764705, 0.011764705, 0.011764705, 0.011764705, 0.011764705, 0.011764705, 0.011764705, 0.011764705, 0.34901962, 0.984313725, 0.984313725, 0.984313725, 0.94509804, 0.90196079, 0.76078433, 0.6901961, 0.27058824000000004, 0.23137256, 0.23137256, 0.08235294, 0.011764705, 0.011764705, 0.011764705, 0.011764705, 0.011764705, 0.011764705, 0.011764705, 0.011764705, 0.011764705, 0.011764705, 0.011764705, 0.011764705, 0.011764705, 0.011764705, 0.011764705, 0.011764705, 0.34901962, 0.984313725, 0.984313725, 0.984313725, 0.65490198, 0.11372549500000001, 0.03921569, 0.011764705, 0.011764705, 0.011764705, 0.011764705, 0.011764705, 0.011764705, 0.011764705, 0.011764705, 0.011764705, 0.011764705, 0.011764705, 0.011764705, 0.011764705, 0.011764705, 0.011764705, 0.011764705, 0.011764705, 0.011764705, 0.011764705, 0.011764705, 0.011764705, 0.34901962, 0.984313725, 0.984313725, 0.984313725, 0.36862746, 0.011764705, 0.011764705, 0.011764705, 0.011764705, 0.011764705, 0.011764705, 0.011764705, 0.011764705, 0.011764705, 0.011764705, 0.011764705, 0.011764705, 0.011764705, 0.011764705, 0.011764705, 0.011764705, 0.011764705, 0.011764705, 0.011764705, 0.011764705, 0.011764705, 0.011764705, 0.011764705, 0.34901962, 0.984313725, 0.984313725, 0.90196079, 0.015686275, 0.011764705, 0.011764705, 0.011764705, 0.011764705, 0.011764705, 0.011764705, 0.011764705, 0.011764705, 0.011764705, 0.011764705, 0.011764705, 0.011764705, 0.011764705, 0.011764705, 0.011764705, 0.011764705, 0.011764705, 0.011764705, 0.011764705, 0.011764705, 0.011764705, 0.011764705, 0.011764705, 0.34901962, 0.984313725, 0.984313725, 0.95294118, 0.21568628, 0.011764705, 0.011764705, 0.011764705, 0.011764705, 0.011764705, 0.011764705, 0.011764705, 0.011764705, 0.011764705, 0.011764705, 0.011764705, 0.011764705, 0.011764705, 0.011764705, 0.011764705, 0.011764705, 0.011764705, 0.011764705, 0.011764705, 0.011764705, 0.011764705, 0.011764705, 0.011764705, 0.34901962, 0.984313725, 0.984313725, 0.984313725, 0.36862746, 0.011764705, 0.011764705, 0.011764705, 0.011764705, 0.011764705, 0.011764705, 0.011764705, 0.011764705, 0.011764705, 0.011764705, 0.011764705, 0.011764705, 0.011764705, 0.011764705, 0.011764705, 0.011764705, 0.011764705, 0.011764705, 0.011764705, 0.011764705, 0.011764705, 0.011764705, 0.011764705, 0.34901962, 0.984313725, 0.984313725, 0.984313725, 0.36862746, 0.011764705, 0.011764705, 0.011764705, 0.011764705, 0.011764705, 0.011764705, 0.011764705, 0.011764705, 0.011764705, 0.011764705, 0.011764705, 0.011764705, 0.011764705, 0.011764705, 0.011764705, 0.011764705, 0.011764705, 0.011764705, 0.011764705, 0.011764705, 0.011764705, 0.011764705, 0.011764705, 0.34901962, 0.984313725, 0.984313725, 0.91764706, 0.078431375, 0.011764705, 0.011764705, 0.011764705, 0.011764705, 0.011764705, 0.011764705, 0.011764705, 0.011764705, 0.011764705, 0.011764705, 0.011764705, 0.011764705, 0.011764705, 0.011764705, 0.011764705, 0.011764705, 0.011764705, 0.011764705, 0.011764705, 0.011764705, 0.011764705, 0.011764705, 0.011764705, 0.34901962, 0.984313725, 0.984313725, 0.90196079, 0.011764705, 0.011764705, 0.011764705, 0.011764705, 0.011764705, 0.011764705, 0.011764705, 0.011764705, 0.011764705, 0.011764705, 0.011764705, 0.011764705, 0.011764705, 0.011764705, 0.011764705, 0.011764705, 0.011764705, 0.011764705, 0.011764705, 0.011764705, 0.011764705, 0.011764705, 0.011764705, 0.011764705, 0.02352941, 0.47843138500000004, 0.5294117899999999, 0.266666675, 0.011764705, 0.011764705, 0.011764705, 0.011764705, 0.011764705, 0.011764705, 0.011764705, 0.011764705, 0.011764705, 0.011764705, 0.011764705, 0.011764705, 0.011764705, 0.011764705, 0.011764705, 0.011764705, 0.011764705, 0.011764705, 0.011764705, 0.011764705, 0.011764705, 0.011764705, 0.011764705, 0.011764705, 0.011764705, 0.011764705, 0.011764705, 0.011764705, 0.011764705, 0.011764705, 0.011764705, 0.011764705, 0.011764705, 0.011764705, 0.011764705, 0.011764705, 0.011764705, 0.011764705, 0.011764705, 0.011764705, 0.011764705, 0.011764705, 0.011764705, 0.011764705, 0.011764705, 0.011764705, 0.011764705, 0.011764705, 0.011764705, 0.011764705, 0.011764705, 0.011764705, 0.011764705, 0.011764705, 0.011764705, 0.011764705, 0.011764705, 0.011764705, 0.011764705, 0.011764705, 0.011764705, 0.011764705, 0.011764705, 0.011764705, 0.011764705, 0.011764705, 0.011764705, 0.011764705, 0.011764705], ([-86.66995186698271, -44.32487808239169, -22.907457640059246, -34.23737845660323, -55.067139809638235, -70.58328383771283, -72.08357400107099, 16.06561089010301, -64.91919467252148, -55.388081533849636], [-81.65431120013439, -44.11159034162208, -20.544957475284814, -31.5940795961112, -54.931201072203564, -68.6237249940577, -67.1328547627021, 13.965836759663087, -64.63446116189202, -55.63416530554553], 2.099774130439922))
[Thread 1] Total splits: 0
Processed 1 zonotopes (Work Done: 0.0%); Generated 0 (0.229270276s/loop)
[Thread 1] Finished in 0.23s
 ────────────────────────────────────────────────────────────────────────────────
                                        Time                    Allocations      
                               ───────────────────────   ────────────────────────
       Tot / % measured:            232ms / 100.0%            138MiB / 100.0%    

 Section               ncalls     time    %tot     avg     alloc    %tot      avg
 ────────────────────────────────────────────────────────────────────────────────
 Verify                     1    229ms   99.0%   229ms    128MiB   92.9%   128MiB
   Zonotope Loop            1    229ms   99.0%   229ms    128MiB   92.9%   128MiB
     Zonotope Propa...      1    202ms   87.2%   202ms    107MiB   77.3%   107MiB
       DiffZonotope...      2    144ms   62.1%  71.9ms   93.2MiB   67.5%  46.6MiB
         Zonotope_R...      4    143ms   61.7%  35.7ms   93.1MiB   67.4%  23.3MiB
           Column M...      4   74.2ms   32.0%  18.5ms   17.1MiB   12.4%  4.27MiB
           Influenc...      4   61.2ms   26.4%  15.3ms   58.8MiB   42.6%  14.7MiB
             Multiply       4   46.0ms   19.9%  11.5ms   32.6MiB   23.6%  8.15MiB
             Alloca...      4   11.8ms    5.1%  2.94ms   26.2MiB   19.0%  6.54MiB
             Set Ma...      4   3.36ms    1.4%   839μs     0.00B    0.0%    0.00B
           Allocation       4   5.06ms    2.2%  1.26ms   17.1MiB   12.4%  4.27MiB
           Set Matrix       4   2.22ms    1.0%   556μs   26.0KiB    0.0%  6.50KiB
           Vectors          4   85.9μs    0.0%  21.5μs    100KiB    0.1%  25.0KiB
           Bounds           4   2.12μs    0.0%   530ns     0.00B    0.0%    0.00B
       DiffZonotope...      3   58.2ms   25.1%  19.4ms   13.6MiB    9.8%  4.53MiB
         Zonotope_D...      6   58.1ms   25.1%  9.69ms   13.6MiB    9.8%  2.26MiB
     Property Check         1   1.70ms    0.7%  1.70ms    361KiB    0.3%   361KiB
 Initialize                 1   2.24ms    1.0%  2.24ms   9.84MiB    7.1%  9.84MiB
 ────────────────────────────────────────────────────────────────────────────────
[VERYDIFF_TIMER] 0.265620573

[VERYDIFF_EXPERIMENT] Running on /home/i57/steuber/NeuroDiff/repos/VeryDiffExperiments/src/../benchmarks/mnist-prune/specs/mnist_97_global_6.vnnlib /home/i57/steuber/NeuroDiff/repos/VeryDiffExperiments/src/../benchmarks/mnist-prune/nets/mnist_relu_3_100.onnx
Found input X
op: matmul, weight: (100, 784), bias: nothing
op: bias, weight: nothing, bias: (100,)
op: relu, weight: nothing, bias: nothing
op: matmul, weight: (100, 100), bias: nothing
op: bias, weight: nothing, bias: (100,)
op: relu, weight: nothing, bias: nothing
op: matmul, weight: (10, 100), bias: nothing
op: bias, weight: nothing, bias: (10,)
op: relu, weight: nothing, bias: nothing
op: matmul, weight: (10, 10), bias: nothing
op: bias, weight: nothing, bias: (10,)
Found input X
op: matmul, weight: (100, 784), bias: nothing
op: bias, weight: nothing, bias: (100,)
op: relu, weight: nothing, bias: nothing
op: matmul, weight: (100, 100), bias: nothing
op: bias, weight: nothing, bias: (100,)
op: relu, weight: nothing, bias: nothing
op: matmul, weight: (10, 100), bias: nothing
op: bias, weight: nothing, bias: (10,)
op: relu, weight: nothing, bias: nothing
op: matmul, weight: (10, 10), bias: nothing
op: bias, weight: nothing, bias: (10,)
Distance: 296.6600370998244
Distance: 77.24290861755458
Distance: 5.7170369567975285
Distance: 0.0
Running with 1 threads
[Thread 1] Time to first task: 0.0s
Zono Bounds:
[0.0, 0.0, 0.0, 0.0, 0.0, 0.0, 0.0, 0.0, 0.0, 0.0, 0.0, 0.0, 0.0, 0.0, 0.0, 0.0, 0.0, 0.0, 0.0, 0.0, 0.0, 0.0, 0.0, 0.0, 0.0, 0.0, 0.0, 0.0, 0.0, 0.0, 0.0, 0.0, 0.0, 0.0, 0.0, 0.0, 0.0, 0.0, 0.0, 0.0, 0.0, 0.0, 0.0, 0.0, 0.0, 0.0, 0.0, 0.0, 0.0, 0.0, 0.0, 0.0, 0.0, 0.0, 0.0, 0.0, 0.0, 0.0, 0.0, 0.0, 0.0, 0.0, 0.0, 0.0, 0.0, 0.0, 0.0, 0.0, 0.0, 0.0, 0.0, 0.0, 0.0, 0.0, 0.0, 0.0, 0.0, 0.0, 0.0, 0.0, 0.0, 0.0, 0.0, 0.0, 0.0, 0.0, 0.0, 0.0, 0.0, 0.0, 0.0, 0.0, 0.0, 0.0, 0.0, 0.0, 0.0, 0.0, 0.0, 0.0, 0.0, 0.0, 0.0, 0.0, 0.0, 0.0, 0.0, 0.0, 0.0, 0.0, 0.0, 0.0, 0.0, 0.0, 0.0, 0.0, 0.0, 0.0, 0.0, 0.0, 0.0, 0.0, 0.0, 0.0, 0.0, 0.0, 0.0, 0.0, 0.0, 0.0, 0.0, 0.0, 0.0, 0.0, 0.0, 0.0, 0.0, 0.0, 0.0, 0.0, 0.0, 0.0, 0.0, 0.0, 0.0, 0.0, 0.0, 0.0, 0.0, 0.0, 0.0, 0.0, 0.0, 0.0, 0.0, 0.0, 0.0, 0.0, 0.0, 0.0, 0.0, 0.0, 0.0, 0.0, 0.0, 0.0, 0.0, 0.0, 0.0, 0.0, 0.0, 0.0, 0.0, 0.0, 0.0, 0.0, 0.0, 0.0, 0.0, 0.0, 0.0, 0.0, 0.0, 0.0, 0.0, 0.0, 0.0, 0.0, 0.0, 0.0, 0.0, 0.0, 0.0, 0.0, 0.0, 0.0, 0.0, 0.0, 0.0, 0.0, 0.0, 0.0, 0.0, 0.0, 0.0, 0.0, 0.0, 0.0, 0.0, 0.0, 0.0, 0.0, 0.0, 0.0, 0.0, 0.0, 0.0, 0.0, 0.0, 0.0, 0.0, 0.0, 0.0, 0.0, 0.0, 0.0, 0.0, 0.0, 0.0, 0.0, 0.0, 0.0, 0.0, 0.0, 0.0, 0.0, 0.0, 0.0, 0.0, 0.0, 0.0, 0.0, 0.0, 0.0, 0.0, 0.0, 0.0, 0.0, 0.0, 0.0, 0.0, 0.0, 0.0, 0.0, 0.0, 0.0, 0.0, 0.0, 0.0, 0.0, 0.0, 0.0, 0.0, 0.0, 0.0, 0.0, 0.0, 0.0, 0.0, 0.0, 0.0, 0.0, 0.0, 0.0, 0.0, 0.0, 0.0, 0.0, 0.0, 0.0, 0.0, 0.0, 0.0, 0.0, 0.0, 0.0, 0.0, 0.0, 0.0, 0.0, 0.0, 0.0, 0.0, 0.0, 0.0, 0.0, 0.0, 0.0, 0.0, 0.0, 0.0, 0.0, 0.0, 0.0, 0.0, 0.0, 0.0, 0.0, 0.0, 0.0, 0.0, 0.0, 0.0, 0.0, 0.0, 0.0, 0.0, 0.0, 0.0, 0.0, 0.0, 0.0, 0.0, 0.0, 0.0, 0.0, 0.0, 0.0, 0.0, 0.0, 0.0, 0.0, 0.0, 0.0, 0.0, 0.0, 0.0, 0.0, 0.0, 0.0, 0.0, 0.0, 0.0, 0.0, 0.0, 0.0, 0.0, 0.0, 0.0, 0.0, 0.0, 0.0, 0.0, 0.0, 0.0, 0.0, 0.0, 0.0, 0.0, 0.0, 0.0, 0.0, 0.0, 0.0, 0.0, 0.0, 0.0, 0.0, 0.0, 0.0, 0.0, 0.0, 0.0, 0.0, 0.0, 0.0, 0.0, 0.0, 0.0, 0.0, 0.0, 0.0, 0.0, 0.0, 0.0, 0.0, 0.0, 0.0, 0.0, 0.0, 0.0, 0.0, 0.0, 0.0, 0.0, 0.0, 0.0, 0.0, 0.0, 0.0, 0.0, 0.0, 0.0, 0.0, 0.0, 0.0, 0.0, 0.0, 0.0, 0.0, 0.0, 0.0, 0.0, 0.0, 0.0, 0.0, 0.0, 0.0, 0.0, 0.0, 0.0, 0.0, 0.0, 0.0, 0.0, 0.0, 0.0, 0.0, 0.0, 0.0, 0.0, 0.0, 0.0, 0.0, 0.0, 0.0, 0.0, 0.0, 0.0, 0.0, 0.0, 0.0, 0.0, 0.0, 0.0, 0.0, 0.0, 0.0, 0.0, 0.0, 0.0, 0.0, 0.0, 0.0, 0.0, 0.0, 0.0, 0.0, 0.0, 0.0, 0.0, 0.0, 0.0, 0.0, 0.0, 0.0, 0.0, 0.0, 0.0, 0.0, 0.0, 0.0, 0.0, 0.0, 0.0, 0.0, 0.0, 0.0, 0.0, 0.0, 0.0, 0.0, 0.0, 0.0, 0.0, 0.0, 0.0, 0.0, 0.0, 0.0, 0.0, 0.0, 0.0, 0.0, 0.0, 0.0, 0.0, 0.0, 0.0, 0.0, 0.0, 0.0, 0.0, 0.0, 0.0, 0.0, 0.0, 0.0, 0.0, 0.0, 0.0, 0.0, 0.0, 0.0, 0.0, 0.0, 0.0, 0.0, 0.0, 0.0, 0.0, 0.0, 0.0, 0.0, 0.0, 0.0, 0.0, 0.0, 0.0, 0.0, 0.0, 0.0, 0.0, 0.0, 0.0, 0.0, 0.0, 0.0, 0.0, 0.0, 0.0, 0.0, 0.0, 0.0, 0.0, 0.0, 0.0, 0.0, 0.0, 0.0, 0.0, 0.0, 0.0, 0.0, 0.0, 0.0, 0.0, 0.0, 0.0, 0.0, 0.0, 0.0, 0.0, 0.0, 0.0, 0.0, 0.0, 0.0, 0.0, 0.0, 0.0, 0.0, 0.0, 0.0, 0.0, 0.0, 0.0, 0.0, 0.0, 0.0, 0.0, 0.0, 0.0, 0.0, 0.0, 0.0, 0.0, 0.0, 0.0, 0.0, 0.0, 0.0, 0.0, 0.0, 0.0, 0.0, 0.0, 0.0, 0.0, 0.0, 0.0, 0.0, 0.0, 0.0, 0.0, 0.0, 0.0, 0.0, 0.0, 0.0, 0.0, 0.0, 0.0, 0.0, 0.0, 0.0, 0.0, 0.0, 0.0, 0.0, 0.0, 0.0, 0.0, 0.0, 0.0, 0.0, 0.0, 0.0, 0.0, 0.0, 0.0, 0.0, 0.0, 0.0, 0.0, 0.0, 0.0, 0.0, 0.0, 0.0, 0.0, 0.0, 0.0, 0.0, 0.0, 0.0, 0.0, 0.0, 0.0, 0.0, 0.0, 0.0, 0.0, 0.0, 0.0, 0.0, 0.0, 0.0, 0.0, 0.0, 0.0, 0.0, 0.0, 0.0, 0.0, 0.0, 0.0, 0.0, 0.0, 0.0, 0.0, 0.0, 0.0, 0.0, 0.0, 0.0, 0.0, 0.0, 0.0, 0.0, 0.0, 0.0, 0.0, 0.0, 0.0, 0.0, 0.0, 0.0, 0.0, 0.0, 0.0, 0.0, 0.0, 0.0, 0.0, 0.0, 0.0, 0.0, 0.0, 0.0, 0.0, 0.0, 0.0, 0.0, 0.0, 0.0, 0.0, 0.0, 0.0, 0.0, 0.0, 0.0, 0.0, 0.0, 0.0, 0.0, 0.0, 0.0, 0.0, 0.0, 0.0, 0.0, 0.0, 0.0, 0.0, 0.0, 0.0, 0.0, 0.0, 0.0, 0.0, 0.0, 0.0, 0.0, 0.0, 0.0, 0.0, 0.0, 0.0, 0.0, 0.0, 0.0, 0.0, 0.0, 0.0, 0.0, 0.0, 0.0, 0.0, 0.0, 0.0, 0.0, 0.0, 0.0, 0.0, 0.0, 0.0, 0.0, 0.0, 0.0, 0.0, 0.0, 0.0, 0.0, 0.0, 0.0, 0.0, 0.0, 0.0, 0.0, 0.0, 0.0, 0.0, 0.0, 0.0, 0.0, 0.0, 0.0, 0.0, 0.0, 0.0, 0.0, 0.0, 0.0]
[0.0, 0.0, 0.0, 0.0, 0.0, 0.0, 0.0, 0.0, 0.0, 0.0, 0.0, 0.0, 0.0, 0.0, 0.0, 0.0, 0.0, 0.0, 0.0, 0.0, 0.0, 0.0, 0.0, 0.0, 0.0, 0.0, 0.0, 0.0, 0.0, 0.0, 0.0, 0.0, 0.0, 0.0, 0.0, 0.0, 0.0, 0.0, 0.0, 0.0, 0.0, 0.0, 0.0, 0.0, 0.0, 0.0, 0.0, 0.0, 0.0, 0.0, 0.0, 0.0, 0.0, 0.0, 0.0, 0.0, 0.0, 0.0, 0.0, 0.0, 0.0, 0.0, 0.0, 0.0, 0.0, 0.0, 0.0, 0.0, 0.0, 0.0, 0.0, 0.0, 0.0, 0.0, 0.0, 0.0, 0.0, 0.0, 0.0, 0.0, 0.0, 0.0, 0.0, 0.0, 0.0, 0.0, 0.0, 0.0, 0.0, 0.0, 0.0, 0.0, 0.0, 0.0, 0.0, 0.0, 0.0, 0.0, 0.0, 0.0, 0.0, 0.0, 0.0, 0.0, 0.0, 0.0, 0.0, 0.0, 0.0, 0.0, 0.0, 0.0, 0.0, 0.0, 0.0, 0.0, 0.0, 0.0, 0.0, 0.0, 0.0, 0.0, 0.0, 0.0, 0.0, 0.0, 0.0, 0.0, 0.0, 0.0, 0.0, 0.0, 0.0, 0.0, 0.0, 0.0, 0.0, 0.0, 0.0, 0.0, 0.0, 0.0, 0.0, 0.0, 0.0, 0.0, 0.0, 0.0, 0.0, 0.0, 0.0, 0.0, 0.0, 0.0, 0.0, 0.0, 0.0, 0.0, 0.0, 0.0, 0.0, 0.0, 0.0, 0.0, 0.0, 0.0, 0.0, 0.0, 0.0, 0.0, 0.0, 0.0, 0.0, 0.0, 0.0, 0.0, 0.0, 0.0, 0.0, 0.0, 0.0, 0.0, 0.0, 0.0, 0.0, 0.0, 0.0, 0.0, 0.0, 0.0, 0.0, 0.0, 0.0, 0.0, 0.0, 0.0, 0.0, 0.0, 0.0, 0.0, 0.0, 0.0, 0.0, 0.0, 0.0, 0.0, 0.0, 0.0, 0.0, 0.0, 0.0, 0.0, 0.0, 0.0, 0.0, 0.0, 0.0, 0.0, 0.0, 0.0, 0.0, 0.0, 0.0, 0.0, 0.0, 0.0, 0.0, 0.0, 0.0, 0.0, 0.0, 0.0, 0.0, 0.0, 0.0, 0.0, 0.0, 0.0, 0.0, 0.0, 0.0, 0.0, 0.0, 0.0, 0.0, 0.0, 0.0, 0.0, 0.0, 0.0, 0.0, 0.0, 0.0, 0.0, 0.0, 0.0, 0.0, 0.0, 0.0, 0.0, 0.0, 0.0, 0.0, 0.0, 0.0, 0.0, 0.0, 0.0, 0.0, 0.0, 0.0, 0.0, 0.0, 0.0, 0.0, 0.0, 0.0, 0.0, 0.0, 0.0, 0.0, 0.0, 0.0, 0.0, 0.0, 0.0, 0.0, 0.0, 0.0, 0.0, 0.0, 0.0, 0.0, 0.0, 0.0, 0.0, 0.0, 0.0, 0.0, 0.0, 0.0, 0.0, 0.0, 0.0, 0.0, 0.0, 0.0, 0.0, 0.0, 0.0, 0.0, 0.0, 0.0, 0.0, 0.0, 0.0, 0.0, 0.0, 0.0, 0.0, 0.0, 0.0, 0.0, 0.0, 0.0, 0.0, 0.0, 0.0, 0.0, 0.0, 0.0, 0.0, 0.0, 0.0, 0.0, 0.0, 0.0, 0.0, 0.0, 0.0, 0.0, 0.0, 0.0, 0.0, 0.0, 0.0, 0.0, 0.0, 0.0, 0.0, 0.0, 0.0, 0.0, 0.0, 0.0, 0.0, 0.0, 0.0, 0.0, 0.0, 0.0, 0.0, 0.0, 0.0, 0.0, 0.0, 0.0, 0.0, 0.0, 0.0, 0.0, 0.0, 0.0, 0.0, 0.0, 0.0, 0.0, 0.0, 0.0, 0.0, 0.0, 0.0, 0.0, 0.0, 0.0, 0.0, 0.0, 0.0, 0.0, 0.0, 0.0, 0.0, 0.0, 0.0, 0.0, 0.0, 0.0, 0.0, 0.0, 0.0, 0.0, 0.0, 0.0, 0.0, 0.0, 0.0, 0.0, 0.0, 0.0, 0.0, 0.0, 0.0, 0.0, 0.0, 0.0, 0.0, 0.0, 0.0, 0.0, 0.0, 0.0, 0.0, 0.0, 0.0, 0.0, 0.0, 0.0, 0.0, 0.0, 0.0, 0.0, 0.0, 0.0, 0.0, 0.0, 0.0, 0.0, 0.0, 0.0, 0.0, 0.0, 0.0, 0.0, 0.0, 0.0, 0.0, 0.0, 0.0, 0.0, 0.0, 0.0, 0.0, 0.0, 0.0, 0.0, 0.0, 0.0, 0.0, 0.0, 0.0, 0.0, 0.0, 0.0, 0.0, 0.0, 0.0, 0.0, 0.0, 0.0, 0.0, 0.0, 0.0, 0.0, 0.0, 0.0, 0.0, 0.0, 0.0, 0.0, 0.0, 0.0, 0.0, 0.0, 0.0, 0.0, 0.0, 0.0, 0.0, 0.0, 0.0, 0.0, 0.0, 0.0, 0.0, 0.0, 0.0, 0.0, 0.0, 0.0, 0.0, 0.0, 0.0, 0.0, 0.0, 0.0, 0.0, 0.0, 0.0, 0.0, 0.0, 0.0, 0.0, 0.0, 0.0, 0.0, 0.0, 0.0, 0.0, 0.0, 0.0, 0.0, 0.0, 0.0, 0.0, 0.0, 0.0, 0.0, 0.0, 0.0, 0.0, 0.0, 0.0, 0.0, 0.0, 0.0, 0.0, 0.0, 0.0, 0.0, 0.0, 0.0, 0.0, 0.0, 0.0, 0.0, 0.0, 0.0, 0.0, 0.0, 0.0, 0.0, 0.0, 0.0, 0.0, 0.0, 0.0, 0.0, 0.0, 0.0, 0.0, 0.0, 0.0, 0.0, 0.0, 0.0, 0.0, 0.0, 0.0, 0.0, 0.0, 0.0, 0.0, 0.0, 0.0, 0.0, 0.0, 0.0, 0.0, 0.0, 0.0, 0.0, 0.0, 0.0, 0.0, 0.0, 0.0, 0.0, 0.0, 0.0, 0.0, 0.0, 0.0, 0.0, 0.0, 0.0, 0.0, 0.0, 0.0, 0.0, 0.0, 0.0, 0.0, 0.0, 0.0, 0.0, 0.0, 0.0, 0.0, 0.0, 0.0, 0.0, 0.0, 0.0, 0.0, 0.0, 0.0, 0.0, 0.0, 0.0, 0.0, 0.0, 0.0, 0.0, 0.0, 0.0, 0.0, 0.0, 0.0, 0.0, 0.0, 0.0, 0.0, 0.0, 0.0, 0.0, 0.0, 0.0, 0.0, 0.0, 0.0, 0.0, 0.0, 0.0, 0.0, 0.0, 0.0, 0.0, 0.0, 0.0, 0.0, 0.0, 0.0, 0.0, 0.0, 0.0, 0.0, 0.0, 0.0, 0.0, 0.0, 0.0, 0.0, 0.0, 0.0, 0.0, 0.0, 0.0, 0.0, 0.0, 0.0, 0.0, 0.0, 0.0, 0.0, 0.0, 0.0, 0.0, 0.0, 0.0, 0.0, 0.0, 0.0, 0.0, 0.0, 0.0, 0.0, 0.0, 0.0, 0.0, 0.0, 0.0, 0.0, 0.0, 0.0, 0.0, 0.0, 0.0, 0.0, 0.0, 0.0, 0.0, 0.0, 0.0, 0.0, 0.0, 0.0, 0.0, 0.0, 0.0, 0.0, 0.0, 0.0, 0.0, 0.0, 0.0, 0.0, 0.0, 0.0, 0.0, 0.0, 0.0, 0.0, 0.0, 0.0, 0.0, 0.0, 0.0, 0.0, 0.0, 0.0, 0.0, 0.0, 0.0, 0.0, 0.0, 0.0, 0.0, 0.0, 0.0, 0.0, 0.0, 0.0, 0.0, 0.0, 0.0, 0.0, 0.0, 0.0, 0.0, 0.0, 0.0, 0.0, 0.0, 0.0, 0.0, 0.0, 0.0, 0.0, 0.0, 0.0, 0.0, 0.0, 0.0, 0.0, 0.0, 0.0, 0.0, 0.0, 0.0, 0.0, 0.0, 0.0, 0.0, 0.0, 0.0, 0.0, 0.0, 0.0, 0.0, 0.0, 0.0, 0.0, 0.0, 0.0]
[Thread 1] Processed 100 zonotopes (Work Done: 0.0%; Expected Zonos: Inf)
[Thread 1] Processed 200 zonotopes (Work Done: 0.0%; Expected Zonos: Inf)
[Thread 1] Processed 300 zonotopes (Work Done: 0.0%; Expected Zonos: Inf)
[Thread 1] Processed 400 zonotopes (Work Done: 0.0%; Expected Zonos: Inf)
[Thread 1] Processed 500 zonotopes (Work Done: 0.0%; Expected Zonos: Inf)


TIMEOUT REACHED
UNKNOWN
[Thread 1] Total splits: 594
Processed 594 zonotopes (Work Done: 0.0%); Generated 1188 (0.20256423796296297s/loop)
[Thread 1] Finished in 120.32s
 ────────────────────────────────────────────────────────────────────────────────
                                        Time                    Allocations      
                               ───────────────────────   ────────────────────────
       Tot / % measured:             120s / 100.0%           62.5GiB / 100.0%    

 Section               ncalls     time    %tot     avg     alloc    %tot      avg
 ────────────────────────────────────────────────────────────────────────────────
 Verify                     1     120s  100.0%    120s   62.5GiB  100.0%  62.5GiB
   Zonotope Loop            1     120s  100.0%    120s   62.5GiB  100.0%  62.5GiB
     Zonotope Propa...    594    66.4s   55.1%   112ms   41.7GiB   66.7%  71.8MiB
       DiffZonotope...  1.78k    54.7s   45.5%  30.7ms   40.1GiB   64.1%  23.0MiB
         Zonotope_R...  3.56k    54.7s   45.4%  15.3ms   40.1GiB   64.1%  11.5MiB
           Influenc...  3.56k    53.8s   44.7%  15.1ms   36.9GiB   59.0%  10.6MiB
             Alloca...  3.56k    29.8s   24.7%  8.35ms   18.0GiB   28.9%  5.18MiB
             Multiply   3.56k    21.4s   17.7%  5.99ms   18.8GiB   30.1%  5.41MiB
             Set Ma...  3.56k    2.69s    2.2%   755μs     0.00B    0.0%    0.00B
           Column M...  3.56k    508ms    0.4%   143μs   1.59GiB    2.5%   468KiB
           Set Matrix   3.56k    206ms    0.2%  57.8μs   4.02MiB    0.0%  1.16KiB
           Allocation   3.56k    104ms    0.1%  29.1μs   1.59GiB    2.5%   468KiB
           Vectors      3.56k   17.9ms    0.0%  5.03μs   11.3MiB    0.0%  3.26KiB
           Bounds       3.56k   1.97ms    0.0%   553ns     0.00B    0.0%    0.00B
       DiffZonotope...  2.38k    11.6s    9.6%  4.88ms   1.58GiB    2.5%   699KiB
         Zonotope_D...  4.75k    11.6s    9.6%  2.44ms   1.58GiB    2.5%   350KiB
     Compute Split        594    28.0s   23.3%  47.2ms   9.13GiB   14.6%  15.7MiB
     Property Check       594    131ms    0.1%   221μs    125MiB    0.2%   215KiB
 Initialize                 1    520μs    0.0%   520μs   5.41MiB    0.0%  5.41MiB
 ────────────────────────────────────────────────────────────────────────────────
[VERYDIFF_TIMER] 120.354202145

[VERYDIFF_EXPERIMENT] Running on /home/i57/steuber/NeuroDiff/repos/VeryDiffExperiments/src/../benchmarks/mnist-prune/specs/mnist_97_global_6.vnnlib /home/i57/steuber/NeuroDiff/repos/VeryDiffExperiments/src/../benchmarks/mnist-prune/nets/mnist_relu_4_1024.onnx
Found input X
op: matmul, weight: (1024, 784), bias: nothing
op: bias, weight: nothing, bias: (1024,)
op: relu, weight: nothing, bias: nothing
op: matmul, weight: (1024, 1024), bias: nothing
op: bias, weight: nothing, bias: (1024,)
op: relu, weight: nothing, bias: nothing
op: matmul, weight: (1024, 1024), bias: nothing
op: bias, weight: nothing, bias: (1024,)
op: relu, weight: nothing, bias: nothing
op: matmul, weight: (10, 1024), bias: nothing
op: bias, weight: nothing, bias: (10,)
op: relu, weight: nothing, bias: nothing
op: matmul, weight: (10, 10), bias: nothing
op: bias, weight: nothing, bias: (10,)
Found input X
op: matmul, weight: (1024, 784), bias: nothing
op: bias, weight: nothing, bias: (1024,)
op: relu, weight: nothing, bias: nothing
op: matmul, weight: (1024, 1024), bias: nothing
op: bias, weight: nothing, bias: (1024,)
op: relu, weight: nothing, bias: nothing
op: matmul, weight: (1024, 1024), bias: nothing
op: bias, weight: nothing, bias: (1024,)
op: relu, weight: nothing, bias: nothing
op: matmul, weight: (10, 1024), bias: nothing
op: bias, weight: nothing, bias: (10,)
op: relu, weight: nothing, bias: nothing
op: matmul, weight: (10, 10), bias: nothing
op: bias, weight: nothing, bias: (10,)
Distance: 1266.8815759184893
Distance: 2876.6944248261216
Distance: 2831.8843567411013
Distance: 34.033756025192815
Distance: 0.0
Running with 1 threads
[Thread 1] Time to first task: 0.01s
Zono Bounds:
[0.0, 0.0, 0.0, 0.0, 0.0, 0.0, 0.0, 0.0, 0.0, 0.0, 0.0, 0.0, 0.0, 0.0, 0.0, 0.0, 0.0, 0.0, 0.0, 0.0, 0.0, 0.0, 0.0, 0.0, 0.0, 0.0, 0.0, 0.0, 0.0, 0.0, 0.0, 0.0, 0.0, 0.0, 0.0, 0.0, 0.0, 0.0, 0.0, 0.0, 0.0, 0.0, 0.0, 0.0, 0.0, 0.0, 0.0, 0.0, 0.0, 0.0, 0.0, 0.0, 0.0, 0.0, 0.0, 0.0, 0.0, 0.0, 0.0, 0.0, 0.0, 0.0, 0.0, 0.0, 0.0, 0.0, 0.0, 0.0, 0.0, 0.0, 0.0, 0.0, 0.0, 0.0, 0.0, 0.0, 0.0, 0.0, 0.0, 0.0, 0.0, 0.0, 0.0, 0.0, 0.0, 0.0, 0.0, 0.0, 0.0, 0.0, 0.0, 0.0, 0.0, 0.0, 0.0, 0.0, 0.0, 0.0, 0.0, 0.0, 0.0, 0.0, 0.0, 0.0, 0.0, 0.0, 0.0, 0.0, 0.0, 0.0, 0.0, 0.0, 0.0, 0.0, 0.0, 0.0, 0.0, 0.0, 0.0, 0.0, 0.0, 0.0, 0.0, 0.0, 0.0, 0.0, 0.0, 0.0, 0.0, 0.0, 0.0, 0.0, 0.0, 0.0, 0.0, 0.0, 0.0, 0.0, 0.0, 0.0, 0.0, 0.0, 0.0, 0.0, 0.0, 0.0, 0.0, 0.0, 0.0, 0.0, 0.0, 0.0, 0.0, 0.0, 0.0, 0.0, 0.0, 0.0, 0.0, 0.0, 0.0, 0.0, 0.0, 0.0, 0.0, 0.0, 0.0, 0.0, 0.0, 0.0, 0.0, 0.0, 0.0, 0.0, 0.0, 0.0, 0.0, 0.0, 0.0, 0.0, 0.0, 0.0, 0.0, 0.0, 0.0, 0.0, 0.0, 0.0, 0.0, 0.0, 0.0, 0.0, 0.0, 0.0, 0.0, 0.0, 0.0, 0.0, 0.0, 0.0, 0.0, 0.0, 0.0, 0.0, 0.0, 0.0, 0.0, 0.0, 0.0, 0.0, 0.0, 0.0, 0.0, 0.0, 0.0, 0.0, 0.0, 0.0, 0.0, 0.0, 0.0, 0.0, 0.0, 0.0, 0.0, 0.0, 0.0, 0.0, 0.0, 0.0, 0.0, 0.0, 0.0, 0.0, 0.0, 0.0, 0.0, 0.0, 0.0, 0.0, 0.0, 0.0, 0.0, 0.0, 0.0, 0.0, 0.0, 0.0, 0.0, 0.0, 0.0, 0.0, 0.0, 0.0, 0.0, 0.0, 0.0, 0.0, 0.0, 0.0, 0.0, 0.0, 0.0, 0.0, 0.0, 0.0, 0.0, 0.0, 0.0, 0.0, 0.0, 0.0, 0.0, 0.0, 0.0, 0.0, 0.0, 0.0, 0.0, 0.0, 0.0, 0.0, 0.0, 0.0, 0.0, 0.0, 0.0, 0.0, 0.0, 0.0, 0.0, 0.0, 0.0, 0.0, 0.0, 0.0, 0.0, 0.0, 0.0, 0.0, 0.0, 0.0, 0.0, 0.0, 0.0, 0.0, 0.0, 0.0, 0.0, 0.0, 0.0, 0.0, 0.0, 0.0, 0.0, 0.0, 0.0, 0.0, 0.0, 0.0, 0.0, 0.0, 0.0, 0.0, 0.0, 0.0, 0.0, 0.0, 0.0, 0.0, 0.0, 0.0, 0.0, 0.0, 0.0, 0.0, 0.0, 0.0, 0.0, 0.0, 0.0, 0.0, 0.0, 0.0, 0.0, 0.0, 0.0, 0.0, 0.0, 0.0, 0.0, 0.0, 0.0, 0.0, 0.0, 0.0, 0.0, 0.0, 0.0, 0.0, 0.0, 0.0, 0.0, 0.0, 0.0, 0.0, 0.0, 0.0, 0.0, 0.0, 0.0, 0.0, 0.0, 0.0, 0.0, 0.0, 0.0, 0.0, 0.0, 0.0, 0.0, 0.0, 0.0, 0.0, 0.0, 0.0, 0.0, 0.0, 0.0, 0.0, 0.0, 0.0, 0.0, 0.0, 0.0, 0.0, 0.0, 0.0, 0.0, 0.0, 0.0, 0.0, 0.0, 0.0, 0.0, 0.0, 0.0, 0.0, 0.0, 0.0, 0.0, 0.0, 0.0, 0.0, 0.0, 0.0, 0.0, 0.0, 0.0, 0.0, 0.0, 0.0, 0.0, 0.0, 0.0, 0.0, 0.0, 0.0, 0.0, 0.0, 0.0, 0.0, 0.0, 0.0, 0.0, 0.0, 0.0, 0.0, 0.0, 0.0, 0.0, 0.0, 0.0, 0.0, 0.0, 0.0, 0.0, 0.0, 0.0, 0.0, 0.0, 0.0, 0.0, 0.0, 0.0, 0.0, 0.0, 0.0, 0.0, 0.0, 0.0, 0.0, 0.0, 0.0, 0.0, 0.0, 0.0, 0.0, 0.0, 0.0, 0.0, 0.0, 0.0, 0.0, 0.0, 0.0, 0.0, 0.0, 0.0, 0.0, 0.0, 0.0, 0.0, 0.0, 0.0, 0.0, 0.0, 0.0, 0.0, 0.0, 0.0, 0.0, 0.0, 0.0, 0.0, 0.0, 0.0, 0.0, 0.0, 0.0, 0.0, 0.0, 0.0, 0.0, 0.0, 0.0, 0.0, 0.0, 0.0, 0.0, 0.0, 0.0, 0.0, 0.0, 0.0, 0.0, 0.0, 0.0, 0.0, 0.0, 0.0, 0.0, 0.0, 0.0, 0.0, 0.0, 0.0, 0.0, 0.0, 0.0, 0.0, 0.0, 0.0, 0.0, 0.0, 0.0, 0.0, 0.0, 0.0, 0.0, 0.0, 0.0, 0.0, 0.0, 0.0, 0.0, 0.0, 0.0, 0.0, 0.0, 0.0, 0.0, 0.0, 0.0, 0.0, 0.0, 0.0, 0.0, 0.0, 0.0, 0.0, 0.0, 0.0, 0.0, 0.0, 0.0, 0.0, 0.0, 0.0, 0.0, 0.0, 0.0, 0.0, 0.0, 0.0, 0.0, 0.0, 0.0, 0.0, 0.0, 0.0, 0.0, 0.0, 0.0, 0.0, 0.0, 0.0, 0.0, 0.0, 0.0, 0.0, 0.0, 0.0, 0.0, 0.0, 0.0, 0.0, 0.0, 0.0, 0.0, 0.0, 0.0, 0.0, 0.0, 0.0, 0.0, 0.0, 0.0, 0.0, 0.0, 0.0, 0.0, 0.0, 0.0, 0.0, 0.0, 0.0, 0.0, 0.0, 0.0, 0.0, 0.0, 0.0, 0.0, 0.0, 0.0, 0.0, 0.0, 0.0, 0.0, 0.0, 0.0, 0.0, 0.0, 0.0, 0.0, 0.0, 0.0, 0.0, 0.0, 0.0, 0.0, 0.0, 0.0, 0.0, 0.0, 0.0, 0.0, 0.0, 0.0, 0.0, 0.0, 0.0, 0.0, 0.0, 0.0, 0.0, 0.0, 0.0, 0.0, 0.0, 0.0, 0.0, 0.0, 0.0, 0.0, 0.0, 0.0, 0.0, 0.0, 0.0, 0.0, 0.0, 0.0, 0.0, 0.0, 0.0, 0.0, 0.0, 0.0, 0.0, 0.0, 0.0, 0.0, 0.0, 0.0, 0.0, 0.0, 0.0, 0.0, 0.0, 0.0, 0.0, 0.0, 0.0, 0.0, 0.0, 0.0, 0.0, 0.0, 0.0, 0.0, 0.0, 0.0, 0.0, 0.0, 0.0, 0.0, 0.0, 0.0, 0.0, 0.0, 0.0, 0.0, 0.0, 0.0, 0.0, 0.0, 0.0, 0.0, 0.0, 0.0, 0.0, 0.0, 0.0, 0.0, 0.0, 0.0, 0.0, 0.0, 0.0, 0.0, 0.0, 0.0, 0.0, 0.0, 0.0, 0.0, 0.0, 0.0, 0.0, 0.0, 0.0, 0.0, 0.0, 0.0, 0.0, 0.0, 0.0, 0.0, 0.0, 0.0, 0.0, 0.0, 0.0, 0.0, 0.0, 0.0, 0.0, 0.0, 0.0, 0.0, 0.0, 0.0, 0.0, 0.0, 0.0, 0.0, 0.0, 0.0, 0.0, 0.0, 0.0, 0.0, 0.0, 0.0, 0.0, 0.0, 0.0, 0.0, 0.0, 0.0, 0.0, 0.0]
[0.0, 0.0, 0.0, 0.0, 0.0, 0.0, 0.0, 0.0, 0.0, 0.0, 0.0, 0.0, 0.0, 0.0, 0.0, 0.0, 0.0, 0.0, 0.0, 0.0, 0.0, 0.0, 0.0, 0.0, 0.0, 0.0, 0.0, 0.0, 0.0, 0.0, 0.0, 0.0, 0.0, 0.0, 0.0, 0.0, 0.0, 0.0, 0.0, 0.0, 0.0, 0.0, 0.0, 0.0, 0.0, 0.0, 0.0, 0.0, 0.0, 0.0, 0.0, 0.0, 0.0, 0.0, 0.0, 0.0, 0.0, 0.0, 0.0, 0.0, 0.0, 0.0, 0.0, 0.0, 0.0, 0.0, 0.0, 0.0, 0.0, 0.0, 0.0, 0.0, 0.0, 0.0, 0.0, 0.0, 0.0, 0.0, 0.0, 0.0, 0.0, 0.0, 0.0, 0.0, 0.0, 0.0, 0.0, 0.0, 0.0, 0.0, 0.0, 0.0, 0.0, 0.0, 0.0, 0.0, 0.0, 0.0, 0.0, 0.0, 0.0, 0.0, 0.0, 0.0, 0.0, 0.0, 0.0, 0.0, 0.0, 0.0, 0.0, 0.0, 0.0, 0.0, 0.0, 0.0, 0.0, 0.0, 0.0, 0.0, 0.0, 0.0, 0.0, 0.0, 0.0, 0.0, 0.0, 0.0, 0.0, 0.0, 0.0, 0.0, 0.0, 0.0, 0.0, 0.0, 0.0, 0.0, 0.0, 0.0, 0.0, 0.0, 0.0, 0.0, 0.0, 0.0, 0.0, 0.0, 0.0, 0.0, 0.0, 0.0, 0.0, 0.0, 0.0, 0.0, 0.0, 0.0, 0.0, 0.0, 0.0, 0.0, 0.0, 0.0, 0.0, 0.0, 0.0, 0.0, 0.0, 0.0, 0.0, 0.0, 0.0, 0.0, 0.0, 0.0, 0.0, 0.0, 0.0, 0.0, 0.0, 0.0, 0.0, 0.0, 0.0, 0.0, 0.0, 0.0, 0.0, 0.0, 0.0, 0.0, 0.0, 0.0, 0.0, 0.0, 0.0, 0.0, 0.0, 0.0, 0.0, 0.0, 0.0, 0.0, 0.0, 0.0, 0.0, 0.0, 0.0, 0.0, 0.0, 0.0, 0.0, 0.0, 0.0, 0.0, 0.0, 0.0, 0.0, 0.0, 0.0, 0.0, 0.0, 0.0, 0.0, 0.0, 0.0, 0.0, 0.0, 0.0, 0.0, 0.0, 0.0, 0.0, 0.0, 0.0, 0.0, 0.0, 0.0, 0.0, 0.0, 0.0, 0.0, 0.0, 0.0, 0.0, 0.0, 0.0, 0.0, 0.0, 0.0, 0.0, 0.0, 0.0, 0.0, 0.0, 0.0, 0.0, 0.0, 0.0, 0.0, 0.0, 0.0, 0.0, 0.0, 0.0, 0.0, 0.0, 0.0, 0.0, 0.0, 0.0, 0.0, 0.0, 0.0, 0.0, 0.0, 0.0, 0.0, 0.0, 0.0, 0.0, 0.0, 0.0, 0.0, 0.0, 0.0, 0.0, 0.0, 0.0, 0.0, 0.0, 0.0, 0.0, 0.0, 0.0, 0.0, 0.0, 0.0, 0.0, 0.0, 0.0, 0.0, 0.0, 0.0, 0.0, 0.0, 0.0, 0.0, 0.0, 0.0, 0.0, 0.0, 0.0, 0.0, 0.0, 0.0, 0.0, 0.0, 0.0, 0.0, 0.0, 0.0, 0.0, 0.0, 0.0, 0.0, 0.0, 0.0, 0.0, 0.0, 0.0, 0.0, 0.0, 0.0, 0.0, 0.0, 0.0, 0.0, 0.0, 0.0, 0.0, 0.0, 0.0, 0.0, 0.0, 0.0, 0.0, 0.0, 0.0, 0.0, 0.0, 0.0, 0.0, 0.0, 0.0, 0.0, 0.0, 0.0, 0.0, 0.0, 0.0, 0.0, 0.0, 0.0, 0.0, 0.0, 0.0, 0.0, 0.0, 0.0, 0.0, 0.0, 0.0, 0.0, 0.0, 0.0, 0.0, 0.0, 0.0, 0.0, 0.0, 0.0, 0.0, 0.0, 0.0, 0.0, 0.0, 0.0, 0.0, 0.0, 0.0, 0.0, 0.0, 0.0, 0.0, 0.0, 0.0, 0.0, 0.0, 0.0, 0.0, 0.0, 0.0, 0.0, 0.0, 0.0, 0.0, 0.0, 0.0, 0.0, 0.0, 0.0, 0.0, 0.0, 0.0, 0.0, 0.0, 0.0, 0.0, 0.0, 0.0, 0.0, 0.0, 0.0, 0.0, 0.0, 0.0, 0.0, 0.0, 0.0, 0.0, 0.0, 0.0, 0.0, 0.0, 0.0, 0.0, 0.0, 0.0, 0.0, 0.0, 0.0, 0.0, 0.0, 0.0, 0.0, 0.0, 0.0, 0.0, 0.0, 0.0, 0.0, 0.0, 0.0, 0.0, 0.0, 0.0, 0.0, 0.0, 0.0, 0.0, 0.0, 0.0, 0.0, 0.0, 0.0, 0.0, 0.0, 0.0, 0.0, 0.0, 0.0, 0.0, 0.0, 0.0, 0.0, 0.0, 0.0, 0.0, 0.0, 0.0, 0.0, 0.0, 0.0, 0.0, 0.0, 0.0, 0.0, 0.0, 0.0, 0.0, 0.0, 0.0, 0.0, 0.0, 0.0, 0.0, 0.0, 0.0, 0.0, 0.0, 0.0, 0.0, 0.0, 0.0, 0.0, 0.0, 0.0, 0.0, 0.0, 0.0, 0.0, 0.0, 0.0, 0.0, 0.0, 0.0, 0.0, 0.0, 0.0, 0.0, 0.0, 0.0, 0.0, 0.0, 0.0, 0.0, 0.0, 0.0, 0.0, 0.0, 0.0, 0.0, 0.0, 0.0, 0.0, 0.0, 0.0, 0.0, 0.0, 0.0, 0.0, 0.0, 0.0, 0.0, 0.0, 0.0, 0.0, 0.0, 0.0, 0.0, 0.0, 0.0, 0.0, 0.0, 0.0, 0.0, 0.0, 0.0, 0.0, 0.0, 0.0, 0.0, 0.0, 0.0, 0.0, 0.0, 0.0, 0.0, 0.0, 0.0, 0.0, 0.0, 0.0, 0.0, 0.0, 0.0, 0.0, 0.0, 0.0, 0.0, 0.0, 0.0, 0.0, 0.0, 0.0, 0.0, 0.0, 0.0, 0.0, 0.0, 0.0, 0.0, 0.0, 0.0, 0.0, 0.0, 0.0, 0.0, 0.0, 0.0, 0.0, 0.0, 0.0, 0.0, 0.0, 0.0, 0.0, 0.0, 0.0, 0.0, 0.0, 0.0, 0.0, 0.0, 0.0, 0.0, 0.0, 0.0, 0.0, 0.0, 0.0, 0.0, 0.0, 0.0, 0.0, 0.0, 0.0, 0.0, 0.0, 0.0, 0.0, 0.0, 0.0, 0.0, 0.0, 0.0, 0.0, 0.0, 0.0, 0.0, 0.0, 0.0, 0.0, 0.0, 0.0, 0.0, 0.0, 0.0, 0.0, 0.0, 0.0, 0.0, 0.0, 0.0, 0.0, 0.0, 0.0, 0.0, 0.0, 0.0, 0.0, 0.0, 0.0, 0.0, 0.0, 0.0, 0.0, 0.0, 0.0, 0.0, 0.0, 0.0, 0.0, 0.0, 0.0, 0.0, 0.0, 0.0, 0.0, 0.0, 0.0, 0.0, 0.0, 0.0, 0.0, 0.0, 0.0, 0.0, 0.0, 0.0, 0.0, 0.0, 0.0, 0.0, 0.0, 0.0, 0.0, 0.0, 0.0, 0.0, 0.0, 0.0, 0.0, 0.0, 0.0, 0.0, 0.0, 0.0, 0.0, 0.0, 0.0, 0.0, 0.0, 0.0, 0.0, 0.0, 0.0, 0.0, 0.0, 0.0, 0.0, 0.0, 0.0, 0.0, 0.0, 0.0, 0.0, 0.0, 0.0, 0.0, 0.0, 0.0, 0.0, 0.0, 0.0, 0.0, 0.0, 0.0, 0.0, 0.0, 0.0, 0.0, 0.0, 0.0, 0.0, 0.0, 0.0, 0.0, 0.0, 0.0, 0.0, 0.0, 0.0, 0.0, 0.0, 0.0, 0.0, 0.0, 0.0, 0.0, 0.0, 0.0, 0.0, 0.0, 0.0, 0.0, 0.0, 0.0, 0.0, 0.0, 0.0, 0.0, 0.0, 0.0, 0.0, 0.0, 0.0, 0.0, 0.0, 0.0, 0.0, 0.0]

Found counterexample: ([0.011764705, 0.011764705, 0.011764705, 0.011764705, 0.011764705, 0.011764705, 0.011764705, 0.011764705, 0.011764705, 0.011764705, 0.011764705, 0.011764705, 0.011764705, 0.011764705, 0.011764705, 0.011764705, 0.011764705, 0.011764705, 0.011764705, 0.011764705, 0.011764705, 0.011764705, 0.011764705, 0.011764705, 0.011764705, 0.011764705, 0.011764705, 0.011764705, 0.011764705, 0.011764705, 0.011764705, 0.011764705, 0.011764705, 0.011764705, 0.011764705, 0.011764705, 0.011764705, 0.011764705, 0.011764705, 0.011764705, 0.011764705, 0.011764705, 0.011764705, 0.011764705, 0.011764705, 0.011764705, 0.011764705, 0.011764705, 0.011764705, 0.011764705, 0.011764705, 0.011764705, 0.011764705, 0.011764705, 0.011764705, 0.011764705, 0.011764705, 0.011764705, 0.011764705, 0.011764705, 0.011764705, 0.011764705, 0.011764705, 0.011764705, 0.011764705, 0.011764705, 0.011764705, 0.011764705, 0.011764705, 0.011764705, 0.011764705, 0.011764705, 0.011764705, 0.011764705, 0.011764705, 0.011764705, 0.011764705, 0.011764705, 0.011764705, 0.011764705, 0.011764705, 0.011764705, 0.011764705, 0.011764705, 0.011764705, 0.011764705, 0.011764705, 0.011764705, 0.011764705, 0.011764705, 0.011764705, 0.011764705, 0.011764705, 0.011764705, 0.011764705, 0.011764705, 0.011764705, 0.011764705, 0.011764705, 0.011764705, 0.011764705, 0.011764705, 0.011764705, 0.011764705, 0.011764705, 0.011764705, 0.011764705, 0.011764705, 0.011764705, 0.011764705, 0.011764705, 0.011764705, 0.011764705, 0.011764705, 0.011764705, 0.011764705, 0.011764705, 0.011764705, 0.011764705, 0.011764705, 0.011764705, 0.011764705, 0.011764705, 0.011764705, 0.011764705, 0.011764705, 0.011764705, 0.011764705, 0.011764705, 0.011764705, 0.011764705, 0.011764705, 0.011764705, 0.011764705, 0.011764705, 0.011764705, 0.011764705, 0.011764705, 0.011764705, 0.011764705, 0.011764705, 0.011764705, 0.011764705, 0.011764705, 0.011764705, 0.011764705, 0.011764705, 0.011764705, 0.011764705, 0.011764705, 0.011764705, 0.011764705, 0.011764705, 0.011764705, 0.011764705, 0.011764705, 0.011764705, 0.011764705, 0.011764705, 0.011764705, 0.011764705, 0.011764705, 0.011764705, 0.011764705, 0.011764705, 0.011764705, 0.011764705, 0.011764705, 0.011764705, 0.011764705, 0.011764705, 0.011764705, 0.011764705, 0.011764705, 0.011764705, 0.10588235500000001, 0.53333336, 0.22352941, 0.070588235, 0.070588235, 0.070588235, 0.070588235, 0.070588235, 0.14901961, 0.53333336, 0.17647059, 0.01764706, 0.011764705, 0.011764705, 0.011764705, 0.011764705, 0.011764705, 0.011764705, 0.011764705, 0.011764705, 0.011764705, 0.011764705, 0.011764705, 0.011764705, 0.011764705, 0.011764705, 0.011764705, 0.011764705, 0.98627451, 0.984313725, 0.984313725, 0.984313725, 0.984313725, 0.984313725, 0.984313725, 0.984313725, 0.984313725, 0.984313725, 0.984313725, 0.16078432, 0.011764705, 0.011764705, 0.011764705, 0.011764705, 0.011764705, 0.011764705, 0.011764705, 0.011764705, 0.011764705, 0.011764705, 0.011764705, 0.011764705, 0.011764705, 0.011764705, 0.011764705, 0.011764705, 0.988235295, 0.984313725, 0.984313725, 0.984313725, 0.984313725, 0.984313725, 0.984313725, 0.984313725, 0.984313725, 0.984313725, 0.984313725, 0.16078432, 0.011764705, 0.011764705, 0.011764705, 0.011764705, 0.011764705, 0.011764705, 0.011764705, 0.011764705, 0.011764705, 0.011764705, 0.011764705, 0.011764705, 0.011764705, 0.011764705, 0.011764705, 0.011764705, 0.28627452, 0.71372551, 0.6156863, 0.25490197000000003, 0.63137257, 0.8313725599999999, 0.984313725, 0.984313725, 0.984313725, 0.984313725, 0.90980393, 0.117647065, 0.011764705, 0.011764705, 0.011764705, 0.011764705, 0.011764705, 0.011764705, 0.011764705, 0.011764705, 0.011764705, 0.011764705, 0.011764705, 0.011764705, 0.011764705, 0.011764705, 0.011764705, 0.011764705, 0.011764705, 0.011764705, 0.011764705, 0.011764705, 0.011764705, 0.22352941, 0.97254902, 0.984313725, 0.984313725, 0.913725495, 0.23529412500000002, 0.011764705, 0.011764705, 0.011764705, 0.011764705, 0.011764705, 0.011764705, 0.011764705, 0.011764705, 0.011764705, 0.011764705, 0.011764705, 0.011764705, 0.011764705, 0.011764705, 0.011764705, 0.011764705, 0.011764705, 0.011764705, 0.011764705, 0.011764705, 0.011764705, 0.011764705, 0.047058825, 0.95686275, 0.984313725, 0.984313725, 0.9686274500000001, 0.20392157, 0.011764705, 0.011764705, 0.011764705, 0.011764705, 0.011764705, 0.011764705, 0.011764705, 0.011764705, 0.011764705, 0.011764705, 0.011764705, 0.011764705, 0.011764705, 0.011764705, 0.011764705, 0.011764705, 0.011764705, 0.011764705, 0.011764705, 0.011764705, 0.011764705, 0.011764705, 0.011764705, 0.73333335, 0.984313725, 0.984313725, 0.76078433, 0.01764706, 0.011764705, 0.011764705, 0.011764705, 0.011764705, 0.011764705, 0.011764705, 0.011764705, 0.011764705, 0.011764705, 0.011764705, 0.011764705, 0.011764705, 0.011764705, 0.011764705, 0.011764705, 0.011764705, 0.011764705, 0.011764705, 0.019607845, 0.09411765, 0.44313726, 0.55686277, 0.55686277, 0.97647059, 0.984313725, 0.984313725, 0.36470589, 0.09411765, 0.09411765, 0.09411765, 0.09411765, 0.09411765, 0.09411765, 0.09411765, 0.09411765, 0.09411765, 0.050980395, 0.011764705, 0.011764705, 0.011764705, 0.011764705, 0.011764705, 0.011764705, 0.011764705, 0.011764705, 0.011764705, 0.117647065, 0.94117647, 0.984313725, 0.984313725, 0.984313725, 0.984313725, 0.984313725, 0.984313725, 0.984313725, 0.984313725, 0.984313725, 0.984313725, 0.984313725, 0.984313725, 0.984313725, 0.984313725, 0.984313725, 0.92941177, 0.6588235499999999, 0.011764705, 0.011764705, 0.011764705, 0.011764705, 0.011764705, 0.011764705, 0.011764705, 0.011764705, 0.011764705, 0.011764705, 0.20392157, 0.43137254999999997, 0.84313726, 0.984313725, 0.984313725, 0.984313725, 0.984313725, 0.984313725, 0.984313725, 0.984313725, 0.984313725, 0.984313725, 0.984313725, 0.84313726, 0.76078433, 0.60784316, 0.18039216, 0.011764705, 0.011764705, 0.011764705, 0.011764705, 0.011764705, 0.011764705, 0.011764705, 0.011764705, 0.011764705, 0.011764705, 0.011764705, 0.011764705, 0.011764705, 0.34901962, 0.984313725, 0.984313725, 0.984313725, 0.94509804, 0.90196079, 0.76078433, 0.6901961, 0.27058824000000004, 0.23137256, 0.23137256, 0.08235294, 0.011764705, 0.011764705, 0.011764705, 0.011764705, 0.011764705, 0.011764705, 0.011764705, 0.011764705, 0.011764705, 0.011764705, 0.011764705, 0.011764705, 0.011764705, 0.011764705, 0.011764705, 0.011764705, 0.34901962, 0.984313725, 0.984313725, 0.984313725, 0.65490198, 0.11372549500000001, 0.03921569, 0.011764705, 0.011764705, 0.011764705, 0.011764705, 0.011764705, 0.011764705, 0.011764705, 0.011764705, 0.011764705, 0.011764705, 0.011764705, 0.011764705, 0.011764705, 0.011764705, 0.011764705, 0.011764705, 0.011764705, 0.011764705, 0.011764705, 0.011764705, 0.011764705, 0.34901962, 0.984313725, 0.984313725, 0.984313725, 0.36862746, 0.011764705, 0.011764705, 0.011764705, 0.011764705, 0.011764705, 0.011764705, 0.011764705, 0.011764705, 0.011764705, 0.011764705, 0.011764705, 0.011764705, 0.011764705, 0.011764705, 0.011764705, 0.011764705, 0.011764705, 0.011764705, 0.011764705, 0.011764705, 0.011764705, 0.011764705, 0.011764705, 0.34901962, 0.984313725, 0.984313725, 0.90196079, 0.015686275, 0.011764705, 0.011764705, 0.011764705, 0.011764705, 0.011764705, 0.011764705, 0.011764705, 0.011764705, 0.011764705, 0.011764705, 0.011764705, 0.011764705, 0.011764705, 0.011764705, 0.011764705, 0.011764705, 0.011764705, 0.011764705, 0.011764705, 0.011764705, 0.011764705, 0.011764705, 0.011764705, 0.34901962, 0.984313725, 0.984313725, 0.95294118, 0.21568628, 0.011764705, 0.011764705, 0.011764705, 0.011764705, 0.011764705, 0.011764705, 0.011764705, 0.011764705, 0.011764705, 0.011764705, 0.011764705, 0.011764705, 0.011764705, 0.011764705, 0.011764705, 0.011764705, 0.011764705, 0.011764705, 0.011764705, 0.011764705, 0.011764705, 0.011764705, 0.011764705, 0.34901962, 0.984313725, 0.984313725, 0.984313725, 0.36862746, 0.011764705, 0.011764705, 0.011764705, 0.011764705, 0.011764705, 0.011764705, 0.011764705, 0.011764705, 0.011764705, 0.011764705, 0.011764705, 0.011764705, 0.011764705, 0.011764705, 0.011764705, 0.011764705, 0.011764705, 0.011764705, 0.011764705, 0.011764705, 0.011764705, 0.011764705, 0.011764705, 0.34901962, 0.984313725, 0.984313725, 0.984313725, 0.36862746, 0.011764705, 0.011764705, 0.011764705, 0.011764705, 0.011764705, 0.011764705, 0.011764705, 0.011764705, 0.011764705, 0.011764705, 0.011764705, 0.011764705, 0.011764705, 0.011764705, 0.011764705, 0.011764705, 0.011764705, 0.011764705, 0.011764705, 0.011764705, 0.011764705, 0.011764705, 0.011764705, 0.34901962, 0.984313725, 0.984313725, 0.91764706, 0.078431375, 0.011764705, 0.011764705, 0.011764705, 0.011764705, 0.011764705, 0.011764705, 0.011764705, 0.011764705, 0.011764705, 0.011764705, 0.011764705, 0.011764705, 0.011764705, 0.011764705, 0.011764705, 0.011764705, 0.011764705, 0.011764705, 0.011764705, 0.011764705, 0.011764705, 0.011764705, 0.011764705, 0.34901962, 0.984313725, 0.984313725, 0.90196079, 0.011764705, 0.011764705, 0.011764705, 0.011764705, 0.011764705, 0.011764705, 0.011764705, 0.011764705, 0.011764705, 0.011764705, 0.011764705, 0.011764705, 0.011764705, 0.011764705, 0.011764705, 0.011764705, 0.011764705, 0.011764705, 0.011764705, 0.011764705, 0.011764705, 0.011764705, 0.011764705, 0.011764705, 0.02352941, 0.47843138500000004, 0.5294117899999999, 0.266666675, 0.011764705, 0.011764705, 0.011764705, 0.011764705, 0.011764705, 0.011764705, 0.011764705, 0.011764705, 0.011764705, 0.011764705, 0.011764705, 0.011764705, 0.011764705, 0.011764705, 0.011764705, 0.011764705, 0.011764705, 0.011764705, 0.011764705, 0.011764705, 0.011764705, 0.011764705, 0.011764705, 0.011764705, 0.011764705, 0.011764705, 0.011764705, 0.011764705, 0.011764705, 0.011764705, 0.011764705, 0.011764705, 0.011764705, 0.011764705, 0.011764705, 0.011764705, 0.011764705, 0.011764705, 0.011764705, 0.011764705, 0.011764705, 0.011764705, 0.011764705, 0.011764705, 0.011764705, 0.011764705, 0.011764705, 0.011764705, 0.011764705, 0.011764705, 0.011764705, 0.011764705, 0.011764705, 0.011764705, 0.011764705, 0.011764705, 0.011764705, 0.011764705, 0.011764705, 0.011764705, 0.011764705, 0.011764705, 0.011764705, 0.011764705, 0.011764705, 0.011764705, 0.011764705, 0.011764705, 0.011764705], ([0.0, 14.658076760349456, 3.6635271193499404, 13.06691696937636, 2.412581458648905, 0.0, 0.0, 38.73593707631951, 0.0, 0.0], [0.0, 11.239923531798969, 3.071920276600224, 12.244736777900938, 0.5894545563109843, 0.0, 0.0, 31.828540087508223, 0.0, 0.0], 6.907396988811286))
[Thread 1] Total splits: 0
Processed 1 zonotopes (Work Done: 0.0%); Generated 0 (1.748239185s/loop)
[Thread 1] Finished in 1.75s
 ────────────────────────────────────────────────────────────────────────────────
                                        Time                    Allocations      
                               ───────────────────────   ────────────────────────
       Tot / % measured:            1.77s / 100.0%            569MiB / 100.0%    

 Section               ncalls     time    %tot     avg     alloc    %tot      avg
 ────────────────────────────────────────────────────────────────────────────────
 Verify                     1    1.75s   98.7%   1.75s    542MiB   95.3%   542MiB
   Zonotope Loop            1    1.75s   98.7%   1.75s    542MiB   95.3%   542MiB
     Zonotope Propa...      1    1.73s   97.4%   1.73s    520MiB   91.4%   520MiB
       DiffZonotope...      4    1.04s   58.8%   260ms    458MiB   80.5%   114MiB
         Zonotope_R...      8    1.04s   58.5%   130ms    457MiB   80.4%  57.2MiB
           Influenc...      8    813ms   45.9%   102ms    266MiB   46.7%  33.2MiB
             Multiply       8    751ms   42.4%  93.9ms    157MiB   27.7%  19.7MiB
             Alloca...      8   45.8ms    2.6%  5.73ms    108MiB   19.0%  13.5MiB
             Set Ma...      8   16.6ms    0.9%  2.07ms     0.00B    0.0%    0.00B
           Column M...      8    124ms    7.0%  15.5ms   95.7MiB   16.8%  12.0MiB
           Allocation       8   81.4ms    4.6%  10.2ms   95.7MiB   16.8%  12.0MiB
           Set Matrix       8   17.1ms    1.0%  2.14ms    112KiB    0.0%  13.9KiB
           Vectors          8    227μs    0.0%  28.3μs    272KiB    0.0%  34.0KiB
           Bounds           8   5.88μs    0.0%   735ns     0.00B    0.0%    0.00B
       DiffZonotope...      5    685ms   38.7%   137ms   62.3MiB   11.0%  12.5MiB
         Zonotope_D...     10    685ms   38.7%  68.5ms   62.3MiB   11.0%  6.23MiB
     Property Check         1   7.34ms    0.4%  7.34ms    822KiB    0.1%   822KiB
 Initialize                 1   22.6ms    1.3%  22.6ms   27.0MiB    4.7%  27.0MiB
 ────────────────────────────────────────────────────────────────────────────────
[VERYDIFF_TIMER] 1.884377411

[VERYDIFF_EXPERIMENT] NETWORK: /home/i57/steuber/NeuroDiff/repos/VeryDiffExperiments/src/../benchmarks/mnist-prune/specs/mnist_97_global_6.vnnlib
[VERYDIFF_EXPERIMENT] TIME: 123.57082076
