
[VERYDIFF_EXPERIMENT] Running on /home/i57/steuber/NeuroDiff/repos/VeryDiffExperiments/src/../benchmarks/mnist-prune/specs/mnist_99_global_6.vnnlib /home/i57/steuber/NeuroDiff/repos/VeryDiffExperiments/src/../benchmarks/mnist-prune/nets/mnist_relu_3_100.onnx
Found input X
op: matmul, weight: (100, 784), bias: nothing
op: bias, weight: nothing, bias: (100,)
op: relu, weight: nothing, bias: nothing
op: matmul, weight: (100, 100), bias: nothing
op: bias, weight: nothing, bias: (100,)
op: relu, weight: nothing, bias: nothing
op: matmul, weight: (10, 100), bias: nothing
op: bias, weight: nothing, bias: (10,)
op: relu, weight: nothing, bias: nothing
op: matmul, weight: (10, 10), bias: nothing
op: bias, weight: nothing, bias: (10,)
Found input X
op: gemm, weight: (100, 784), bias: (100,)
op: relu, weight: nothing, bias: nothing
op: gemm, weight: (100, 100), bias: (100,)
op: relu, weight: nothing, bias: nothing
op: gemm, weight: (10, 100), bias: (10,)
op: relu, weight: nothing, bias: nothing
op: gemm, weight: (10, 10), bias: (10,)
Distance: 1958.4889029213523
Distance: 144.28197153992141
Distance: 22.063573056613677
Distance: 0.8412832540489035
Running with 1 threads
[Thread 1] Time to first task: 0.0s
Instable Generators: 34
Instable Generators: 51
Instable Generators: 6
Zono Bounds:
[-0.028520770704068558, 0.01285278707551334, -6.144143283813632, -6.181764229900407, -7.520194101607544, -6.314970498334727, -0.012721012458963172, -7.6139819644365945, -6.398845289125185, -6.180755318782848]
[-0.0072684464732612995, 0.04404870511925198, 6.225840812909629, 5.289520930290214, 7.731412029139527, 6.306845539347874, 0.003124648993053864, 6.832515421951098, 6.599430353639145, 5.757863287066246]
[Thread 1] Processed 100 zonotopes (Work Done: 0.0%; Expected Zonos: Inf)
[Thread 1] Processed 200 zonotopes (Work Done: 0.0%; Expected Zonos: Inf)
[Thread 1] Processed 300 zonotopes (Work Done: 0.0%; Expected Zonos: Inf)
[Thread 1] Processed 400 zonotopes (Work Done: 0.0%; Expected Zonos: Inf)
[Thread 1] Processed 500 zonotopes (Work Done: 0.0%; Expected Zonos: Inf)


TIMEOUT REACHED
UNKNOWN
[Thread 1] Total splits: 569
Processed 569 zonotopes (Work Done: 0.0%); Generated 1138 (0.2109948689841828s/loop)
[Thread 1] Finished in 120.06s
 ────────────────────────────────────────────────────────────────────────────────
                                        Time                    Allocations      
                               ───────────────────────   ────────────────────────
       Tot / % measured:             120s / 100.0%           60.7GiB / 100.0%    

 Section               ncalls     time    %tot     avg     alloc    %tot      avg
 ────────────────────────────────────────────────────────────────────────────────
 Verify                     1     120s  100.0%    120s   60.7GiB  100.0%  60.7GiB
   Zonotope Loop            1     120s  100.0%    120s   60.7GiB  100.0%  60.7GiB
     Zonotope Propa...    569    90.2s   75.1%   158ms   40.9GiB   67.4%  73.6MiB
       DiffZonotope...  1.71k    80.2s   66.8%  47.0ms   38.6GiB   63.6%  23.1MiB
         Zonotope_R...  3.41k    79.5s   66.2%  23.3ms   37.6GiB   62.0%  11.3MiB
           Influenc...  3.41k    72.9s   60.7%  21.4ms   34.6GiB   57.0%  10.4MiB
             Multiply   3.41k    39.9s   33.2%  11.7ms   17.6GiB   29.0%  5.28MiB
             Alloca...  3.41k    30.5s   25.4%  8.95ms   17.0GiB   28.0%  5.10MiB
             Set Ma...  3.41k    2.46s    2.1%   722μs     0.00B    0.0%    0.00B
           Column M...  3.41k    6.23s    5.2%  1.82ms   1.50GiB    2.5%   461KiB
           Set Matrix   3.41k    190ms    0.2%  55.7μs   3.37MiB    0.0%  1.01KiB
           Allocation   3.41k   90.0ms    0.1%  26.4μs   1.50GiB    2.5%   461KiB
           Vectors      3.41k   18.8ms    0.0%  5.52μs   10.9MiB    0.0%  3.26KiB
           Bounds       3.41k   2.57ms    0.0%   752ns     0.00B    0.0%    0.00B
       DiffZonotope...  2.28k    10.0s    8.3%  4.39ms   2.31GiB    3.8%  1.04MiB
         Zonotope_D...  4.55k    4.83s    4.0%  1.06ms   1.51GiB    2.5%   348KiB
     Compute Split        569    27.7s   23.0%  48.6ms   8.61GiB   14.2%  15.5MiB
     Property Check       569    112ms    0.1%   196μs    118MiB    0.2%   212KiB
 Initialize                 1    580μs    0.0%   580μs   5.41MiB    0.0%  5.41MiB
 ────────────────────────────────────────────────────────────────────────────────
[VERYDIFF_TIMER] 120.100196977

[VERYDIFF_EXPERIMENT] NETWORK: /home/i57/steuber/NeuroDiff/repos/VeryDiffExperiments/src/../benchmarks/mnist-prune/specs/mnist_99_global_6.vnnlib
[VERYDIFF_EXPERIMENT] TIME: 120.569381279
