
[VERYDIFF_EXPERIMENT] Running on /home/i57/steuber/NeuroDiff/repos/VeryDiffExperiments/src/../benchmarks/mnist-prune/specs/mnist_83_global_4.vnnlib /home/i57/steuber/NeuroDiff/repos/VeryDiffExperiments/src/../benchmarks/mnist-prune/nets/mnist_relu_3_100.onnx
Total difference: 419.1098
Average difference: 0.0047
Initial output delta:
[-0.839185 -0.852403 -0.796606 -0.931987 -0.997172 -0.896634 -0.001131 -0.995608 -0.829751 -0.880014 ]
[0.766478 0.845563 0.867654 0.891909 0.950452 0.929071 0.000649 0.937135 0.925891 0.832997 ]

No adv!
time: 0.127651 


numSplits: 0
setenv(`timeout -k 5 120 ../NeuroDiff/DiffNN-Code/delta_network_test 483 /home/i57/steuber/NeuroDiff/repos/VeryDiffExperiments/src/../benchmarks/mnist-prune/nets/mnist_relu_3_100.nnet /home/i57/steuber/NeuroDiff/repos/VeryDiffExperiments/src/../benchmarks/mnist-prune/nets_pruned/mnist_relu_3_100_0.79_adam_1_stepsize.nnet 1.0 -p 4`,["OMP_NUM_THREADS=1"])
[VERYDIFF_TIMER] 0.174731411

[VERYDIFF_EXPERIMENT] NETWORK: /home/i57/steuber/NeuroDiff/repos/VeryDiffExperiments/src/../benchmarks/mnist-prune/specs/mnist_83_global_4.vnnlib
[VERYDIFF_EXPERIMENT] TIME: 0.525746709
