
[VERYDIFF_EXPERIMENT] Running on /home/i57/steuber/NeuroDiff/repos/VeryDiffExperiments/src/../benchmarks/mnist-prune/specs/mnist_90_local_24.vnnlib /home/i57/steuber/NeuroDiff/repos/VeryDiffExperiments/src/../benchmarks/mnist-prune/nets/mnist_relu_3_100.onnx
Found input X
op: matmul, weight: (100, 784), bias: nothing
op: bias, weight: nothing, bias: (100,)
op: relu, weight: nothing, bias: nothing
op: matmul, weight: (100, 100), bias: nothing
op: bias, weight: nothing, bias: (100,)
op: relu, weight: nothing, bias: nothing
op: matmul, weight: (10, 100), bias: nothing
op: bias, weight: nothing, bias: (10,)
op: relu, weight: nothing, bias: nothing
op: matmul, weight: (10, 10), bias: nothing
op: bias, weight: nothing, bias: (10,)
Found input X
op: gemm, weight: (100, 784), bias: (100,)
op: relu, weight: nothing, bias: nothing
op: gemm, weight: (100, 100), bias: (100,)
op: relu, weight: nothing, bias: nothing
op: gemm, weight: (10, 100), bias: (10,)
op: relu, weight: nothing, bias: nothing
op: gemm, weight: (10, 10), bias: (10,)
Distance: 368.62397500800625
Distance: 47.56803950402309
Distance: 2.8977568827249343
Distance: 0.01885471428334995
Running with 1 threads
[Thread 1] Time to first task: 0.0s
Instable Generators: 45
Instable Generators: 77
Instable Generators: 8
Zono Bounds:
[-2.2907836170204776, -2.313618012855428, -2.7682087434503027, -2.2855579035786655, -2.5764125886894593, -2.869703766246301, -0.0010970559617568896, -2.621584146104646, -2.1187844471989714, -2.4988435701463008]
[2.2904456081464364, 2.2581195987240053, 2.7098841212958007, 2.427087576581528, 2.5229965562266834, 2.785313820546968, 0.0007166887177026907, 2.38575304338229, 2.1102277692808182, 2.4869443556475277]
[Thread 1] Processed 100 zonotopes (Work Done: 0.0%; Expected Zonos: Inf)
[Thread 1] Processed 200 zonotopes (Work Done: 0.0%; Expected Zonos: Inf)
[Thread 1] Processed 300 zonotopes (Work Done: 0.0%; Expected Zonos: Inf)
[Thread 1] Processed 400 zonotopes (Work Done: 0.0%; Expected Zonos: Inf)
[Thread 1] Processed 500 zonotopes (Work Done: 0.0%; Expected Zonos: Inf)
[Thread 1] Processed 600 zonotopes (Work Done: 0.0%; Expected Zonos: Inf)
[Thread 1] Processed 700 zonotopes (Work Done: 0.0%; Expected Zonos: Inf)
[Thread 1] Processed 800 zonotopes (Work Done: 0.0%; Expected Zonos: Inf)
[Thread 1] Processed 900 zonotopes (Work Done: 0.0%; Expected Zonos: Inf)
[Thread 1] Processed 1000 zonotopes (Work Done: 0.0%; Expected Zonos: Inf)
[Thread 1] Processed 1100 zonotopes (Work Done: 0.0%; Expected Zonos: Inf)
[Thread 1] Processed 1200 zonotopes (Work Done: 0.0%; Expected Zonos: Inf)
[Thread 1] Processed 1300 zonotopes (Work Done: 0.0%; Expected Zonos: Inf)
[Thread 1] Processed 1400 zonotopes (Work Done: 0.0%; Expected Zonos: Inf)
[Thread 1] Processed 1500 zonotopes (Work Done: 0.0%; Expected Zonos: Inf)
[Thread 1] Processed 1600 zonotopes (Work Done: 0.0%; Expected Zonos: Inf)
[Thread 1] Processed 1700 zonotopes (Work Done: 0.0%; Expected Zonos: Inf)
[Thread 1] Processed 1800 zonotopes (Work Done: 0.0%; Expected Zonos: Inf)
[Thread 1] Processed 1900 zonotopes (Work Done: 0.0%; Expected Zonos: Inf)
[Thread 1] Processed 2000 zonotopes (Work Done: 0.0%; Expected Zonos: Inf)
[Thread 1] Processed 2100 zonotopes (Work Done: 0.0%; Expected Zonos: Inf)
[Thread 1] Processed 2200 zonotopes (Work Done: 0.0%; Expected Zonos: Inf)
[Thread 1] Processed 2300 zonotopes (Work Done: 0.0%; Expected Zonos: Inf)
[Thread 1] Processed 2400 zonotopes (Work Done: 0.0%; Expected Zonos: Inf)
[Thread 1] Processed 2500 zonotopes (Work Done: 0.0%; Expected Zonos: Inf)
[Thread 1] Processed 2600 zonotopes (Work Done: 0.0%; Expected Zonos: Inf)
[Thread 1] Processed 2700 zonotopes (Work Done: 0.0%; Expected Zonos: Inf)
[Thread 1] Processed 2800 zonotopes (Work Done: 0.0%; Expected Zonos: Inf)
[Thread 1] Processed 2900 zonotopes (Work Done: 0.0%; Expected Zonos: Inf)
[Thread 1] Processed 3000 zonotopes (Work Done: 0.0%; Expected Zonos: Inf)
[Thread 1] Processed 3100 zonotopes (Work Done: 0.0%; Expected Zonos: Inf)
[Thread 1] Processed 3200 zonotopes (Work Done: 0.0%; Expected Zonos: Inf)
[Thread 1] Processed 3300 zonotopes (Work Done: 0.0%; Expected Zonos: Inf)
[Thread 1] Processed 3400 zonotopes (Work Done: 0.0%; Expected Zonos: Inf)
[Thread 1] Processed 3500 zonotopes (Work Done: 0.0%; Expected Zonos: Inf)
[Thread 1] Processed 3600 zonotopes (Work Done: 0.0%; Expected Zonos: Inf)
[Thread 1] Processed 3700 zonotopes (Work Done: 0.0%; Expected Zonos: Inf)
[Thread 1] Processed 3800 zonotopes (Work Done: 0.0%; Expected Zonos: Inf)
[Thread 1] Processed 3900 zonotopes (Work Done: 0.0%; Expected Zonos: Inf)
[Thread 1] Processed 4000 zonotopes (Work Done: 0.0%; Expected Zonos: Inf)
[Thread 1] Processed 4100 zonotopes (Work Done: 0.0%; Expected Zonos: Inf)
[Thread 1] Processed 4200 zonotopes (Work Done: 0.0%; Expected Zonos: Inf)
[Thread 1] Processed 4300 zonotopes (Work Done: 0.0%; Expected Zonos: Inf)
[Thread 1] Processed 4400 zonotopes (Work Done: 0.0%; Expected Zonos: Inf)
[Thread 1] Processed 4500 zonotopes (Work Done: 0.0%; Expected Zonos: Inf)
[Thread 1] Processed 4600 zonotopes (Work Done: 0.0%; Expected Zonos: Inf)
[Thread 1] Processed 4700 zonotopes (Work Done: 0.0%; Expected Zonos: Inf)
[Thread 1] Processed 4800 zonotopes (Work Done: 0.0%; Expected Zonos: Inf)
[Thread 1] Processed 4900 zonotopes (Work Done: 0.0%; Expected Zonos: Inf)
[Thread 1] Processed 5000 zonotopes (Work Done: 0.0%; Expected Zonos: Inf)
[Thread 1] Processed 5100 zonotopes (Work Done: 0.0%; Expected Zonos: Inf)
[Thread 1] Processed 5200 zonotopes (Work Done: 0.0%; Expected Zonos: Inf)
[Thread 1] Processed 5300 zonotopes (Work Done: 0.0%; Expected Zonos: Inf)
[Thread 1] Processed 5400 zonotopes (Work Done: 0.0%; Expected Zonos: Inf)
[Thread 1] Processed 5500 zonotopes (Work Done: 0.0%; Expected Zonos: Inf)
[Thread 1] Processed 5600 zonotopes (Work Done: 0.0%; Expected Zonos: Inf)
[Thread 1] Processed 5700 zonotopes (Work Done: 0.0%; Expected Zonos: Inf)
[Thread 1] Processed 5800 zonotopes (Work Done: 0.0%; Expected Zonos: Inf)
[Thread 1] Processed 5900 zonotopes (Work Done: 0.0%; Expected Zonos: Inf)
[Thread 1] Processed 6000 zonotopes (Work Done: 0.0%; Expected Zonos: Inf)
[Thread 1] Processed 6100 zonotopes (Work Done: 0.0%; Expected Zonos: Inf)
[Thread 1] Processed 6200 zonotopes (Work Done: 0.0%; Expected Zonos: Inf)
[Thread 1] Processed 6300 zonotopes (Work Done: 0.0%; Expected Zonos: Inf)
[Thread 1] Processed 6400 zonotopes (Work Done: 0.0%; Expected Zonos: Inf)
[Thread 1] Processed 6500 zonotopes (Work Done: 0.0%; Expected Zonos: Inf)
[Thread 1] Processed 6600 zonotopes (Work Done: 0.0%; Expected Zonos: Inf)
[Thread 1] Processed 6700 zonotopes (Work Done: 0.0%; Expected Zonos: Inf)
[Thread 1] Processed 6800 zonotopes (Work Done: 0.0%; Expected Zonos: Inf)
[Thread 1] Processed 6900 zonotopes (Work Done: 0.0%; Expected Zonos: Inf)
[Thread 1] Processed 7000 zonotopes (Work Done: 0.0%; Expected Zonos: Inf)
[Thread 1] Processed 7100 zonotopes (Work Done: 0.0%; Expected Zonos: Inf)
[Thread 1] Processed 7200 zonotopes (Work Done: 0.0%; Expected Zonos: Inf)
[Thread 1] Processed 7300 zonotopes (Work Done: 0.0%; Expected Zonos: Inf)
[Thread 1] Processed 7400 zonotopes (Work Done: 0.0%; Expected Zonos: Inf)
[Thread 1] Processed 7500 zonotopes (Work Done: 0.0%; Expected Zonos: Inf)
[Thread 1] Processed 7600 zonotopes (Work Done: 0.0%; Expected Zonos: Inf)
[Thread 1] Processed 7700 zonotopes (Work Done: 0.0%; Expected Zonos: Inf)
[Thread 1] Processed 7800 zonotopes (Work Done: 0.0%; Expected Zonos: Inf)
[Thread 1] Processed 7900 zonotopes (Work Done: 0.0%; Expected Zonos: Inf)
[Thread 1] Processed 8000 zonotopes (Work Done: 0.0%; Expected Zonos: Inf)
[Thread 1] Processed 8100 zonotopes (Work Done: 0.0%; Expected Zonos: Inf)
[Thread 1] Processed 8200 zonotopes (Work Done: 0.0%; Expected Zonos: Inf)
[Thread 1] Processed 8300 zonotopes (Work Done: 0.0%; Expected Zonos: Inf)
[Thread 1] Processed 8400 zonotopes (Work Done: 0.0%; Expected Zonos: Inf)
[Thread 1] Processed 8500 zonotopes (Work Done: 0.0%; Expected Zonos: Inf)
[Thread 1] Processed 8600 zonotopes (Work Done: 0.0%; Expected Zonos: Inf)
[Thread 1] Processed 8700 zonotopes (Work Done: 0.0%; Expected Zonos: Inf)
[Thread 1] Processed 8800 zonotopes (Work Done: 0.0%; Expected Zonos: Inf)
[Thread 1] Processed 8900 zonotopes (Work Done: 0.0%; Expected Zonos: Inf)
[Thread 1] Processed 9000 zonotopes (Work Done: 0.0%; Expected Zonos: Inf)
[Thread 1] Processed 9100 zonotopes (Work Done: 0.0%; Expected Zonos: Inf)
[Thread 1] Processed 9200 zonotopes (Work Done: 0.0%; Expected Zonos: Inf)
[Thread 1] Processed 9300 zonotopes (Work Done: 0.0%; Expected Zonos: Inf)
[Thread 1] Processed 9400 zonotopes (Work Done: 0.0%; Expected Zonos: Inf)
[Thread 1] Processed 9500 zonotopes (Work Done: 0.0%; Expected Zonos: Inf)
[Thread 1] Processed 9600 zonotopes (Work Done: 0.0%; Expected Zonos: Inf)
[Thread 1] Processed 9700 zonotopes (Work Done: 0.0%; Expected Zonos: Inf)
[Thread 1] Processed 9800 zonotopes (Work Done: 0.0%; Expected Zonos: Inf)
[Thread 1] Processed 9900 zonotopes (Work Done: 0.0%; Expected Zonos: Inf)
[Thread 1] Processed 10000 zonotopes (Work Done: 0.0%; Expected Zonos: Inf)
[Thread 1] Processed 10100 zonotopes (Work Done: 0.0%; Expected Zonos: Inf)
[Thread 1] Processed 10200 zonotopes (Work Done: 0.0%; Expected Zonos: Inf)
[Thread 1] Processed 10300 zonotopes (Work Done: 0.0%; Expected Zonos: Inf)
[Thread 1] Processed 10400 zonotopes (Work Done: 0.0%; Expected Zonos: Inf)
[Thread 1] Processed 10500 zonotopes (Work Done: 0.0%; Expected Zonos: Inf)
[Thread 1] Processed 10600 zonotopes (Work Done: 0.0%; Expected Zonos: Inf)
[Thread 1] Processed 10700 zonotopes (Work Done: 0.0%; Expected Zonos: Inf)
[Thread 1] Processed 10800 zonotopes (Work Done: 0.0%; Expected Zonos: Inf)
[Thread 1] Processed 10900 zonotopes (Work Done: 0.0%; Expected Zonos: Inf)
[Thread 1] Processed 11000 zonotopes (Work Done: 0.0%; Expected Zonos: Inf)
[Thread 1] Processed 11100 zonotopes (Work Done: 0.0%; Expected Zonos: Inf)
[Thread 1] Processed 11200 zonotopes (Work Done: 0.0%; Expected Zonos: Inf)
[Thread 1] Processed 11300 zonotopes (Work Done: 0.0%; Expected Zonos: Inf)
[Thread 1] Processed 11400 zonotopes (Work Done: 0.0%; Expected Zonos: Inf)
[Thread 1] Processed 11500 zonotopes (Work Done: 0.0%; Expected Zonos: Inf)
[Thread 1] Processed 11600 zonotopes (Work Done: 0.0%; Expected Zonos: Inf)
[Thread 1] Processed 11700 zonotopes (Work Done: 0.0%; Expected Zonos: Inf)
[Thread 1] Processed 11800 zonotopes (Work Done: 0.0%; Expected Zonos: Inf)
[Thread 1] Processed 11900 zonotopes (Work Done: 0.0%; Expected Zonos: Inf)
[Thread 1] Processed 12000 zonotopes (Work Done: 0.0%; Expected Zonos: Inf)
[Thread 1] Processed 12100 zonotopes (Work Done: 0.0%; Expected Zonos: Inf)
[Thread 1] Processed 12200 zonotopes (Work Done: 0.0%; Expected Zonos: Inf)
[Thread 1] Processed 12300 zonotopes (Work Done: 0.0%; Expected Zonos: Inf)
[Thread 1] Processed 12400 zonotopes (Work Done: 0.0%; Expected Zonos: Inf)
[Thread 1] Processed 12500 zonotopes (Work Done: 0.0%; Expected Zonos: Inf)
[Thread 1] Processed 12600 zonotopes (Work Done: 0.0%; Expected Zonos: Inf)
[Thread 1] Processed 12700 zonotopes (Work Done: 0.0%; Expected Zonos: Inf)
[Thread 1] Processed 12800 zonotopes (Work Done: 0.0%; Expected Zonos: Inf)
[Thread 1] Processed 12900 zonotopes (Work Done: 0.0%; Expected Zonos: Inf)
[Thread 1] Processed 13000 zonotopes (Work Done: 0.0%; Expected Zonos: Inf)
[Thread 1] Processed 13100 zonotopes (Work Done: 0.0%; Expected Zonos: Inf)
[Thread 1] Processed 13200 zonotopes (Work Done: 0.0%; Expected Zonos: Inf)
[Thread 1] Processed 13300 zonotopes (Work Done: 0.0%; Expected Zonos: Inf)
[Thread 1] Processed 13400 zonotopes (Work Done: 0.0%; Expected Zonos: Inf)
[Thread 1] Processed 13500 zonotopes (Work Done: 0.0%; Expected Zonos: Inf)
[Thread 1] Processed 13600 zonotopes (Work Done: 0.0%; Expected Zonos: Inf)
[Thread 1] Processed 13700 zonotopes (Work Done: 0.0%; Expected Zonos: Inf)
[Thread 1] Processed 13800 zonotopes (Work Done: 0.0%; Expected Zonos: Inf)
[Thread 1] Processed 13900 zonotopes (Work Done: 0.0%; Expected Zonos: Inf)
[Thread 1] Processed 14000 zonotopes (Work Done: 0.0%; Expected Zonos: Inf)
[Thread 1] Processed 14100 zonotopes (Work Done: 0.0%; Expected Zonos: Inf)
[Thread 1] Processed 14200 zonotopes (Work Done: 0.0%; Expected Zonos: Inf)
[Thread 1] Processed 14300 zonotopes (Work Done: 0.0%; Expected Zonos: Inf)
[Thread 1] Processed 14400 zonotopes (Work Done: 0.0%; Expected Zonos: Inf)
[Thread 1] Processed 14500 zonotopes (Work Done: 0.0%; Expected Zonos: Inf)
[Thread 1] Processed 14600 zonotopes (Work Done: 0.0%; Expected Zonos: Inf)
[Thread 1] Processed 14700 zonotopes (Work Done: 0.0%; Expected Zonos: Inf)
[Thread 1] Processed 14800 zonotopes (Work Done: 0.0%; Expected Zonos: Inf)
[Thread 1] Processed 14900 zonotopes (Work Done: 0.0%; Expected Zonos: Inf)
[Thread 1] Processed 15000 zonotopes (Work Done: 0.0%; Expected Zonos: Inf)
[Thread 1] Processed 15100 zonotopes (Work Done: 0.0%; Expected Zonos: Inf)
[Thread 1] Processed 15200 zonotopes (Work Done: 0.0%; Expected Zonos: Inf)
[Thread 1] Processed 15300 zonotopes (Work Done: 0.0%; Expected Zonos: Inf)
[Thread 1] Processed 15400 zonotopes (Work Done: 0.0%; Expected Zonos: Inf)
[Thread 1] Processed 15500 zonotopes (Work Done: 0.0%; Expected Zonos: Inf)
[Thread 1] Processed 15600 zonotopes (Work Done: 0.0%; Expected Zonos: Inf)
[Thread 1] Processed 15700 zonotopes (Work Done: 0.0%; Expected Zonos: Inf)
[Thread 1] Processed 15800 zonotopes (Work Done: 0.0%; Expected Zonos: Inf)
[Thread 1] Processed 15900 zonotopes (Work Done: 0.0%; Expected Zonos: Inf)
[Thread 1] Processed 16000 zonotopes (Work Done: 0.0%; Expected Zonos: Inf)
[Thread 1] Processed 16100 zonotopes (Work Done: 0.0%; Expected Zonos: Inf)
[Thread 1] Processed 16200 zonotopes (Work Done: 0.0%; Expected Zonos: Inf)
[Thread 1] Processed 16300 zonotopes (Work Done: 0.0%; Expected Zonos: Inf)
[Thread 1] Processed 16400 zonotopes (Work Done: 0.0%; Expected Zonos: Inf)
[Thread 1] Processed 16500 zonotopes (Work Done: 0.0%; Expected Zonos: Inf)
[Thread 1] Processed 16600 zonotopes (Work Done: 0.0%; Expected Zonos: Inf)
[Thread 1] Processed 16700 zonotopes (Work Done: 0.0%; Expected Zonos: Inf)
[Thread 1] Processed 16800 zonotopes (Work Done: 0.0%; Expected Zonos: Inf)
[Thread 1] Processed 16900 zonotopes (Work Done: 0.0%; Expected Zonos: Inf)
[Thread 1] Processed 17000 zonotopes (Work Done: 0.0%; Expected Zonos: Inf)
[Thread 1] Processed 17100 zonotopes (Work Done: 0.0%; Expected Zonos: Inf)
[Thread 1] Processed 17200 zonotopes (Work Done: 0.0%; Expected Zonos: Inf)
[Thread 1] Processed 17300 zonotopes (Work Done: 0.0%; Expected Zonos: Inf)
[Thread 1] Processed 17400 zonotopes (Work Done: 0.0%; Expected Zonos: Inf)
[Thread 1] Processed 17500 zonotopes (Work Done: 0.0%; Expected Zonos: Inf)
[Thread 1] Processed 17600 zonotopes (Work Done: 0.0%; Expected Zonos: Inf)
[Thread 1] Processed 17700 zonotopes (Work Done: 0.0%; Expected Zonos: Inf)
[Thread 1] Processed 17800 zonotopes (Work Done: 0.0%; Expected Zonos: Inf)
[Thread 1] Processed 17900 zonotopes (Work Done: 0.0%; Expected Zonos: Inf)
[Thread 1] Processed 18000 zonotopes (Work Done: 0.0%; Expected Zonos: Inf)
[Thread 1] Processed 18100 zonotopes (Work Done: 0.0%; Expected Zonos: Inf)
[Thread 1] Processed 18200 zonotopes (Work Done: 0.0%; Expected Zonos: Inf)
[Thread 1] Processed 18300 zonotopes (Work Done: 0.0%; Expected Zonos: Inf)
[Thread 1] Processed 18400 zonotopes (Work Done: 0.0%; Expected Zonos: Inf)
[Thread 1] Processed 18500 zonotopes (Work Done: 0.0%; Expected Zonos: Inf)
[Thread 1] Processed 18600 zonotopes (Work Done: 0.0%; Expected Zonos: Inf)
[Thread 1] Processed 18700 zonotopes (Work Done: 0.0%; Expected Zonos: Inf)
[Thread 1] Processed 18800 zonotopes (Work Done: 0.0%; Expected Zonos: Inf)
[Thread 1] Processed 18900 zonotopes (Work Done: 0.0%; Expected Zonos: Inf)
[Thread 1] Processed 19000 zonotopes (Work Done: 0.0%; Expected Zonos: Inf)
[Thread 1] Processed 19100 zonotopes (Work Done: 0.0%; Expected Zonos: Inf)
[Thread 1] Processed 19200 zonotopes (Work Done: 0.0%; Expected Zonos: Inf)
[Thread 1] Processed 19300 zonotopes (Work Done: 0.0%; Expected Zonos: Inf)
[Thread 1] Processed 19400 zonotopes (Work Done: 0.0%; Expected Zonos: Inf)
[Thread 1] Processed 19500 zonotopes (Work Done: 0.0%; Expected Zonos: Inf)
[Thread 1] Processed 19600 zonotopes (Work Done: 0.0%; Expected Zonos: Inf)
[Thread 1] Processed 19700 zonotopes (Work Done: 0.0%; Expected Zonos: Inf)
[Thread 1] Processed 19800 zonotopes (Work Done: 0.0%; Expected Zonos: Inf)
[Thread 1] Processed 19900 zonotopes (Work Done: 0.0%; Expected Zonos: Inf)
[Thread 1] Processed 20000 zonotopes (Work Done: 0.0%; Expected Zonos: Inf)
[Thread 1] Processed 20100 zonotopes (Work Done: 0.0%; Expected Zonos: Inf)
[Thread 1] Processed 20200 zonotopes (Work Done: 0.0%; Expected Zonos: Inf)
[Thread 1] Processed 20300 zonotopes (Work Done: 0.0%; Expected Zonos: Inf)
[Thread 1] Processed 20400 zonotopes (Work Done: 0.0%; Expected Zonos: Inf)
[Thread 1] Processed 20500 zonotopes (Work Done: 0.0%; Expected Zonos: Inf)
[Thread 1] Processed 20600 zonotopes (Work Done: 0.0%; Expected Zonos: Inf)
[Thread 1] Processed 20700 zonotopes (Work Done: 0.0%; Expected Zonos: Inf)
[Thread 1] Processed 20800 zonotopes (Work Done: 0.0%; Expected Zonos: Inf)
[Thread 1] Processed 20900 zonotopes (Work Done: 0.0%; Expected Zonos: Inf)
[Thread 1] Processed 21000 zonotopes (Work Done: 0.0%; Expected Zonos: Inf)
[Thread 1] Processed 21100 zonotopes (Work Done: 0.0%; Expected Zonos: Inf)
[Thread 1] Processed 21200 zonotopes (Work Done: 0.0%; Expected Zonos: Inf)
[Thread 1] Processed 21300 zonotopes (Work Done: 0.0%; Expected Zonos: Inf)
[Thread 1] Processed 21400 zonotopes (Work Done: 0.0%; Expected Zonos: Inf)
[Thread 1] Processed 21500 zonotopes (Work Done: 0.0%; Expected Zonos: Inf)
[Thread 1] Processed 21600 zonotopes (Work Done: 0.0%; Expected Zonos: Inf)
[Thread 1] Processed 21700 zonotopes (Work Done: 0.0%; Expected Zonos: Inf)
[Thread 1] Processed 21800 zonotopes (Work Done: 0.0%; Expected Zonos: Inf)
[Thread 1] Processed 21900 zonotopes (Work Done: 0.0%; Expected Zonos: Inf)
[Thread 1] Processed 22000 zonotopes (Work Done: 0.0%; Expected Zonos: Inf)
[Thread 1] Processed 22100 zonotopes (Work Done: 0.0%; Expected Zonos: Inf)
[Thread 1] Processed 22200 zonotopes (Work Done: 0.0%; Expected Zonos: Inf)
[Thread 1] Processed 22300 zonotopes (Work Done: 0.0%; Expected Zonos: Inf)
[Thread 1] Processed 22400 zonotopes (Work Done: 0.0%; Expected Zonos: Inf)
[Thread 1] Processed 22500 zonotopes (Work Done: 0.0%; Expected Zonos: Inf)
[Thread 1] Processed 22600 zonotopes (Work Done: 0.0%; Expected Zonos: Inf)
[Thread 1] Processed 22700 zonotopes (Work Done: 0.0%; Expected Zonos: Inf)
[Thread 1] Processed 22800 zonotopes (Work Done: 0.0%; Expected Zonos: Inf)
[Thread 1] Processed 22900 zonotopes (Work Done: 0.00305%; Expected Zonos: 7.503872e8)
[Thread 1] Processed 23000 zonotopes (Work Done: 0.00305%; Expected Zonos: 7.53664e8)
[Thread 1] Processed 23100 zonotopes (Work Done: 0.00305%; Expected Zonos: 7.569408e8)
[Thread 1] Processed 23200 zonotopes (Work Done: 0.00305%; Expected Zonos: 7.602176e8)
[Thread 1] Processed 23300 zonotopes (Work Done: 0.00305%; Expected Zonos: 7.634944e8)
[Thread 1] Processed 23400 zonotopes (Work Done: 0.00305%; Expected Zonos: 7.667712e8)
[Thread 1] Processed 23500 zonotopes (Work Done: 0.00305%; Expected Zonos: 7.70048e8)
[Thread 1] Processed 23600 zonotopes (Work Done: 0.00305%; Expected Zonos: 7.733248e8)
[Thread 1] Processed 23700 zonotopes (Work Done: 0.00305%; Expected Zonos: 7.766016e8)
[Thread 1] Processed 23800 zonotopes (Work Done: 0.00305%; Expected Zonos: 7.798784e8)
[Thread 1] Processed 23900 zonotopes (Work Done: 0.00305%; Expected Zonos: 7.831552e8)
[Thread 1] Processed 24000 zonotopes (Work Done: 0.00305%; Expected Zonos: 7.86432e8)
[Thread 1] Processed 24100 zonotopes (Work Done: 0.00305%; Expected Zonos: 7.897088e8)
[Thread 1] Processed 24200 zonotopes (Work Done: 0.00305%; Expected Zonos: 7.929856e8)
[Thread 1] Processed 24300 zonotopes (Work Done: 0.00305%; Expected Zonos: 7.962624e8)
[Thread 1] Processed 24400 zonotopes (Work Done: 0.00305%; Expected Zonos: 7.995392e8)
[Thread 1] Processed 24500 zonotopes (Work Done: 0.00305%; Expected Zonos: 8.02816e8)
[Thread 1] Processed 24600 zonotopes (Work Done: 0.00305%; Expected Zonos: 8.060928e8)
[Thread 1] Processed 24700 zonotopes (Work Done: 0.00305%; Expected Zonos: 8.093696e8)
[Thread 1] Processed 24800 zonotopes (Work Done: 0.00305%; Expected Zonos: 8.126464e8)
[Thread 1] Processed 24900 zonotopes (Work Done: 0.00305%; Expected Zonos: 8.159232e8)
[Thread 1] Processed 25000 zonotopes (Work Done: 0.00305%; Expected Zonos: 8.192e8)
[Thread 1] Processed 25100 zonotopes (Work Done: 0.00305%; Expected Zonos: 8.224768e8)
[Thread 1] Processed 25200 zonotopes (Work Done: 0.00305%; Expected Zonos: 8.257536e8)
[Thread 1] Processed 25300 zonotopes (Work Done: 0.00305%; Expected Zonos: 8.290304e8)
[Thread 1] Processed 25400 zonotopes (Work Done: 0.00305%; Expected Zonos: 8.323072e8)
[Thread 1] Processed 25500 zonotopes (Work Done: 0.00305%; Expected Zonos: 8.35584e8)
[Thread 1] Processed 25600 zonotopes (Work Done: 0.00305%; Expected Zonos: 8.388608e8)
[Thread 1] Processed 25700 zonotopes (Work Done: 0.00305%; Expected Zonos: 8.421376e8)
[Thread 1] Processed 25800 zonotopes (Work Done: 0.00305%; Expected Zonos: 8.454144e8)
[Thread 1] Processed 25900 zonotopes (Work Done: 0.00305%; Expected Zonos: 8.486912e8)
[Thread 1] Processed 26000 zonotopes (Work Done: 0.00305%; Expected Zonos: 8.51968e8)
[Thread 1] Processed 26100 zonotopes (Work Done: 0.00305%; Expected Zonos: 8.552448e8)
[Thread 1] Processed 26200 zonotopes (Work Done: 0.00305%; Expected Zonos: 8.585216e8)
[Thread 1] Processed 26300 zonotopes (Work Done: 0.00305%; Expected Zonos: 8.617984e8)
[Thread 1] Processed 26400 zonotopes (Work Done: 0.00305%; Expected Zonos: 8.650752e8)
[Thread 1] Processed 26500 zonotopes (Work Done: 0.00305%; Expected Zonos: 8.68352e8)
[Thread 1] Processed 26600 zonotopes (Work Done: 0.00305%; Expected Zonos: 8.716288e8)
[Thread 1] Processed 26700 zonotopes (Work Done: 0.00305%; Expected Zonos: 8.749056e8)
[Thread 1] Processed 26800 zonotopes (Work Done: 0.00305%; Expected Zonos: 8.781824e8)
[Thread 1] Processed 26900 zonotopes (Work Done: 0.00305%; Expected Zonos: 8.814592e8)
[Thread 1] Processed 27000 zonotopes (Work Done: 0.00305%; Expected Zonos: 8.84736e8)
[Thread 1] Processed 27100 zonotopes (Work Done: 0.00305%; Expected Zonos: 8.880128e8)
[Thread 1] Processed 27200 zonotopes (Work Done: 0.00305%; Expected Zonos: 8.912896e8)
[Thread 1] Processed 27300 zonotopes (Work Done: 0.00305%; Expected Zonos: 8.945664e8)
[Thread 1] Processed 27400 zonotopes (Work Done: 0.00305%; Expected Zonos: 8.978432e8)
[Thread 1] Processed 27500 zonotopes (Work Done: 0.00305%; Expected Zonos: 9.0112e8)
[Thread 1] Processed 27600 zonotopes (Work Done: 0.00305%; Expected Zonos: 9.043968e8)
[Thread 1] Processed 27700 zonotopes (Work Done: 0.00305%; Expected Zonos: 9.076736e8)
[Thread 1] Processed 27800 zonotopes (Work Done: 0.00305%; Expected Zonos: 9.109504e8)
[Thread 1] Processed 27900 zonotopes (Work Done: 0.00305%; Expected Zonos: 9.142272e8)
[Thread 1] Processed 28000 zonotopes (Work Done: 0.00305%; Expected Zonos: 9.17504e8)
[Thread 1] Processed 28100 zonotopes (Work Done: 0.00305%; Expected Zonos: 9.207808e8)
[Thread 1] Processed 28200 zonotopes (Work Done: 0.00305%; Expected Zonos: 9.240576e8)
[Thread 1] Processed 28300 zonotopes (Work Done: 0.00305%; Expected Zonos: 9.273344e8)
[Thread 1] Processed 28400 zonotopes (Work Done: 0.00305%; Expected Zonos: 9.306112e8)
[Thread 1] Processed 28500 zonotopes (Work Done: 0.00305%; Expected Zonos: 9.33888e8)
[Thread 1] Processed 28600 zonotopes (Work Done: 0.00305%; Expected Zonos: 9.371648e8)
[Thread 1] Processed 28700 zonotopes (Work Done: 0.00305%; Expected Zonos: 9.404416e8)
[Thread 1] Processed 28800 zonotopes (Work Done: 0.00305%; Expected Zonos: 9.437184e8)
[Thread 1] Processed 28900 zonotopes (Work Done: 0.00305%; Expected Zonos: 9.469952e8)
[Thread 1] Processed 29000 zonotopes (Work Done: 0.00305%; Expected Zonos: 9.50272e8)
[Thread 1] Processed 29100 zonotopes (Work Done: 0.00305%; Expected Zonos: 9.535488e8)
[Thread 1] Processed 29200 zonotopes (Work Done: 0.00305%; Expected Zonos: 9.568256e8)
[Thread 1] Processed 29300 zonotopes (Work Done: 0.00305%; Expected Zonos: 9.601024e8)
[Thread 1] Processed 29400 zonotopes (Work Done: 0.00305%; Expected Zonos: 9.633792e8)
[Thread 1] Processed 29500 zonotopes (Work Done: 0.00305%; Expected Zonos: 9.66656e8)
[Thread 1] Processed 29600 zonotopes (Work Done: 0.00305%; Expected Zonos: 9.699328e8)
[Thread 1] Processed 29700 zonotopes (Work Done: 0.00305%; Expected Zonos: 9.732096e8)
[Thread 1] Processed 29800 zonotopes (Work Done: 0.00305%; Expected Zonos: 9.764864e8)
[Thread 1] Processed 29900 zonotopes (Work Done: 0.00305%; Expected Zonos: 9.797632e8)
[Thread 1] Processed 30000 zonotopes (Work Done: 0.00305%; Expected Zonos: 9.8304e8)
[Thread 1] Processed 30100 zonotopes (Work Done: 0.00305%; Expected Zonos: 9.863168e8)
[Thread 1] Processed 30200 zonotopes (Work Done: 0.00305%; Expected Zonos: 9.895936e8)
[Thread 1] Processed 30300 zonotopes (Work Done: 0.00305%; Expected Zonos: 9.928704e8)
[Thread 1] Processed 30400 zonotopes (Work Done: 0.00305%; Expected Zonos: 9.961472e8)
[Thread 1] Processed 30500 zonotopes (Work Done: 0.00305%; Expected Zonos: 9.99424e8)
[Thread 1] Processed 30600 zonotopes (Work Done: 0.00305%; Expected Zonos: 1.0027008e9)
[Thread 1] Processed 30700 zonotopes (Work Done: 0.00305%; Expected Zonos: 1.0059776e9)
[Thread 1] Processed 30800 zonotopes (Work Done: 0.00305%; Expected Zonos: 1.0092544e9)
[Thread 1] Processed 30900 zonotopes (Work Done: 0.00305%; Expected Zonos: 1.0125312e9)
[Thread 1] Processed 31000 zonotopes (Work Done: 0.00305%; Expected Zonos: 1.015808e9)
[Thread 1] Processed 31100 zonotopes (Work Done: 0.00305%; Expected Zonos: 1.0190848e9)
[Thread 1] Processed 31200 zonotopes (Work Done: 0.00305%; Expected Zonos: 1.0223616e9)
[Thread 1] Processed 31300 zonotopes (Work Done: 0.0061%; Expected Zonos: 5.128192e8)
[Thread 1] Processed 31400 zonotopes (Work Done: 0.0061%; Expected Zonos: 5.144576e8)
[Thread 1] Processed 31500 zonotopes (Work Done: 0.0061%; Expected Zonos: 5.16096e8)
[Thread 1] Processed 31600 zonotopes (Work Done: 0.0061%; Expected Zonos: 5.177344e8)
[Thread 1] Processed 31700 zonotopes (Work Done: 0.0061%; Expected Zonos: 5.193728e8)
[Thread 1] Processed 31800 zonotopes (Work Done: 0.0061%; Expected Zonos: 5.210112e8)
[Thread 1] Processed 31900 zonotopes (Work Done: 0.0061%; Expected Zonos: 5.226496e8)
[Thread 1] Processed 32000 zonotopes (Work Done: 0.0061%; Expected Zonos: 5.24288e8)
[Thread 1] Processed 32100 zonotopes (Work Done: 0.0061%; Expected Zonos: 5.259264e8)
[Thread 1] Processed 32200 zonotopes (Work Done: 0.0061%; Expected Zonos: 5.275648e8)
[Thread 1] Processed 32300 zonotopes (Work Done: 0.0061%; Expected Zonos: 5.292032e8)
[Thread 1] Processed 32400 zonotopes (Work Done: 0.0061%; Expected Zonos: 5.308416e8)
[Thread 1] Processed 32500 zonotopes (Work Done: 0.0061%; Expected Zonos: 5.3248e8)
[Thread 1] Processed 32600 zonotopes (Work Done: 0.0061%; Expected Zonos: 5.341184e8)
[Thread 1] Processed 32700 zonotopes (Work Done: 0.0061%; Expected Zonos: 5.357568e8)
[Thread 1] Processed 32800 zonotopes (Work Done: 0.0061%; Expected Zonos: 5.373952e8)
[Thread 1] Processed 32900 zonotopes (Work Done: 0.0061%; Expected Zonos: 5.390336e8)
[Thread 1] Processed 33000 zonotopes (Work Done: 0.0061%; Expected Zonos: 5.40672e8)
[Thread 1] Processed 33100 zonotopes (Work Done: 0.0061%; Expected Zonos: 5.423104e8)
[Thread 1] Processed 33200 zonotopes (Work Done: 0.0061%; Expected Zonos: 5.439488e8)
[Thread 1] Processed 33300 zonotopes (Work Done: 0.0061%; Expected Zonos: 5.455872e8)
[Thread 1] Processed 33400 zonotopes (Work Done: 0.0061%; Expected Zonos: 5.472256e8)
[Thread 1] Processed 33500 zonotopes (Work Done: 0.0061%; Expected Zonos: 5.48864e8)
[Thread 1] Processed 33600 zonotopes (Work Done: 0.0061%; Expected Zonos: 5.505024e8)
[Thread 1] Processed 33700 zonotopes (Work Done: 0.0061%; Expected Zonos: 5.521408e8)
[Thread 1] Processed 33800 zonotopes (Work Done: 0.0061%; Expected Zonos: 5.537792e8)
[Thread 1] Processed 33900 zonotopes (Work Done: 0.0061%; Expected Zonos: 5.554176e8)
[Thread 1] Processed 34000 zonotopes (Work Done: 0.0061%; Expected Zonos: 5.57056e8)
[Thread 1] Processed 34100 zonotopes (Work Done: 0.0061%; Expected Zonos: 5.586944e8)
[Thread 1] Processed 34200 zonotopes (Work Done: 0.0061%; Expected Zonos: 5.603328e8)
[Thread 1] Processed 34300 zonotopes (Work Done: 0.0061%; Expected Zonos: 5.619712e8)
[Thread 1] Processed 34400 zonotopes (Work Done: 0.0061%; Expected Zonos: 5.636096e8)
[Thread 1] Processed 34500 zonotopes (Work Done: 0.0061%; Expected Zonos: 5.65248e8)
[Thread 1] Processed 34600 zonotopes (Work Done: 0.0061%; Expected Zonos: 5.668864e8)
[Thread 1] Processed 34700 zonotopes (Work Done: 0.0061%; Expected Zonos: 5.685248e8)
[Thread 1] Processed 34800 zonotopes (Work Done: 0.0061%; Expected Zonos: 5.701632e8)
[Thread 1] Processed 34900 zonotopes (Work Done: 0.0061%; Expected Zonos: 5.718016e8)
[Thread 1] Processed 35000 zonotopes (Work Done: 0.0061%; Expected Zonos: 5.7344e8)
[Thread 1] Processed 35100 zonotopes (Work Done: 0.0061%; Expected Zonos: 5.750784e8)
[Thread 1] Processed 35200 zonotopes (Work Done: 0.0061%; Expected Zonos: 5.767168e8)
[Thread 1] Processed 35300 zonotopes (Work Done: 0.0061%; Expected Zonos: 5.783552e8)
[Thread 1] Processed 35400 zonotopes (Work Done: 0.0061%; Expected Zonos: 5.799936e8)
[Thread 1] Processed 35500 zonotopes (Work Done: 0.0061%; Expected Zonos: 5.81632e8)
[Thread 1] Processed 35600 zonotopes (Work Done: 0.0061%; Expected Zonos: 5.832704e8)
[Thread 1] Processed 35700 zonotopes (Work Done: 0.0061%; Expected Zonos: 5.849088e8)
[Thread 1] Processed 35800 zonotopes (Work Done: 0.0061%; Expected Zonos: 5.865472e8)
[Thread 1] Processed 35900 zonotopes (Work Done: 0.0061%; Expected Zonos: 5.881856e8)
[Thread 1] Processed 36000 zonotopes (Work Done: 0.0061%; Expected Zonos: 5.89824e8)
[Thread 1] Processed 36100 zonotopes (Work Done: 0.0061%; Expected Zonos: 5.914624e8)
[Thread 1] Processed 36200 zonotopes (Work Done: 0.0061%; Expected Zonos: 5.931008e8)
[Thread 1] Processed 36300 zonotopes (Work Done: 0.0061%; Expected Zonos: 5.947392e8)
[Thread 1] Processed 36400 zonotopes (Work Done: 0.0061%; Expected Zonos: 5.963776e8)
[Thread 1] Processed 36500 zonotopes (Work Done: 0.0061%; Expected Zonos: 5.98016e8)
[Thread 1] Processed 36600 zonotopes (Work Done: 0.0061%; Expected Zonos: 5.996544e8)
[Thread 1] Processed 36700 zonotopes (Work Done: 0.0061%; Expected Zonos: 6.012928e8)


TIMEOUT REACHED
UNKNOWN
[Thread 1] Total splits: 36756
Processed 36758 zonotopes (Work Done: 0.0%); Generated 73512 (0.0032709287518907447s/loop)
[Thread 1] Finished in 120.23s
 ────────────────────────────────────────────────────────────────────────────────
                                        Time                    Allocations      
                               ───────────────────────   ────────────────────────
       Tot / % measured:             120s / 100.0%            100GiB / 100.0%    

 Section               ncalls     time    %tot     avg     alloc    %tot      avg
 ────────────────────────────────────────────────────────────────────────────────
 Verify                     1     120s  100.0%    120s    100GiB  100.0%   100GiB
   Zonotope Loop            1     120s  100.0%    120s    100GiB  100.0%   100GiB
     Zonotope Propa...  36.8k    81.4s   67.7%  2.21ms   56.7GiB   56.9%  1.58MiB
       DiffZonotope...   147k    44.6s   37.1%   303μs   11.7GiB   11.7%  83.2KiB
         Zonotope_D...   294k    19.5s   16.3%  66.4μs   5.98GiB    6.0%  21.3KiB
       DiffZonotope...   110k    36.6s   30.4%   332μs   45.0GiB   45.2%   428KiB
         Zonotope_R...   221k    22.4s   18.7%   102μs   30.2GiB   30.3%   144KiB
           Influenc...   221k    7.71s    6.4%  35.0μs   9.84GiB    9.9%  46.8KiB
             Multiply    221k    5.07s    4.2%  23.0μs   6.15GiB    6.2%  29.2KiB
             Alloca...   221k    2.21s    1.8%  10.0μs   3.69GiB    3.7%  17.5KiB
             Set Ma...   221k    300ms    0.2%  1.36μs     0.00B    0.0%    0.00B
           Column M...   221k    6.62s    5.5%  30.0μs   9.73GiB    9.8%  46.3KiB
           Allocation    221k    5.67s    4.7%  25.7μs   9.72GiB    9.8%  46.2KiB
           Set Matrix    221k    1.50s    1.2%  6.80μs    220MiB    0.2%  1.02KiB
           Vectors       221k    682ms    0.6%  3.09μs    701MiB    0.7%  3.26KiB
           Bounds        221k   51.9ms    0.0%   235ns     0.00B    0.0%    0.00B
     Compute Split      36.8k    7.76s    6.5%   211μs   8.02GiB    8.1%   229KiB
     Property Check     36.8k    6.70s    5.6%   182μs   2.34GiB    2.3%  66.8KiB
 Initialize                 1    342μs    0.0%   342μs    876KiB    0.0%   876KiB
 ────────────────────────────────────────────────────────────────────────────────
[VERYDIFF_TIMER] 120.26409374

[VERYDIFF_EXPERIMENT] NETWORK: /home/i57/steuber/NeuroDiff/repos/VeryDiffExperiments/src/../benchmarks/mnist-prune/specs/mnist_90_local_24.vnnlib
[VERYDIFF_EXPERIMENT] TIME: 120.913935376
