
[VERYDIFF_EXPERIMENT] Running on /home/i57/steuber/NeuroDiff/repos/VeryDiffExperiments/src/../benchmarks/mnist-prune/specs/mnist_59_global_4.vnnlib /home/i57/steuber/NeuroDiff/repos/VeryDiffExperiments/src/../benchmarks/mnist-prune/nets/mnist_relu_2_512.onnx
Parsing /home/i57/steuber/NeuroDiff/repos/VeryDiffExperiments/src/../benchmarks/mnist-prune/nets/mnist_relu_2_512.onnx...
Found input X
op: matmul, weight: (512, 784), bias: nothing
op: bias, weight: nothing, bias: (512,)
op: relu, weight: nothing, bias: nothing
op: matmul, weight: (512, 512), bias: nothing
op: bias, weight: nothing, bias: (512,)
op: relu, weight: nothing, bias: nothing
op: matmul, weight: (10, 512), bias: nothing
op: bias, weight: nothing, bias: (10,)
Parsing /home/i57/steuber/NeuroDiff/repos/VeryDiffExperiments/src/../benchmarks/mnist-prune/nets_pruned/mnist_relu_2_512_0.79-old.onnx...
Found input X
op: gemm, weight: (512, 784), bias: (512,)
op: relu, weight: nothing, bias: nothing
op: gemm, weight: (512, 512), bias: (512,)
op: relu, weight: nothing, bias: nothing
op: gemm, weight: (10, 512), bias: (10,)
Distance: 973.3044369037136
Distance: 481.63499746812613
Distance: 8.744412635378467
Running with 1 threads
[Thread 1] Time to first task: 0.01s
Instable Generators: 171
Instable Generators: 351
Zono Bounds:
[-13.024803227734559, -12.7133356433843, -11.328334212209294, -12.137178122935053, -12.76623255908286, -10.878074555872697, -11.780003004507785, -12.253862202243827, -10.627941817236009, -10.718183070119514]
[15.035887383129602, 14.947035633996576, 13.093138639191812, 14.45979668768622, 14.440170949739718, 13.841043359398267, 14.209425526299905, 14.965182703417735, 12.894255674103603, 12.264002867178997]
[Thread 1] Processed 100 zonotopes (Work Done: 0.0%; Expected Zonos: Inf)


TIMEOUT REACHED
UNKNOWN
[Thread 1] Total splits: 149
Processed 149 zonotopes (Work Done: 0.0%); Generated 298 (0.8080507949664429s/loop)
[Thread 1] Finished in 120.4s
 ────────────────────────────────────────────────────────────────────────────────
                                        Time                    Allocations      
                               ───────────────────────   ────────────────────────
       Tot / % measured:             120s / 100.0%           42.5GiB / 100.0%    

 Section               ncalls     time    %tot     avg     alloc    %tot      avg
 ────────────────────────────────────────────────────────────────────────────────
 Verify                     1     120s  100.0%    120s   42.5GiB  100.0%  42.5GiB
   Zonotope Loop            1     120s  100.0%    120s   42.5GiB  100.0%  42.5GiB
     Property Check       149    82.3s   68.4%   552ms   17.2GiB   40.5%   118MiB
     Zonotope Propa...    149    35.8s   29.7%   240ms   19.4GiB   45.6%   133MiB
       DiffZonotope...    298    19.7s   16.4%  66.2ms   16.2GiB   38.0%  55.6MiB
         Zonotope_R...    596    13.4s   11.2%  22.6ms   14.0GiB   33.0%  24.1MiB
           Influenc...    596    11.9s    9.9%  20.0ms   8.89GiB   20.9%  15.3MiB
             Multiply     596    11.1s    9.2%  18.7ms   4.96GiB   11.7%  8.53MiB
             Set Ma...    596    524ms    0.4%   879μs     0.00B    0.0%    0.00B
             Alloca...    596    251ms    0.2%   422μs   3.93GiB    9.2%  6.75MiB
           Column M...    596    963ms    0.8%  1.62ms   2.57GiB    6.0%  4.41MiB
           Set Matrix     596    350ms    0.3%   588μs   4.12MiB    0.0%  7.07KiB
           Allocation     596    210ms    0.2%   352μs   2.57GiB    6.0%  4.41MiB
           Vectors        596   11.9ms    0.0%  20.0μs   14.5MiB    0.0%  25.0KiB
           Bounds         596    450μs    0.0%   755ns     0.00B    0.0%    0.00B
       DiffZonotope...    447    16.1s   13.4%  36.0ms   3.22GiB    7.6%  7.37MiB
         Zonotope_D...    894    7.68s    6.4%  8.59ms   2.01GiB    4.7%  2.30MiB
     Compute Split        149    1.66s    1.4%  11.1ms   3.01GiB    7.1%  20.7MiB
 Initialize                 1   2.22ms    0.0%  2.22ms   9.84MiB    0.0%  9.84MiB
 ────────────────────────────────────────────────────────────────────────────────
[VERYDIFF_TIMER] 120.433608401

[VERYDIFF_EXPERIMENT] NETWORK: /home/i57/steuber/NeuroDiff/repos/VeryDiffExperiments/src/../benchmarks/mnist-prune/specs/mnist_59_global_4.vnnlib
[VERYDIFF_EXPERIMENT] TIME: 120.815655868
