
[VERYDIFF_EXPERIMENT] Running on /home/i57/steuber/NeuroDiff/repos/VeryDiffExperiments/src/../benchmarks/mnist-prune/specs/mnist_8_global_3.vnnlib /home/i57/steuber/NeuroDiff/repos/VeryDiffExperiments/src/../benchmarks/mnist-prune/nets/mnist_relu_3_100.onnx
Loading /home/i57/steuber/NeuroDiff/repos/VeryDiffExperiments/src/../benchmarks/mnist-prune/nets/mnist_relu_3_100.onnx and /home/i57/steuber/NeuroDiff/repos/VeryDiffExperiments/src/../benchmarks/mnist-prune/nets_pruned/mnist_relu_3_100_0.49-old.onnx
INPUT SHAPE: 784
UNKNOWN
TIMEOUT
Refined: 52 | Refine Limit: 26 | Wrong: 0 | Right: 46 | Total: 46 | Total Zonos Considered: 98 | Expected 19512153539 (2.3575050241408415e-07%)

time: 120.378537727

[VERYDIFF_TIMER] 120.412369352

[VERYDIFF_EXPERIMENT] NETWORK: /home/i57/steuber/NeuroDiff/repos/VeryDiffExperiments/src/../benchmarks/mnist-prune/specs/mnist_8_global_3.vnnlib
[VERYDIFF_EXPERIMENT] TIME: 120.715096401
