
[VERYDIFF_EXPERIMENT] Running on /home/i57/steuber/NeuroDiff/repos/VeryDiffExperiments/src/../benchmarks/mnist-prune/specs/mnist_26_local_21.vnnlib /home/i57/steuber/NeuroDiff/repos/VeryDiffExperiments/src/../benchmarks/mnist-prune/nets/mnist_relu_2_512.onnx
Loading /home/i57/steuber/NeuroDiff/repos/VeryDiffExperiments/src/../benchmarks/mnist-prune/nets/mnist_relu_2_512.onnx and /home/i57/steuber/NeuroDiff/repos/VeryDiffExperiments/src/../benchmarks/mnist-prune/nets_pruned/mnist_relu_2_512_pruned5.onnx
INPUT SHAPE: 784

[NEQUIV] 370.79717346096413

[ -99.50088116 -102.27777502  -60.28414247  -69.96728294 -136.26124516
  -93.20616682 -130.64405178   33.0725     -142.68030427  -64.21387379]
[ -90.17071619  -95.53955977  -53.82131819  -65.96939899 -122.14095245
  -84.5822178  -120.18781075   29.20397243 -132.43361879  -54.53945976]
NETWORKS NOT EQUIVALENT
Refined: 0 | Refine Limit: -1 | Wrong: 0 | Right: 1 | Total: 1 | Total Zonos Considered: 1 | Expected 2 (50.0%)

time: 2.432723841

[VERYDIFF_TIMER] 2.456562339

[VERYDIFF_EXPERIMENT] Running on /home/i57/steuber/NeuroDiff/repos/VeryDiffExperiments/src/../benchmarks/mnist-prune/specs/mnist_26_local_21.vnnlib /home/i57/steuber/NeuroDiff/repos/VeryDiffExperiments/src/../benchmarks/mnist-prune/nets/mnist_relu_3_100.onnx
Loading /home/i57/steuber/NeuroDiff/repos/VeryDiffExperiments/src/../benchmarks/mnist-prune/nets/mnist_relu_3_100.onnx and /home/i57/steuber/NeuroDiff/repos/VeryDiffExperiments/src/../benchmarks/mnist-prune/nets_pruned/mnist_relu_3_100_pruned5.onnx
INPUT SHAPE: 784
Refined: 95 | Refine Limit: 29 | Wrong: 0 | Right: 116 | Total: 116 | Total Zonos Considered: 211 | Expected 11395029 (0.0010179877558889935%)Refined: 218 | Refine Limit: 31 | Wrong: 0 | Right: 353 | Total: 353 | Total Zonos Considered: 571 | Expected 34676248 (0.0010179878745820482%)Refined: 333 | Refine Limit: 28 | Wrong: 0 | Right: 552 | Total: 552 | Total Zonos Considered: 885 | Expected 54222561 (0.0010180264263062013%)Refined: 456 | Refine Limit: 26 | Wrong: 0 | Right: 787 | Total: 787 | Total Zonos Considered: 1243 | Expected 77306405 (0.001018026902169361%)Refined: 576 | Refine Limit: 28 | Wrong: 0 | Right: 988 | Total: 988 | Total Zonos Considered: 1564 | Expected 95157328 (0.00103828052002469%)Refined: 698 | Refine Limit: 24 | Wrong: 0 | Right: 1223 | Total: 1223 | Total Zonos Considered: 1921 | Expected 117790760 (0.0010382817803365899%)Refined: 818 | Refine Limit: 30 | Wrong: 0 | Right: 1433 | Total: 1433 | Total Zonos Considered: 2251 | Expected 137999009 (0.0010384132541125712%)Refined: 913 | Refine Limit: 13 | Wrong: 0 | Right: 1642 | Total: 1642 | Total Zonos Considered: 2555 | Expected 138054552 (0.0011893849034401995%)Refined: 1033 | Refine Limit: 21 | Wrong: 0 | Right: 1843 | Total: 1843 | Total Zonos Considered: 2876 | Expected 154451685 (0.0011932534112528458%)Refined: 1169 | Refine Limit: 33 | Wrong: 0 | Right: 2070 | Total: 2070 | Total Zonos Considered: 3239 | Expected 173475019 (0.0011932553816293285%)Refined: 1292 | Refine Limit: 32 | Wrong: 0 | Right: 2298 | Total: 2298 | Total Zonos Considered: 3590 | Expected 192582102 (0.0011932573048766494%)Refined: 1410 | Refine Limit: 35 | Wrong: 0 | Right: 2526 | Total: 2526 | Total Zonos Considered: 3936 | Expected 211689464 (0.0011932573082616903%)Refined: 1534 | Refine Limit: 36 | Wrong: 0 | Right: 2742 | Total: 2742 | Total Zonos Considered: 4276 | Expected 229791175 (0.001193257312862428%)Refined: 1649 | Refine Limit: 23 | Wrong: 0 | Right: 2956 | Total: 2956 | Total Zonos Considered: 4605 | Expected 247723521 (0.0011932657779395925%)Refined: 1770 | Refine Limit: 29 | Wrong: 0 | Right: 3169 | Total: 3169 | Total Zonos Considered: 4939 | Expected 265528887 (0.0011934671348959483%)Refined: 1889 | Refine Limit: 35 | Wrong: 0 | Right: 3371 | Total: 3371 | Total Zonos Considered: 5260 | Expected 282449694 (0.0011934868656646518%)UNKNOWN
TIMEOUT
Refined: 1917 | Refine Limit: 30 | Wrong: 0 | Right: 3427 | Total: 3427 | Total Zonos Considered: 5344 | Expected 287141828 (0.0011934868646166033%)

time: 120.31850406

[VERYDIFF_TIMER] 120.342554912

[VERYDIFF_EXPERIMENT] Running on /home/i57/steuber/NeuroDiff/repos/VeryDiffExperiments/src/../benchmarks/mnist-prune/specs/mnist_26_local_21.vnnlib /home/i57/steuber/NeuroDiff/repos/VeryDiffExperiments/src/../benchmarks/mnist-prune/nets/mnist_relu_4_1024.onnx
Loading /home/i57/steuber/NeuroDiff/repos/VeryDiffExperiments/src/../benchmarks/mnist-prune/nets/mnist_relu_4_1024.onnx and /home/i57/steuber/NeuroDiff/repos/VeryDiffExperiments/src/../benchmarks/mnist-prune/nets_pruned/mnist_relu_4_1024_pruned5.onnx
INPUT SHAPE: 784

[NEQUIV] 875.6993298481096

[ 2.48969902  0.          3.66095657  5.69322991  0.          0.
  0.         19.53063443  0.         12.52716737]
[ 1.32792894  0.          2.53959815  5.0434867   0.          0.
  0.         16.89246307  0.          9.87761819]
NETWORKS NOT EQUIVALENT
Refined: 0 | Refine Limit: -1 | Wrong: 0 | Right: 1 | Total: 1 | Total Zonos Considered: 1 | Expected 2 (50.0%)

time: 31.896333015

[VERYDIFF_TIMER] 31.935003562

[VERYDIFF_EXPERIMENT] NETWORK: /home/i57/steuber/NeuroDiff/repos/VeryDiffExperiments/src/../benchmarks/mnist-prune/specs/mnist_26_local_21.vnnlib
[VERYDIFF_EXPERIMENT] TIME: 155.578295577
