
[VERYDIFF_EXPERIMENT] Running on /home/i57/steuber/NeuroDiff/repos/VeryDiffExperiments/src/../benchmarks/mnist-prune/specs/mnist_66_global_4.vnnlib /home/i57/steuber/NeuroDiff/repos/VeryDiffExperiments/src/../benchmarks/mnist-prune/nets/mnist_relu_3_100.onnx
Found input X
op: matmul, weight: (100, 784), bias: nothing
op: bias, weight: nothing, bias: (100,)
op: relu, weight: nothing, bias: nothing
op: matmul, weight: (100, 100), bias: nothing
op: bias, weight: nothing, bias: (100,)
op: relu, weight: nothing, bias: nothing
op: matmul, weight: (10, 100), bias: nothing
op: bias, weight: nothing, bias: (10,)
op: relu, weight: nothing, bias: nothing
op: matmul, weight: (10, 10), bias: nothing
op: bias, weight: nothing, bias: (10,)
Found input X
op: gemm, weight: (100, 784), bias: (100,)
op: relu, weight: nothing, bias: nothing
op: gemm, weight: (100, 100), bias: (100,)
op: relu, weight: nothing, bias: nothing
op: gemm, weight: (10, 100), bias: (10,)
op: relu, weight: nothing, bias: nothing
op: gemm, weight: (10, 10), bias: (10,)
Distance: 1958.4889029213523
Distance: 144.28197153992141
Distance: 22.063573056613677
Distance: 0.8412832540489035
Running with 1 threads
[Thread 1] Time to first task: 0.0s
Instable Generators: 35
Instable Generators: 50
Instable Generators: 8
Zono Bounds:
[-4.216519439064525, -3.9643309989799667, -5.438765264530094, -4.686708680289257, -4.7461715063022005, -5.619825254493266, -5.352193064304915, -5.071784009792956, -4.709196884227088, -0.2234103769992929]
[3.936577029342361, 3.8608058679121795, 5.165050164537485, 4.797284702793595, 4.755807655962119, 5.2124958756684645, 4.497249451200867, 5.100499724134651, 4.740893935833769, 0.2401436310199092]
[Thread 1] Processed 100 zonotopes (Work Done: 0.0%; Expected Zonos: Inf)
[Thread 1] Processed 200 zonotopes (Work Done: 0.0%; Expected Zonos: Inf)
[Thread 1] Processed 300 zonotopes (Work Done: 0.0%; Expected Zonos: Inf)
[Thread 1] Processed 400 zonotopes (Work Done: 0.0%; Expected Zonos: Inf)
[Thread 1] Processed 500 zonotopes (Work Done: 0.0%; Expected Zonos: Inf)


TIMEOUT REACHED
UNKNOWN
[Thread 1] Total splits: 578
Processed 578 zonotopes (Work Done: 0.0%); Generated 1156 (0.20769566661764707s/loop)
[Thread 1] Finished in 120.05s
 ────────────────────────────────────────────────────────────────────────────────
                                        Time                    Allocations      
                               ───────────────────────   ────────────────────────
       Tot / % measured:             120s / 100.0%           61.8GiB / 100.0%    

 Section               ncalls     time    %tot     avg     alloc    %tot      avg
 ────────────────────────────────────────────────────────────────────────────────
 Verify                     1     120s  100.0%    120s   61.8GiB  100.0%  61.8GiB
   Zonotope Loop            1     120s  100.0%    120s   61.8GiB  100.0%  61.8GiB
     Zonotope Propa...    578    72.3s   60.2%   125ms   41.7GiB   67.4%  73.8MiB
       DiffZonotope...  1.73k    62.2s   51.8%  35.9ms   39.3GiB   63.6%  23.2MiB
         Zonotope_R...  3.47k    61.5s   51.3%  17.7ms   38.4GiB   62.1%  11.3MiB
           Influenc...  3.47k    53.7s   44.7%  15.5ms   35.3GiB   57.1%  10.4MiB
             Alloca...  3.47k    26.2s   21.9%  7.57ms   17.3GiB   28.0%  5.12MiB
             Multiply   3.47k    24.9s   20.8%  7.19ms   18.0GiB   29.1%  5.31MiB
             Set Ma...  3.47k    2.49s    2.1%   719μs     0.00B    0.0%    0.00B
           Column M...  3.47k    7.23s    6.0%  2.08ms   1.53GiB    2.5%   463KiB
           Allocation   3.47k    397ms    0.3%   114μs   1.53GiB    2.5%   463KiB
           Set Matrix   3.47k    189ms    0.2%  54.6μs   3.56MiB    0.0%  1.05KiB
           Vectors      3.47k   17.5ms    0.0%  5.05μs   11.0MiB    0.0%  3.26KiB
           Bounds       3.47k   2.49ms    0.0%   717ns     0.00B    0.0%    0.00B
       DiffZonotope...  2.31k    10.1s    8.4%  4.35ms   2.35GiB    3.8%  1.04MiB
         Zonotope_D...  4.62k    4.86s    4.0%  1.05ms   1.54GiB    2.5%   348KiB
     Compute Split        578    32.0s   26.6%  55.3ms   8.78GiB   14.2%  15.6MiB
     Property Check       578    113ms    0.1%   196μs    120MiB    0.2%   213KiB
 Initialize                 1    536μs    0.0%   536μs   5.41MiB    0.0%  5.41MiB
 ────────────────────────────────────────────────────────────────────────────────
[VERYDIFF_TIMER] 120.079926678

[VERYDIFF_EXPERIMENT] NETWORK: /home/i57/steuber/NeuroDiff/repos/VeryDiffExperiments/src/../benchmarks/mnist-prune/specs/mnist_66_global_4.vnnlib
[VERYDIFF_EXPERIMENT] TIME: 120.477547884
