
[VERYDIFF_EXPERIMENT] Running on /home/i57/steuber/NeuroDiff/repos/VeryDiffExperiments/src/../benchmarks/mnist-prune/specs/mnist_96_global_3.vnnlib /home/i57/steuber/NeuroDiff/repos/VeryDiffExperiments/src/../benchmarks/mnist-prune/nets/mnist_relu_3_100.onnx
Found input X
op: matmul, weight: (100, 784), bias: nothing
op: bias, weight: nothing, bias: (100,)
op: relu, weight: nothing, bias: nothing
op: matmul, weight: (100, 100), bias: nothing
op: bias, weight: nothing, bias: (100,)
op: relu, weight: nothing, bias: nothing
op: matmul, weight: (10, 100), bias: nothing
op: bias, weight: nothing, bias: (10,)
op: relu, weight: nothing, bias: nothing
op: matmul, weight: (10, 10), bias: nothing
op: bias, weight: nothing, bias: (10,)
Found input X
op: gemm, weight: (100, 784), bias: (100,)
op: relu, weight: nothing, bias: nothing
op: gemm, weight: (100, 100), bias: (100,)
op: relu, weight: nothing, bias: nothing
op: gemm, weight: (10, 100), bias: (10,)
op: relu, weight: nothing, bias: nothing
op: gemm, weight: (10, 10), bias: (10,)
Distance: 368.62397500800625
Distance: 47.56803950402309
Distance: 2.8977568827249343
Distance: 0.01885471428334995
Running with 1 threads
[Thread 1] Time to first task: 0.0s
Instable Generators: 29
Instable Generators: 39
Instable Generators: 5
Zono Bounds:
[7.969033511882133e-5, -0.504574315259878, -0.04417738930532623, -0.7303671951608771, -0.7193296936857216, -0.7928847924910458, -0.0001373497692051984, -0.6613976150372267, -0.5611909799059662, -0.6361939403178299]
[0.0003618286295930911, 0.578998282442562, 0.04544658419093934, 0.5712436121390484, 0.6975277305837555, 0.6804013038469756, 0.0003508339359742385, 0.6505166281294037, 0.5375547294104941, 0.6157021596873958]
[Thread 1] Total splits: 0
Processed 1 zonotopes (Work Done: 100.0%); Generated 0 (0.06351318s/loop)
[Thread 1] Finished in 0.06s
 ────────────────────────────────────────────────────────────────────────────────
                                        Time                    Allocations      
                               ───────────────────────   ────────────────────────
       Tot / % measured:           64.1ms / 100.0%           97.8MiB / 100.0%    

 Section               ncalls     time    %tot     avg     alloc    %tot      avg
 ────────────────────────────────────────────────────────────────────────────────
 Verify                     1   63.5ms   99.2%  63.5ms   92.3MiB   94.5%  92.3MiB
   Zonotope Loop            1   63.5ms   99.1%  63.5ms   92.3MiB   94.5%  92.3MiB
     Zonotope Propa...      1   60.2ms   94.0%  60.2ms   72.4MiB   74.1%  72.4MiB
       DiffZonotope...      3   36.1ms   56.3%  12.0ms   68.3MiB   69.8%  22.8MiB
         Zonotope_R...      6   35.2ms   54.9%  5.86ms   66.7MiB   68.2%  11.1MiB
           Influenc...      6   33.9ms   52.9%  5.65ms   61.3MiB   62.7%  10.2MiB
             Multiply       6   22.7ms   35.5%  3.79ms   31.1MiB   31.8%  5.18MiB
             Alloca...      6   7.02ms   11.0%  1.17ms   30.2MiB   30.9%  5.03MiB
             Set Ma...      6   4.15ms    6.5%   692μs     0.00B    0.0%    0.00B
           Column M...      6    748μs    1.2%   125μs   2.67MiB    2.7%   456KiB
           Set Matrix       6    303μs    0.5%  50.6μs   5.25KiB    0.0%     896B
           Allocation       6    129μs    0.2%  21.6μs   2.67MiB    2.7%   456KiB
           Vectors          6   29.9μs    0.0%  4.98μs   19.5KiB    0.0%  3.26KiB
           Bounds           6   3.76μs    0.0%   626ns     0.00B    0.0%    0.00B
       DiffZonotope...      4   24.1ms   37.7%  6.04ms   4.13MiB    4.2%  1.03MiB
         Zonotope_D...      8   8.93ms   13.9%  1.12ms   2.71MiB    2.8%   347KiB
     Property Check         1   9.66μs    0.0%  9.66μs   1.23KiB    0.0%  1.23KiB
 Initialize                 1    542μs    0.8%   542μs   5.41MiB    5.5%  5.41MiB
 ────────────────────────────────────────────────────────────────────────────────
[VERYDIFF_TIMER] 0.093894789

[VERYDIFF_EXPERIMENT] NETWORK: /home/i57/steuber/NeuroDiff/repos/VeryDiffExperiments/src/../benchmarks/mnist-prune/specs/mnist_96_global_3.vnnlib
[VERYDIFF_EXPERIMENT] TIME: 0.395983209
