[runlim] version:		2.0.0rc12
[runlim] host:			i57pool5
[runlim] time limit:		311040000 seconds
[runlim] real time limit:	120 seconds
[runlim] space limit:		15563 MB
[runlim] argv[0]:		/home/i57/steuber/.local/bin/Marabou
[runlim] argv[1]:		./mnist-prune/nets/product_mnist_relu_3_100_mnist_relu_3_100_pruned5_eps.onnx
[runlim] argv[2]:		./mnist-prune/specs/product_mnist_54_global_3_eps_1.0.vnnlib
[runlim] start:			Thu Oct  3 22:00:10 2024
[runlim] child:			628452
Network: ./mnist-prune/nets/product_mnist_relu_3_100_mnist_relu_3_100_pruned5_eps.onnx
Property: ./mnist-prune/specs/product_mnist_54_global_3_eps_1.0.vnnlib

Engine::processInputQuery: Input query (before preprocessing): 450 equations, 1654 variables
Engine::processInputQuery: Input query (after preprocessing): 830 equations, 1786 variables

Input bounds:
	x0: [ -0.0000,   0.0118] 
	x1: [ -0.0000,   0.0118] 
	x2: [ -0.0000,   0.0118] 
	x3: [ -0.0000,   0.0118] 
	x4: [ -0.0000,   0.0118] 
	x5: [ -0.0000,   0.0118] 
	x6: [ -0.0000,   0.0118] 
	x7: [ -0.0000,   0.0118] 
	x8: [ -0.0000,   0.0118] 
	x9: [ -0.0000,   0.0118] 
	x10: [ -0.0000,   0.0118] 
	x11: [ -0.0000,   0.0118] 
	x12: [ -0.0000,   0.0118] 
	x13: [ -0.0000,   0.0118] 
	x14: [ -0.0000,   0.0118] 
	x15: [ -0.0000,   0.0118] 
	x16: [ -0.0000,   0.0118] 
	x17: [ -0.0000,   0.0118] 
	x18: [ -0.0000,   0.0118] 
	x19: [ -0.0000,   0.0118] 
	x20: [ -0.0000,   0.0118] 
	x21: [ -0.0000,   0.0118] 
	x22: [ -0.0000,   0.0118] 
	x23: [ -0.0000,   0.0118] 
	x24: [ -0.0000,   0.0118] 
	x25: [ -0.0000,   0.0118] 
	x26: [ -0.0000,   0.0118] 
	x27: [ -0.0000,   0.0118] 
	x28: [ -0.0000,   0.0118] 
	x29: [ -0.0000,   0.0118] 
	x30: [ -0.0000,   0.0118] 
	x31: [ -0.0000,   0.0118] 
	x32: [ -0.0000,   0.0118] 
	x33: [ -0.0000,   0.0118] 
	x34: [ -0.0000,   0.0118] 
	x35: [ -0.0000,   0.0118] 
	x36: [ -0.0000,   0.0118] 
	x37: [ -0.0000,   0.0118] 
	x38: [ -0.0000,   0.0118] 
	x39: [ -0.0000,   0.0118] 
	x40: [ -0.0000,   0.0118] 
	x41: [ -0.0000,   0.0118] 
	x42: [ -0.0000,   0.0118] 
	x43: [ -0.0000,   0.0118] 
	x44: [ -0.0000,   0.0118] 
	x45: [ -0.0000,   0.0118] 
	x46: [ -0.0000,   0.0118] 
	x47: [ -0.0000,   0.0118] 
	x48: [ -0.0000,   0.0118] 
	x49: [ -0.0000,   0.0118] 
	x50: [ -0.0000,   0.0118] 
	x51: [ -0.0000,   0.0118] 
	x52: [ -0.0000,   0.0118] 
	x53: [ -0.0000,   0.0118] 
	x54: [ -0.0000,   0.0118] 
	x55: [ -0.0000,   0.0118] 
	x56: [ -0.0000,   0.0118] 
	x57: [ -0.0000,   0.0118] 
	x58: [ -0.0000,   0.0118] 
	x59: [ -0.0000,   0.0118] 
	x60: [ -0.0000,   0.0118] 
	x61: [ -0.0000,   0.0118] 
	x62: [ -0.0000,   0.0118] 
	x63: [ -0.0000,   0.0118] 
	x64: [ -0.0000,   0.0118] 
	x65: [ -0.0000,   0.0118] 
	x66: [ -0.0000,   0.0118] 
	x67: [ -0.0000,   0.0118] 
	x68: [ -0.0000,   0.0118] 
	x69: [ -0.0000,   0.0118] 
	x70: [ -0.0000,   0.0118] 
	x71: [ -0.0000,   0.0118] 
	x72: [ -0.0000,   0.0118] 
	x73: [ -0.0000,   0.0118] 
	x74: [ -0.0000,   0.0118] 
	x75: [ -0.0000,   0.0118] 
	x76: [ -0.0000,   0.0118] 
	x77: [ -0.0000,   0.0118] 
	x78: [ -0.0000,   0.0118] 
	x79: [ -0.0000,   0.0118] 
	x80: [ -0.0000,   0.0118] 
	x81: [ -0.0000,   0.0118] 
	x82: [ -0.0000,   0.0118] 
	x83: [ -0.0000,   0.0118] 
	x84: [ -0.0000,   0.0118] 
	x85: [ -0.0000,   0.0118] 
	x86: [ -0.0000,   0.0118] 
	x87: [ -0.0000,   0.0118] 
	x88: [ -0.0000,   0.0118] 
	x89: [ -0.0000,   0.0118] 
	x90: [ -0.0000,   0.0118] 
	x91: [ -0.0000,   0.0118] 
	x92: [ -0.0000,   0.0118] 
	x93: [  0.0510,   0.0745] 
	x94: [  0.7961,   0.8196] 
	x95: [  0.8392,   0.8627] 
	x96: [ -0.0000,   0.0118] 
	x97: [ -0.0000,   0.0118] 
	x98: [ -0.0000,   0.0118] 
	x99: [ -0.0000,   0.0118] 
	x100: [ -0.0000,   0.0118] 
	x101: [ -0.0000,   0.0118] 
	x102: [ -0.0000,   0.0118] 
	x103: [ -0.0000,   0.0118] 
	x104: [ -0.0000,   0.0118] 
	x105: [ -0.0000,   0.0118] 
	x106: [ -0.0000,   0.0118] 
	x107: [ -0.0000,   0.0118] 
	x108: [ -0.0000,   0.0118] 
	x109: [ -0.0000,   0.0118] 
	x110: [ -0.0000,   0.0118] 
	x111: [ -0.0000,   0.0118] 
	x112: [ -0.0000,   0.0118] 
	x113: [ -0.0000,   0.0118] 
	x114: [ -0.0000,   0.0118] 
	x115: [ -0.0000,   0.0118] 
	x116: [ -0.0000,   0.0118] 
	x117: [ -0.0000,   0.0118] 
	x118: [ -0.0000,   0.0118] 
	x119: [ -0.0000,   0.0118] 
	x120: [  0.0549,   0.0784] 
	x121: [  0.7922,   0.8157] 
	x122: [  0.9804,   1.0000] 
	x123: [  0.8353,   0.8588] 
	x124: [ -0.0000,   0.0118] 
	x125: [ -0.0000,   0.0118] 
	x126: [ -0.0000,   0.0118] 
	x127: [ -0.0000,   0.0118] 
	x128: [ -0.0000,   0.0118] 
	x129: [ -0.0000,   0.0118] 
	x130: [ -0.0000,   0.0118] 
	x131: [ -0.0000,   0.0118] 
	x132: [ -0.0000,   0.0118] 
	x133: [ -0.0000,   0.0118] 
	x134: [ -0.0000,   0.0118] 
	x135: [ -0.0000,   0.0118] 
	x136: [ -0.0000,   0.0118] 
	x137: [ -0.0000,   0.0118] 
	x138: [ -0.0000,   0.0118] 
	x139: [ -0.0000,   0.0118] 
	x140: [ -0.0000,   0.0118] 
	x141: [ -0.0000,   0.0118] 
	x142: [ -0.0000,   0.0118] 
	x143: [ -0.0000,   0.0118] 
	x144: [ -0.0000,   0.0118] 
	x145: [ -0.0000,   0.0118] 
	x146: [ -0.0000,   0.0118] 
	x147: [  0.0549,   0.0784] 
	x148: [  0.7922,   0.8157] 
	x149: [  0.9804,   1.0000] 
	x150: [  0.9725,   0.9961] 
	x151: [  0.5333,   0.5569] 
	x152: [ -0.0000,   0.0118] 
	x153: [ -0.0000,   0.0118] 
	x154: [ -0.0000,   0.0118] 
	x155: [ -0.0000,   0.0118] 
	x156: [ -0.0000,   0.0118] 
	x157: [ -0.0000,   0.0118] 
	x158: [ -0.0000,   0.0118] 
	x159: [ -0.0000,   0.0118] 
	x160: [ -0.0000,   0.0118] 
	x161: [ -0.0000,   0.0118] 
	x162: [ -0.0000,   0.0118] 
	x163: [ -0.0000,   0.0118] 
	x164: [ -0.0000,   0.0118] 
	x165: [ -0.0000,   0.0118] 
	x166: [ -0.0000,   0.0118] 
	x167: [ -0.0000,   0.0118] 
	x168: [ -0.0000,   0.0118] 
	x169: [ -0.0000,   0.0118] 
	x170: [ -0.0000,   0.0118] 
	x171: [ -0.0000,   0.0118] 
	x172: [ -0.0000,   0.0118] 
	x173: [ -0.0000,   0.0118] 
	x174: [ -0.0000,   0.0118] 
	x175: [  0.5216,   0.5451] 
	x176: [  0.9804,   1.0000] 
	x177: [  0.9804,   1.0000] 
	x178: [  0.5725,   0.5961] 
	x179: [ -0.0000,   0.0118] 
	x180: [ -0.0000,   0.0118] 
	x181: [ -0.0000,   0.0118] 
	x182: [ -0.0000,   0.0118] 
	x183: [ -0.0000,   0.0118] 
	x184: [ -0.0000,   0.0118] 
	x185: [ -0.0000,   0.0118] 
	x186: [ -0.0000,   0.0118] 
	x187: [ -0.0000,   0.0118] 
	x188: [ -0.0000,   0.0118] 
	x189: [ -0.0000,   0.0118] 
	x190: [ -0.0000,   0.0118] 
	x191: [ -0.0000,   0.0118] 
	x192: [ -0.0000,   0.0118] 
	x193: [ -0.0000,   0.0118] 
	x194: [ -0.0000,   0.0118] 
	x195: [ -0.0000,   0.0118] 
	x196: [ -0.0000,   0.0118] 
	x197: [ -0.0000,   0.0118] 
	x198: [ -0.0000,   0.0118] 
	x199: [ -0.0000,   0.0118] 
	x200: [ -0.0000,   0.0118] 
	x201: [ -0.0000,   0.0118] 
	x202: [  0.0667,   0.0902] 
	x203: [  0.8039,   0.8275] 
	x204: [  0.9804,   1.0000] 
	x205: [  0.9216,   0.9451] 
	x206: [  0.1412,   0.1647] 
	x207: [ -0.0000,   0.0118] 
	x208: [ -0.0000,   0.0118] 
	x209: [ -0.0000,   0.0118] 
	x210: [ -0.0000,   0.0118] 
	x211: [ -0.0000,   0.0118] 
	x212: [ -0.0000,   0.0118] 
	x213: [ -0.0000,   0.0118] 
	x214: [ -0.0000,   0.0118] 
	x215: [ -0.0000,   0.0118] 
	x216: [ -0.0000,   0.0118] 
	x217: [ -0.0000,   0.0118] 
	x218: [ -0.0000,   0.0118] 
	x219: [ -0.0000,   0.0118] 
	x220: [ -0.0000,   0.0118] 
	x221: [ -0.0000,   0.0118] 
	x222: [ -0.0000,   0.0118] 
	x223: [ -0.0000,   0.0118] 
	x224: [ -0.0000,   0.0118] 
	x225: [ -0.0000,   0.0118] 
	x226: [ -0.0000,   0.0118] 
	x227: [ -0.0000,   0.0118] 
	x228: [ -0.0000,   0.0118] 
	x229: [ -0.0000,   0.0118] 
	x230: [  0.8078,   0.8314] 
	x231: [  0.9804,   1.0000] 
	x232: [  0.9804,   1.0000] 
	x233: [  0.5725,   0.5961] 
	x234: [ -0.0000,   0.0118] 
	x235: [ -0.0000,   0.0118] 
	x236: [ -0.0000,   0.0118] 
	x237: [ -0.0000,   0.0118] 
	x238: [ -0.0000,   0.0118] 
	x239: [ -0.0000,   0.0118] 
	x240: [ -0.0000,   0.0118] 
	x241: [ -0.0000,   0.0118] 
	x242: [ -0.0000,   0.0118] 
	x243: [ -0.0000,   0.0118] 
	x244: [ -0.0000,   0.0118] 
	x245: [ -0.0000,   0.0118] 
	x246: [ -0.0000,   0.0118] 
	x247: [ -0.0000,   0.0118] 
	x248: [ -0.0000,   0.0118] 
	x249: [ -0.0000,   0.0118] 
	x250: [ -0.0000,   0.0118] 
	x251: [ -0.0000,   0.0118] 
	x252: [ -0.0000,   0.0118] 
	x253: [ -0.0000,   0.0118] 
	x254: [ -0.0000,   0.0118] 
	x255: [ -0.0000,   0.0118] 
	x256: [ -0.0000,   0.0118] 
	x257: [ -0.0000,   0.0118] 
	x258: [  0.9843,   1.0000] 
	x259: [  0.9804,   1.0000] 
	x260: [  0.9333,   0.9569] 
	x261: [  0.1294,   0.1529] 
	x262: [ -0.0000,   0.0118] 
	x263: [ -0.0000,   0.0118] 
	x264: [ -0.0000,   0.0118] 
	x265: [ -0.0000,   0.0118] 
	x266: [ -0.0000,   0.0118] 
	x267: [ -0.0000,   0.0118] 
	x268: [ -0.0000,   0.0118] 
	x269: [ -0.0000,   0.0118] 
	x270: [ -0.0000,   0.0118] 
	x271: [ -0.0000,   0.0118] 
	x272: [ -0.0000,   0.0118] 
	x273: [ -0.0000,   0.0118] 
	x274: [ -0.0000,   0.0118] 
	x275: [ -0.0000,   0.0118] 
	x276: [ -0.0000,   0.0118] 
	x277: [ -0.0000,   0.0118] 
	x278: [ -0.0000,   0.0118] 
	x279: [ -0.0000,   0.0118] 
	x280: [ -0.0000,   0.0118] 
	x281: [ -0.0000,   0.0118] 
	x282: [ -0.0000,   0.0118] 
	x283: [ -0.0000,   0.0118] 
	x284: [ -0.0000,   0.0118] 
	x285: [ -0.0000,   0.0118] 
	x286: [  0.9882,   1.0000] 
	x287: [  0.9804,   1.0000] 
	x288: [  0.9098,   0.9333] 
	x289: [ -0.0000,   0.0118] 
	x290: [ -0.0000,   0.0118] 
	x291: [ -0.0000,   0.0118] 
	x292: [ -0.0000,   0.0118] 
	x293: [ -0.0000,   0.0118] 
	x294: [ -0.0000,   0.0118] 
	x295: [ -0.0000,   0.0118] 
	x296: [  0.1373,   0.1608] 
	x297: [  0.1843,   0.2078] 
	x298: [  0.1843,   0.2078] 
	x299: [  0.1843,   0.2078] 
	x300: [  0.1843,   0.2078] 
	x301: [  0.1843,   0.2078] 
	x302: [  0.0078,   0.0314] 
	x303: [ -0.0000,   0.0118] 
	x304: [ -0.0000,   0.0118] 
	x305: [ -0.0000,   0.0118] 
	x306: [ -0.0000,   0.0118] 
	x307: [ -0.0000,   0.0118] 
	x308: [ -0.0000,   0.0118] 
	x309: [ -0.0000,   0.0118] 
	x310: [ -0.0000,   0.0118] 
	x311: [ -0.0000,   0.0118] 
	x312: [ -0.0000,   0.0118] 
	x313: [ -0.0000,   0.0118] 
	x314: [  0.9843,   1.0000] 
	x315: [  0.9804,   1.0000] 
	x316: [  0.9098,   0.9333] 
	x317: [ -0.0000,   0.0118] 
	x318: [ -0.0000,   0.0118] 
	x319: [ -0.0000,   0.0118] 
	x320: [ -0.0000,   0.0118] 
	x321: [ -0.0000,   0.0118] 
	x322: [  0.2549,   0.2784] 
	x323: [  0.6941,   0.7176] 
	x324: [  0.9137,   0.9373] 
	x325: [  0.9804,   1.0000] 
	x326: [  0.9804,   1.0000] 
	x327: [  0.9804,   1.0000] 
	x328: [  0.9804,   1.0000] 
	x329: [  0.9804,   1.0000] 
	x330: [  0.7216,   0.7451] 
	x331: [  0.4824,   0.5059] 
	x332: [  0.1059,   0.1294] 
	x333: [ -0.0000,   0.0118] 
	x334: [ -0.0000,   0.0118] 
	x335: [ -0.0000,   0.0118] 
	x336: [ -0.0000,   0.0118] 
	x337: [ -0.0000,   0.0118] 
	x338: [ -0.0000,   0.0118] 
	x339: [ -0.0000,   0.0118] 
	x340: [ -0.0000,   0.0118] 
	x341: [ -0.0000,   0.0118] 
	x342: [  0.9843,   1.0000] 
	x343: [  0.9804,   1.0000] 
	x344: [  0.9098,   0.9333] 
	x345: [ -0.0000,   0.0118] 
	x346: [ -0.0000,   0.0118] 
	x347: [ -0.0000,   0.0118] 
	x348: [ -0.0000,   0.0118] 
	x349: [  0.0392,   0.0627] 
	x350: [  0.7647,   0.7882] 
	x351: [  0.9804,   1.0000] 
	x352: [  0.9804,   1.0000] 
	x353: [  0.7882,   0.8118] 
	x354: [  0.7373,   0.7608] 
	x355: [  0.5686,   0.5922] 
	x356: [  0.4902,   0.5137] 
	x357: [  0.6784,   0.7020] 
	x358: [  0.9569,   0.9804] 
	x359: [  0.9804,   1.0000] 
	x360: [  0.8588,   0.8824] 
	x361: [  0.4824,   0.5059] 
	x362: [ -0.0000,   0.0118] 
	x363: [ -0.0000,   0.0118] 
	x364: [ -0.0000,   0.0118] 
	x365: [ -0.0000,   0.0118] 
	x366: [ -0.0000,   0.0118] 
	x367: [ -0.0000,   0.0118] 
	x368: [ -0.0000,   0.0118] 
	x369: [ -0.0000,   0.0118] 
	x370: [  0.9843,   1.0000] 
	x371: [  0.9804,   1.0000] 
	x372: [  0.5373,   0.5608] 
	x373: [ -0.0000,   0.0118] 
	x374: [ -0.0000,   0.0118] 
	x375: [ -0.0000,   0.0118] 
	x376: [ -0.0000,   0.0118] 
	x377: [  0.5529,   0.5765] 
	x378: [  0.9804,   1.0000] 
	x379: [  0.9804,   1.0000] 
	x380: [  0.6471,   0.6706] 
	x381: [  0.0431,   0.0667] 
	x382: [ -0.0000,   0.0118] 
	x383: [ -0.0000,   0.0118] 
	x384: [ -0.0000,   0.0118] 
	x385: [ -0.0000,   0.0118] 
	x386: [  0.4118,   0.4353] 
	x387: [  0.8314,   0.8549] 
	x388: [  0.9804,   1.0000] 
	x389: [  0.9804,   1.0000] 
	x390: [ -0.0000,   0.0118] 
	x391: [ -0.0000,   0.0118] 
	x392: [ -0.0000,   0.0118] 
	x393: [ -0.0000,   0.0118] 
	x394: [ -0.0000,   0.0118] 
	x395: [ -0.0000,   0.0118] 
	x396: [ -0.0000,   0.0118] 
	x397: [ -0.0000,   0.0118] 
	x398: [  0.9843,   1.0000] 
	x399: [  0.9804,   1.0000] 
	x400: [  0.8039,   0.8275] 
	x401: [ -0.0000,   0.0118] 
	x402: [ -0.0000,   0.0118] 
	x403: [ -0.0000,   0.0118] 
	x404: [ -0.0000,   0.0118] 
	x405: [  0.6706,   0.6941] 
	x406: [  0.9804,   1.0000] 
	x407: [  0.9804,   1.0000] 
	x408: [  0.2275,   0.2510] 
	x409: [ -0.0000,   0.0118] 
	x410: [ -0.0000,   0.0118] 
	x411: [ -0.0000,   0.0118] 
	x412: [ -0.0000,   0.0118] 
	x413: [ -0.0000,   0.0118] 
	x414: [ -0.0000,   0.0118] 
	x415: [  0.4275,   0.4510] 
	x416: [  0.9804,   1.0000] 
	x417: [  0.9804,   1.0000] 
	x418: [ -0.0000,   0.0118] 
	x419: [ -0.0000,   0.0118] 
	x420: [ -0.0000,   0.0118] 
	x421: [ -0.0000,   0.0118] 
	x422: [ -0.0000,   0.0118] 
	x423: [ -0.0000,   0.0118] 
	x424: [ -0.0000,   0.0118] 
	x425: [ -0.0000,   0.0118] 
	x426: [  0.9843,   1.0000] 
	x427: [  0.9804,   1.0000] 
	x428: [  0.9098,   0.9333] 
	x429: [ -0.0000,   0.0118] 
	x430: [ -0.0000,   0.0118] 
	x431: [ -0.0000,   0.0118] 
	x432: [ -0.0000,   0.0118] 
	x433: [  0.6706,   0.6941] 
	x434: [  0.9804,   1.0000] 
	x435: [  0.9804,   1.0000] 
	x436: [  0.2275,   0.2510] 
	x437: [ -0.0000,   0.0118] 
	x438: [ -0.0000,   0.0118] 
	x439: [ -0.0000,   0.0118] 
	x440: [ -0.0000,   0.0118] 
	x441: [ -0.0000,   0.0118] 
	x442: [ -0.0000,   0.0118] 
	x443: [  0.4275,   0.4510] 
	x444: [  0.9804,   1.0000] 
	x445: [  0.8275,   0.8510] 
	x446: [ -0.0000,   0.0118] 
	x447: [ -0.0000,   0.0118] 
	x448: [ -0.0000,   0.0118] 
	x449: [ -0.0000,   0.0118] 
	x450: [ -0.0000,   0.0118] 
	x451: [ -0.0000,   0.0118] 
	x452: [ -0.0000,   0.0118] 
	x453: [ -0.0000,   0.0118] 
	x454: [  0.9843,   1.0000] 
	x455: [  0.9804,   1.0000] 
	x456: [  0.9333,   0.9569] 
	x457: [  0.1294,   0.1529] 
	x458: [ -0.0000,   0.0118] 
	x459: [ -0.0000,   0.0118] 
	x460: [ -0.0000,   0.0118] 
	x461: [  0.6706,   0.6941] 
	x462: [  0.9804,   1.0000] 
	x463: [  0.9804,   1.0000] 
	x464: [  0.6314,   0.6549] 
	x465: [ -0.0000,   0.0118] 
	x466: [ -0.0000,   0.0118] 
	x467: [ -0.0000,   0.0118] 
	x468: [ -0.0000,   0.0118] 
	x469: [ -0.0000,   0.0118] 
	x470: [ -0.0000,   0.0118] 
	x471: [  0.4275,   0.4510] 
	x472: [  0.9804,   1.0000] 
	x473: [  0.3294,   0.3529] 
	x474: [ -0.0000,   0.0118] 
	x475: [ -0.0000,   0.0118] 
	x476: [ -0.0000,   0.0118] 
	x477: [ -0.0000,   0.0118] 
	x478: [ -0.0000,   0.0118] 
	x479: [ -0.0000,   0.0118] 
	x480: [ -0.0000,   0.0118] 
	x481: [ -0.0000,   0.0118] 
	x482: [  0.3922,   0.4157] 
	x483: [  0.9804,   1.0000] 
	x484: [  0.9804,   1.0000] 
	x485: [  0.8980,   0.9216] 
	x486: [  0.3216,   0.3451] 
	x487: [ -0.0000,   0.0118] 
	x488: [ -0.0000,   0.0118] 
	x489: [  0.0863,   0.1098] 
	x490: [  0.4784,   0.5020] 
	x491: [  0.8863,   0.9098] 
	x492: [  0.9451,   0.9686] 
	x493: [  0.6980,   0.7216] 
	x494: [  0.2392,   0.2627] 
	x495: [ -0.0000,   0.0118] 
	x496: [ -0.0000,   0.0118] 
	x497: [ -0.0000,   0.0118] 
	x498: [ -0.0000,   0.0118] 
	x499: [  0.6039,   0.6275] 
	x500: [  0.9804,   1.0000] 
	x501: [  0.4275,   0.4510] 
	x502: [ -0.0000,   0.0118] 
	x503: [ -0.0000,   0.0118] 
	x504: [ -0.0000,   0.0118] 
	x505: [ -0.0000,   0.0118] 
	x506: [ -0.0000,   0.0118] 
	x507: [ -0.0000,   0.0118] 
	x508: [ -0.0000,   0.0118] 
	x509: [ -0.0000,   0.0118] 
	x510: [  0.0039,   0.0275] 
	x511: [  0.8000,   0.8235] 
	x512: [  0.9804,   1.0000] 
	x513: [  0.9804,   1.0000] 
	x514: [  0.8039,   0.8275] 
	x515: [ -0.0000,   0.0118] 
	x516: [ -0.0000,   0.0118] 
	x517: [ -0.0000,   0.0118] 
	x518: [ -0.0000,   0.0118] 
	x519: [  0.4353,   0.4588] 
	x520: [  0.8863,   0.9098] 
	x521: [  0.9804,   1.0000] 
	x522: [  0.9451,   0.9686] 
	x523: [  0.3294,   0.3529] 
	x524: [ -0.0000,   0.0118] 
	x525: [ -0.0000,   0.0118] 
	x526: [  0.1529,   0.1765] 
	x527: [  0.9412,   0.9647] 
	x528: [  0.9804,   1.0000] 
	x529: [  0.3059,   0.3294] 
	x530: [ -0.0000,   0.0118] 
	x531: [ -0.0000,   0.0118] 
	x532: [ -0.0000,   0.0118] 
	x533: [ -0.0000,   0.0118] 
	x534: [ -0.0000,   0.0118] 
	x535: [ -0.0000,   0.0118] 
	x536: [ -0.0000,   0.0118] 
	x537: [ -0.0000,   0.0118] 
	x538: [ -0.0000,   0.0118] 
	x539: [  0.0863,   0.1098] 
	x540: [  0.9804,   1.0000] 
	x541: [  0.9804,   1.0000] 
	x542: [  0.9686,   0.9922] 
	x543: [  0.5765,   0.6000] 
	x544: [  0.1294,   0.1529] 
	x545: [ -0.0000,   0.0118] 
	x546: [ -0.0000,   0.0118] 
	x547: [ -0.0000,   0.0118] 
	x548: [  0.1922,   0.2157] 
	x549: [  0.5686,   0.5922] 
	x550: [  0.6980,   0.7216] 
	x551: [  0.9490,   0.9725] 
	x552: [  0.7098,   0.7333] 
	x553: [  0.4039,   0.4275] 
	x554: [  0.8824,   0.9059] 
	x555: [  0.9804,   1.0000] 
	x556: [  0.3608,   0.3843] 
	x557: [ -0.0000,   0.0157] 
	x558: [ -0.0000,   0.0118] 
	x559: [ -0.0000,   0.0118] 
	x560: [ -0.0000,   0.0118] 
	x561: [ -0.0000,   0.0118] 
	x562: [ -0.0000,   0.0118] 
	x563: [ -0.0000,   0.0118] 
	x564: [ -0.0000,   0.0118] 
	x565: [ -0.0000,   0.0118] 
	x566: [ -0.0000,   0.0118] 
	x567: [ -0.0000,   0.0157] 
	x568: [  0.3333,   0.3569] 
	x569: [  0.8000,   0.8235] 
	x570: [  0.9804,   1.0000] 
	x571: [  0.9804,   1.0000] 
	x572: [  0.9373,   0.9608] 
	x573: [  0.8157,   0.8392] 
	x574: [  0.4275,   0.4510] 
	x575: [  0.4275,   0.4510] 
	x576: [  0.4275,   0.4510] 
	x577: [  0.4275,   0.4510] 
	x578: [  0.4510,   0.4745] 
	x579: [  0.6627,   0.6863] 
	x580: [  0.9804,   1.0000] 
	x581: [  0.9804,   1.0000] 
	x582: [  0.8000,   0.8235] 
	x583: [  0.0902,   0.1137] 
	x584: [ -0.0000,   0.0157] 
	x585: [ -0.0000,   0.0118] 
	x586: [ -0.0000,   0.0118] 
	x587: [ -0.0000,   0.0118] 
	x588: [ -0.0000,   0.0118] 
	x589: [ -0.0000,   0.0118] 
	x590: [ -0.0000,   0.0118] 
	x591: [ -0.0000,   0.0118] 
	x592: [ -0.0000,   0.0118] 
	x593: [ -0.0000,   0.0118] 
	x594: [ -0.0000,   0.0118] 
	x595: [ -0.0000,   0.0118] 
	x596: [ -0.0000,   0.0118] 
	x597: [  0.3020,   0.3255] 
	x598: [  0.5176,   0.5412] 
	x599: [  0.8118,   0.8353] 
	x600: [  0.9804,   1.0000] 
	x601: [  0.9804,   1.0000] 
	x602: [  0.9804,   1.0000] 
	x603: [  0.9804,   1.0000] 
	x604: [  0.9804,   1.0000] 
	x605: [  0.9804,   1.0000] 
	x606: [  0.9804,   1.0000] 
	x607: [  0.8235,   0.8471] 
	x608: [  0.5176,   0.5412] 
	x609: [  0.3294,   0.3529] 
	x610: [  0.0157,   0.0392] 
	x611: [ -0.0000,   0.0118] 
	x612: [ -0.0000,   0.0118] 
	x613: [ -0.0000,   0.0118] 
	x614: [ -0.0000,   0.0118] 
	x615: [ -0.0000,   0.0118] 
	x616: [ -0.0000,   0.0118] 
	x617: [ -0.0000,   0.0118] 
	x618: [ -0.0000,   0.0118] 
	x619: [ -0.0000,   0.0118] 
	x620: [ -0.0000,   0.0118] 
	x621: [ -0.0000,   0.0118] 
	x622: [ -0.0000,   0.0118] 
	x623: [ -0.0000,   0.0118] 
	x624: [ -0.0000,   0.0118] 
	x625: [ -0.0000,   0.0118] 
	x626: [ -0.0000,   0.0118] 
	x627: [  0.0039,   0.0275] 
	x628: [  0.0941,   0.1176] 
	x629: [  0.4941,   0.5176] 
	x630: [  0.4941,   0.5176] 
	x631: [  0.4941,   0.5176] 
	x632: [  0.4941,   0.5176] 
	x633: [  0.4941,   0.5176] 
	x634: [  0.4941,   0.5176] 
	x635: [  0.0863,   0.1098] 
	x636: [ -0.0000,   0.0118] 
	x637: [ -0.0000,   0.0118] 
	x638: [ -0.0000,   0.0118] 
	x639: [ -0.0000,   0.0118] 
	x640: [ -0.0000,   0.0118] 
	x641: [ -0.0000,   0.0118] 
	x642: [ -0.0000,   0.0118] 
	x643: [ -0.0000,   0.0118] 
	x644: [ -0.0000,   0.0118] 
	x645: [ -0.0000,   0.0118] 
	x646: [ -0.0000,   0.0118] 
	x647: [ -0.0000,   0.0118] 
	x648: [ -0.0000,   0.0118] 
	x649: [ -0.0000,   0.0118] 
	x650: [ -0.0000,   0.0118] 
	x651: [ -0.0000,   0.0118] 
	x652: [ -0.0000,   0.0118] 
	x653: [ -0.0000,   0.0118] 
	x654: [ -0.0000,   0.0118] 
	x655: [ -0.0000,   0.0118] 
	x656: [ -0.0000,   0.0118] 
	x657: [ -0.0000,   0.0118] 
	x658: [ -0.0000,   0.0118] 
	x659: [ -0.0000,   0.0118] 
	x660: [ -0.0000,   0.0118] 
	x661: [ -0.0000,   0.0118] 
	x662: [ -0.0000,   0.0118] 
	x663: [ -0.0000,   0.0118] 
	x664: [ -0.0000,   0.0118] 
	x665: [ -0.0000,   0.0118] 
	x666: [ -0.0000,   0.0118] 
	x667: [ -0.0000,   0.0118] 
	x668: [ -0.0000,   0.0118] 
	x669: [ -0.0000,   0.0118] 
	x670: [ -0.0000,   0.0118] 
	x671: [ -0.0000,   0.0118] 
	x672: [ -0.0000,   0.0118] 
	x673: [ -0.0000,   0.0118] 
	x674: [ -0.0000,   0.0118] 
	x675: [ -0.0000,   0.0118] 
	x676: [ -0.0000,   0.0118] 
	x677: [ -0.0000,   0.0118] 
	x678: [ -0.0000,   0.0118] 
	x679: [ -0.0000,   0.0118] 
	x680: [ -0.0000,   0.0118] 
	x681: [ -0.0000,   0.0118] 
	x682: [ -0.0000,   0.0118] 
	x683: [ -0.0000,   0.0118] 
	x684: [ -0.0000,   0.0118] 
	x685: [ -0.0000,   0.0118] 
	x686: [ -0.0000,   0.0118] 
	x687: [ -0.0000,   0.0118] 
	x688: [ -0.0000,   0.0118] 
	x689: [ -0.0000,   0.0118] 
	x690: [ -0.0000,   0.0118] 
	x691: [ -0.0000,   0.0118] 
	x692: [ -0.0000,   0.0118] 
	x693: [ -0.0000,   0.0118] 
	x694: [ -0.0000,   0.0118] 
	x695: [ -0.0000,   0.0118] 
	x696: [ -0.0000,   0.0118] 
	x697: [ -0.0000,   0.0118] 
	x698: [ -0.0000,   0.0118] 
	x699: [ -0.0000,   0.0118] 
	x700: [ -0.0000,   0.0118] 
	x701: [ -0.0000,   0.0118] 
	x702: [ -0.0000,   0.0118] 
	x703: [ -0.0000,   0.0118] 
	x704: [ -0.0000,   0.0118] 
	x705: [ -0.0000,   0.0118] 
	x706: [ -0.0000,   0.0118] 
	x707: [ -0.0000,   0.0118] 
	x708: [ -0.0000,   0.0118] 
	x709: [ -0.0000,   0.0118] 
	x710: [ -0.0000,   0.0118] 
	x711: [ -0.0000,   0.0118] 
	x712: [ -0.0000,   0.0118] 
	x713: [ -0.0000,   0.0118] 
	x714: [ -0.0000,   0.0118] 
	x715: [ -0.0000,   0.0118] 
	x716: [ -0.0000,   0.0118] 
	x717: [ -0.0000,   0.0118] 
	x718: [ -0.0000,   0.0118] 
	x719: [ -0.0000,   0.0118] 
	x720: [ -0.0000,   0.0118] 
	x721: [ -0.0000,   0.0118] 
	x722: [ -0.0000,   0.0118] 
	x723: [ -0.0000,   0.0118] 
	x724: [ -0.0000,   0.0118] 
	x725: [ -0.0000,   0.0118] 
	x726: [ -0.0000,   0.0118] 
	x727: [ -0.0000,   0.0118] 
	x728: [ -0.0000,   0.0118] 
	x729: [ -0.0000,   0.0118] 
	x730: [ -0.0000,   0.0118] 
	x731: [ -0.0000,   0.0118] 
	x732: [ -0.0000,   0.0118] 
	x733: [ -0.0000,   0.0118] 
	x734: [ -0.0000,   0.0118] 
	x735: [ -0.0000,   0.0118] 
	x736: [ -0.0000,   0.0118] 
	x737: [ -0.0000,   0.0118] 
	x738: [ -0.0000,   0.0118] 
	x739: [ -0.0000,   0.0118] 
	x740: [ -0.0000,   0.0118] 
	x741: [ -0.0000,   0.0118] 
	x742: [ -0.0000,   0.0118] 
	x743: [ -0.0000,   0.0118] 
	x744: [ -0.0000,   0.0118] 
	x745: [ -0.0000,   0.0118] 
	x746: [ -0.0000,   0.0118] 
	x747: [ -0.0000,   0.0118] 
	x748: [ -0.0000,   0.0118] 
	x749: [ -0.0000,   0.0118] 
	x750: [ -0.0000,   0.0118] 
	x751: [ -0.0000,   0.0118] 
	x752: [ -0.0000,   0.0118] 
	x753: [ -0.0000,   0.0118] 
	x754: [ -0.0000,   0.0118] 
	x755: [ -0.0000,   0.0118] 
	x756: [ -0.0000,   0.0118] 
	x757: [ -0.0000,   0.0118] 
	x758: [ -0.0000,   0.0118] 
	x759: [ -0.0000,   0.0118] 
	x760: [ -0.0000,   0.0118] 
	x761: [ -0.0000,   0.0118] 
	x762: [ -0.0000,   0.0118] 
	x763: [ -0.0000,   0.0118] 
	x764: [ -0.0000,   0.0118] 
	x765: [ -0.0000,   0.0118] 
	x766: [ -0.0000,   0.0118] 
	x767: [ -0.0000,   0.0118] 
	x768: [ -0.0000,   0.0118] 
	x769: [ -0.0000,   0.0118] 
	x770: [ -0.0000,   0.0118] 
	x771: [ -0.0000,   0.0118] 
	x772: [ -0.0000,   0.0118] 
	x773: [ -0.0000,   0.0118] 
	x774: [ -0.0000,   0.0118] 
	x775: [ -0.0000,   0.0118] 
	x776: [ -0.0000,   0.0118] 
	x777: [ -0.0000,   0.0118] 
	x778: [ -0.0000,   0.0118] 
	x779: [ -0.0000,   0.0118] 
	x780: [ -0.0000,   0.0118] 
	x781: [ -0.0000,   0.0118] 
	x782: [ -0.0000,   0.0118] 
	x783: [ -0.0000,   0.0118] 

unsat
[runlim] end:			Thu Oct  3 22:00:17 2024
[runlim] status:		ok
[runlim] result:		0
[runlim] children:		1
[runlim] processes:		2
[runlim] real:			6.99 seconds
[runlim] time:			7.10 seconds
[runlim] space:			99 MB
[runlim] load:			1.13 maximum
[runlim] samples:		70

real	0m7,003s
user	0m7,123s
sys	0m0,288s
