
[VERYDIFF_EXPERIMENT] Running on /home/i57/steuber/NeuroDiff/repos/VeryDiffExperiments/src/../benchmarks/mnist-prune/specs/mnist_80_global_3.vnnlib /home/i57/steuber/NeuroDiff/repos/VeryDiffExperiments/src/../benchmarks/mnist-prune/nets/mnist_relu_2_512.onnx
Parsing /home/i57/steuber/NeuroDiff/repos/VeryDiffExperiments/src/../benchmarks/mnist-prune/nets/mnist_relu_2_512.onnx...
Found input X
op: matmul, weight: (512, 784), bias: nothing
op: bias, weight: nothing, bias: (512,)
op: relu, weight: nothing, bias: nothing
op: matmul, weight: (512, 512), bias: nothing
op: bias, weight: nothing, bias: (512,)
op: relu, weight: nothing, bias: nothing
op: matmul, weight: (10, 512), bias: nothing
op: bias, weight: nothing, bias: (10,)
Parsing /home/i57/steuber/NeuroDiff/repos/VeryDiffExperiments/src/../benchmarks/mnist-prune/nets_pruned/mnist_relu_2_512_pruned5.onnx...
Found input X
op: matmul, weight: (512, 784), bias: nothing
op: bias, weight: nothing, bias: (512,)
op: relu, weight: nothing, bias: nothing
op: matmul, weight: (512, 512), bias: nothing
op: bias, weight: nothing, bias: (512,)
op: relu, weight: nothing, bias: nothing
op: matmul, weight: (10, 512), bias: nothing
op: bias, weight: nothing, bias: (10,)
Distance: 1085.5985166831802
Distance: 1719.8468985003963
Distance: 31.228482716001736
Running with 1 threads
[Thread 1] Time to first task: 0.01s
Instable Generators: 73
Instable Generators: 155
Zono Bounds:
[-10.241094790374964, -6.230265647472397, -8.807616492747822, -7.844527536859543, -9.739088583157027, -7.9059590697837585, -8.816343257512411, -0.9122019932141079, -10.025422250891026, -10.043064167597473]
[2.7928816254176296, 4.028248213582698, 1.3963244166972109, 1.9911773804311896, 1.2144793347226868, 1.1693686086640516, 2.6068422124812356, 9.79478628789366, 1.1491623858451963, 0.43011159550351863]
[Thread 1] Total splits: 0
Processed 1 zonotopes (Work Done: 100.0%); Generated 0 (0.632366746s/loop)
[Thread 1] Finished in 0.63s
 ────────────────────────────────────────────────────────────────────────────────
                                        Time                    Allocations      
                               ───────────────────────   ────────────────────────
       Tot / % measured:            635ms / 100.0%            211MiB / 100.0%    

 Section               ncalls     time    %tot     avg     alloc    %tot      avg
 ────────────────────────────────────────────────────────────────────────────────
 Verify                     1    632ms   99.7%   632ms    202MiB   95.3%   202MiB
   Zonotope Loop            1    632ms   99.7%   632ms    202MiB   95.3%   202MiB
     Property Check         1    387ms   61.0%   387ms   73.6MiB   34.8%  73.6MiB
     Zonotope Propa...      1    235ms   37.1%   235ms    108MiB   51.1%   108MiB
       DiffZonotope...      2    127ms   19.9%  63.3ms   87.9MiB   41.6%  43.9MiB
         Zonotope_R...      4    117ms   18.4%  29.1ms   77.5MiB   36.6%  19.4MiB
           Allocation       4   66.7ms   10.5%  16.7ms   14.7MiB    6.9%  3.67MiB
           Influenc...      4   40.1ms    6.3%  10.0ms   48.0MiB   22.7%  12.0MiB
             Multiply       4   26.7ms    4.2%  6.69ms   25.5MiB   12.1%  6.37MiB
             Alloca...      4   10.4ms    1.6%  2.60ms   22.5MiB   10.6%  5.62MiB
             Set Ma...      4   2.93ms    0.5%   733μs     0.00B    0.0%    0.00B
           Column M...      4   7.84ms    1.2%  1.96ms   14.7MiB    6.9%  3.67MiB
           Set Matrix       4   1.80ms    0.3%   451μs   14.3KiB    0.0%  3.59KiB
           Vectors          4   77.6μs    0.0%  19.4μs    100KiB    0.0%  25.0KiB
           Bounds           4   2.63μs    0.0%   659ns     0.00B    0.0%    0.00B
       DiffZonotope...      3    109ms   17.1%  36.3ms   20.2MiB    9.5%  6.72MiB
         Zonotope_D...      6   52.0ms    8.2%  8.66ms   13.0MiB    6.2%  2.17MiB
 Initialize                 1   2.15ms    0.3%  2.15ms   9.84MiB    4.7%  9.84MiB
 ────────────────────────────────────────────────────────────────────────────────
[VERYDIFF_TIMER] 0.666446861

[VERYDIFF_EXPERIMENT] Running on /home/i57/steuber/NeuroDiff/repos/VeryDiffExperiments/src/../benchmarks/mnist-prune/specs/mnist_80_global_3.vnnlib /home/i57/steuber/NeuroDiff/repos/VeryDiffExperiments/src/../benchmarks/mnist-prune/nets/mnist_relu_3_100.onnx
Parsing /home/i57/steuber/NeuroDiff/repos/VeryDiffExperiments/src/../benchmarks/mnist-prune/nets/mnist_relu_3_100.onnx...
Found input X
op: matmul, weight: (100, 784), bias: nothing
op: bias, weight: nothing, bias: (100,)
op: relu, weight: nothing, bias: nothing
op: matmul, weight: (100, 100), bias: nothing
op: bias, weight: nothing, bias: (100,)
op: relu, weight: nothing, bias: nothing
op: matmul, weight: (10, 100), bias: nothing
op: bias, weight: nothing, bias: (10,)
op: relu, weight: nothing, bias: nothing
op: matmul, weight: (10, 10), bias: nothing
op: bias, weight: nothing, bias: (10,)
Parsing /home/i57/steuber/NeuroDiff/repos/VeryDiffExperiments/src/../benchmarks/mnist-prune/nets_pruned/mnist_relu_3_100_pruned5.onnx...
Found input X
op: matmul, weight: (100, 784), bias: nothing
op: bias, weight: nothing, bias: (100,)
op: relu, weight: nothing, bias: nothing
op: matmul, weight: (100, 100), bias: nothing
op: bias, weight: nothing, bias: (100,)
op: relu, weight: nothing, bias: nothing
op: matmul, weight: (10, 100), bias: nothing
op: bias, weight: nothing, bias: (10,)
op: relu, weight: nothing, bias: nothing
op: matmul, weight: (10, 10), bias: nothing
op: bias, weight: nothing, bias: (10,)
Distance: 296.6600370998244
Distance: 77.24290861755458
Distance: 5.7170369567975285
Distance: 0.0
Running with 1 threads
[Thread 1] Time to first task: 0.0s
Instable Generators: 26
Instable Generators: 20
Instable Generators: 3
Zono Bounds:
[-0.01401081524078807, 0.0, -0.21131802334021482, -0.41145251939547844, -0.03131566157102959, -0.782096262207635, 0.0, 0.10552896488468422, 0.0, -0.23840161863565193]
[0.013921184301094573, 0.0, 0.21131802334021482, 0.41145251939547844, 0.03160982976815217, 0.28763083308760595, 0.0, 0.717983218515085, 0.0, 0.2239310107472353]
[Thread 1] Total splits: 0
Processed 1 zonotopes (Work Done: 100.0%); Generated 0 (0.123452258s/loop)
[Thread 1] Finished in 0.12s
 ────────────────────────────────────────────────────────────────────────────────
                                        Time                    Allocations      
                               ───────────────────────   ────────────────────────
       Tot / % measured:            124ms / 100.0%            145MiB / 100.0%    

 Section               ncalls     time    %tot     avg     alloc    %tot      avg
 ────────────────────────────────────────────────────────────────────────────────
 Verify                     1    123ms   99.6%   123ms    140MiB   96.3%   140MiB
   Zonotope Loop            1    123ms   99.5%   123ms    139MiB   96.3%   139MiB
     Property Check         1   72.3ms   58.3%  72.3ms   48.7MiB   33.6%  48.7MiB
     Zonotope Propa...      1   47.7ms   38.4%  47.7ms   70.9MiB   48.9%  70.9MiB
       DiffZonotope...      3   24.5ms   19.7%  8.16ms   66.8MiB   46.1%  22.3MiB
         Zonotope_R...      6   23.6ms   19.0%  3.93ms   65.2MiB   45.0%  10.9MiB
           Influenc...      6   22.3ms   18.0%  3.72ms   59.9MiB   41.3%  10.0MiB
             Multiply       6   16.8ms   13.6%  2.80ms   30.3MiB   20.9%  5.05MiB
             Set Ma...      6   4.16ms    3.4%   693μs     0.00B    0.0%    0.00B
             Alloca...      6   1.33ms    1.1%   222μs   29.6MiB   20.5%  4.94MiB
           Column M...      6    782μs    0.6%   130μs   2.63MiB    1.8%   450KiB
           Set Matrix       6    316μs    0.3%  52.6μs   4.27KiB    0.0%     728B
           Allocation       6    129μs    0.1%  21.4μs   2.63MiB    1.8%   450KiB
           Vectors          6   30.2μs    0.0%  5.03μs   19.5KiB    0.0%  3.26KiB
           Bounds           6   4.31μs    0.0%   718ns     0.00B    0.0%    0.00B
       DiffZonotope...      4   23.2ms   18.7%  5.79ms   4.10MiB    2.8%  1.02MiB
         Zonotope_D...      8   9.31ms    7.5%  1.16ms   2.70MiB    1.9%   345KiB
 Initialize                 1    554μs    0.4%   554μs   5.41MiB    3.7%  5.41MiB
 ────────────────────────────────────────────────────────────────────────────────
[VERYDIFF_TIMER] 0.149914307

[VERYDIFF_EXPERIMENT] NETWORK: /home/i57/steuber/NeuroDiff/repos/VeryDiffExperiments/src/../benchmarks/mnist-prune/specs/mnist_80_global_3.vnnlib
[VERYDIFF_EXPERIMENT] TIME: 1.424564682
