
[VERYDIFF_EXPERIMENT] Running on /home/i57/steuber/NeuroDiff/repos/VeryDiffExperiments/src/../benchmarks/mnist-prune/specs/mnist_9_local_15.vnnlib /home/i57/steuber/NeuroDiff/repos/VeryDiffExperiments/src/../benchmarks/mnist-prune/nets/mnist_relu_3_100.onnx
Found input X
op: matmul, weight: (100, 784), bias: nothing
op: bias, weight: nothing, bias: (100,)
op: relu, weight: nothing, bias: nothing
op: matmul, weight: (100, 100), bias: nothing
op: bias, weight: nothing, bias: (100,)
op: relu, weight: nothing, bias: nothing
op: matmul, weight: (10, 100), bias: nothing
op: bias, weight: nothing, bias: (10,)
op: relu, weight: nothing, bias: nothing
op: matmul, weight: (10, 10), bias: nothing
op: bias, weight: nothing, bias: (10,)
Found input X
op: gemm, weight: (100, 784), bias: (100,)
op: relu, weight: nothing, bias: nothing
op: gemm, weight: (100, 100), bias: (100,)
op: relu, weight: nothing, bias: nothing
op: gemm, weight: (10, 100), bias: (10,)
op: relu, weight: nothing, bias: nothing
op: gemm, weight: (10, 10), bias: (10,)
Distance: 1958.4889029213523
Distance: 144.28197153992141
Distance: 22.063573056613677
Distance: 0.8412832540489035
Running with 1 threads
[Thread 1] Time to first task: 0.0s
Instable Generators: 26
Instable Generators: 39
Instable Generators: 4
Zono Bounds:
[-0.02279901857538358, 0.016190372581449734, -3.544003649222895, -3.034103340840156, -4.369716874501952, -0.024923229386609062, -0.010829291252747494, -3.811232838025959, -3.6117037203468167, -2.84374628754339]
[-0.013400398649201286, 0.031857756667909354, 3.5530240598878136, 2.99466089167446, 4.799257188745139, -0.005145704917861441, -0.00030296487916058393, 4.338753242593427, 3.895764765525891, 3.553337396577301]
[Thread 1] Processed 100 zonotopes (Work Done: 0.0%; Expected Zonos: Inf)
[Thread 1] Processed 200 zonotopes (Work Done: 0.0%; Expected Zonos: Inf)
[Thread 1] Processed 300 zonotopes (Work Done: 0.0%; Expected Zonos: Inf)
[Thread 1] Processed 400 zonotopes (Work Done: 0.0%; Expected Zonos: Inf)
[Thread 1] Processed 500 zonotopes (Work Done: 0.0%; Expected Zonos: Inf)
[Thread 1] Processed 600 zonotopes (Work Done: 0.0%; Expected Zonos: Inf)
[Thread 1] Processed 700 zonotopes (Work Done: 0.0%; Expected Zonos: Inf)
[Thread 1] Processed 800 zonotopes (Work Done: 0.0%; Expected Zonos: Inf)
[Thread 1] Processed 900 zonotopes (Work Done: 0.0%; Expected Zonos: Inf)
[Thread 1] Processed 1000 zonotopes (Work Done: 0.0%; Expected Zonos: Inf)
[Thread 1] Processed 1100 zonotopes (Work Done: 0.0%; Expected Zonos: Inf)
[Thread 1] Processed 1200 zonotopes (Work Done: 0.0%; Expected Zonos: Inf)
[Thread 1] Processed 1300 zonotopes (Work Done: 0.0%; Expected Zonos: Inf)
[Thread 1] Processed 1400 zonotopes (Work Done: 0.0%; Expected Zonos: Inf)
[Thread 1] Processed 1500 zonotopes (Work Done: 0.0%; Expected Zonos: Inf)
[Thread 1] Processed 1600 zonotopes (Work Done: 0.0%; Expected Zonos: Inf)
[Thread 1] Processed 1700 zonotopes (Work Done: 0.0%; Expected Zonos: Inf)
[Thread 1] Processed 1800 zonotopes (Work Done: 0.0%; Expected Zonos: Inf)
[Thread 1] Processed 1900 zonotopes (Work Done: 0.0%; Expected Zonos: Inf)
[Thread 1] Processed 2000 zonotopes (Work Done: 0.0%; Expected Zonos: Inf)
[Thread 1] Processed 2100 zonotopes (Work Done: 0.0%; Expected Zonos: Inf)
[Thread 1] Processed 2200 zonotopes (Work Done: 0.0%; Expected Zonos: Inf)
[Thread 1] Processed 2300 zonotopes (Work Done: 0.0%; Expected Zonos: Inf)
[Thread 1] Processed 2400 zonotopes (Work Done: 0.0%; Expected Zonos: Inf)
[Thread 1] Processed 2500 zonotopes (Work Done: 0.0%; Expected Zonos: Inf)
[Thread 1] Processed 2600 zonotopes (Work Done: 0.0%; Expected Zonos: Inf)
[Thread 1] Processed 2700 zonotopes (Work Done: 0.0%; Expected Zonos: Inf)
[Thread 1] Processed 2800 zonotopes (Work Done: 0.0%; Expected Zonos: Inf)
[Thread 1] Processed 2900 zonotopes (Work Done: 0.0%; Expected Zonos: Inf)
[Thread 1] Processed 3000 zonotopes (Work Done: 0.0%; Expected Zonos: Inf)
[Thread 1] Processed 3100 zonotopes (Work Done: 0.0%; Expected Zonos: Inf)
[Thread 1] Processed 3200 zonotopes (Work Done: 0.0%; Expected Zonos: Inf)
[Thread 1] Processed 3300 zonotopes (Work Done: 0.0%; Expected Zonos: Inf)
[Thread 1] Processed 3400 zonotopes (Work Done: 0.0%; Expected Zonos: Inf)
[Thread 1] Processed 3500 zonotopes (Work Done: 0.0%; Expected Zonos: Inf)
[Thread 1] Processed 3600 zonotopes (Work Done: 0.0%; Expected Zonos: Inf)
[Thread 1] Processed 3700 zonotopes (Work Done: 0.0%; Expected Zonos: Inf)
[Thread 1] Processed 3800 zonotopes (Work Done: 0.0%; Expected Zonos: Inf)
[Thread 1] Processed 3900 zonotopes (Work Done: 0.0%; Expected Zonos: Inf)
[Thread 1] Processed 4000 zonotopes (Work Done: 0.0%; Expected Zonos: Inf)
[Thread 1] Processed 4100 zonotopes (Work Done: 0.0%; Expected Zonos: Inf)
[Thread 1] Processed 4200 zonotopes (Work Done: 0.0%; Expected Zonos: Inf)
[Thread 1] Processed 4300 zonotopes (Work Done: 0.0%; Expected Zonos: Inf)
[Thread 1] Processed 4400 zonotopes (Work Done: 0.0%; Expected Zonos: Inf)
[Thread 1] Processed 4500 zonotopes (Work Done: 0.0%; Expected Zonos: Inf)
[Thread 1] Processed 4600 zonotopes (Work Done: 0.0%; Expected Zonos: Inf)
[Thread 1] Processed 4700 zonotopes (Work Done: 0.0%; Expected Zonos: Inf)
[Thread 1] Processed 4800 zonotopes (Work Done: 0.0%; Expected Zonos: Inf)
[Thread 1] Processed 4900 zonotopes (Work Done: 0.0%; Expected Zonos: Inf)
[Thread 1] Processed 5000 zonotopes (Work Done: 0.0%; Expected Zonos: Inf)
[Thread 1] Processed 5100 zonotopes (Work Done: 0.0%; Expected Zonos: Inf)
[Thread 1] Processed 5200 zonotopes (Work Done: 0.0%; Expected Zonos: Inf)
[Thread 1] Processed 5300 zonotopes (Work Done: 0.0%; Expected Zonos: Inf)
[Thread 1] Processed 5400 zonotopes (Work Done: 0.0%; Expected Zonos: Inf)
[Thread 1] Processed 5500 zonotopes (Work Done: 0.0%; Expected Zonos: Inf)
[Thread 1] Processed 5600 zonotopes (Work Done: 0.0%; Expected Zonos: Inf)
[Thread 1] Processed 5700 zonotopes (Work Done: 0.0%; Expected Zonos: Inf)
[Thread 1] Processed 5800 zonotopes (Work Done: 0.0%; Expected Zonos: Inf)
[Thread 1] Processed 5900 zonotopes (Work Done: 0.0%; Expected Zonos: Inf)
[Thread 1] Processed 6000 zonotopes (Work Done: 0.0%; Expected Zonos: Inf)
[Thread 1] Processed 6100 zonotopes (Work Done: 0.0%; Expected Zonos: Inf)
[Thread 1] Processed 6200 zonotopes (Work Done: 0.01221%; Expected Zonos: 5.07904e7)
[Thread 1] Processed 6300 zonotopes (Work Done: 0.01221%; Expected Zonos: 5.16096e7)
[Thread 1] Processed 6400 zonotopes (Work Done: 0.01221%; Expected Zonos: 5.24288e7)
[Thread 1] Processed 6500 zonotopes (Work Done: 0.01221%; Expected Zonos: 5.3248e7)
[Thread 1] Processed 6600 zonotopes (Work Done: 0.01221%; Expected Zonos: 5.40672e7)
[Thread 1] Processed 6700 zonotopes (Work Done: 0.01831%; Expected Zonos: 3.6590933333333336e7)
[Thread 1] Processed 6800 zonotopes (Work Done: 0.01831%; Expected Zonos: 3.7137066666666664e7)
[Thread 1] Processed 6900 zonotopes (Work Done: 0.01831%; Expected Zonos: 3.76832e7)
[Thread 1] Processed 7000 zonotopes (Work Done: 0.01831%; Expected Zonos: 3.8229333333333336e7)
[Thread 1] Processed 7100 zonotopes (Work Done: 0.01831%; Expected Zonos: 3.8775466666666664e7)
[Thread 1] Processed 7200 zonotopes (Work Done: 0.01831%; Expected Zonos: 3.93216e7)
[Thread 1] Processed 7300 zonotopes (Work Done: 0.01831%; Expected Zonos: 3.9867733333333336e7)
[Thread 1] Processed 7400 zonotopes (Work Done: 0.01831%; Expected Zonos: 4.0413866666666664e7)
[Thread 1] Processed 7500 zonotopes (Work Done: 0.01831%; Expected Zonos: 4.096e7)
[Thread 1] Processed 7600 zonotopes (Work Done: 0.01831%; Expected Zonos: 4.1506133333333336e7)
[Thread 1] Processed 7700 zonotopes (Work Done: 0.01831%; Expected Zonos: 4.2052266666666664e7)
[Thread 1] Processed 7800 zonotopes (Work Done: 0.01831%; Expected Zonos: 4.25984e7)
[Thread 1] Processed 7900 zonotopes (Work Done: 0.01831%; Expected Zonos: 4.3144533333333336e7)
[Thread 1] Processed 8000 zonotopes (Work Done: 0.01831%; Expected Zonos: 4.3690666666666664e7)
[Thread 1] Processed 8100 zonotopes (Work Done: 0.01831%; Expected Zonos: 4.42368e7)
[Thread 1] Processed 8200 zonotopes (Work Done: 0.01831%; Expected Zonos: 4.4782933333333336e7)
[Thread 1] Processed 8300 zonotopes (Work Done: 0.01831%; Expected Zonos: 4.5329066666666664e7)
[Thread 1] Processed 8400 zonotopes (Work Done: 0.03052%; Expected Zonos: 2.752512e7)
[Thread 1] Processed 8500 zonotopes (Work Done: 0.03052%; Expected Zonos: 2.78528e7)
[Thread 1] Processed 8600 zonotopes (Work Done: 0.03052%; Expected Zonos: 2.818048e7)
[Thread 1] Processed 8700 zonotopes (Work Done: 0.03052%; Expected Zonos: 2.850816e7)
[Thread 1] Processed 8800 zonotopes (Work Done: 0.03662%; Expected Zonos: 2.4029866666666668e7)
[Thread 1] Processed 8900 zonotopes (Work Done: 0.03662%; Expected Zonos: 2.4302933333333332e7)
[Thread 1] Processed 9000 zonotopes (Work Done: 0.03662%; Expected Zonos: 2.4576e7)
[Thread 1] Processed 9100 zonotopes (Work Done: 0.04883%; Expected Zonos: 1.86368e7)
[Thread 1] Processed 9200 zonotopes (Work Done: 0.04883%; Expected Zonos: 1.88416e7)
[Thread 1] Processed 9300 zonotopes (Work Done: 0.04883%; Expected Zonos: 1.90464e7)
[Thread 1] Processed 9400 zonotopes (Work Done: 0.04883%; Expected Zonos: 1.92512e7)
[Thread 1] Processed 9500 zonotopes (Work Done: 0.06104%; Expected Zonos: 1.55648e7)
[Thread 1] Processed 9600 zonotopes (Work Done: 0.06714%; Expected Zonos: 1.4298763636363637e7)
[Thread 1] Processed 9700 zonotopes (Work Done: 0.07324%; Expected Zonos: 1.3243733333333334e7)
[Thread 1] Processed 9800 zonotopes (Work Done: 0.07324%; Expected Zonos: 1.3380266666666666e7)
[Thread 1] Processed 9900 zonotopes (Work Done: 0.07935%; Expected Zonos: 1.2477046153846154e7)
[Thread 1] Processed 10000 zonotopes (Work Done: 0.07935%; Expected Zonos: 1.2603076923076924e7)
[Thread 1] Processed 10100 zonotopes (Work Done: 0.07935%; Expected Zonos: 1.2729107692307692e7)
[Thread 1] Processed 10200 zonotopes (Work Done: 0.07935%; Expected Zonos: 1.2855138461538462e7)
[Thread 1] Processed 10300 zonotopes (Work Done: 0.09766%; Expected Zonos: 1.05472e7)
[Thread 1] Processed 10400 zonotopes (Work Done: 0.10986%; Expected Zonos: 9.466311111111112e6)
[Thread 1] Processed 10500 zonotopes (Work Done: 0.10986%; Expected Zonos: 9.557333333333334e6)
[Thread 1] Processed 10600 zonotopes (Work Done: 0.10986%; Expected Zonos: 9.648355555555556e6)
[Thread 1] Processed 10700 zonotopes (Work Done: 0.14038%; Expected Zonos: 7.622121739130435e6)
[Thread 1] Processed 10800 zonotopes (Work Done: 0.14648%; Expected Zonos: 7.3728e6)
[Thread 1] Processed 10900 zonotopes (Work Done: 0.15259%; Expected Zonos: 7.143424e6)
[Thread 1] Processed 11000 zonotopes (Work Done: 0.16479%; Expected Zonos: 6.674962962962963e6)
[Thread 1] Processed 11100 zonotopes (Work Done: 0.1709%; Expected Zonos: 6.495085714285715e6)
[Thread 1] Processed 11200 zonotopes (Work Done: 0.177%; Expected Zonos: 6.327613793103448e6)
[Thread 1] Processed 11300 zonotopes (Work Done: 0.18311%; Expected Zonos: 6.171306666666667e6)
[Thread 1] Processed 11400 zonotopes (Work Done: 0.19836%; Expected Zonos: 5.747003076923077e6)
[Thread 1] Processed 11500 zonotopes (Work Done: 0.19989%; Expected Zonos: 5.7531603053435115e6)
[Thread 1] Processed 11600 zonotopes (Work Done: 0.2121%; Expected Zonos: 5.469191366906475e6)
[Thread 1] Processed 11700 zonotopes (Work Done: 0.2243%; Expected Zonos: 5.2161306122448975e6)
[Thread 1] Processed 11800 zonotopes (Work Done: 0.24261%; Expected Zonos: 4.863677987421384e6)
[Thread 1] Processed 11900 zonotopes (Work Done: 0.25482%; Expected Zonos: 4.669930538922155e6)
[Thread 1] Processed 12000 zonotopes (Work Done: 0.27313%; Expected Zonos: 4.393474860335195e6)
[Thread 1] Processed 12100 zonotopes (Work Done: 0.27313%; Expected Zonos: 4.430087150837989e6)
[Thread 1] Processed 12200 zonotopes (Work Done: 0.28534%; Expected Zonos: 4.275610695187165e6)
[Thread 1] Processed 12300 zonotopes (Work Done: 0.28534%; Expected Zonos: 4.310656684491979e6)
[Thread 1] Processed 12400 zonotopes (Work Done: 0.29755%; Expected Zonos: 4.167417435897436e6)
[Thread 1] Processed 12500 zonotopes (Work Done: 0.30365%; Expected Zonos: 4.1165829145728643e6)
[Thread 1] Processed 12600 zonotopes (Work Done: 0.31586%; Expected Zonos: 3.9891478260869565e6)
[Thread 1] Processed 12700 zonotopes (Work Done: 0.33417%; Expected Zonos: 3.800489497716895e6)
[Thread 1] Processed 12800 zonotopes (Work Done: 0.33417%; Expected Zonos: 3.830414611872146e6)
[Thread 1] Processed 12900 zonotopes (Work Done: 0.34027%; Expected Zonos: 3.7910959641255606e6)
[Thread 1] Processed 13000 zonotopes (Work Done: 0.37689%; Expected Zonos: 3.4492631578947366e6)
[Thread 1] Processed 13100 zonotopes (Work Done: 0.3952%; Expected Zonos: 3.3147552123552123e6)
[Thread 1] Processed 13200 zonotopes (Work Done: 0.41962%; Expected Zonos: 3.145728e6)
[Thread 1] Processed 13300 zonotopes (Work Done: 0.44403%; Expected Zonos: 2.995287972508591e6)
[Thread 1] Processed 13400 zonotopes (Work Done: 0.47455%; Expected Zonos: 2.823737620578778e6)
[Thread 1] Processed 13500 zonotopes (Work Done: 0.48676%; Expected Zonos: 2.7734670846394985e6)
[Thread 1] Processed 13600 zonotopes (Work Done: 0.49896%; Expected Zonos: 2.72565626911315e6)
[Thread 1] Processed 13700 zonotopes (Work Done: 0.51117%; Expected Zonos: 2.6801289552238807e6)
[Thread 1] Processed 13800 zonotopes (Work Done: 0.52338%; Expected Zonos: 2.636725364431487e6)
[Thread 1] Processed 13900 zonotopes (Work Done: 0.53558%; Expected Zonos: 2.595300284900285e6)
[Thread 1] Processed 14000 zonotopes (Work Done: 0.5722%; Expected Zonos: 2.4466773333333335e6)
[Thread 1] Processed 14100 zonotopes (Work Done: 0.59662%; Expected Zonos: 2.3633186700767265e6)
[Thread 1] Processed 14200 zonotopes (Work Done: 0.60883%; Expected Zonos: 2.3323588972431077e6)
[Thread 1] Processed 14300 zonotopes (Work Done: 0.61188%; Expected Zonos: 2.3370693266832917e6)
[Thread 1] Processed 14400 zonotopes (Work Done: 0.6424%; Expected Zonos: 2.241611401425178e6)
[Thread 1] Processed 14500 zonotopes (Work Done: 0.66681%; Expected Zonos: 2.1745354691075515e6)
[Thread 1] Processed 14600 zonotopes (Work Done: 0.67291%; Expected Zonos: 2.1696725623582765e6)
[Thread 1] Processed 14700 zonotopes (Work Done: 0.69122%; Expected Zonos: 2.1266649006622517e6)
[Thread 1] Processed 14800 zonotopes (Work Done: 0.71487%; Expected Zonos: 2.070294130202775e6)
[Thread 1] Processed 14900 zonotopes (Work Done: 0.75455%; Expected Zonos: 1.974694438827098e6)
[Thread 1] Processed 15000 zonotopes (Work Done: 0.75455%; Expected Zonos: 1.9879474216380182e6)
[Thread 1] Processed 15100 zonotopes (Work Done: 0.76675%; Expected Zonos: 1.9693404975124379e6)
[Thread 1] Processed 15200 zonotopes (Work Done: 0.77896%; Expected Zonos: 1.9513167482859942e6)
[Thread 1] Processed 15300 zonotopes (Work Done: 0.80338%; Expected Zonos: 1.9044649572649573e6)
[Thread 1] Processed 15400 zonotopes (Work Done: 0.83389%; Expected Zonos: 1.84676010978957e6)
[Thread 1] Processed 15500 zonotopes (Work Done: 0.8461%; Expected Zonos: 1.8319350766456267e6)
[Thread 1] Processed 15600 zonotopes (Work Done: 0.86441%; Expected Zonos: 1.804698323036187e6)
[Thread 1] Processed 15700 zonotopes (Work Done: 0.90256%; Expected Zonos: 1.7395016060862215e6)
[Thread 1] Processed 15800 zonotopes (Work Done: 0.95749%; Expected Zonos: 1.650149482071713e6)
[Thread 1] Processed 15900 zonotopes (Work Done: 1.00174%; Expected Zonos: 1.5872389946686977e6)
[Thread 1] Processed 16000 zonotopes (Work Done: 1.02615%; Expected Zonos: 1.559220817843866e6)
[Thread 1] Processed 16100 zonotopes (Work Done: 1.04446%; Expected Zonos: 1.5414603360116873e6)
[Thread 1] Processed 16200 zonotopes (Work Done: 1.05972%; Expected Zonos: 1.5287015118790497e6)
[Thread 1] Processed 16300 zonotopes (Work Done: 1.07193%; Expected Zonos: 1.5206217793594305e6)
[Thread 1] Processed 16400 zonotopes (Work Done: 1.14059%; Expected Zonos: 1.4378466889632107e6)
[Thread 1] Processed 16500 zonotopes (Work Done: 1.19629%; Expected Zonos: 1.379265306122449e6)
[Thread 1] Processed 16600 zonotopes (Work Done: 1.22681%; Expected Zonos: 1.3531064676616916e6)
[Thread 1] Processed 16700 zonotopes (Work Done: 1.23901%; Expected Zonos: 1.3478463054187193e6)
[Thread 1] Processed 16800 zonotopes (Work Done: 1.31073%; Expected Zonos: 1.2817285215366706e6)
[Thread 1] Processed 16900 zonotopes (Work Done: 1.33362%; Expected Zonos: 1.267229290617849e6)
[Thread 1] Processed 17000 zonotopes (Work Done: 1.37558%; Expected Zonos: 1.235842484747643e6)
[Thread 1] Processed 17100 zonotopes (Work Done: 1.41525%; Expected Zonos: 1.2082647978436658e6)
[Thread 1] Processed 17200 zonotopes (Work Done: 1.48315%; Expected Zonos: 1.159690534979424e6)
[Thread 1] Processed 17300 zonotopes (Work Done: 1.49231%; Expected Zonos: 1.159276891615542e6)
[Thread 1] Processed 17400 zonotopes (Work Done: 1.51367%; Expected Zonos: 1.1495225806451612e6)
[Thread 1] Processed 17500 zonotopes (Work Done: 1.52283%; Expected Zonos: 1.1491783567134268e6)
[Thread 1] Processed 17600 zonotopes (Work Done: 1.55182%; Expected Zonos: 1.134152999016716e6)
[Thread 1] Processed 17700 zonotopes (Work Done: 1.58768%; Expected Zonos: 1.1148363286881307e6)
[Thread 1] Processed 17800 zonotopes (Work Done: 1.60904%; Expected Zonos: 1.1062501659554292e6)
[Thread 1] Processed 17900 zonotopes (Work Done: 1.61667%; Expected Zonos: 1.1072151014629542e6)
[Thread 1] Processed 18000 zonotopes (Work Done: 1.6571%; Expected Zonos: 1.086232044198895e6)
[Thread 1] Processed 18100 zonotopes (Work Done: 1.67236%; Expected Zonos: 1.0823007299270073e6)
[Thread 1] Processed 18200 zonotopes (Work Done: 1.7067%; Expected Zonos: 1.0663881984801074e6)
[Thread 1] Processed 18300 zonotopes (Work Done: 1.73721%; Expected Zonos: 1.053411330698287e6)
[Thread 1] Processed 18400 zonotopes (Work Done: 1.79367%; Expected Zonos: 1.0258293492131009e6)
[Thread 1] Processed 18500 zonotopes (Work Done: 1.84174%; Expected Zonos: 1.0044871582435791e6)
[Thread 1] Processed 18600 zonotopes (Work Done: 1.87988%; Expected Zonos: 989423.3766233766)
[Thread 1] Processed 18700 zonotopes (Work Done: 1.92337%; Expected Zonos: 972251.6461721539)
[Thread 1] Processed 18800 zonotopes (Work Done: 1.94626%; Expected Zonos: 965955.9388475107)
[Thread 1] Processed 18900 zonotopes (Work Done: 1.99814%; Expected Zonos: 945880.412371134)
[Thread 1] Processed 19000 zonotopes (Work Done: 2.06299%; Expected Zonos: 920994.0828402367)
[Thread 1] Processed 19100 zonotopes (Work Done: 2.09198%; Expected Zonos: 913010.6491611962)
[Thread 1] Processed 19200 zonotopes (Work Done: 2.13089%; Expected Zonos: 901032.0085929108)
[Thread 1] Processed 19300 zonotopes (Work Done: 2.1904%; Expected Zonos: 881117.9380006966)
[Thread 1] Processed 19400 zonotopes (Work Done: 2.22321%; Expected Zonos: 872613.8641043239)
[Thread 1] Processed 19500 zonotopes (Work Done: 2.23846%; Expected Zonos: 871132.9243353783)
[Thread 1] Processed 19600 zonotopes (Work Done: 2.28577%; Expected Zonos: 857480.3738317757)
[Thread 1] Processed 19700 zonotopes (Work Done: 2.33154%; Expected Zonos: 844934.0314136125)
[Thread 1] Processed 19800 zonotopes (Work Done: 2.39258%; Expected Zonos: 827559.1836734693)
[Thread 1] Processed 19900 zonotopes (Work Done: 2.41699%; Expected Zonos: 823337.3737373737)
[Thread 1] Processed 20000 zonotopes (Work Done: 2.45895%; Expected Zonos: 813354.0179956562)
[Thread 1] Processed 20100 zonotopes (Work Done: 2.50778%; Expected Zonos: 801505.0806206267)
[Thread 1] Processed 20200 zonotopes (Work Done: 2.54135%; Expected Zonos: 794852.7169018313)
[Thread 1] Processed 20300 zonotopes (Work Done: 2.58026%; Expected Zonos: 786742.0461265524)
[Thread 1] Processed 20400 zonotopes (Work Done: 2.64511%; Expected Zonos: 771234.1505624459)
[Thread 1] Processed 20500 zonotopes (Work Done: 2.72446%; Expected Zonos: 752443.5732287874)
[Thread 1] Processed 20600 zonotopes (Work Done: 2.79312%; Expected Zonos: 737526.1403987982)
[Thread 1] Processed 20700 zonotopes (Work Done: 2.82211%; Expected Zonos: 733492.9440389294)
[Thread 1] Processed 20800 zonotopes (Work Done: 2.83966%; Expected Zonos: 732481.8914562063)
[Thread 1] Processed 20900 zonotopes (Work Done: 2.89764%; Expected Zonos: 721275.6187467088)
[Thread 1] Processed 21000 zonotopes (Work Done: 2.97699%; Expected Zonos: 705410.5586878523)
[Thread 1] Processed 21100 zonotopes (Work Done: 3.04413%; Expected Zonos: 693137.6441102757)
[Thread 1] Processed 21200 zonotopes (Work Done: 3.09448%; Expected Zonos: 685090.3353057199)
[Thread 1] Processed 21300 zonotopes (Work Done: 3.11737%; Expected Zonos: 683268.1350954479)
[Thread 1] Processed 21400 zonotopes (Work Done: 3.1662%; Expected Zonos: 675889.3493975904)
[Thread 1] Processed 21500 zonotopes (Work Done: 3.20282%; Expected Zonos: 671283.4683182468)
[Thread 1] Processed 21600 zonotopes (Work Done: 3.25775%; Expected Zonos: 663034.0046838408)
[Thread 1] Processed 21700 zonotopes (Work Done: 3.27377%; Expected Zonos: 662843.7194127243)
[Thread 1] Processed 21800 zonotopes (Work Done: 3.29819%; Expected Zonos: 660969.1417996761)
[Thread 1] Processed 21900 zonotopes (Work Done: 3.37791%; Expected Zonos: 648329.0344438171)
[Thread 1] Processed 22000 zonotopes (Work Done: 3.46184%; Expected Zonos: 635500.6060606061)
[Thread 1] Processed 22100 zonotopes (Work Done: 3.53222%; Expected Zonos: 625669.031805173)
[Thread 1] Processed 22200 zonotopes (Work Done: 3.58181%; Expected Zonos: 619798.370520262)
[Thread 1] Processed 22300 zonotopes (Work Done: 3.64666%; Expected Zonos: 611518.5103823422)
[Thread 1] Processed 22400 zonotopes (Work Done: 3.71761%; Expected Zonos: 602537.1299574162)
[Thread 1] Processed 22500 zonotopes (Work Done: 3.77102%; Expected Zonos: 596655.707854939)
[Thread 1] Processed 22600 zonotopes (Work Done: 3.87783%; Expected Zonos: 582800.0983719443)
[Thread 1] Processed 22700 zonotopes (Work Done: 3.94802%; Expected Zonos: 574971.6218174791)
[Thread 1] Processed 22800 zonotopes (Work Done: 4.00524%; Expected Zonos: 569254.0787656555)
[Thread 1] Processed 22900 zonotopes (Work Done: 4.0678%; Expected Zonos: 562957.5280161297)
[Thread 1] Processed 23000 zonotopes (Work Done: 4.1296%; Expected Zonos: 556954.5979400489)
[Thread 1] Processed 23100 zonotopes (Work Done: 4.20971%; Expected Zonos: 548731.4938154139)
[Thread 1] Processed 23200 zonotopes (Work Done: 4.24633%; Expected Zonos: 546354.1122041055)
[Thread 1] Processed 23300 zonotopes (Work Done: 4.29516%; Expected Zonos: 542471.2642657312)
[Thread 1] Processed 23400 zonotopes (Work Done: 4.37298%; Expected Zonos: 535104.4270946919)
[Thread 1] Processed 23500 zonotopes (Work Done: 4.42638%; Expected Zonos: 530907.3986297238)
[Thread 1] Processed 23600 zonotopes (Work Done: 4.53167%; Expected Zonos: 520779.35940064816)
[Thread 1] Processed 23700 zonotopes (Work Done: 4.61292%; Expected Zonos: 513774.0583005996)
[Thread 1] Processed 23800 zonotopes (Work Done: 4.68235%; Expected Zonos: 508291.7593384659)
[Thread 1] Processed 23900 zonotopes (Work Done: 4.74224%; Expected Zonos: 503981.14467280696)
[Thread 1] Processed 24000 zonotopes (Work Done: 4.7842%; Expected Zonos: 501650.9986843679)
[Thread 1] Processed 24100 zonotopes (Work Done: 4.82693%; Expected Zonos: 499282.44359268184)
[Thread 1] Processed 24200 zonotopes (Work Done: 4.89178%; Expected Zonos: 494707.7474948337)
[Thread 1] Processed 24300 zonotopes (Work Done: 4.93145%; Expected Zonos: 492755.6913556372)
[Thread 1] Processed 24400 zonotopes (Work Done: 4.96845%; Expected Zonos: 491098.59111674153)
[Thread 1] Processed 24500 zonotopes (Work Done: 5.04627%; Expected Zonos: 485506.8979854103)
[Thread 1] Processed 24600 zonotopes (Work Done: 5.08747%; Expected Zonos: 483540.83905072545)
[Thread 1] Processed 24700 zonotopes (Work Done: 5.20802%; Expected Zonos: 474268.94707928953)
[Thread 1] Processed 24800 zonotopes (Work Done: 5.26829%; Expected Zonos: 470741.189674523)
[Thread 1] Processed 24900 zonotopes (Work Done: 5.34611%; Expected Zonos: 465759.43487102643)
[Thread 1] Processed 25000 zonotopes (Work Done: 5.4121%; Expected Zonos: 461927.75330396474)
[Thread 1] Processed 25100 zonotopes (Work Done: 5.49145%; Expected Zonos: 457074.3913028377)
[Thread 1] Processed 25200 zonotopes (Work Done: 5.55477%; Expected Zonos: 453664.0318648491)
[Thread 1] Processed 25300 zonotopes (Work Done: 5.61962%; Expected Zonos: 450208.27478532394)
[Thread 1] Processed 25400 zonotopes (Work Done: 5.69515%; Expected Zonos: 445993.3420409257)
[Thread 1] Processed 25500 zonotopes (Work Done: 5.77755%; Expected Zonos: 441363.5733386154)
[Thread 1] Processed 25600 zonotopes (Work Done: 5.88284%; Expected Zonos: 435164.3095678112)
[Thread 1] Processed 25700 zonotopes (Work Done: 5.96066%; Expected Zonos: 431160.6540590701)
[Thread 1] Processed 25800 zonotopes (Work Done: 6.06518%; Expected Zonos: 425379.11255070916)
[Thread 1] Processed 25900 zonotopes (Work Done: 6.15978%; Expected Zonos: 420469.39773958817)
[Thread 1] Processed 26000 zonotopes (Work Done: 6.23035%; Expected Zonos: 417311.74039491813)
[Thread 1] Processed 26100 zonotopes (Work Done: 6.30817%; Expected Zonos: 413748.8827744686)
[Thread 1] Processed 26200 zonotopes (Work Done: 6.37226%; Expected Zonos: 411157.04151575925)
[Thread 1] Processed 26300 zonotopes (Work Done: 6.45313%; Expected Zonos: 407553.9975763308)
[Thread 1] Processed 26400 zonotopes (Work Done: 6.51073%; Expected Zonos: 405484.2009667497)
[Thread 1] Processed 26500 zonotopes (Work Done: 6.57711%; Expected Zonos: 402912.50761244673)
[Thread 1] Processed 26600 zonotopes (Work Done: 6.62289%; Expected Zonos: 401637.55435878236)
[Thread 1] Processed 26700 zonotopes (Work Done: 6.6637%; Expected Zonos: 400678.066233506)
[Thread 1] Processed 26800 zonotopes (Work Done: 6.70881%; Expected Zonos: 399474.55897195335)
[Thread 1] Processed 26900 zonotopes (Work Done: 6.81181%; Expected Zonos: 394902.409453008)
[Thread 1] Processed 27000 zonotopes (Work Done: 6.86121%; Expected Zonos: 393516.6029605949)
[Thread 1] Processed 27100 zonotopes (Work Done: 6.95124%; Expected Zonos: 389858.6837520065)
[Thread 1] Processed 27200 zonotopes (Work Done: 7.02829%; Expected Zonos: 387007.167184553)
[Thread 1] Processed 27300 zonotopes (Work Done: 7.11527%; Expected Zonos: 383681.9257730301)
[Thread 1] Processed 27400 zonotopes (Work Done: 7.19233%; Expected Zonos: 380961.61873317685)
[Thread 1] Processed 27500 zonotopes (Work Done: 7.30104%; Expected Zonos: 376658.4375040819)
[Thread 1] Processed 27600 zonotopes (Work Done: 7.3926%; Expected Zonos: 373346.46077634586)
[Thread 1] Processed 27700 zonotopes (Work Done: 7.48415%; Expected Zonos: 370115.5140996725)
[Thread 1] Processed 27800 zonotopes (Work Done: 7.55625%; Expected Zonos: 367907.4728963942)
[Thread 1] Processed 27900 zonotopes (Work Done: 7.67012%; Expected Zonos: 363749.3677496363)
[Thread 1] Processed 28000 zonotopes (Work Done: 7.73802%; Expected Zonos: 361849.76398525987)
[Thread 1] Processed 28100 zonotopes (Work Done: 7.80973%; Expected Zonos: 359807.37321561587)
[Thread 1] Processed 28200 zonotopes (Work Done: 7.86047%; Expected Zonos: 358757.1818545794)
[Thread 1] Processed 28300 zonotopes (Work Done: 7.9402%; Expected Zonos: 356414.3311834156)
[Thread 1] Processed 28400 zonotopes (Work Done: 8.02031%; Expected Zonos: 354101.21880165045)
[Thread 1] Processed 28500 zonotopes (Work Done: 8.11434%; Expected Zonos: 351230.13457131106)
[Thread 1] Processed 28600 zonotopes (Work Done: 8.19597%; Expected Zonos: 348951.8809415762)
[Thread 1] Processed 28700 zonotopes (Work Done: 8.31804%; Expected Zonos: 345033.0906547735)
[Thread 1] Processed 28800 zonotopes (Work Done: 8.38709%; Expected Zonos: 343384.94286201603)
[Thread 1] Processed 28900 zonotopes (Work Done: 8.45537%; Expected Zonos: 341794.5477718501)
[Thread 1] Processed 29000 zonotopes (Work Done: 8.59423%; Expected Zonos: 337435.822319873)
[Thread 1] Processed 29100 zonotopes (Work Done: 8.68692%; Expected Zonos: 334986.23983137374)
[Thread 1] Processed 29200 zonotopes (Work Done: 8.76703%; Expected Zonos: 333065.94437011174)
[Thread 1] Processed 29300 zonotopes (Work Done: 8.8788%; Expected Zonos: 329999.4285775663)
[Thread 1] Processed 29400 zonotopes (Work Done: 9.01537%; Expected Zonos: 326109.76484402275)
[Thread 1] Processed 29500 zonotopes (Work Done: 9.10997%; Expected Zonos: 323820.90552211466)
[Thread 1] Processed 29600 zonotopes (Work Done: 9.23014%; Expected Zonos: 320688.63563568733)
[Thread 1] Processed 29700 zonotopes (Work Done: 9.31063%; Expected Zonos: 318990.33279046183)
[Thread 1] Processed 29800 zonotopes (Work Done: 9.39722%; Expected Zonos: 317115.04105056985)
[Thread 1] Processed 29900 zonotopes (Work Done: 9.4697%; Expected Zonos: 315743.9036426075)
[Thread 1] Processed 30000 zonotopes (Work Done: 9.56583%; Expected Zonos: 313616.27037535515)
[Thread 1] Processed 30100 zonotopes (Work Done: 9.66425%; Expected Zonos: 311457.1933252415)
[Thread 1] Processed 30200 zonotopes (Work Done: 9.74741%; Expected Zonos: 309825.8979150564)
[Thread 1] Processed 30300 zonotopes (Work Done: 9.87005%; Expected Zonos: 306989.2535871298)
[Thread 1] Processed 30400 zonotopes (Work Done: 9.9246%; Expected Zonos: 306309.49676650617)
[Thread 1] Processed 30500 zonotopes (Work Done: 9.99289%; Expected Zonos: 305217.1440023668)
[Thread 1] Processed 30600 zonotopes (Work Done: 10.13556%; Expected Zonos: 301907.4850158545)
[Thread 1] Processed 30700 zonotopes (Work Done: 10.25686%; Expected Zonos: 299311.79812368087)
[Thread 1] Processed 30800 zonotopes (Work Done: 10.32743%; Expected Zonos: 298234.7637384455)
[Thread 1] Processed 30900 zonotopes (Work Done: 10.44302%; Expected Zonos: 295891.4221528177)
[Thread 1] Processed 31000 zonotopes (Work Done: 10.57005%; Expected Zonos: 293281.5085487436)
[Thread 1] Processed 31100 zonotopes (Work Done: 10.65207%; Expected Zonos: 291962.1612426698)
[Thread 1] Processed 31200 zonotopes (Work Done: 10.74362%; Expected Zonos: 290404.9638276153)
[Thread 1] Processed 31300 zonotopes (Work Done: 10.83822%; Expected Zonos: 288792.7424393077)
[Thread 1] Processed 31400 zonotopes (Work Done: 10.94465%; Expected Zonos: 286898.0978189835)
[Thread 1] Processed 31500 zonotopes (Work Done: 11.07435%; Expected Zonos: 284441.01513050817)
[Thread 1] Processed 31600 zonotopes (Work Done: 11.24563%; Expected Zonos: 280997.986753619)
[Thread 1] Processed 31700 zonotopes (Work Done: 11.38525%; Expected Zonos: 278430.42309206503)
[Thread 1] Processed 31800 zonotopes (Work Done: 11.50198%; Expected Zonos: 276474.1416335702)
[Thread 1] Processed 31900 zonotopes (Work Done: 11.59658%; Expected Zonos: 275080.9990213735)
[Thread 1] Processed 32000 zonotopes (Work Done: 11.70473%; Expected Zonos: 273393.7245891488)
[Thread 1] Processed 32100 zonotopes (Work Done: 11.82261%; Expected Zonos: 271513.7623115456)
[Thread 1] Processed 32200 zonotopes (Work Done: 11.92636%; Expected Zonos: 269990.062131668)
[Thread 1] Processed 32300 zonotopes (Work Done: 12.01143%; Expected Zonos: 268910.47011091793)
[Thread 1] Processed 32400 zonotopes (Work Done: 12.16822%; Expected Zonos: 266267.44727375323)
[Thread 1] Processed 32500 zonotopes (Work Done: 12.30745%; Expected Zonos: 264067.63112829614)
[Thread 1] Processed 32600 zonotopes (Work Done: 12.42342%; Expected Zonos: 262407.6150120136)
[Thread 1] Processed 32700 zonotopes (Work Done: 12.56037%; Expected Zonos: 260342.69921415285)
[Thread 1] Processed 32800 zonotopes (Work Done: 12.65192%; Expected Zonos: 259249.18252741868)
[Thread 1] Processed 32900 zonotopes (Work Done: 12.80451%; Expected Zonos: 256940.7544780844)
[Thread 1] Processed 33000 zonotopes (Work Done: 12.91094%; Expected Zonos: 255597.22560772928)
[Thread 1] Processed 33100 zonotopes (Work Done: 13.01203%; Expected Zonos: 254380.0294632845)
[Thread 1] Processed 33200 zonotopes (Work Done: 13.12437%; Expected Zonos: 252964.51216765126)
[Thread 1] Processed 33300 zonotopes (Work Done: 13.25712%; Expected Zonos: 251185.73925804434)
[Thread 1] Processed 33400 zonotopes (Work Done: 13.38224%; Expected Zonos: 249584.4473108471)
[Thread 1] Processed 33500 zonotopes (Work Done: 13.49669%; Expected Zonos: 248209.09675459113)
[Thread 1] Processed 33600 zonotopes (Work Done: 13.66072%; Expected Zonos: 245960.73525407873)
[Thread 1] Processed 33700 zonotopes (Work Done: 13.74197%; Expected Zonos: 245234.1247093931)
[Thread 1] Processed 33800 zonotopes (Work Done: 13.86957%; Expected Zonos: 243698.94590636238)
[Thread 1] Processed 33900 zonotopes (Work Done: 13.97333%; Expected Zonos: 242604.994505907)
[Thread 1] Processed 34000 zonotopes (Work Done: 14.13965%; Expected Zonos: 240458.5303341989)
[Thread 1] Processed 34100 zonotopes (Work Done: 14.25409%; Expected Zonos: 239229.5293212458)
[Thread 1] Processed 34200 zonotopes (Work Done: 14.3899%; Expected Zonos: 237666.75635732227)
[Thread 1] Processed 34300 zonotopes (Work Done: 14.55011%; Expected Zonos: 235736.98982099904)
[Thread 1] Processed 34400 zonotopes (Work Done: 14.6245%; Expected Zonos: 235221.71256415106)
[Thread 1] Processed 34500 zonotopes (Work Done: 14.75306%; Expected Zonos: 233849.8613418489)
[Thread 1] Processed 34600 zonotopes (Work Done: 14.91098%; Expected Zonos: 232043.70622885393)
[Thread 1] Processed 34700 zonotopes (Work Done: 14.97984%; Expected Zonos: 231644.67420022283)
[Thread 1] Processed 34800 zonotopes (Work Done: 15.13395%; Expected Zonos: 229946.5300489631)
[Thread 1] Processed 34900 zonotopes (Work Done: 15.20166%; Expected Zonos: 229580.1306139861)
[Thread 1] Processed 35000 zonotopes (Work Done: 15.31343%; Expected Zonos: 228557.4785300144)
[Thread 1] Processed 35100 zonotopes (Work Done: 15.39621%; Expected Zonos: 227978.13194913312)
[Thread 1] Processed 35200 zonotopes (Work Done: 15.54937%; Expected Zonos: 226375.67817868467)
[Thread 1] Processed 35300 zonotopes (Work Done: 15.66305%; Expected Zonos: 225371.15301481378)
[Thread 1] Processed 35400 zonotopes (Work Done: 15.76719%; Expected Zonos: 224516.82019705922)
[Thread 1] Processed 35500 zonotopes (Work Done: 15.86485%; Expected Zonos: 223765.12879083888)
[Thread 1] Processed 35600 zonotopes (Work Done: 15.94934%; Expected Zonos: 223206.66343779335)
[Thread 1] Processed 35700 zonotopes (Work Done: 16.1294%; Expected Zonos: 221334.97626072407)
[Thread 1] Processed 35800 zonotopes (Work Done: 16.2488%; Expected Zonos: 220323.98448183778)
[Thread 1] Processed 35900 zonotopes (Work Done: 16.37697%; Expected Zonos: 219210.2396273111)
[Thread 1] Processed 36000 zonotopes (Work Done: 16.53566%; Expected Zonos: 217711.25042534416)
[Thread 1] Processed 36100 zonotopes (Work Done: 16.62111%; Expected Zonos: 217193.64030180452)
[Thread 1] Processed 36200 zonotopes (Work Done: 16.70237%; Expected Zonos: 216735.76228895094)
[Thread 1] Processed 36300 zonotopes (Work Done: 16.81414%; Expected Zonos: 215889.76626264115)
[Thread 1] Processed 36400 zonotopes (Work Done: 16.94651%; Expected Zonos: 214793.5328114712)
[Thread 1] Processed 36500 zonotopes (Work Done: 17.07945%; Expected Zonos: 213707.1321283593)
[Thread 1] Processed 36600 zonotopes (Work Done: 17.16909%; Expected Zonos: 213173.74007809767)
[Thread 1] Processed 36700 zonotopes (Work Done: 17.25607%; Expected Zonos: 212678.79497963446)
[Thread 1] Processed 36800 zonotopes (Work Done: 17.37127%; Expected Zonos: 211844.00195442242)
[Thread 1] Processed 36900 zonotopes (Work Done: 17.49983%; Expected Zonos: 210859.21122185953)
[Thread 1] Processed 37000 zonotopes (Work Done: 17.61999%; Expected Zonos: 209988.7529159608)
[Thread 1] Processed 37100 zonotopes (Work Done: 17.71498%; Expected Zonos: 209427.30801324325)
[Thread 1] Processed 37200 zonotopes (Work Done: 17.86604%; Expected Zonos: 208216.26676773123)
[Thread 1] Processed 37300 zonotopes (Work Done: 18.02053%; Expected Zonos: 206986.09116263315)
[Thread 1] Processed 37400 zonotopes (Work Done: 18.12887%; Expected Zonos: 206300.7569899261)
[Thread 1] Processed 37500 zonotopes (Work Done: 18.20688%; Expected Zonos: 205966.0683138393)
[Thread 1] Processed 37600 zonotopes (Work Done: 18.35871%; Expected Zonos: 204807.44707929663)
[Thread 1] Processed 37700 zonotopes (Work Done: 18.49833%; Expected Zonos: 203802.23231547308)
[Thread 1] Processed 37800 zonotopes (Work Done: 18.65931%; Expected Zonos: 202579.88622947302)
[Thread 1] Processed 37900 zonotopes (Work Done: 18.80999%; Expected Zonos: 201488.71864812382)
[Thread 1] Processed 38000 zonotopes (Work Done: 18.9641%; Expected Zonos: 200378.61133601202)
[Thread 1] Processed 38100 zonotopes (Work Done: 19.08007%; Expected Zonos: 199684.8367313277)
[Thread 1] Processed 38200 zonotopes (Work Done: 19.18535%; Expected Zonos: 199110.23447480527)
[Thread 1] Processed 38300 zonotopes (Work Done: 19.32745%; Expected Zonos: 198163.75362054247)
[Thread 1] Processed 38400 zonotopes (Work Done: 19.45486%; Expected Zonos: 197379.9793136241)
[Thread 1] Processed 38500 zonotopes (Work Done: 19.57579%; Expected Zonos: 196671.5351225477)
[Thread 1] Processed 38600 zonotopes (Work Done: 19.71159%; Expected Zonos: 195823.8800915376)
[Thread 1] Processed 38700 zonotopes (Work Done: 19.83061%; Expected Zonos: 195152.8630992743)
[Thread 1] Processed 38800 zonotopes (Work Done: 19.98434%; Expected Zonos: 194152.01454538514)
[Thread 1] Processed 38900 zonotopes (Work Done: 20.10775%; Expected Zonos: 193457.78367995447)
[Thread 1] Processed 39000 zonotopes (Work Done: 20.22982%; Expected Zonos: 192784.74484384208)
[Thread 1] Processed 39100 zonotopes (Work Done: 20.32499%; Expected Zonos: 192373.98872951302)
[Thread 1] Processed 39200 zonotopes (Work Done: 20.43209%; Expected Zonos: 191855.0600711332)
[Thread 1] Processed 39300 zonotopes (Work Done: 20.51868%; Expected Zonos: 191532.7477062941)
[Thread 1] Processed 39400 zonotopes (Work Done: 20.61977%; Expected Zonos: 191078.7201568816)
[Thread 1] Processed 39500 zonotopes (Work Done: 20.75424%; Expected Zonos: 190322.53795537257)
[Thread 1] Processed 39600 zonotopes (Work Done: 20.88299%; Expected Zonos: 189628.03620521157)
[Thread 1] Processed 39700 zonotopes (Work Done: 21.02146%; Expected Zonos: 188854.61424695817)
[Thread 1] Processed 39800 zonotopes (Work Done: 21.22421%; Expected Zonos: 187521.67942772925)
[Thread 1] Processed 39900 zonotopes (Work Done: 21.37661%; Expected Zonos: 186652.6094133393)
[Thread 1] Processed 40000 zonotopes (Work Done: 21.51546%; Expected Zonos: 185912.78600746434)
[Thread 1] Processed 40100 zonotopes (Work Done: 21.62685%; Expected Zonos: 185417.6298870241)
[Thread 1] Processed 40200 zonotopes (Work Done: 21.78955%; Expected Zonos: 184492.10084033615)
[Thread 1] Processed 40300 zonotopes (Work Done: 21.92116%; Expected Zonos: 183840.65431131993)
[Thread 1] Processed 40400 zonotopes (Work Done: 22.06516%; Expected Zonos: 183094.0502225872)
[Thread 1] Processed 40500 zonotopes (Work Done: 22.24083%; Expected Zonos: 182097.5249987136)
[Thread 1] Processed 40600 zonotopes (Work Done: 22.43805%; Expected Zonos: 180942.64535872152)
[Thread 1] Processed 40700 zonotopes (Work Done: 22.55554%; Expected Zonos: 180443.458260046)
[Thread 1] Processed 40800 zonotopes (Work Done: 22.67952%; Expected Zonos: 179897.9900089146)
[Thread 1] Processed 40900 zonotopes (Work Done: 22.83173%; Expected Zonos: 179136.6971863931)
[Thread 1] Processed 41000 zonotopes (Work Done: 22.93243%; Expected Zonos: 178786.08024485994)
[Thread 1] Processed 41100 zonotopes (Work Done: 23.0505%; Expected Zonos: 178304.16628741176)
[Thread 1] Processed 41200 zonotopes (Work Done: 23.24085%; Expected Zonos: 177274.04902789518)
[Thread 1] Processed 41300 zonotopes (Work Done: 23.39287%; Expected Zonos: 176549.53606314107)
[Thread 1] Processed 41400 zonotopes (Work Done: 23.52085%; Expected Zonos: 176014.0386159248)
[Thread 1] Processed 41500 zonotopes (Work Done: 23.66085%; Expected Zonos: 175395.21648354304)
[Thread 1] Processed 41600 zonotopes (Work Done: 23.83442%; Expected Zonos: 174537.5021006554)
[Thread 1] Processed 41700 zonotopes (Work Done: 23.94238%; Expected Zonos: 174168.1837373633)
[Thread 1] Processed 41800 zonotopes (Work Done: 24.1087%; Expected Zonos: 173381.42232137913)
[Thread 1] Processed 41900 zonotopes (Work Done: 24.25385%; Expected Zonos: 172756.11198490093)
[Thread 1] Processed 42000 zonotopes (Work Done: 24.37267%; Expected Zonos: 172324.14327414444)
[Thread 1] Processed 42100 zonotopes (Work Done: 24.54586%; Expected Zonos: 171515.6833034167)
[Thread 1] Processed 42200 zonotopes (Work Done: 24.63856%; Expected Zonos: 171276.2612539384)
[Thread 1] Processed 42300 zonotopes (Work Done: 24.86973%; Expected Zonos: 170086.2986908405)
[Thread 1] Processed 42400 zonotopes (Work Done: 24.99599%; Expected Zonos: 169627.17720582063)
[Thread 1] Processed 42500 zonotopes (Work Done: 25.2037%; Expected Zonos: 168626.00272438323)
[Thread 1] Processed 42600 zonotopes (Work Done: 25.41637%; Expected Zonos: 167608.48598551648)
[Thread 1] Processed 42700 zonotopes (Work Done: 25.5806%; Expected Zonos: 166923.39169077514)
[Thread 1] Processed 42800 zonotopes (Work Done: 25.7885%; Expected Zonos: 165965.4630711655)
[Thread 1] Processed 42900 zonotopes (Work Done: 25.93937%; Expected Zonos: 165385.67174275903)
[Thread 1] Processed 43000 zonotopes (Work Done: 26.11351%; Expected Zonos: 164665.72200715798)
[Thread 1] Processed 43100 zonotopes (Work Done: 26.20115%; Expected Zonos: 164496.5789349164)
[Thread 1] Processed 43200 zonotopes (Work Done: 26.32437%; Expected Zonos: 164106.50687785068)
[Thread 1] Processed 43300 zonotopes (Work Done: 26.50213%; Expected Zonos: 163383.0792205689)
[Thread 1] Processed 43400 zonotopes (Work Done: 26.60837%; Expected Zonos: 163106.56072026351)
[Thread 1] Processed 43500 zonotopes (Work Done: 26.74456%; Expected Zonos: 162649.9213727147)
[Thread 1] Processed 43600 zonotopes (Work Done: 26.94197%; Expected Zonos: 161829.31254800767)
[Thread 1] Processed 43700 zonotopes (Work Done: 27.09465%; Expected Zonos: 161286.45163106988)
[Thread 1] Processed 43800 zonotopes (Work Done: 27.2316%; Expected Zonos: 160842.56296752865)
[Thread 1] Processed 43900 zonotopes (Work Done: 27.38142%; Expected Zonos: 160327.69587099247)
[Thread 1] Processed 44000 zonotopes (Work Done: 27.55823%; Expected Zonos: 159661.91529195174)
[Thread 1] Processed 44100 zonotopes (Work Done: 27.66762%; Expected Zonos: 159392.11074191015)
[Thread 1] Processed 44200 zonotopes (Work Done: 27.77081%; Expected Zonos: 159159.95027438377)
[Thread 1] Processed 44300 zonotopes (Work Done: 27.93255%; Expected Zonos: 158596.34133850472)
[Thread 1] Processed 44400 zonotopes (Work Done: 28.09429%; Expected Zonos: 158039.22196951695)
[Thread 1] Processed 44500 zonotopes (Work Done: 28.25003%; Expected Zonos: 157521.97499856527)
[Thread 1] Processed 44600 zonotopes (Work Done: 28.39575%; Expected Zonos: 157065.7683769324)
[Thread 1] Processed 44700 zonotopes (Work Done: 28.56398%; Expected Zonos: 156490.8174882727)
[Thread 1] Processed 44800 zonotopes (Work Done: 28.72038%; Expected Zonos: 155986.80015274527)
[Thread 1] Processed 44900 zonotopes (Work Done: 28.88174%; Expected Zonos: 155461.54460833358)
[Thread 1] Processed 45000 zonotopes (Work Done: 29.06179%; Expected Zonos: 154842.46968677704)
[Thread 1] Processed 45100 zonotopes (Work Done: 29.16861%; Expected Zonos: 154618.29167415932)
[Thread 1] Processed 45200 zonotopes (Work Done: 29.33321%; Expected Zonos: 154091.55702075225)
[Thread 1] Processed 45300 zonotopes (Work Done: 29.47664%; Expected Zonos: 153681.0029603507)
[Thread 1] Processed 45400 zonotopes (Work Done: 29.63409%; Expected Zonos: 153201.9154523454)
[Thread 1] Processed 45500 zonotopes (Work Done: 29.81339%; Expected Zonos: 152616.01453540445)
[Thread 1] Processed 45600 zonotopes (Work Done: 29.97265%; Expected Zonos: 152138.70678299383)
[Thread 1] Processed 45700 zonotopes (Work Done: 30.09052%; Expected Zonos: 151875.06164387905)
[Thread 1] Processed 45800 zonotopes (Work Done: 30.2906%; Expected Zonos: 151202.0049115295)
[Thread 1] Processed 45900 zonotopes (Work Done: 30.45807%; Expected Zonos: 150698.98301688294)
[Thread 1] Processed 46000 zonotopes (Work Done: 30.59359%; Expected Zonos: 150358.31382463052)
[Thread 1] Processed 46100 zonotopes (Work Done: 30.7847%; Expected Zonos: 149749.7021384692)
[Thread 1] Processed 46200 zonotopes (Work Done: 30.92146%; Expected Zonos: 149410.80142489244)
[Thread 1] Processed 46300 zonotopes (Work Done: 31.05497%; Expected Zonos: 149090.45035085295)
[Thread 1] Processed 46400 zonotopes (Work Done: 31.26802%; Expected Zonos: 148394.40874251607)
[Thread 1] Processed 46500 zonotopes (Work Done: 31.39524%; Expected Zonos: 148111.60287117676)
[Thread 1] Processed 46600 zonotopes (Work Done: 31.61497%; Expected Zonos: 147398.5212981928)
[Thread 1] Processed 46700 zonotopes (Work Done: 31.84004%; Expected Zonos: 146670.67784477051)
[Thread 1] Processed 46800 zonotopes (Work Done: 32.00388%; Expected Zonos: 146232.2714066481)
[Thread 1] Processed 46900 zonotopes (Work Done: 32.1805%; Expected Zonos: 145740.4327326286)
[Thread 1] Processed 47000 zonotopes (Work Done: 32.29237%; Expected Zonos: 145545.2349310416)
[Thread 1] Processed 47100 zonotopes (Work Done: 32.46002%; Expected Zonos: 145101.5653645466)
[Thread 1] Processed 47200 zonotopes (Work Done: 32.63893%; Expected Zonos: 144612.57816061054)
[Thread 1] Processed 47300 zonotopes (Work Done: 32.79076%; Expected Zonos: 144247.96938075128)
[Thread 1] Processed 47400 zonotopes (Work Done: 32.91073%; Expected Zonos: 144025.98248593137)
[Thread 1] Processed 47500 zonotopes (Work Done: 33.02326%; Expected Zonos: 143838.00112049995)
[Thread 1] Processed 47600 zonotopes (Work Done: 33.18672%; Expected Zonos: 143430.85853535178)
[Thread 1] Processed 47700 zonotopes (Work Done: 33.35609%; Expected Zonos: 143002.3535869901)
[Thread 1] Processed 47800 zonotopes (Work Done: 33.53233%; Expected Zonos: 142548.98240105572)
[Thread 1] Processed 47900 zonotopes (Work Done: 33.74577%; Expected Zonos: 141943.73435071358)
[Thread 1] Processed 48000 zonotopes (Work Done: 33.90503%; Expected Zonos: 141571.91719171917)
[Thread 1] Processed 48100 zonotopes (Work Done: 34.06487%; Expected Zonos: 141201.20494070483)
[Thread 1] Processed 48200 zonotopes (Work Done: 34.22251%; Expected Zonos: 140842.98186702485)
[Thread 1] Processed 48300 zonotopes (Work Done: 34.37395%; Expected Zonos: 140513.37903711328)
[Thread 1] Processed 48400 zonotopes (Work Done: 34.57403%; Expected Zonos: 139989.45867295572)
[Thread 1] Processed 48500 zonotopes (Work Done: 34.69305%; Expected Zonos: 139797.45067801408)
[Thread 1] Processed 48600 zonotopes (Work Done: 34.84125%; Expected Zonos: 139489.82336856108)
[Thread 1] Processed 48700 zonotopes (Work Done: 34.99355%; Expected Zonos: 139168.49133631663)
[Thread 1] Processed 48800 zonotopes (Work Done: 35.17208%; Expected Zonos: 138746.41085014885)
[Thread 1] Processed 48900 zonotopes (Work Done: 35.34842%; Expected Zonos: 138337.17715935304)
[Thread 1] Processed 49000 zonotopes (Work Done: 35.54487%; Expected Zonos: 137853.92055592075)
[Thread 1] Processed 49100 zonotopes (Work Done: 35.69403%; Expected Zonos: 137558.0291707523)
[Thread 1] Processed 49200 zonotopes (Work Done: 35.85634%; Expected Zonos: 137214.21880360975)
[Thread 1] Processed 49300 zonotopes (Work Done: 36.01313%; Expected Zonos: 136894.52975835817)
[Thread 1] Processed 49400 zonotopes (Work Done: 36.18898%; Expected Zonos: 136505.62865477812)
[Thread 1] Processed 49500 zonotopes (Work Done: 36.41729%; Expected Zonos: 135924.433631957)
[Thread 1] Processed 49600 zonotopes (Work Done: 36.58438%; Expected Zonos: 135576.9967284908)
[Thread 1] Processed 49700 zonotopes (Work Done: 36.75337%; Expected Zonos: 135225.70091881667)
[Thread 1] Processed 49800 zonotopes (Work Done: 36.91149%; Expected Zonos: 134917.34759524086)
[Thread 1] Processed 49900 zonotopes (Work Done: 37.08315%; Expected Zonos: 134562.46679268088)
[Thread 1] Processed 50000 zonotopes (Work Done: 37.23783%; Expected Zonos: 134272.03835407345)
[Thread 1] Processed 50100 zonotopes (Work Done: 37.44078%; Expected Zonos: 133811.32617583007)
[Thread 1] Processed 50200 zonotopes (Work Done: 37.58459%; Expected Zonos: 133565.3755490316)
[Thread 1] Processed 50300 zonotopes (Work Done: 37.76436%; Expected Zonos: 133194.37154661253)
[Thread 1] Processed 50400 zonotopes (Work Done: 37.92267%; Expected Zonos: 132902.0399951716)
[Thread 1] Processed 50500 zonotopes (Work Done: 38.05943%; Expected Zonos: 132687.23720939556)
[Thread 1] Processed 50600 zonotopes (Work Done: 38.25569%; Expected Zonos: 132267.9004836217)
[Thread 1] Processed 50700 zonotopes (Work Done: 38.39912%; Expected Zonos: 132034.26153127826)
[Thread 1] Processed 50800 zonotopes (Work Done: 38.54027%; Expected Zonos: 131810.18895190585)
[Thread 1] Processed 50900 zonotopes (Work Done: 38.75809%; Expected Zonos: 131327.4305623905)
[Thread 1] Processed 51000 zonotopes (Work Done: 38.9389%; Expected Zonos: 130974.4112230103)
[Thread 1] Processed 51100 zonotopes (Work Done: 39.10484%; Expected Zonos: 130674.35104525369)
[Thread 1] Processed 51200 zonotopes (Work Done: 39.29787%; Expected Zonos: 130286.97011172913)
[Thread 1] Processed 51300 zonotopes (Work Done: 39.49966%; Expected Zonos: 129874.52146871922)
[Thread 1] Processed 51400 zonotopes (Work Done: 39.67791%; Expected Zonos: 129543.12647667485)
[Thread 1] Processed 51500 zonotopes (Work Done: 39.86216%; Expected Zonos: 129195.21992415996)
[Thread 1] Processed 51600 zonotopes (Work Done: 40.01303%; Expected Zonos: 128958.00098673155)
[Thread 1] Processed 51700 zonotopes (Work Done: 40.13605%; Expected Zonos: 128811.87481733701)
[Thread 1] Processed 51800 zonotopes (Work Done: 40.27376%; Expected Zonos: 128619.72100468623)
[Thread 1] Processed 51900 zonotopes (Work Done: 40.48033%; Expected Zonos: 128210.42483868003)
[Thread 1] Processed 52000 zonotopes (Work Done: 40.63406%; Expected Zonos: 127971.4606915619)
[Thread 1] Processed 52100 zonotopes (Work Done: 40.79618%; Expected Zonos: 127708.02119786151)
[Thread 1] Processed 52200 zonotopes (Work Done: 40.97967%; Expected Zonos: 127380.23053132047)
[Thread 1] Processed 52300 zonotopes (Work Done: 41.13512%; Expected Zonos: 127141.96409734474)
[Thread 1] Processed 52400 zonotopes (Work Done: 41.34083%; Expected Zonos: 126751.21086991626)
[Thread 1] Processed 52500 zonotopes (Work Done: 41.49609%; Expected Zonos: 126517.95604870403)
[Thread 1] Processed 52600 zonotopes (Work Done: 41.68777%; Expected Zonos: 126176.08023279223)
[Thread 1] Processed 52700 zonotopes (Work Done: 41.86935%; Expected Zonos: 125867.71624847391)
[Thread 1] Processed 52800 zonotopes (Work Done: 42.0536%; Expected Zonos: 125554.04250687131)
[Thread 1] Processed 52900 zonotopes (Work Done: 42.21668%; Expected Zonos: 125305.91451045239)
[Thread 1] Processed 53000 zonotopes (Work Done: 42.43927%; Expected Zonos: 124884.3346636465)
[Thread 1] Processed 53100 zonotopes (Work Done: 42.57565%; Expected Zonos: 124719.18967471407)
[Thread 1] Processed 53200 zonotopes (Work Done: 42.74578%; Expected Zonos: 124456.72724676611)
[Thread 1] Processed 53300 zonotopes (Work Done: 42.93985%; Expected Zonos: 124127.1114052641)
[Thread 1] Processed 53400 zonotopes (Work Done: 43.14356%; Expected Zonos: 123772.82230273235)
[Thread 1] Processed 53500 zonotopes (Work Done: 43.35814%; Expected Zonos: 123390.91550953165)
[Thread 1] Processed 53600 zonotopes (Work Done: 43.47239%; Expected Zonos: 123296.66177461001)
[Thread 1] Processed 53700 zonotopes (Work Done: 43.63623%; Expected Zonos: 123062.8863163002)
[Thread 1] Processed 53800 zonotopes (Work Done: 43.78653%; Expected Zonos: 122868.84859572892)
[Thread 1] Processed 53900 zonotopes (Work Done: 43.92824%; Expected Zonos: 122700.10789781621)
[Thread 1] Processed 54000 zonotopes (Work Done: 44.09647%; Expected Zonos: 122458.78218367811)
[Thread 1] Processed 54100 zonotopes (Work Done: 44.29502%; Expected Zonos: 122135.61264847664)
[Thread 1] Processed 54200 zonotopes (Work Done: 44.41538%; Expected Zonos: 122029.80531596701)
[Thread 1] Processed 54300 zonotopes (Work Done: 44.65933%; Expected Zonos: 121587.13951059927)
[Thread 1] Processed 54400 zonotopes (Work Done: 44.81783%; Expected Zonos: 121380.26551817326)
[Thread 1] Processed 54500 zonotopes (Work Done: 44.94314%; Expected Zonos: 121264.33010866544)
[Thread 1] Processed 54600 zonotopes (Work Done: 45.09878%; Expected Zonos: 121067.57229406104)
[Thread 1] Processed 54700 zonotopes (Work Done: 45.26453%; Expected Zonos: 120845.17342873335)
[Thread 1] Processed 54800 zonotopes (Work Done: 45.43276%; Expected Zonos: 120617.81413401008)
[Thread 1] Processed 54900 zonotopes (Work Done: 45.60385%; Expected Zonos: 120384.57938355175)
[Thread 1] Processed 55000 zonotopes (Work Done: 45.75758%; Expected Zonos: 120198.66486870653)
[Thread 1] Processed 55100 zonotopes (Work Done: 45.92543%; Expected Zonos: 119977.11119832711)
[Thread 1] Processed 55200 zonotopes (Work Done: 46.09537%; Expected Zonos: 119751.72019985724)
[Thread 1] Processed 55300 zonotopes (Work Done: 46.23613%; Expected Zonos: 119603.42641923514)
[Thread 1] Processed 55400 zonotopes (Work Done: 46.37117%; Expected Zonos: 119470.77330602155)
[Thread 1] Processed 55500 zonotopes (Work Done: 46.51661%; Expected Zonos: 119312.2219443089)
[Thread 1] Processed 55600 zonotopes (Work Done: 46.68598%; Expected Zonos: 119093.56495307821)
[Thread 1] Processed 55700 zonotopes (Work Done: 46.94004%; Expected Zonos: 118662.01925225822)
[Thread 1] Processed 55800 zonotopes (Work Done: 47.11628%; Expected Zonos: 118430.40340046554)
[Thread 1] Processed 55900 zonotopes (Work Done: 47.26849%; Expected Zonos: 118260.61019356558)
[Thread 1] Processed 56000 zonotopes (Work Done: 47.4041%; Expected Zonos: 118133.24535073672)
[Thread 1] Processed 56100 zonotopes (Work Done: 47.62783%; Expected Zonos: 117788.27505836841)
[Thread 1] Processed 56200 zonotopes (Work Done: 47.75963%; Expected Zonos: 117672.60760868697)
[Thread 1] Processed 56300 zonotopes (Work Done: 47.95551%; Expected Zonos: 117400.47489310928)
[Thread 1] Processed 56400 zonotopes (Work Done: 48.08168%; Expected Zonos: 117300.38379683164)
[Thread 1] Processed 56500 zonotopes (Work Done: 48.21081%; Expected Zonos: 117193.62961820042)
[Thread 1] Processed 56600 zonotopes (Work Done: 48.36645%; Expected Zonos: 117023.26410455104)
[Thread 1] Processed 56700 zonotopes (Work Done: 48.60258%; Expected Zonos: 116660.47112148891)
[Thread 1] Processed 56800 zonotopes (Work Done: 48.83966%; Expected Zonos: 116298.9152954087)
[Thread 1] Processed 56900 zonotopes (Work Done: 48.98825%; Expected Zonos: 116150.30865579477)
[Thread 1] Processed 57000 zonotopes (Work Done: 49.12138%; Expected Zonos: 116039.08557006261)
[Thread 1] Processed 57100 zonotopes (Work Done: 49.27988%; Expected Zonos: 115868.78741022997)
[Thread 1] Processed 57200 zonotopes (Work Done: 49.46461%; Expected Zonos: 115638.23750563938)
[Thread 1] Processed 57300 zonotopes (Work Done: 49.61872%; Expected Zonos: 115480.60658478925)
[Thread 1] Processed 57400 zonotopes (Work Done: 49.83215%; Expected Zonos: 115186.67401555515)
[Thread 1] Processed 57500 zonotopes (Work Done: 50.00801%; Expected Zonos: 114981.57796373568)
[Thread 1] Processed 57600 zonotopes (Work Done: 50.16079%; Expected Zonos: 114830.72851509771)
[Thread 1] Processed 57700 zonotopes (Work Done: 50.36802%; Expected Zonos: 114556.809373148)
[Thread 1] Processed 57800 zonotopes (Work Done: 50.49353%; Expected Zonos: 114470.11934733872)
[Thread 1] Processed 57900 zonotopes (Work Done: 50.66872%; Expected Zonos: 114271.69282891022)
[Thread 1] Processed 58000 zonotopes (Work Done: 50.82836%; Expected Zonos: 114109.52128996911)
[Thread 1] Processed 58100 zonotopes (Work Done: 51.03912%; Expected Zonos: 113834.24317617866)
[Thread 1] Processed 58200 zonotopes (Work Done: 51.2516%; Expected Zonos: 113557.42558781717)
[Thread 1] Processed 58300 zonotopes (Work Done: 51.39713%; Expected Zonos: 113430.4517402744)
[Thread 1] Processed 58400 zonotopes (Work Done: 51.56517%; Expected Zonos: 113254.74089143703)
[Thread 1] Processed 58500 zonotopes (Work Done: 51.75323%; Expected Zonos: 113036.41241855118)
[Thread 1] Processed 58600 zonotopes (Work Done: 51.90334%; Expected Zonos: 112902.16850468355)
[Thread 1] Processed 58700 zonotopes (Work Done: 52.05841%; Expected Zonos: 112757.95644400152)
[Thread 1] Processed 58800 zonotopes (Work Done: 52.25468%; Expected Zonos: 112525.81315131494)
[Thread 1] Processed 58900 zonotopes (Work Done: 52.45132%; Expected Zonos: 112294.59046677043)
[Thread 1] Processed 59000 zonotopes (Work Done: 52.61164%; Expected Zonos: 112142.49020706107)


TIMEOUT REACHED
UNKNOWN
[Thread 1] Total splits: 42425
Processed 59099 zonotopes (Work Done: 52.8%); Generated 84850 (0.0020305036631076668s/loop)
[Thread 1] Finished in 120.0s
 ────────────────────────────────────────────────────────────────────────────────
                                        Time                    Allocations      
                               ───────────────────────   ────────────────────────
       Tot / % measured:             120s / 100.0%           95.8GiB / 100.0%    

 Section               ncalls     time    %tot     avg     alloc    %tot      avg
 ────────────────────────────────────────────────────────────────────────────────
 Verify                     1     120s  100.0%    120s   95.8GiB  100.0%  95.8GiB
   Zonotope Loop            1     120s  100.0%    120s   95.8GiB  100.0%  95.8GiB
     Zonotope Propa...  59.1k    83.6s   69.6%  1.41ms   42.5GiB   44.3%   753KiB
       DiffZonotope...   236k    54.1s   45.1%   229μs   9.53GiB    9.9%  42.3KiB
         Zonotope_D...   473k    25.9s   21.6%  54.9μs   5.25GiB    5.5%  11.6KiB
       DiffZonotope...   177k    29.1s   24.2%   164μs   32.9GiB   34.3%   195KiB
         Zonotope_R...   355k    15.8s   13.2%  44.6μs   20.1GiB   21.0%  59.6KiB
           Column M...   355k    4.60s    3.8%  13.0μs   7.32GiB    7.6%  21.6KiB
           Influenc...   355k    3.91s    3.3%  11.0μs   4.26GiB    4.4%  12.6KiB
             Multiply    355k    2.93s    2.4%  8.27μs   2.54GiB    2.7%  7.51KiB
             Alloca...   355k    597ms    0.5%  1.68μs   1.72GiB    1.8%  5.07KiB
             Set Ma...   355k    194ms    0.2%   548ns     0.00B    0.0%    0.00B
           Allocation    355k    2.79s    2.3%  7.88μs   7.27GiB    7.6%  21.5KiB
           Vectors       355k    1.87s    1.6%  5.28μs   1.10GiB    1.1%  3.26KiB
           Set Matrix    355k    1.17s    1.0%  3.31μs    196MiB    0.2%     580B
           Bounds        355k   75.1ms    0.1%   212ns     0.00B    0.0%    0.00B
     Property Check     59.1k    7.05s    5.9%   119μs   2.62GiB    2.7%  46.5KiB
     Compute Split      42.4k    4.27s    3.6%   101μs   5.28GiB    5.5%   130KiB
 Initialize                 1    346μs    0.0%   346μs    821KiB    0.0%   821KiB
 ────────────────────────────────────────────────────────────────────────────────
[VERYDIFF_TIMER] 120.033450292

[VERYDIFF_EXPERIMENT] NETWORK: /home/i57/steuber/NeuroDiff/repos/VeryDiffExperiments/src/../benchmarks/mnist-prune/specs/mnist_9_local_15.vnnlib
[VERYDIFF_EXPERIMENT] TIME: 120.511540864
