
[VERYDIFF_EXPERIMENT] Running on /home/i57/steuber/NeuroDiff/repos/VeryDiffExperiments/src/../benchmarks/mnist-prune/specs/mnist_63_local_24.vnnlib /home/i57/steuber/NeuroDiff/repos/VeryDiffExperiments/src/../benchmarks/mnist-prune/nets/mnist_relu_2_512.onnx
Loading /home/i57/steuber/NeuroDiff/repos/VeryDiffExperiments/src/../benchmarks/mnist-prune/nets/mnist_relu_2_512.onnx and /home/i57/steuber/NeuroDiff/repos/VeryDiffExperiments/src/../benchmarks/mnist-prune/nets_pruned/mnist_relu_2_512_0.79-old.onnx
INPUT SHAPE: 784
Refined: 26 | Refine Limit: 7 | Wrong: 0 | Right: 39 | Total: 39 | Total Zonos Considered: 65 | Expected 94663 (0.04119877882594044%)Refined: 71 | Refine Limit: 20 | Wrong: 0 | Right: 100 | Total: 100 | Total Zonos Considered: 171 | Expected 181121 (0.055211709299308194%)Refined: 115 | Refine Limit: 13 | Wrong: 0 | Right: 184 | Total: 184 | Total Zonos Considered: 299 | Expected 332701 (0.055304913420759175%)Refined: 154 | Refine Limit: 13 | Wrong: 0 | Right: 252 | Total: 252 | Total Zonos Considered: 406 | Expected 453916 (0.055516879775112576%)
[NEQUIV] 2.00849437500713

[-91.52197462 -76.61561658 -41.41934691   7.41071036 -91.79082085
 -47.56916018 -99.44760704 -70.52335059 -36.18254415 -44.91768235]
[-91.21849779 -75.55963729 -41.43549271   7.26834158 -91.33187456
 -47.38559696 -98.94648605 -70.35243254 -36.29487425 -44.94645687]
NETWORKS NOT EQUIVALENT
Refined: 155 | Refine Limit: 13 | Wrong: 0 | Right: 254 | Total: 254 | Total Zonos Considered: 409 | Expected 453622 (0.05599375691655166%)

time: 45.797276403

[VERYDIFF_TIMER] 45.820997345

[VERYDIFF_EXPERIMENT] NETWORK: /home/i57/steuber/NeuroDiff/repos/VeryDiffExperiments/src/../benchmarks/mnist-prune/specs/mnist_63_local_24.vnnlib
[VERYDIFF_EXPERIMENT] TIME: 46.121524905
