
[VERYDIFF_EXPERIMENT] Running on /home/i57/steuber/NeuroDiff/repos/VeryDiffExperiments/src/../benchmarks/acas-prune/specs/prop_5.vnnlib /home/i57/steuber/NeuroDiff/repos/VeryDiffExperiments/src/../benchmarks/acas-prune/nets/ACASXU_run2a_1_1_batch_2000.onnx
/home/i57/steuber/NeuroDiff/repos/VeryDiffExperiments/src/../benchmarks/acas-prune/nets/ACASXU_run2a_1_1_batch_2000.onnx
/home/i57/steuber/NeuroDiff/repos/VeryDiffExperiments/src/../benchmarks/acas-prune/nets_pruned/ACASXU_run2a_1_1_batch_2000_pruned10.onnx
[[-0.32427426 -0.32178509]
 [ 0.03183099  0.06366198]
 [-0.4999999  -0.49920412]
 [-0.5        -0.22727273]
 [-0.5        -0.16666667]]
0.05
120
False
50
50
50
50
50
50
50
50
50
50
50
50
Set parameter TimeLimit to value 120
Set parameter Threads to value 1
Set parameter BestObjStop to value 0.05
Set parameter BestBdStop to value 0.05
Gurobi Optimizer version 10.0.0 build v10.0.0rc2 (linux64)

CPU model: Intel(R) Core(TM) i5-6500 CPU @ 3.20GHz, instruction set [SSE2|AVX|AVX2]
Thread count: 4 physical cores, 4 logical processors, using up to 1 threads

Optimize a model with 4273 rows, 1847 columns and 31633 nonzeros
Model fingerprint: 0x1c0c2c31
Variable types: 1232 continuous, 615 integer (615 binary)
Coefficient statistics:
  Matrix range     [1e-05, 2e+06]
  Objective range  [1e+00, 1e+00]
  Bounds range     [3e-02, 1e+00]
  RHS range        [5e-03, 2e+06]
Presolve removed 1863 rows and 393 columns
Presolve time: 0.19s
Presolved: 2410 rows, 1454 columns, 24669 nonzeros
Variable types: 993 continuous, 461 integer (461 binary)

Root relaxation: objective 9.999990e+05, 805 iterations, 0.05 seconds (0.07 work units)

    Nodes    |    Current Node    |     Objective Bounds      |     Work
 Expl Unexpl |  Obj  Depth IntInf | Incumbent    BestBd   Gap | It/Node Time

     0     0 999999.000    0   52          - 999999.000      -     -    0s
     0     0 999999.000    0   56          - 999999.000      -     -    0s
     0     0 507698.731    0   58          - 507698.731      -     -    0s
     0     0 8874.90908    0   56          - 8874.90908      -     -    0s
     0     0 2714.10915    0  115          - 2714.10915      -     -    0s
     0     0 2714.10915    0  111          - 2714.10915      -     -    0s
     0     0 2714.05207    0  248          - 2714.05207      -     -    1s
     0     0 2714.03345    0  262          - 2714.03345      -     -    1s
     0     0 2683.07689    0  249          - 2683.07689      -     -    2s
     0     0 2683.07689    0  280          - 2683.07689      -     -    2s
     0     0 2672.98888    0  400          - 2672.98888      -     -    3s
     0     0 2672.98732    0  399          - 2672.98732      -     -    3s
     0     0 2600.90298    0  402          - 2600.90298      -     -    4s
     0     0 2599.84751    0  414          - 2599.84751      -     -    4s
     0     0 2599.84738    0  413          - 2599.84738      -     -    4s
     0     0 2599.26185    0  421          - 2599.26185      -     -    5s
     0     0 2599.09052    0  426          - 2599.09052      -     -    5s
     0     0 2599.09036    0  426          - 2599.09036      -     -    5s
     0     0 2599.03259    0  421          - 2599.03259      -     -    6s
     0     0 2599.03259    0  404          - 2599.03259      -     -    8s
     0     2 2599.03259    0  404          - 2599.03259      -     -   10s
   135   119 1379.57337   10  261          - 2362.70696      -   286   15s
   356   326   43.19817  122  113          - 2362.70696      -   221   20s
   513   423   68.46336  114  145          - 2362.70696      -   239   26s
   517   426 2210.78318   58  350          - 2362.70696      -   238   30s
   521   429  238.27198   67  397          - 2270.32398      -   236   35s
   526   432 2197.25377   25  417          - 2197.25377      -   234   40s
   531   435 2185.75103   68  430          - 2185.75103      -   231   45s
   533   437  499.76132   30  428          - 2184.86054      -   231   50s
   536   439 2183.19263   30  432          - 2183.19263      -   229   55s
   539   442 2183.19263   49  404          - 2183.19263      -   296   60s
   542   444 1630.88747   74  331          - 1630.88747      -   295   65s
   545   446 1418.46005   29  308          - 1418.46005      -   293   71s
   548   448 1104.37487   20  372          - 1412.50112      -   291   76s
   550   449   34.31299  132  396          - 1412.46675      -   290   81s
   553   451 1381.00463   39  391          - 1381.00463      -   289   86s
   556   453 1379.86618   74  404          - 1379.86618      -   287   90s
   564   460 1379.17921   16  185          - 1379.17921      -   350   96s
   566   462   34.55957  131  386          - 1366.87363      -   349  100s
   568   463  181.98343   82  405          - 1365.85475      -   348  107s
   571   465  263.20933   53  415          - 1363.49887      -   346  112s
   574   467  592.64178   28  424          - 1343.25360      -   344  115s

Cutting planes:
  Gomory: 30
  Cover: 2
  Implied bound: 107
  Projected implied bound: 20
  MIR: 148
  StrongCG: 1
  Flow cover: 249
  RLT: 667
  Relax-and-lift: 52

Explored 576 nodes (232392 simplex iterations) in 120.02 seconds (105.65 work units)
Thread count was 1 (of 4 available processors)

Solution count 0

Time limit reached
Best objective -, best bound 1.342983764298e+03, gap -


TIMEOUT
time: 120.774580518

[VERYDIFF_TIMER] 120.780403018

[VERYDIFF_EXPERIMENT] NETWORK: /home/i57/steuber/NeuroDiff/repos/VeryDiffExperiments/src/../benchmarks/acas-prune/specs/prop_5.vnnlib
[VERYDIFF_EXPERIMENT] TIME: 121.038710467
