Network: ./acas-prune/nets/product_ACASXU_run2a_5_2_batch_2000_ACASXU_run2a_5_2_batch_2000_pruned30_eps.onnx
Property: ./acas-prune/specs/product_prop_1_eps_0.05.vnnlib

Engine::processInputQuery: Input query (before preprocessing): 615 equations, 1220 variables
Engine::processInputQuery: Input query (after preprocessing): 1047 equations, 1505 variables

Input bounds:
	x0: [  0.6000,   0.6799] 
	x1: [ -0.5000,   0.5000] 
	x2: [ -0.5000,   0.5000] 
	x3: [  0.4500,   0.5000] 
	x4: [ -0.5000,  -0.4500] 

Branching heuristics set to LargestInterval

Engine::solve: Initial statistics

04:59:59 Statistics update:
	--- Time Statistics ---
	Total time elapsed: 221 milli (00:00:00)
		Main loop: 0 milli (00:00:00)
		Preprocessing time: 137 milli (00:00:00)
		Unknown: 83 milli (00:00:00)
	Breakdown for main loop:
		[0.00%] Simplex steps: 0 milli
		[0.00%] Explicit-basis bound tightening: 0 milli
		[0.00%] Constraint-matrix bound tightening: 0 milli
		[0.00%] Degradation checking: 0 milli
		[0.00%] Precision restoration: 0 milli
		[0.00%] Statistics handling: 0 milli
		[0.00%] Constraint-fixing steps: 0 milli
		[0.00%] Valid case splits: 0 milli. Average per split: 0.00 milli
		[0.00%] Applying stored bound-tightening: 0 milli
		[0.00%] SMT core: 0 milli
		[0.00%] Symbolic Bound Tightening: 16 milli
		[0.00%] SoI-based local search: 0 milli
		[0.00%] SoI-based local search: 0 milli
		[0.00%] Unaccounted for: 0 milli
	--- Preprocessor Statistics ---
	Number of preprocessor bound-tightening loop iterations: 8
	Number of eliminated variables: 315
	Number of constraints removed due to variable elimination: 147
	Number of equations removed due to variable elimination: 0
	--- Engine Statistics ---
	Number of main loop iterations: 1
		0 iterations were simplex steps. Total time: 0 milli. Average: 0.00 milli.
		0 iterations were constraint-fixing steps. Total time: 0 milli. Average: 0.00 milli
	Number of active piecewise-linear constraints: 440 / 454
		Constraints disabled by valid splits: 14. By SMT-originated splits: 0
	Last reported degradation: 0.0000000000. Max degradation so far: 0.0000000000. Restorations so far: 0
	Number of simplex pivots we attempted to skip because of instability: 0.
	Unstable pivots performed anyway: 0
	--- Tableau Statistics ---
	Total number of pivots performed: 0
		Real pivots: 0. Degenerate: 0 (0.00%)
		Degenerate pivots by request (e.g., to fix a PL constraint): 0 (0.00%)
		Average time per pivot: 0.00 milli
	Total number of fake pivots performed: 0
	Total number of rows added: 0. Number of merged columns: 0
	Current tableau dimensions: M = 1047, N = 2552
	--- SMT Core Statistics ---
	Total depth is 0. Total visited states: 1. Number of splits: 0. Number of pops: 0
	Max stack depth: 0
	--- Bound Tightening Statistics ---
	Number of tightened bounds: 0.
		Number of rows examined by row tightener: 0. Consequent tightenings: 0
		Number of explicit basis matrices examined by row tightener: 0. Consequent tightenings: 0
		Number of bound tightening rounds on the entire constraint matrix: 0. Consequent tightenings: 0
		Number of bound notifications sent to PL constraints: 2728. Tightenings proposed: 0
	--- Basis Factorization statistics ---
	Number of basis refactorizations: 2
	--- Projected Steepest Edge Statistics ---
	Number of iterations: 0.
	Number of resets to reference space: 1. Avg. iterations per reset: 0
	--- SBT ---
	Number of tightened bounds: 1283
	--- SoI-based local search ---
	Number of proposed phase pattern update: 0. Number of accepted update: 0 [0.00%]
	Total time (% of local search time) updating SoI phase pattern : 0 milli [0.00%]
	Total time obtaining current assignment: 0 milli [0.00%]
	Total time getting SoI phase pattern : 0 milli [0.00%]
	--- Context dependent statistics ---
	Number of pushes / pops: 0 / 0
		[0.00%] Pre-Push hook: 0 milli
		[0.00%] Push : 0 milli
		[0.00%] Post-Pop hook: 0 milli
		[0.00%] Pop : 0 milli
		[0.00%] Total context-switching time: 0 milli
	--- Proof Certificate ---
	Number of certified leaves: 0
	Number of leaves to delegate: 0

---

05:00:11 Statistics update:
	--- Time Statistics ---
	Total time elapsed: 12218 milli (00:00:12)
		Main loop: 11994 milli (00:00:11)
		Preprocessing time: 137 milli (00:00:00)
		Unknown: 86 milli (00:00:00)
	Breakdown for main loop:
		[33.85%] Simplex steps: 4060 milli
		[36.60%] Explicit-basis bound tightening: 4389 milli
		[0.00%] Constraint-matrix bound tightening: 0 milli
		[0.30%] Degradation checking: 35 milli
		[0.00%] Precision restoration: 0 milli
		[0.25%] Statistics handling: 30 milli
		[0.00%] Constraint-fixing steps: 0 milli
		[0.09%] Valid case splits: 10 milli. Average per split: 0.00 milli
		[0.03%] Applying stored bound-tightening: 3 milli
		[3.36%] SMT core: 403 milli
		[17.09%] Symbolic Bound Tightening: 2050 milli
		[17.90%] SoI-based local search: 2147 milli
		[0.00%] SoI-based local search: 0 milli
		[8.42%] Unaccounted for: 1009 milli
	--- Preprocessor Statistics ---
	Number of preprocessor bound-tightening loop iterations: 8
	Number of eliminated variables: 315
	Number of constraints removed due to variable elimination: 147
	Number of equations removed due to variable elimination: 0
	--- Engine Statistics ---
	Number of main loop iterations: 10000
		9769 iterations were simplex steps. Total time: 4060 milli. Average: 0.42 milli.
		0 iterations were constraint-fixing steps. Total time: 0 milli. Average: 0.00 milli
	Number of active piecewise-linear constraints: 76 / 454
		Constraints disabled by valid splits: 377. By SMT-originated splits: 1
	Last reported degradation: 0.0000000000. Max degradation so far: 0.0000000258. Restorations so far: 0
	Number of simplex pivots we attempted to skip because of instability: 7.
	Unstable pivots performed anyway: 0
	--- Tableau Statistics ---
	Total number of pivots performed: 8360
		Real pivots: 8338. Degenerate: 22 (0.26%)
		Degenerate pivots by request (e.g., to fix a PL constraint): 0 (0.00%)
		Average time per pivot: 0.12 milli
	Total number of fake pivots performed: 448
	Total number of rows added: 0. Number of merged columns: 0
	Current tableau dimensions: M = 1047, N = 2552
	--- SMT Core Statistics ---
	Total depth is 11. Total visited states: 152. Number of splits: 77. Number of pops: 74
	Max stack depth: 14
	--- Bound Tightening Statistics ---
	Number of tightened bounds: 143710.
		Number of rows examined by row tightener: 8360. Consequent tightenings: 212
		Number of explicit basis matrices examined by row tightener: 57. Consequent tightenings: 7872
		Number of bound tightening rounds on the entire constraint matrix: 0. Consequent tightenings: 0
		Number of bound notifications sent to PL constraints: 223861. Tightenings proposed: 0
	--- Basis Factorization statistics ---
	Number of basis refactorizations: 77
	--- Projected Steepest Edge Statistics ---
	Number of iterations: 8815.
	Number of resets to reference space: 102. Avg. iterations per reset: 86
	--- SBT ---
	Number of tightened bounds: 95510
	--- SoI-based local search ---
	Number of proposed phase pattern update: 404. Number of accepted update: 401 [99.26%]
	Total time (% of local search time) updating SoI phase pattern : 23769 milli [1.11%]
	Total time obtaining current assignment: 154781 milli [7.21%]
	Total time getting SoI phase pattern : 12318 milli [0.10%]
	--- Context dependent statistics ---
	Number of pushes / pops: 177 / 166
		[0.07%] Pre-Push hook: 7 milli
		[0.00%] Push : 0 milli
		[0.07%] Post-Pop hook: 8 milli
		[0.05%] Pop : 6 milli
		[0.19%] Total context-switching time: 22 milli
	--- Proof Certificate ---
	Number of certified leaves: 0
	Number of leaves to delegate: 0

05:00:22 Statistics update:
	--- Time Statistics ---
	Total time elapsed: 22817 milli (00:00:22)
		Main loop: 22575 milli (00:00:22)
		Preprocessing time: 137 milli (00:00:00)
		Unknown: 104 milli (00:00:00)
	Breakdown for main loop:
		[37.62%] Simplex steps: 8493 milli
		[36.35%] Explicit-basis bound tightening: 8206 milli
		[0.00%] Constraint-matrix bound tightening: 0 milli
		[0.32%] Degradation checking: 72 milli
		[0.00%] Precision restoration: 0 milli
		[0.27%] Statistics handling: 59 milli
		[0.00%] Constraint-fixing steps: 0 milli
		[0.07%] Valid case splits: 15 milli. Average per split: 0.00 milli
		[0.03%] Applying stored bound-tightening: 5 milli
		[2.56%] SMT core: 578 milli
		[14.33%] Symbolic Bound Tightening: 3235 milli
		[20.36%] SoI-based local search: 4595 milli
		[0.00%] SoI-based local search: 0 milli
		[8.45%] Unaccounted for: 1908 milli
	--- Preprocessor Statistics ---
	Number of preprocessor bound-tightening loop iterations: 8
	Number of eliminated variables: 315
	Number of constraints removed due to variable elimination: 147
	Number of equations removed due to variable elimination: 0
	--- Engine Statistics ---
	Number of main loop iterations: 20000
		19649 iterations were simplex steps. Total time: 8493 milli. Average: 0.43 milli.
		0 iterations were constraint-fixing steps. Total time: 0 milli. Average: 0.00 milli
	Number of active piecewise-linear constraints: 60 / 454
		Constraints disabled by valid splits: 393. By SMT-originated splits: 1
	Last reported degradation: 0.0000000000. Max degradation so far: 0.0000000258. Restorations so far: 0
	Number of simplex pivots we attempted to skip because of instability: 11.
	Unstable pivots performed anyway: 0
	--- Tableau Statistics ---
	Total number of pivots performed: 16671
		Real pivots: 16629. Degenerate: 42 (0.25%)
		Degenerate pivots by request (e.g., to fix a PL constraint): 0 (0.00%)
		Average time per pivot: 0.13 milli
	Total number of fake pivots performed: 819
	Total number of rows added: 0. Number of merged columns: 0
	Current tableau dimensions: M = 1047, N = 2552
	--- SMT Core Statistics ---
	Total depth is 13. Total visited states: 233. Number of splits: 117. Number of pops: 115
	Max stack depth: 19
	--- Bound Tightening Statistics ---
	Number of tightened bounds: 232004.
		Number of rows examined by row tightener: 16671. Consequent tightenings: 423
		Number of explicit basis matrices examined by row tightener: 106. Consequent tightenings: 19155
		Number of bound tightening rounds on the entire constraint matrix: 0. Consequent tightenings: 0
		Number of bound notifications sent to PL constraints: 371620. Tightenings proposed: 0
	--- Basis Factorization statistics ---
	Number of basis refactorizations: 150
	--- Projected Steepest Edge Statistics ---
	Number of iterations: 17501.
	Number of resets to reference space: 143. Avg. iterations per reset: 122
	--- SBT ---
	Number of tightened bounds: 157175
	--- SoI-based local search ---
	Number of proposed phase pattern update: 969. Number of accepted update: 925 [95.46%]
	Total time (% of local search time) updating SoI phase pattern : 37366 milli [0.81%]
	Total time obtaining current assignment: 361543 milli [7.87%]
	Total time getting SoI phase pattern : 24746 milli [0.11%]
	--- Context dependent statistics ---
	Number of pushes / pops: 258 / 245
		[0.05%] Pre-Push hook: 11 milli
		[0.00%] Push : 0 milli
		[0.06%] Post-Pop hook: 12 milli
		[0.04%] Pop : 9 milli
		[0.15%] Total context-switching time: 34 milli
	--- Proof Certificate ---
	Number of certified leaves: 0
	Number of leaves to delegate: 0

05:00:32 Statistics update:
	--- Time Statistics ---
	Total time elapsed: 33005 milli (00:00:33)
		Main loop: 32750 milli (00:00:32)
		Preprocessing time: 137 milli (00:00:00)
		Unknown: 117 milli (00:00:00)
	Breakdown for main loop:
		[39.46%] Simplex steps: 12922 milli
		[33.92%] Explicit-basis bound tightening: 11108 milli
		[0.00%] Constraint-matrix bound tightening: 0 milli
		[0.34%] Degradation checking: 110 milli
		[0.00%] Precision restoration: 0 milli
		[0.28%] Statistics handling: 90 milli
		[0.00%] Constraint-fixing steps: 0 milli
		[0.07%] Valid case splits: 22 milli. Average per split: 0.00 milli
		[0.03%] Applying stored bound-tightening: 8 milli
		[2.60%] SMT core: 852 milli
		[15.53%] Symbolic Bound Tightening: 5087 milli
		[23.05%] SoI-based local search: 7549 milli
		[0.00%] SoI-based local search: 0 milli
		[7.78%] Unaccounted for: 2547 milli
	--- Preprocessor Statistics ---
	Number of preprocessor bound-tightening loop iterations: 8
	Number of eliminated variables: 315
	Number of constraints removed due to variable elimination: 147
	Number of equations removed due to variable elimination: 0
	--- Engine Statistics ---
	Number of main loop iterations: 30000
		29483 iterations were simplex steps. Total time: 12922 milli. Average: 0.44 milli.
		0 iterations were constraint-fixing steps. Total time: 0 milli. Average: 0.00 milli
	Number of active piecewise-linear constraints: 76 / 454
		Constraints disabled by valid splits: 377. By SMT-originated splits: 1
	Last reported degradation: 0.0000000000. Max degradation so far: 0.0000012015. Restorations so far: 0
	Number of simplex pivots we attempted to skip because of instability: 14.
	Unstable pivots performed anyway: 0
	--- Tableau Statistics ---
	Total number of pivots performed: 24836
		Real pivots: 24784. Degenerate: 52 (0.21%)
		Degenerate pivots by request (e.g., to fix a PL constraint): 0 (0.00%)
		Average time per pivot: 0.13 milli
	Total number of fake pivots performed: 1269
	Total number of rows added: 0. Number of merged columns: 0
	Current tableau dimensions: M = 1047, N = 2552
	--- SMT Core Statistics ---
	Total depth is 11. Total visited states: 351. Number of splits: 172. Number of pops: 178
	Max stack depth: 19
	--- Bound Tightening Statistics ---
	Number of tightened bounds: 351679.
		Number of rows examined by row tightener: 24836. Consequent tightenings: 548
		Number of explicit basis matrices examined by row tightener: 140. Consequent tightenings: 24920
		Number of bound tightening rounds on the entire constraint matrix: 0. Consequent tightenings: 0
		Number of bound notifications sent to PL constraints: 544557. Tightenings proposed: 0
	--- Basis Factorization statistics ---
	Number of basis refactorizations: 221
	--- Projected Steepest Edge Statistics ---
	Number of iterations: 26119.
	Number of resets to reference space: 207. Avg. iterations per reset: 126
	--- SBT ---
	Number of tightened bounds: 248686
	--- SoI-based local search ---
	Number of proposed phase pattern update: 1525. Number of accepted update: 1428 [93.64%]
	Total time (% of local search time) updating SoI phase pattern : 55365 milli [0.73%]
	Total time obtaining current assignment: 574842 milli [7.61%]
	Total time getting SoI phase pattern : 42253 milli [0.13%]
	--- Context dependent statistics ---
	Number of pushes / pops: 377 / 366
		[0.05%] Pre-Push hook: 17 milli
		[0.00%] Push : 0 milli
		[0.06%] Post-Pop hook: 19 milli
		[0.05%] Pop : 14 milli
		[0.16%] Total context-switching time: 52 milli
	--- Proof Certificate ---
	Number of certified leaves: 0
	Number of leaves to delegate: 0

05:00:43 Statistics update:
	--- Time Statistics ---
	Total time elapsed: 43452 milli (00:00:43)
		Main loop: 43189 milli (00:00:43)
		Preprocessing time: 137 milli (00:00:00)
		Unknown: 126 milli (00:00:00)
	Breakdown for main loop:
		[40.31%] Simplex steps: 17408 milli
		[32.65%] Explicit-basis bound tightening: 14099 milli
		[0.00%] Constraint-matrix bound tightening: 0 milli
		[0.34%] Degradation checking: 148 milli
		[0.00%] Precision restoration: 0 milli
		[0.28%] Statistics handling: 120 milli
		[0.00%] Constraint-fixing steps: 0 milli
		[0.07%] Valid case splits: 29 milli. Average per split: 0.00 milli
		[0.02%] Applying stored bound-tightening: 10 milli
		[2.58%] SMT core: 1113 milli
		[16.14%] Symbolic Bound Tightening: 6971 milli
		[24.48%] SoI-based local search: 10574 milli
		[0.00%] SoI-based local search: 0 milli
		[7.61%] Unaccounted for: 3287 milli
	--- Preprocessor Statistics ---
	Number of preprocessor bound-tightening loop iterations: 8
	Number of eliminated variables: 315
	Number of constraints removed due to variable elimination: 147
	Number of equations removed due to variable elimination: 0
	--- Engine Statistics ---
	Number of main loop iterations: 40000
		39322 iterations were simplex steps. Total time: 17408 milli. Average: 0.44 milli.
		0 iterations were constraint-fixing steps. Total time: 0 milli. Average: 0.00 milli
	Number of active piecewise-linear constraints: 107 / 454
		Constraints disabled by valid splits: 346. By SMT-originated splits: 1
	Last reported degradation: 0.0000000000. Max degradation so far: 0.0000012015. Restorations so far: 0
	Number of simplex pivots we attempted to skip because of instability: 14.
	Unstable pivots performed anyway: 0
	--- Tableau Statistics ---
	Total number of pivots performed: 32941
		Real pivots: 32883. Degenerate: 58 (0.18%)
		Degenerate pivots by request (e.g., to fix a PL constraint): 0 (0.00%)
		Average time per pivot: 0.13 milli
	Total number of fake pivots performed: 1692
	Total number of rows added: 0. Number of merged columns: 0
	Current tableau dimensions: M = 1047, N = 2552
	--- SMT Core Statistics ---
	Total depth is 10. Total visited states: 464. Number of splits: 225. Number of pops: 238
	Max stack depth: 19
	--- Bound Tightening Statistics ---
	Number of tightened bounds: 466867.
		Number of rows examined by row tightener: 32941. Consequent tightenings: 678
		Number of explicit basis matrices examined by row tightener: 177. Consequent tightenings: 35299
		Number of bound tightening rounds on the entire constraint matrix: 0. Consequent tightenings: 0
		Number of bound notifications sent to PL constraints: 725170. Tightenings proposed: 0
	--- Basis Factorization statistics ---
	Number of basis refactorizations: 293
	--- Projected Steepest Edge Statistics ---
	Number of iterations: 34647.
	Number of resets to reference space: 268. Avg. iterations per reset: 129
	--- SBT ---
	Number of tightened bounds: 343443
	--- SoI-based local search ---
	Number of proposed phase pattern update: 2131. Number of accepted update: 1980 [92.91%]
	Total time (% of local search time) updating SoI phase pattern : 72856 milli [0.69%]
	Total time obtaining current assignment: 806286 milli [7.63%]
	Total time getting SoI phase pattern : 57318 milli [0.13%]
	--- Context dependent statistics ---
	Number of pushes / pops: 491 / 481
		[0.05%] Pre-Push hook: 23 milli
		[0.00%] Push : 0 milli
		[0.06%] Post-Pop hook: 25 milli
		[0.05%] Pop : 20 milli
		[0.16%] Total context-switching time: 69 milli
	--- Proof Certificate ---
	Number of certified leaves: 0
	Number of leaves to delegate: 0

05:00:54 Statistics update:
	--- Time Statistics ---
	Total time elapsed: 54268 milli (00:00:54)
		Main loop: 54033 milli (00:00:54)
		Preprocessing time: 137 milli (00:00:00)
		Unknown: 97 milli (00:00:00)
	Breakdown for main loop:
		[40.76%] Simplex steps: 22025 milli
		[32.89%] Explicit-basis bound tightening: 17771 milli
		[0.00%] Constraint-matrix bound tightening: 0 milli
		[0.34%] Degradation checking: 186 milli
		[0.00%] Precision restoration: 0 milli
		[0.28%] Statistics handling: 150 milli
		[0.00%] Constraint-fixing steps: 0 milli
		[0.07%] Valid case splits: 36 milli. Average per split: 0.00 milli
		[0.02%] Applying stored bound-tightening: 12 milli
		[2.51%] SMT core: 1356 milli
		[15.67%] Symbolic Bound Tightening: 8466 milli
		[24.84%] SoI-based local search: 13421 milli
		[0.00%] SoI-based local search: 0 milli
		[7.45%] Unaccounted for: 4027 milli
	--- Preprocessor Statistics ---
	Number of preprocessor bound-tightening loop iterations: 8
	Number of eliminated variables: 315
	Number of constraints removed due to variable elimination: 147
	Number of equations removed due to variable elimination: 0
	--- Engine Statistics ---
	Number of main loop iterations: 50000
		49168 iterations were simplex steps. Total time: 22025 milli. Average: 0.45 milli.
		0 iterations were constraint-fixing steps. Total time: 0 milli. Average: 0.00 milli
	Number of active piecewise-linear constraints: 65 / 454
		Constraints disabled by valid splits: 388. By SMT-originated splits: 1
	Last reported degradation: 0.0000000000. Max degradation so far: 0.0000012015. Restorations so far: 0
	Number of simplex pivots we attempted to skip because of instability: 17.
	Unstable pivots performed anyway: 0
	--- Tableau Statistics ---
	Total number of pivots performed: 41343
		Real pivots: 41272. Degenerate: 71 (0.17%)
		Degenerate pivots by request (e.g., to fix a PL constraint): 0 (0.00%)
		Average time per pivot: 0.13 milli
	Total number of fake pivots performed: 2145
	Total number of rows added: 0. Number of merged columns: 0
	Current tableau dimensions: M = 1047, N = 2552
	--- SMT Core Statistics ---
	Total depth is 12. Total visited states: 569. Number of splits: 273. Number of pops: 295
	Max stack depth: 19
	--- Bound Tightening Statistics ---
	Number of tightened bounds: 570586.
		Number of rows examined by row tightener: 41343. Consequent tightenings: 811
		Number of explicit basis matrices examined by row tightener: 221. Consequent tightenings: 41756
		Number of bound tightening rounds on the entire constraint matrix: 0. Consequent tightenings: 0
		Number of bound notifications sent to PL constraints: 879497. Tightenings proposed: 0
	--- Basis Factorization statistics ---
	Number of basis refactorizations: 367
	--- Projected Steepest Edge Statistics ---
	Number of iterations: 43505.
	Number of resets to reference space: 325. Avg. iterations per reset: 133
	--- SBT ---
	Number of tightened bounds: 415972
	--- SoI-based local search ---
	Number of proposed phase pattern update: 2578. Number of accepted update: 2385 [92.51%]
	Total time (% of local search time) updating SoI phase pattern : 89731 milli [0.67%]
	Total time obtaining current assignment: 978836 milli [7.29%]
	Total time getting SoI phase pattern : 73576 milli [0.14%]
	--- Context dependent statistics ---
	Number of pushes / pops: 596 / 584
		[0.05%] Pre-Push hook: 28 milli
		[0.00%] Push : 0 milli
		[0.06%] Post-Pop hook: 32 milli
		[0.05%] Pop : 24 milli
		[0.16%] Total context-switching time: 85 milli
	--- Proof Certificate ---
	Number of certified leaves: 0
	Number of leaves to delegate: 0

05:01:04 Statistics update:
	--- Time Statistics ---
	Total time elapsed: 64937 milli (00:01:04)
		Main loop: 64684 milli (00:01:04)
		Preprocessing time: 137 milli (00:00:00)
		Unknown: 115 milli (00:00:00)
	Breakdown for main loop:
		[41.03%] Simplex steps: 26541 milli
		[32.86%] Explicit-basis bound tightening: 21255 milli
		[0.00%] Constraint-matrix bound tightening: 0 milli
		[0.35%] Degradation checking: 224 milli
		[0.00%] Precision restoration: 0 milli
		[0.28%] Statistics handling: 180 milli
		[0.00%] Constraint-fixing steps: 0 milli
		[0.07%] Valid case splits: 42 milli. Average per split: 0.00 milli
		[0.02%] Applying stored bound-tightening: 14 milli
		[2.46%] SMT core: 1591 milli
		[15.33%] Symbolic Bound Tightening: 9918 milli
		[25.18%] SoI-based local search: 16289 milli
		[0.00%] SoI-based local search: 0 milli
		[7.60%] Unaccounted for: 4915 milli
	--- Preprocessor Statistics ---
	Number of preprocessor bound-tightening loop iterations: 8
	Number of eliminated variables: 315
	Number of constraints removed due to variable elimination: 147
	Number of equations removed due to variable elimination: 0
	--- Engine Statistics ---
	Number of main loop iterations: 60000
		59015 iterations were simplex steps. Total time: 26541 milli. Average: 0.45 milli.
		0 iterations were constraint-fixing steps. Total time: 0 milli. Average: 0.00 milli
	Number of active piecewise-linear constraints: 27 / 454
		Constraints disabled by valid splits: 426. By SMT-originated splits: 1
	Last reported degradation: 0.0000000000. Max degradation so far: 0.0000012015. Restorations so far: 0
	Number of simplex pivots we attempted to skip because of instability: 17.
	Unstable pivots performed anyway: 0
	--- Tableau Statistics ---
	Total number of pivots performed: 49154
		Real pivots: 49064. Degenerate: 90 (0.18%)
		Degenerate pivots by request (e.g., to fix a PL constraint): 0 (0.00%)
		Average time per pivot: 0.13 milli
	Total number of fake pivots performed: 2625
	Total number of rows added: 0. Number of merged columns: 0
	Current tableau dimensions: M = 1047, N = 2552
	--- SMT Core Statistics ---
	Total depth is 17. Total visited states: 674. Number of splits: 323. Number of pops: 350
	Max stack depth: 20
	--- Bound Tightening Statistics ---
	Number of tightened bounds: 669485.
		Number of rows examined by row tightener: 49154. Consequent tightenings: 982
		Number of explicit basis matrices examined by row tightener: 263. Consequent tightenings: 48539
		Number of bound tightening rounds on the entire constraint matrix: 0. Consequent tightenings: 0
		Number of bound notifications sent to PL constraints: 1023666. Tightenings proposed: 0
	--- Basis Factorization statistics ---
	Number of basis refactorizations: 436
	--- Projected Steepest Edge Statistics ---
	Number of iterations: 51796.
	Number of resets to reference space: 381. Avg. iterations per reset: 135
	--- SBT ---
	Number of tightened bounds: 485613
	--- SoI-based local search ---
	Number of proposed phase pattern update: 3317. Number of accepted update: 3080 [92.85%]
	Total time (% of local search time) updating SoI phase pattern : 105711 milli [0.65%]
	Total time obtaining current assignment: 1256292 milli [7.71%]
	Total time getting SoI phase pattern : 87713 milli [0.14%]
	--- Context dependent statistics ---
	Number of pushes / pops: 701 / 684
		[0.05%] Pre-Push hook: 34 milli
		[0.00%] Push : 0 milli
		[0.06%] Post-Pop hook: 37 milli
		[0.04%] Pop : 28 milli
		[0.16%] Total context-switching time: 100 milli
	--- Proof Certificate ---
	Number of certified leaves: 0
	Number of leaves to delegate: 0

05:01:15 Statistics update:
	--- Time Statistics ---
	Total time elapsed: 75404 milli (00:01:15)
		Main loop: 75169 milli (00:01:15)
		Preprocessing time: 137 milli (00:00:00)
		Unknown: 97 milli (00:00:00)
	Breakdown for main loop:
		[41.38%] Simplex steps: 31107 milli
		[32.69%] Explicit-basis bound tightening: 24573 milli
		[0.00%] Constraint-matrix bound tightening: 0 milli
		[0.35%] Degradation checking: 262 milli
		[0.00%] Precision restoration: 0 milli
		[0.28%] Statistics handling: 210 milli
		[0.00%] Constraint-fixing steps: 0 milli
		[0.06%] Valid case splits: 48 milli. Average per split: 0.00 milli
		[0.02%] Applying stored bound-tightening: 16 milli
		[2.41%] SMT core: 1815 milli
		[14.99%] Symbolic Bound Tightening: 11266 milli
		[25.41%] SoI-based local search: 19097 milli
		[0.00%] SoI-based local search: 0 milli
		[7.81%] Unaccounted for: 5868 milli
	--- Preprocessor Statistics ---
	Number of preprocessor bound-tightening loop iterations: 8
	Number of eliminated variables: 315
	Number of constraints removed due to variable elimination: 147
	Number of equations removed due to variable elimination: 0
	--- Engine Statistics ---
	Number of main loop iterations: 70000
		68875 iterations were simplex steps. Total time: 31107 milli. Average: 0.45 milli.
		0 iterations were constraint-fixing steps. Total time: 0 milli. Average: 0.00 milli
	Number of active piecewise-linear constraints: 68 / 454
		Constraints disabled by valid splits: 385. By SMT-originated splits: 1
	Last reported degradation: 0.0000000000. Max degradation so far: 0.0000012015. Restorations so far: 0
	Number of simplex pivots we attempted to skip because of instability: 19.
	Unstable pivots performed anyway: 0
	--- Tableau Statistics ---
	Total number of pivots performed: 56905
		Real pivots: 56790. Degenerate: 115 (0.20%)
		Degenerate pivots by request (e.g., to fix a PL constraint): 0 (0.00%)
		Average time per pivot: 0.13 milli
	Total number of fake pivots performed: 3216
	Total number of rows added: 0. Number of merged columns: 0
	Current tableau dimensions: M = 1047, N = 2552
	--- SMT Core Statistics ---
	Total depth is 11. Total visited states: 768. Number of splits: 365. Number of pops: 402
	Max stack depth: 22
	--- Bound Tightening Statistics ---
	Number of tightened bounds: 754679.
		Number of rows examined by row tightener: 56905. Consequent tightenings: 1148
		Number of explicit basis matrices examined by row tightener: 306. Consequent tightenings: 56871
		Number of bound tightening rounds on the entire constraint matrix: 0. Consequent tightenings: 0
		Number of bound notifications sent to PL constraints: 1154316. Tightenings proposed: 0
	--- Basis Factorization statistics ---
	Number of basis refactorizations: 503
	--- Projected Steepest Edge Statistics ---
	Number of iterations: 60140.
	Number of resets to reference space: 434. Avg. iterations per reset: 138
	--- SBT ---
	Number of tightened bounds: 548340
	--- SoI-based local search ---
	Number of proposed phase pattern update: 4048. Number of accepted update: 3769 [93.11%]
	Total time (% of local search time) updating SoI phase pattern : 120696 milli [0.63%]
	Total time obtaining current assignment: 1531763 milli [8.02%]
	Total time getting SoI phase pattern : 102647 milli [0.14%]
	--- Context dependent statistics ---
	Number of pushes / pops: 795 / 784
		[0.05%] Pre-Push hook: 38 milli
		[0.00%] Push : 0 milli
		[0.06%] Post-Pop hook: 43 milli
		[0.04%] Pop : 33 milli
		[0.15%] Total context-switching time: 115 milli
	--- Proof Certificate ---
	Number of certified leaves: 0
	Number of leaves to delegate: 0

05:01:24 Statistics update:
	--- Time Statistics ---
	Total time elapsed: 84873 milli (00:01:24)
		Main loop: 84564 milli (00:01:24)
		Preprocessing time: 137 milli (00:00:00)
		Unknown: 171 milli (00:00:00)
	Breakdown for main loop:
		[42.04%] Simplex steps: 35551 milli
		[32.21%] Explicit-basis bound tightening: 27241 milli
		[0.00%] Constraint-matrix bound tightening: 0 milli
		[0.36%] Degradation checking: 300 milli
		[0.00%] Precision restoration: 0 milli
		[0.28%] Statistics handling: 239 milli
		[0.00%] Constraint-fixing steps: 0 milli
		[0.06%] Valid case splits: 51 milli. Average per split: 0.00 milli
		[0.02%] Applying stored bound-tightening: 19 milli
		[2.38%] SMT core: 2016 milli
		[14.67%] Symbolic Bound Tightening: 12409 milli
		[26.48%] SoI-based local search: 22392 milli
		[0.00%] SoI-based local search: 0 milli
		[7.96%] Unaccounted for: 6733 milli
	--- Preprocessor Statistics ---
	Number of preprocessor bound-tightening loop iterations: 8
	Number of eliminated variables: 315
	Number of constraints removed due to variable elimination: 147
	Number of equations removed due to variable elimination: 0
	--- Engine Statistics ---
	Number of main loop iterations: 80000
		78725 iterations were simplex steps. Total time: 35551 milli. Average: 0.45 milli.
		0 iterations were constraint-fixing steps. Total time: 0 milli. Average: 0.00 milli
	Number of active piecewise-linear constraints: 19 / 454
		Constraints disabled by valid splits: 433. By SMT-originated splits: 2
	Last reported degradation: 0.0000000000. Max degradation so far: 0.0000012015. Restorations so far: 0
	Number of simplex pivots we attempted to skip because of instability: 19.
	Unstable pivots performed anyway: 0
	--- Tableau Statistics ---
	Total number of pivots performed: 64292
		Real pivots: 64166. Degenerate: 126 (0.20%)
		Degenerate pivots by request (e.g., to fix a PL constraint): 0 (0.00%)
		Average time per pivot: 0.13 milli
	Total number of fake pivots performed: 3543
	Total number of rows added: 0. Number of merged columns: 0
	Current tableau dimensions: M = 1047, N = 2552
	--- SMT Core Statistics ---
	Total depth is 21. Total visited states: 863. Number of splits: 413. Number of pops: 449
	Max stack depth: 22
	--- Bound Tightening Statistics ---
	Number of tightened bounds: 848023.
		Number of rows examined by row tightener: 64292. Consequent tightenings: 1263
		Number of explicit basis matrices examined by row tightener: 337. Consequent tightenings: 65172
		Number of bound tightening rounds on the entire constraint matrix: 0. Consequent tightenings: 0
		Number of bound notifications sent to PL constraints: 1298119. Tightenings proposed: 0
	--- Basis Factorization statistics ---
	Number of basis refactorizations: 565
	--- Projected Steepest Edge Statistics ---
	Number of iterations: 67854.
	Number of resets to reference space: 481. Avg. iterations per reset: 141
	--- SBT ---
	Number of tightened bounds: 607167
	--- SoI-based local search ---
	Number of proposed phase pattern update: 5100. Number of accepted update: 4769 [93.51%]
	Total time (% of local search time) updating SoI phase pattern : 137532 milli [0.61%]
	Total time obtaining current assignment: 1924242 milli [8.59%]
	Total time getting SoI phase pattern : 116613 milli [0.14%]
	--- Context dependent statistics ---
	Number of pushes / pops: 890 / 869
		[0.05%] Pre-Push hook: 43 milli
		[0.00%] Push : 0 milli
		[0.06%] Post-Pop hook: 47 milli
		[0.04%] Pop : 36 milli
		[0.15%] Total context-switching time: 128 milli
	--- Proof Certificate ---
	Number of certified leaves: 0
	Number of leaves to delegate: 0

05:01:35 Statistics update:
	--- Time Statistics ---
	Total time elapsed: 95415 milli (00:01:35)
		Main loop: 95171 milli (00:01:35)
		Preprocessing time: 137 milli (00:00:00)
		Unknown: 106 milli (00:00:00)
	Breakdown for main loop:
		[42.20%] Simplex steps: 40163 milli
		[31.76%] Explicit-basis bound tightening: 30228 milli
		[0.00%] Constraint-matrix bound tightening: 0 milli
		[0.36%] Degradation checking: 339 milli
		[0.00%] Precision restoration: 0 milli
		[0.28%] Statistics handling: 269 milli
		[0.00%] Constraint-fixing steps: 0 milli
		[0.06%] Valid case splits: 58 milli. Average per split: 0.00 milli
		[0.02%] Applying stored bound-tightening: 21 milli
		[2.38%] SMT core: 2265 milli
		[14.79%] Symbolic Bound Tightening: 14079 milli
		[26.46%] SoI-based local search: 25186 milli
		[0.00%] SoI-based local search: 0 milli
		[8.14%] Unaccounted for: 7746 milli
	--- Preprocessor Statistics ---
	Number of preprocessor bound-tightening loop iterations: 8
	Number of eliminated variables: 315
	Number of constraints removed due to variable elimination: 147
	Number of equations removed due to variable elimination: 0
	--- Engine Statistics ---
	Number of main loop iterations: 90000
		88565 iterations were simplex steps. Total time: 40163 milli. Average: 0.45 milli.
		0 iterations were constraint-fixing steps. Total time: 0 milli. Average: 0.00 milli
	Number of active piecewise-linear constraints: 58 / 454
		Constraints disabled by valid splits: 395. By SMT-originated splits: 1
	Last reported degradation: 0.0000000000. Max degradation so far: 0.0007120233. Restorations so far: 0
	Number of simplex pivots we attempted to skip because of instability: 19.
	Unstable pivots performed anyway: 0
	--- Tableau Statistics ---
	Total number of pivots performed: 72029
		Real pivots: 71879. Degenerate: 150 (0.21%)
		Degenerate pivots by request (e.g., to fix a PL constraint): 0 (0.00%)
		Average time per pivot: 0.14 milli
	Total number of fake pivots performed: 4108
	Total number of rows added: 0. Number of merged columns: 0
	Current tableau dimensions: M = 1047, N = 2552
	--- SMT Core Statistics ---
	Total depth is 13. Total visited states: 969. Number of splits: 462. Number of pops: 506
	Max stack depth: 22
	--- Bound Tightening Statistics ---
	Number of tightened bounds: 945496.
		Number of rows examined by row tightener: 72029. Consequent tightenings: 1463
		Number of explicit basis matrices examined by row tightener: 376. Consequent tightenings: 73609
		Number of bound tightening rounds on the entire constraint matrix: 0. Consequent tightenings: 0
		Number of bound notifications sent to PL constraints: 1447986. Tightenings proposed: 0
	--- Basis Factorization statistics ---
	Number of basis refactorizations: 633
	--- Projected Steepest Edge Statistics ---
	Number of iterations: 76156.
	Number of resets to reference space: 540. Avg. iterations per reset: 141
	--- SBT ---
	Number of tightened bounds: 684628
	--- SoI-based local search ---
	Number of proposed phase pattern update: 5832. Number of accepted update: 5455 [93.54%]
	Total time (% of local search time) updating SoI phase pattern : 154795 milli [0.61%]
	Total time obtaining current assignment: 2205095 milli [8.76%]
	Total time getting SoI phase pattern : 132242 milli [0.14%]
	--- Context dependent statistics ---
	Number of pushes / pops: 996 / 983
		[0.05%] Pre-Push hook: 48 milli
		[0.00%] Push : 0 milli
		[0.06%] Post-Pop hook: 54 milli
		[0.04%] Pop : 42 milli
		[0.15%] Total context-switching time: 145 milli
	--- Proof Certificate ---
	Number of certified leaves: 0
	Number of leaves to delegate: 0

05:01:46 Statistics update:
	--- Time Statistics ---
	Total time elapsed: 106546 milli (00:01:46)
		Main loop: 106306 milli (00:01:46)
		Preprocessing time: 137 milli (00:00:00)
		Unknown: 102 milli (00:00:00)
	Breakdown for main loop:
		[42.12%] Simplex steps: 44779 milli
		[31.93%] Explicit-basis bound tightening: 33942 milli
		[0.00%] Constraint-matrix bound tightening: 0 milli
		[0.36%] Degradation checking: 377 milli
		[0.00%] Precision restoration: 0 milli
		[0.28%] Statistics handling: 299 milli
		[0.00%] Constraint-fixing steps: 0 milli
		[0.06%] Valid case splits: 65 milli. Average per split: 0.00 milli
		[0.02%] Applying stored bound-tightening: 23 milli
		[2.37%] SMT core: 2523 milli
		[14.83%] Symbolic Bound Tightening: 15765 milli
		[26.35%] SoI-based local search: 28013 milli
		[0.00%] SoI-based local search: 0 milli
		[8.02%] Unaccounted for: 8529 milli
	--- Preprocessor Statistics ---
	Number of preprocessor bound-tightening loop iterations: 8
	Number of eliminated variables: 315
	Number of constraints removed due to variable elimination: 147
	Number of equations removed due to variable elimination: 0
	--- Engine Statistics ---
	Number of main loop iterations: 100000
		98410 iterations were simplex steps. Total time: 44779 milli. Average: 0.46 milli.
		0 iterations were constraint-fixing steps. Total time: 0 milli. Average: 0.00 milli
	Number of active piecewise-linear constraints: 28 / 454
		Constraints disabled by valid splits: 425. By SMT-originated splits: 1
	Last reported degradation: 0.0000000000. Max degradation so far: 0.0007120233. Restorations so far: 0
	Number of simplex pivots we attempted to skip because of instability: 21.
	Unstable pivots performed anyway: 0
	--- Tableau Statistics ---
	Total number of pivots performed: 80010
		Real pivots: 79838. Degenerate: 172 (0.21%)
		Degenerate pivots by request (e.g., to fix a PL constraint): 0 (0.00%)
		Average time per pivot: 0.14 milli
	Total number of fake pivots performed: 4565
	Total number of rows added: 0. Number of merged columns: 0
	Current tableau dimensions: M = 1047, N = 2552
	--- SMT Core Statistics ---
	Total depth is 16. Total visited states: 1082. Number of splits: 515. Number of pops: 566
	Max stack depth: 22
	--- Bound Tightening Statistics ---
	Number of tightened bounds: 1050420.
		Number of rows examined by row tightener: 80010. Consequent tightenings: 1605
		Number of explicit basis matrices examined by row tightener: 420. Consequent tightenings: 83094
		Number of bound tightening rounds on the entire constraint matrix: 0. Consequent tightenings: 0
		Number of bound notifications sent to PL constraints: 1609155. Tightenings proposed: 0
	--- Basis Factorization statistics ---
	Number of basis refactorizations: 703
	--- Projected Steepest Edge Statistics ---
	Number of iterations: 84596.
	Number of resets to reference space: 600. Avg. iterations per reset: 140
	--- SBT ---
	Number of tightened bounds: 764113
	--- SoI-based local search ---
	Number of proposed phase pattern update: 6488. Number of accepted update: 6060 [93.40%]
	Total time (% of local search time) updating SoI phase pattern : 171895 milli [0.61%]
	Total time obtaining current assignment: 2457238 milli [8.77%]
	Total time getting SoI phase pattern : 150818 milli [0.14%]
	--- Context dependent statistics ---
	Number of pushes / pops: 1109 / 1093
		[0.05%] Pre-Push hook: 54 milli
		[0.00%] Push : 0 milli
		[0.06%] Post-Pop hook: 60 milli
		[0.04%] Pop : 47 milli
		[0.15%] Total context-switching time: 162 milli
	--- Proof Certificate ---
	Number of certified leaves: 0
	Number of leaves to delegate: 0

05:01:58 Statistics update:
	--- Time Statistics ---
	Total time elapsed: 118463 milli (00:01:58)
		Main loop: 118147 milli (00:01:58)
		Preprocessing time: 137 milli (00:00:00)
		Unknown: 178 milli (00:00:00)
	Breakdown for main loop:
		[41.97%] Simplex steps: 49586 milli
		[32.16%] Explicit-basis bound tightening: 38001 milli
		[0.00%] Constraint-matrix bound tightening: 0 milli
		[0.35%] Degradation checking: 417 milli
		[0.00%] Precision restoration: 0 milli
		[0.28%] Statistics handling: 329 milli
		[0.00%] Constraint-fixing steps: 0 milli
		[0.06%] Valid case splits: 71 milli. Average per split: 0.00 milli
		[0.02%] Applying stored bound-tightening: 26 milli
		[2.35%] SMT core: 2779 milli
		[14.65%] Symbolic Bound Tightening: 17311 milli
		[25.69%] SoI-based local search: 30355 milli
		[0.00%] SoI-based local search: 0 milli
		[8.15%] Unaccounted for: 9623 milli
	--- Preprocessor Statistics ---
	Number of preprocessor bound-tightening loop iterations: 8
	Number of eliminated variables: 315
	Number of constraints removed due to variable elimination: 147
	Number of equations removed due to variable elimination: 0
	--- Engine Statistics ---
	Number of main loop iterations: 110000
		108250 iterations were simplex steps. Total time: 49586 milli. Average: 0.46 milli.
		0 iterations were constraint-fixing steps. Total time: 0 milli. Average: 0.00 milli
	Number of active piecewise-linear constraints: 55 / 454
		Constraints disabled by valid splits: 398. By SMT-originated splits: 1
	Last reported degradation: 0.0000000000. Max degradation so far: 0.0007120233. Restorations so far: 0
	Number of simplex pivots we attempted to skip because of instability: 25.
	Unstable pivots performed anyway: 0
	--- Tableau Statistics ---
	Total number of pivots performed: 88197
		Real pivots: 88001. Degenerate: 196 (0.22%)
		Degenerate pivots by request (e.g., to fix a PL constraint): 0 (0.00%)
		Average time per pivot: 0.14 milli
	Total number of fake pivots performed: 5005
	Total number of rows added: 0. Number of merged columns: 0
	Current tableau dimensions: M = 1047, N = 2552
	--- SMT Core Statistics ---
	Total depth is 13. Total visited states: 1193. Number of splits: 567. Number of pops: 625
	Max stack depth: 22
	--- Bound Tightening Statistics ---
	Number of tightened bounds: 1155790.
		Number of rows examined by row tightener: 88197. Consequent tightenings: 1933
		Number of explicit basis matrices examined by row tightener: 473. Consequent tightenings: 93388
		Number of bound tightening rounds on the entire constraint matrix: 0. Consequent tightenings: 0
		Number of bound notifications sent to PL constraints: 1776837. Tightenings proposed: 0
	--- Basis Factorization statistics ---
	Number of basis refactorizations: 776
	--- Projected Steepest Edge Statistics ---
	Number of iterations: 93227.
	Number of resets to reference space: 659. Avg. iterations per reset: 141
	--- SBT ---
	Number of tightened bounds: 839820
	--- SoI-based local search ---
	Number of proposed phase pattern update: 7044. Number of accepted update: 6564 [93.19%]
	Total time (% of local search time) updating SoI phase pattern : 189669 milli [0.62%]
	Total time obtaining current assignment: 2672519 milli [8.80%]
	Total time getting SoI phase pattern : 164450 milli [0.14%]
	--- Context dependent statistics ---
	Number of pushes / pops: 1220 / 1207
		[0.05%] Pre-Push hook: 60 milli
		[0.00%] Push : 0 milli
		[0.06%] Post-Pop hook: 66 milli
		[0.04%] Pop : 52 milli
		[0.15%] Total context-switching time: 179 milli
	--- Proof Certificate ---
	Number of certified leaves: 0
	Number of leaves to delegate: 0


Engine: quitting due to timeout...

Final statistics:

05:01:59 Statistics update:
	--- Time Statistics ---
	Total time elapsed: 120092 milli (00:02:00)
		Main loop: 119850 milli (00:01:59)
		Preprocessing time: 137 milli (00:00:00)
		Unknown: 104 milli (00:00:00)
	Breakdown for main loop:
		[41.95%] Simplex steps: 50273 milli
		[31.92%] Explicit-basis bound tightening: 38256 milli
		[0.00%] Constraint-matrix bound tightening: 0 milli
		[0.35%] Degradation checking: 423 milli
		[0.00%] Precision restoration: 0 milli
		[0.28%] Statistics handling: 334 milli
		[0.00%] Constraint-fixing steps: 0 milli
		[0.06%] Valid case splits: 73 milli. Average per split: 0.00 milli
		[0.02%] Applying stored bound-tightening: 26 milli
		[2.38%] SMT core: 2848 milli
		[14.82%] Symbolic Bound Tightening: 17759 milli
		[25.77%] SoI-based local search: 30882 milli
		[0.00%] SoI-based local search: 0 milli
		[8.22%] Unaccounted for: 9853 milli
	--- Preprocessor Statistics ---
	Number of preprocessor bound-tightening loop iterations: 8
	Number of eliminated variables: 315
	Number of constraints removed due to variable elimination: 147
	Number of equations removed due to variable elimination: 0
	--- Engine Statistics ---
	Number of main loop iterations: 111547
		109763 iterations were simplex steps. Total time: 50273 milli. Average: 0.46 milli.
		0 iterations were constraint-fixing steps. Total time: 0 milli. Average: 0.00 milli
	Number of active piecewise-linear constraints: 271 / 454
		Constraints disabled by valid splits: 183. By SMT-originated splits: 0
	Last reported degradation: 0.0000000000. Max degradation so far: 0.0007120233. Restorations so far: 0
	Number of simplex pivots we attempted to skip because of instability: 25.
	Unstable pivots performed anyway: 0
	--- Tableau Statistics ---
	Total number of pivots performed: 89385
		Real pivots: 89189. Degenerate: 196 (0.22%)
		Degenerate pivots by request (e.g., to fix a PL constraint): 0 (0.00%)
		Average time per pivot: 0.14 milli
	Total number of fake pivots performed: 5079
	Total number of rows added: 0. Number of merged columns: 0
	Current tableau dimensions: M = 1047, N = 2552
	--- SMT Core Statistics ---
	Total depth is 6. Total visited states: 1219. Number of splits: 577. Number of pops: 641
	Max stack depth: 22
	--- Bound Tightening Statistics ---
	Number of tightened bounds: 1179078.
		Number of rows examined by row tightener: 89385. Consequent tightenings: 1953
		Number of explicit basis matrices examined by row tightener: 477. Consequent tightenings: 93840
		Number of bound tightening rounds on the entire constraint matrix: 0. Consequent tightenings: 0
		Number of bound notifications sent to PL constraints: 1806831. Tightenings proposed: 0
	--- Basis Factorization statistics ---
	Number of basis refactorizations: 787
	--- Projected Steepest Edge Statistics ---
	Number of iterations: 94489.
	Number of resets to reference space: 675. Avg. iterations per reset: 139
	--- SBT ---
	Number of tightened bounds: 859992
	--- SoI-based local search ---
	Number of proposed phase pattern update: 7160. Number of accepted update: 6670 [93.16%]
	Total time (% of local search time) updating SoI phase pattern : 192652 milli [0.62%]
	Total time obtaining current assignment: 2716928 milli [8.80%]
	Total time getting SoI phase pattern : 167992 milli [0.14%]
	--- Context dependent statistics ---
	Number of pushes / pops: 1246 / 1240
		[0.05%] Pre-Push hook: 61 milli
		[0.00%] Push : 0 milli
		[0.06%] Post-Pop hook: 68 milli
		[0.05%] Pop : 54 milli
		[0.15%] Total context-switching time: 184 milli
	--- Proof Certificate ---
	Number of certified leaves: 0
	Number of leaves to delegate: 0
Timeout

real	2m0,142s
user	2m0,179s
sys	0m0,164s
