
[VERYDIFF_EXPERIMENT] Running on /home/i57/steuber/NeuroDiff/repos/VeryDiffExperiments/src/../benchmarks/mnist-prune/specs/mnist_65_local_15.vnnlib /home/i57/steuber/NeuroDiff/repos/VeryDiffExperiments/src/../benchmarks/mnist-prune/nets/mnist_relu_3_100.onnx
Parsing /home/i57/steuber/NeuroDiff/repos/VeryDiffExperiments/src/../benchmarks/mnist-prune/nets/mnist_relu_3_100.onnx...
Found input X
op: matmul, weight: (100, 784), bias: nothing
op: bias, weight: nothing, bias: (100,)
op: relu, weight: nothing, bias: nothing
op: matmul, weight: (100, 100), bias: nothing
op: bias, weight: nothing, bias: (100,)
op: relu, weight: nothing, bias: nothing
op: matmul, weight: (10, 100), bias: nothing
op: bias, weight: nothing, bias: (10,)
op: relu, weight: nothing, bias: nothing
op: matmul, weight: (10, 10), bias: nothing
op: bias, weight: nothing, bias: (10,)
Parsing /home/i57/steuber/NeuroDiff/repos/VeryDiffExperiments/src/../benchmarks/mnist-prune/nets_pruned/mnist_relu_3_100_0.79_adam_1_stepsize-old.onnx...
Found input X
op: gemm, weight: (100, 784), bias: (100,)
op: relu, weight: nothing, bias: nothing
op: gemm, weight: (100, 100), bias: (100,)
op: relu, weight: nothing, bias: nothing
op: gemm, weight: (10, 100), bias: (10,)
op: relu, weight: nothing, bias: nothing
op: gemm, weight: (10, 10), bias: (10,)
Distance: 368.62397500800625
Distance: 47.56803950402309
Distance: 2.8977568827249343
Distance: 0.01885471428334995
Running with 1 threads
[Thread 1] Time to first task: 0.0s
Zono Bounds:
[0.0, 0.0, 0.0, 0.0, 0.0, 0.0, 0.0, 0.0, 0.0, 0.0, 0.0, 0.0, 0.0, 0.0, 0.0, 0.0, 0.0, 0.0, 0.0, 0.0, 0.0, 0.0, 0.0, 0.0, 0.0, 0.0, 0.0, 0.0, 0.0, 0.0, 0.0, 0.0, 0.0, 0.0, 0.0, 0.0, 0.0, 0.0, 0.0, 0.0, 0.0, 0.0, 0.0, 0.0, 0.0, 0.0, 0.0, 0.0, 0.0, 0.0, 0.0, 0.0, 0.0, 0.0, 0.0, 0.0, 0.0, 0.0, 0.0, 0.0, 0.0, 0.0, 0.0, 0.0, 0.0, 0.0, 0.0, 0.0, 0.0, 0.0, 0.0, 0.0, 0.0, 0.0, 0.0, 0.0, 0.0, 0.0, 0.0, 0.0, 0.0, 0.0, 0.0, 0.0, 0.0, 0.0, 0.0, 0.0, 0.0, 0.0, 0.0, 0.0, 0.0, 0.0, 0.0, 0.0, 0.0, 0.0, 0.0, 0.0, 0.0, 0.0, 0.0, 0.0, 0.0, 0.0, 0.0, 0.0, 0.0, 0.0, 0.0, 0.0, 0.0, 0.0, 0.0, 0.0, 0.0, 0.0, 0.0, 0.0, 0.0, 0.0, 0.0, 0.0, 0.0, 0.0, 0.0, 0.0, 0.0, 0.0, 0.0, 0.0, 0.0, 0.0, 0.0, 0.0, 0.0, 0.0, 0.0, 0.0, 0.0, 0.0, 0.0, 0.0, 0.0, 0.0, 0.0, 0.0, 0.0, 0.0, 0.0, 0.0, 0.0, 0.0, 0.0, 0.0, 0.0, 0.0, 0.0, 0.0, 0.0, 0.0, 0.0, 0.0, 0.0, 0.0, 0.0, 0.0, 0.0, 0.0, 0.0, 0.0, 0.0, 0.0, 0.0, 0.0, 0.0, 0.0, 0.0, 0.0, 0.0, 0.0, 0.0, 0.0, 0.0, 0.0, 0.0, 0.0, 0.0, 0.0, 0.0, 0.0, 0.0, 0.0, 0.0, 0.0, 0.0, 0.0, 0.0, 0.0, 0.0, 0.0, 0.0, 0.0, 0.0, 0.0, 0.0, 0.0, 0.0, 0.0, 0.0, 0.0, 0.0, 0.0, 0.0, 0.0, 0.0, 0.0, 0.0, 0.0, 0.0, 0.0, 0.0, 0.0, 0.0, 0.0, 0.0, 0.0, 0.0, 0.0, 0.0, 0.0, 0.0, 0.0, 0.0, 0.0, 0.0, 0.0, 0.0, 0.0, 0.0, 0.0, 0.0, 0.0, 0.0, 0.0, 0.0, 0.0, 0.0, 0.0, 0.0, 0.0, 0.0, 0.0, 0.0, 0.0, 0.0, 0.0, 0.0, 0.0, 0.0, 0.0, 0.0, 0.0, 0.0, 0.0, 0.0, 0.0, 0.0, 0.0, 0.0, 0.0, 0.0, 0.0, 0.0, 0.0, 0.0, 0.0, 0.0, 0.0, 0.0, 0.0, 0.0, 0.0, 0.0, 0.0, 0.0, 0.0, 0.0, 0.0, 0.0, 0.0, 0.0, 0.0, 0.0, 0.0, 0.0, 0.0, 0.0, 0.0, 0.0, 0.0, 0.0, 0.0, 0.0, 0.0, 0.0, 0.0, 0.0, 0.0, 0.0, 0.0, 0.0, 0.0, 0.0, 0.0, 0.0, 0.0, 0.0, 0.0, 0.0, 0.0, 0.0, 0.0, 0.0, 0.0, 0.0, 0.0, 0.0, 0.0, 0.0, 0.0, 0.0, 0.0, 0.0, 0.0, 0.0, 0.0, 0.0, 0.0, 0.0, 0.0, 0.0, 0.0, 0.0, 0.0, 0.0, 0.0, 0.0, 0.0, 0.0, 0.0, 0.0, 0.0, 0.0, 0.0, 0.0, 0.0, 0.0, 0.0, 0.0, 0.0, 0.0, 0.0, 0.0, 0.0, 0.0, 0.0, 0.0, 0.0, 0.0, 0.0, 0.0, 0.0, 0.0, 0.0, 0.0, 0.0, 0.0, 0.0, 0.0, 0.0, 0.0, 0.0, 0.0, 0.0, 0.0, 0.0, 0.0, 0.0, 0.0, 0.0, 0.0, 0.0, 0.0, 0.0, 0.0, 0.0, 0.0, 0.0, 0.0, 0.0, 0.0, 0.0, 0.0, 0.0, 0.0, 0.0, 0.0, 0.0, 0.0, 0.0, 0.0, 0.0, 0.0, 0.0, 0.0, 0.0, 0.0, 0.0, 0.0, 0.0, 0.0, 0.0, 0.0, 0.0, 0.0, 0.0, 0.0, 0.0, 0.0, 0.0, 0.0, 0.0, 0.0, 0.0, 0.0, 0.0, 0.0, 0.0, 0.0, 0.0, 0.0, 0.0, 0.0, 0.0, 0.0, 0.0, 0.0, 0.0, 0.0, 0.0, 0.0, 0.0, 0.0, 0.0, 0.0, 0.0, 0.0, 0.0, 0.0, 0.0, 0.0, 0.0, 0.0, 0.0, 0.0, 0.0, 0.0, 0.0, 0.0, 0.0, 0.0, 0.0, 0.0, 0.0, 0.0, 0.0, 0.0, 0.0, 0.0, 0.0, 0.0, 0.0, 0.0, 0.0, 0.0, 0.0, 0.0, 0.0, 0.0, 0.0, 0.0, 0.0, 0.0, 0.0, 0.0, 0.0, 0.0, 0.0, 0.0, 0.0, 0.0, 0.0, 0.0, 0.0, 0.0, 0.0, 0.0, 0.0, 0.0, 0.0, 0.0, 0.0, 0.0, 0.0, 0.0, 0.0, 0.0, 0.0, 0.0, 0.0, 0.0, 0.0, 0.0, 0.0, 0.0, 0.0, 0.0, 0.0, 0.0, 0.0, 0.0, 0.0, 0.0, 0.0, 0.0, 0.0, 0.0, 0.0, 0.0, 0.0, 0.0, 0.0, 0.0, 0.0, 0.0, 0.0, 0.0, 0.0, 0.0, 0.0, 0.0, 0.0, 0.0, 0.0, 0.0, 0.0, 0.0, 0.0, 0.0, 0.0, 0.0, 0.0, 0.0, 0.0, 0.0, 0.0, 0.0, 0.0, 0.0, 0.0, 0.0, 0.0, 0.0, 0.0, 0.0, 0.0, 0.0, 0.0, 0.0, 0.0, 0.0, 0.0, 0.0, 0.0, 0.0, 0.0, 0.0, 0.0, 0.0, 0.0, 0.0, 0.0, 0.0, 0.0, 0.0, 0.0, 0.0, 0.0, 0.0, 0.0, 0.0, 0.0, 0.0, 0.0, 0.0, 0.0, 0.0, 0.0, 0.0, 0.0, 0.0, 0.0, 0.0, 0.0, 0.0, 0.0, 0.0, 0.0, 0.0, 0.0, 0.0, 0.0, 0.0, 0.0, 0.0, 0.0, 0.0, 0.0, 0.0, 0.0, 0.0, 0.0, 0.0, 0.0, 0.0, 0.0, 0.0, 0.0, 0.0, 0.0, 0.0, 0.0, 0.0, 0.0, 0.0, 0.0, 0.0, 0.0, 0.0, 0.0, 0.0, 0.0, 0.0, 0.0, 0.0, 0.0, 0.0, 0.0, 0.0, 0.0, 0.0, 0.0, 0.0, 0.0, 0.0, 0.0, 0.0, 0.0, 0.0, 0.0, 0.0, 0.0, 0.0, 0.0, 0.0, 0.0, 0.0, 0.0, 0.0, 0.0, 0.0, 0.0, 0.0, 0.0, 0.0, 0.0, 0.0, 0.0, 0.0, 0.0, 0.0, 0.0, 0.0, 0.0, 0.0, 0.0, 0.0, 0.0, 0.0, 0.0, 0.0, 0.0, 0.0, 0.0, 0.0, 0.0, 0.0, 0.0, 0.0, 0.0, 0.0, 0.0, 0.0, 0.0, 0.0, 0.0, 0.0, 0.0, 0.0, 0.0, 0.0, 0.0, 0.0, 0.0, 0.0, 0.0, 0.0, 0.0, 0.0, 0.0, 0.0, 0.0, 0.0, 0.0, 0.0, 0.0, 0.0, 0.0, 0.0, 0.0, 0.0, 0.0, 0.0, 0.0, 0.0, 0.0, 0.0, 0.0, 0.0, 0.0, 0.0, 0.0, 0.0, 0.0, 0.0, 0.0, 0.0, 0.0, 0.0, 0.0, 0.0, 0.0, 0.0, 0.0, 0.0, 0.0, 0.0, 0.0, 0.0, 0.0, 0.0, 0.0, 0.0, 0.0, 0.0, 0.0, 0.0, 0.0, 0.0, 0.0, 0.0, 0.0]
[0.0, 0.0, 0.0, 0.0, 0.0, 0.0, 0.0, 0.0, 0.0, 0.0, 0.0, 0.0, 0.0, 0.0, 0.0, 0.0, 0.0, 0.0, 0.0, 0.0, 0.0, 0.0, 0.0, 0.0, 0.0, 0.0, 0.0, 0.0, 0.0, 0.0, 0.0, 0.0, 0.0, 0.0, 0.0, 0.0, 0.0, 0.0, 0.0, 0.0, 0.0, 0.0, 0.0, 0.0, 0.0, 0.0, 0.0, 0.0, 0.0, 0.0, 0.0, 0.0, 0.0, 0.0, 0.0, 0.0, 0.0, 0.0, 0.0, 0.0, 0.0, 0.0, 0.0, 0.0, 0.0, 0.0, 0.0, 0.0, 0.0, 0.0, 0.0, 0.0, 0.0, 0.0, 0.0, 0.0, 0.0, 0.0, 0.0, 0.0, 0.0, 0.0, 0.0, 0.0, 0.0, 0.0, 0.0, 0.0, 0.0, 0.0, 0.0, 0.0, 0.0, 0.0, 0.0, 0.0, 0.0, 0.0, 0.0, 0.0, 0.0, 0.0, 0.0, 0.0, 0.0, 0.0, 0.0, 0.0, 0.0, 0.0, 0.0, 0.0, 0.0, 0.0, 0.0, 0.0, 0.0, 0.0, 0.0, 0.0, 0.0, 0.0, 0.0, 0.0, 0.0, 0.0, 0.0, 0.0, 0.0, 0.0, 0.0, 0.0, 0.0, 0.0, 0.0, 0.0, 0.0, 0.0, 0.0, 0.0, 0.0, 0.0, 0.0, 0.0, 0.0, 0.0, 0.0, 0.0, 0.0, 0.0, 0.0, 0.0, 0.0, 0.0, 0.0, 0.0, 0.0, 0.0, 0.0, 0.0, 0.0, 0.0, 0.0, 0.0, 0.0, 0.0, 0.0, 0.0, 0.0, 0.0, 0.0, 0.0, 0.0, 0.0, 0.0, 0.0, 0.0, 0.0, 0.0, 0.0, 0.0, 0.0, 0.0, 0.0, 0.0, 0.0, 0.0, 0.0, 0.0, 0.0, 0.0, 0.0, 0.0, 0.0, 0.0, 0.0, 0.0, 0.0, 0.0, 0.0, 0.0, 0.0, 0.0, 0.0, 0.0, 0.0, 0.0, 0.0, 0.0, 0.0, 0.0, 0.0, 0.0, 0.0, 0.0, 0.0, 0.0, 0.0, 0.0, 0.0, 0.0, 0.0, 0.0, 0.0, 0.0, 0.0, 0.0, 0.0, 0.0, 0.0, 0.0, 0.0, 0.0, 0.0, 0.0, 0.0, 0.0, 0.0, 0.0, 0.0, 0.0, 0.0, 0.0, 0.0, 0.0, 0.0, 0.0, 0.0, 0.0, 0.0, 0.0, 0.0, 0.0, 0.0, 0.0, 0.0, 0.0, 0.0, 0.0, 0.0, 0.0, 0.0, 0.0, 0.0, 0.0, 0.0, 0.0, 0.0, 0.0, 0.0, 0.0, 0.0, 0.0, 0.0, 0.0, 0.0, 0.0, 0.0, 0.0, 0.0, 0.0, 0.0, 0.0, 0.0, 0.0, 0.0, 0.0, 0.0, 0.0, 0.0, 0.0, 0.0, 0.0, 0.0, 0.0, 0.0, 0.0, 0.0, 0.0, 0.0, 0.0, 0.0, 0.0, 0.0, 0.0, 0.0, 0.0, 0.0, 0.0, 0.0, 0.0, 0.0, 0.0, 0.0, 0.0, 0.0, 0.0, 0.0, 0.0, 0.0, 0.0, 0.0, 0.0, 0.0, 0.0, 0.0, 0.0, 0.0, 0.0, 0.0, 0.0, 0.0, 0.0, 0.0, 0.0, 0.0, 0.0, 0.0, 0.0, 0.0, 0.0, 0.0, 0.0, 0.0, 0.0, 0.0, 0.0, 0.0, 0.0, 0.0, 0.0, 0.0, 0.0, 0.0, 0.0, 0.0, 0.0, 0.0, 0.0, 0.0, 0.0, 0.0, 0.0, 0.0, 0.0, 0.0, 0.0, 0.0, 0.0, 0.0, 0.0, 0.0, 0.0, 0.0, 0.0, 0.0, 0.0, 0.0, 0.0, 0.0, 0.0, 0.0, 0.0, 0.0, 0.0, 0.0, 0.0, 0.0, 0.0, 0.0, 0.0, 0.0, 0.0, 0.0, 0.0, 0.0, 0.0, 0.0, 0.0, 0.0, 0.0, 0.0, 0.0, 0.0, 0.0, 0.0, 0.0, 0.0, 0.0, 0.0, 0.0, 0.0, 0.0, 0.0, 0.0, 0.0, 0.0, 0.0, 0.0, 0.0, 0.0, 0.0, 0.0, 0.0, 0.0, 0.0, 0.0, 0.0, 0.0, 0.0, 0.0, 0.0, 0.0, 0.0, 0.0, 0.0, 0.0, 0.0, 0.0, 0.0, 0.0, 0.0, 0.0, 0.0, 0.0, 0.0, 0.0, 0.0, 0.0, 0.0, 0.0, 0.0, 0.0, 0.0, 0.0, 0.0, 0.0, 0.0, 0.0, 0.0, 0.0, 0.0, 0.0, 0.0, 0.0, 0.0, 0.0, 0.0, 0.0, 0.0, 0.0, 0.0, 0.0, 0.0, 0.0, 0.0, 0.0, 0.0, 0.0, 0.0, 0.0, 0.0, 0.0, 0.0, 0.0, 0.0, 0.0, 0.0, 0.0, 0.0, 0.0, 0.0, 0.0, 0.0, 0.0, 0.0, 0.0, 0.0, 0.0, 0.0, 0.0, 0.0, 0.0, 0.0, 0.0, 0.0, 0.0, 0.0, 0.0, 0.0, 0.0, 0.0, 0.0, 0.0, 0.0, 0.0, 0.0, 0.0, 0.0, 0.0, 0.0, 0.0, 0.0, 0.0, 0.0, 0.0, 0.0, 0.0, 0.0, 0.0, 0.0, 0.0, 0.0, 0.0, 0.0, 0.0, 0.0, 0.0, 0.0, 0.0, 0.0, 0.0, 0.0, 0.0, 0.0, 0.0, 0.0, 0.0, 0.0, 0.0, 0.0, 0.0, 0.0, 0.0, 0.0, 0.0, 0.0, 0.0, 0.0, 0.0, 0.0, 0.0, 0.0, 0.0, 0.0, 0.0, 0.0, 0.0, 0.0, 0.0, 0.0, 0.0, 0.0, 0.0, 0.0, 0.0, 0.0, 0.0, 0.0, 0.0, 0.0, 0.0, 0.0, 0.0, 0.0, 0.0, 0.0, 0.0, 0.0, 0.0, 0.0, 0.0, 0.0, 0.0, 0.0, 0.0, 0.0, 0.0, 0.0, 0.0, 0.0, 0.0, 0.0, 0.0, 0.0, 0.0, 0.0, 0.0, 0.0, 0.0, 0.0, 0.0, 0.0, 0.0, 0.0, 0.0, 0.0, 0.0, 0.0, 0.0, 0.0, 0.0, 0.0, 0.0, 0.0, 0.0, 0.0, 0.0, 0.0, 0.0, 0.0, 0.0, 0.0, 0.0, 0.0, 0.0, 0.0, 0.0, 0.0, 0.0, 0.0, 0.0, 0.0, 0.0, 0.0, 0.0, 0.0, 0.0, 0.0, 0.0, 0.0, 0.0, 0.0, 0.0, 0.0, 0.0, 0.0, 0.0, 0.0, 0.0, 0.0, 0.0, 0.0, 0.0, 0.0, 0.0, 0.0, 0.0, 0.0, 0.0, 0.0, 0.0, 0.0, 0.0, 0.0, 0.0, 0.0, 0.0, 0.0, 0.0, 0.0, 0.0, 0.0, 0.0, 0.0, 0.0, 0.0, 0.0, 0.0, 0.0, 0.0, 0.0, 0.0, 0.0, 0.0, 0.0, 0.0, 0.0, 0.0, 0.0, 0.0, 0.0, 0.0, 0.0, 0.0, 0.0, 0.0, 0.0, 0.0, 0.0, 0.0, 0.0, 0.0, 0.0, 0.0, 0.0, 0.0, 0.0, 0.0, 0.0, 0.0, 0.0, 0.0, 0.0, 0.0, 0.0, 0.0, 0.0, 0.0, 0.0, 0.0, 0.0, 0.0, 0.0, 0.0, 0.0, 0.0, 0.0, 0.0, 0.0, 0.0, 0.0, 0.0, 0.0, 0.0, 0.0, 0.0, 0.0, 0.0, 0.0, 0.0, 0.0, 0.0, 0.0, 0.0, 0.0, 0.0, 0.0, 0.0, 0.0, 0.0, 0.0, 0.0, 0.0, 0.0, 0.0, 0.0, 0.0, 0.0, 0.0, 0.0, 0.0, 0.0, 0.0, 0.0, 0.0, 0.0, 0.0, 0.0, 0.0, 0.0, 0.0, 0.0, 0.0]
[Thread 1] Processed 100 zonotopes (Work Done: 0.0%; Expected Zonos: Inf)
[Thread 1] Processed 200 zonotopes (Work Done: 0.0%; Expected Zonos: Inf)
[Thread 1] Processed 300 zonotopes (Work Done: 0.0%; Expected Zonos: Inf)
[Thread 1] Processed 400 zonotopes (Work Done: 0.0%; Expected Zonos: Inf)
[Thread 1] Processed 500 zonotopes (Work Done: 0.0%; Expected Zonos: Inf)
[Thread 1] Processed 600 zonotopes (Work Done: 0.0%; Expected Zonos: Inf)
[Thread 1] Processed 700 zonotopes (Work Done: 0.19531%; Expected Zonos: 358400.0)
[Thread 1] Processed 800 zonotopes (Work Done: 0.19531%; Expected Zonos: 409600.0)
[Thread 1] Processed 900 zonotopes (Work Done: 1.31836%; Expected Zonos: 68266.66666666667)
[Thread 1] Processed 1000 zonotopes (Work Done: 1.95312%; Expected Zonos: 51200.0)
[Thread 1] Processed 1100 zonotopes (Work Done: 2.44141%; Expected Zonos: 45056.0)
[Thread 1] Processed 1200 zonotopes (Work Done: 5.37109%; Expected Zonos: 22341.81818181818)
[Thread 1] Processed 1300 zonotopes (Work Done: 6.98242%; Expected Zonos: 18618.18181818182)
[Thread 1] Processed 1400 zonotopes (Work Done: 8.34961%; Expected Zonos: 16767.251461988304)
[Thread 1] Processed 1500 zonotopes (Work Done: 10.88867%; Expected Zonos: 13775.784753363228)
[Thread 1] Processed 1600 zonotopes (Work Done: 13.11035%; Expected Zonos: 12204.096834264432)
[Thread 1] Processed 1700 zonotopes (Work Done: 15.25879%; Expected Zonos: 11141.12)
[Thread 1] Processed 1800 zonotopes (Work Done: 17.99316%; Expected Zonos: 10003.799185888738)
[Thread 1] Processed 1900 zonotopes (Work Done: 21.89941%; Expected Zonos: 8676.03121516165)
[Thread 1] Processed 2000 zonotopes (Work Done: 22.72949%; Expected Zonos: 8799.140708915145)
[Thread 1] Processed 2100 zonotopes (Work Done: 23.80371%; Expected Zonos: 8822.153846153846)
[Thread 1] Processed 2200 zonotopes (Work Done: 24.8291%; Expected Zonos: 8860.570304818093)
[Thread 1] Processed 2300 zonotopes (Work Done: 25.46387%; Expected Zonos: 9032.406519654842)
[Thread 1] Processed 2400 zonotopes (Work Done: 26.3916%; Expected Zonos: 9093.802035152636)
[Thread 1] Processed 2500 zonotopes (Work Done: 27.34375%; Expected Zonos: 9142.857142857143)
[Thread 1] Processed 2600 zonotopes (Work Done: 28.39355%; Expected Zonos: 9157.007738607052)
[Thread 1] Processed 2700 zonotopes (Work Done: 29.39453%; Expected Zonos: 9185.382059800664)
[Thread 1] Processed 2800 zonotopes (Work Done: 30.05371%; Expected Zonos: 9316.653127538586)
[Thread 1] Processed 2900 zonotopes (Work Done: 30.44434%; Expected Zonos: 9525.581395348838)
[Thread 1] Processed 3000 zonotopes (Work Done: 30.81055%; Expected Zonos: 9736.925515055467)
[Thread 1] Processed 3100 zonotopes (Work Done: 31.29883%; Expected Zonos: 9904.524180967239)
[Thread 1] Processed 3200 zonotopes (Work Done: 31.64062%; Expected Zonos: 10113.58024691358)
[Thread 1] Processed 3300 zonotopes (Work Done: 32.00684%; Expected Zonos: 10310.297482837528)
[Thread 1] Processed 3400 zonotopes (Work Done: 32.26318%; Expected Zonos: 10538.327657964433)
[Thread 1] Processed 3500 zonotopes (Work Done: 32.60498%; Expected Zonos: 10734.556345937852)
[Thread 1] Processed 3600 zonotopes (Work Done: 32.97119%; Expected Zonos: 10918.622732321362)
[Thread 1] Processed 3700 zonotopes (Work Done: 33.43506%; Expected Zonos: 11066.2285505659)
[Thread 1] Processed 3800 zonotopes (Work Done: 34.14307%; Expected Zonos: 11129.638898820165)
[Thread 1] Processed 3900 zonotopes (Work Done: 34.82666%; Expected Zonos: 11198.31756046267)
[Thread 1] Processed 4000 zonotopes (Work Done: 35.9375%; Expected Zonos: 11130.434782608696)
[Thread 1] Processed 4100 zonotopes (Work Done: 36.19385%; Expected Zonos: 11327.892074198988)
[Thread 1] Processed 4200 zonotopes (Work Done: 37.10327%; Expected Zonos: 11319.756538904425)
[Thread 1] Processed 4300 zonotopes (Work Done: 39.01062%; Expected Zonos: 11022.639443010248)
[Thread 1] Processed 4400 zonotopes (Work Done: 42.73682%; Expected Zonos: 10295.572693516138)
[Thread 1] Processed 4500 zonotopes (Work Done: 49.62158%; Expected Zonos: 9068.634686346864)
[Thread 1] Processed 4600 zonotopes (Work Done: 54.96826%; Expected Zonos: 8368.465467466134)
[Thread 1] Processed 4700 zonotopes (Work Done: 59.19189%; Expected Zonos: 7940.276345638276)
[Thread 1] Processed 4800 zonotopes (Work Done: 62.51221%; Expected Zonos: 7678.500292911541)
[Thread 1] Processed 4900 zonotopes (Work Done: 65.84473%; Expected Zonos: 7441.750092695588)
[Thread 1] Processed 5000 zonotopes (Work Done: 68.88428%; Expected Zonos: 7258.550416445153)
[Thread 1] Processed 5100 zonotopes (Work Done: 71.32568%; Expected Zonos: 7150.2995036796165)
[Thread 1] Processed 5200 zonotopes (Work Done: 74.14551%; Expected Zonos: 7013.236746789595)
[Thread 1] Processed 5300 zonotopes (Work Done: 75.98877%; Expected Zonos: 6974.714859437751)
[Thread 1] Processed 5400 zonotopes (Work Done: 77.96021%; Expected Zonos: 6926.6108196978)
[Thread 1] Processed 5500 zonotopes (Work Done: 79.92554%; Expected Zonos: 6881.405116456663)
[Thread 1] Processed 5600 zonotopes (Work Done: 82.04956%; Expected Zonos: 6825.143197203005)
[Thread 1] Processed 5700 zonotopes (Work Done: 83.40759%; Expected Zonos: 6833.910211847353)
[Thread 1] Processed 5800 zonotopes (Work Done: 85.06775%; Expected Zonos: 6818.095067264574)
[Thread 1] Processed 5900 zonotopes (Work Done: 86.29761%; Expected Zonos: 6836.805997595304)
[Thread 1] Processed 6000 zonotopes (Work Done: 87.70447%; Expected Zonos: 6841.156616444553)
[Thread 1] Processed 6100 zonotopes (Work Done: 88.81836%; Expected Zonos: 6867.949422759758)
[Thread 1] Processed 6200 zonotopes (Work Done: 89.9765%; Expected Zonos: 6890.688011938881)
[Thread 1] Processed 6300 zonotopes (Work Done: 91.38641%; Expected Zonos: 6893.803743467299)
[Thread 1] Processed 6400 zonotopes (Work Done: 92.85126%; Expected Zonos: 6892.744572808992)
[Thread 1] Processed 6500 zonotopes (Work Done: 94.24896%; Expected Zonos: 6896.627649068273)
[Thread 1] Processed 6600 zonotopes (Work Done: 95.32928%; Expected Zonos: 6923.370948379352)
[Thread 1] Processed 6700 zonotopes (Work Done: 96.17767%; Expected Zonos: 6966.27373831924)
[Thread 1] Processed 6800 zonotopes (Work Done: 96.97113%; Expected Zonos: 7012.396343094522)
[Thread 1] Processed 6900 zonotopes (Work Done: 97.6532%; Expected Zonos: 7065.820806900216)
[Thread 1] Processed 7000 zonotopes (Work Done: 98.21701%; Expected Zonos: 7127.074999029013)
[Thread 1] Processed 7100 zonotopes (Work Done: 98.70605%; Expected Zonos: 7193.074449666089)
[Thread 1] Processed 7200 zonotopes (Work Done: 99.11041%; Expected Zonos: 7264.625190522378)
[Thread 1] Processed 7300 zonotopes (Work Done: 99.46518%; Expected Zonos: 7339.25182747697)
[Thread 1] Processed 7400 zonotopes (Work Done: 99.74747%; Expected Zonos: 7418.7347503843475)
[Thread 1] Processed 7500 zonotopes (Work Done: 99.98627%; Expected Zonos: 7501.030109725762)
[Thread 1] Total splits: 3753
Processed 7507 zonotopes (Work Done: 100.0%); Generated 7506 (0.01586263751671773s/loop)
[Thread 1] Finished in 119.08s
 ────────────────────────────────────────────────────────────────────────────────
                                        Time                    Allocations      
                               ───────────────────────   ────────────────────────
       Tot / % measured:             119s / 100.0%           53.4GiB / 100.0%    

 Section               ncalls     time    %tot     avg     alloc    %tot      avg
 ────────────────────────────────────────────────────────────────────────────────
 Verify                     1     119s  100.0%    119s   53.4GiB  100.0%  53.4GiB
   Zonotope Loop            1     119s  100.0%    119s   53.4GiB  100.0%  53.4GiB
     Property Check     7.51k     110s   92.3%  14.6ms   41.3GiB   77.2%  5.63MiB
     Zonotope Propa...  7.51k    6.48s    5.4%   863μs   5.83GiB   10.9%   815KiB
       DiffZonotope...  30.0k    3.72s    3.1%   124μs   0.97GiB    1.8%  34.0KiB
         Zonotope_D...  60.1k    3.71s    3.1%  61.8μs   0.97GiB    1.8%  17.0KiB
       DiffZonotope...  22.5k    2.69s    2.3%   119μs   4.86GiB    9.1%   226KiB
         Zonotope_R...  45.0k    2.32s    1.9%  51.5μs   4.72GiB    8.8%   110KiB
           Column M...  45.0k    760ms    0.6%  16.9μs   1.67GiB    3.1%  38.9KiB
           Influenc...  45.0k    677ms    0.6%  15.0μs   1.20GiB    2.2%  27.9KiB
             Multiply   45.0k    533ms    0.4%  11.8μs    811MiB    1.5%  18.4KiB
             Alloca...  45.0k   86.8ms    0.1%  1.93μs    415MiB    0.8%  9.43KiB
             Set Ma...  45.0k   33.0ms    0.0%   734ns     0.00B    0.0%    0.00B
           Allocation   45.0k    487ms    0.4%  10.8μs   1.67GiB    3.1%  38.8KiB
           Set Matrix   45.0k    194ms    0.2%  4.31μs   42.9MiB    0.1%     998B
           Vectors      45.0k    150ms    0.1%  3.34μs    143MiB    0.3%  3.26KiB
           Bounds       45.0k   11.3ms    0.0%   250ns     0.00B    0.0%    0.00B
     Compute Split      3.75k    383ms    0.3%   102μs    574MiB    1.0%   157KiB
 Initialize                 1    317μs    0.0%   317μs    821KiB    0.0%   821KiB
 ────────────────────────────────────────────────────────────────────────────────
[VERYDIFF_TIMER] 119.113532215

[VERYDIFF_EXPERIMENT] NETWORK: /home/i57/steuber/NeuroDiff/repos/VeryDiffExperiments/src/../benchmarks/mnist-prune/specs/mnist_65_local_15.vnnlib
[VERYDIFF_EXPERIMENT] TIME: 119.421359675
