
[VERYDIFF_EXPERIMENT] Running on /home/i57/steuber/NeuroDiff/repos/VeryDiffExperiments/src/../benchmarks/mnist-prune/specs/mnist_51_local_18.vnnlib /home/i57/steuber/NeuroDiff/repos/VeryDiffExperiments/src/../benchmarks/mnist-prune/nets/mnist_relu_2_512.onnx
Parsing /home/i57/steuber/NeuroDiff/repos/VeryDiffExperiments/src/../benchmarks/mnist-prune/nets/mnist_relu_2_512.onnx...
Found input X
op: matmul, weight: (512, 784), bias: nothing
op: bias, weight: nothing, bias: (512,)
op: relu, weight: nothing, bias: nothing
op: matmul, weight: (512, 512), bias: nothing
op: bias, weight: nothing, bias: (512,)
op: relu, weight: nothing, bias: nothing
op: matmul, weight: (10, 512), bias: nothing
op: bias, weight: nothing, bias: (10,)
Parsing /home/i57/steuber/NeuroDiff/repos/VeryDiffExperiments/src/../benchmarks/mnist-prune/nets_pruned/mnist_relu_2_512_pruned5.onnx...
Found input X
op: matmul, weight: (512, 784), bias: nothing
op: bias, weight: nothing, bias: (512,)
op: relu, weight: nothing, bias: nothing
op: matmul, weight: (512, 512), bias: nothing
op: bias, weight: nothing, bias: (512,)
op: relu, weight: nothing, bias: nothing
op: matmul, weight: (10, 512), bias: nothing
op: bias, weight: nothing, bias: (10,)
Distance: 1085.5985166831802
Distance: 1719.8468985003963
Distance: 31.228482716001736
Running with 1 threads
[Thread 1] Time to first task: 0.0s
Instable Generators: 81
Instable Generators: 160
Zono Bounds:
[-8.304406012201907, -7.428529764240722, -5.928493529788319, -2.3406353436813543, -8.392119188170874, -8.093231026694834, -10.87810842306445, -7.415998178208175, -3.7901296408976766, -6.562128002959351]
[4.8106132972881515, 7.558813641267661, 4.70141096014138, 6.962326416958135, 5.564626951145258, 2.908640135660098, 3.0268819603955452, 4.467270387131535, 6.991827043616247, 2.8715284859088133]
[Thread 1] Total splits: 0
Processed 1 zonotopes (Work Done: 100.0%); Generated 0 (0.099194361s/loop)
[Thread 1] Finished in 0.1s
 ────────────────────────────────────────────────────────────────────────────────
                                        Time                    Allocations      
                               ───────────────────────   ────────────────────────
       Tot / % measured:            101ms / 100.0%           63.0MiB / 100.0%    

 Section               ncalls     time    %tot     avg     alloc    %tot      avg
 ────────────────────────────────────────────────────────────────────────────────
 Verify                     1   99.2ms   98.1%  99.2ms   57.7MiB   91.7%  57.7MiB
   Zonotope Loop            1   99.2ms   98.0%  99.2ms   57.7MiB   91.7%  57.7MiB
     Property Check         1   75.9ms   75.0%  75.9ms   43.9MiB   69.8%  43.9MiB
     Zonotope Propa...      1   23.1ms   22.9%  23.1ms   13.0MiB   20.6%  13.0MiB
       DiffZonotope...      3   14.2ms   14.0%  4.74ms   2.18MiB    3.5%   746KiB
         Zonotope_D...      6   5.55ms    5.5%   924μs   1.01MiB    1.6%   172KiB
       DiffZonotope...      2   8.91ms    8.8%  4.46ms   10.8MiB   17.1%  5.38MiB
         Zonotope_R...      4   7.46ms    7.4%  1.86ms   6.38MiB   10.1%  1.60MiB
           Column M...      4   6.71ms    6.6%  1.68ms   2.89MiB    4.6%   739KiB
           Influenc...      4    308μs    0.3%  77.1μs    504KiB    0.8%   126KiB
             Multiply       4    266μs    0.3%  66.5μs    398KiB    0.6%  99.4KiB
             Alloca...      4   29.0μs    0.0%  7.25μs    104KiB    0.2%  26.1KiB
             Set Ma...      4   7.18μs    0.0%  1.80μs     0.00B    0.0%    0.00B
           Set Matrix       4    185μs    0.2%  46.2μs   15.1KiB    0.0%  3.79KiB
           Allocation       4    174μs    0.2%  43.6μs   2.89MiB    4.6%   739KiB
           Vectors          4   70.3μs    0.1%  17.6μs    100KiB    0.2%  25.0KiB
           Bounds           4   2.61μs    0.0%   653ns     0.00B    0.0%    0.00B
 Initialize                 1   1.95ms    1.9%  1.95ms   5.24MiB    8.3%  5.24MiB
 ────────────────────────────────────────────────────────────────────────────────
[VERYDIFF_TIMER] 0.13137508

[VERYDIFF_EXPERIMENT] Running on /home/i57/steuber/NeuroDiff/repos/VeryDiffExperiments/src/../benchmarks/mnist-prune/specs/mnist_51_local_18.vnnlib /home/i57/steuber/NeuroDiff/repos/VeryDiffExperiments/src/../benchmarks/mnist-prune/nets/mnist_relu_3_100.onnx
Parsing /home/i57/steuber/NeuroDiff/repos/VeryDiffExperiments/src/../benchmarks/mnist-prune/nets/mnist_relu_3_100.onnx...
Found input X
op: matmul, weight: (100, 784), bias: nothing
op: bias, weight: nothing, bias: (100,)
op: relu, weight: nothing, bias: nothing
op: matmul, weight: (100, 100), bias: nothing
op: bias, weight: nothing, bias: (100,)
op: relu, weight: nothing, bias: nothing
op: matmul, weight: (10, 100), bias: nothing
op: bias, weight: nothing, bias: (10,)
op: relu, weight: nothing, bias: nothing
op: matmul, weight: (10, 10), bias: nothing
op: bias, weight: nothing, bias: (10,)
Parsing /home/i57/steuber/NeuroDiff/repos/VeryDiffExperiments/src/../benchmarks/mnist-prune/nets_pruned/mnist_relu_3_100_pruned5.onnx...
Found input X
op: matmul, weight: (100, 784), bias: nothing
op: bias, weight: nothing, bias: (100,)
op: relu, weight: nothing, bias: nothing
op: matmul, weight: (100, 100), bias: nothing
op: bias, weight: nothing, bias: (100,)
op: relu, weight: nothing, bias: nothing
op: matmul, weight: (10, 100), bias: nothing
op: bias, weight: nothing, bias: (10,)
op: relu, weight: nothing, bias: nothing
op: matmul, weight: (10, 10), bias: nothing
op: bias, weight: nothing, bias: (10,)
Distance: 296.6600370998244
Distance: 77.24290861755458
Distance: 5.7170369567975285
Distance: 0.0
Running with 1 threads
[Thread 1] Time to first task: 0.0s
Instable Generators: 31
Instable Generators: 54
Instable Generators: 7
Zono Bounds:
[0.0, -0.5173432355444041, -1.0698363805846476, -0.36000574857244944, -0.8000291123856534, -1.1494730678437146, 0.0, -1.0295193858993823, -0.6812145488379415, -0.6720798811577531]
[0.0, 0.5173432355444041, 1.0698363805846476, 1.0286506749947553, 0.49495069236759603, 0.5497105425339983, 0.0, 1.0295193858993823, 0.6812145488379415, 0.6720798811577531]
[Thread 1] Total splits: 0
Processed 1 zonotopes (Work Done: 100.0%); Generated 0 (0.028338669s/loop)
[Thread 1] Finished in 0.03s
 ────────────────────────────────────────────────────────────────────────────────
                                        Time                    Allocations      
                               ───────────────────────   ────────────────────────
       Tot / % measured:           28.7ms / 100.0%           16.6MiB / 100.0%    

 Section               ncalls     time    %tot     avg     alloc    %tot      avg
 ────────────────────────────────────────────────────────────────────────────────
 Verify                     1   28.4ms   98.9%  28.4ms   15.8MiB   95.1%  15.8MiB
   Zonotope Loop            1   28.3ms   98.8%  28.3ms   15.8MiB   95.1%  15.8MiB
     Property Check         1   26.5ms   92.5%  26.5ms   13.5MiB   81.3%  13.5MiB
     Zonotope Propa...      1   1.67ms    5.8%  1.67ms   1.44MiB    8.7%  1.44MiB
       DiffZonotope...      4   1.06ms    3.7%   264μs    298KiB    1.7%  74.5KiB
         Zonotope_D...      8    468μs    1.6%  58.5μs    148KiB    0.9%  18.6KiB
       DiffZonotope...      3    609μs    2.1%   203μs   1.15MiB    6.9%   393KiB
         Zonotope_R...      6    280μs    1.0%  46.7μs    765KiB    4.5%   128KiB
           Influenc...      6    113μs    0.4%  18.8μs    219KiB    1.3%  36.4KiB
             Multiply       6   79.2μs    0.3%  13.2μs    141KiB    0.8%  23.5KiB
             Alloca...      6   21.2μs    0.1%  3.53μs   75.4KiB    0.4%  12.6KiB
             Set Ma...      6   7.07μs    0.0%  1.18μs     0.00B    0.0%    0.00B
           Column M...      6   75.4μs    0.3%  12.6μs    258KiB    1.5%  43.0KiB
           Set Matrix       6   32.0μs    0.1%  5.34μs   6.33KiB    0.0%  1.05KiB
           Allocation       6   29.7μs    0.1%  4.95μs    258KiB    1.5%  43.0KiB
           Vectors          6   19.3μs    0.1%  3.22μs   19.5KiB    0.1%  3.26KiB
           Bounds           6   1.78μs    0.0%   297ns     0.00B    0.0%    0.00B
 Initialize                 1    328μs    1.1%   328μs    839KiB    4.9%   839KiB
 ────────────────────────────────────────────────────────────────────────────────
[VERYDIFF_TIMER] 0.05321558

[VERYDIFF_EXPERIMENT] NETWORK: /home/i57/steuber/NeuroDiff/repos/VeryDiffExperiments/src/../benchmarks/mnist-prune/specs/mnist_51_local_18.vnnlib
[VERYDIFF_EXPERIMENT] TIME: 0.78380888
