Network: ./acas-prune/nets/product_ACASXU_run2a_4_7_batch_2000_ACASXU_run2a_4_7_batch_2000_pruned10_eps.onnx
Property: ./acas-prune/specs/product_prop_2_eps_0.05.vnnlib

Engine::processInputQuery: Input query (before preprocessing): 615 equations, 1220 variables
Engine::processInputQuery: Input query (after preprocessing): 1155 equations, 1697 variables

Input bounds:
	x0: [  0.6000,   0.6799] 
	x1: [ -0.5000,   0.5000] 
	x2: [ -0.5000,   0.5000] 
	x3: [  0.4500,   0.5000] 
	x4: [ -0.5000,  -0.4500] 

Branching heuristics set to LargestInterval

Engine::solve: Initial statistics

04:36:54 Statistics update:
	--- Time Statistics ---
	Total time elapsed: 230 milli (00:00:00)
		Main loop: 0 milli (00:00:00)
		Preprocessing time: 165 milli (00:00:00)
		Unknown: 64 milli (00:00:00)
	Breakdown for main loop:
		[0.00%] Simplex steps: 0 milli
		[0.00%] Explicit-basis bound tightening: 0 milli
		[0.00%] Constraint-matrix bound tightening: 0 milli
		[0.00%] Degradation checking: 0 milli
		[0.00%] Precision restoration: 0 milli
		[0.00%] Statistics handling: 0 milli
		[0.00%] Constraint-fixing steps: 0 milli
		[0.00%] Valid case splits: 0 milli. Average per split: 0.00 milli
		[0.00%] Applying stored bound-tightening: 0 milli
		[0.00%] SMT core: 0 milli
		[0.00%] Symbolic Bound Tightening: 19 milli
		[0.00%] SoI-based local search: 0 milli
		[0.00%] SoI-based local search: 0 milli
		[0.00%] Unaccounted for: 0 milli
	--- Preprocessor Statistics ---
	Number of preprocessor bound-tightening loop iterations: 8
	Number of eliminated variables: 123
	Number of constraints removed due to variable elimination: 63
	Number of equations removed due to variable elimination: 0
	--- Engine Statistics ---
	Number of main loop iterations: 1
		0 iterations were simplex steps. Total time: 0 milli. Average: 0.00 milli.
		0 iterations were constraint-fixing steps. Total time: 0 milli. Average: 0.00 milli
	Number of active piecewise-linear constraints: 522 / 538
		Constraints disabled by valid splits: 16. By SMT-originated splits: 0
	Last reported degradation: 0.0000000000. Max degradation so far: 0.0000000000. Restorations so far: 0
	Number of simplex pivots we attempted to skip because of instability: 0.
	Unstable pivots performed anyway: 0
	--- Tableau Statistics ---
	Total number of pivots performed: 0
		Real pivots: 0. Degenerate: 0 (0.00%)
		Degenerate pivots by request (e.g., to fix a PL constraint): 0 (0.00%)
		Average time per pivot: 0.00 milli
	Total number of fake pivots performed: 0
	Total number of rows added: 0. Number of merged columns: 0
	Current tableau dimensions: M = 1155, N = 2852
	--- SMT Core Statistics ---
	Total depth is 0. Total visited states: 1. Number of splits: 0. Number of pops: 0
	Max stack depth: 0
	--- Bound Tightening Statistics ---
	Number of tightened bounds: 0.
		Number of rows examined by row tightener: 0. Consequent tightenings: 0
		Number of explicit basis matrices examined by row tightener: 0. Consequent tightenings: 0
		Number of bound tightening rounds on the entire constraint matrix: 0. Consequent tightenings: 0
		Number of bound notifications sent to PL constraints: 3232. Tightenings proposed: 0
	--- Basis Factorization statistics ---
	Number of basis refactorizations: 2
	--- Projected Steepest Edge Statistics ---
	Number of iterations: 0.
	Number of resets to reference space: 1. Avg. iterations per reset: 0
	--- SBT ---
	Number of tightened bounds: 1419
	--- SoI-based local search ---
	Number of proposed phase pattern update: 0. Number of accepted update: 0 [0.00%]
	Total time (% of local search time) updating SoI phase pattern : 0 milli [0.00%]
	Total time obtaining current assignment: 0 milli [0.00%]
	Total time getting SoI phase pattern : 0 milli [0.00%]
	--- Context dependent statistics ---
	Number of pushes / pops: 0 / 0
		[0.00%] Pre-Push hook: 0 milli
		[0.00%] Push : 0 milli
		[0.00%] Post-Pop hook: 0 milli
		[0.00%] Pop : 0 milli
		[0.00%] Total context-switching time: 0 milli
	--- Proof Certificate ---
	Number of certified leaves: 0
	Number of leaves to delegate: 0

---

04:37:07 Statistics update:
	--- Time Statistics ---
	Total time elapsed: 13283 milli (00:00:13)
		Main loop: 13050 milli (00:00:13)
		Preprocessing time: 165 milli (00:00:00)
		Unknown: 67 milli (00:00:00)
	Breakdown for main loop:
		[43.00%] Simplex steps: 5611 milli
		[37.39%] Explicit-basis bound tightening: 4880 milli
		[0.00%] Constraint-matrix bound tightening: 0 milli
		[0.35%] Degradation checking: 45 milli
		[0.00%] Precision restoration: 0 milli
		[0.25%] Statistics handling: 33 milli
		[0.00%] Constraint-fixing steps: 0 milli
		[0.09%] Valid case splits: 11 milli. Average per split: 0.00 milli
		[0.02%] Applying stored bound-tightening: 2 milli
		[1.89%] SMT core: 246 milli
		[13.10%] Symbolic Bound Tightening: 1709 milli
		[22.24%] SoI-based local search: 2901 milli
		[0.00%] SoI-based local search: 0 milli
		[3.91%] Unaccounted for: 510 milli
	--- Preprocessor Statistics ---
	Number of preprocessor bound-tightening loop iterations: 8
	Number of eliminated variables: 123
	Number of constraints removed due to variable elimination: 63
	Number of equations removed due to variable elimination: 0
	--- Engine Statistics ---
	Number of main loop iterations: 10000
		9856 iterations were simplex steps. Total time: 5611 milli. Average: 0.57 milli.
		0 iterations were constraint-fixing steps. Total time: 0 milli. Average: 0.00 milli
	Number of active piecewise-linear constraints: 82 / 538
		Constraints disabled by valid splits: 455. By SMT-originated splits: 1
	Last reported degradation: 0.0000000000. Max degradation so far: 0.0000264731. Restorations so far: 0
	Number of simplex pivots we attempted to skip because of instability: 9.
	Unstable pivots performed anyway: 0
	--- Tableau Statistics ---
	Total number of pivots performed: 9141
		Real pivots: 9124. Degenerate: 17 (0.19%)
		Degenerate pivots by request (e.g., to fix a PL constraint): 0 (0.00%)
		Average time per pivot: 0.18 milli
	Total number of fake pivots performed: 379
	Total number of rows added: 0. Number of merged columns: 0
	Current tableau dimensions: M = 1155, N = 2852
	--- SMT Core Statistics ---
	Total depth is 11. Total visited states: 96. Number of splits: 47. Number of pops: 48
	Max stack depth: 14
	--- Bound Tightening Statistics ---
	Number of tightened bounds: 102390.
		Number of rows examined by row tightener: 9141. Consequent tightenings: 44
		Number of explicit basis matrices examined by row tightener: 43. Consequent tightenings: 3434
		Number of bound tightening rounds on the entire constraint matrix: 0. Consequent tightenings: 0
		Number of bound notifications sent to PL constraints: 159248. Tightenings proposed: 0
	--- Basis Factorization statistics ---
	Number of basis refactorizations: 85
	--- Projected Steepest Edge Statistics ---
	Number of iterations: 9529.
	Number of resets to reference space: 53. Avg. iterations per reset: 179
	--- SBT ---
	Number of tightened bounds: 68875
	--- SoI-based local search ---
	Number of proposed phase pattern update: 125. Number of accepted update: 116 [92.80%]
	Total time (% of local search time) updating SoI phase pattern : 15977 milli [0.55%]
	Total time obtaining current assignment: 61227 milli [2.11%]
	Total time getting SoI phase pattern : 6998 milli [0.05%]
	--- Context dependent statistics ---
	Number of pushes / pops: 95 / 84
		[0.04%] Pre-Push hook: 5 milli
		[0.00%] Push : 0 milli
		[0.04%] Post-Pop hook: 5 milli
		[0.03%] Pop : 3 milli
		[0.11%] Total context-switching time: 14 milli
	--- Proof Certificate ---
	Number of certified leaves: 0
	Number of leaves to delegate: 0

04:37:21 Statistics update:
	--- Time Statistics ---
	Total time elapsed: 27112 milli (00:00:27)
		Main loop: 26820 milli (00:00:26)
		Preprocessing time: 165 milli (00:00:00)
		Unknown: 126 milli (00:00:00)
	Breakdown for main loop:
		[40.16%] Simplex steps: 10771 milli
		[35.70%] Explicit-basis bound tightening: 9573 milli
		[0.00%] Constraint-matrix bound tightening: 0 milli
		[0.35%] Degradation checking: 92 milli
		[0.00%] Precision restoration: 0 milli
		[0.24%] Statistics handling: 65 milli
		[0.00%] Constraint-fixing steps: 0 milli
		[0.07%] Valid case splits: 19 milli. Average per split: 0.00 milli
		[0.02%] Applying stored bound-tightening: 5 milli
		[2.37%] SMT core: 636 milli
		[14.75%] Symbolic Bound Tightening: 3955 milli
		[20.10%] SoI-based local search: 5390 milli
		[0.00%] SoI-based local search: 0 milli
		[6.34%] Unaccounted for: 1700 milli
	--- Preprocessor Statistics ---
	Number of preprocessor bound-tightening loop iterations: 8
	Number of eliminated variables: 123
	Number of constraints removed due to variable elimination: 63
	Number of equations removed due to variable elimination: 0
	--- Engine Statistics ---
	Number of main loop iterations: 20000
		19660 iterations were simplex steps. Total time: 10771 milli. Average: 0.55 milli.
		0 iterations were constraint-fixing steps. Total time: 0 milli. Average: 0.00 milli
	Number of active piecewise-linear constraints: 29 / 538
		Constraints disabled by valid splits: 508. By SMT-originated splits: 1
	Last reported degradation: 0.0000000000. Max degradation so far: 0.0000264731. Restorations so far: 0
	Number of simplex pivots we attempted to skip because of instability: 11.
	Unstable pivots performed anyway: 0
	--- Tableau Statistics ---
	Total number of pivots performed: 17716
		Real pivots: 17681. Degenerate: 35 (0.20%)
		Degenerate pivots by request (e.g., to fix a PL constraint): 0 (0.00%)
		Average time per pivot: 0.17 milli
	Total number of fake pivots performed: 811
	Total number of rows added: 0. Number of merged columns: 0
	Current tableau dimensions: M = 1155, N = 2852
	--- SMT Core Statistics ---
	Total depth is 16. Total visited states: 233. Number of splits: 116. Number of pops: 116
	Max stack depth: 17
	--- Bound Tightening Statistics ---
	Number of tightened bounds: 258382.
		Number of rows examined by row tightener: 17716. Consequent tightenings: 231
		Number of explicit basis matrices examined by row tightener: 87. Consequent tightenings: 11963
		Number of bound tightening rounds on the entire constraint matrix: 0. Consequent tightenings: 0
		Number of bound notifications sent to PL constraints: 401479. Tightenings proposed: 0
	--- Basis Factorization statistics ---
	Number of basis refactorizations: 161
	--- Projected Steepest Edge Statistics ---
	Number of iterations: 18538.
	Number of resets to reference space: 128. Avg. iterations per reset: 144
	--- SBT ---
	Number of tightened bounds: 165995
	--- SoI-based local search ---
	Number of proposed phase pattern update: 465. Number of accepted update: 408 [87.74%]
	Total time (% of local search time) updating SoI phase pattern : 37208 milli [0.69%]
	Total time obtaining current assignment: 220879 milli [4.10%]
	Total time getting SoI phase pattern : 15116 milli [0.06%]
	--- Context dependent statistics ---
	Number of pushes / pops: 239 / 223
		[0.05%] Pre-Push hook: 13 milli
		[0.00%] Push : 0 milli
		[0.05%] Post-Pop hook: 14 milli
		[0.04%] Pop : 11 milli
		[0.15%] Total context-switching time: 39 milli
	--- Proof Certificate ---
	Number of certified leaves: 0
	Number of leaves to delegate: 0

04:37:37 Statistics update:
	--- Time Statistics ---
	Total time elapsed: 42897 milli (00:00:42)
		Main loop: 42659 milli (00:00:42)
		Preprocessing time: 165 milli (00:00:00)
		Unknown: 71 milli (00:00:00)
	Breakdown for main loop:
		[37.78%] Simplex steps: 16117 milli
		[37.74%] Explicit-basis bound tightening: 16098 milli
		[0.00%] Constraint-matrix bound tightening: 0 milli
		[0.33%] Degradation checking: 140 milli
		[0.00%] Precision restoration: 0 milli
		[0.23%] Statistics handling: 97 milli
		[0.00%] Constraint-fixing steps: 0 milli
		[0.07%] Valid case splits: 27 milli. Average per split: 0.00 milli
		[0.02%] Applying stored bound-tightening: 10 milli
		[2.38%] SMT core: 1014 milli
		[15.05%] Symbolic Bound Tightening: 6420 milli
		[17.38%] SoI-based local search: 7414 milli
		[0.00%] SoI-based local search: 0 milli
		[6.41%] Unaccounted for: 2732 milli
	--- Preprocessor Statistics ---
	Number of preprocessor bound-tightening loop iterations: 8
	Number of eliminated variables: 123
	Number of constraints removed due to variable elimination: 63
	Number of equations removed due to variable elimination: 0
	--- Engine Statistics ---
	Number of main loop iterations: 30000
		29456 iterations were simplex steps. Total time: 16117 milli. Average: 0.55 milli.
		0 iterations were constraint-fixing steps. Total time: 0 milli. Average: 0.00 milli
	Number of active piecewise-linear constraints: 37 / 538
		Constraints disabled by valid splits: 500. By SMT-originated splits: 1
	Last reported degradation: 0.0000000000. Max degradation so far: 0.0000264731. Restorations so far: 0
	Number of simplex pivots we attempted to skip because of instability: 14.
	Unstable pivots performed anyway: 0
	--- Tableau Statistics ---
	Total number of pivots performed: 26362
		Real pivots: 26309. Degenerate: 53 (0.20%)
		Degenerate pivots by request (e.g., to fix a PL constraint): 0 (0.00%)
		Average time per pivot: 0.17 milli
	Total number of fake pivots performed: 1185
	Total number of rows added: 0. Number of merged columns: 0
	Current tableau dimensions: M = 1155, N = 2852
	--- SMT Core Statistics ---
	Total depth is 12. Total visited states: 373. Number of splits: 185. Number of pops: 187
	Max stack depth: 19
	--- Bound Tightening Statistics ---
	Number of tightened bounds: 418961.
		Number of rows examined by row tightener: 26362. Consequent tightenings: 911
		Number of explicit basis matrices examined by row tightener: 145. Consequent tightenings: 29203
		Number of bound tightening rounds on the entire constraint matrix: 0. Consequent tightenings: 0
		Number of bound notifications sent to PL constraints: 666454. Tightenings proposed: 0
	--- Basis Factorization statistics ---
	Number of basis refactorizations: 239
	--- Projected Steepest Edge Statistics ---
	Number of iterations: 27561.
	Number of resets to reference space: 199. Avg. iterations per reset: 138
	--- SBT ---
	Number of tightened bounds: 277213
	--- SoI-based local search ---
	Number of proposed phase pattern update: 784. Number of accepted update: 665 [84.82%]
	Total time (% of local search time) updating SoI phase pattern : 60886 milli [0.82%]
	Total time obtaining current assignment: 378614 milli [5.11%]
	Total time getting SoI phase pattern : 22061 milli [0.05%]
	--- Context dependent statistics ---
	Number of pushes / pops: 379 / 367
		[0.05%] Pre-Push hook: 21 milli
		[0.00%] Push : 0 milli
		[0.05%] Post-Pop hook: 22 milli
		[0.05%] Pop : 21 milli
		[0.15%] Total context-switching time: 65 milli
	--- Proof Certificate ---
	Number of certified leaves: 0
	Number of leaves to delegate: 0

04:37:52 Statistics update:
	--- Time Statistics ---
	Total time elapsed: 58498 milli (00:00:58)
		Main loop: 58257 milli (00:00:58)
		Preprocessing time: 165 milli (00:00:00)
		Unknown: 74 milli (00:00:00)
	Breakdown for main loop:
		[36.33%] Simplex steps: 21162 milli
		[36.88%] Explicit-basis bound tightening: 21487 milli
		[0.00%] Constraint-matrix bound tightening: 0 milli
		[0.32%] Degradation checking: 189 milli
		[0.00%] Precision restoration: 0 milli
		[0.22%] Statistics handling: 130 milli
		[0.00%] Constraint-fixing steps: 0 milli
		[0.06%] Valid case splits: 35 milli. Average per split: 0.00 milli
		[0.03%] Applying stored bound-tightening: 15 milli
		[2.65%] SMT core: 1543 milli
		[16.20%] Symbolic Bound Tightening: 9437 milli
		[16.65%] SoI-based local search: 9699 milli
		[0.00%] SoI-based local search: 0 milli
		[7.30%] Unaccounted for: 4255 milli
	--- Preprocessor Statistics ---
	Number of preprocessor bound-tightening loop iterations: 8
	Number of eliminated variables: 123
	Number of constraints removed due to variable elimination: 63
	Number of equations removed due to variable elimination: 0
	--- Engine Statistics ---
	Number of main loop iterations: 40000
		39173 iterations were simplex steps. Total time: 21162 milli. Average: 0.54 milli.
		0 iterations were constraint-fixing steps. Total time: 0 milli. Average: 0.00 milli
	Number of active piecewise-linear constraints: 25 / 538
		Constraints disabled by valid splits: 512. By SMT-originated splits: 1
	Last reported degradation: 0.0000000000. Max degradation so far: 0.0000264731. Restorations so far: 0
	Number of simplex pivots we attempted to skip because of instability: 44.
	Unstable pivots performed anyway: 4
	--- Tableau Statistics ---
	Total number of pivots performed: 34110
		Real pivots: 33963. Degenerate: 147 (0.43%)
		Degenerate pivots by request (e.g., to fix a PL constraint): 0 (0.00%)
		Average time per pivot: 0.16 milli
	Total number of fake pivots performed: 1751
	Total number of rows added: 0. Number of merged columns: 0
	Current tableau dimensions: M = 1155, N = 2852
	--- SMT Core Statistics ---
	Total depth is 13. Total visited states: 572. Number of splits: 284. Number of pops: 287
	Max stack depth: 20
	--- Bound Tightening Statistics ---
	Number of tightened bounds: 624340.
		Number of rows examined by row tightener: 34110. Consequent tightenings: 1419
		Number of explicit basis matrices examined by row tightener: 193. Consequent tightenings: 48486
		Number of bound tightening rounds on the entire constraint matrix: 0. Consequent tightenings: 0
		Number of bound notifications sent to PL constraints: 989958. Tightenings proposed: 0
	--- Basis Factorization statistics ---
	Number of basis refactorizations: 310
	--- Projected Steepest Edge Statistics ---
	Number of iterations: 35901.
	Number of resets to reference space: 300. Avg. iterations per reset: 119
	--- SBT ---
	Number of tightened bounds: 417803
	--- SoI-based local search ---
	Number of proposed phase pattern update: 1440. Number of accepted update: 1231 [85.49%]
	Total time (% of local search time) updating SoI phase pattern : 91919 milli [0.95%]
	Total time obtaining current assignment: 690761 milli [7.12%]
	Total time getting SoI phase pattern : 28688 milli [0.05%]
	--- Context dependent statistics ---
	Number of pushes / pops: 578 / 565
		[0.06%] Pre-Push hook: 33 milli
		[0.00%] Push : 0 milli
		[0.06%] Post-Pop hook: 34 milli
		[0.06%] Pop : 32 milli
		[0.17%] Total context-switching time: 100 milli
	--- Proof Certificate ---
	Number of certified leaves: 0
	Number of leaves to delegate: 0

Engine::solve: sat assignment found

04:37:59 Statistics update:
	--- Time Statistics ---
	Total time elapsed: 65288 milli (00:01:05)
		Main loop: 65046 milli (00:01:05)
		Preprocessing time: 165 milli (00:00:00)
		Unknown: 75 milli (00:00:00)
	Breakdown for main loop:
		[35.78%] Simplex steps: 23276 milli
		[37.73%] Explicit-basis bound tightening: 24542 milli
		[0.00%] Constraint-matrix bound tightening: 0 milli
		[0.32%] Degradation checking: 208 milli
		[0.00%] Precision restoration: 0 milli
		[0.22%] Statistics handling: 143 milli
		[0.00%] Constraint-fixing steps: 0 milli
		[0.06%] Valid case splits: 37 milli. Average per split: 0.00 milli
		[0.03%] Applying stored bound-tightening: 17 milli
		[2.58%] SMT core: 1678 milli
		[15.77%] Symbolic Bound Tightening: 10255 milli
		[15.90%] SoI-based local search: 10343 milli
		[0.00%] SoI-based local search: 0 milli
		[7.51%] Unaccounted for: 4886 milli
	--- Preprocessor Statistics ---
	Number of preprocessor bound-tightening loop iterations: 8
	Number of eliminated variables: 123
	Number of constraints removed due to variable elimination: 63
	Number of equations removed due to variable elimination: 0
	--- Engine Statistics ---
	Number of main loop iterations: 43872
		42967 iterations were simplex steps. Total time: 23276 milli. Average: 0.54 milli.
		0 iterations were constraint-fixing steps. Total time: 0 milli. Average: 0.00 milli
	Number of active piecewise-linear constraints: 19 / 538
		Constraints disabled by valid splits: 518. By SMT-originated splits: 1
	Last reported degradation: 0.0000000000. Max degradation so far: 0.0000264731. Restorations so far: 0
	Number of simplex pivots we attempted to skip because of instability: 44.
	Unstable pivots performed anyway: 4
	--- Tableau Statistics ---
	Total number of pivots performed: 37413
		Real pivots: 37264. Degenerate: 149 (0.40%)
		Degenerate pivots by request (e.g., to fix a PL constraint): 0 (0.00%)
		Average time per pivot: 0.17 milli
	Total number of fake pivots performed: 1915
	Total number of rows added: 0. Number of merged columns: 0
	Current tableau dimensions: M = 1155, N = 2852
	--- SMT Core Statistics ---
	Total depth is 16. Total visited states: 624. Number of splits: 312. Number of pops: 311
	Max stack depth: 20
	--- Bound Tightening Statistics ---
	Number of tightened bounds: 680893.
		Number of rows examined by row tightener: 37413. Consequent tightenings: 1585
		Number of explicit basis matrices examined by row tightener: 222. Consequent tightenings: 57847
		Number of bound tightening rounds on the entire constraint matrix: 0. Consequent tightenings: 0
		Number of bound notifications sent to PL constraints: 1086467. Tightenings proposed: 0
	--- Basis Factorization statistics ---
	Number of basis refactorizations: 340
	--- Projected Steepest Edge Statistics ---
	Number of iterations: 39368.
	Number of resets to reference space: 325. Avg. iterations per reset: 121
	--- SBT ---
	Number of tightened bounds: 456209
	--- SoI-based local search ---
	Number of proposed phase pattern update: 1580. Number of accepted update: 1351 [85.51%]
	Total time (% of local search time) updating SoI phase pattern : 100944 milli [0.98%]
	Total time obtaining current assignment: 760939 milli [7.36%]
	Total time getting SoI phase pattern : 30800 milli [0.05%]
	--- Context dependent statistics ---
	Number of pushes / pops: 631 / 615
		[0.06%] Pre-Push hook: 36 milli
		[0.00%] Push : 0 milli
		[0.06%] Post-Pop hook: 37 milli
		[0.06%] Pop : 36 milli
		[0.17%] Total context-switching time: 110 milli
	--- Proof Certificate ---
	Number of certified leaves: 0
	Number of leaves to delegate: 0
sat
Input assignment:
	x0 = 0.619964
	x1 = -0.285444
	x2 = -0.034576
	x3 = 0.475000
	x4 = -0.450000

Output:
	y0 = -0.050000
	y1 = 0.004180
	y2 = -0.005944
	y3 = 0.000641
	y4 = -0.003611


real	1m5,351s
user	1m5,345s
sys	0m0,228s
