
[VERYDIFF_EXPERIMENT] Running on /home/i57/steuber/NeuroDiff/repos/VeryDiffExperiments/src/../benchmarks/mnist-prune/specs/mnist_65_local_24.vnnlib /home/i57/steuber/NeuroDiff/repos/VeryDiffExperiments/src/../benchmarks/mnist-prune/nets/mnist_relu_4_1024.onnx
Found input X
op: matmul, weight: (1024, 784), bias: nothing
op: bias, weight: nothing, bias: (1024,)
op: relu, weight: nothing, bias: nothing
op: matmul, weight: (1024, 1024), bias: nothing
op: bias, weight: nothing, bias: (1024,)
op: relu, weight: nothing, bias: nothing
op: matmul, weight: (1024, 1024), bias: nothing
op: bias, weight: nothing, bias: (1024,)
op: relu, weight: nothing, bias: nothing
op: matmul, weight: (10, 1024), bias: nothing
op: bias, weight: nothing, bias: (10,)
op: relu, weight: nothing, bias: nothing
op: matmul, weight: (10, 10), bias: nothing
op: bias, weight: nothing, bias: (10,)
Found input X
op: gemm, weight: (1024, 784), bias: (1024,)
op: relu, weight: nothing, bias: nothing
op: gemm, weight: (1024, 1024), bias: (1024,)
op: relu, weight: nothing, bias: nothing
op: gemm, weight: (1024, 1024), bias: (1024,)
op: relu, weight: nothing, bias: nothing
op: gemm, weight: (10, 1024), bias: (10,)
op: relu, weight: nothing, bias: nothing
op: gemm, weight: (10, 10), bias: (10,)
Distance: 915.6394868631054
Distance: 1298.7052820973968
Distance: 1296.587532894263
Distance: 6.054483317080667
Distance: 0.04942679278974538
Running with 1 threads
[Thread 1] Time to first task: 0.0s
Instable Generators: 659
Instable Generators: 1022
Instable Generators: 1024
Instable Generators: 10
Zono Bounds:
[-231.6373496993929, -236.38061927075032, -260.75875914291095, -258.74224890554495, -248.80014186869326, -263.37652000867615, -235.3469345488817, -246.44615231140557, -251.76253035489339, -262.4787207812504]
[231.19679594328724, 235.86303709053183, 259.77481284929644, 258.2295162970955, 248.60586966892416, 263.11700857491087, 235.2811984775228, 245.01931625491164, 251.94389582500105, 262.1210052316122]


TIMEOUT REACHED
UNKNOWN
[Thread 1] Total splits: 82
Processed 82 zonotopes (Work Done: 0.0%); Generated 164 (1.4654982917560975s/loop)
[Thread 1] Finished in 120.17s
 ────────────────────────────────────────────────────────────────────────────────
                                        Time                    Allocations      
                               ───────────────────────   ────────────────────────
       Tot / % measured:             120s / 100.0%           32.4GiB / 100.0%    

 Section               ncalls     time    %tot     avg     alloc    %tot      avg
 ────────────────────────────────────────────────────────────────────────────────
 Verify                     1     120s  100.0%    120s   32.4GiB   99.9%  32.4GiB
   Zonotope Loop            1     120s  100.0%    120s   32.4GiB   99.9%  32.4GiB
     Zonotope Propa...     82     120s   99.7%   1.46s   32.2GiB   99.2%   402MiB
       DiffZonotope...    410    65.5s   54.5%   160ms   7.21GiB   22.2%  18.0MiB
         Zonotope_D...    820    22.6s   18.8%  27.5ms   2.92GiB    9.0%  3.65MiB
       DiffZonotope...    328    54.3s   45.2%   166ms   25.0GiB   77.0%  78.0MiB
         Zonotope_R...    656    29.4s   24.5%  44.9ms   15.7GiB   48.4%  24.5MiB
           Allocation     656    23.3s   19.4%  35.5ms   6.18GiB   19.0%  9.65MiB
           Column M...    656    2.83s    2.4%  4.32ms   6.18GiB   19.0%  9.65MiB
           Influenc...    656    2.19s    1.8%  3.34ms   3.31GiB   10.2%  5.17MiB
             Multiply     656    2.15s    1.8%  3.28ms   3.09GiB    9.5%  4.82MiB
             Alloca...    656   26.5ms    0.0%  40.4μs    228MiB    0.7%   355KiB
             Set Ma...    656   14.9ms    0.0%  22.7μs     0.00B    0.0%    0.00B
           Set Matrix     656    1.11s    0.9%  1.69ms   10.7MiB    0.0%  16.7KiB
           Vectors        656   16.1ms    0.0%  24.6μs   21.8MiB    0.1%  34.0KiB
           Bounds         656    411μs    0.0%   627ns     0.00B    0.0%    0.00B
     Property Check        82    303ms    0.3%  3.70ms   45.6MiB    0.1%   569KiB
     Compute Split         82   49.8ms    0.0%   608μs    127MiB    0.4%  1.55MiB
 Initialize                 1   14.0ms    0.0%  14.0ms   22.4MiB    0.1%  22.4MiB
 ────────────────────────────────────────────────────────────────────────────────
[VERYDIFF_TIMER] 120.263073515

[VERYDIFF_EXPERIMENT] NETWORK: /home/i57/steuber/NeuroDiff/repos/VeryDiffExperiments/src/../benchmarks/mnist-prune/specs/mnist_65_local_24.vnnlib
[VERYDIFF_EXPERIMENT] TIME: 120.516028471
