
[VERYDIFF_EXPERIMENT] Running on /home/i57/steuber/NeuroDiff/repos/VeryDiffExperiments/src/../benchmarks/mnist-prune/specs/mnist_64_global_5.vnnlib /home/i57/steuber/NeuroDiff/repos/VeryDiffExperiments/src/../benchmarks/mnist-prune/nets/mnist_relu_2_512.onnx
Parsing /home/i57/steuber/NeuroDiff/repos/VeryDiffExperiments/src/../benchmarks/mnist-prune/nets/mnist_relu_2_512.onnx...
Found input X
op: matmul, weight: (512, 784), bias: nothing
op: bias, weight: nothing, bias: (512,)
op: relu, weight: nothing, bias: nothing
op: matmul, weight: (512, 512), bias: nothing
op: bias, weight: nothing, bias: (512,)
op: relu, weight: nothing, bias: nothing
op: matmul, weight: (10, 512), bias: nothing
op: bias, weight: nothing, bias: (10,)
Parsing /home/i57/steuber/NeuroDiff/repos/VeryDiffExperiments/src/../benchmarks/mnist-prune/nets_pruned/mnist_relu_2_512_pruned5.onnx...
Found input X
op: matmul, weight: (512, 784), bias: nothing
op: bias, weight: nothing, bias: (512,)
op: relu, weight: nothing, bias: nothing
op: matmul, weight: (512, 512), bias: nothing
op: bias, weight: nothing, bias: (512,)
op: relu, weight: nothing, bias: nothing
op: matmul, weight: (10, 512), bias: nothing
op: bias, weight: nothing, bias: (10,)
Distance: 1085.5985166831802
Distance: 1719.8468985003963
Distance: 31.228482716001736
Running with 1 threads
[Thread 1] Time to first task: 0.01s
Instable Generators: 107
Instable Generators: 217
Zono Bounds:
[-15.598387729635213, -8.382182993508035, -11.831244351027527, -11.811363325403933, -7.743868972867442, -14.254462038427754, -17.21591147172994, -3.7857113606608914, -7.3162190378649665, -5.537386213040252]
[4.051066979211233, 10.17123883271918, 4.024128453956161, 4.475657260409308, 9.550075027853088, 0.8433344508153571, 0.7302133547839773, 12.586233682162344, 6.198721788920288, 8.279390761993659]
[Thread 1] Total splits: 0
Processed 1 zonotopes (Work Done: 100.0%); Generated 0 (0.639180034s/loop)
[Thread 1] Finished in 0.64s
 ────────────────────────────────────────────────────────────────────────────────
                                        Time                    Allocations      
                               ───────────────────────   ────────────────────────
       Tot / % measured:            641ms / 100.0%            226MiB / 100.0%    

 Section               ncalls     time    %tot     avg     alloc    %tot      avg
 ────────────────────────────────────────────────────────────────────────────────
 Verify                     1    639ms   99.7%   639ms    216MiB   95.6%   216MiB
   Zonotope Loop            1    639ms   99.7%   639ms    216MiB   95.6%   216MiB
     Property Check         1    406ms   63.3%   406ms   78.9MiB   35.0%  78.9MiB
     Zonotope Propa...      1    224ms   35.0%   224ms    117MiB   51.8%   117MiB
       DiffZonotope...      2    121ms   18.8%  60.3ms   96.0MiB   42.6%  48.0MiB
         Zonotope_R...      4    108ms   16.8%  27.0ms   84.1MiB   37.3%  21.0MiB
           Influenc...      4   99.5ms   15.5%  24.9ms   52.5MiB   23.3%  13.1MiB
             Multiply       4   93.7ms   14.6%  23.4ms   28.5MiB   12.6%  7.12MiB
             Set Ma...      4   3.23ms    0.5%   807μs     0.00B    0.0%    0.00B
             Alloca...      4   2.51ms    0.4%   627μs   24.1MiB   10.7%  6.02MiB
           Column M...      4   5.56ms    0.9%  1.39ms   15.7MiB    7.0%  3.93MiB
           Set Matrix       4   1.96ms    0.3%   490μs   20.1KiB    0.0%  5.02KiB
           Allocation       4    779μs    0.1%   195μs   15.7MiB    7.0%  3.93MiB
           Vectors          4   87.9μs    0.0%  22.0μs    100KiB    0.0%  25.0KiB
           Bounds           4   2.85μs    0.0%   712ns     0.00B    0.0%    0.00B
       DiffZonotope...      3    104ms   16.2%  34.6ms   20.9MiB    9.3%  6.95MiB
         Zonotope_D...      6   49.0ms    7.6%  8.16ms   13.3MiB    5.9%  2.22MiB
 Initialize                 1   2.18ms    0.3%  2.18ms   9.84MiB    4.4%  9.84MiB
 ────────────────────────────────────────────────────────────────────────────────
[VERYDIFF_TIMER] 0.671600172

[VERYDIFF_EXPERIMENT] Running on /home/i57/steuber/NeuroDiff/repos/VeryDiffExperiments/src/../benchmarks/mnist-prune/specs/mnist_64_global_5.vnnlib /home/i57/steuber/NeuroDiff/repos/VeryDiffExperiments/src/../benchmarks/mnist-prune/nets/mnist_relu_3_100.onnx
Parsing /home/i57/steuber/NeuroDiff/repos/VeryDiffExperiments/src/../benchmarks/mnist-prune/nets/mnist_relu_3_100.onnx...
Found input X
op: matmul, weight: (100, 784), bias: nothing
op: bias, weight: nothing, bias: (100,)
op: relu, weight: nothing, bias: nothing
op: matmul, weight: (100, 100), bias: nothing
op: bias, weight: nothing, bias: (100,)
op: relu, weight: nothing, bias: nothing
op: matmul, weight: (10, 100), bias: nothing
op: bias, weight: nothing, bias: (10,)
op: relu, weight: nothing, bias: nothing
op: matmul, weight: (10, 10), bias: nothing
op: bias, weight: nothing, bias: (10,)
Parsing /home/i57/steuber/NeuroDiff/repos/VeryDiffExperiments/src/../benchmarks/mnist-prune/nets_pruned/mnist_relu_3_100_pruned5.onnx...
Found input X
op: matmul, weight: (100, 784), bias: nothing
op: bias, weight: nothing, bias: (100,)
op: relu, weight: nothing, bias: nothing
op: matmul, weight: (100, 100), bias: nothing
op: bias, weight: nothing, bias: (100,)
op: relu, weight: nothing, bias: nothing
op: matmul, weight: (10, 100), bias: nothing
op: bias, weight: nothing, bias: (10,)
op: relu, weight: nothing, bias: nothing
op: matmul, weight: (10, 10), bias: nothing
op: bias, weight: nothing, bias: (10,)
Distance: 296.6600370998244
Distance: 77.24290861755458
Distance: 5.7170369567975285
Distance: 0.0
Running with 1 threads
[Thread 1] Time to first task: 0.0s
Instable Generators: 34
Instable Generators: 40
Instable Generators: 5
Zono Bounds:
[0.0, -0.7654391156694393, -1.110727970975177, -0.2833858396882277, -1.0610387472878227, 0.0, 0.0, 0.1277497118948706, -1.1706900216824039, -1.068404910708394]
[0.0, 0.7654391156694393, 0.6915935015184846, 1.1951549850315129, 0.7245062990565141, 0.0, 0.0, 1.808611685860293, 1.1706900216824039, 1.068404910708394]
[Thread 1] Total splits: 0
Processed 1 zonotopes (Work Done: 100.0%); Generated 0 (0.137012116s/loop)
[Thread 1] Finished in 0.14s
 ────────────────────────────────────────────────────────────────────────────────
                                        Time                    Allocations      
                               ───────────────────────   ────────────────────────
       Tot / % measured:            138ms / 100.0%            154MiB / 100.0%    

 Section               ncalls     time    %tot     avg     alloc    %tot      avg
 ────────────────────────────────────────────────────────────────────────────────
 Verify                     1    137ms   99.6%   137ms    149MiB   96.5%   149MiB
   Zonotope Loop            1    137ms   99.6%   137ms    149MiB   96.5%   149MiB
     Property Check         1   85.7ms   62.3%  85.7ms   56.1MiB   36.3%  56.1MiB
     Zonotope Propa...      1   47.9ms   34.8%  47.9ms   73.0MiB   47.3%  73.0MiB
       DiffZonotope...      3   26.4ms   19.2%  8.81ms   68.8MiB   44.6%  22.9MiB
         Zonotope_R...      6   25.3ms   18.4%  4.21ms   67.2MiB   43.5%  11.2MiB
           Influenc...      6   23.9ms   17.4%  3.99ms   61.8MiB   40.0%  10.3MiB
             Multiply       6   18.4ms   13.4%  3.07ms   31.4MiB   20.3%  5.23MiB
             Set Ma...      6   4.17ms    3.0%   695μs     0.00B    0.0%    0.00B
             Alloca...      6   1.34ms    1.0%   223μs   30.4MiB   19.7%  5.07MiB
           Column M...      6    779μs    0.6%   130μs   2.69MiB    1.7%   460KiB
           Set Matrix       6    307μs    0.2%  51.1μs   5.72KiB    0.0%     976B
           Allocation       6    158μs    0.1%  26.3μs   2.69MiB    1.7%   460KiB
           Vectors          6   64.7μs    0.0%  10.8μs   19.5KiB    0.0%  3.26KiB
           Bounds           6   3.56μs    0.0%   594ns     0.00B    0.0%    0.00B
       DiffZonotope...      4   21.5ms   15.6%  5.37ms   4.15MiB    2.7%  1.04MiB
         Zonotope_D...      8   8.43ms    6.1%  1.05ms   2.72MiB    1.8%   348KiB
 Initialize                 1    573μs    0.4%   573μs   5.41MiB    3.5%  5.41MiB
 ────────────────────────────────────────────────────────────────────────────────
[VERYDIFF_TIMER] 0.162699765

[VERYDIFF_EXPERIMENT] NETWORK: /home/i57/steuber/NeuroDiff/repos/VeryDiffExperiments/src/../benchmarks/mnist-prune/specs/mnist_64_global_5.vnnlib
[VERYDIFF_EXPERIMENT] TIME: 1.444577759
