
[VERYDIFF_EXPERIMENT] Running on /home/i57/steuber/NeuroDiff/repos/VeryDiffExperiments/src/../benchmarks/mnist-prune/specs/mnist_33_local_15.vnnlib /home/i57/steuber/NeuroDiff/repos/VeryDiffExperiments/src/../benchmarks/mnist-prune/nets/mnist_relu_2_512.onnx
Loading /home/i57/steuber/NeuroDiff/repos/VeryDiffExperiments/src/../benchmarks/mnist-prune/nets/mnist_relu_2_512.onnx and /home/i57/steuber/NeuroDiff/repos/VeryDiffExperiments/src/../benchmarks/mnist-prune/nets_pruned/mnist_relu_2_512_pruned5.onnx
INPUT SHAPE: 784

[NEQUIV] 114.11940700484206

[ -76.94252299 -117.73739656  -85.11344503 -134.29035916   -7.00224261
 -107.24749099  -71.49847405  -78.77817669 -124.08072011 -105.40381881]
[ -72.1525865  -113.7424129   -77.86026616 -128.67649117   -8.33978624
 -103.67696998  -68.29033439  -74.8071939  -117.79917042 -100.66517377]
NETWORKS NOT EQUIVALENT
Refined: 0 | Refine Limit: -1 | Wrong: 0 | Right: 1 | Total: 1 | Total Zonos Considered: 1 | Expected 2 (50.0%)

time: 1.928154267

[VERYDIFF_TIMER] 1.958463335

[VERYDIFF_EXPERIMENT] Running on /home/i57/steuber/NeuroDiff/repos/VeryDiffExperiments/src/../benchmarks/mnist-prune/specs/mnist_33_local_15.vnnlib /home/i57/steuber/NeuroDiff/repos/VeryDiffExperiments/src/../benchmarks/mnist-prune/nets/mnist_relu_3_100.onnx
Loading /home/i57/steuber/NeuroDiff/repos/VeryDiffExperiments/src/../benchmarks/mnist-prune/nets/mnist_relu_3_100.onnx and /home/i57/steuber/NeuroDiff/repos/VeryDiffExperiments/src/../benchmarks/mnist-prune/nets_pruned/mnist_relu_3_100_pruned5.onnx
INPUT SHAPE: 784
Refined: 74 | Refine Limit: 25 | Wrong: 0 | Right: 96 | Total: 96 | Total Zonos Considered: 170 | Expected 140136194 (6.850478613683486e-05%)Refined: 152 | Refine Limit: 20 | Wrong: 0 | Right: 254 | Total: 254 | Total Zonos Considered: 406 | Expected 347667072 (7.30583999625941e-05%)Refined: 233 | Refine Limit: 25 | Wrong: 0 | Right: 404 | Total: 404 | Total Zonos Considered: 637 | Expected 540893183 (7.469127226918665e-05%)Refined: 314 | Refine Limit: 24 | Wrong: 0 | Right: 558 | Total: 558 | Total Zonos Considered: 872 | Expected 744994018 (7.489993027031258e-05%)Refined: 395 | Refine Limit: 22 | Wrong: 0 | Right: 713 | Total: 713 | Total Zonos Considered: 1108 | Expected 951113001 (7.496480431350975e-05%)Refined: 468 | Refine Limit: 19 | Wrong: 0 | Right: 860 | Total: 860 | Total Zonos Considered: 1328 | Expected 1052661166 (8.169770366545468e-05%)Refined: 553 | Refine Limit: 25 | Wrong: 0 | Right: 1020 | Total: 1020 | Total Zonos Considered: 1573 | Expected 1244751781 (8.194404824876486e-05%)Refined: 623 | Refine Limit: 16 | Wrong: 0 | Right: 1169 | Total: 1169 | Total Zonos Considered: 1792 | Expected 935161833 (0.0001250051016570947%)Refined: 688 | Refine Limit: 14 | Wrong: 0 | Right: 1301 | Total: 1301 | Total Zonos Considered: 1989 | Expected 365959663 (0.0003555036610687883%)Refined: 764 | Refine Limit: 24 | Wrong: 0 | Right: 1424 | Total: 1424 | Total Zonos Considered: 2188 | Expected 62005016 (0.0022965883921391133%)Refined: 840 | Refine Limit: 22 | Wrong: 0 | Right: 1569 | Total: 1569 | Total Zonos Considered: 2409 | Expected 68318700 (0.0022965893671864366%)Refined: 918 | Refine Limit: 24 | Wrong: 0 | Right: 1698 | Total: 1698 | Total Zonos Considered: 2616 | Expected 73736326 (0.0023027998438652883%)Refined: 999 | Refine Limit: 28 | Wrong: 0 | Right: 1842 | Total: 1842 | Total Zonos Considered: 2841 | Expected 79974751 (0.0023032269272085636%)Refined: 1096 | Refine Limit: 34 | Wrong: 0 | Right: 2000 | Total: 2000 | Total Zonos Considered: 3096 | Expected 86834685 (0.0023032271033170673%)Refined: 1186 | Refine Limit: 29 | Wrong: 0 | Right: 2171 | Total: 2171 | Total Zonos Considered: 3357 | Expected 94259039 (0.0023032273859698482%)Refined: 1280 | Refine Limit: 22 | Wrong: 0 | Right: 2345 | Total: 2345 | Total Zonos Considered: 3625 | Expected 101813633 (0.002303227898762831%)Refined: 1386 | Refine Limit: 39 | Wrong: 0 | Right: 2505 | Total: 2505 | Total Zonos Considered: 3891 | Expected 108760404 (0.0023032279284288058%)Refined: 1475 | Refine Limit: 32 | Wrong: 0 | Right: 2667 | Total: 2667 | Total Zonos Considered: 4142 | Expected 115794000 (0.0023032281465360897%)Refined: 1551 | Refine Limit: 30 | Wrong: 0 | Right: 2799 | Total: 2799 | Total Zonos Considered: 4350 | Expected 121495874 (0.0023037819374837373%)Refined: 1629 | Refine Limit: 27 | Wrong: 0 | Right: 2941 | Total: 2941 | Total Zonos Considered: 4570 | Expected 127654647 (0.0023038722593467357%)Refined: 1719 | Refine Limit: 37 | Wrong: 0 | Right: 3096 | Total: 3096 | Total Zonos Considered: 4815 | Expected 134381618 (0.0023038865330524596%)Refined: 1798 | Refine Limit: 32 | Wrong: 0 | Right: 3245 | Total: 3245 | Total Zonos Considered: 5043 | Expected 140848325 (0.0023038967627055556%)Refined: 1892 | Refine Limit: 34 | Wrong: 0 | Right: 3410 | Total: 3410 | Total Zonos Considered: 5302 | Expected 148010018 (0.002303898105059348%)Refined: 1973 | Refine Limit: 39 | Wrong: 0 | Right: 3541 | Total: 3541 | Total Zonos Considered: 5514 | Expected 153696030 (0.0023038981553394713%)Refined: 2061 | Refine Limit: 37 | Wrong: 0 | Right: 3695 | Total: 3695 | Total Zonos Considered: 5756 | Expected 160380353 (0.002303898158897306%)Refined: 2149 | Refine Limit: 38 | Wrong: 0 | Right: 3852 | Total: 3852 | Total Zonos Considered: 6001 | Expected 167194890 (0.0023038981633948263%)Refined: 2233 | Refine Limit: 39 | Wrong: 0 | Right: 3993 | Total: 3993 | Total Zonos Considered: 6226 | Expected 173314951 (0.002303898178986301%)Refined: 2316 | Refine Limit: 37 | Wrong: 0 | Right: 4144 | Total: 4144 | Total Zonos Considered: 6460 | Expected 179868770 (0.0023039018946980068%)Refined: 2405 | Refine Limit: 33 | Wrong: 0 | Right: 4301 | Total: 4301 | Total Zonos Considered: 6706 | Expected 186683292 (0.0023039019474758353%)Refined: 2478 | Refine Limit: 30 | Wrong: 0 | Right: 4435 | Total: 4435 | Total Zonos Considered: 6913 | Expected 192498474 (0.002303914367653637%)UNKNOWN
TIMEOUT
Refined: 2563 | Refine Limit: 39 | Wrong: 0 | Right: 4568 | Total: 4568 | Total Zonos Considered: 7131 | Expected 198271249 (0.002303914472238988%)

time: 120.311278077

[VERYDIFF_TIMER] 120.335299098

[VERYDIFF_EXPERIMENT] Running on /home/i57/steuber/NeuroDiff/repos/VeryDiffExperiments/src/../benchmarks/mnist-prune/specs/mnist_33_local_15.vnnlib /home/i57/steuber/NeuroDiff/repos/VeryDiffExperiments/src/../benchmarks/mnist-prune/nets/mnist_relu_4_1024.onnx
Loading /home/i57/steuber/NeuroDiff/repos/VeryDiffExperiments/src/../benchmarks/mnist-prune/nets/mnist_relu_4_1024.onnx and /home/i57/steuber/NeuroDiff/repos/VeryDiffExperiments/src/../benchmarks/mnist-prune/nets_pruned/mnist_relu_4_1024_pruned5.onnx
INPUT SHAPE: 784

[NEQUIV] 383.2851624675378

[12.99253411  0.          0.          0.         22.20971019  0.
  5.09535933  2.25142885  0.          0.        ]
[12.29517752  0.          0.          0.         16.8609081   0.
  2.90211453  0.99677947  0.          0.        ]
NETWORKS NOT EQUIVALENT
Refined: 0 | Refine Limit: -1 | Wrong: 0 | Right: 1 | Total: 1 | Total Zonos Considered: 1 | Expected 2 (50.0%)

time: 26.266104646

[VERYDIFF_TIMER] 26.29493809

[VERYDIFF_EXPERIMENT] NETWORK: /home/i57/steuber/NeuroDiff/repos/VeryDiffExperiments/src/../benchmarks/mnist-prune/specs/mnist_33_local_15.vnnlib
[VERYDIFF_EXPERIMENT] TIME: 149.445858452
