
[VERYDIFF_EXPERIMENT] Running on /home/i57/steuber/NeuroDiff/repos/VeryDiffExperiments/src/../benchmarks/mnist-prune/specs/mnist_40_global_6.vnnlib /home/i57/steuber/NeuroDiff/repos/VeryDiffExperiments/src/../benchmarks/mnist-prune/nets/mnist_relu_4_1024.onnx
Found input X
op: matmul, weight: (1024, 784), bias: nothing
op: bias, weight: nothing, bias: (1024,)
op: relu, weight: nothing, bias: nothing
op: matmul, weight: (1024, 1024), bias: nothing
op: bias, weight: nothing, bias: (1024,)
op: relu, weight: nothing, bias: nothing
op: matmul, weight: (1024, 1024), bias: nothing
op: bias, weight: nothing, bias: (1024,)
op: relu, weight: nothing, bias: nothing
op: matmul, weight: (10, 1024), bias: nothing
op: bias, weight: nothing, bias: (10,)
op: relu, weight: nothing, bias: nothing
op: matmul, weight: (10, 10), bias: nothing
op: bias, weight: nothing, bias: (10,)
Found input X
op: gemm, weight: (1024, 784), bias: (1024,)
op: relu, weight: nothing, bias: nothing
op: gemm, weight: (1024, 1024), bias: (1024,)
op: relu, weight: nothing, bias: nothing
op: gemm, weight: (1024, 1024), bias: (1024,)
op: relu, weight: nothing, bias: nothing
op: gemm, weight: (10, 1024), bias: (10,)
op: relu, weight: nothing, bias: nothing
op: gemm, weight: (10, 10), bias: (10,)
Distance: 915.6394868631054
Distance: 1298.7052820973968
Distance: 1296.587532894263
Distance: 6.054483317080667
Distance: 0.04942679278974538
Running with 1 threads
[Thread 1] Time to first task: 0.01s
Instable Generators: 718
Instable Generators: 1022
Instable Generators: 1024
Instable Generators: 10
Zono Bounds:
[-185.41122184903332, -189.36281565240017, -208.53234574355565, -206.88191927974526, -199.1007203589771, -210.57361831229778, -188.26824341760556, -197.0449308978527, -201.39925544451344, -209.8355316673656]
[184.92902971986956, 189.02058240237034, 207.78138724585028, 206.4169866423897, 198.94885433244698, 210.2841484968678, 188.23572595135238, 195.96658996638982, 201.55453843631537, 209.54406717717583]


TIMEOUT REACHED
UNKNOWN
[Thread 1] Total splits: 38
Processed 38 zonotopes (Work Done: 0.0%); Generated 76 (3.2119194491842107s/loop)
[Thread 1] Finished in 122.05s
 ────────────────────────────────────────────────────────────────────────────────
                                        Time                    Allocations      
                               ───────────────────────   ────────────────────────
       Tot / % measured:             122s / 100.0%           34.9GiB / 100.0%    

 Section               ncalls     time    %tot     avg     alloc    %tot      avg
 ────────────────────────────────────────────────────────────────────────────────
 Verify                     1     122s  100.0%    122s   34.9GiB   99.9%  34.9GiB
   Zonotope Loop            1     122s  100.0%    122s   34.9GiB   99.9%  34.9GiB
     Zonotope Propa...     38     118s   96.5%   3.10s   32.4GiB   92.6%   872MiB
       DiffZonotope...    152    68.2s   55.9%   449ms   26.7GiB   76.3%   180MiB
         Zonotope_R...    304    60.7s   49.7%   200ms   21.4GiB   61.2%  72.0MiB
           Influenc...    304    46.1s   37.8%   152ms   12.5GiB   35.9%  42.3MiB
             Multiply     304    26.6s   21.8%  87.6ms   7.61GiB   21.8%  25.6MiB
             Alloca...    304    18.7s   15.3%  61.6ms   4.94GiB   14.1%  16.6MiB
             Set Ma...    304    801ms    0.7%  2.63ms     0.00B    0.0%    0.00B
           Column M...    304    10.7s    8.8%  35.1ms   4.41GiB   12.6%  14.8MiB
           Allocation     304    3.00s    2.5%  9.86ms   4.41GiB   12.6%  14.8MiB
           Set Matrix     304    854ms    0.7%  2.81ms   5.17MiB    0.0%  17.4KiB
           Vectors        304   7.44ms    0.0%  24.5μs   10.1MiB    0.0%  34.0KiB
           Bounds         304    230μs    0.0%   758ns     0.00B    0.0%    0.00B
       DiffZonotope...    190    49.5s   40.6%   261ms   5.70GiB   16.3%  30.7MiB
         Zonotope_D...    380    24.4s   20.0%  64.2ms   2.83GiB    8.1%  7.63MiB
     Compute Split         38    4.03s    3.3%   106ms   1.78GiB    5.1%  48.0MiB
     Property Check        38    147ms    0.1%  3.88ms   28.5MiB    0.1%   767KiB
 Initialize                 1   17.1ms    0.0%  17.1ms   27.0MiB    0.1%  27.0MiB
 ────────────────────────────────────────────────────────────────────────────────
[VERYDIFF_TIMER] 122.148630975

[VERYDIFF_EXPERIMENT] NETWORK: /home/i57/steuber/NeuroDiff/repos/VeryDiffExperiments/src/../benchmarks/mnist-prune/specs/mnist_40_global_6.vnnlib
[VERYDIFF_EXPERIMENT] TIME: 122.435550867
