
[VERYDIFF_EXPERIMENT] Running on /home/i57/steuber/NeuroDiff/repos/VeryDiffExperiments/src/../benchmarks/acas-prune/specs/prop_26.vnnlib /home/i57/steuber/NeuroDiff/repos/VeryDiffExperiments/src/../benchmarks/acas-prune/nets/ACASXU_run2a_1_1_batch_2000.onnx
Found input X
op: matmul, weight: (50, 5), bias: nothing
op: bias, weight: nothing, bias: (50,)
op: relu, weight: nothing, bias: nothing
op: matmul, weight: (50, 50), bias: nothing
op: bias, weight: nothing, bias: (50,)
op: relu, weight: nothing, bias: nothing
op: matmul, weight: (50, 50), bias: nothing
op: bias, weight: nothing, bias: (50,)
op: relu, weight: nothing, bias: nothing
op: matmul, weight: (50, 50), bias: nothing
op: bias, weight: nothing, bias: (50,)
op: relu, weight: nothing, bias: nothing
op: matmul, weight: (50, 50), bias: nothing
op: bias, weight: nothing, bias: (50,)
op: relu, weight: nothing, bias: nothing
op: matmul, weight: (50, 50), bias: nothing
op: bias, weight: nothing, bias: (50,)
op: relu, weight: nothing, bias: nothing
op: matmul, weight: (5, 50), bias: nothing
op: bias, weight: nothing, bias: (5,)
Found input X
op: matmul, weight: (50, 5), bias: nothing
op: bias, weight: nothing, bias: (50,)
op: relu, weight: nothing, bias: nothing
op: matmul, weight: (50, 50), bias: nothing
op: bias, weight: nothing, bias: (50,)
op: relu, weight: nothing, bias: nothing
op: matmul, weight: (50, 50), bias: nothing
op: bias, weight: nothing, bias: (50,)
op: relu, weight: nothing, bias: nothing
op: matmul, weight: (50, 50), bias: nothing
op: bias, weight: nothing, bias: (50,)
op: relu, weight: nothing, bias: nothing
op: matmul, weight: (50, 50), bias: nothing
op: bias, weight: nothing, bias: (50,)
op: relu, weight: nothing, bias: nothing
op: matmul, weight: (50, 50), bias: nothing
op: bias, weight: nothing, bias: (50,)
op: relu, weight: nothing, bias: nothing
op: matmul, weight: (5, 50), bias: nothing
op: bias, weight: nothing, bias: (5,)
Distance: 1.5776899396441877
Distance: 17.418555105464293
Distance: 37.042030851967866
Distance: 30.03193642082624
Distance: 103.34971769736148
Distance: 163.01328082102555
Distance: 0.07780875975367962
Running with 1 threads
[Thread 1] Time to first task: 0.0s
Instable Generators: 21
Instable Generators: 27
Instable Generators: 48
Instable Generators: 48
Instable Generators: 48
Instable Generators: 48
Zono Bounds:
[-1090.3608274248438, -1260.6399661622868, -1343.8814074972793, -1246.0687032337282, -1238.0507032326975]
[1119.9437674279986, 1321.874402724255, 1325.8649251904021, 1313.266762318361, 1204.9481921740655]
[Thread 1] Processed 100 zonotopes (Work Done: 0.39062%; Expected Zonos: 25600.0)
[Thread 1] Processed 200 zonotopes (Work Done: 28.41797%; Expected Zonos: 703.7800687285223)
[Thread 1] Processed 300 zonotopes (Work Done: 61.05042%; Expected Zonos: 491.39715071232195)
[Thread 1] Total splits: 194
Processed 389 zonotopes (Work Done: 100.0%); Generated 388 (0.000626481264781491s/loop)
[Thread 1] Finished in 0.24s
 ────────────────────────────────────────────────────────────────────────────────
                                        Time                    Allocations      
                               ───────────────────────   ────────────────────────
       Tot / % measured:            244ms / 100.0%            428MiB / 100.0%    

 Section               ncalls     time    %tot     avg     alloc    %tot      avg
 ────────────────────────────────────────────────────────────────────────────────
 Verify                     1    244ms  100.0%   244ms    428MiB  100.0%   428MiB
   Zonotope Loop            1    244ms   99.9%   244ms    428MiB  100.0%   428MiB
     Zonotope Propa...    389    231ms   94.8%   594μs    412MiB   96.4%  1.06MiB
       DiffZonotope...  2.33k    137ms   56.0%  58.5μs    302MiB   70.6%   133KiB
         Zonotope_R...  4.67k   69.8ms   28.6%  15.0μs    169MiB   39.5%  37.1KiB
           Column M...  4.67k   21.6ms    8.9%  4.63μs   62.7MiB   14.7%  13.8KiB
           Influenc...  4.67k   17.9ms    7.3%  3.84μs   30.3MiB    7.1%  6.65KiB
             Multiply   4.67k   12.8ms    5.3%  2.74μs   23.7MiB    5.5%  5.19KiB
             Alloca...  4.67k   1.94ms    0.8%   416ns   6.64MiB    1.6%  1.46KiB
             Set Ma...  4.67k   1.21ms    0.5%   260ns     0.00B    0.0%    0.00B
           Allocation   4.67k   10.5ms    4.3%  2.25μs   62.0MiB   14.5%  13.6KiB
           Set Matrix   4.67k   8.22ms    3.4%  1.76μs   2.43MiB    0.6%     545B
           Vectors      4.67k   7.76ms    3.2%  1.66μs   11.5MiB    2.7%  2.52KiB
           Bounds       4.67k    832μs    0.3%   178ns     0.00B    0.0%    0.00B
       DiffZonotope...  2.72k   92.1ms   37.8%  33.8μs    110MiB   25.7%  41.4KiB
         Zonotope_D...  5.45k   36.3ms   14.9%  6.66μs   50.3MiB   11.8%  9.46KiB
     Property Check       389   8.88ms    3.6%  22.8μs   11.2MiB    2.6%  29.6KiB
     Compute Split        194   2.60ms    1.1%  13.4μs   3.45MiB    0.8%  18.2KiB
 Initialize                 1    100μs    0.0%   100μs    112KiB    0.0%   112KiB
 ────────────────────────────────────────────────────────────────────────────────
[VERYDIFF_TIMER] 0.251605073

[VERYDIFF_EXPERIMENT] NETWORK: /home/i57/steuber/NeuroDiff/repos/VeryDiffExperiments/src/../benchmarks/acas-prune/specs/prop_26.vnnlib
[VERYDIFF_EXPERIMENT] TIME: 0.55223003
