
[VERYDIFF_EXPERIMENT] Running on /home/i57/steuber/NeuroDiff/repos/VeryDiffExperiments/src/../benchmarks/mnist-prune/specs/mnist_58_local_21.vnnlib /home/i57/steuber/NeuroDiff/repos/VeryDiffExperiments/src/../benchmarks/mnist-prune/nets/mnist_relu_4_1024.onnx
Found input X
op: matmul, weight: (1024, 784), bias: nothing
op: bias, weight: nothing, bias: (1024,)
op: relu, weight: nothing, bias: nothing
op: matmul, weight: (1024, 1024), bias: nothing
op: bias, weight: nothing, bias: (1024,)
op: relu, weight: nothing, bias: nothing
op: matmul, weight: (1024, 1024), bias: nothing
op: bias, weight: nothing, bias: (1024,)
op: relu, weight: nothing, bias: nothing
op: matmul, weight: (10, 1024), bias: nothing
op: bias, weight: nothing, bias: (10,)
op: relu, weight: nothing, bias: nothing
op: matmul, weight: (10, 10), bias: nothing
op: bias, weight: nothing, bias: (10,)
Found input X
op: gemm, weight: (1024, 784), bias: (1024,)
op: relu, weight: nothing, bias: nothing
op: gemm, weight: (1024, 1024), bias: (1024,)
op: relu, weight: nothing, bias: nothing
op: gemm, weight: (1024, 1024), bias: (1024,)
op: relu, weight: nothing, bias: nothing
op: gemm, weight: (10, 1024), bias: (10,)
op: relu, weight: nothing, bias: nothing
op: gemm, weight: (10, 10), bias: (10,)
Distance: 915.6394868631054
Distance: 1298.7052820973968
Distance: 1296.587532894263
Distance: 6.054483317080667
Distance: 0.04942679278974538
Running with 1 threads
[Thread 1] Time to first task: 0.0s
Instable Generators: 451
Instable Generators: 871
Instable Generators: 1024
Instable Generators: 10
Zono Bounds:
[-153.6555886682276, -156.73006253887263, -173.0080372898207, -171.0662366263633, -165.22620294172273, -174.65618793057243, -155.82189564638927, -163.1710665522614, -167.21610541523026, -174.23328527418371]
[153.50214025095067, 156.34893427609853, 172.4768710448627, 170.92865090905676, 165.12816547503357, 174.49259187809187, 155.61369310400679, 162.42147032393453, 167.30969406644314, 174.03573227209185]
[Thread 1] Processed 100 zonotopes (Work Done: 0.0%; Expected Zonos: Inf)


TIMEOUT REACHED
UNKNOWN
[Thread 1] Total splits: 135
Processed 135 zonotopes (Work Done: 0.0%); Generated 270 (0.8892315074296296s/loop)
[Thread 1] Finished in 120.05s
 ────────────────────────────────────────────────────────────────────────────────
                                        Time                    Allocations      
                               ───────────────────────   ────────────────────────
       Tot / % measured:             120s / 100.0%           40.1GiB / 100.0%    

 Section               ncalls     time    %tot     avg     alloc    %tot      avg
 ────────────────────────────────────────────────────────────────────────────────
 Verify                     1     120s  100.0%    120s   40.1GiB   99.9%  40.1GiB
   Zonotope Loop            1     120s  100.0%    120s   40.1GiB   99.9%  40.1GiB
     Zonotope Propa...    135     119s   98.7%   878ms   39.7GiB   99.1%   301MiB
       DiffZonotope...    675    62.0s   51.7%  91.9ms   8.45GiB   21.1%  12.8MiB
         Zonotope_D...  1.35k    21.6s   18.0%  16.0ms   3.44GiB    8.6%  2.61MiB
       DiffZonotope...    540    56.5s   47.1%   105ms   31.3GiB   78.0%  59.3MiB
         Zonotope_R...  1.08k    16.4s   13.7%  15.2ms   19.4GiB   48.5%  18.4MiB
           Column M...  1.08k    7.67s    6.4%  7.10ms   7.88GiB   19.6%  7.47MiB
           Allocation   1.08k    5.14s    4.3%  4.76ms   7.88GiB   19.6%  7.47MiB
           Influenc...  1.08k    2.21s    1.8%  2.05ms   3.65GiB    9.1%  3.46MiB
             Multiply   1.08k    2.16s    1.8%  2.00ms   3.39GiB    8.5%  3.22MiB
             Alloca...  1.08k   36.6ms    0.0%  33.9μs    260MiB    0.6%   247KiB
             Set Ma...  1.08k   16.6ms    0.0%  15.4μs     0.00B    0.0%    0.00B
           Set Matrix   1.08k    1.38s    1.2%  1.28ms   14.8MiB    0.0%  14.0KiB
           Vectors      1.08k   32.1ms    0.0%  29.7μs   35.8MiB    0.1%  34.0KiB
           Bounds       1.08k    682μs    0.0%   631ns     0.00B    0.0%    0.00B
     Property Check       135    1.43s    1.2%  10.6ms   72.5MiB    0.2%   550KiB
     Compute Split        135   68.4ms    0.1%   507μs    161MiB    0.4%  1.19MiB
 Initialize                 1   14.4ms    0.0%  14.4ms   22.4MiB    0.1%  22.4MiB
 ────────────────────────────────────────────────────────────────────────────────
[VERYDIFF_TIMER] 120.144919948

[VERYDIFF_EXPERIMENT] NETWORK: /home/i57/steuber/NeuroDiff/repos/VeryDiffExperiments/src/../benchmarks/mnist-prune/specs/mnist_58_local_21.vnnlib
[VERYDIFF_EXPERIMENT] TIME: 120.468996043
