
[VERYDIFF_EXPERIMENT] Running on /home/i57/steuber/NeuroDiff/repos/VeryDiffExperiments/src/../benchmarks/mnist-prune/specs/mnist_42_global_5.vnnlib /home/i57/steuber/NeuroDiff/repos/VeryDiffExperiments/src/../benchmarks/mnist-prune/nets/mnist_relu_3_100.onnx
Found input X
op: matmul, weight: (100, 784), bias: nothing
op: bias, weight: nothing, bias: (100,)
op: relu, weight: nothing, bias: nothing
op: matmul, weight: (100, 100), bias: nothing
op: bias, weight: nothing, bias: (100,)
op: relu, weight: nothing, bias: nothing
op: matmul, weight: (10, 100), bias: nothing
op: bias, weight: nothing, bias: (10,)
op: relu, weight: nothing, bias: nothing
op: matmul, weight: (10, 10), bias: nothing
op: bias, weight: nothing, bias: (10,)
Found input X
op: gemm, weight: (100, 784), bias: (100,)
op: relu, weight: nothing, bias: nothing
op: gemm, weight: (100, 100), bias: (100,)
op: relu, weight: nothing, bias: nothing
op: gemm, weight: (10, 100), bias: (10,)
op: relu, weight: nothing, bias: nothing
op: gemm, weight: (10, 10), bias: (10,)
Distance: 1623.4465197373434
Distance: 201.62056963066925
Distance: 13.962962507051998
Distance: 0.183768135302671
Running with 1 threads
[Thread 1] Time to first task: 0.0s
Instable Generators: 32
Instable Generators: 44
Instable Generators: 7
Zono Bounds:
[-9.002867647400683e-5, -3.6029132342630237, -4.757335899182849, -4.099054238196599, -4.122489647571414, -4.208904271870134, -0.00264138339217736, -4.3309389572908685, -4.053881847090845, -4.416948449057163]
[0.00567856892021562, 3.5703541013105835, 3.975974159365856, 3.542554194119863, 5.468489681130918, 4.07973452266998, 3.618543678055898e-5, 3.979549071152258, 3.498521958400558, 4.143043082163869]
[Thread 1] Processed 100 zonotopes (Work Done: 0.0%; Expected Zonos: Inf)
[Thread 1] Processed 200 zonotopes (Work Done: 0.0%; Expected Zonos: Inf)
[Thread 1] Processed 300 zonotopes (Work Done: 0.0%; Expected Zonos: Inf)
[Thread 1] Processed 400 zonotopes (Work Done: 0.0%; Expected Zonos: Inf)
[Thread 1] Processed 500 zonotopes (Work Done: 0.0%; Expected Zonos: Inf)


TIMEOUT REACHED
UNKNOWN
[Thread 1] Total splits: 570
Processed 570 zonotopes (Work Done: 0.0%); Generated 1140 (0.21068649083508773s/loop)
[Thread 1] Finished in 120.09s
 ────────────────────────────────────────────────────────────────────────────────
                                        Time                    Allocations      
                               ───────────────────────   ────────────────────────
       Tot / % measured:             120s / 100.0%           60.5GiB / 100.0%    

 Section               ncalls     time    %tot     avg     alloc    %tot      avg
 ────────────────────────────────────────────────────────────────────────────────
 Verify                     1     120s  100.0%    120s   60.4GiB  100.0%  60.4GiB
   Zonotope Loop            1     120s  100.0%    120s   60.4GiB  100.0%  60.4GiB
     Zonotope Propa...    570    89.9s   74.8%   158ms   40.7GiB   67.3%  73.1MiB
       DiffZonotope...  1.71k    79.9s   66.5%  46.7ms   38.4GiB   63.5%  23.0MiB
         Zonotope_R...  3.42k    79.2s   65.9%  23.2ms   37.5GiB   62.0%  11.2MiB
           Influenc...  3.42k    72.6s   60.5%  21.2ms   34.5GiB   57.0%  10.3MiB
             Multiply   3.42k    39.8s   33.1%  11.6ms   17.5GiB   29.0%  5.24MiB
             Alloca...  3.42k    30.3s   25.3%  8.87ms   16.9GiB   28.0%  5.07MiB
             Set Ma...  3.42k    2.46s    2.0%   719μs     0.00B    0.0%    0.00B
           Column M...  3.42k    6.28s    5.2%  1.84ms   1.50GiB    2.5%   460KiB
           Set Matrix   3.42k    189ms    0.2%  55.3μs   3.24MiB    0.0%     992B
           Allocation   3.42k   82.9ms    0.1%  24.2μs   1.50GiB    2.5%   459KiB
           Vectors      3.42k   18.1ms    0.0%  5.30μs   10.9MiB    0.0%  3.26KiB
           Bounds       3.42k   2.42ms    0.0%   707ns     0.00B    0.0%    0.00B
       DiffZonotope...  2.28k    10.0s    8.3%  4.39ms   2.31GiB    3.8%  1.04MiB
         Zonotope_D...  4.56k    4.85s    4.0%  1.06ms   1.51GiB    2.5%   348KiB
     Compute Split        570    27.5s   22.9%  48.2ms   8.58GiB   14.2%  15.4MiB
     Property Check       570    633ms    0.5%  1.11ms   65.9MiB    0.1%   118KiB
 Initialize                 1    548μs    0.0%   548μs   5.41MiB    0.0%  5.41MiB
 ────────────────────────────────────────────────────────────────────────────────
[VERYDIFF_TIMER] 120.122273271

[VERYDIFF_EXPERIMENT] NETWORK: /home/i57/steuber/NeuroDiff/repos/VeryDiffExperiments/src/../benchmarks/mnist-prune/specs/mnist_42_global_5.vnnlib
[VERYDIFF_EXPERIMENT] TIME: 120.593812389
