
[VERYDIFF_EXPERIMENT] Running on /home/i57/steuber/NeuroDiff/repos/VeryDiffExperiments/src/../benchmarks/mnist-prune/specs/mnist_56_global_6.vnnlib /home/i57/steuber/NeuroDiff/repos/VeryDiffExperiments/src/../benchmarks/mnist-prune/nets/mnist_relu_2_512.onnx
Found input X
op: matmul, weight: (512, 784), bias: nothing
op: bias, weight: nothing, bias: (512,)
op: relu, weight: nothing, bias: nothing
op: matmul, weight: (512, 512), bias: nothing
op: bias, weight: nothing, bias: (512,)
op: relu, weight: nothing, bias: nothing
op: matmul, weight: (10, 512), bias: nothing
op: bias, weight: nothing, bias: (10,)
Found input X
op: gemm, weight: (512, 784), bias: (512,)
op: relu, weight: nothing, bias: nothing
op: gemm, weight: (512, 512), bias: (512,)
op: relu, weight: nothing, bias: nothing
op: gemm, weight: (10, 512), bias: (10,)
Distance: 973.3044369037136
Distance: 481.63499746812613
Distance: 8.744412635378467
Running with 1 threads
[Thread 1] Time to first task: 0.01s
Instable Generators: 140
Instable Generators: 229
Zono Bounds:
[-12.57891403299572, -10.55044488716698, -9.616246726118062, -11.672073898497294, -10.696445460427643, -10.929565673196786, -11.342335628294418, -11.871414158039405, -10.80801458312308, -9.694055508513571]
[16.02751354828405, 13.11746410766993, 12.74036110586409, 13.34020833008661, 13.566694008373172, 12.08059086317414, 13.050968246336602, 14.422027689219588, 12.124123985669959, 12.05816183193378]
[Thread 1] Processed 100 zonotopes (Work Done: 0.0%; Expected Zonos: Inf)
[Thread 1] Processed 200 zonotopes (Work Done: 0.0%; Expected Zonos: Inf)


TIMEOUT REACHED
UNKNOWN
[Thread 1] Total splits: 294
Processed 294 zonotopes (Work Done: 0.0%); Generated 588 (0.4083846855170068s/loop)
[Thread 1] Finished in 120.07s
 ────────────────────────────────────────────────────────────────────────────────
                                        Time                    Allocations      
                               ───────────────────────   ────────────────────────
       Tot / % measured:             120s / 100.0%           46.0GiB / 100.0%    

 Section               ncalls     time    %tot     avg     alloc    %tot      avg
 ────────────────────────────────────────────────────────────────────────────────
 Verify                     1     120s  100.0%    120s   46.0GiB  100.0%  46.0GiB
   Zonotope Loop            1     120s  100.0%    120s   46.0GiB  100.0%  46.0GiB
     Zonotope Propa...    294    96.9s   80.7%   330ms   34.8GiB   75.6%   121MiB
       DiffZonotope...    882    50.1s   41.7%  56.8ms   6.18GiB   13.4%  7.17MiB
         Zonotope_D...  1.76k    32.6s   27.2%  18.5ms   3.90GiB    8.5%  2.26MiB
       DiffZonotope...    588    46.8s   39.0%  79.6ms   28.6GiB   62.2%  49.9MiB
         Zonotope_R...  1.18k    44.8s   37.3%  38.1ms   25.1GiB   54.4%  21.8MiB
           Allocation   1.18k    22.3s   18.6%  18.9ms   4.66GiB   10.1%  4.06MiB
           Influenc...  1.18k    20.2s   16.8%  17.2ms   15.7GiB   34.1%  13.7MiB
             Multiply   1.18k    14.3s   11.9%  12.1ms   8.55GiB   18.6%  7.45MiB
             Alloca...  1.18k    4.97s    4.1%  4.22ms   7.14GiB   15.5%  6.22MiB
             Set Ma...  1.18k    951ms    0.8%   809μs     0.00B    0.0%    0.00B
           Column M...  1.18k    1.72s    1.4%  1.47ms   4.66GiB   10.1%  4.06MiB
           Set Matrix   1.18k    594ms    0.5%   505μs   6.09MiB    0.0%  5.31KiB
           Vectors      1.18k   22.4ms    0.0%  19.1μs   28.7MiB    0.1%  25.0KiB
           Bounds       1.18k    905μs    0.0%   769ns     0.00B    0.0%    0.00B
     Compute Split        294    3.21s    2.7%  10.9ms   5.42GiB   11.8%  18.9MiB
     Property Check       294    908ms    0.8%  3.09ms   69.1MiB    0.1%   241KiB
 Initialize                 1   2.21ms    0.0%  2.21ms   9.84MiB    0.0%  9.84MiB
 ────────────────────────────────────────────────────────────────────────────────
[VERYDIFF_TIMER] 120.103612722

[VERYDIFF_EXPERIMENT] NETWORK: /home/i57/steuber/NeuroDiff/repos/VeryDiffExperiments/src/../benchmarks/mnist-prune/specs/mnist_56_global_6.vnnlib
[VERYDIFF_EXPERIMENT] TIME: 120.446157265
