
[VERYDIFF_EXPERIMENT] Running on /home/i57/steuber/NeuroDiff/repos/VeryDiffExperiments/src/../benchmarks/mnist-prune/specs/mnist_3_global_5.vnnlib /home/i57/steuber/NeuroDiff/repos/VeryDiffExperiments/src/../benchmarks/mnist-prune/nets/mnist_relu_3_100.onnx
Parsing /home/i57/steuber/NeuroDiff/repos/VeryDiffExperiments/src/../benchmarks/mnist-prune/nets/mnist_relu_3_100.onnx...
Found input X
op: matmul, weight: (100, 784), bias: nothing
op: bias, weight: nothing, bias: (100,)
op: relu, weight: nothing, bias: nothing
op: matmul, weight: (100, 100), bias: nothing
op: bias, weight: nothing, bias: (100,)
op: relu, weight: nothing, bias: nothing
op: matmul, weight: (10, 100), bias: nothing
op: bias, weight: nothing, bias: (10,)
op: relu, weight: nothing, bias: nothing
op: matmul, weight: (10, 10), bias: nothing
op: bias, weight: nothing, bias: (10,)
Parsing /home/i57/steuber/NeuroDiff/repos/VeryDiffExperiments/src/../benchmarks/mnist-prune/nets_pruned/mnist_relu_3_100_0.79_adam_1_stepsize-old.onnx...
Found input X
op: gemm, weight: (100, 784), bias: (100,)
op: relu, weight: nothing, bias: nothing
op: gemm, weight: (100, 100), bias: (100,)
op: relu, weight: nothing, bias: nothing
op: gemm, weight: (10, 100), bias: (10,)
op: relu, weight: nothing, bias: nothing
op: gemm, weight: (10, 10), bias: (10,)
Distance: 368.62397500800625
Distance: 47.56803950402309
Distance: 2.8977568827249343
Distance: 0.01885471428334995
Running with 1 threads
[Thread 1] Time to first task: 0.0s
Instable Generators: 28
Instable Generators: 37
Instable Generators: 8
Zono Bounds:
[-0.7644193496623194, -0.7836917836162589, -0.7025275264560537, -0.8399858341531303, -0.8117261715932245, -1.005861503842464, -0.8888543505692024, -0.8080184684180681, -0.0008964199114866048, -0.8147543821009198]
[0.8844685106429088, 0.6035072213401997, 0.6242908189856448, 0.8383081067477967, 0.8123124336357572, 0.9197184209768726, 0.8025801378509883, 0.7706163291672724, -0.00022239804219719583, 0.810394178115496]
[Thread 1] Total splits: 0
Processed 1 zonotopes (Work Done: 100.0%); Generated 0 (0.14049674s/loop)
[Thread 1] Finished in 0.14s
 ────────────────────────────────────────────────────────────────────────────────
                                        Time                    Allocations      
                               ───────────────────────   ────────────────────────
       Tot / % measured:            141ms / 100.0%            160MiB / 100.0%    

 Section               ncalls     time    %tot     avg     alloc    %tot      avg
 ────────────────────────────────────────────────────────────────────────────────
 Verify                     1    141ms   99.6%   141ms    154MiB   96.6%   154MiB
   Zonotope Loop            1    140ms   99.6%   140ms    154MiB   96.6%   154MiB
     Property Check         1   86.6ms   61.4%  86.6ms   62.0MiB   38.9%  62.0MiB
     Zonotope Propa...      1   50.5ms   35.8%  50.5ms   72.2MiB   45.2%  72.2MiB
       DiffZonotope...      3   25.7ms   18.2%  8.55ms   68.0MiB   42.7%  22.7MiB
         Zonotope_R...      6   24.7ms   17.5%  4.12ms   66.5MiB   41.7%  11.1MiB
           Influenc...      6   23.5ms   16.6%  3.91ms   61.1MiB   38.3%  10.2MiB
             Multiply       6   18.0ms   12.7%  2.99ms   31.0MiB   19.4%  5.17MiB
             Set Ma...      6   4.12ms    2.9%   686μs     0.00B    0.0%    0.00B
             Alloca...      6   1.35ms    1.0%   225μs   30.1MiB   18.9%  5.02MiB
           Column M...      6    735μs    0.5%   123μs   2.66MiB    1.7%   455KiB
           Set Matrix       6    306μs    0.2%  51.0μs   5.30KiB    0.0%     904B
           Allocation       6    147μs    0.1%  24.5μs   2.66MiB    1.7%   455KiB
           Vectors          6   29.3μs    0.0%  4.88μs   19.5KiB    0.0%  3.26KiB
           Bounds           6   3.54μs    0.0%   590ns     0.00B    0.0%    0.00B
       DiffZonotope...      4   24.8ms   17.6%  6.20ms   4.12MiB    2.6%  1.03MiB
         Zonotope_D...      8   9.30ms    6.6%  1.16ms   2.70MiB    1.7%   346KiB
 Initialize                 1    542μs    0.4%   542μs   5.41MiB    3.4%  5.41MiB
 ────────────────────────────────────────────────────────────────────────────────
[VERYDIFF_TIMER] 0.167371209

[VERYDIFF_EXPERIMENT] NETWORK: /home/i57/steuber/NeuroDiff/repos/VeryDiffExperiments/src/../benchmarks/mnist-prune/specs/mnist_3_global_5.vnnlib
[VERYDIFF_EXPERIMENT] TIME: 0.471982112
