
[VERYDIFF_EXPERIMENT] Running on /home/i57/steuber/NeuroDiff/repos/VeryDiffExperiments/src/../benchmarks/mnist-prune/specs/mnist_24_global_6.vnnlib /home/i57/steuber/NeuroDiff/repos/VeryDiffExperiments/src/../benchmarks/mnist-prune/nets/mnist_relu_3_100.onnx
Found input X
op: matmul, weight: (100, 784), bias: nothing
op: bias, weight: nothing, bias: (100,)
op: relu, weight: nothing, bias: nothing
op: matmul, weight: (100, 100), bias: nothing
op: bias, weight: nothing, bias: (100,)
op: relu, weight: nothing, bias: nothing
op: matmul, weight: (10, 100), bias: nothing
op: bias, weight: nothing, bias: (10,)
op: relu, weight: nothing, bias: nothing
op: matmul, weight: (10, 10), bias: nothing
op: bias, weight: nothing, bias: (10,)
Found input X
op: gemm, weight: (100, 784), bias: (100,)
op: relu, weight: nothing, bias: nothing
op: gemm, weight: (100, 100), bias: (100,)
op: relu, weight: nothing, bias: nothing
op: gemm, weight: (10, 100), bias: (10,)
op: relu, weight: nothing, bias: nothing
op: gemm, weight: (10, 10), bias: (10,)
Distance: 368.62397500800625
Distance: 47.56803950402309
Distance: 2.8977568827249343
Distance: 0.01885471428334995
Running with 1 threads
[Thread 1] Time to first task: 0.0s
Instable Generators: 61
Instable Generators: 85
Instable Generators: 10
Zono Bounds:
[-2.474304053675892, -2.70251101552447, -2.9647727088896505, -2.780392404958979, -3.1470963286913487, -3.094732576305503, -3.0150053661355294, -3.100176267540305, -2.7410679106193783, -2.894659528476598]
[2.465750630596587, 2.494189131947758, 2.8243497547716623, 2.77779414569096, 3.1357521133257262, 3.0109856375065953, 2.980507743610289, 3.0606378852099843, 2.739379765080333, 2.885058932500075]
[Thread 1] Processed 100 zonotopes (Work Done: 0.0%; Expected Zonos: Inf)
[Thread 1] Processed 200 zonotopes (Work Done: 0.0%; Expected Zonos: Inf)
[Thread 1] Processed 300 zonotopes (Work Done: 0.0%; Expected Zonos: Inf)
[Thread 1] Processed 400 zonotopes (Work Done: 0.0%; Expected Zonos: Inf)
[Thread 1] Processed 500 zonotopes (Work Done: 0.0%; Expected Zonos: Inf)


TIMEOUT REACHED
UNKNOWN
[Thread 1] Total splits: 563
Processed 563 zonotopes (Work Done: 0.0%); Generated 1126 (0.21338121158614565s/loop)
[Thread 1] Finished in 120.13s
 ────────────────────────────────────────────────────────────────────────────────
                                        Time                    Allocations      
                               ───────────────────────   ────────────────────────
       Tot / % measured:             120s / 100.0%           63.4GiB / 100.0%    

 Section               ncalls     time    %tot     avg     alloc    %tot      avg
 ────────────────────────────────────────────────────────────────────────────────
 Verify                     1     120s  100.0%    120s   63.4GiB  100.0%  63.4GiB
   Zonotope Loop            1     120s  100.0%    120s   63.4GiB  100.0%  63.4GiB
     Zonotope Propa...    563     108s   89.6%   191ms   43.3GiB   68.4%  78.8MiB
       DiffZonotope...  2.25k    71.6s   59.6%  31.8ms   2.37GiB    3.7%  1.08MiB
         Zonotope_D...  4.50k    66.5s   55.3%  14.8ms   1.53GiB    2.4%   356KiB
       DiffZonotope...  1.69k    36.0s   30.0%  21.3ms   41.0GiB   64.6%  24.8MiB
         Zonotope_R...  3.38k    35.5s   29.6%  10.5ms   40.0GiB   63.0%  12.1MiB
           Influenc...  3.38k    33.5s   27.9%  9.91ms   36.8GiB   58.1%  11.2MiB
             Alloca...  3.38k    17.4s   14.5%  5.16ms   17.9GiB   28.2%  5.41MiB
             Multiply   3.38k    13.5s   11.2%  3.99ms   18.9GiB   29.9%  5.74MiB
             Set Ma...  3.38k    2.55s    2.1%   756μs     0.00B    0.0%    0.00B
           Column M...  3.38k    1.72s    1.4%   508μs   1.57GiB    2.5%   487KiB
           Set Matrix   3.38k    195ms    0.2%  57.8μs   5.10MiB    0.0%  1.55KiB
           Allocation   3.38k   99.3ms    0.1%  29.4μs   1.57GiB    2.5%   487KiB
           Vectors      3.38k   16.5ms    0.0%  4.89μs   10.7MiB    0.0%  3.26KiB
           Bounds       3.38k   2.46ms    0.0%   727ns     0.00B    0.0%    0.00B
     Compute Split        563    4.21s    3.5%  7.48ms   8.97GiB   14.1%  16.3MiB
     Property Check       563    112ms    0.1%   198μs    122MiB    0.2%   223KiB
 Initialize                 1    515μs    0.0%   515μs   5.41MiB    0.0%  5.41MiB
 ────────────────────────────────────────────────────────────────────────────────
[VERYDIFF_TIMER] 120.1621206

[VERYDIFF_EXPERIMENT] NETWORK: /home/i57/steuber/NeuroDiff/repos/VeryDiffExperiments/src/../benchmarks/mnist-prune/specs/mnist_24_global_6.vnnlib
[VERYDIFF_EXPERIMENT] TIME: 120.622059865
