
[VERYDIFF_EXPERIMENT] Running on /home/i57/steuber/NeuroDiff/repos/VeryDiffExperiments/src/../benchmarks/mnist-prune/specs/mnist_72_global_4.vnnlib /home/i57/steuber/NeuroDiff/repos/VeryDiffExperiments/src/../benchmarks/mnist-prune/nets/mnist_relu_3_100.onnx
Total difference: 419.1098
Average difference: 0.0047
Initial output delta:
[-0.624913 -0.497974 -0.683735 -0.595432 -0.001043 -0.718375 -0.000339 -0.004499 -0.567811 -0.002277 ]
[0.587521 0.534587 0.620173 0.666018 0.001164 0.682363 0.000828 0.000920 0.513986 0.001855 ]

No adv!
time: 0.126835 


numSplits: 0
setenv(`timeout -k 5 120 ../NeuroDiff/DiffNN-Code/delta_network_test 472 /home/i57/steuber/NeuroDiff/repos/VeryDiffExperiments/src/../benchmarks/mnist-prune/nets/mnist_relu_3_100.nnet /home/i57/steuber/NeuroDiff/repos/VeryDiffExperiments/src/../benchmarks/mnist-prune/nets_pruned/mnist_relu_3_100_0.79_adam_1_stepsize.nnet 1.0 -p 4`,["OMP_NUM_THREADS=1"])
[VERYDIFF_TIMER] 0.175675538

[VERYDIFF_EXPERIMENT] NETWORK: /home/i57/steuber/NeuroDiff/repos/VeryDiffExperiments/src/../benchmarks/mnist-prune/specs/mnist_72_global_4.vnnlib
[VERYDIFF_EXPERIMENT] TIME: 0.524352825
