
[VERYDIFF_EXPERIMENT] Running on /home/i57/steuber/NeuroDiff/repos/VeryDiffExperiments/src/../benchmarks/mnist-prune/specs/mnist_9_global_4.vnnlib /home/i57/steuber/NeuroDiff/repos/VeryDiffExperiments/src/../benchmarks/mnist-prune/nets/mnist_relu_3_100.onnx
Parsing /home/i57/steuber/NeuroDiff/repos/VeryDiffExperiments/src/../benchmarks/mnist-prune/nets/mnist_relu_3_100.onnx...
Found input X
op: matmul, weight: (100, 784), bias: nothing
op: bias, weight: nothing, bias: (100,)
op: relu, weight: nothing, bias: nothing
op: matmul, weight: (100, 100), bias: nothing
op: bias, weight: nothing, bias: (100,)
op: relu, weight: nothing, bias: nothing
op: matmul, weight: (10, 100), bias: nothing
op: bias, weight: nothing, bias: (10,)
op: relu, weight: nothing, bias: nothing
op: matmul, weight: (10, 10), bias: nothing
op: bias, weight: nothing, bias: (10,)
Parsing /home/i57/steuber/NeuroDiff/repos/VeryDiffExperiments/src/../benchmarks/mnist-prune/nets_pruned/mnist_relu_3_100_0.79_adam_1_stepsize-old.onnx...
Found input X
op: gemm, weight: (100, 784), bias: (100,)
op: relu, weight: nothing, bias: nothing
op: gemm, weight: (100, 100), bias: (100,)
op: relu, weight: nothing, bias: nothing
op: gemm, weight: (10, 100), bias: (10,)
op: relu, weight: nothing, bias: nothing
op: gemm, weight: (10, 10), bias: (10,)
Distance: 368.62397500800625
Distance: 47.56803950402309
Distance: 2.8977568827249343
Distance: 0.01885471428334995
Running with 1 threads
[Thread 1] Time to first task: 0.0s
Instable Generators: 30
Instable Generators: 40
Instable Generators: 4
Zono Bounds:
[0.00045520818709977076, -0.00013796664452985147, -0.8524264326200632, -0.7359411536052083, -1.010644859881339, 0.0002948011096576674, -0.00034880704669630684, -0.9270476451030908, -0.7388710313980564, -0.7551444859131539]
[0.000687994305809796, 0.000520629988938151, 0.8533837141388352, 0.7185435592925242, 1.0077984019213593, 0.0009690647049759521, 0.00031411913315137417, 0.81548509488833, 0.6528393518163509, 0.768097245552163]
[Thread 1] Processed 100 zonotopes (Work Done: 0.0%; Expected Zonos: Inf)
[Thread 1] Processed 200 zonotopes (Work Done: 0.0%; Expected Zonos: Inf)
[Thread 1] Processed 300 zonotopes (Work Done: 0.0%; Expected Zonos: Inf)
[Thread 1] Processed 400 zonotopes (Work Done: 0.0%; Expected Zonos: Inf)


TIMEOUT REACHED
UNKNOWN
[Thread 1] Total splits: 418
Processed 418 zonotopes (Work Done: 0.0%); Generated 836 (0.2880442920382775s/loop)
[Thread 1] Finished in 120.4s
 ────────────────────────────────────────────────────────────────────────────────
                                        Time                    Allocations      
                               ───────────────────────   ────────────────────────
       Tot / % measured:             120s / 100.0%           65.0GiB / 100.0%    

 Section               ncalls     time    %tot     avg     alloc    %tot      avg
 ────────────────────────────────────────────────────────────────────────────────
 Verify                     1     120s  100.0%    120s   65.0GiB  100.0%  65.0GiB
   Zonotope Loop            1     120s  100.0%    120s   65.0GiB  100.0%  65.0GiB
     Property Check       418    84.0s   69.8%   201ms   21.1GiB   32.4%  51.6MiB
     Zonotope Propa...    418    31.3s   26.0%  74.9ms   29.5GiB   45.4%  72.3MiB
       DiffZonotope...  1.25k    24.8s   20.6%  19.8ms   27.8GiB   42.8%  22.7MiB
         Zonotope_R...  2.51k    24.4s   20.3%  9.72ms   27.2GiB   41.8%  11.1MiB
           Influenc...  2.51k    23.9s   19.8%  9.52ms   25.0GiB   38.5%  10.2MiB
             Alloca...  2.51k    14.5s   12.1%  5.79ms   12.3GiB   19.0%  5.03MiB
             Multiply   2.51k    7.63s    6.3%  3.04ms   12.7GiB   19.5%  5.18MiB
             Set Ma...  2.51k    1.72s    1.4%   686μs     0.00B    0.0%    0.00B
           Column M...  2.51k    300ms    0.2%   120μs   1.09GiB    1.7%   456KiB
           Set Matrix   2.51k    127ms    0.1%  50.7μs   2.13MiB    0.0%     889B
           Allocation   2.51k   52.7ms    0.0%  21.0μs   1.09GiB    1.7%   456KiB
           Vectors      2.51k   12.2ms    0.0%  4.88μs   7.97MiB    0.0%  3.26KiB
           Bounds       2.51k   1.69ms    0.0%   675ns     0.00B    0.0%    0.00B
       DiffZonotope...  1.67k    6.53s    5.4%  3.91ms   1.68GiB    2.6%  1.03MiB
         Zonotope_D...  3.34k    3.16s    2.6%   944μs   1.10GiB    1.7%   346KiB
     Compute Split        418    3.25s    2.7%  7.76ms   6.24GiB    9.6%  15.3MiB
 Initialize                 1    561μs    0.0%   561μs   5.41MiB    0.0%  5.41MiB
 ────────────────────────────────────────────────────────────────────────────────
[VERYDIFF_TIMER] 120.449215123

[VERYDIFF_EXPERIMENT] NETWORK: /home/i57/steuber/NeuroDiff/repos/VeryDiffExperiments/src/../benchmarks/mnist-prune/specs/mnist_9_global_4.vnnlib
[VERYDIFF_EXPERIMENT] TIME: 120.896355177
