[runlim] version:		2.0.0rc12
[runlim] host:			i57pool5
[runlim] time limit:		311040000 seconds
[runlim] real time limit:	120 seconds
[runlim] space limit:		15563 MB
[runlim] argv[0]:		/home/i57/steuber/.local/bin/Marabou
[runlim] argv[1]:		./mnist-prune/nets/product_mnist_relu_3_100_mnist_relu_3_100_pruned5_eps.onnx
[runlim] argv[2]:		./mnist-prune/specs/product_mnist_81_global_5_eps_1.0.vnnlib
[runlim] start:			Fri Oct  4 05:24:29 2024
[runlim] child:			902079
Network: ./mnist-prune/nets/product_mnist_relu_3_100_mnist_relu_3_100_pruned5_eps.onnx
Property: ./mnist-prune/specs/product_mnist_81_global_5_eps_1.0.vnnlib

Engine::processInputQuery: Input query (before preprocessing): 450 equations, 1654 variables
Engine::processInputQuery: Input query (after preprocessing): 830 equations, 1899 variables

Input bounds:
	x0: [ -0.0000,   0.0196] 
	x1: [ -0.0000,   0.0196] 
	x2: [ -0.0000,   0.0196] 
	x3: [ -0.0000,   0.0196] 
	x4: [ -0.0000,   0.0196] 
	x5: [ -0.0000,   0.0196] 
	x6: [ -0.0000,   0.0196] 
	x7: [ -0.0000,   0.0196] 
	x8: [ -0.0000,   0.0196] 
	x9: [ -0.0000,   0.0196] 
	x10: [ -0.0000,   0.0196] 
	x11: [ -0.0000,   0.0196] 
	x12: [ -0.0000,   0.0196] 
	x13: [ -0.0000,   0.0196] 
	x14: [ -0.0000,   0.0196] 
	x15: [ -0.0000,   0.0196] 
	x16: [ -0.0000,   0.0196] 
	x17: [ -0.0000,   0.0196] 
	x18: [ -0.0000,   0.0196] 
	x19: [ -0.0000,   0.0196] 
	x20: [ -0.0000,   0.0196] 
	x21: [ -0.0000,   0.0196] 
	x22: [ -0.0000,   0.0196] 
	x23: [ -0.0000,   0.0196] 
	x24: [ -0.0000,   0.0196] 
	x25: [ -0.0000,   0.0196] 
	x26: [ -0.0000,   0.0196] 
	x27: [ -0.0000,   0.0196] 
	x28: [ -0.0000,   0.0196] 
	x29: [ -0.0000,   0.0196] 
	x30: [ -0.0000,   0.0196] 
	x31: [ -0.0000,   0.0196] 
	x32: [ -0.0000,   0.0196] 
	x33: [ -0.0000,   0.0196] 
	x34: [ -0.0000,   0.0196] 
	x35: [ -0.0000,   0.0196] 
	x36: [ -0.0000,   0.0196] 
	x37: [ -0.0000,   0.0196] 
	x38: [ -0.0000,   0.0196] 
	x39: [ -0.0000,   0.0196] 
	x40: [ -0.0000,   0.0196] 
	x41: [ -0.0000,   0.0196] 
	x42: [ -0.0000,   0.0196] 
	x43: [ -0.0000,   0.0196] 
	x44: [ -0.0000,   0.0196] 
	x45: [ -0.0000,   0.0196] 
	x46: [ -0.0000,   0.0196] 
	x47: [ -0.0000,   0.0196] 
	x48: [ -0.0000,   0.0196] 
	x49: [ -0.0000,   0.0196] 
	x50: [ -0.0000,   0.0196] 
	x51: [ -0.0000,   0.0196] 
	x52: [ -0.0000,   0.0196] 
	x53: [ -0.0000,   0.0196] 
	x54: [ -0.0000,   0.0196] 
	x55: [ -0.0000,   0.0196] 
	x56: [ -0.0000,   0.0196] 
	x57: [ -0.0000,   0.0196] 
	x58: [ -0.0000,   0.0196] 
	x59: [ -0.0000,   0.0196] 
	x60: [ -0.0000,   0.0196] 
	x61: [ -0.0000,   0.0196] 
	x62: [ -0.0000,   0.0196] 
	x63: [ -0.0000,   0.0196] 
	x64: [ -0.0000,   0.0196] 
	x65: [ -0.0000,   0.0196] 
	x66: [ -0.0000,   0.0196] 
	x67: [ -0.0000,   0.0196] 
	x68: [ -0.0000,   0.0196] 
	x69: [ -0.0000,   0.0196] 
	x70: [ -0.0000,   0.0196] 
	x71: [ -0.0000,   0.0196] 
	x72: [ -0.0000,   0.0196] 
	x73: [ -0.0000,   0.0196] 
	x74: [ -0.0000,   0.0196] 
	x75: [ -0.0000,   0.0196] 
	x76: [ -0.0000,   0.0196] 
	x77: [ -0.0000,   0.0196] 
	x78: [ -0.0000,   0.0196] 
	x79: [ -0.0000,   0.0196] 
	x80: [ -0.0000,   0.0196] 
	x81: [ -0.0000,   0.0196] 
	x82: [ -0.0000,   0.0196] 
	x83: [ -0.0000,   0.0196] 
	x84: [ -0.0000,   0.0196] 
	x85: [ -0.0000,   0.0196] 
	x86: [ -0.0000,   0.0196] 
	x87: [ -0.0000,   0.0196] 
	x88: [ -0.0000,   0.0196] 
	x89: [ -0.0000,   0.0196] 
	x90: [ -0.0000,   0.0196] 
	x91: [ -0.0000,   0.0196] 
	x92: [ -0.0000,   0.0196] 
	x93: [ -0.0000,   0.0196] 
	x94: [ -0.0000,   0.0196] 
	x95: [ -0.0000,   0.0196] 
	x96: [ -0.0000,   0.0196] 
	x97: [ -0.0000,   0.0196] 
	x98: [ -0.0000,   0.0196] 
	x99: [  0.2902,   0.3294] 
	x100: [  0.6392,   0.6784] 
	x101: [  0.5294,   0.5686] 
	x102: [ -0.0000,   0.0314] 
	x103: [ -0.0000,   0.0196] 
	x104: [ -0.0000,   0.0196] 
	x105: [ -0.0000,   0.0196] 
	x106: [ -0.0000,   0.0196] 
	x107: [ -0.0000,   0.0196] 
	x108: [ -0.0000,   0.0196] 
	x109: [ -0.0000,   0.0196] 
	x110: [ -0.0000,   0.0196] 
	x111: [ -0.0000,   0.0196] 
	x112: [ -0.0000,   0.0196] 
	x113: [ -0.0000,   0.0196] 
	x114: [ -0.0000,   0.0196] 
	x115: [ -0.0000,   0.0196] 
	x116: [ -0.0000,   0.0196] 
	x117: [ -0.0000,   0.0196] 
	x118: [ -0.0000,   0.0196] 
	x119: [ -0.0000,   0.0196] 
	x120: [ -0.0000,   0.0196] 
	x121: [ -0.0000,   0.0196] 
	x122: [ -0.0000,   0.0196] 
	x123: [ -0.0000,   0.0196] 
	x124: [ -0.0000,   0.0196] 
	x125: [  0.3020,   0.3412] 
	x126: [  0.7569,   0.7961] 
	x127: [  0.9333,   0.9725] 
	x128: [  0.9765,   1.0000] 
	x129: [  0.9765,   1.0000] 
	x130: [  0.0392,   0.0784] 
	x131: [ -0.0000,   0.0196] 
	x132: [ -0.0000,   0.0196] 
	x133: [ -0.0000,   0.0196] 
	x134: [ -0.0000,   0.0196] 
	x135: [ -0.0000,   0.0196] 
	x136: [ -0.0000,   0.0196] 
	x137: [ -0.0000,   0.0196] 
	x138: [ -0.0000,   0.0196] 
	x139: [ -0.0000,   0.0196] 
	x140: [ -0.0000,   0.0196] 
	x141: [ -0.0000,   0.0196] 
	x142: [ -0.0000,   0.0196] 
	x143: [ -0.0000,   0.0196] 
	x144: [ -0.0000,   0.0196] 
	x145: [ -0.0000,   0.0196] 
	x146: [ -0.0000,   0.0196] 
	x147: [ -0.0000,   0.0196] 
	x148: [ -0.0000,   0.0196] 
	x149: [ -0.0000,   0.0196] 
	x150: [ -0.0000,   0.0196] 
	x151: [ -0.0000,   0.0314] 
	x152: [  0.3255,   0.3647] 
	x153: [  0.9725,   1.0000] 
	x154: [  0.9765,   1.0000] 
	x155: [  0.9765,   1.0000] 
	x156: [  0.9765,   1.0000] 
	x157: [  0.9765,   1.0000] 
	x158: [  0.0392,   0.0784] 
	x159: [ -0.0000,   0.0196] 
	x160: [ -0.0000,   0.0196] 
	x161: [ -0.0000,   0.0196] 
	x162: [ -0.0000,   0.0196] 
	x163: [ -0.0000,   0.0196] 
	x164: [ -0.0000,   0.0196] 
	x165: [ -0.0000,   0.0196] 
	x166: [ -0.0000,   0.0196] 
	x167: [ -0.0000,   0.0196] 
	x168: [ -0.0000,   0.0196] 
	x169: [ -0.0000,   0.0196] 
	x170: [ -0.0000,   0.0196] 
	x171: [ -0.0000,   0.0196] 
	x172: [ -0.0000,   0.0196] 
	x173: [ -0.0000,   0.0196] 
	x174: [ -0.0000,   0.0196] 
	x175: [ -0.0000,   0.0196] 
	x176: [ -0.0000,   0.0196] 
	x177: [ -0.0000,   0.0196] 
	x178: [ -0.0000,   0.0196] 
	x179: [  0.1765,   0.2157] 
	x180: [  0.9765,   1.0000] 
	x181: [  0.9765,   1.0000] 
	x182: [  0.9765,   1.0000] 
	x183: [  0.9765,   1.0000] 
	x184: [  0.7922,   0.8314] 
	x185: [  0.5059,   0.5451] 
	x186: [ -0.0000,   0.0353] 
	x187: [ -0.0000,   0.0196] 
	x188: [ -0.0000,   0.0196] 
	x189: [ -0.0000,   0.0196] 
	x190: [ -0.0000,   0.0196] 
	x191: [ -0.0000,   0.0196] 
	x192: [ -0.0000,   0.0196] 
	x193: [ -0.0000,   0.0196] 
	x194: [ -0.0000,   0.0196] 
	x195: [ -0.0000,   0.0196] 
	x196: [ -0.0000,   0.0196] 
	x197: [ -0.0000,   0.0196] 
	x198: [ -0.0000,   0.0196] 
	x199: [ -0.0000,   0.0196] 
	x200: [ -0.0000,   0.0196] 
	x201: [ -0.0000,   0.0196] 
	x202: [ -0.0000,   0.0196] 
	x203: [ -0.0000,   0.0196] 
	x204: [ -0.0000,   0.0196] 
	x205: [ -0.0000,   0.0196] 
	x206: [  0.0118,   0.0510] 
	x207: [  0.6706,   0.7098] 
	x208: [  0.9765,   1.0000] 
	x209: [  0.9765,   1.0000] 
	x210: [  0.9137,   0.9529] 
	x211: [  0.3922,   0.4314] 
	x212: [  0.0157,   0.0549] 
	x213: [ -0.0000,   0.0196] 
	x214: [ -0.0000,   0.0196] 
	x215: [ -0.0000,   0.0196] 
	x216: [ -0.0000,   0.0196] 
	x217: [ -0.0000,   0.0196] 
	x218: [ -0.0000,   0.0196] 
	x219: [ -0.0000,   0.0196] 
	x220: [ -0.0000,   0.0196] 
	x221: [ -0.0000,   0.0196] 
	x222: [ -0.0000,   0.0196] 
	x223: [ -0.0000,   0.0196] 
	x224: [ -0.0000,   0.0196] 
	x225: [ -0.0000,   0.0196] 
	x226: [ -0.0000,   0.0196] 
	x227: [ -0.0000,   0.0196] 
	x228: [ -0.0000,   0.0196] 
	x229: [ -0.0000,   0.0196] 
	x230: [ -0.0000,   0.0196] 
	x231: [ -0.0000,   0.0196] 
	x232: [ -0.0000,   0.0196] 
	x233: [ -0.0000,   0.0196] 
	x234: [  0.5490,   0.5882] 
	x235: [  0.9804,   1.0000] 
	x236: [  0.9765,   1.0000] 
	x237: [  0.9647,   1.0000] 
	x238: [  0.0980,   0.1373] 
	x239: [ -0.0000,   0.0196] 
	x240: [ -0.0000,   0.0196] 
	x241: [ -0.0000,   0.0196] 
	x242: [ -0.0000,   0.0196] 
	x243: [ -0.0000,   0.0196] 
	x244: [ -0.0000,   0.0196] 
	x245: [ -0.0000,   0.0196] 
	x246: [ -0.0000,   0.0196] 
	x247: [ -0.0000,   0.0196] 
	x248: [ -0.0000,   0.0196] 
	x249: [ -0.0000,   0.0196] 
	x250: [ -0.0000,   0.0196] 
	x251: [ -0.0000,   0.0196] 
	x252: [ -0.0000,   0.0196] 
	x253: [ -0.0000,   0.0196] 
	x254: [ -0.0000,   0.0196] 
	x255: [ -0.0000,   0.0196] 
	x256: [ -0.0000,   0.0196] 
	x257: [ -0.0000,   0.0196] 
	x258: [ -0.0000,   0.0196] 
	x259: [ -0.0000,   0.0196] 
	x260: [ -0.0000,   0.0196] 
	x261: [  0.0549,   0.0941] 
	x262: [  0.8196,   0.8588] 
	x263: [  0.9765,   1.0000] 
	x264: [  0.8627,   0.9020] 
	x265: [  0.1647,   0.2039] 
	x266: [ -0.0000,   0.0196] 
	x267: [ -0.0000,   0.0196] 
	x268: [ -0.0000,   0.0196] 
	x269: [ -0.0000,   0.0196] 
	x270: [ -0.0000,   0.0196] 
	x271: [ -0.0000,   0.0196] 
	x272: [ -0.0000,   0.0196] 
	x273: [ -0.0000,   0.0196] 
	x274: [ -0.0000,   0.0196] 
	x275: [ -0.0000,   0.0196] 
	x276: [ -0.0000,   0.0196] 
	x277: [ -0.0000,   0.0196] 
	x278: [ -0.0000,   0.0196] 
	x279: [ -0.0000,   0.0196] 
	x280: [ -0.0000,   0.0196] 
	x281: [ -0.0000,   0.0196] 
	x282: [ -0.0000,   0.0196] 
	x283: [ -0.0000,   0.0196] 
	x284: [ -0.0000,   0.0196] 
	x285: [ -0.0000,   0.0196] 
	x286: [ -0.0000,   0.0196] 
	x287: [ -0.0000,   0.0196] 
	x288: [ -0.0000,   0.0196] 
	x289: [  0.7608,   0.8000] 
	x290: [  0.9765,   1.0000] 
	x291: [  0.9647,   1.0000] 
	x292: [  0.3843,   0.4235] 
	x293: [ -0.0000,   0.0196] 
	x294: [ -0.0000,   0.0196] 
	x295: [ -0.0000,   0.0196] 
	x296: [ -0.0000,   0.0196] 
	x297: [ -0.0000,   0.0196] 
	x298: [ -0.0000,   0.0196] 
	x299: [ -0.0000,   0.0196] 
	x300: [ -0.0000,   0.0196] 
	x301: [ -0.0000,   0.0196] 
	x302: [ -0.0000,   0.0196] 
	x303: [ -0.0000,   0.0196] 
	x304: [ -0.0000,   0.0196] 
	x305: [ -0.0000,   0.0196] 
	x306: [ -0.0000,   0.0196] 
	x307: [ -0.0000,   0.0196] 
	x308: [ -0.0000,   0.0196] 
	x309: [ -0.0000,   0.0196] 
	x310: [ -0.0000,   0.0196] 
	x311: [ -0.0000,   0.0196] 
	x312: [ -0.0000,   0.0196] 
	x313: [ -0.0000,   0.0196] 
	x314: [ -0.0000,   0.0196] 
	x315: [ -0.0000,   0.0196] 
	x316: [ -0.0000,   0.0196] 
	x317: [  0.9020,   0.9412] 
	x318: [  0.9804,   1.0000] 
	x319: [  0.5725,   0.6118] 
	x320: [ -0.0000,   0.0196] 
	x321: [ -0.0000,   0.0196] 
	x322: [ -0.0000,   0.0196] 
	x323: [ -0.0000,   0.0196] 
	x324: [ -0.0000,   0.0196] 
	x325: [ -0.0000,   0.0196] 
	x326: [ -0.0000,   0.0196] 
	x327: [ -0.0000,   0.0196] 
	x328: [ -0.0000,   0.0196] 
	x329: [ -0.0000,   0.0196] 
	x330: [ -0.0000,   0.0196] 
	x331: [ -0.0000,   0.0196] 
	x332: [ -0.0000,   0.0196] 
	x333: [ -0.0000,   0.0196] 
	x334: [ -0.0000,   0.0196] 
	x335: [ -0.0000,   0.0196] 
	x336: [ -0.0000,   0.0196] 
	x337: [ -0.0000,   0.0196] 
	x338: [ -0.0000,   0.0196] 
	x339: [ -0.0000,   0.0196] 
	x340: [ -0.0000,   0.0196] 
	x341: [ -0.0000,   0.0196] 
	x342: [ -0.0000,   0.0196] 
	x343: [ -0.0000,   0.0196] 
	x344: [ -0.0000,   0.0196] 
	x345: [  0.9020,   0.9412] 
	x346: [  0.9765,   1.0000] 
	x347: [  0.5059,   0.5451] 
	x348: [ -0.0000,   0.0196] 
	x349: [ -0.0000,   0.0196] 
	x350: [ -0.0000,   0.0196] 
	x351: [ -0.0000,   0.0196] 
	x352: [ -0.0000,   0.0196] 
	x353: [ -0.0000,   0.0196] 
	x354: [ -0.0000,   0.0196] 
	x355: [ -0.0000,   0.0196] 
	x356: [ -0.0000,   0.0196] 
	x357: [ -0.0000,   0.0196] 
	x358: [ -0.0000,   0.0196] 
	x359: [ -0.0000,   0.0196] 
	x360: [ -0.0000,   0.0196] 
	x361: [ -0.0000,   0.0196] 
	x362: [ -0.0000,   0.0196] 
	x363: [ -0.0000,   0.0196] 
	x364: [ -0.0000,   0.0196] 
	x365: [ -0.0000,   0.0196] 
	x366: [ -0.0000,   0.0196] 
	x367: [ -0.0000,   0.0196] 
	x368: [ -0.0000,   0.0196] 
	x369: [ -0.0000,   0.0196] 
	x370: [ -0.0000,   0.0196] 
	x371: [ -0.0000,   0.0196] 
	x372: [  0.2431,   0.2824] 
	x373: [  0.9647,   1.0000] 
	x374: [  0.8667,   0.9059] 
	x375: [  0.1373,   0.1765] 
	x376: [ -0.0000,   0.0196] 
	x377: [ -0.0000,   0.0196] 
	x378: [ -0.0000,   0.0196] 
	x379: [ -0.0000,   0.0196] 
	x380: [  0.0471,   0.0863] 
	x381: [  0.3725,   0.4118] 
	x382: [  0.7529,   0.7922] 
	x383: [  0.6510,   0.6902] 
	x384: [  0.0196,   0.0588] 
	x385: [ -0.0000,   0.0196] 
	x386: [ -0.0000,   0.0196] 
	x387: [ -0.0000,   0.0196] 
	x388: [ -0.0000,   0.0196] 
	x389: [ -0.0000,   0.0196] 
	x390: [ -0.0000,   0.0196] 
	x391: [ -0.0000,   0.0196] 
	x392: [ -0.0000,   0.0196] 
	x393: [ -0.0000,   0.0196] 
	x394: [ -0.0000,   0.0196] 
	x395: [ -0.0000,   0.0196] 
	x396: [ -0.0000,   0.0196] 
	x397: [ -0.0000,   0.0196] 
	x398: [ -0.0000,   0.0196] 
	x399: [ -0.0000,   0.0196] 
	x400: [  0.2549,   0.2941] 
	x401: [  0.9647,   1.0000] 
	x402: [  0.6902,   0.7294] 
	x403: [ -0.0000,   0.0196] 
	x404: [ -0.0000,   0.0196] 
	x405: [ -0.0000,   0.0196] 
	x406: [ -0.0000,   0.0196] 
	x407: [  0.2745,   0.3137] 
	x408: [  0.9569,   0.9961] 
	x409: [  0.9765,   1.0000] 
	x410: [  0.9765,   1.0000] 
	x411: [  0.9765,   1.0000] 
	x412: [  0.3843,   0.4235] 
	x413: [ -0.0000,   0.0196] 
	x414: [ -0.0000,   0.0196] 
	x415: [ -0.0000,   0.0196] 
	x416: [ -0.0000,   0.0196] 
	x417: [ -0.0000,   0.0196] 
	x418: [ -0.0000,   0.0196] 
	x419: [ -0.0000,   0.0196] 
	x420: [ -0.0000,   0.0196] 
	x421: [ -0.0000,   0.0196] 
	x422: [ -0.0000,   0.0196] 
	x423: [ -0.0000,   0.0196] 
	x424: [ -0.0000,   0.0196] 
	x425: [ -0.0000,   0.0196] 
	x426: [ -0.0000,   0.0196] 
	x427: [ -0.0000,   0.0196] 
	x428: [ -0.0000,   0.0196] 
	x429: [  0.9020,   0.9412] 
	x430: [  0.6902,   0.7294] 
	x431: [ -0.0000,   0.0196] 
	x432: [ -0.0000,   0.0196] 
	x433: [ -0.0000,   0.0196] 
	x434: [  0.0549,   0.0941] 
	x435: [  0.8471,   0.8863] 
	x436: [  0.9765,   1.0000] 
	x437: [  0.9765,   1.0000] 
	x438: [  0.9765,   1.0000] 
	x439: [  0.9765,   1.0000] 
	x440: [  0.8980,   0.9373] 
	x441: [ -0.0000,   0.0196] 
	x442: [ -0.0000,   0.0196] 
	x443: [ -0.0000,   0.0196] 
	x444: [ -0.0000,   0.0196] 
	x445: [ -0.0000,   0.0196] 
	x446: [ -0.0000,   0.0196] 
	x447: [ -0.0000,   0.0196] 
	x448: [ -0.0000,   0.0196] 
	x449: [ -0.0000,   0.0196] 
	x450: [ -0.0000,   0.0196] 
	x451: [ -0.0000,   0.0196] 
	x452: [ -0.0000,   0.0196] 
	x453: [ -0.0000,   0.0196] 
	x454: [ -0.0000,   0.0196] 
	x455: [ -0.0000,   0.0196] 
	x456: [ -0.0000,   0.0196] 
	x457: [  0.9020,   0.9412] 
	x458: [  0.6902,   0.7294] 
	x459: [ -0.0000,   0.0196] 
	x460: [ -0.0000,   0.0196] 
	x461: [ -0.0000,   0.0196] 
	x462: [  0.4039,   0.4431] 
	x463: [  0.9765,   1.0000] 
	x464: [  0.9765,   1.0000] 
	x465: [  0.9373,   0.9765] 
	x466: [  0.6353,   0.6745] 
	x467: [  0.8275,   0.8667] 
	x468: [  0.8980,   0.9373] 
	x469: [ -0.0000,   0.0196] 
	x470: [ -0.0000,   0.0196] 
	x471: [ -0.0000,   0.0196] 
	x472: [ -0.0000,   0.0196] 
	x473: [ -0.0000,   0.0196] 
	x474: [ -0.0000,   0.0196] 
	x475: [ -0.0000,   0.0196] 
	x476: [ -0.0000,   0.0196] 
	x477: [ -0.0000,   0.0196] 
	x478: [ -0.0000,   0.0196] 
	x479: [ -0.0000,   0.0196] 
	x480: [ -0.0000,   0.0196] 
	x481: [ -0.0000,   0.0196] 
	x482: [ -0.0000,   0.0196] 
	x483: [ -0.0000,   0.0196] 
	x484: [ -0.0000,   0.0196] 
	x485: [  0.9020,   0.9412] 
	x486: [  0.7804,   0.8196] 
	x487: [  0.0196,   0.0588] 
	x488: [ -0.0000,   0.0196] 
	x489: [ -0.0000,   0.0275] 
	x490: [  0.7098,   0.7490] 
	x491: [  0.9765,   1.0000] 
	x492: [  0.9294,   0.9686] 
	x493: [  0.2667,   0.3059] 
	x494: [  0.0196,   0.0588] 
	x495: [  0.7843,   0.8235] 
	x496: [  0.8980,   0.9373] 
	x497: [ -0.0000,   0.0196] 
	x498: [ -0.0000,   0.0196] 
	x499: [ -0.0000,   0.0196] 
	x500: [ -0.0000,   0.0196] 
	x501: [ -0.0000,   0.0196] 
	x502: [ -0.0000,   0.0196] 
	x503: [ -0.0000,   0.0196] 
	x504: [ -0.0000,   0.0196] 
	x505: [ -0.0000,   0.0196] 
	x506: [ -0.0000,   0.0196] 
	x507: [ -0.0000,   0.0196] 
	x508: [ -0.0000,   0.0196] 
	x509: [ -0.0000,   0.0196] 
	x510: [ -0.0000,   0.0196] 
	x511: [ -0.0000,   0.0196] 
	x512: [ -0.0000,   0.0196] 
	x513: [  0.8667,   0.9059] 
	x514: [  0.9804,   1.0000] 
	x515: [  0.5059,   0.5451] 
	x516: [  0.0118,   0.0510] 
	x517: [  0.0039,   0.0431] 
	x518: [  0.9765,   1.0000] 
	x519: [  0.9765,   1.0000] 
	x520: [  0.4471,   0.4863] 
	x521: [ -0.0000,   0.0196] 
	x522: [  0.3412,   0.3804] 
	x523: [  0.9765,   1.0000] 
	x524: [  0.6627,   0.7020] 
	x525: [ -0.0000,   0.0196] 
	x526: [ -0.0000,   0.0196] 
	x527: [ -0.0000,   0.0196] 
	x528: [ -0.0000,   0.0196] 
	x529: [ -0.0000,   0.0196] 
	x530: [ -0.0000,   0.0196] 
	x531: [ -0.0000,   0.0196] 
	x532: [ -0.0000,   0.0196] 
	x533: [ -0.0000,   0.0196] 
	x534: [ -0.0000,   0.0196] 
	x535: [ -0.0000,   0.0196] 
	x536: [ -0.0000,   0.0196] 
	x537: [ -0.0000,   0.0196] 
	x538: [ -0.0000,   0.0196] 
	x539: [ -0.0000,   0.0196] 
	x540: [ -0.0000,   0.0196] 
	x541: [  0.3843,   0.4235] 
	x542: [  0.9765,   1.0000] 
	x543: [  0.9765,   1.0000] 
	x544: [  0.6667,   0.7059] 
	x545: [  0.2627,   0.3020] 
	x546: [  0.9765,   1.0000] 
	x547: [  0.9765,   1.0000] 
	x548: [  0.5569,   0.5961] 
	x549: [  0.3922,   0.4314] 
	x550: [  0.9608,   1.0000] 
	x551: [  0.9765,   1.0000] 
	x552: [  0.0824,   0.1216] 
	x553: [ -0.0000,   0.0196] 
	x554: [ -0.0000,   0.0196] 
	x555: [ -0.0000,   0.0196] 
	x556: [ -0.0000,   0.0196] 
	x557: [ -0.0000,   0.0196] 
	x558: [ -0.0000,   0.0196] 
	x559: [ -0.0000,   0.0196] 
	x560: [ -0.0000,   0.0196] 
	x561: [ -0.0000,   0.0196] 
	x562: [ -0.0000,   0.0196] 
	x563: [ -0.0000,   0.0196] 
	x564: [ -0.0000,   0.0196] 
	x565: [ -0.0000,   0.0196] 
	x566: [ -0.0000,   0.0196] 
	x567: [ -0.0000,   0.0196] 
	x568: [ -0.0000,   0.0196] 
	x569: [ -0.0000,   0.0353] 
	x570: [  0.6902,   0.7294] 
	x571: [  0.9725,   1.0000] 
	x572: [  0.9765,   1.0000] 
	x573: [  0.9765,   1.0000] 
	x574: [  0.9765,   1.0000] 
	x575: [  0.9765,   1.0000] 
	x576: [  0.9765,   1.0000] 
	x577: [  0.9765,   1.0000] 
	x578: [  0.9765,   1.0000] 
	x579: [  0.6980,   0.7373] 
	x580: [ -0.0000,   0.0353] 
	x581: [ -0.0000,   0.0196] 
	x582: [ -0.0000,   0.0196] 
	x583: [ -0.0000,   0.0196] 
	x584: [ -0.0000,   0.0196] 
	x585: [ -0.0000,   0.0196] 
	x586: [ -0.0000,   0.0196] 
	x587: [ -0.0000,   0.0196] 
	x588: [ -0.0000,   0.0196] 
	x589: [ -0.0000,   0.0196] 
	x590: [ -0.0000,   0.0196] 
	x591: [ -0.0000,   0.0196] 
	x592: [ -0.0000,   0.0196] 
	x593: [ -0.0000,   0.0196] 
	x594: [ -0.0000,   0.0196] 
	x595: [ -0.0000,   0.0196] 
	x596: [ -0.0000,   0.0196] 
	x597: [ -0.0000,   0.0196] 
	x598: [ -0.0000,   0.0196] 
	x599: [  0.5059,   0.5451] 
	x600: [  0.9765,   1.0000] 
	x601: [  0.9765,   1.0000] 
	x602: [  0.9765,   1.0000] 
	x603: [  0.9765,   1.0000] 
	x604: [  0.9765,   1.0000] 
	x605: [  0.8980,   0.9373] 
	x606: [  0.7020,   0.7412] 
	x607: [  0.0863,   0.1255] 
	x608: [ -0.0000,   0.0196] 
	x609: [ -0.0000,   0.0196] 
	x610: [ -0.0000,   0.0196] 
	x611: [ -0.0000,   0.0196] 
	x612: [ -0.0000,   0.0196] 
	x613: [ -0.0000,   0.0196] 
	x614: [ -0.0000,   0.0196] 
	x615: [ -0.0000,   0.0196] 
	x616: [ -0.0000,   0.0196] 
	x617: [ -0.0000,   0.0196] 
	x618: [ -0.0000,   0.0196] 
	x619: [ -0.0000,   0.0196] 
	x620: [ -0.0000,   0.0196] 
	x621: [ -0.0000,   0.0196] 
	x622: [ -0.0000,   0.0196] 
	x623: [ -0.0000,   0.0196] 
	x624: [ -0.0000,   0.0196] 
	x625: [ -0.0000,   0.0196] 
	x626: [ -0.0000,   0.0196] 
	x627: [ -0.0000,   0.0314] 
	x628: [  0.2627,   0.3020] 
	x629: [  0.9137,   0.9529] 
	x630: [  0.8941,   0.9333] 
	x631: [  0.5686,   0.6078] 
	x632: [  0.5020,   0.5412] 
	x633: [  0.0980,   0.1373] 
	x634: [ -0.0000,   0.0196] 
	x635: [ -0.0000,   0.0196] 
	x636: [ -0.0000,   0.0196] 
	x637: [ -0.0000,   0.0196] 
	x638: [ -0.0000,   0.0196] 
	x639: [ -0.0000,   0.0196] 
	x640: [ -0.0000,   0.0196] 
	x641: [ -0.0000,   0.0196] 
	x642: [ -0.0000,   0.0196] 
	x643: [ -0.0000,   0.0196] 
	x644: [ -0.0000,   0.0196] 
	x645: [ -0.0000,   0.0196] 
	x646: [ -0.0000,   0.0196] 
	x647: [ -0.0000,   0.0196] 
	x648: [ -0.0000,   0.0196] 
	x649: [ -0.0000,   0.0196] 
	x650: [ -0.0000,   0.0196] 
	x651: [ -0.0000,   0.0196] 
	x652: [ -0.0000,   0.0196] 
	x653: [ -0.0000,   0.0196] 
	x654: [ -0.0000,   0.0196] 
	x655: [ -0.0000,   0.0196] 
	x656: [ -0.0000,   0.0196] 
	x657: [ -0.0000,   0.0196] 
	x658: [ -0.0000,   0.0196] 
	x659: [ -0.0000,   0.0196] 
	x660: [ -0.0000,   0.0196] 
	x661: [ -0.0000,   0.0196] 
	x662: [ -0.0000,   0.0196] 
	x663: [ -0.0000,   0.0196] 
	x664: [ -0.0000,   0.0196] 
	x665: [ -0.0000,   0.0196] 
	x666: [ -0.0000,   0.0196] 
	x667: [ -0.0000,   0.0196] 
	x668: [ -0.0000,   0.0196] 
	x669: [ -0.0000,   0.0196] 
	x670: [ -0.0000,   0.0196] 
	x671: [ -0.0000,   0.0196] 
	x672: [ -0.0000,   0.0196] 
	x673: [ -0.0000,   0.0196] 
	x674: [ -0.0000,   0.0196] 
	x675: [ -0.0000,   0.0196] 
	x676: [ -0.0000,   0.0196] 
	x677: [ -0.0000,   0.0196] 
	x678: [ -0.0000,   0.0196] 
	x679: [ -0.0000,   0.0196] 
	x680: [ -0.0000,   0.0196] 
	x681: [ -0.0000,   0.0196] 
	x682: [ -0.0000,   0.0196] 
	x683: [ -0.0000,   0.0196] 
	x684: [ -0.0000,   0.0196] 
	x685: [ -0.0000,   0.0196] 
	x686: [ -0.0000,   0.0196] 
	x687: [ -0.0000,   0.0196] 
	x688: [ -0.0000,   0.0196] 
	x689: [ -0.0000,   0.0196] 
	x690: [ -0.0000,   0.0196] 
	x691: [ -0.0000,   0.0196] 
	x692: [ -0.0000,   0.0196] 
	x693: [ -0.0000,   0.0196] 
	x694: [ -0.0000,   0.0196] 
	x695: [ -0.0000,   0.0196] 
	x696: [ -0.0000,   0.0196] 
	x697: [ -0.0000,   0.0196] 
	x698: [ -0.0000,   0.0196] 
	x699: [ -0.0000,   0.0196] 
	x700: [ -0.0000,   0.0196] 
	x701: [ -0.0000,   0.0196] 
	x702: [ -0.0000,   0.0196] 
	x703: [ -0.0000,   0.0196] 
	x704: [ -0.0000,   0.0196] 
	x705: [ -0.0000,   0.0196] 
	x706: [ -0.0000,   0.0196] 
	x707: [ -0.0000,   0.0196] 
	x708: [ -0.0000,   0.0196] 
	x709: [ -0.0000,   0.0196] 
	x710: [ -0.0000,   0.0196] 
	x711: [ -0.0000,   0.0196] 
	x712: [ -0.0000,   0.0196] 
	x713: [ -0.0000,   0.0196] 
	x714: [ -0.0000,   0.0196] 
	x715: [ -0.0000,   0.0196] 
	x716: [ -0.0000,   0.0196] 
	x717: [ -0.0000,   0.0196] 
	x718: [ -0.0000,   0.0196] 
	x719: [ -0.0000,   0.0196] 
	x720: [ -0.0000,   0.0196] 
	x721: [ -0.0000,   0.0196] 
	x722: [ -0.0000,   0.0196] 
	x723: [ -0.0000,   0.0196] 
	x724: [ -0.0000,   0.0196] 
	x725: [ -0.0000,   0.0196] 
	x726: [ -0.0000,   0.0196] 
	x727: [ -0.0000,   0.0196] 
	x728: [ -0.0000,   0.0196] 
	x729: [ -0.0000,   0.0196] 
	x730: [ -0.0000,   0.0196] 
	x731: [ -0.0000,   0.0196] 
	x732: [ -0.0000,   0.0196] 
	x733: [ -0.0000,   0.0196] 
	x734: [ -0.0000,   0.0196] 
	x735: [ -0.0000,   0.0196] 
	x736: [ -0.0000,   0.0196] 
	x737: [ -0.0000,   0.0196] 
	x738: [ -0.0000,   0.0196] 
	x739: [ -0.0000,   0.0196] 
	x740: [ -0.0000,   0.0196] 
	x741: [ -0.0000,   0.0196] 
	x742: [ -0.0000,   0.0196] 
	x743: [ -0.0000,   0.0196] 
	x744: [ -0.0000,   0.0196] 
	x745: [ -0.0000,   0.0196] 
	x746: [ -0.0000,   0.0196] 
	x747: [ -0.0000,   0.0196] 
	x748: [ -0.0000,   0.0196] 
	x749: [ -0.0000,   0.0196] 
	x750: [ -0.0000,   0.0196] 
	x751: [ -0.0000,   0.0196] 
	x752: [ -0.0000,   0.0196] 
	x753: [ -0.0000,   0.0196] 
	x754: [ -0.0000,   0.0196] 
	x755: [ -0.0000,   0.0196] 
	x756: [ -0.0000,   0.0196] 
	x757: [ -0.0000,   0.0196] 
	x758: [ -0.0000,   0.0196] 
	x759: [ -0.0000,   0.0196] 
	x760: [ -0.0000,   0.0196] 
	x761: [ -0.0000,   0.0196] 
	x762: [ -0.0000,   0.0196] 
	x763: [ -0.0000,   0.0196] 
	x764: [ -0.0000,   0.0196] 
	x765: [ -0.0000,   0.0196] 
	x766: [ -0.0000,   0.0196] 
	x767: [ -0.0000,   0.0196] 
	x768: [ -0.0000,   0.0196] 
	x769: [ -0.0000,   0.0196] 
	x770: [ -0.0000,   0.0196] 
	x771: [ -0.0000,   0.0196] 
	x772: [ -0.0000,   0.0196] 
	x773: [ -0.0000,   0.0196] 
	x774: [ -0.0000,   0.0196] 
	x775: [ -0.0000,   0.0196] 
	x776: [ -0.0000,   0.0196] 
	x777: [ -0.0000,   0.0196] 
	x778: [ -0.0000,   0.0196] 
	x779: [ -0.0000,   0.0196] 
	x780: [ -0.0000,   0.0196] 
	x781: [ -0.0000,   0.0196] 
	x782: [ -0.0000,   0.0196] 
	x783: [ -0.0000,   0.0196] 

Branching heuristics set to PseudoImpact

Engine::solve: Initial statistics

05:24:36 Statistics update:
	--- Time Statistics ---
	Total time elapsed: 7135 milli (00:00:07)
		Main loop: 0 milli (00:00:00)
		Preprocessing time: 312 milli (00:00:00)
		Unknown: 6822 milli (00:00:06)
	Breakdown for main loop:
		[0.00%] Simplex steps: 0 milli
		[0.00%] Explicit-basis bound tightening: 0 milli
		[0.00%] Constraint-matrix bound tightening: 0 milli
		[0.00%] Degradation checking: 0 milli
		[0.00%] Precision restoration: 0 milli
		[0.00%] Statistics handling: 0 milli
		[0.00%] Constraint-fixing steps: 0 milli
		[0.00%] Valid case splits: 0 milli. Average per split: 0.00 milli
		[0.00%] Applying stored bound-tightening: 0 milli
		[0.00%] SMT core: 0 milli
		[0.00%] Symbolic Bound Tightening: 23 milli
		[0.00%] SoI-based local search: 0 milli
		[0.00%] SoI-based local search: 0 milli
		[0.00%] Unaccounted for: 0 milli
	--- Preprocessor Statistics ---
	Number of preprocessor bound-tightening loop iterations: 5
	Number of eliminated variables: 175
	Number of constraints removed due to variable elimination: 135
	Number of equations removed due to variable elimination: 0
	--- Engine Statistics ---
	Number of main loop iterations: 1
		0 iterations were simplex steps. Total time: 0 milli. Average: 0.00 milli.
		0 iterations were constraint-fixing steps. Total time: 0 milli. Average: 0.00 milli
	Number of active piecewise-linear constraints: 184 / 286
		Constraints disabled by valid splits: 102. By SMT-originated splits: 0
	Last reported degradation: 0.0000000000. Max degradation s[runlim] sample:		10.22 time, 10.01 real, 179 MB, 2.48 load
[runlim] sample:		20.21 time, 20.01 real, 179 MB, 2.25 load
[runlim] sample:		30.21 time, 30.01 real, 179 MB, 2.70 load
[runlim] sample:		40.21 time, 40.01 real, 179 MB, 2.44 load
[runlim] sample:		50.21 time, 50.01 real, 179 MB, 2.29 load
[runlim] sample:		60.21 time, 60.01 real, 179 MB, 2.09 load
o far: 0.0000000000. Restorations so far: 0
	Number of simplex pivots we attempted to skip because of instability: 0.
	Unstable pivots performed anyway: 0
	--- Tableau Statistics ---
	Total number of pivots performed: 0
		Real pivots: 0. Degenerate: 0 (0.00%)
		Degenerate pivots by request (e.g., to fix a PL constraint): 0 (0.00%)
		Average time per pivot: 0.00 milli
	Total number of fake pivots performed: 0
	Total number of rows added: 0. Number of merged columns: 0
	Current tableau dimensions: M = 830, N = 2729
	--- SMT Core Statistics ---
	Total depth is 0. Total visited states: 1. Number of splits: 0. Number of pops: 0
	Max stack depth: 0
	--- Bound Tightening Statistics ---
	Number of tightened bounds: 0.
		Number of rows examined by row tightener: 0. Consequent tightenings: 0
		Number of explicit basis matrices examined by row tightener: 0. Consequent tightenings: 0
		Number of bound tightening rounds on the entire constraint matrix: 0. Consequent tightenings: 0
		Number of bound notifications sent to PL constraints: 1730. Tightenings proposed: 0
	--- Basis Factorization statistics ---
	Number of basis refactorizations: 2
	--- Projected Steepest Edge Statistics ---
	Number of iterations: 0.
	Number of resets to reference space: 1. Avg. iterations per reset: 0
	--- SBT ---
	Number of tightened bounds: 705
	--- SoI-based local search ---
	Number of proposed phase pattern update: 0. Number of accepted update: 0 [0.00%]
	Total time (% of local search time) updating SoI phase pattern : 0 milli [0.00%]
	Total time obtaining current assignment: 0 milli [0.00%]
	Total time getting SoI phase pattern : 0 milli [0.00%]
	--- Context dependent statistics ---
	Number of pushes / pops: 0 / 0
		[0.00%] Pre-Push hook: 0 milli
		[0.00%] Push : 0 milli
		[0.00%] Post-Pop hook: 0 milli
		[0.00%] Pop : 0 milli
		[0.00%] Total context-switching time: 0 milli
	--- Proof Certificate ---
	Number of certified leaves: 0
	Number of leaves to delegate: 0

---

05:25:17 Statistics update:
	--- Time Statistics ---
	Total time elapsed: 48449 milli (00:00:48)
		Main loop: 13658 milli (00:00:13)
		Preprocessing time: 312 milli (00:00:00)
		Unknown: 34478 milli (00:00:34)
	Breakdown for main loop:
		[211.83%] Simplex steps: 28933 milli
		[87.20%] Explicit-basis bound tightening: 11910 milli
		[0.00%] Constraint-matrix bound tightening: 0 milli
		[1.47%] Degradation checking: 200 milli
		[0.00%] Precision restoration: 0 milli
		[0.51%] Statistics handling: 69 milli
		[0.00%] Constraint-fixing steps: 0 milli
		[0.00%] Valid case splits: 0 milli. Average per split: 0.00 milli
		[0.00%] Applying stored bound-tightening: 0 milli
		[0.01%] SMT core: 0 milli
		[0.77%] Symbolic Bound Tightening: 104 milli
		[205.68%] SoI-based local search: 28093 milli
		[0.00%] SoI-based local search: 0 milli
		[135052609337845.64%] Unaccounted for: 0 milli
	--- Preprocessor Statistics ---
	Number of preprocessor bound-tightening loop iterations: 5
	Number of eliminated variables: 175
	Number of constraints removed due to variable elimination: 135
	Number of equations removed due to variable elimination: 0
	--- Engine Statistics ---
	Number of main loop iterations: 10000
		9987 iterations were simplex steps. Total time: 28933 milli. Average: 2.90 milli.
		0 iterations were constraint-fixing steps. Total time: 0 milli. Average: 0.00 milli
	Number of active piecewise-linear constraints: 178 / 286
		Constraints disabled by valid splits: 103. By SMT-originated splits: 5
	Last reported degradation: 0.0000000000. Max degradation so far: 0.0000000000. Restorations so far: 0
	Number of simplex pivots we attempted to skip because of instability: 0.
	Unstable pivots performed anyway: 0
	--- Tableau Statistics ---
	Total number of pivots performed: 9579
		Real pivots: 9577. Degenerate: 2 (0.02%)
		Degenerate pivots by request (e.g., to fix a PL constraint): 0 (0.00%)
		Average time per pivot: 0.14 milli
	Total number of fake pivots performed: 337
	Total number of rows added: 0. Number of merged columns: 0
	Current tableau dimensions: M = 830, N = 2729
	--- SMT Core Statistics ---
	Total depth is 5. Total visited states: 6. Number of splits: 5. Number of pops: 0
	Max stack depth: 5
	--- Bound Tightening Statistics ---
	Number of tightened bounds: 611.
		Number of rows examined by row tightener: 9579. Consequent tightenings: 0
		Number of explicit basis matrices examined by row tightener: 24. Consequent tightenings: 141
		Number of bound tightening rounds on the entire constraint matrix: 0. Consequent tightenings: 0
		Number of bound notifications sent to PL constraints: 4069. Tightenings proposed: 0
	--- Basis Factorization statistics ---
	Number of basis refactorizations: 88
	--- Projected Steepest Edge Statistics ---
	Number of iterations: 9916.
	Number of resets to reference space: 10. Avg. iterations per reset: 991
	--- SBT ---
	Number of tightened bounds: 1316
	--- SoI-based local search ---
	Number of proposed phase pattern update: 33. Number of accepted update: 38 [115.15%]
	Total time (% of local search time) updating SoI phase pattern : 3473 milli [0.01%]
	Total time obtaining current assignment: 11852 milli [0.04%]
	Total time getting SoI phase pattern : 3092 milli [0.02%]
	--- Context dependent statistics ---
	Number of pushes / pops: 5 / 0
		[0.00%] Pre-Push hook: 0 milli
		[0.00%] Push : 0 milli
		[0.00%] Post-Pop hook: 0 milli
		[0.00%] Pop : 0 milli
		[0.00%] Total context-switching time: 0 milli
	--- Proof Certificate ---
	Number of certified leaves: 0
	Number of leaves to delegate: 0
Performing precision restoration. Degradation before: 0.000000000000231. After: 0.000000000000184

Engine::solve: sat assignment found

05:25:38 Statistics update:
	--- Time Statistics ---
	Total time elapsed: 69381 milli (00:01:09)
		Main loop: 62245 milli (00:01:02)
		Preprocessing time: 312 milli (00:00:00)
		Unknown: 6822 milli (00:00:06)
	Breakdown for main loop:
		[77.13%] Simplex steps: 48012 milli
		[21.63%] Explicit-basis bound tightening: 13466 milli
		[0.00%] Constraint-matrix bound tightening: 0 milli
		[0.53%] Degradation checking: 332 milli
		[0.07%] Precision restoration: 45 milli
		[0.19%] Statistics handling: 115 milli
		[0.00%] Constraint-fixing steps: 0 milli
		[0.00%] Valid case splits: 0 milli. Average per split: 0.00 milli
		[0.00%] Applying stored bound-tightening: 0 milli
		[0.00%] SMT core: 0 milli
		[0.17%] Symbolic Bound Tightening: 104 milli
		[74.02%] SoI-based local search: 46075 milli
		[0.00%] SoI-based local search: 0 milli
		[0.27%] Unaccounted for: 166 milli
	--- Preprocessor Statistics ---
	Number of preprocessor bound-tightening loop iterations: 5
	Number of eliminated variables: 175
	Number of constraints removed due to variable elimination: 135
	Number of equations removed due to variable elimination: 0
	--- Engine Statistics ---
	Number of main loop iterations: 16450
		16436 iterations were simplex steps. Total time: 48012 milli. Average: 2.92 milli.
		0 iterations were constraint-fixing steps. Total time: 0 milli. Average: 0.00 milli
	Number of active piecewise-linear constraints: 178 / 286
		Constraints disabled by valid splits: 103. By SMT-originated splits: 5
	Last reported degradation: 0.0000000000. Max degradation so far: 0.0000000000. Restorations so far: 1
	Number of simplex pivots we attempted to skip because of instability: 0.
	Unstable pivots performed anyway: 0
	--- Tableau Statistics ---
	Total number of pivots performed: 15871
		Real pivots: 15869. Degenerate: 2 (0.01%)
		Degenerate pivots by request (e.g., to fix a PL constraint): 0 (0.00%)
		Average time per pivot: 0.15 milli
	Total number of fake pivots performed: 438
	Total number of rows added: 0. Number of merged columns: 0
	Current tableau dimensions: M = 830, N = 2729
	--- SMT Core Statistics ---
	Total depth is 5. Total visited states: 6. Number of splits: 5. Number of pops: 0
	Max stack depth: 5
	--- Bound Tightening Statistics ---
	Number of tightened bounds: 611.
		Number of rows examined by row tightener: 15871. Consequent tightenings: 1
		Number of explicit basis matrices examined by row tightener: 27. Consequent tightenings: 141
		Number of bound tightening rounds on the entire constraint matrix: 0. Consequent tightenings: 0
		Number of bound notifications sent to PL constraints: 4071. Tightenings proposed: 0
	--- Basis Factorization statistics ---
	Number of basis refactorizations: 147
	--- Projected Steepest Edge Statistics ---
	Number of iterations: 16309.
	Number of resets to reference space: 18. Avg. iterations per reset: 906
	--- SBT ---
	Number of tightened bounds: 1316
	--- SoI-based local search ---
	Number of proposed phase pattern update: 59. Number of accepted update: 64 [108.47%]
	Total time (% of local search time) updating SoI phase pattern : 4325 milli [0.01%]
	Total time obtaining current assignment: 20715 milli [0.04%]
	Total time getting SoI phase pattern : 5339 milli [0.01%]
	--- Context dependent statistics ---
	Number of pushes / pops: 5 / 0
		[0.00%] Pre-Push hook: 0 milli
		[0.00%] Push : 0 milli
		[0.00%] Post-Pop hook: 0 milli
		[0.00%] Pop : 0 milli
		[0.00%] Total context-switching time: 0 milli
	--- Proof Certificate ---
	Number of certified leaves: 0
	Number of leaves to delegate: 0
sat
Input assignment:
	x0 = -0.000000
	x1 = -0.000000
	x2 = -0.000000
	x3 = -0.000000
	x4 = -0.000000
	x5 = -0.000000
	x6 = -0.000000
	x7 = 0.019608
	x8 = -0.000000
	x9 = -0.000000
	x10 = -0.000000
	x11 = -0.000000
	x12 = -0.000000
	x13 = -0.000000
	x14 = -0.000000
	x15 = -0.000000
	x16 = -0.000000
	x17 = -0.000000
	x18 = -0.000000
	x19 = -0.000000
	x20 = -0.000000
	x21 = -0.000000
	x22 = -0.000000
	x23 = -0.000000
	x24 = -0.000000
	x25 = 0.011783
	x26 = -0.000000
	x27 = -0.000000
	x28 = -0.000000
	x29 = -0.000000
	x30 = -0.000000
	x31 = -0.000000
	x32 = -0.000000
	x33 = -0.000000
	x34 = -0.000000
	x35 = -0.000000
	x36 = 0.019608
	x37 = -0.000000
	x38 = -0.000000
	x39 = -0.000000
	x40 = -0.000000
	x41 = -0.000000
	x42 = -0.000000
	x43 = -0.000000
	x44 = -0.000000
	x45 = -0.000000
	x46 = -0.000000
	x47 = -0.000000
	x48 = -0.000000
	x49 = -0.000000
	x50 = -0.000000
	x51 = -0.000000
	x52 = -0.000000
	x53 = -0.000000
	x54 = -0.000000
	x55 = 0.019608
	x56 = -0.000000
	x57 = -0.000000
	x58 = -0.000000
	x59 = -0.000000
	x60 = -0.000000
	x61 = -0.000000
	x62 = -0.000000
	x63 = -0.000000
	x64 = -0.000000
	x65 = -0.000000
	x66 = -0.000000
	x67 = -0.000000
	x68 = -0.000000
	x69 = -0.000000
	x70 = -0.000000
	x71 = -0.000000
	x72 = -0.000000
	x73 = -0.000000
	x74 = -0.000000
	x75 = -0.000000
	x76 = -0.000000
	x77 = -0.000000
	x78 = -0.000000
	x79 = 0.019608
	x80 = -0.000000
	x81 = 0.019608
	x82 = -0.000000
	x83 = -0.000000
	x84 = -0.000000
	x85 = -0.000000
	x86 = -0.000000
	x87 = -0.000000
	x88 = -0.000000
	x89 = -0.000000
	x90 = -0.000000
	x91 = -0.000000
	x92 = -0.000000
	x93 = -0.000000
	x94 = -0.000000
	x95 = -0.000000
	x96 = -0.000000
	x97 = -0.000000
	x98 = -0.000000
	x99 = 0.290196
	x100 = 0.639216
	x101 = 0.529412
	x102 = -0.000000
	x103 = -0.000000
	x104 = -0.000000
	x105 = -0.000000
	x106 = -0.000000
	x107 = -0.000000
	x108 = -0.000000
	x109 = -0.000000
	x110 = -0.000000
	x111 = -0.000000
	x112 = -0.000000
	x113 = -0.000000
	x114 = -0.000000
	x115 = -0.000000
	x116 = -0.000000
	x117 = -0.000000
	x118 = -0.000000
	x119 = -0.000000
	x120 = -0.000000
	x121 = -0.000000
	x122 = -0.000000
	x123 = -0.000000
	x124 = -0.000000
	x125 = 0.301961
	x126 = 0.756863
	x127 = 0.933333
	x128 = 0.976471
	x129 = 0.976471
	x130 = 0.039216
	x131 = -0.000000
	x132 = -0.000000
	x133 = -0.000000
	x134 = -0.000000
	x135 = -0.000000
	x136 = -0.000000
	x137 = -0.000000
	x138 = -0.000000
	x139 = -0.000000
	x140 = -0.000000
	x141 = -0.000000
	x142 = -0.000000
	x143 = -0.000000
	x144 = -0.000000
	x145 = -0.000000
	x146 = -0.000000
	x147 = -0.000000
	x148 = -0.000000
	x149 = -0.000000
	x150 = -0.000000
	x151 = -0.000000
	x152 = 0.325490
	x153 = 0.972549
	x154 = 0.976471
	x155 = 0.976471
	x156 = 0.976471
	x157 = 1.000000
	x158 = 0.039216
	x159 = -0.000000
	x160 = -0.000000
	x161 = -0.000000
	x162 = 0.019608
	x163 = -0.000000
	x164 = -0.000000
	x165 = -0.000000
	x166 = -0.000000
	x167 = -0.000000
	x168 = -0.000000
	x169 = -0.000000
	x170 = -0.000000
	x171 = -0.000000
	x172 = -0.000000
	x173 = -0.000000
	x174 = -0.000000
	x175 = -0.000000
	x176 = -0.000000
	x177 = -0.000000
	x178 = -0.000000
	x179 = 0.176471
	x180 = 0.976471
	x181 = 0.976471
	x182 = 0.976471
	x183 = 0.976471
	x184 = 0.806059
	x185 = 0.505882
	x186 = 0.035294
	x187 = 0.019608
	x188 = -0.000000
	x189 = -0.000000
	x190 = -0.000000
	x191 = -0.000000
	x192 = 0.019608
	x193 = -0.000000
	x194 = -0.000000
	x195 = -0.000000
	x196 = -0.000000
	x197 = -0.000000
	x198 = -0.000000
	x199 = -0.000000
	x200 = -0.000000
	x201 = -0.000000
	x202 = -0.000000
	x203 = -0.000000
	x204 = -0.000000
	x205 = -0.000000
	x206 = 0.011765
	x207 = 0.670588
	x208 = 0.976471
	x209 = 1.000000
	x210 = 0.913725
	x211 = 0.392157
	x212 = 0.054902
	x213 = 0.019608
	x214 = 0.019608
	x215 = -0.000000
	x216 = -0.000000
	x217 = -0.000000
	x218 = -0.000000
	x219 = -0.000000
	x220 = -0.000000
	x221 = -0.000000
	x222 = -0.000000
	x223 = -0.000000
	x224 = -0.000000
	x225 = -0.000000
	x226 = -0.000000
	x227 = -0.000000
	x228 = -0.000000
	x229 = -0.000000
	x230 = -0.000000
	x231 = -0.000000
	x232 = -0.000000
	x233 = -0.000000
	x234 = 0.549020
	x235 = 0.980392
	x236 = 0.976471
	x237 = 0.964706
	x238 = 0.137255
	x239 = -0.000000
	x240 = 0.019608
	x241 = 0.019608
	x242 = -0.000000
	x243 = -0.000000
	x244 = -0.000000
	x245 = -0.000000
	x246 = -0.000000
	x247 = -0.000000
	x248 = -0.000000
	x249 = -0.000000
	x250 = -0.000000
	x251 = -0.000000
	x252 = -0.000000
	x253 = -0.000000
	x254 = -0.000000
	x255 = 0.019608
	x256 = -0.000000
	x257 = -0.000000
	x258 = -0.000000
	x259 = -0.000000
	x260 = -0.000000
	x261 = 0.054902
	x262 = 0.819608
	x263 = 0.976471
	x264 = 0.862745
	x265 = 0.164706
	x266 = -0.000000
	x267 = -0.000000
	x268 = -0.000000
	x269 = -0.000000
	x270 = -0.000000
	x271 = -0.000000
	x272 = -0.000000
	x273 = -0.000000
	x274 = -0.000000
	x275 = -0.000000
	x276 = -0.000000
	x277 = 0.019608
	x278 = -0.000000
	x279 = -0.000000
	x280 = -0.000000
	x281 = -0.000000
	x282 = -0.000000
	x283 = -0.000000
	x284 = -0.000000
	x285 = -0.000000
	x286 = -0.000000
	x287 = -0.000000
	x288 = 0.019608
	x289 = 0.800000
	x290 = 0.976471
	x291 = 0.964706
	x292 = 0.384314
	x293 = -0.000000
	x294 = -0.000000
	x295 = -0.000000
	x296 = -0.000000
	x297 = -0.000000
	x298 = -0.000000
	x299 = -0.000000
	x300 = -0.000000
	x301 = -0.000000
	x302 = -0.000000
	x303 = -0.000000
	x304 = -0.000000
	x305 = -0.000000
	x306 = -0.000000
	x307 = -0.000000
	x308 = -0.000000
	x309 = -0.000000
	x310 = -0.000000
	x311 = -0.000000
	x312 = -0.000000
	x313 = -0.000000
	x314 = -0.000000
	x315 = -0.000000
	x316 = -0.000000
	x317 = 0.901961
	x318 = 0.980392
	x319 = 0.572549
	x320 = -0.000000
	x321 = -0.000000
	x322 = -0.000000
	x323 = -0.000000
	x324 = -0.000000
	x325 = -0.000000
	x326 = -0.000000
	x327 = -0.000000
	x328 = -0.000000
	x329 = -0.000000
	x330 = -0.000000
	x331 = -0.000000
	x332 = -0.000000
	x333 = -0.000000
	x334 = -0.000000
	x335 = -0.000000
	x336 = -0.000000
	x337 = -0.000000
	x338 = -0.000000
	x339 = -0.000000
	x340 = -0.000000
	x341 = -0.000000
	x342 = -0.000000
	x343 = -0.000000
	x344 = -0.000000
	x345 = 0.901961
	x346 = 0.976471
	x347 = 0.505882
	x348 = -0.000000
	x349 = -0.000000
	x350 = -0.000000
	x351 = 0.019608
	x352 = -0.000000
	x353 = -0.000000
	x354 = -0.000000
	x355 = -0.000000
	x356 = -0.000000
	x357 = -0.000000
	x358 = -0.000000
	x359 = -0.000000
	x360 = -0.000000
	x361 = -0.000000
	x362 = -0.000000
	x363 = -0.000000
	x364 = -0.000000
	x365 = -0.000000
	x366 = -0.000000
	x367 = -0.000000
	x368 = -0.000000
	x369 = -0.000000
	x370 = -0.000000
	x371 = -0.000000
	x372 = 0.243137
	x373 = 0.964706
	x374 = 0.866667
	x375 = 0.137255
	x376 = -0.000000
	x377 = -0.000000
	x378 = -0.000000
	x379 = 0.019608
	x380 = 0.047059
	x381 = 0.372549
	x382 = 0.752941
	x383 = 0.650980
	x384 = 0.019608
	x385 = -0.000000
	x386 = -0.000000
	x387 = -0.000000
	x388 = -0.000000
	x389 = -0.000000
	x390 = -0.000000
	x391 = -0.000000
	x392 = -0.000000
	x393 = -0.000000
	x394 = -0.000000
	x395 = -0.000000
	x396 = -0.000000
	x397 = -0.000000
	x398 = -0.000000
	x399 = -0.000000
	x400 = 0.254902
	x401 = 0.964706
	x402 = 0.690196
	x403 = -0.000000
	x404 = -0.000000
	x405 = -0.000000
	x406 = -0.000000
	x407 = 0.274510
	x408 = 0.956863
	x409 = 0.976471
	x410 = 0.976471
	x411 = 0.976471
	x412 = 0.384314
	x413 = -0.000000
	x414 = -0.000000
	x415 = -0.000000
	x416 = -0.000000
	x417 = -0.000000
	x418 = -0.000000
	x419 = -0.000000
	x420 = -0.000000
	x421 = -0.000000
	x422 = -0.000000
	x423 = -0.000000
	x424 = -0.000000
	x425 = -0.000000
	x426 = -0.000000
	x427 = -0.000000
	x428 = -0.000000
	x429 = 0.901961
	x430 = 0.690196
	x431 = -0.000000
	x432 = -0.000000
	x433 = -0.000000
	x434 = 0.054902
	x435 = 0.847059
	x436 = 0.976471
	x437 = 0.976471
	x438 = 0.976471
	x439 = 0.976471
	x440 = 0.898039
	x441 = -0.000000
	x442 = -0.000000
	x443 = -0.000000
	x444 = -0.000000
	x445 = -0.000000
	x446 = -0.000000
	x447 = -0.000000
	x448 = -0.000000
	x449 = 0.019608
	x450 = -0.000000
	x451 = -0.000000
	x452 = -0.000000
	x453 = -0.000000
	x454 = -0.000000
	x455 = -0.000000
	x456 = -0.000000
	x457 = 0.901961
	x458 = 0.690196
	x459 = 0.019608
	x460 = -0.000000
	x461 = -0.000000
	x462 = 0.403922
	x463 = 0.976471
	x464 = 0.976471
	x465 = 0.937255
	x466 = 0.635294
	x467 = 0.827451
	x468 = 0.898039
	x469 = -0.000000
	x470 = -0.000000
	x471 = -0.000000
	x472 = -0.000000
	x473 = -0.000000
	x474 = -0.000000
	x475 = -0.000000
	x476 = -0.000000
	x477 = -0.000000
	x478 = -0.000000
	x479 = -0.000000
	x480 = -0.000000
	x481 = -0.000000
	x482 = -0.000000
	x483 = -0.000000
	x484 = -0.000000
	x485 = 0.941176
	x486 = 0.819608
	x487 = 0.058824
	x488 = 0.019608
	x489 = 0.027451
	x490 = 0.709804
	x491 = 0.976471
	x492 = 0.929412
	x493 = 0.266667
	x494 = 0.019608
	x495 = 0.784314
	x496 = 0.898039
	x497 = -0.000000
	x498 = -0.000000
	x499 = -0.000000
	x500 = -0.000000
	x501 = -0.000000
	x502 = -0.000000
	x503 = -0.000000
	x504 = -0.000000
	x505 = -0.000000
	x506 = -0.000000
	x507 = -0.000000
	x508 = -0.000000
	x509 = -0.000000
	x510 = -0.000000
	x511 = -0.000000
	x512 = -0.000000
	x513 = 0.866667
	x514 = 0.980392
	x515 = 0.505882
	x516 = 0.011765
	x517 = 0.003922
	x518 = 0.976471
	x519 = 0.976471
	x520 = 0.447059
	x521 = -0.000000
	x522 = 0.341176
	x523 = 0.976471
	x524 = 0.662745
	x525 = 0.019608
	x526 = -0.000000
	x527 = -0.000000
	x528 = -0.000000
	x529 = -0.000000
	x530 = -0.000000
	x531 = -0.000000
	x532 = -0.000000
	x533 = -0.000000
	x534 = -0.000000
	x535 = -0.000000
	x536 = -0.000000
	x537 = 0.019608
	x538 = -0.000000
	x539 = -0.000000
	x540 = -0.000000
	x541 = 0.423529
	x542 = 0.976471
	x543 = 0.976471
	x544 = 0.666667
	x545 = 0.262745
	x546 = 0.976471
	x547 = 0.976471
	x548 = 0.556863
	x549 = 0.392157
	x550 = 0.960784
	x551 = 0.976471
	x552 = 0.082353
	x553 = -0.000000
	x554 = -0.000000
	x555 = -0.000000
	x556 = -0.000000
	x557 = -0.000000
	x558 = -0.000000
	x559 = -0.000000
	x560 = -0.000000
	x561 = -0.000000
	x562 = -0.000000
	x563 = 0.019608
	x564 = -0.000000
	x565 = -0.000000
	x566 = -0.000000
	x567 = -0.000000
	x568 = 0.019608
	x569 = -0.000000
	x570 = 0.690196
	x571 = 0.972549
	x572 = 0.976471
	x573 = 0.976471
	x574 = 0.976471
	x575 = 0.976471
	x576 = 0.976471
	x577 = 0.976471
	x578 = 0.976471
	x579 = 0.698039
	x580 = -0.000000
	x581 = -0.000000
	x582 = -0.000000
	x583 = -0.000000
	x584 = -0.000000
	x585 = -0.000000
	x586 = -0.000000
	x587 = 0.019608
	x588 = 0.019608
	x589 = -0.000000
	x590 = -0.000000
	x591 = -0.000000
	x592 = -0.000000
	x593 = -0.000000
	x594 = -0.000000
	x595 = -0.000000
	x596 = -0.000000
	x597 = -0.000000
	x598 = -0.000000
	x599 = 0.505882
	x600 = 0.976471
	x601 = 0.976471
	x602 = 0.976471
	x603 = 0.976471
	x604 = 0.976471
	x605 = 0.898039
	x606 = 0.741176
	x607 = 0.086275
	x608 = -0.000000
	x609 = -0.000000
	x610 = -0.000000
	x611 = -0.000000
	x612 = -0.000000
	x613 = -0.000000
	x614 = -0.000000
	x615 = -0.000000
	x616 = -0.000000
	x617 = -0.000000
	x618 = -0.000000
	x619 = -0.000000
	x620 = -0.000000
	x621 = -0.000000
	x622 = -0.000000
	x623 = -0.000000
	x624 = -0.000000
	x625 = -0.000000
	x626 = -0.000000
	x627 = -0.000000
	x628 = 0.262745
	x629 = 0.952941
	x630 = 0.933333
	x631 = 0.568627
	x632 = 0.501961
	x633 = 0.098039
	x634 = -0.000000
	x635 = 0.019608
	x636 = 0.019608
	x637 = -0.000000
	x638 = -0.000000
	x639 = -0.000000
	x640 = -0.000000
	x641 = -0.000000
	x642 = -0.000000
	x643 = -0.000000
	x644 = -0.000000
	x645 = -0.000000
	x646 = -0.000000
	x647 = -0.000000
	x648 = -0.000000
	x649 = -0.000000
	x650 = -0.000000
	x651 = -0.000000
	x652 = -0.000000
	x653 = -0.000000
	x654 = -0.000000
	x655 = -0.000000
	x656 = -0.000000
	x657 = -0.000000
	x658 = 0.019608
	x659 = 0.019608
	x660 = -0.000000
	x661 = 0.019608
	x662 = -0.000000
	x663 = 0.019608
	x664 = -0.000000
	x665 = 0.019608
	x666 = -0.000000
	x667 = 0.019608
	x668 = -0.000000
	x669 = -0.000000
	x670 = -0.000000
	x671 = -0.000000
	x672 = -0.000000
	x673 = -0.000000
	x674 = -0.000000
	x675 = -0.000000
	x676 = -0.000000
	x677 = -0.000000
	x678 = -0.000000
	x679 = -0.000000
	x680 = -0.000000
	x681 = 0.019608
	x682 = -0.000000
	x683 = -0.000000
	x684 = -0.000000
	x685 = -0.000000
	x686 = -0.000000
	x687 = -0.000000
	x688 = -0.000000
	x689 = -0.000000
	x690 = -0.000000
	x691 = -0.000000
	x692 = -0.000000
	x693 = -0.000000
	x694 = 0.019608
	x695 = -0.000000
	x696 = -0.000000
	x697 = -0.000000
	x698 = -0.000000
	x699 = -0.000000
	x700 = -0.000000
	x701 = -0.000000
	x702 = -0.000000
	x703 = -0.000000
	x704 = -0.000000
	x705 = -0.000000
	x706 = -0.000000
	x707 = -0.000000
	x708 = -0.000000
	x709 = -0.000000
	x710 = -0.000000
	x711 = -0.000000
	x712 = -0.000000
	x713 = -0.000000
	x714 = -0.000000
	x715 = -0.000000
	x716 = -0.000000
	x717 = -0.000000
	x718 = -0.000000
	x719 = -0.000000
	x720 = -0.000000
	x721 = -0.000000
	x722 = 0.019608
	x723 = -0.000000
	x724 = -0.000000
	x725 = -0.000000
	x726 = -0.000000
	x727 = -0.000000
	x728 = -0.000000
	x729 = -0.000000
	x730 = -0.000000
	x731 = -0.000000
	x732 = -0.000000
	x733 = -0.000000
	x734 = -0.000000
	x735 = -0.000000
	x736 = -0.000000
	x737 = -0.000000
	x738 = -0.000000
	x739 = -0.000000
	x740 = -0.000000
	x741 = -0.000000
	x742 = -0.000000
	x743 = -0.000000
	x744 = -0.000000
	x745 = -0.000000
	x746 = -0.000000
	x747 = -0.000000
	x748 = -0.000000
	x749 = -0.000000
	x750 = -0.000000
	x751 = -0.000000
	x752 = -0.000000
	x753 = -0.000000
	x754 = -0.000000
	x755 = -0.000000
	x756 = -0.000000
	x757 = -0.000000
	x758 = -0.000000
	x759 = -0.000000
	x760 = -0.000000
	x761 = -0.000000
	x762 = -0.000000
	x763 = -0.000000
	x764 = -0.000000
	x765 = -0.000000
	x766 = -0.000000
	x767 = -0.000000
	x768 = -0.000000
	x769 = -0.000000
	x770 = -0.000000
	x771 = -0.000000
	x772 = -0.000000
	x773 = -0.000000
	x774 = -0.000000
	x775 = -0.000000
	x776 = -0.000000
	x777 = -0.000000
	x778 = -0.000000
	x779 = -0.000000
	x780 = -0.000000
	x781 = -0.000000
	x782 = -0.000000
	x783 = -0.000000

Output:
	y0 = -0.003568
	y1 = -0.134876
	y2 = -0.000000
	y3 = -0.000000
	y4 = -0.000000
	y5 = 0.374001
	y6 = 0.290342
	y7 = -0.000000
	y8 = -0.000000
	y9 = -0.000000

[runlim] end:			Fri Oct  4 05:25:38 2024
[runlim] status:		ok
[runlim] result:		0
[runlim] children:		1
[runlim] processes:		2
[runlim] real:			69.48 seconds
[runlim] time:			69.60 seconds
[runlim] space:			183 MB
[runlim] load:			2.70 maximum
[runlim] samples:		695

real	1m9,490s
user	1m10,141s
sys	0m2,068s
