
[VERYDIFF_EXPERIMENT] Running on /home/i57/steuber/NeuroDiff/repos/VeryDiffExperiments/src/../benchmarks/mnist-prune/specs/mnist_96_global_6.vnnlib /home/i57/steuber/NeuroDiff/repos/VeryDiffExperiments/src/../benchmarks/mnist-prune/nets/mnist_relu_2_512.onnx
Found input X
op: matmul, weight: (512, 784), bias: nothing
op: bias, weight: nothing, bias: (512,)
op: relu, weight: nothing, bias: nothing
op: matmul, weight: (512, 512), bias: nothing
op: bias, weight: nothing, bias: (512,)
op: relu, weight: nothing, bias: nothing
op: matmul, weight: (10, 512), bias: nothing
op: bias, weight: nothing, bias: (10,)
Found input X
op: matmul, weight: (512, 784), bias: nothing
op: bias, weight: nothing, bias: (512,)
op: relu, weight: nothing, bias: nothing
op: matmul, weight: (512, 512), bias: nothing
op: bias, weight: nothing, bias: (512,)
op: relu, weight: nothing, bias: nothing
op: matmul, weight: (10, 512), bias: nothing
op: bias, weight: nothing, bias: (10,)
Distance: 1085.5985166831802
Distance: 1719.8468985003963
Distance: 31.228482716001736
Running with 1 threads
[Thread 1] Time to first task: 0.02s
Instable Generators: 235
Instable Generators: 484
Zono Bounds:
[-19.603676648865026, -15.409940367455377, -15.077823531701988, -13.621173782252503, -17.666980306474493, -14.629505107928555, -18.701335866138685, -16.580944300909614, -9.540127283553478, -10.883536453578069]
[14.491099951167655, 18.458795435798542, 12.914238749203705, 14.497975808301371, 14.301569786634907, 12.665514876691716, 14.758636331319744, 14.119803601471045, 13.19285497840141, 12.453641151154107]

Found counterexample: ([0.0, 0.0, 0.0, 0.02352941, 0.02352941, 0.02352941, 0.02352941, 0.02352941, 0.0, 0.0, 0.0, 0.0, 0.0, 0.0, 0.0, 0.02352941, 0.0, 0.0, 0.02352941, 0.0, 0.02352941, 0.0, 0.0, 0.0, 0.0, 0.02352941, 0.0, 0.0, 0.0, 0.0, 0.02352941, 0.0, 0.0, 0.02352941, 0.0, 0.0, 0.0, 0.02352941, 0.0, 0.0, 0.02352941, 0.02352941, 0.0, 0.0, 0.0, 0.02352941, 0.0, 0.0, 0.0, 0.02352941, 0.0, 0.0, 0.0, 0.0, 0.0, 0.0, 0.0, 0.0, 0.02352941, 0.02352941, 0.0, 0.0, 0.0, 0.0, 0.02352941, 0.02352941, 0.0, 0.0, 0.0, 0.0, 0.0, 0.0, 0.0, 0.0, 0.02352941, 0.02352941, 0.0, 0.0, 0.02352941, 0.0, 0.02352941, 0.0, 0.0, 0.02352941, 0.02352941, 0.02352941, 0.0, 0.0, 0.02352941, 0.02352941, 0.02352941, 0.0, 0.0, 0.0, 0.0, 0.02352941, 0.0, 0.0, 0.0, 0.02352941, 0.0, 0.0, 0.02352941, 0.02352941, 0.0, 0.02352941, 0.0, 0.0, 0.02352941, 0.02352941, 0.0, 0.02352941, 0.0, 0.02352941, 0.0, 0.0, 0.0, 0.0, 0.0, 0.0, 0.0, 0.0, 0.0, 0.0, 0.0, 0.0, 0.0, 0.0, 0.02352941, 0.02352941, 0.02352941, 0.02352941, 0.02352941, 0.02352941, 0.0, 0.02352941, 0.02352941, 0.02352941, 0.02352941, 0.0, 0.0, 0.0, 0.0, 0.0, 0.0, 0.0, 0.0, 0.0, 0.0, 0.10980392, 0.98431373, 0.3137255, 0.0, 0.06666667, 0.0, 0.0, 0.0, 0.02352941, 0.02352941, 0.0, 0.0, 0.0, 0.0, 0.0, 0.02352941, 0.02352941, 0.02352941, 0.02352941, 0.02352941, 0.0, 0.02352941, 0.02352941, 0.02352941, 0.0, 0.0, 0.0, 0.02352941, 0.02352941, 0.29019609, 0.91764706, 0.7176470800000001, 0.8196078500000001, 0.0, 0.02352941, 0.02352941, 0.02352941, 0.02352941, 0.0, 0.02352941, 0.02352941, 0.02352941, 0.0, 0.02352941, 0.02352941, 0.02352941, 0.02352941, 0.02352941, 0.0, 0.02352941, 0.0, 0.02352941, 0.02352941, 0.0, 0.0, 0.02352941, 0.02352941, 0.0, 0.69803923, 0.96470588, 0.96470588, 0.0, 0.02352941, 0.02352941, 0.02352941, 0.02352941, 0.02352941, 0.02352941, 0.02352941, 0.02352941, 0.02352941, 0.02352941, 0.02352941, 0.02352941, 0.02352941, 0.02352941, 0.0, 0.02352941, 0.02352941, 0.02352941, 0.02352941, 0.0, 0.0, 0.02352941, 0.0, 0.0, 0.74509805, 0.96470588, 0.96470588, 0.0, 0.0, 0.02352941, 0.02352941, 0.02352941, 0.02352941, 0.02352941, 0.0, 0.02352941, 0.02352941, 0.02352941, 0.02352941, 0.02352941, 0.02352941, 0.0, 0.0, 0.02352941, 0.02352941, 0.02352941, 0.02352941, 0.0, 0.0, 0.02352941, 0.02352941, 0.02352941, 0.49019608, 0.9999999999999999, 0.96470588, 0.39215687, 0.0, 0.02352941, 0.02352941, 0.02352941, 0.02352941, 0.02352941, 0.02352941, 0.02352941, 0.0, 0.02352941, 0.02352941, 0.02352941, 0.02352941, 0.02352941, 0.0, 0.02352941, 0.02352941, 0.02352941, 0.02352941, 0.02352941, 0.0, 0.0, 0.02352941, 0.0, 0.10196079, 0.87450981, 0.96862745, 0.93333334, 0.17254902, 0.02352941, 0.02352941, 0.02352941, 0.02352941, 0.02352941, 0.02352941, 0.02352941, 0.02352941, 0.02352941, 0.02352941, 0.02352941, 0.0, 0.0, 0.0, 0.02352941, 0.02352941, 0.0, 0.0, 0.02352941, 0.02352941, 0.02352941, 0.0, 0.0, 0.0, 0.54509807, 0.9999999999999999, 1.0, 0.46666666999999995, 0.02352941, 0.02352941, 0.0, 0.02352941, 0.0, 0.02352941, 0.02352941, 0.02352941, 0.02352941, 0.02352941, 0.02352941, 0.0, 0.0, 0.02352941, 0.0, 0.02352941, 0.02352941, 0.02352941, 0.02352941, 0.02352941, 0.0, 0.0, 0.0, 0.0, 0.24313726, 0.86666667, 1.0, 0.8823529499999999, 0.09803922, 0.02352941, 0.0, 0.0, 0.0, 0.0, 0.0, 0.0, 0.02352941, 0.02352941, 0.02352941, 0.0, 0.0, 0.0, 0.0, 0.0, 0.02352941, 0.02352941, 0.02352941, 0.0, 0.02352941, 0.0, 0.02352941, 0.02352941, 0.02352941, 0.10588235, 1.0, 0.9999999999999999, 0.45882353000000003, 0.0, 0.0, 0.0, 0.0, 0.0, 0.0, 0.0, 0.0, 0.0, 0.02352941, 0.02352941, 0.0, 0.0, 0.0, 0.0, 0.0, 0.0, 0.0, 0.02352941, 0.0, 0.02352941, 0.0, 0.02352941, 0.02352941, 0.02352941, 0.96862745, 0.9999999999999999, 0.74117649, 0.0, 0.02352941, 0.0, 0.0, 0.0, 0.0, 0.0, 0.0, 0.02352941, 0.0, 0.02352941, 0.0, 0.02352941, 0.0, 0.0, 0.02352941, 0.02352941, 0.02352941, 0.0, 0.0, 0.0, 0.02352941, 0.02352941, 0.02352941, 0.0, 0.97647059, 0.96862745, 0.74509805, 0.02352941, 0.02352941, 0.0, 0.0, 0.02352941, 0.0, 0.0, 0.02352941, 0.0, 0.0, 0.0, 0.02352941, 0.0, 0.0, 0.0, 0.02352941, 0.02352941, 0.02352941, 0.0, 0.0, 0.0, 0.02352941, 0.02352941, 0.02352941, 0.0, 0.60000002, 0.96470588, 0.74509805, 0.05882353, 0.02352941, 0.02352941, 0.0, 0.02352941, 0.0, 0.0, 0.0, 0.0, 0.0, 0.0, 0.0, 0.02352941, 0.02352941, 0.02352941, 0.02352941, 0.02352941, 0.02352941, 0.02352941, 0.0, 0.0, 0.02352941, 0.02352941, 0.02352941, 0.0, 0.04313726, 0.86666667, 0.96470588, 0.2, 0.0, 0.0, 0.02352941, 0.0, 0.0, 0.0, 0.0, 0.0, 0.0, 0.02352941, 0.02352941, 0.02352941, 0.02352941, 0.0, 0.02352941, 0.02352941, 0.02352941, 0.02352941, 0.0, 0.02352941, 0.02352941, 0.02352941, 0.02352941, 0.0, 0.0, 0.60784316, 0.96470588, 0.2, 0.0, 0.02352941, 0.0, 0.0, 0.0, 0.0, 0.0, 0.0, 0.02352941, 0.0, 0.0, 0.02352941, 0.02352941, 0.0, 0.02352941, 0.02352941, 0.0, 0.0, 0.0, 0.0, 0.02352941, 0.02352941, 0.02352941, 0.0, 0.0, 0.2, 0.96470588, 0.61176473, 0.0, 0.02352941, 0.0, 0.0, 0.0, 0.0, 0.0, 0.0, 0.02352941, 0.02352941, 0.02352941, 0.02352941, 0.02352941, 0.02352941, 0.02352941, 0.02352941, 0.0, 0.0, 0.0, 0.0, 0.02352941, 0.0, 0.0, 0.0, 0.0, 0.16078432, 0.96862745, 0.60784316, 0.0, 0.0, 0.0, 0.0, 0.02352941, 0.0, 0.0, 0.0, 0.02352941, 0.0, 0.02352941, 0.02352941, 0.02352941, 0.02352941, 0.02352941, 0.02352941, 0.0, 0.0, 0.0, 0.0, 0.0, 0.0, 0.0, 0.0, 0.0, 0.16078432, 0.96470588, 0.60392159, 0.0, 0.0, 0.0, 0.0, 0.0, 0.02352941, 0.0, 0.0, 0.0, 0.02352941, 0.0, 0.0, 0.02352941, 0.02352941, 0.02352941, 0.0, 0.02352941, 0.02352941, 0.02352941, 0.0, 0.0, 0.0, 0.0, 0.02352941, 0.02352941, 0.16078432, 0.96470588, 0.60392159, 0.0, 0.0, 0.0, 0.0, 0.0, 0.02352941, 0.02352941, 0.02352941, 0.0, 0.0, 0.02352941, 0.02352941, 0.02352941, 0.02352941, 0.02352941, 0.02352941, 0.02352941, 0.02352941, 0.02352941, 0.02352941, 0.02352941, 0.0, 0.0, 0.02352941, 0.02352941, 0.16078432, 0.96470588, 0.90196079, 0.05098039, 0.0, 0.0, 0.0, 0.02352941, 0.02352941, 0.02352941, 0.02352941, 0.0, 0.02352941, 0.02352941, 0.0, 0.02352941, 0.02352941, 0.02352941, 0.02352941, 0.0, 0.02352941, 0.02352941, 0.02352941, 0.02352941, 0.02352941, 0.02352941, 0.02352941, 0.02352941, 0.04313726, 0.56078434, 0.4784313700000001, 0.0, 0.02352941, 0.02352941, 0.02352941, 0.02352941, 0.02352941, 0.02352941, 0.0, 0.0, 0.0, 0.0, 0.02352941, 0.02352941, 0.0, 0.02352941, 0.02352941, 0.02352941, 0.02352941, 0.02352941, 0.02352941, 0.02352941, 0.02352941, 0.02352941, 0.02352941, 0.02352941, 0.02352941, 0.02352941, 0.02352941, 0.02352941, 0.02352941, 0.02352941, 0.02352941, 0.02352941, 0.02352941, 0.02352941, 0.02352941, 0.02352941, 0.0, 0.02352941, 0.0, 0.02352941, 0.02352941, 0.02352941, 0.02352941, 0.02352941, 0.02352941, 0.02352941, 0.02352941, 0.02352941, 0.02352941, 0.02352941, 0.02352941, 0.02352941, 0.02352941, 0.02352941, 0.02352941, 0.02352941, 0.02352941, 0.02352941, 0.02352941, 0.02352941, 0.02352941, 0.0, 0.02352941, 0.02352941, 0.0, 0.0, 0.0, 0.0, 0.0, 0.0, 0.02352941, 0.02352941, 0.0, 0.02352941, 0.02352941, 0.02352941, 0.02352941, 0.02352941, 0.02352941, 0.02352941, 0.02352941, 0.02352941, 0.02352941, 0.02352941, 0.02352941, 0.0, 0.02352941, 0.02352941, 0.0, 0.02352941, 0.02352941, 0.0, 0.0], ([-58.65633514849627, -8.387122349516474, -32.203152593297155, -26.661455037613322, -23.520731704097532, -20.785370386182166, -45.65302032981813, -34.44311819034879, -20.882256219025688, -12.682678183277003], [-53.69552183127043, -6.34664833054533, -29.11344489628654, -25.653951972437845, -19.8420204525421, -18.142094525465765, -41.36905859692497, -30.1849292855704, -21.32179652218752, -12.000655538333968], 2.0404740189711443))
[Thread 1] Total splits: 0
Processed 1 zonotopes (Work Done: 0.0%); Generated 0 (0.576092731s/loop)
[Thread 1] Finished in 0.58s
 ────────────────────────────────────────────────────────────────────────────────
                                        Time                    Allocations      
                               ───────────────────────   ────────────────────────
       Tot / % measured:            578ms / 100.0%            183MiB / 100.0%    

 Section               ncalls     time    %tot     avg     alloc    %tot      avg
 ────────────────────────────────────────────────────────────────────────────────
 Verify                     1    576ms   99.6%   576ms    173MiB   94.6%   173MiB
   Zonotope Loop            1    576ms   99.6%   576ms    173MiB   94.6%   173MiB
     Zonotope Propa...      1    549ms   94.9%   549ms    153MiB   83.4%   153MiB
       DiffZonotope...      2    425ms   73.5%   212ms    129MiB   70.5%  64.7MiB
         Zonotope_R...      4    408ms   70.6%   102ms    111MiB   60.8%  27.9MiB
           Influenc...      4    391ms   67.6%  97.8ms   71.5MiB   39.0%  17.9MiB
             Multiply       4    307ms   53.1%  76.8ms   41.1MiB   22.4%  10.3MiB
             Alloca...      4   79.8ms   13.8%  20.0ms   30.4MiB   16.6%  7.61MiB
             Set Ma...      4   3.88ms    0.7%   971μs     0.00B    0.0%    0.00B
           Column M...      4   11.3ms    2.0%  2.82ms   19.9MiB   10.8%  4.97MiB
           Allocation       4   3.13ms    0.5%   782μs   19.9MiB   10.8%  4.97MiB
           Set Matrix       4   2.87ms    0.5%   718μs   38.3KiB    0.0%  9.59KiB
           Vectors          4   85.8μs    0.0%  21.5μs    100KiB    0.1%  25.0KiB
           Bounds           4   2.81μs    0.0%   703ns     0.00B    0.0%    0.00B
       DiffZonotope...      3    124ms   21.4%  41.3ms   23.6MiB   12.9%  7.85MiB
         Zonotope_D...      6   59.9ms   10.4%  10.0ms   14.4MiB    7.9%  2.40MiB
     Property Check         1   2.65ms    0.5%  2.65ms    234KiB    0.1%   234KiB
 Initialize                 1   2.24ms    0.4%  2.24ms   9.84MiB    5.4%  9.84MiB
 ────────────────────────────────────────────────────────────────────────────────
[VERYDIFF_TIMER] 0.606362615

[VERYDIFF_EXPERIMENT] Running on /home/i57/steuber/NeuroDiff/repos/VeryDiffExperiments/src/../benchmarks/mnist-prune/specs/mnist_96_global_6.vnnlib /home/i57/steuber/NeuroDiff/repos/VeryDiffExperiments/src/../benchmarks/mnist-prune/nets/mnist_relu_3_100.onnx
Found input X
op: matmul, weight: (100, 784), bias: nothing
op: bias, weight: nothing, bias: (100,)
op: relu, weight: nothing, bias: nothing
op: matmul, weight: (100, 100), bias: nothing
op: bias, weight: nothing, bias: (100,)
op: relu, weight: nothing, bias: nothing
op: matmul, weight: (10, 100), bias: nothing
op: bias, weight: nothing, bias: (10,)
op: relu, weight: nothing, bias: nothing
op: matmul, weight: (10, 10), bias: nothing
op: bias, weight: nothing, bias: (10,)
Found input X
op: matmul, weight: (100, 784), bias: nothing
op: bias, weight: nothing, bias: (100,)
op: relu, weight: nothing, bias: nothing
op: matmul, weight: (100, 100), bias: nothing
op: bias, weight: nothing, bias: (100,)
op: relu, weight: nothing, bias: nothing
op: matmul, weight: (10, 100), bias: nothing
op: bias, weight: nothing, bias: (10,)
op: relu, weight: nothing, bias: nothing
op: matmul, weight: (10, 10), bias: nothing
op: bias, weight: nothing, bias: (10,)
Distance: 296.6600370998244
Distance: 77.24290861755458
Distance: 5.7170369567975285
Distance: 0.0
Running with 1 threads
[Thread 1] Time to first task: 0.0s
Instable Generators: 50
Instable Generators: 80
Instable Generators: 10
Zono Bounds:
[-0.7908011925754492, -0.8919599255458867, -0.8543321196434372, -1.028626942642584, -0.964683868109681, -1.7547327869669558, -1.253698709007486, -1.410755394137737, -1.0022793873222502, -0.9195115837917852]
[0.6342973403428516, 0.8919599255458867, 0.7692203751865301, 1.028626942642584, 0.7522134005093586, 1.2784392125951616, 1.0240445614725346, 1.410755394137737, 1.0022793873222502, 0.9195115837917852]
[Thread 1] Total splits: 0
Processed 1 zonotopes (Work Done: 100.0%); Generated 0 (0.069272019s/loop)
[Thread 1] Finished in 0.07s
 ────────────────────────────────────────────────────────────────────────────────
                                        Time                    Allocations      
                               ───────────────────────   ────────────────────────
       Tot / % measured:           69.9ms / 100.0%            103MiB / 100.0%    

 Section               ncalls     time    %tot     avg     alloc    %tot      avg
 ────────────────────────────────────────────────────────────────────────────────
 Verify                     1   69.3ms   99.1%  69.3ms   97.7MiB   94.7%  97.7MiB
   Zonotope Loop            1   69.3ms   99.1%  69.3ms   97.7MiB   94.7%  97.7MiB
     Zonotope Propa...      1   66.0ms   94.4%  66.0ms   77.7MiB   75.4%  77.7MiB
       DiffZonotope...      3   44.4ms   63.5%  14.8ms   73.4MiB   71.3%  24.5MiB
         Zonotope_R...      6   43.4ms   62.1%  7.23ms   71.6MiB   69.5%  11.9MiB
           Influenc...      6   42.0ms   60.1%  7.01ms   66.0MiB   64.0%  11.0MiB
             Multiply       6   26.4ms   37.7%  4.39ms   33.9MiB   32.9%  5.65MiB
             Alloca...      6   11.2ms   16.1%  1.87ms   32.1MiB   31.1%  5.35MiB
             Set Ma...      6   4.40ms    6.3%   734μs     0.00B    0.0%    0.00B
           Column M...      6    787μs    1.1%   131μs   2.82MiB    2.7%   481KiB
           Set Matrix       6    345μs    0.5%  57.5μs   8.81KiB    0.0%  1.47KiB
           Allocation       6    178μs    0.3%  29.7μs   2.82MiB    2.7%   481KiB
           Vectors          6   29.0μs    0.0%  4.83μs   19.5KiB    0.0%  3.26KiB
           Bounds           6   3.50μs    0.0%   583ns     0.00B    0.0%    0.00B
       DiffZonotope...      4   21.6ms   30.8%  5.39ms   4.26MiB    4.1%  1.07MiB
         Zonotope_D...      8   8.45ms   12.1%  1.06ms   2.76MiB    2.7%   353KiB
     Property Check         1   9.91μs    0.0%  9.91μs      992B    0.0%     992B
 Initialize                 1    625μs    0.9%   625μs   5.41MiB    5.3%  5.41MiB
 ────────────────────────────────────────────────────────────────────────────────
[VERYDIFF_TIMER] 0.094767026

[VERYDIFF_EXPERIMENT] Running on /home/i57/steuber/NeuroDiff/repos/VeryDiffExperiments/src/../benchmarks/mnist-prune/specs/mnist_96_global_6.vnnlib /home/i57/steuber/NeuroDiff/repos/VeryDiffExperiments/src/../benchmarks/mnist-prune/nets/mnist_relu_4_1024.onnx
Found input X
op: matmul, weight: (1024, 784), bias: nothing
op: bias, weight: nothing, bias: (1024,)
op: relu, weight: nothing, bias: nothing
op: matmul, weight: (1024, 1024), bias: nothing
op: bias, weight: nothing, bias: (1024,)
op: relu, weight: nothing, bias: nothing
op: matmul, weight: (1024, 1024), bias: nothing
op: bias, weight: nothing, bias: (1024,)
op: relu, weight: nothing, bias: nothing
op: matmul, weight: (10, 1024), bias: nothing
op: bias, weight: nothing, bias: (10,)
op: relu, weight: nothing, bias: nothing
op: matmul, weight: (10, 10), bias: nothing
op: bias, weight: nothing, bias: (10,)
Found input X
op: matmul, weight: (1024, 784), bias: nothing
op: bias, weight: nothing, bias: (1024,)
op: relu, weight: nothing, bias: nothing
op: matmul, weight: (1024, 1024), bias: nothing
op: bias, weight: nothing, bias: (1024,)
op: relu, weight: nothing, bias: nothing
op: matmul, weight: (1024, 1024), bias: nothing
op: bias, weight: nothing, bias: (1024,)
op: relu, weight: nothing, bias: nothing
op: matmul, weight: (10, 1024), bias: nothing
op: bias, weight: nothing, bias: (10,)
op: relu, weight: nothing, bias: nothing
op: matmul, weight: (10, 10), bias: nothing
op: bias, weight: nothing, bias: (10,)
Distance: 1266.8815759184893
Distance: 2876.6944248261216
Distance: 2831.8843567411013
Distance: 34.033756025192815
Distance: 0.0
Running with 1 threads
[Thread 1] Time to first task: 0.01s
Instable Generators: 559
Instable Generators: 956
Instable Generators: 973
Instable Generators: 10
Zono Bounds:
[-106.36413241561112, -109.97170484876612, -120.00415315758833, -121.30617141610529, -113.68047890640626, -122.90921994326182, -110.37202079976262, -114.03160149281018, -116.70207972265865, -122.27572282536465]
[104.82988134536467, 109.97170484876612, 118.64968679363157, 121.30617141610529, 113.6426625591278, 119.06776444192086, 105.31290957492803, 114.03160149281018, 116.70207972265865, 122.27572282536465]

Found counterexample: ([0.02352941, 0.02352941, 0.02352941, 0.0, 0.02352941, 0.0, 0.0, 0.0, 0.0, 0.0, 0.0, 0.0, 0.0, 0.02352941, 0.0, 0.02352941, 0.02352941, 0.0, 0.0, 0.02352941, 0.0, 0.0, 0.0, 0.0, 0.02352941, 0.0, 0.0, 0.0, 0.0, 0.02352941, 0.02352941, 0.02352941, 0.0, 0.02352941, 0.02352941, 0.0, 0.0, 0.0, 0.0, 0.02352941, 0.0, 0.02352941, 0.0, 0.0, 0.0, 0.02352941, 0.0, 0.0, 0.02352941, 0.02352941, 0.02352941, 0.02352941, 0.0, 0.0, 0.02352941, 0.0, 0.02352941, 0.0, 0.0, 0.0, 0.0, 0.0, 0.02352941, 0.0, 0.02352941, 0.0, 0.0, 0.02352941, 0.0, 0.0, 0.0, 0.0, 0.0, 0.02352941, 0.0, 0.0, 0.0, 0.0, 0.0, 0.02352941, 0.0, 0.0, 0.02352941, 0.02352941, 0.0, 0.0, 0.0, 0.0, 0.0, 0.0, 0.0, 0.0, 0.0, 0.0, 0.02352941, 0.02352941, 0.02352941, 0.0, 0.02352941, 0.0, 0.0, 0.02352941, 0.0, 0.0, 0.0, 0.02352941, 0.02352941, 0.0, 0.0, 0.0, 0.02352941, 0.0, 0.02352941, 0.0, 0.0, 0.0, 0.0, 0.0, 0.02352941, 0.0, 0.02352941, 0.0, 0.0, 0.02352941, 0.0, 0.0, 0.0, 0.0, 0.02352941, 0.02352941, 0.02352941, 0.0, 0.0, 0.0, 0.0, 0.0, 0.0, 0.02352941, 0.0, 0.02352941, 0.0, 0.02352941, 0.02352941, 0.0, 0.0, 0.0, 0.0, 0.0, 0.0, 0.10980392, 0.98431373, 0.36078431999999994, 0.0, 0.01960784, 0.0, 0.0, 0.0, 0.02352941, 0.02352941, 0.0, 0.02352941, 0.02352941, 0.0, 0.0, 0.0, 0.0, 0.02352941, 0.0, 0.02352941, 0.02352941, 0.0, 0.02352941, 0.0, 0.0, 0.0, 0.02352941, 0.02352941, 0.02352941, 0.33725490999999996, 0.91764706, 0.67058825, 0.77254903, 0.0, 0.0, 0.02352941, 0.02352941, 0.02352941, 0.02352941, 0.02352941, 0.02352941, 0.0, 0.0, 0.0, 0.02352941, 0.0, 0.0, 0.0, 0.0, 0.02352941, 0.0, 0.02352941, 0.0, 0.0, 0.0, 0.02352941, 0.02352941, 0.02352941, 0.74509805, 0.96470588, 0.9999999999999999, 0.0, 0.02352941, 0.02352941, 0.02352941, 0.02352941, 0.02352941, 0.02352941, 0.0, 0.0, 0.0, 0.0, 0.02352941, 0.02352941, 0.0, 0.02352941, 0.02352941, 0.02352941, 0.02352941, 0.0, 0.0, 0.02352941, 0.02352941, 0.02352941, 0.02352941, 0.02352941, 0.74509805, 0.9999999999999999, 0.96470588, 0.0, 0.0, 0.02352941, 0.02352941, 0.02352941, 0.02352941, 0.02352941, 0.02352941, 0.02352941, 0.0, 0.0, 0.0, 0.0, 0.0, 0.02352941, 0.0, 0.02352941, 0.0, 0.02352941, 0.0, 0.02352941, 0.0, 0.02352941, 0.02352941, 0.02352941, 0.53725493, 0.9999999999999999, 0.96470588, 0.39215687, 0.0, 0.02352941, 0.02352941, 0.0, 0.02352941, 0.02352941, 0.02352941, 0.02352941, 0.02352941, 0.02352941, 0.0, 0.0, 0.0, 0.0, 0.0, 0.02352941, 0.02352941, 0.0, 0.0, 0.02352941, 0.02352941, 0.02352941, 0.02352941, 0.02352941, 0.10196079, 0.87450981, 0.96862745, 0.93333334, 0.17254902, 0.02352941, 0.02352941, 0.02352941, 0.02352941, 0.02352941, 0.02352941, 0.02352941, 0.02352941, 0.02352941, 0.0, 0.0, 0.02352941, 0.02352941, 0.0, 0.0, 0.02352941, 0.02352941, 0.0, 0.02352941, 0.02352941, 0.02352941, 0.02352941, 0.02352941, 0.02352941, 0.49803922, 0.96470588, 0.96862745, 0.46666666999999995, 0.02352941, 0.02352941, 0.02352941, 0.02352941, 0.02352941, 0.02352941, 0.02352941, 0.02352941, 0.02352941, 0.02352941, 0.0, 0.02352941, 0.02352941, 0.0, 0.02352941, 0.0, 0.0, 0.02352941, 0.02352941, 0.02352941, 0.02352941, 0.02352941, 0.0, 0.0, 0.24313726, 0.81960785, 0.96862745, 0.83529413, 0.05098039, 0.02352941, 0.02352941, 0.02352941, 0.02352941, 0.02352941, 0.02352941, 0.02352941, 0.02352941, 0.0, 0.0, 0.02352941, 0.0, 0.0, 0.0, 0.02352941, 0.02352941, 0.02352941, 0.0, 0.02352941, 0.02352941, 0.02352941, 0.02352941, 0.0, 0.0, 0.10588235, 0.96862745, 0.96470588, 0.41176471, 0.0, 0.02352941, 0.02352941, 0.02352941, 0.02352941, 0.02352941, 0.02352941, 0.0, 0.02352941, 0.0, 0.02352941, 0.0, 0.0, 0.0, 0.0, 0.0, 0.02352941, 0.02352941, 0.02352941, 0.0, 0.0, 0.02352941, 0.02352941, 0.02352941, 0.02352941, 0.96862745, 0.96470588, 0.69411767, 0.0, 0.02352941, 0.02352941, 0.02352941, 0.02352941, 0.0, 0.02352941, 0.02352941, 0.02352941, 0.02352941, 0.0, 0.0, 0.0, 0.02352941, 0.0, 0.0, 0.02352941, 0.02352941, 0.02352941, 0.02352941, 0.0, 0.02352941, 0.02352941, 0.0, 0.0, 0.97647059, 0.96862745, 0.69803923, 0.02352941, 0.02352941, 0.02352941, 0.02352941, 0.0, 0.0, 0.0, 0.02352941, 0.0, 0.0, 0.02352941, 0.02352941, 0.0, 0.0, 0.0, 0.02352941, 0.02352941, 0.02352941, 0.0, 0.02352941, 0.0, 0.02352941, 0.02352941, 0.02352941, 0.0, 0.60000002, 0.96470588, 0.74509805, 0.05882353, 0.02352941, 0.02352941, 0.02352941, 0.0, 0.0, 0.0, 0.0, 0.0, 0.0, 0.02352941, 0.02352941, 0.0, 0.0, 0.0, 0.02352941, 0.02352941, 0.0, 0.02352941, 0.02352941, 0.02352941, 0.02352941, 0.02352941, 0.02352941, 0.0, 0.04313726, 0.86666667, 0.96470588, 0.2, 0.0, 0.02352941, 0.02352941, 0.0, 0.02352941, 0.02352941, 0.0, 0.0, 0.02352941, 0.0, 0.0, 0.0, 0.02352941, 0.02352941, 0.0, 0.02352941, 0.02352941, 0.02352941, 0.02352941, 0.02352941, 0.02352941, 0.02352941, 0.02352941, 0.0, 0.0, 0.60784316, 0.96470588, 0.2, 0.0, 0.02352941, 0.02352941, 0.0, 0.02352941, 0.0, 0.0, 0.0, 0.0, 0.0, 0.0, 0.0, 0.02352941, 0.0, 0.0, 0.02352941, 0.02352941, 0.02352941, 0.0, 0.0, 0.02352941, 0.02352941, 0.02352941, 0.0, 0.0, 0.2, 0.96470588, 0.61176473, 0.02352941, 0.02352941, 0.02352941, 0.02352941, 0.0, 0.0, 0.0, 0.0, 0.0, 0.02352941, 0.0, 0.0, 0.0, 0.0, 0.02352941, 0.0, 0.0, 0.0, 0.0, 0.0, 0.0, 0.02352941, 0.0, 0.0, 0.0, 0.16078432, 0.96862745, 0.60784316, 0.0, 0.0, 0.0, 0.0, 0.0, 0.02352941, 0.02352941, 0.0, 0.0, 0.0, 0.02352941, 0.02352941, 0.0, 0.02352941, 0.0, 0.02352941, 0.0, 0.02352941, 0.02352941, 0.02352941, 0.0, 0.02352941, 0.0, 0.0, 0.0, 0.16078432, 0.96470588, 0.65098041, 0.0, 0.0, 0.0, 0.0, 0.02352941, 0.02352941, 0.0, 0.02352941, 0.02352941, 0.0, 0.0, 0.02352941, 0.0, 0.0, 0.0, 0.0, 0.0, 0.0, 0.0, 0.0, 0.0, 0.0, 0.02352941, 0.02352941, 0.02352941, 0.20784314, 0.9999999999999999, 0.65098041, 0.0, 0.0, 0.0, 0.0, 0.02352941, 0.0, 0.02352941, 0.0, 0.0, 0.0, 0.02352941, 0.02352941, 0.02352941, 0.0, 0.0, 0.02352941, 0.0, 0.02352941, 0.02352941, 0.02352941, 0.0, 0.02352941, 0.02352941, 0.02352941, 0.02352941, 0.16078432, 0.96470588, 0.90196079, 0.05098039, 0.0, 0.0, 0.0, 0.02352941, 0.02352941, 0.0, 0.02352941, 0.0, 0.0, 0.0, 0.02352941, 0.0, 0.02352941, 0.0, 0.0, 0.0, 0.0, 0.0, 0.02352941, 0.02352941, 0.0, 0.02352941, 0.02352941, 0.02352941, 0.04313726, 0.56078434, 0.4784313700000001, 0.03137255, 0.02352941, 0.02352941, 0.0, 0.02352941, 0.02352941, 0.02352941, 0.02352941, 0.0, 0.0, 0.02352941, 0.0, 0.02352941, 0.02352941, 0.02352941, 0.0, 0.0, 0.0, 0.0, 0.02352941, 0.02352941, 0.02352941, 0.0, 0.0, 0.0, 0.02352941, 0.02352941, 0.02352941, 0.02352941, 0.02352941, 0.0, 0.0, 0.0, 0.02352941, 0.02352941, 0.0, 0.0, 0.0, 0.02352941, 0.02352941, 0.0, 0.02352941, 0.0, 0.02352941, 0.0, 0.02352941, 0.0, 0.02352941, 0.02352941, 0.02352941, 0.02352941, 0.02352941, 0.02352941, 0.0, 0.02352941, 0.02352941, 0.02352941, 0.02352941, 0.0, 0.02352941, 0.0, 0.02352941, 0.0, 0.0, 0.0, 0.02352941, 0.02352941, 0.0, 0.0, 0.02352941, 0.0, 0.0, 0.0, 0.02352941, 0.02352941, 0.0, 0.0, 0.0, 0.02352941, 0.0, 0.0, 0.0, 0.02352941, 0.0, 0.0, 0.0, 0.0, 0.0, 0.0, 0.0, 0.0, 0.0, 0.02352941, 0.0], ([0.0, 13.671604294282242, 0.0, 3.4139846035491415, 1.8565342439430732, 1.4429416251009872, 0.0, 0.7587643329174473, 5.073703671537673, 1.7131824574522212], [0.0, 10.607656289243751, 0.0, 3.186978351579768, 1.0076232704298018, 3.3187295362404265, 0.0, 0.0, 4.54557287557655, 1.2450330876596925], 3.5512724573198824))
[Thread 1] Total splits: 0
Processed 1 zonotopes (Work Done: 0.0%); Generated 0 (2.895407911s/loop)
[Thread 1] Finished in 2.9s
 ────────────────────────────────────────────────────────────────────────────────
                                        Time                    Allocations      
                               ───────────────────────   ────────────────────────
       Tot / % measured:            2.92s / 100.0%            852MiB / 100.0%    

 Section               ncalls     time    %tot     avg     alloc    %tot      avg
 ────────────────────────────────────────────────────────────────────────────────
 Verify                     1    2.90s   99.2%   2.90s    825MiB   96.8%   825MiB
   Zonotope Loop            1    2.90s   99.2%   2.90s    825MiB   96.8%   825MiB
     Zonotope Propa...      1    2.87s   98.4%   2.87s    804MiB   94.4%   804MiB
       DiffZonotope...      4    1.80s   61.7%   450ms    663MiB   77.9%   166MiB
         Zonotope_R...      8    1.62s   55.5%   202ms    534MiB   62.7%  66.7MiB
           Influenc...      8    963ms   33.0%   120ms    312MiB   36.7%  39.0MiB
             Multiply       8    656ms   22.5%  82.0ms    188MiB   22.1%  23.5MiB
             Alloca...      8    288ms    9.9%  36.0ms    124MiB   14.6%  15.5MiB
             Set Ma...      8   19.5ms    0.7%  2.44ms     0.00B    0.0%    0.00B
           Column M...      8    358ms   12.3%  44.7ms    111MiB   13.0%  13.8MiB
           Allocation       8    278ms    9.5%  34.8ms    111MiB   13.0%  13.8MiB
           Set Matrix       8   20.4ms    0.7%  2.55ms    130KiB    0.0%  16.2KiB
           Vectors          8    230μs    0.0%  28.8μs    272KiB    0.0%  34.0KiB
           Bounds           8   6.29μs    0.0%   786ns     0.00B    0.0%    0.00B
       DiffZonotope...      5    1.07s   36.7%   214ms    141MiB   16.5%  28.1MiB
         Zonotope_D...     10    465ms   15.9%  46.5ms   71.3MiB    8.4%  7.13MiB
     Property Check         1   11.2ms    0.4%  11.2ms    586KiB    0.1%   586KiB
 Initialize                 1   22.1ms    0.8%  22.1ms   27.0MiB    3.2%  27.0MiB
 ────────────────────────────────────────────────────────────────────────────────
[VERYDIFF_TIMER] 3.010304301

[VERYDIFF_EXPERIMENT] NETWORK: /home/i57/steuber/NeuroDiff/repos/VeryDiffExperiments/src/../benchmarks/mnist-prune/specs/mnist_96_global_6.vnnlib
[VERYDIFF_EXPERIMENT] TIME: 4.643704142
