Parsing new_benchmarks/rice-1-retrained/nets/2_40.onnx...
Found input onnx::Gemm_0
op: gemm, weight: (40, 7), bias: (40,)
op: relu, weight: nothing, bias: nothing
op: gemm, weight: (40, 40), bias: (40,)
op: relu, weight: nothing, bias: nothing
op: gemm, weight: (2, 40), bias: (2,)
Parsing new_benchmarks/rice-1-retrained/nets_pruned/2_40-0.2.onnx...
Found input onnx::Gemm_0
op: gemm, weight: (40, 7), bias: (40,)
op: relu, weight: nothing, bias: nothing
op: gemm, weight: (40, 40), bias: (40,)
op: relu, weight: nothing, bias: nothing
op: gemm, weight: (2, 40), bias: (2,)
Distance: 17.538211775769014
Distance: 75.58587575942796
Distance: 4.246822140804536
Running with 1 threads
[Thread 1] Time to first task: 0.0s
Instable Generators: 32
Instable Generators: 32
Zono Bounds:
[-64.79934921653879, -59.236527584168506]
[57.17586870399087, 66.39252106686494]
[TOP-1] did not find required confidence yet.
[TOP-1] required confidence (1.0≥0.9999) is feasible for index 2
Found cex
N1 Probability: 0.9999417970960306 >= 0.9999

Found counterexample: ([-1.3000000000000003, 0.0, 0.19999999999999996, -2.6, -3.2375000000000007, 1.8875, 0.22499999999999987], (2, 1))
[Thread 1] Total splits: 28
Processed 29 zonotopes (Work Done: 0.0%); Generated 56 (0.003988552896551725s/loop)
[Thread 1] Finished in 0.12s
 ────────────────────────────────────────────────────────────────────────────────
                                        Time                    Allocations      
                               ───────────────────────   ────────────────────────
       Tot / % measured:            116ms / 100.0%           46.7MiB / 100.0%    

 Section               ncalls     time    %tot     avg     alloc    %tot      avg
 ────────────────────────────────────────────────────────────────────────────────
 Verify                     1    116ms  100.0%   116ms   46.7MiB  100.0%  46.7MiB
   Zonotope Loop            1    116ms  100.0%   116ms   46.7MiB   99.9%  46.7MiB
     Property Check        29    108ms   93.5%  3.73ms   33.5MiB   71.8%  1.16MiB
     Zonotope Propa...     29   6.62ms    5.7%   228μs   12.6MiB   27.1%   446KiB
       DiffZonotope...     58   4.73ms    4.1%  81.6μs   10.4MiB   22.2%   183KiB
         Zonotope_R...    116   2.31ms    2.0%  19.9μs   6.37MiB   13.6%  56.2KiB
           Influenc...    116    814μs    0.7%  7.02μs   1.66MiB    3.6%  14.7KiB
             Multiply     116    614μs    0.5%  5.29μs   1.26MiB    2.7%  11.1KiB
             Alloca...    116   89.3μs    0.1%   770ns    406KiB    0.8%  3.50KiB
             Set Ma...    116   41.5μs    0.0%   357ns     0.00B    0.0%    0.00B
           Column M...    116    480μs    0.4%  4.14μs   2.18MiB    4.7%  19.2KiB
           Set Matrix     116    406μs    0.4%  3.50μs    133KiB    0.3%  1.15KiB
           Allocation     116    287μs    0.2%  2.47μs   2.16MiB    4.6%  19.1KiB
           Vectors        116    202μs    0.2%  1.74μs    237KiB    0.5%  2.05KiB
           Bounds         116   21.7μs    0.0%   187ns     0.00B    0.0%    0.00B
       DiffZonotope...     87   1.73ms    1.5%  19.8μs   2.26MiB    4.8%  26.6KiB
         Zonotope_D...    174    639μs    0.6%  3.67μs   1.08MiB    2.3%  6.34KiB
     Compute Split         28    631μs    0.5%  22.5μs    438KiB    0.9%  15.6KiB
 Initialize                 1   35.4μs    0.0%  35.4μs   20.8KiB    0.0%  20.8KiB
 ────────────────────────────────────────────────────────────────────────────────[VERYDIFF_TIMER] 0.117234443
