
[VERYDIFF_EXPERIMENT] Running on /home/i57/steuber/NeuroDiff/repos/VeryDiffExperiments/src/../benchmarks/mnist-prune/specs/mnist_50_global_5.vnnlib /home/i57/steuber/NeuroDiff/repos/VeryDiffExperiments/src/../benchmarks/mnist-prune/nets/mnist_relu_2_512.onnx
Loading /home/i57/steuber/NeuroDiff/repos/VeryDiffExperiments/src/../benchmarks/mnist-prune/nets/mnist_relu_2_512.onnx and /home/i57/steuber/NeuroDiff/repos/VeryDiffExperiments/src/../benchmarks/mnist-prune/nets_pruned/mnist_relu_2_512_0.79-old.onnx
INPUT SHAPE: 784
Refined: 4 | Refine Limit: 1 | Wrong: 0 | Right: 1 | Total: 1 | Total Zonos Considered: 5 | Expected 32 (3.125%)UNKNOWN
TIMEOUT
Refined: 8 | Refine Limit: 1 | Wrong: 0 | Right: 1 | Total: 1 | Total Zonos Considered: 9 | Expected 32 (3.125%)

time: 124.624047347

[VERYDIFF_TIMER] 124.648471401

[VERYDIFF_EXPERIMENT] NETWORK: /home/i57/steuber/NeuroDiff/repos/VeryDiffExperiments/src/../benchmarks/mnist-prune/specs/mnist_50_global_5.vnnlib
[VERYDIFF_EXPERIMENT] TIME: 124.941566281
