[VERYDIFF_EXPERIMENT] Sigma: 0.1
Parsing new_benchmarks/lhc/nets/2_20-1.onnx...
Found input X
WARNING: Operation Softmax is not supported
WE ARE IGNORING THIS OPERATION -- IF YOU DO NOT KNOW WHAT YOU ARE DOING THIS MAY BE UNSOUND!
op: gemm, weight: (20, 16), bias: (20,)
op: relu, weight: nothing, bias: nothing
op: gemm, weight: (20, 20), bias: (20,)
op: relu, weight: nothing, bias: nothing
op: gemm, weight: (5, 20), bias: (5,)
Parsing new_benchmarks/lhc/nets_pruned/2_20-1-0.2.onnx...
Found input X
WARNING: Operation Softmax is not supported
WE ARE IGNORING THIS OPERATION -- IF YOU DO NOT KNOW WHAT YOU ARE DOING THIS MAY BE UNSOUND!
op: gemm, weight: (20, 16), bias: (20,)
op: relu, weight: nothing, bias: nothing
op: gemm, weight: (20, 20), bias: (20,)
op: relu, weight: nothing, bias: nothing
op: gemm, weight: (5, 20), bias: (5,)
Distance: 45.1203789866413
Distance: 91.51211437367601
Distance: 21.60429206630215
Running with 1 threads
[Thread 1] Time to first task: 0.0s
Zono Bounds:
[0.0, 0.0, 0.0, 0.0, 0.0, 0.0, 0.0, 0.0, 0.0, 0.0, 0.0, 0.0, 0.0, 0.0, 0.0, 0.0]
[0.0, 0.0, 0.0, 0.0, 0.0, 0.0, 0.0, 0.0, 0.0, 0.0, 0.0, 0.0, 0.0, 0.0, 0.0, 0.0]
[TOP-1] required confidence (0.8274651793999701≥0.5) is feasible for index 2
Found cex
N1: 0.6788070205511313 (vs. 0.32051531521583804)
N2: 0.871091562935056
N1 Probability: 0.6788070205511313 >= 0.5

Found counterexample: ([0.1, 0.1, -0.1, 0.1, -0.1, -0.1, 0.1, -0.1, 0.1, 0.1, 0.1, 0.1, 0.1, -0.1, 0.058958282363070436, 0.1], (2, 5))
[Thread 1] Total splits: 0
Processed 1 zonotopes (Work Done: 0.0%); Generated 0 (0.001973263s/loop)
[Thread 1] Finished in 0.0s
 ────────────────────────────────────────────────────────────────────────────────
                                        Time                    Allocations      
                               ───────────────────────   ────────────────────────
       Tot / % measured:           2.02ms /  99.8%            432KiB /  99.6%    

 Section               ncalls     time    %tot     avg     alloc    %tot      avg
 ────────────────────────────────────────────────────────────────────────────────
 Verify                     1   1.99ms   98.5%  1.99ms    416KiB   96.8%   416KiB
   Zonotope Loop            1   1.97ms   97.7%  1.97ms    413KiB   96.0%   413KiB
     Property Check         1   1.84ms   91.0%  1.84ms    258KiB   60.1%   258KiB
     Zonotope Propa...      1   83.9μs    4.2%  83.9μs    116KiB   27.0%   116KiB
       DiffZonotope...      2   58.5μs    2.9%  29.3μs   94.8KiB   22.0%  47.4KiB
         Zonotope_R...      4   52.0μs    2.6%  13.0μs   89.5KiB   20.8%  22.4KiB
           Influenc...      4   21.2μs    1.0%  5.29μs   39.7KiB    9.2%  9.91KiB
             Multiply       4   12.8μs    0.6%  3.20μs   22.2KiB    5.2%  5.55KiB
             Alloca...      4   3.93μs    0.2%   983ns   15.2KiB    3.5%  3.81KiB
             Set Ma...      4   1.45μs    0.1%   363ns     0.00B    0.0%    0.00B
           Column M...      4   7.49μs    0.4%  1.87μs   19.7KiB    4.6%  4.92KiB
           Vectors          4   6.24μs    0.3%  1.56μs   4.75KiB    1.1%  1.19KiB
           Allocation       4   5.86μs    0.3%  1.46μs   19.0KiB    4.4%  4.75KiB
           Set Matrix       4   5.68μs    0.3%  1.42μs   1.86KiB    0.4%     476B
           Bounds           4   1.00μs    0.0%   250ns     0.00B    0.0%    0.00B
       DiffZonotope...      3   19.7μs    1.0%  6.58μs   19.7KiB    4.6%  6.55KiB
         Zonotope_D...      6   18.1μs    0.9%  3.02μs   18.7KiB    4.4%  3.12KiB
 Initialize                 1   30.7μs    1.5%  30.7μs   13.7KiB    3.2%  13.7KiB
 ────────────────────────────────────────────────────────────────────────────────[VERYDIFF_TIMER] 0.003577378
[VERYDIFF_EXPERIMENT] Sigma: 0.5
Parsing new_benchmarks/lhc/nets/2_20-1.onnx...
Found input X
WARNING: Operation Softmax is not supported
WE ARE IGNORING THIS OPERATION -- IF YOU DO NOT KNOW WHAT YOU ARE DOING THIS MAY BE UNSOUND!
op: gemm, weight: (20, 16), bias: (20,)
op: relu, weight: nothing, bias: nothing
op: gemm, weight: (20, 20), bias: (20,)
op: relu, weight: nothing, bias: nothing
op: gemm, weight: (5, 20), bias: (5,)
Parsing new_benchmarks/lhc/nets_pruned/2_20-1-0.2.onnx...
Found input X
WARNING: Operation Softmax is not supported
WE ARE IGNORING THIS OPERATION -- IF YOU DO NOT KNOW WHAT YOU ARE DOING THIS MAY BE UNSOUND!
op: gemm, weight: (20, 16), bias: (20,)
op: relu, weight: nothing, bias: nothing
op: gemm, weight: (20, 20), bias: (20,)
op: relu, weight: nothing, bias: nothing
op: gemm, weight: (5, 20), bias: (5,)
Distance: 45.1203789866413
Distance: 91.51211437367601
Distance: 21.60429206630215
Running with 1 threads
[Thread 1] Time to first task: 0.0s
Zono Bounds:
[0.0, 0.0, 0.0, 0.0, 0.0, 0.0, 0.0, 0.0, 0.0, 0.0, 0.0, 0.0, 0.0, 0.0, 0.0, 0.0]
[0.0, 0.0, 0.0, 0.0, 0.0, 0.0, 0.0, 0.0, 0.0, 0.0, 0.0, 0.0, 0.0, 0.0, 0.0, 0.0]
[TOP-1] required confidence (0.9882646959999019≥0.5) is feasible for index 5
Found cex
N1: 0.9927740048857813 (vs. 0.0072259950042318655)
N2: 0.5369681571965381
N1 Probability: 0.9927740048857813 >= 0.5

Found counterexample: ([-0.5, -0.5, 0.5, 0.5, 0.5, 0.5, -0.5, -0.5, -0.5, 0.5, -0.5, 0.5, -0.5, 0.5, 0.5, -0.5], (4, 3))
[Thread 1] Total splits: 0
Processed 1 zonotopes (Work Done: 0.0%); Generated 0 (0.001926134s/loop)
[Thread 1] Finished in 0.0s
 ────────────────────────────────────────────────────────────────────────────────
                                        Time                    Allocations      
                               ───────────────────────   ────────────────────────
       Tot / % measured:           1.97ms /  99.8%            567KiB /  99.7%    

 Section               ncalls     time    %tot     avg     alloc    %tot      avg
 ────────────────────────────────────────────────────────────────────────────────
 Verify                     1   1.94ms   98.6%  1.94ms    552KiB   97.6%   552KiB
   Zonotope Loop            1   1.93ms   97.8%  1.93ms    548KiB   96.9%   548KiB
     Property Check         1   1.79ms   90.6%  1.79ms    350KiB   61.9%   350KiB
     Zonotope Propa...      1   94.8μs    4.8%  94.8μs    160KiB   28.3%   160KiB
       DiffZonotope...      2   70.3μs    3.6%  35.1μs    135KiB   23.8%  67.4KiB
         Zonotope_R...      4   63.6μs    3.2%  15.9μs    129KiB   22.9%  32.4KiB
           Influenc...      4   28.1μs    1.4%  7.02μs   62.1KiB   11.0%  15.5KiB
             Multiply       4   16.7μs    0.8%  4.18μs   37.9KiB    6.7%  9.48KiB
             Alloca...      4   7.36μs    0.4%  1.84μs   22.0KiB    3.9%  5.50KiB
             Set Ma...      4   1.41μs    0.1%   352ns     0.00B    0.0%    0.00B
           Column M...      4   10.2μs    0.5%  2.56μs   27.9KiB    4.9%  6.97KiB
           Allocation       4   7.77μs    0.4%  1.94μs   27.4KiB    4.8%  6.84KiB
           Set Matrix       4   6.78μs    0.3%  1.69μs   2.75KiB    0.5%     704B
           Vectors          4   5.09μs    0.3%  1.27μs   4.75KiB    0.8%  1.19KiB
           Bounds           4    853ns    0.0%   213ns     0.00B    0.0%    0.00B
       DiffZonotope...      3   19.3μs    1.0%  6.44μs   23.7KiB    4.2%  7.89KiB
         Zonotope_D...      6   17.9μs    0.9%  2.99μs   22.7KiB    4.0%  3.79KiB
 Initialize                 1   27.4μs    1.4%  27.4μs   13.7KiB    2.4%  13.7KiB
 ────────────────────────────────────────────────────────────────────────────────[VERYDIFF_TIMER] 0.003454508
[VERYDIFF_EXPERIMENT] Sigma: 1.0
Parsing new_benchmarks/lhc/nets/2_20-1.onnx...
Found input X
WARNING: Operation Softmax is not supported
WE ARE IGNORING THIS OPERATION -- IF YOU DO NOT KNOW WHAT YOU ARE DOING THIS MAY BE UNSOUND!
op: gemm, weight: (20, 16), bias: (20,)
op: relu, weight: nothing, bias: nothing
op: gemm, weight: (20, 20), bias: (20,)
op: relu, weight: nothing, bias: nothing
op: gemm, weight: (5, 20), bias: (5,)
Parsing new_benchmarks/lhc/nets_pruned/2_20-1-0.2.onnx...
Found input X
WARNING: Operation Softmax is not supported
WE ARE IGNORING THIS OPERATION -- IF YOU DO NOT KNOW WHAT YOU ARE DOING THIS MAY BE UNSOUND!
op: gemm, weight: (20, 16), bias: (20,)
op: relu, weight: nothing, bias: nothing
op: gemm, weight: (20, 20), bias: (20,)
op: relu, weight: nothing, bias: nothing
op: gemm, weight: (5, 20), bias: (5,)
Distance: 45.1203789866413
Distance: 91.51211437367601
Distance: 21.60429206630215
Running with 1 threads
[Thread 1] Time to first task: 0.0s
Zono Bounds:
[0.0, 0.0, 0.0, 0.0, 0.0, 0.0, 0.0, 0.0, 0.0, 0.0, 0.0, 0.0, 0.0, 0.0, 0.0, 0.0]
[0.0, 0.0, 0.0, 0.0, 0.0, 0.0, 0.0, 0.0, 0.0, 0.0, 0.0, 0.0, 0.0, 0.0, 0.0, 0.0]
[TOP-1] required confidence (0.8238357387262583≥0.5) is feasible for index 1
Found cex
N1: 0.9999999999960592 (vs. 3.940860806675741e-12)
N2: 0.9297082323647159
N1 Probability: 0.9999999999960592 >= 0.5

Found counterexample: ([-1.0, -1.0, 1.0, -1.0, 1.0, 1.0, -1.0, -1.0, -1.0, 1.0, -1.0, 1.0, -1.0, 1.0, 1.0, -1.0], (4, 3))
[Thread 1] Total splits: 0
Processed 1 zonotopes (Work Done: 0.0%); Generated 0 (0.003612561s/loop)
[Thread 1] Finished in 0.0s
 ────────────────────────────────────────────────────────────────────────────────
                                        Time                    Allocations      
                               ───────────────────────   ────────────────────────
       Tot / % measured:           3.66ms /  99.9%            924KiB /  99.8%    

 Section               ncalls     time    %tot     avg     alloc    %tot      avg
 ────────────────────────────────────────────────────────────────────────────────
 Verify                     1   3.63ms   99.3%  3.63ms    909KiB   98.5%   909KiB
   Zonotope Loop            1   3.61ms   98.8%  3.61ms    905KiB   98.1%   905KiB
     Property Check         1   3.47ms   94.9%  3.47ms    707KiB   76.6%   707KiB
     Zonotope Propa...      1   93.4μs    2.6%  93.4μs    160KiB   17.4%   160KiB
       DiffZonotope...      2   70.5μs    1.9%  35.3μs    135KiB   14.6%  67.4KiB
         Zonotope_R...      4   64.2μs    1.8%  16.0μs    129KiB   14.0%  32.4KiB
           Influenc...      4   27.8μs    0.8%  6.95μs   62.1KiB    6.7%  15.5KiB
             Multiply       4   15.9μs    0.4%  3.96μs   37.9KiB    4.1%  9.48KiB
             Alloca...      4   7.38μs    0.2%  1.85μs   22.0KiB    2.4%  5.50KiB
             Set Ma...      4   1.70μs    0.0%   426ns     0.00B    0.0%    0.00B
           Column M...      4   10.8μs    0.3%  2.70μs   27.9KiB    3.0%  6.97KiB
           Allocation       4   7.67μs    0.2%  1.92μs   27.4KiB    3.0%  6.84KiB
           Set Matrix       4   7.37μs    0.2%  1.84μs   2.75KiB    0.3%     704B
           Vectors          4   5.19μs    0.1%  1.30μs   4.75KiB    0.5%  1.19KiB
           Bounds           4    713ns    0.0%   178ns     0.00B    0.0%    0.00B
       DiffZonotope...      3   18.1μs    0.5%  6.02μs   23.7KiB    2.6%  7.89KiB
         Zonotope_D...      6   16.7μs    0.5%  2.78μs   22.7KiB    2.5%  3.79KiB
 Initialize                 1   27.0μs    0.7%  27.0μs   13.7KiB    1.5%  13.7KiB
 ────────────────────────────────────────────────────────────────────────────────[VERYDIFF_TIMER] 0.004954917
[VERYDIFF_EXPERIMENT] Sigma: 2.0
Parsing new_benchmarks/lhc/nets/2_20-1.onnx...
Found input X
WARNING: Operation Softmax is not supported
WE ARE IGNORING THIS OPERATION -- IF YOU DO NOT KNOW WHAT YOU ARE DOING THIS MAY BE UNSOUND!
op: gemm, weight: (20, 16), bias: (20,)
op: relu, weight: nothing, bias: nothing
op: gemm, weight: (20, 20), bias: (20,)
op: relu, weight: nothing, bias: nothing
op: gemm, weight: (5, 20), bias: (5,)
Parsing new_benchmarks/lhc/nets_pruned/2_20-1-0.2.onnx...
Found input X
WARNING: Operation Softmax is not supported
WE ARE IGNORING THIS OPERATION -- IF YOU DO NOT KNOW WHAT YOU ARE DOING THIS MAY BE UNSOUND!
op: gemm, weight: (20, 16), bias: (20,)
op: relu, weight: nothing, bias: nothing
op: gemm, weight: (20, 20), bias: (20,)
op: relu, weight: nothing, bias: nothing
op: gemm, weight: (5, 20), bias: (5,)
Distance: 45.1203789866413
Distance: 91.51211437367601
Distance: 21.60429206630215
Running with 1 threads
[Thread 1] Time to first task: 0.0s
Zono Bounds:
[0.0, 0.0, 0.0, 0.0, 0.0, 0.0, 0.0, 0.0, 0.0, 0.0, 0.0, 0.0, 0.0, 0.0, 0.0, 0.0]
[0.0, 0.0, 0.0, 0.0, 0.0, 0.0, 0.0, 0.0, 0.0, 0.0, 0.0, 0.0, 0.0, 0.0, 0.0, 0.0]
[TOP-1] required confidence (0.9999949026792413≥0.5) is feasible for index 1
Found cex
N1: 0.756142963257481 (vs. 0.24385703674251905)
N2: 0.9999862384674723
N1 Probability: 0.756142963257481 >= 0.5

Found counterexample: ([2.0, 2.0, -2.0, -2.0, -2.0, -2.0, 2.0, 2.0, 2.0, 2.0, 2.0, 2.0, 2.0, -2.0, -2.0, -2.0], (5, 1))
[Thread 1] Total splits: 0
Processed 1 zonotopes (Work Done: 0.0%); Generated 0 (0.005091725s/loop)
[Thread 1] Finished in 0.01s
 ────────────────────────────────────────────────────────────────────────────────
                                        Time                    Allocations      
                               ───────────────────────   ────────────────────────
       Tot / % measured:           5.14ms /  99.9%           1.23MiB /  99.9%    

 Section               ncalls     time    %tot     avg     alloc    %tot      avg
 ────────────────────────────────────────────────────────────────────────────────
 Verify                     1   5.11ms   99.5%  5.11ms   1.21MiB   98.9%  1.21MiB
   Zonotope Loop            1   5.09ms   99.1%  5.09ms   1.21MiB   98.6%  1.21MiB
     Property Check         1   4.92ms   95.8%  4.92ms   1.02MiB   82.8%  1.02MiB
     Zonotope Propa...      1    121μs    2.3%   121μs    160KiB   12.8%   160KiB
       DiffZonotope...      2   97.0μs    1.9%  48.5μs    135KiB   10.7%  67.4KiB
         Zonotope_R...      4   90.9μs    1.8%  22.7μs    129KiB   10.3%  32.4KiB
           Influenc...      4   54.0μs    1.1%  13.5μs   62.1KiB    4.9%  15.5KiB
             Alloca...      4   25.8μs    0.5%  6.44μs   22.0KiB    1.8%  5.50KiB
             Multiply       4   23.8μs    0.5%  5.94μs   37.9KiB    3.0%  9.48KiB
             Set Ma...      4   1.42μs    0.0%   354ns     0.00B    0.0%    0.00B
           Column M...      4   10.1μs    0.2%  2.53μs   27.9KiB    2.2%  6.97KiB
           Set Matrix       4   8.07μs    0.2%  2.02μs   2.75KiB    0.2%     704B
           Allocation       4   7.56μs    0.1%  1.89μs   27.4KiB    2.2%  6.84KiB
           Vectors          4   5.45μs    0.1%  1.36μs   4.75KiB    0.4%  1.19KiB
           Bounds           4    841ns    0.0%   210ns     0.00B    0.0%    0.00B
       DiffZonotope...      3   18.2μs    0.4%  6.07μs   23.7KiB    1.9%  7.89KiB
         Zonotope_D...      6   16.9μs    0.3%  2.81μs   22.7KiB    1.8%  3.79KiB
 Initialize                 1   27.7μs    0.5%  27.7μs   13.7KiB    1.1%  13.7KiB
 ────────────────────────────────────────────────────────────────────────────────[VERYDIFF_TIMER] 0.006423552
[VERYDIFF_EXPERIMENT] Sigma: 3.0
Parsing new_benchmarks/lhc/nets/2_20-1.onnx...
Found input X
WARNING: Operation Softmax is not supported
WE ARE IGNORING THIS OPERATION -- IF YOU DO NOT KNOW WHAT YOU ARE DOING THIS MAY BE UNSOUND!
op: gemm, weight: (20, 16), bias: (20,)
op: relu, weight: nothing, bias: nothing
op: gemm, weight: (20, 20), bias: (20,)
op: relu, weight: nothing, bias: nothing
op: gemm, weight: (5, 20), bias: (5,)
Parsing new_benchmarks/lhc/nets_pruned/2_20-1-0.2.onnx...
Found input X
WARNING: Operation Softmax is not supported
WE ARE IGNORING THIS OPERATION -- IF YOU DO NOT KNOW WHAT YOU ARE DOING THIS MAY BE UNSOUND!
op: gemm, weight: (20, 16), bias: (20,)
op: relu, weight: nothing, bias: nothing
op: gemm, weight: (20, 20), bias: (20,)
op: relu, weight: nothing, bias: nothing
op: gemm, weight: (5, 20), bias: (5,)
Distance: 45.1203789866413
Distance: 91.51211437367601
Distance: 21.60429206630215
Running with 1 threads
[Thread 1] Time to first task: 0.0s
Zono Bounds:
[0.0, 0.0, 0.0, 0.0, 0.0, 0.0, 0.0, 0.0, 0.0, 0.0, 0.0, 0.0, 0.0, 0.0, 0.0, 0.0]
[0.0, 0.0, 0.0, 0.0, 0.0, 0.0, 0.0, 0.0, 0.0, 0.0, 0.0, 0.0, 0.0, 0.0, 0.0, 0.0]
[TOP-1] required confidence (0.9999999999130004≥0.5) is feasible for index 1
Found cex
N1: 0.7820628695941894 (vs. 0.2179371304058106)
N2: 0.9999999999936817
N1 Probability: 0.7820628695941894 >= 0.5

Found counterexample: ([3.0, 3.0, -3.0, -3.0, -3.0, -3.0, 3.0, 3.0, 3.0, 3.0, 3.0, 3.0, 3.0, -3.0, -3.0, -3.0], (5, 1))
[Thread 1] Total splits: 0
Processed 1 zonotopes (Work Done: 0.0%); Generated 0 (0.005001159s/loop)
[Thread 1] Finished in 0.01s
 ────────────────────────────────────────────────────────────────────────────────
                                        Time                    Allocations      
                               ───────────────────────   ────────────────────────
       Tot / % measured:           5.05ms /  99.9%           1.23MiB /  99.9%    

 Section               ncalls     time    %tot     avg     alloc    %tot      avg
 ────────────────────────────────────────────────────────────────────────────────
 Verify                     1   5.02ms   99.4%  5.02ms   1.21MiB   98.9%  1.21MiB
   Zonotope Loop            1   5.00ms   99.1%  5.00ms   1.21MiB   98.6%  1.21MiB
     Property Check         1   4.85ms   96.2%  4.85ms   1.02MiB   82.8%  1.02MiB
     Zonotope Propa...      1   95.8μs    1.9%  95.8μs    160KiB   12.8%   160KiB
       DiffZonotope...      2   70.7μs    1.4%  35.4μs    135KiB   10.7%  67.4KiB
         Zonotope_R...      4   64.2μs    1.3%  16.0μs    129KiB   10.3%  32.4KiB
           Influenc...      4   27.8μs    0.6%  6.96μs   62.1KiB    4.9%  15.5KiB
             Multiply       4   16.0μs    0.3%  4.00μs   37.9KiB    3.0%  9.48KiB
             Alloca...      4   7.45μs    0.1%  1.86μs   22.0KiB    1.8%  5.50KiB
             Set Ma...      4   1.45μs    0.0%   362ns     0.00B    0.0%    0.00B
           Column M...      4   10.3μs    0.2%  2.58μs   27.9KiB    2.2%  6.97KiB
           Set Matrix       4   7.51μs    0.1%  1.88μs   2.75KiB    0.2%     704B
           Allocation       4   7.18μs    0.1%  1.79μs   27.4KiB    2.2%  6.84KiB
           Vectors          4   5.66μs    0.1%  1.41μs   4.75KiB    0.4%  1.19KiB
           Bounds           4    883ns    0.0%   221ns     0.00B    0.0%    0.00B
       DiffZonotope...      3   19.5μs    0.4%  6.49μs   23.7KiB    1.9%  7.89KiB
         Zonotope_D...      6   18.2μs    0.4%  3.03μs   22.7KiB    1.8%  3.79KiB
 Initialize                 1   29.0μs    0.6%  29.0μs   13.7KiB    1.1%  13.7KiB
 ────────────────────────────────────────────────────────────────────────────────[VERYDIFF_TIMER] 0.006377032
