%!PS-Adobe-3.0 EPSF-3.0
%%Title: softmax_error_plot.eps
%%Creator: Matplotlib v3.6.0, https://matplotlib.org/
%%CreationDate: Tue Oct  8 12:34:44 2024
%%Orientation: portrait
%%BoundingBox: 192 307 420 485
%%HiResBoundingBox: 192.660937 307.000000 419.339062 485.000000
%%EndComments
%%BeginProlog
/mpldict 12 dict def
mpldict begin
/_d { bind def } bind def
/m { moveto } _d
/l { lineto } _d
/r { rlineto } _d
/c { curveto } _d
/cl { closepath } _d
/ce { closepath eofill } _d
/box {
      m
      1 index 0 r
      0 exch r
      neg 0 r
      cl
    } _d
/clipbox {
      box
      clip
      newpath
    } _d
/sc { setcachedevice } _d
%!PS-Adobe-3.0 Resource-Font
%%Creator: Converted from TrueType to Type 3 by Matplotlib.
10 dict begin
/FontName /DejaVuSans def
/PaintType 0 def
/FontMatrix [0.00048828125 0 0 0.00048828125 0 0] def
/FontBBox [-2090 -948 3673 2524] def
/FontType 3 def
/Encoding [/E /e /parenleft /parenright /comma /period /o /zero /one /two /r /four /n /six /three /eight /five /equal] def
/CharStrings 19 dict dup begin
/.notdef 0 def
/E{1294 0 201 0 1163 1493 sc
201 1493 m
1145 1493 l
1145 1323 l
403 1323 l
403 881 l
1114 881 l
1114 711 l
403 711 l
403 170 l
1163 170 l
1163 0 l
201 0 l
201 1493 l

ce} _d
/e{1260 0 113 -29 1151 1147 sc
1151 606 m
1151 516 l
305 516 l
313 389 351 293 419 226 c
488 160 583 127 705 127 c
776 127 844 136 910 153 c
977 170 1043 196 1108 231 c
1108 57 l
1042 29 974 8 905 -7 c
836 -22 765 -29 694 -29 c
515 -29 374 23 269 127 c
165 231 113 372 113 549 c
113 732 162 878 261 985 c
360 1093 494 1147 662 1147 c
813 1147 932 1098 1019 1001 c
1107 904 1151 773 1151 606 c

967 660 m
966 761 937 841 882 901 c
827 961 755 991 664 991 c
561 991 479 962 417 904 c
356 846 320 764 311 659 c
967 660 l

ce} _d
/parenleft{799 0 176 -270 635 1554 sc
635 1554 m
546 1401 479 1249 436 1099 c
393 949 371 797 371 643 c
371 489 393 336 436 185 c
480 34 546 -117 635 -270 c
475 -270 l
375 -113 300 41 250 192 c
201 343 176 494 176 643 c
176 792 201 941 250 1092 c
299 1243 374 1397 475 1554 c
635 1554 l

ce} _d
/parenright{799 0 164 -270 623 1554 sc
164 1554 m
324 1554 l
424 1397 499 1243 548 1092 c
598 941 623 792 623 643 c
623 494 598 343 548 192 c
499 41 424 -113 324 -270 c
164 -270 l
253 -117 319 34 362 185 c
406 336 428 489 428 643 c
428 797 406 949 362 1099 c
319 1249 253 1401 164 1554 c

ce} _d
/comma{651 0 158 -238 451 254 sc
240 254 m
451 254 l
451 82 l
287 -238 l
158 -238 l
240 82 l
240 254 l

ce} _d
/period{651 0 219 0 430 254 sc
219 254 m
430 254 l
430 0 l
219 0 l
219 254 l

ce} _d
/o{1253 0 113 -29 1141 1147 sc
627 991 m
528 991 450 952 393 875 c
336 798 307 693 307 559 c
307 425 335 319 392 242 c
449 165 528 127 627 127 c
725 127 803 166 860 243 c
917 320 946 426 946 559 c
946 692 917 797 860 874 c
803 952 725 991 627 991 c

627 1147 m
787 1147 913 1095 1004 991 c
1095 887 1141 743 1141 559 c
1141 376 1095 232 1004 127 c
913 23 787 -29 627 -29 c
466 -29 340 23 249 127 c
158 232 113 376 113 559 c
113 743 158 887 249 991 c
340 1095 466 1147 627 1147 c

ce} _d
/zero{1303 0 135 -29 1167 1520 sc
651 1360 m
547 1360 469 1309 416 1206 c
364 1104 338 950 338 745 c
338 540 364 387 416 284 c
469 182 547 131 651 131 c
756 131 834 182 886 284 c
939 387 965 540 965 745 c
965 950 939 1104 886 1206 c
834 1309 756 1360 651 1360 c

651 1520 m
818 1520 946 1454 1034 1321 c
1123 1189 1167 997 1167 745 c
1167 494 1123 302 1034 169 c
946 37 818 -29 651 -29 c
484 -29 356 37 267 169 c
179 302 135 494 135 745 c
135 997 179 1189 267 1321 c
356 1454 484 1520 651 1520 c

ce} _d
/one{1303 0 225 0 1114 1493 sc
254 170 m
584 170 l
584 1309 l
225 1237 l
225 1421 l
582 1493 l
784 1493 l
784 170 l
1114 170 l
1114 0 l
254 0 l
254 170 l

ce} _d
/two{1303 0 150 0 1098 1520 sc
393 170 m
1098 170 l
1098 0 l
150 0 l
150 170 l
227 249 331 356 463 489 c
596 623 679 709 713 748 c
778 821 823 882 848 932 c
874 983 887 1032 887 1081 c
887 1160 859 1225 803 1275 c
748 1325 675 1350 586 1350 c
523 1350 456 1339 385 1317 c
315 1295 240 1262 160 1217 c
160 1421 l
241 1454 317 1478 388 1495 c
459 1512 523 1520 582 1520 c
737 1520 860 1481 952 1404 c
1044 1327 1090 1223 1090 1094 c
1090 1033 1078 974 1055 919 c
1032 864 991 800 930 725 c
913 706 860 650 771 557 c
682 465 556 336 393 170 c

ce} _d
/r{842 0 186 0 842 1147 sc
842 948 m
821 960 799 969 774 974 c
750 980 723 983 694 983 c
590 983 510 949 454 881 c
399 814 371 717 371 590 c
371 0 l
186 0 l
186 1120 l
371 1120 l
371 946 l
410 1014 460 1064 522 1097 c
584 1130 659 1147 748 1147 c
761 1147 775 1146 790 1144 c
805 1143 822 1140 841 1137 c
842 948 l

ce} _d
/four{1303 0 100 0 1188 1493 sc
774 1317 m
264 520 l
774 520 l
774 1317 l

721 1493 m
975 1493 l
975 520 l
1188 520 l
1188 352 l
975 352 l
975 0 l
774 0 l
774 352 l
100 352 l
100 547 l
721 1493 l

ce} _d
/n{1298 0 186 0 1124 1147 sc
1124 676 m
1124 0 l
940 0 l
940 670 l
940 776 919 855 878 908 c
837 961 775 987 692 987 c
593 987 514 955 457 892 c
400 829 371 742 371 633 c
371 0 l
186 0 l
186 1120 l
371 1120 l
371 946 l
415 1013 467 1064 526 1097 c
586 1130 655 1147 733 1147 c
862 1147 959 1107 1025 1027 c
1091 948 1124 831 1124 676 c

ce} _d
/six{1303 0 143 -29 1174 1520 sc
676 827 m
585 827 513 796 460 734 c
407 672 381 587 381 479 c
381 372 407 287 460 224 c
513 162 585 131 676 131 c
767 131 838 162 891 224 c
944 287 971 372 971 479 c
971 587 944 672 891 734 c
838 796 767 827 676 827 c

1077 1460 m
1077 1276 l
1026 1300 975 1318 923 1331 c
872 1344 821 1350 770 1350 c
637 1350 535 1305 464 1215 c
394 1125 354 989 344 807 c
383 865 433 909 492 940 c
551 971 617 987 688 987 c
838 987 956 941 1043 850 c
1130 759 1174 636 1174 479 c
1174 326 1129 203 1038 110 c
947 17 827 -29 676 -29 c
503 -29 371 37 280 169 c
189 302 143 494 143 745 c
143 981 199 1169 311 1309 c
423 1450 573 1520 762 1520 c
813 1520 864 1515 915 1505 c
967 1495 1021 1480 1077 1460 c

ce} _d
/three{1303 0 156 -29 1139 1520 sc
831 805 m
928 784 1003 741 1057 676 c
1112 611 1139 530 1139 434 c
1139 287 1088 173 987 92 c
886 11 742 -29 555 -29 c
492 -29 428 -23 361 -10 c
295 2 227 20 156 45 c
156 240 l
212 207 273 183 340 166 c
407 149 476 141 549 141 c
676 141 772 166 838 216 c
905 266 938 339 938 434 c
938 522 907 591 845 640 c
784 690 698 715 588 715 c
414 715 l
414 881 l
596 881 l
695 881 771 901 824 940 c
877 980 903 1037 903 1112 c
903 1189 876 1247 821 1288 c
767 1329 689 1350 588 1350 c
533 1350 473 1344 410 1332 c
347 1320 277 1301 201 1276 c
201 1456 l
278 1477 349 1493 416 1504 c
483 1515 547 1520 606 1520 c
759 1520 881 1485 970 1415 c
1059 1346 1104 1252 1104 1133 c
1104 1050 1080 980 1033 923 c
986 866 918 827 831 805 c

ce} _d
/eight{1303 0 139 -29 1163 1520 sc
651 709 m
555 709 479 683 424 632 c
369 581 342 510 342 420 c
342 330 369 259 424 208 c
479 157 555 131 651 131 c
747 131 823 157 878 208 c
933 260 961 331 961 420 c
961 510 933 581 878 632 c
823 683 748 709 651 709 c

449 795 m
362 816 295 857 246 916 c
198 975 174 1048 174 1133 c
174 1252 216 1347 301 1416 c
386 1485 503 1520 651 1520 c
800 1520 916 1485 1001 1416 c
1086 1347 1128 1252 1128 1133 c
1128 1048 1104 975 1055 916 c
1007 857 940 816 854 795 c
951 772 1027 728 1081 662 c
1136 596 1163 515 1163 420 c
1163 275 1119 164 1030 87 c
942 10 816 -29 651 -29 c
486 -29 360 10 271 87 c
183 164 139 275 139 420 c
139 515 166 596 221 662 c
276 728 352 772 449 795 c

375 1114 m
375 1037 399 976 447 933 c
496 890 564 868 651 868 c
738 868 805 890 854 933 c
903 976 928 1037 928 1114 c
928 1191 903 1252 854 1295 c
805 1338 738 1360 651 1360 c
564 1360 496 1338 447 1295 c
399 1252 375 1191 375 1114 c

ce} _d
/five{1303 0 158 -29 1124 1493 sc
221 1493 m
1014 1493 l
1014 1323 l
406 1323 l
406 957 l
435 967 465 974 494 979 c
523 984 553 987 582 987 c
749 987 881 941 978 850 c
1075 759 1124 635 1124 479 c
1124 318 1074 193 974 104 c
874 15 733 -29 551 -29 c
488 -29 424 -24 359 -13 c
294 -2 227 14 158 35 c
158 238 l
218 205 280 181 344 165 c
408 149 476 141 547 141 c
662 141 754 171 821 232 c
888 293 922 375 922 479 c
922 583 888 665 821 726 c
754 787 662 817 547 817 c
493 817 439 811 385 799 c
332 787 277 768 221 743 c
221 1493 l

ce} _d
/equal{1716 0 217 352 1499 930 sc
217 930 m
1499 930 l
1499 762 l
217 762 l
217 930 l

217 522 m
1499 522 l
1499 352 l
217 352 l
217 522 l

ce} _d
end readonly def

/BuildGlyph {
 exch begin
 CharStrings exch
 2 copy known not {pop /.notdef} if
 true 3 1 roll get exec
 end
} _d

/BuildChar {
 1 index /Encoding get exch get
 1 index /BuildGlyph get exec
} _d

FontName currentdict end definefont pop
%!PS-Adobe-3.0 Resource-Font
%%Creator: Converted from TrueType to Type 3 by Matplotlib.
10 dict begin
/FontName /DejaVuSans-Oblique def
/PaintType 0 def
/FontMatrix [0.00048828125 0 0 0.00048828125 0 0] def
/FontBBox [-2080 -717 3398 2187] def
/FontType 3 def
/Encoding [/sigma /l /n /o /p /delta /y] def
/CharStrings 8 dict dup begin
/.notdef 0 def
/sigma{1298 0 62 -29 1350 1121 sc
710 974 m
609 974 524 937 455 864 c
382 787 334 686 310 559 c
283 425 291 319 334 242 c
376 165 447 127 546 127 c
644 127 729 166 801 243 c
874 320 923 426 949 559 c
972 681 963 783 922 864 c
883 937 813 974 710 974 c

739 1121 m
1350 1120 l
1314 936 l
1108 936 l
1160 832 1172 706 1144 559 c
1108 376 1034 232 923 128 c
811 23 675 -29 515 -29 c
354 -29 239 23 168 128 c
97 232 80 376 116 559 c
151 743 225 887 336 991 c
429 1078 563 1121 739 1121 c

ce} _d
/l{569 0 72 0 559 1556 sc
375 1556 m
559 1556 l
256 0 l
72 0 l
375 1556 l

ce} _d
/n{1298 0 72 0 1159 1147 sc
1141 676 m
1010 0 l
825 0 l
956 669 l
962 700 967 728 970 752 c
973 776 975 795 975 809 c
975 865 957 909 922 940 c
887 971 837 987 774 987 c
675 987 590 954 519 888 c
448 823 401 734 379 621 c
256 0 l
72 0 l
289 1120 l
473 1120 l
436 944 l
487 1009 549 1059 621 1094 c
693 1129 769 1147 848 1147 c
947 1147 1023 1120 1077 1067 c
1132 1014 1159 939 1159 842 c
1159 818 1157 792 1154 765 c
1151 738 1147 708 1141 676 c

ce} _d
/o{1253 0 94 -29 1159 1147 sc
520 -29 m
389 -29 285 11 208 92 c
132 173 94 284 94 424 c
94 505 107 588 133 672 c
160 757 194 828 236 885 c
302 974 376 1040 457 1083 c
538 1126 630 1147 733 1147 c
860 1147 963 1107 1041 1028 c
1120 949 1159 845 1159 717 c
1159 628 1146 540 1120 452 c
1094 364 1060 291 1018 233 c
953 144 879 78 798 35 c
717 -8 624 -29 520 -29 c

285 430 m
285 329 306 253 348 202 c
391 152 455 127 541 127 c
664 127 766 181 847 288 c
928 396 969 533 969 698 c
969 795 947 868 904 917 c
861 966 797 991 713 991 c
644 991 582 975 528 942 c
474 910 426 861 383 795 c
352 746 327 689 310 626 c
293 563 285 497 285 430 c

ce} _d
/p{1300 0 -6 -426 1206 1147 sc
1016 690 m
1016 788 995 863 952 915 c
909 967 848 993 768 993 c
713 993 661 979 611 951 c
562 923 518 882 479 829 c
441 776 411 713 388 638 c
365 563 354 489 354 416 c
354 323 375 251 418 200 c
461 150 521 125 600 125 c
658 125 712 139 761 166 c
811 193 854 233 889 285 c
927 340 958 404 981 478 c
1004 552 1016 623 1016 690 c

446 950 m
495 1015 553 1064 620 1097 c
687 1130 762 1147 844 1147 c
959 1147 1048 1109 1111 1034 c
1174 959 1206 854 1206 719 c
1206 608 1186 503 1147 402 c
1108 302 1051 212 977 133 c
928 80 872 40 810 12 c
748 -15 683 -29 614 -29 c
535 -29 468 -13 414 20 c
360 53 320 103 293 168 c
178 -426 l
-6 -426 l
295 1120 l
479 1120 l
446 950 l

ce} _d
/delta{1253 0 23 -29 1157 1520 sc
1111 1297 m
1052 1344 943 1367 784 1367 c
615 1367 523 1328 508 1250 c
496 1189 575 1142 745 1110 c
878 1085 977 1036 1041 961 c
1118 871 1139 734 1103 549 c
1068 372 995 232 884 128 c
772 23 636 -29 476 -29 c
317 -29 201 23 130 128 c
59 232 41 376 77 559 c
103 695 172 818 285 928 c
329 971 378 1004 433 1028 c
339 1081 301 1154 320 1248 c
355 1429 520 1520 814 1520 c
961 1520 1070 1497 1141 1450 c
1111 1297 l

561 978 m
512 959 465 925 418 876 c
346 801 297 695 271 559 c
244 424 252 318 294 242 c
337 165 408 127 507 127 c
605 127 690 166 762 243 c
835 320 883 422 908 549 c
933 682 922 780 874 844 c
823 913 756 951 673 958 c
631 962 594 969 561 978 c

ce} _d
/y{1212 0 -51 -426 1235 1120 sc
508 -104 m
423 -247 353 -337 299 -372 c
246 -408 177 -426 94 -426 c
-51 -426 l
-20 -272 l
86 -272 l
137 -272 181 -258 217 -230 c
253 -202 293 -147 338 -66 c
395 41 l
147 1120 l
342 1120 l
528 262 l
1042 1120 l
1235 1120 l
508 -104 l

ce} _d
end readonly def

/BuildGlyph {
 exch begin
 CharStrings exch
 2 copy known not {pop /.notdef} if
 true 3 1 roll get exec
 end
} _d

/BuildChar {
 1 index /Encoding get exch get
 1 index /BuildGlyph get exec
} _d

FontName currentdict end definefont pop
end
%%EndProlog
mpldict begin
192.661 307 translate
226.678 178 0 0 clipbox
gsave
0 0 m
226.678125 0 l
226.678125 178 l
0 178 l
cl
1.000 setgray
fill
grestore
gsave
43.778125 59.92 m
211.178125 59.92 l
211.178125 170.8 l
43.778125 170.8 l
cl
1.000 setgray
fill
grestore
0.800 setlinewidth
1 setlinejoin
0 setlinecap
[] 0 setdash
0.000 setgray
gsave
/o {
gsave
newpath
translate
0.8 setlinewidth
1 setlinejoin

0 setlinecap

0 0 m
0 -3.5 l

gsave
0.000 setgray
fill
grestore
stroke
grestore
} bind def
81.8236 59.92 o
grestore
/DejaVuSans 10.000 selectfont
gsave

73.8705 45.3262 translate
0 rotate
0 0 m /zero glyphshow
6.3623 0 m /period glyphshow
9.54102 0 m /six glyphshow
grestore
gsave
/o {
gsave
newpath
translate
0.8 setlinewidth
1 setlinejoin

0 setlinecap

0 0 m
0 -3.5 l

gsave
0.000 setgray
fill
grestore
stroke
grestore
} bind def
142.696 59.92 o
grestore
/DejaVuSans 10.000 selectfont
gsave

134.743 45.3262 translate
0 rotate
0 0 m /zero glyphshow
6.3623 0 m /period glyphshow
9.54102 0 m /eight glyphshow
grestore
gsave
/o {
gsave
newpath
translate
0.8 setlinewidth
1 setlinejoin

0 setlinecap

0 0 m
0 -3.5 l

gsave
0.000 setgray
fill
grestore
stroke
grestore
} bind def
203.569 59.92 o
grestore
/DejaVuSans 10.000 selectfont
gsave

195.616 45.3262 translate
0 rotate
0 0 m /one glyphshow
6.3623 0 m /period glyphshow
9.54102 0 m /zero glyphshow
grestore
gsave
123.978 31.6544 translate
0 rotate
/DejaVuSans-Oblique 10.0 selectfont
0 0.578125 moveto
/delta glyphshow
grestore
gsave
/o {
gsave
newpath
translate
0.8 setlinewidth
1 setlinejoin

0 setlinecap

-0 0 m
-3.5 0 l

gsave
0.000 setgray
fill
grestore
stroke
grestore
} bind def
43.7781 59.92 o
grestore
/DejaVuSans 10.000 selectfont
gsave

20.8719 56.1231 translate
0 rotate
0 0 m /zero glyphshow
6.3623 0 m /period glyphshow
9.54102 0 m /zero glyphshow
grestore
gsave
/o {
gsave
newpath
translate
0.8 setlinewidth
1 setlinejoin

0 setlinecap

-0 0 m
-3.5 0 l

gsave
0.000 setgray
fill
grestore
stroke
grestore
} bind def
43.7781 83.7652 o
grestore
/DejaVuSans 10.000 selectfont
gsave

20.8719 79.9683 translate
0 rotate
0 0 m /zero glyphshow
6.3623 0 m /period glyphshow
9.54102 0 m /two glyphshow
grestore
gsave
/o {
gsave
newpath
translate
0.8 setlinewidth
1 setlinejoin

0 setlinecap

-0 0 m
-3.5 0 l

gsave
0.000 setgray
fill
grestore
stroke
grestore
} bind def
43.7781 107.61 o
grestore
/DejaVuSans 10.000 selectfont
gsave

20.8719 103.813 translate
0 rotate
0 0 m /zero glyphshow
6.3623 0 m /period glyphshow
9.54102 0 m /four glyphshow
grestore
gsave
/o {
gsave
newpath
translate
0.8 setlinewidth
1 setlinejoin

0 setlinecap

-0 0 m
-3.5 0 l

gsave
0.000 setgray
fill
grestore
stroke
grestore
} bind def
43.7781 131.455 o
grestore
/DejaVuSans 10.000 selectfont
gsave

20.8719 127.659 translate
0 rotate
0 0 m /zero glyphshow
6.3623 0 m /period glyphshow
9.54102 0 m /six glyphshow
grestore
gsave
/o {
gsave
newpath
translate
0.8 setlinewidth
1 setlinejoin

0 setlinecap

-0 0 m
-3.5 0 l

gsave
0.000 setgray
fill
grestore
stroke
grestore
} bind def
43.7781 155.301 o
grestore
/DejaVuSans 10.000 selectfont
gsave

20.8719 151.504 translate
0 rotate
0 0 m /zero glyphshow
6.3623 0 m /period glyphshow
9.54102 0 m /eight glyphshow
grestore
/DejaVuSans 10.000 selectfont
gsave

14.7938 103.165 translate
90 rotate
0 0 m /E glyphshow
6.31836 0 m /r glyphshow
10.3047 0 m /r glyphshow
14.166 0 m /o glyphshow
20.2842 0 m /r glyphshow
grestore
1.500 setlinewidth
[1.5 2.475] 0 setdash
1.000 0.000 0.000 setrgbcolor
gsave
167.4 110.88 43.778 59.92 clipbox
51.387216 59.92 m
52.924406 59.92 l
54.461596 59.92 l
55.998786 59.92 l
57.535976 59.92 l
59.073166 59.92 l
60.610356 59.92 l
62.147546 59.92 l
63.684737 59.92 l
65.221927 59.92 l
66.759117 59.92 l
68.296307 59.92 l
69.833497 59.92 l
71.370687 59.92 l
72.907877 59.92 l
74.445067 59.92 l
75.982257 59.92 l
77.519447 59.92 l
79.056637 59.92 l
80.593827 59.92 l
82.131018 59.92 l
83.668208 59.92 l
85.205398 59.92 l
86.742588 59.92 l
88.279778 59.92 l
89.816968 59.92 l
91.354158 59.92 l
92.891348 59.92 l
94.428538 59.92 l
95.965728 59.92 l
97.502918 59.92 l
99.040108 59.92 l
100.577299 59.92 l
102.114489 59.92 l
103.651679 59.92 l
105.188869 59.92 l
106.726059 59.92 l
108.263249 59.92 l
109.800439 59.92 l
111.337629 59.92 l
112.874819 59.92 l
114.412009 59.92 l
115.949199 59.92 l
117.486389 59.92 l
119.02358 59.92 l
120.56077 59.92 l
122.09796 59.92 l
123.63515 59.92 l
125.17234 59.92 l
126.70953 59.92 l
128.24672 59.92 l
129.78391 59.92 l
131.3211 59.92 l
132.85829 59.92 l
134.39548 59.92 l
135.93267 59.92 l
137.469861 59.92 l
139.007051 59.92 l
140.544241 59.92 l
142.081431 59.92 l
143.618621 59.92 l
145.155811 59.92 l
146.693001 59.92 l
148.230191 59.92 l
149.767381 59.92 l
151.304571 59.92 l
152.841761 59.92 l
154.378951 59.92 l
155.916142 59.92 l
157.453332 59.92 l
158.990522 59.92 l
160.527712 59.92 l
162.064902 59.92 l
163.602092 59.92 l
165.139282 59.92 l
166.676472 59.92 l
168.213662 59.92 l
169.750852 59.92 l
171.288042 59.92 l
172.825232 59.92 l
174.362423 59.92 l
175.899613 59.92 l
177.436803 59.92 l
178.973993 59.92 l
180.511183 59.92 l
182.048373 59.92 l
183.585563 59.92 l
185.122753 59.92 l
186.659943 59.92 l
188.197133 59.92 l
189.734323 59.92 l
191.271513 59.92 l
192.808704 59.92 l
194.345894 59.92 l
195.883084 59.92 l
197.420274 59.92 l
198.957464 59.92 l
200.494654 59.92 l
202.031844 59.92 l
203.569034 59.92 l
stroke
grestore
2 setlinecap
[] 0 setdash
gsave
167.4 110.88 43.778 59.92 clipbox
51.387216 59.92 m
52.924406 59.92 l
54.461596 59.92 l
55.998786 59.92 l
57.535976 59.92 l
59.073166 59.92 l
60.610356 59.92 l
62.147546 59.92 l
63.684737 59.92 l
65.221927 59.92 l
66.759117 59.92 l
68.296307 59.92 l
69.833497 59.92 l
71.370687 59.92 l
72.907877 59.92 l
74.445067 59.92 l
75.982257 59.92 l
77.519447 59.92 l
79.056637 59.92 l
80.593827 59.92 l
82.131018 59.92 l
83.668208 59.92 l
85.205398 59.92 l
86.742588 59.92 l
88.279778 59.92 l
89.816968 59.92 l
91.354158 59.92 l
92.891348 59.92 l
94.428538 59.92 l
95.965728 59.92 l
97.502918 59.92 l
99.040108 59.92 l
100.577299 59.92 l
102.114489 59.92 l
103.651679 59.92 l
105.188869 59.92 l
106.726059 59.92 l
108.263249 59.92 l
109.800439 59.92 l
111.337629 59.92 l
112.874819 59.92 l
114.412009 59.92 l
115.949199 59.92 l
117.486389 59.92 l
119.02358 59.92 l
120.56077 59.92 l
122.09796 59.92 l
123.63515 59.92 l
125.17234 59.92 l
126.70953 59.92 l
128.24672 59.92 l
129.78391 59.92 l
131.3211 59.92 l
132.85829 59.92 l
134.39548 59.92 l
135.93267 59.92 l
137.469861 59.92 l
139.007051 59.92 l
140.544241 59.92 l
142.081431 59.92 l
143.618621 59.92 l
145.155811 59.92 l
146.693001 59.92 l
148.230191 59.92 l
149.767381 59.92 l
151.304571 59.92 l
152.841761 59.92 l
154.378951 59.92 l
155.916142 59.92 l
157.453332 59.92 l
158.990522 59.92 l
160.527712 59.92 l
162.064902 59.92 l
163.602092 59.92 l
165.139282 59.92 l
166.676472 59.92 l
168.213662 59.92 l
169.750852 59.92 l
171.288042 59.92 l
172.825232 59.92 l
174.362423 59.92 l
175.899613 59.92 l
177.436803 59.92 l
178.973993 59.92 l
180.511183 59.92 l
182.048373 59.92 l
183.585563 59.92 l
185.122753 59.92 l
186.659943 59.92 l
188.197133 59.92 l
189.734323 59.92 l
191.271513 59.92 l
192.808704 59.92 l
194.345894 59.92 l
195.883084 59.92 l
197.420274 59.92 l
198.957464 59.92 l
200.494654 59.92 l
202.031844 59.92 l
203.569034 59.92 l
stroke
grestore
0 setlinecap
[1.5 2.475] 0 setdash
0.000 0.502 0.000 setrgbcolor
gsave
167.4 110.88 43.778 59.92 clipbox
51.387216 80.375914 m
52.924406 80.375914 l
54.461596 80.375914 l
55.998786 80.375914 l
57.535976 80.375914 l
59.073166 80.375914 l
60.610356 80.375914 l
62.147546 80.375914 l
63.684737 80.375914 l
65.221927 80.375914 l
66.759117 80.375914 l
68.296307 80.375914 l
69.833497 80.375914 l
71.370687 80.375914 l
72.907877 80.375914 l
74.445067 80.375914 l
75.982257 80.375914 l
77.519447 80.375914 l
79.056637 80.375914 l
80.593827 80.375914 l
82.131018 80.375914 l
83.668208 80.375914 l
85.205398 80.375914 l
86.742588 80.375914 l
88.279778 80.375914 l
89.816968 80.375914 l
91.354158 80.375914 l
92.891348 80.375914 l
94.428538 80.375914 l
95.965728 80.375914 l
97.502918 80.375914 l
99.040108 80.375914 l
100.577299 80.375914 l
102.114489 80.375914 l
103.651679 80.375914 l
105.188869 80.375914 l
106.726059 80.375914 l
108.263249 80.375914 l
109.800439 80.375914 l
111.337629 80.375914 l
112.874819 80.375914 l
114.412009 80.375914 l
115.949199 80.375914 l
117.486389 80.375914 l
119.02358 80.375914 l
120.56077 80.375914 l
122.09796 80.375914 l
123.63515 80.375914 l
125.17234 80.375914 l
126.70953 80.375914 l
128.24672 80.375914 l
129.78391 80.375914 l
131.3211 80.375914 l
132.85829 80.375914 l
134.39548 80.375914 l
135.93267 80.375914 l
137.469861 80.375914 l
139.007051 80.375914 l
140.544241 80.375914 l
142.081431 80.375914 l
143.618621 80.375914 l
145.155811 80.375914 l
146.693001 80.375914 l
148.230191 80.375914 l
149.767381 80.375914 l
151.304571 80.375914 l
152.841761 80.375914 l
154.378951 80.375914 l
155.916142 80.375914 l
157.453332 80.375914 l
158.990522 80.375914 l
160.527712 80.375914 l
162.064902 80.375914 l
163.602092 80.375914 l
165.139282 80.375914 l
166.676472 80.375914 l
168.213662 80.375914 l
169.750852 80.375914 l
171.288042 80.375914 l
172.825232 80.375914 l
174.362423 80.375914 l
175.899613 80.375914 l
177.436803 80.375914 l
178.973993 80.375914 l
180.511183 80.375914 l
182.048373 80.375914 l
183.585563 80.375914 l
185.122753 80.375914 l
186.659943 80.375914 l
188.197133 80.375914 l
189.734323 80.375914 l
191.271513 80.375914 l
192.808704 80.375914 l
194.345894 80.375914 l
195.883084 80.375914 l
197.420274 80.375914 l
198.957464 80.375914 l
200.494654 80.375914 l
202.031844 80.375914 l
203.569034 80.375914 l
stroke
grestore
2 setlinecap
[] 0 setdash
gsave
167.4 110.88 43.778 59.92 clipbox
51.387216 79.790968 m
52.924406 79.856065 l
54.461596 79.917521 l
55.998786 79.9753 l
57.535976 80.029362 l
59.073166 80.07967 l
60.610356 80.126186 l
62.147546 80.168869 l
63.684737 80.207681 l
65.221927 80.242581 l
66.759117 80.273527 l
68.296307 80.30048 l
69.833497 80.323396 l
71.370687 80.342232 l
72.907877 80.356947 l
74.445067 80.367495 l
75.982257 80.373832 l
77.519447 80.375914 l
79.056637 80.373694 l
80.593827 80.367126 l
82.131018 80.356163 l
83.668208 80.340757 l
85.205398 80.32086 l
86.742588 80.296423 l
88.279778 80.267395 l
89.816968 80.233725 l
91.354158 80.195364 l
92.891348 80.152258 l
94.428538 80.104355 l
95.965728 80.0516 l
97.502918 79.99394 l
99.040108 79.931319 l
100.577299 79.86368 l
102.114489 79.790968 l
103.651679 79.713123 l
105.188869 79.630088 l
106.726059 79.541802 l
108.263249 79.448205 l
109.800439 79.349236 l
111.337629 79.244831 l
112.874819 79.134928 l
114.412009 79.019462 l
115.949199 78.898368 l
117.486389 78.771579 l
119.02358 78.639028 l
120.56077 78.500645 l
122.09796 78.356362 l
123.63515 78.206108 l
125.17234 78.04981 l
126.70953 77.887395 l
128.24672 77.71879 l
129.78391 77.543918 l
131.3211 77.362704 l
132.85829 77.175068 l
134.39548 76.980932 l
135.93267 76.780215 l
137.469861 76.572835 l
139.007051 76.35871 l
140.544241 76.137753 l
142.081431 75.90988 l
143.618621 75.675002 l
145.155811 75.433031 l
146.693001 75.183876 l
148.230191 74.927444 l
149.767381 74.663643 l
151.304571 74.392377 l
152.841761 74.113548 l
154.378951 73.827059 l
155.916142 73.532809 l
157.453332 73.230696 l
158.990522 72.920616 l
160.527712 72.602463 l
162.064902 72.276129 l
163.602092 71.941505 l
165.139282 71.59848 l
166.676472 71.24694 l
168.213662 70.886769 l
169.750852 70.517849 l
171.288042 70.140062 l
172.825232 69.753284 l
174.362423 69.357392 l
175.899613 68.952258 l
177.436803 68.537754 l
178.973993 68.113749 l
180.511183 67.680109 l
182.048373 67.236697 l
183.585563 66.783375 l
185.122753 66.32 l
186.659943 65.846429 l
188.197133 65.362514 l
189.734323 64.868107 l
191.271513 64.363053 l
192.808704 63.847196 l
194.345894 63.32038 l
195.883084 62.78244 l
197.420274 62.233212 l
198.957464 61.672528 l
200.494654 61.100215 l
202.031844 60.516099 l
203.569034 59.92 l
stroke
grestore
0 setlinecap
[1.5 2.475] 0 setdash
0.000 0.000 1.000 setrgbcolor
gsave
167.4 110.88 43.778 59.92 clipbox
51.387216 99.661935 m
52.924406 99.661935 l
54.461596 99.661935 l
55.998786 99.661935 l
57.535976 99.661935 l
59.073166 99.661935 l
60.610356 99.661935 l
62.147546 99.661935 l
63.684737 99.661935 l
65.221927 99.661935 l
66.759117 99.661935 l
68.296307 99.661935 l
69.833497 99.661935 l
71.370687 99.661935 l
72.907877 99.661935 l
74.445067 99.661935 l
75.982257 99.661935 l
77.519447 99.661935 l
79.056637 99.661935 l
80.593827 99.661935 l
82.131018 99.661935 l
83.668208 99.661935 l
85.205398 99.661935 l
86.742588 99.661935 l
88.279778 99.661935 l
89.816968 99.661935 l
91.354158 99.661935 l
92.891348 99.661935 l
94.428538 99.661935 l
95.965728 99.661935 l
97.502918 99.661935 l
99.040108 99.661935 l
100.577299 99.661935 l
102.114489 99.661935 l
103.651679 99.661935 l
105.188869 99.661935 l
106.726059 99.661935 l
108.263249 99.661935 l
109.800439 99.661935 l
111.337629 99.661935 l
112.874819 99.661935 l
114.412009 99.661935 l
115.949199 99.661935 l
117.486389 99.661935 l
119.02358 99.661935 l
120.56077 99.661935 l
122.09796 99.661935 l
123.63515 99.661935 l
125.17234 99.661935 l
126.70953 99.661935 l
128.24672 99.661935 l
129.78391 99.661935 l
131.3211 99.661935 l
132.85829 99.661935 l
134.39548 99.661935 l
135.93267 99.661935 l
137.469861 99.661935 l
139.007051 99.661935 l
140.544241 99.661935 l
142.081431 99.661935 l
143.618621 99.661935 l
145.155811 99.661935 l
146.693001 99.661935 l
148.230191 99.661935 l
149.767381 99.661935 l
151.304571 99.661935 l
152.841761 99.661935 l
154.378951 99.661935 l
155.916142 99.661935 l
157.453332 99.661935 l
158.990522 99.661935 l
160.527712 99.661935 l
162.064902 99.661935 l
163.602092 99.661935 l
165.139282 99.661935 l
166.676472 99.661935 l
168.213662 99.661935 l
169.750852 99.661935 l
171.288042 99.661935 l
172.825232 99.661935 l
174.362423 99.661935 l
175.899613 99.661935 l
177.436803 99.661935 l
178.973993 99.661935 l
180.511183 99.661935 l
182.048373 99.661935 l
183.585563 99.661935 l
185.122753 99.661935 l
186.659943 99.661935 l
188.197133 99.661935 l
189.734323 99.661935 l
191.271513 99.661935 l
192.808704 99.661935 l
194.345894 99.661935 l
195.883084 99.661935 l
197.420274 99.661935 l
198.957464 99.661935 l
200.494654 99.661935 l
202.031844 99.661935 l
203.569034 99.661935 l
stroke
grestore
2 setlinecap
[] 0 setdash
gsave
167.4 110.88 43.778 59.92 clipbox
51.387216 95.687742 m
52.924406 95.902166 l
54.461596 96.111833 l
55.998786 96.316655 l
57.535976 96.51654 l
59.073166 96.711398 l
60.610356 96.901132 l
62.147546 97.085646 l
63.684737 97.264839 l
65.221927 97.43861 l
66.759117 97.606854 l
68.296307 97.769462 l
69.833497 97.926325 l
71.370687 98.077329 l
72.907877 98.222357 l
74.445067 98.36129 l
75.982257 98.494006 l
77.519447 98.620378 l
79.056637 98.740276 l
80.593827 98.853569 l
82.131018 98.960119 l
83.668208 99.059785 l
85.205398 99.152423 l
86.742588 99.237886 l
88.279778 99.316019 l
89.816968 99.386667 l
91.354158 99.449667 l
92.891348 99.504853 l
94.428538 99.552054 l
95.965728 99.591094 l
97.502918 99.621792 l
99.040108 99.643961 l
100.577299 99.657408 l
102.114489 99.661935 l
103.651679 99.657339 l
105.188869 99.643408 l
106.726059 99.619925 l
108.263249 99.586667 l
109.800439 99.543402 l
111.337629 99.489892 l
112.874819 99.425892 l
114.412009 99.351148 l
115.949199 99.265397 l
117.486389 99.168369 l
119.02358 99.059785 l
120.56077 98.939355 l
122.09796 98.806781 l
123.63515 98.661753 l
125.17234 98.503954 l
126.70953 98.333052 l
128.24672 98.148705 l
129.78391 97.95056 l
131.3211 97.738251 l
132.85829 97.511398 l
134.39548 97.269608 l
135.93267 97.012473 l
137.469861 96.739572 l
139.007051 96.450466 l
140.544241 96.144701 l
142.081431 95.821806 l
143.618621 95.48129 l
145.155811 95.122647 l
146.693001 94.745347 l
148.230191 94.348843 l
149.767381 93.932563 l
151.304571 93.495914 l
152.841761 93.03828 l
154.378951 92.559017 l
155.916142 92.057457 l
157.453332 91.532903 l
158.990522 90.984629 l
160.527712 90.411878 l
162.064902 89.813861 l
163.602092 89.189752 l
165.139282 88.538693 l
166.676472 87.859785 l
168.213662 87.152089 l
169.750852 86.414624 l
171.288042 85.646363 l
172.825232 84.846232 l
174.362423 84.013106 l
175.899613 83.145806 l
177.436803 82.243099 l
178.973993 81.303687 l
180.511183 80.326213 l
182.048373 79.309247 l
183.585563 78.251292 l
185.122753 77.150769 l
186.659943 76.006022 l
188.197133 74.815303 l
189.734323 73.576774 l
191.271513 72.288498 l
192.808704 70.948428 l
194.345894 69.554409 l
195.883084 68.104159 l
197.420274 66.595269 l
198.957464 65.025189 l
200.494654 63.391221 l
202.031844 61.690502 l
203.569034 59.92 l
stroke
grestore
0 setlinecap
[1.5 2.475] 0 setdash
0.647 0.165 0.165 setrgbcolor
gsave
167.4 110.88 43.778 59.92 clipbox
51.387216 119.532903 m
52.924406 119.532903 l
54.461596 119.532903 l
55.998786 119.532903 l
57.535976 119.532903 l
59.073166 119.532903 l
60.610356 119.532903 l
62.147546 119.532903 l
63.684737 119.532903 l
65.221927 119.532903 l
66.759117 119.532903 l
68.296307 119.532903 l
69.833497 119.532903 l
71.370687 119.532903 l
72.907877 119.532903 l
74.445067 119.532903 l
75.982257 119.532903 l
77.519447 119.532903 l
79.056637 119.532903 l
80.593827 119.532903 l
82.131018 119.532903 l
83.668208 119.532903 l
85.205398 119.532903 l
86.742588 119.532903 l
88.279778 119.532903 l
89.816968 119.532903 l
91.354158 119.532903 l
92.891348 119.532903 l
94.428538 119.532903 l
95.965728 119.532903 l
97.502918 119.532903 l
99.040108 119.532903 l
100.577299 119.532903 l
102.114489 119.532903 l
103.651679 119.532903 l
105.188869 119.532903 l
106.726059 119.532903 l
108.263249 119.532903 l
109.800439 119.532903 l
111.337629 119.532903 l
112.874819 119.532903 l
114.412009 119.532903 l
115.949199 119.532903 l
117.486389 119.532903 l
119.02358 119.532903 l
120.56077 119.532903 l
122.09796 119.532903 l
123.63515 119.532903 l
125.17234 119.532903 l
126.70953 119.532903 l
128.24672 119.532903 l
129.78391 119.532903 l
131.3211 119.532903 l
132.85829 119.532903 l
134.39548 119.532903 l
135.93267 119.532903 l
137.469861 119.532903 l
139.007051 119.532903 l
140.544241 119.532903 l
142.081431 119.532903 l
143.618621 119.532903 l
145.155811 119.532903 l
146.693001 119.532903 l
148.230191 119.532903 l
149.767381 119.532903 l
151.304571 119.532903 l
152.841761 119.532903 l
154.378951 119.532903 l
155.916142 119.532903 l
157.453332 119.532903 l
158.990522 119.532903 l
160.527712 119.532903 l
162.064902 119.532903 l
163.602092 119.532903 l
165.139282 119.532903 l
166.676472 119.532903 l
168.213662 119.532903 l
169.750852 119.532903 l
171.288042 119.532903 l
172.825232 119.532903 l
174.362423 119.532903 l
175.899613 119.532903 l
177.436803 119.532903 l
178.973993 119.532903 l
180.511183 119.532903 l
182.048373 119.532903 l
183.585563 119.532903 l
185.122753 119.532903 l
186.659943 119.532903 l
188.197133 119.532903 l
189.734323 119.532903 l
191.271513 119.532903 l
192.808704 119.532903 l
194.345894 119.532903 l
195.883084 119.532903 l
197.420274 119.532903 l
198.957464 119.532903 l
200.494654 119.532903 l
202.031844 119.532903 l
203.569034 119.532903 l
stroke
grestore
2 setlinecap
[] 0 setdash
gsave
167.4 110.88 43.778 59.92 clipbox
51.387216 107.610323 m
52.924406 107.993933 l
54.461596 108.373953 l
55.998786 108.750295 l
57.535976 109.122864 l
59.073166 109.491568 l
60.610356 109.856306 l
62.147546 110.216977 l
63.684737 110.573475 l
65.221927 110.925693 l
66.759117 111.273515 l
68.296307 111.616827 l
69.833497 111.955506 l
71.370687 112.289426 l
72.907877 112.618459 l
74.445067 112.942469 l
75.982257 113.261317 l
77.519447 113.574856 l
79.056637 113.882938 l
80.593827 114.185404 l
82.131018 114.482094 l
83.668208 114.772837 l
85.205398 115.05746 l
86.742588 115.33578 l
88.279778 115.607606 l
89.816968 115.872743 l
91.354158 116.130984 l
92.891348 116.382116 l
94.428538 116.625915 l
95.965728 116.862151 l
97.502918 117.090581 l
99.040108 117.310952 l
100.577299 117.523 l
102.114489 117.726452 l
103.651679 117.921018 l
105.188869 118.1064 l
106.726059 118.282283 l
108.263249 118.448338 l
109.800439 118.604222 l
111.337629 118.749575 l
112.874819 118.884019 l
114.412009 119.007158 l
115.949199 119.118579 l
117.486389 119.217846 l
119.02358 119.304501 l
120.56077 119.378065 l
122.09796 119.438031 l
123.63515 119.483868 l
125.17234 119.515018 l
126.70953 119.530889 l
128.24672 119.530862 l
129.78391 119.51428 l
131.3211 119.480451 l
132.85829 119.428644 l
134.39548 119.358085 l
135.93267 119.267957 l
137.469861 119.157392 l
139.007051 119.025473 l
140.544241 118.871224 l
142.081431 118.693612 l
143.618621 118.491537 l
145.155811 118.263829 l
146.693001 118.009243 l
148.230191 117.726452 l
149.767381 117.414039 l
151.304571 117.070492 l
152.841761 116.694194 l
154.378951 116.283412 l
155.916142 115.836293 l
157.453332 115.350844 l
158.990522 114.824926 l
160.527712 114.256238 l
162.064902 113.6423 l
163.602092 112.980438 l
165.139282 112.26776 l
166.676472 111.501141 l
168.213662 110.677192 l
169.750852 109.792233 l
171.288042 108.842263 l
172.825232 107.822925 l
174.362423 106.729462 l
175.899613 105.556672 l
177.436803 104.298855 l
178.973993 102.949751 l
180.511183 101.502471 l
182.048373 99.949414 l
183.585563 98.282173 l
185.122753 96.491429 l
186.659943 94.566816 l
188.197133 92.496777 l
189.734323 90.268387 l
191.271513 87.867139 l
192.808704 85.276701 l
194.345894 82.478615 l
195.883084 79.451942 l
197.420274 76.172828 l
198.957464 72.613984 l
200.494654 68.744038 l
202.031844 64.526744 l
203.569034 59.92 l
stroke
grestore
0 setlinecap
[1.5 2.475] 0 setdash
1.000 0.000 1.000 setrgbcolor
gsave
167.4 110.88 43.778 59.92 clipbox
51.387216 157.369154 m
52.924406 157.369154 l
54.461596 157.369154 l
55.998786 157.369154 l
57.535976 157.369154 l
59.073166 157.369154 l
60.610356 157.369154 l
62.147546 157.369154 l
63.684737 157.369154 l
65.221927 157.369154 l
66.759117 157.369154 l
68.296307 157.369154 l
69.833497 157.369154 l
71.370687 157.369154 l
72.907877 157.369154 l
74.445067 157.369154 l
75.982257 157.369154 l
77.519447 157.369154 l
79.056637 157.369154 l
80.593827 157.369154 l
82.131018 157.369154 l
83.668208 157.369154 l
85.205398 157.369154 l
86.742588 157.369154 l
88.279778 157.369154 l
89.816968 157.369154 l
91.354158 157.369154 l
92.891348 157.369154 l
94.428538 157.369154 l
95.965728 157.369154 l
97.502918 157.369154 l
99.040108 157.369154 l
100.577299 157.369154 l
102.114489 157.369154 l
103.651679 157.369154 l
105.188869 157.369154 l
106.726059 157.369154 l
108.263249 157.369154 l
109.800439 157.369154 l
111.337629 157.369154 l
112.874819 157.369154 l
114.412009 157.369154 l
115.949199 157.369154 l
117.486389 157.369154 l
119.02358 157.369154 l
120.56077 157.369154 l
122.09796 157.369154 l
123.63515 157.369154 l
125.17234 157.369154 l
126.70953 157.369154 l
128.24672 157.369154 l
129.78391 157.369154 l
131.3211 157.369154 l
132.85829 157.369154 l
134.39548 157.369154 l
135.93267 157.369154 l
137.469861 157.369154 l
139.007051 157.369154 l
140.544241 157.369154 l
142.081431 157.369154 l
143.618621 157.369154 l
145.155811 157.369154 l
146.693001 157.369154 l
148.230191 157.369154 l
149.767381 157.369154 l
151.304571 157.369154 l
152.841761 157.369154 l
154.378951 157.369154 l
155.916142 157.369154 l
157.453332 157.369154 l
158.990522 157.369154 l
160.527712 157.369154 l
162.064902 157.369154 l
163.602092 157.369154 l
165.139282 157.369154 l
166.676472 157.369154 l
168.213662 157.369154 l
169.750852 157.369154 l
171.288042 157.369154 l
172.825232 157.369154 l
174.362423 157.369154 l
175.899613 157.369154 l
177.436803 157.369154 l
178.973993 157.369154 l
180.511183 157.369154 l
182.048373 157.369154 l
183.585563 157.369154 l
185.122753 157.369154 l
186.659943 157.369154 l
188.197133 157.369154 l
189.734323 157.369154 l
191.271513 157.369154 l
192.808704 157.369154 l
194.345894 157.369154 l
195.883084 157.369154 l
197.420274 157.369154 l
198.957464 157.369154 l
200.494654 157.369154 l
202.031844 157.369154 l
203.569034 157.369154 l
stroke
grestore
2 setlinecap
[] 0 setdash
gsave
167.4 110.88 43.778 59.92 clipbox
51.387216 118.340645 m
52.924406 118.918712 l
54.461596 119.496293 l
55.998786 120.073372 l
57.535976 120.649934 l
59.073166 121.225964 l
60.610356 121.801443 l
62.147546 122.376356 l
63.684737 122.950682 l
65.221927 123.524404 l
66.759117 124.097501 l
68.296307 124.669953 l
69.833497 125.241738 l
71.370687 125.812832 l
72.907877 126.383213 l
74.445067 126.952855 l
75.982257 127.521732 l
77.519447 128.089818 l
79.056637 128.657083 l
80.593827 129.223497 l
82.131018 129.789028 l
83.668208 130.353645 l
85.205398 130.917312 l
86.742588 131.479992 l
88.279778 132.041647 l
89.816968 132.602237 l
91.354158 133.161719 l
92.891348 133.720048 l
94.428538 134.277177 l
95.965728 134.833055 l
97.502918 135.387631 l
99.040108 135.940847 l
100.577299 136.492646 l
102.114489 137.042964 l
103.651679 137.591735 l
105.188869 138.138889 l
106.726059 138.684352 l
108.263249 139.228044 l
109.800439 139.76988 l
111.337629 140.309772 l
112.874819 140.847623 l
114.412009 141.383331 l
115.949199 141.916788 l
117.486389 142.447876 l
119.02358 142.976473 l
120.56077 143.502443 l
122.09796 144.025644 l
123.63515 144.545923 l
125.17234 145.063113 l
126.70953 145.577036 l
128.24672 146.087501 l
129.78391 146.5943 l
131.3211 147.097209 l
132.85829 147.595984 l
134.39548 148.090363 l
135.93267 148.580058 l
137.469861 149.064757 l
139.007051 149.54412 l
140.544241 150.017774 l
142.081431 150.485313 l
143.618621 150.946288 l
145.155811 151.400208 l
146.693001 151.846531 l
148.230191 152.284656 l
149.767381 152.713921 l
151.304571 153.133586 l
152.841761 153.542829 l
154.378951 153.940731 l
155.916142 154.326263 l
157.453332 154.698264 l
158.990522 155.055427 l
160.527712 155.396269 l
162.064902 155.719102 l
163.602092 156.021998 l
165.139282 156.302744 l
166.676472 156.558786 l
168.213662 156.787161 l
169.750852 156.984416 l
171.288042 157.146493 l
172.825232 157.2686 l
174.362423 157.345034 l
175.899613 157.368949 l
177.436803 157.332063 l
178.973993 157.224254 l
180.511183 157.033019 l
182.048373 156.742738 l
183.585563 156.333628 l
185.122753 155.780262 l
186.659943 155.049403 l
188.197133 154.096753 l
189.734323 152.861935 l
191.271513 151.260473 l
192.808704 149.170426 l
194.345894 146.409042 l
195.883084 142.689442 l
197.420274 137.534143 l
198.957464 130.085224 l
200.494654 118.631206 l
202.031844 99.194048 l
203.569034 59.92 l
stroke
grestore
0.800 setlinewidth
0 setlinejoin
0.000 setgray
gsave
43.778125 59.92 m
43.778125 170.8 l
stroke
grestore
gsave
211.178125 59.92 m
211.178125 170.8 l
stroke
grestore
gsave
43.778125 59.92 m
211.178125 59.92 l
stroke
grestore
gsave
43.778125 170.8 m
211.178125 170.8 l
stroke
grestore
1.000 0.000 0.000 setrgbcolor
/DejaVuSans 10.000 selectfont
gsave

127.478 62.3045 translate
0 rotate
0 0 m /n glyphshow
6.33789 0 m /equal glyphshow
14.7168 0 m /two glyphshow
grestore
0.000 0.502 0.000 setrgbcolor
/DejaVuSans 10.000 selectfont
gsave

127.478 82.7604 translate
0 rotate
0 0 m /n glyphshow
6.33789 0 m /equal glyphshow
14.7168 0 m /three glyphshow
grestore
0.000 0.000 1.000 setrgbcolor
/DejaVuSans 10.000 selectfont
gsave

127.478 102.046 translate
0 rotate
0 0 m /n glyphshow
6.33789 0 m /equal glyphshow
14.7168 0 m /five glyphshow
grestore
0.647 0.165 0.165 setrgbcolor
/DejaVuSans 10.000 selectfont
gsave

127.478 121.917 translate
0 rotate
0 0 m /n glyphshow
6.33789 0 m /equal glyphshow
14.7168 0 m /one glyphshow
21.0791 0 m /zero glyphshow
grestore
1.000 0.000 1.000 setrgbcolor
/DejaVuSans 10.000 selectfont
gsave

127.478 159.754 translate
0 rotate
0 0 m /n glyphshow
6.33789 0 m /equal glyphshow
14.7168 0 m /one glyphshow
21.0791 0 m /zero glyphshow
27.4414 0 m /zero glyphshow
grestore
1.000 setlinewidth
0 setlinecap
0.800 setgray
gsave
37.478125 7.2 m
217.478125 7.2 l
218.811458 7.2 219.478125 7.866667 219.478125 9.2 c
219.478125 25.2 l
219.478125 26.533333 218.811458 27.2 217.478125 27.2 c
37.478125 27.2 l
36.144792 27.2 35.478125 26.533333 35.478125 25.2 c
35.478125 9.2 l
35.478125 7.866667 36.144792 7.2 37.478125 7.2 c
cl
gsave
1.000 setgray
fill
grestore
stroke
grestore
1.500 setlinewidth
1 setlinejoin
[1.5 2.475] 0 setdash
0.000 setgray
gsave
39.478125 18.7 m
49.478125 18.7 l
59.478125 18.7 l
stroke
grestore
gsave
67.4781 15.2 translate
0 rotate
/DejaVuSans 10.0 selectfont
0 0.40625 moveto
/e glyphshow
6.15234 0.40625 moveto
/r glyphshow
10.2637 0.40625 moveto
/r glyphshow
/DejaVuSans-Oblique 7.0 selectfont
14.4707 -1.23438 moveto
/sigma glyphshow
/DejaVuSans 10.0 selectfont
19.1807 0.40625 moveto
/parenleft glyphshow
/DejaVuSans-Oblique 10.0 selectfont
23.082 0.40625 moveto
/n glyphshow
/DejaVuSans 10.0 selectfont
29.4199 0.40625 moveto
/comma glyphshow
34.5469 0.40625 moveto
/zero glyphshow
40.9092 0.40625 moveto
/parenright glyphshow
grestore
2 setlinecap
[] 0 setdash
gsave
132.478125 18.7 m
142.478125 18.7 l
152.478125 18.7 l
stroke
grestore
gsave
160.478 15.2 translate
0 rotate
/DejaVuSans 10.0 selectfont
0 0.40625 moveto
/e glyphshow
6.15234 0.40625 moveto
/r glyphshow
10.2637 0.40625 moveto
/r glyphshow
/DejaVuSans-Oblique 7.0 selectfont
14.4707 -1.23438 moveto
/p glyphshow
18.9141 -1.23438 moveto
/o glyphshow
23.1968 -1.23438 moveto
/l glyphshow
25.1416 -1.23438 moveto
/y glyphshow
/DejaVuSans 10.0 selectfont
29.5576 0.40625 moveto
/parenleft glyphshow
/DejaVuSans-Oblique 10.0 selectfont
33.459 0.40625 moveto
/n glyphshow
/DejaVuSans 10.0 selectfont
39.7969 0.40625 moveto
/comma glyphshow
/DejaVuSans-Oblique 10.0 selectfont
44.9238 0.40625 moveto
/delta glyphshow
/DejaVuSans 10.0 selectfont
51.042 0.40625 moveto
/parenright glyphshow
grestore

end
showpage
