
[VERYDIFF_EXPERIMENT] Running on /home/i57/steuber/NeuroDiff/repos/VeryDiffExperiments/src/../benchmarks/mnist-prune/specs/mnist_44_local_15.vnnlib /home/i57/steuber/NeuroDiff/repos/VeryDiffExperiments/src/../benchmarks/mnist-prune/nets/mnist_relu_4_1024.onnx
Loading /home/i57/steuber/NeuroDiff/repos/VeryDiffExperiments/src/../benchmarks/mnist-prune/nets/mnist_relu_4_1024.onnx and /home/i57/steuber/NeuroDiff/repos/VeryDiffExperiments/src/../benchmarks/mnist-prune/nets_pruned/mnist_relu_4_1024_0.79-old.onnx
INPUT SHAPE: 784
Skipping 0 row
Skipping 0 row
Refined: 8 | Refine Limit: 7 | Wrong: 0 | Right: 1 | Total: 1 | Total Zonos Considered: 9 | Expected 131072 (0.000762939453125%)UNKNOWN
TIMEOUT
Refined: 8 | Refine Limit: 7 | Wrong: 0 | Right: 1 | Total: 1 | Total Zonos Considered: 9 | Expected 131072 (0.000762939453125%)

time: 123.35604744

[VERYDIFF_TIMER] 123.379815861

[VERYDIFF_EXPERIMENT] NETWORK: /home/i57/steuber/NeuroDiff/repos/VeryDiffExperiments/src/../benchmarks/mnist-prune/specs/mnist_44_local_15.vnnlib
[VERYDIFF_EXPERIMENT] TIME: 123.730510599
