
[VERYDIFF_EXPERIMENT] Running on /home/i57/steuber/NeuroDiff/repos/VeryDiffExperiments/src/../benchmarks/mnist-prune/specs/mnist_78_local_18.vnnlib /home/i57/steuber/NeuroDiff/repos/VeryDiffExperiments/src/../benchmarks/mnist-prune/nets/mnist_relu_2_512.onnx
Loading /home/i57/steuber/NeuroDiff/repos/VeryDiffExperiments/src/../benchmarks/mnist-prune/nets/mnist_relu_2_512.onnx and /home/i57/steuber/NeuroDiff/repos/VeryDiffExperiments/src/../benchmarks/mnist-prune/nets_pruned/mnist_relu_2_512_0.79-old.onnx
INPUT SHAPE: 784
Refined: 10 | Refine Limit: 8 | Wrong: 0 | Right: 2 | Total: 2 | Total Zonos Considered: 12 | Expected 61680 (0.00324254215304799%)Refined: 16 | Refine Limit: 14 | Wrong: 0 | Right: 6 | Total: 6 | Total Zonos Considered: 22 | Expected 184864 (0.003245629219317985%)Refined: 18 | Refine Limit: 8 | Wrong: 0 | Right: 20 | Total: 20 | Total Zonos Considered: 38 | Expected 189502 (0.010553978322128527%)Refined: 22 | Refine Limit: 10 | Wrong: 0 | Right: 27 | Total: 27 | Total Zonos Considered: 49 | Expected 252759 (0.010682112209654255%)Refined: 26 | Refine Limit: 8 | Wrong: 0 | Right: 33 | Total: 33 | Total Zonos Considered: 59 | Expected 131067 (0.02517796241616883%)Refined: 33 | Refine Limit: 11 | Wrong: 0 | Right: 34 | Total: 34 | Total Zonos Considered: 67 | Expected 134974 (0.025190036599641412%)Refined: 40 | Refine Limit: 23 | Wrong: 0 | Right: 37 | Total: 37 | Total Zonos Considered: 77 | Expected 146884 (0.025189945807576046%)Refined: 43 | Refine Limit: 22 | Wrong: 0 | Right: 49 | Total: 49 | Total Zonos Considered: 92 | Expected 194522 (0.025189952807394535%)Refined: 45 | Refine Limit: 16 | Wrong: 0 | Right: 59 | Total: 59 | Total Zonos Considered: 104 | Expected 234220 (0.0251899923149176%)Refined: 51 | Refine Limit: 23 | Wrong: 0 | Right: 62 | Total: 62 | Total Zonos Considered: 113 | Expected 246130 (0.025189940275464184%)Refined: 57 | Refine Limit: 29 | Wrong: 0 | Right: 66 | Total: 66 | Total Zonos Considered: 123 | Expected 262009 (0.0251899743901927%)Refined: 57 | Refine Limit: 21 | Wrong: 0 | Right: 80 | Total: 80 | Total Zonos Considered: 137 | Expected 317587 (0.025189947951270046%)Refined: 58 | Refine Limit: 13 | Wrong: 0 | Right: 95 | Total: 95 | Total Zonos Considered: 153 | Expected 377077 (0.025193793310119682%)Refined: 63 | Refine Limit: 11 | Wrong: 0 | Right: 103 | Total: 103 | Total Zonos Considered: 166 | Expected 381737 (0.02698192734788611%)Refined: 66 | Refine Limit: 8 | Wrong: 0 | Right: 116 | Total: 116 | Total Zonos Considered: 182 | Expected 286866 (0.04043699845921092%)Refined: 72 | Refine Limit: 11 | Wrong: 0 | Right: 117 | Total: 117 | Total Zonos Considered: 189 | Expected 289254 (0.04044887884005061%)Refined: 80 | Refine Limit: 18 | Wrong: 0 | Right: 118 | Total: 118 | Total Zonos Considered: 198 | Expected 291726 (0.0404489143922722%)Refined: 82 | Refine Limit: 16 | Wrong: 0 | Right: 129 | Total: 129 | Total Zonos Considered: 211 | Expected 318920 (0.040449015427066345%)Refined: 89 | Refine Limit: 24 | Wrong: 0 | Right: 132 | Total: 132 | Total Zonos Considered: 221 | Expected 326337 (0.04044898371928405%)Refined: 89 | Refine Limit: 17 | Wrong: 0 | Right: 145 | Total: 145 | Total Zonos Considered: 234 | Expected 358476 (0.04044901192827414%)Refined: 91 | Refine Limit: 9 | Wrong: 0 | Right: 159 | Total: 159 | Total Zonos Considered: 250 | Expected 376625 (0.04221705940922668%)Refined: 95 | Refine Limit: 12 | Wrong: 0 | Right: 163 | Total: 163 | Total Zonos Considered: 258 | Expected 380724 (0.042813166493312745%)Refined: 101 | Refine Limit: 16 | Wrong: 0 | Right: 165 | Total: 165 | Total Zonos Considered: 266 | Expected 385392 (0.04281355087806701%)Refined: 108 | Refine Limit: 25 | Wrong: 0 | Right: 168 | Total: 168 | Total Zonos Considered: 276 | Expected 392399 (0.0428135647644362%)Refined: 114 | Refine Limit: 31 | Wrong: 0 | Right: 170 | Total: 170 | Total Zonos Considered: 284 | Expected 397070 (0.04281360969098648%)Refined: 121 | Refine Limit: 38 | Wrong: 0 | Right: 173 | Total: 173 | Total Zonos Considered: 294 | Expected 404077 (0.0428136221561732%)Refined: 123 | Refine Limit: 30 | Wrong: 0 | Right: 188 | Total: 188 | Total Zonos Considered: 311 | Expected 439113 (0.042813581014454136%)Refined: 127 | Refine Limit: 33 | Wrong: 0 | Right: 194 | Total: 194 | Total Zonos Considered: 321 | Expected 453127 (0.04281360413305762%)Refined: 127 | Refine Limit: 25 | Wrong: 0 | Right: 207 | Total: 207 | Total Zonos Considered: 334 | Expected 483491 (0.04281362010875073%)Refined: 134 | Refine Limit: 31 | Wrong: 0 | Right: 210 | Total: 210 | Total Zonos Considered: 344 | Expected 490498 (0.042813630228869436%)Refined: 136 | Refine Limit: 28 | Wrong: 0 | Right: 219 | Total: 219 | Total Zonos Considered: 355 | Expected 511520 (0.042813575226775105%)Refined: 140 | Refine Limit: 25 | Wrong: 0 | Right: 230 | Total: 230 | Total Zonos Considered: 370 | Expected 537213 (0.04281355812312807%)Refined: 142 | Refine Limit: 21 | Wrong: 0 | Right: 241 | Total: 241 | Total Zonos Considered: 383 | Expected 562905 (0.042813618639024345%)Refined: 147 | Refine Limit: 19 | Wrong: 0 | Right: 245 | Total: 245 | Total Zonos Considered: 392 | Expected 572248 (0.04281360529001412%)Refined: 153 | Refine Limit: 29 | Wrong: 0 | Right: 248 | Total: 248 | Total Zonos Considered: 401 | Expected 579255 (0.04281361403872215%)UNKNOWN
TIMEOUT
Refined: 157 | Refine Limit: 33 | Wrong: 0 | Right: 250 | Total: 250 | Total Zonos Considered: 407 | Expected 583927 (0.042813570874441494%)

time: 120.980168467

[VERYDIFF_TIMER] 121.007567563

[VERYDIFF_EXPERIMENT] NETWORK: /home/i57/steuber/NeuroDiff/repos/VeryDiffExperiments/src/../benchmarks/mnist-prune/specs/mnist_78_local_18.vnnlib
[VERYDIFF_EXPERIMENT] TIME: 121.29662484
