
[VERYDIFF_EXPERIMENT] Running on /home/i57/steuber/NeuroDiff/repos/VeryDiffExperiments/src/../benchmarks/mnist-prune/specs/mnist_73_global_5.vnnlib /home/i57/steuber/NeuroDiff/repos/VeryDiffExperiments/src/../benchmarks/mnist-prune/nets/mnist_relu_4_1024.onnx
Found input X
op: matmul, weight: (1024, 784), bias: nothing
op: bias, weight: nothing, bias: (1024,)
op: relu, weight: nothing, bias: nothing
op: matmul, weight: (1024, 1024), bias: nothing
op: bias, weight: nothing, bias: (1024,)
op: relu, weight: nothing, bias: nothing
op: matmul, weight: (1024, 1024), bias: nothing
op: bias, weight: nothing, bias: (1024,)
op: relu, weight: nothing, bias: nothing
op: matmul, weight: (10, 1024), bias: nothing
op: bias, weight: nothing, bias: (10,)
op: relu, weight: nothing, bias: nothing
op: matmul, weight: (10, 10), bias: nothing
op: bias, weight: nothing, bias: (10,)
Found input X
op: gemm, weight: (1024, 784), bias: (1024,)
op: relu, weight: nothing, bias: nothing
op: gemm, weight: (1024, 1024), bias: (1024,)
op: relu, weight: nothing, bias: nothing
op: gemm, weight: (1024, 1024), bias: (1024,)
op: relu, weight: nothing, bias: nothing
op: gemm, weight: (10, 1024), bias: (10,)
op: relu, weight: nothing, bias: nothing
op: gemm, weight: (10, 10), bias: (10,)
Distance: 915.6394868631054
Distance: 1298.7052820973968
Distance: 1296.587532894263
Distance: 6.054483317080667
Distance: 0.04942679278974538
Running with 1 threads
[Thread 1] Time to first task: 0.01s
Instable Generators: 330
Instable Generators: 583
Instable Generators: 1015
Instable Generators: 10
Zono Bounds:
[-77.24881103211573, -78.00233898124249, -86.46681210122422, -86.01927872113963, -83.00490141014772, -87.78465408901167, -77.09174784518576, -82.2131250142902, -83.73452584290996, -86.69285795163954]
[77.24648136980647, 77.89257796344178, 86.41725320928298, 85.15614691964414, 82.95945896169168, 86.95167600386267, 77.09999924065023, 81.95295465944821, 83.33844748374003, 86.59875835615874]


TIMEOUT REACHED
UNKNOWN
[Thread 1] Total splits: 51
Processed 51 zonotopes (Work Done: 0.0%); Generated 102 (2.3798384097254903s/loop)
[Thread 1] Finished in 121.37s
 ────────────────────────────────────────────────────────────────────────────────
                                        Time                    Allocations      
                               ───────────────────────   ────────────────────────
       Tot / % measured:             121s / 100.0%           33.3GiB / 100.0%    

 Section               ncalls     time    %tot     avg     alloc    %tot      avg
 ────────────────────────────────────────────────────────────────────────────────
 Verify                     1     121s  100.0%    121s   33.3GiB   99.9%  33.3GiB
   Zonotope Loop            1     121s  100.0%    121s   33.3GiB   99.9%  33.3GiB
     Zonotope Propa...     51     115s   94.9%   2.26s   30.4GiB   91.2%   610MiB
       DiffZonotope...    204    70.6s   58.1%   346ms   25.1GiB   75.4%   126MiB
         Zonotope_R...    408    67.2s   55.3%   165ms   20.4GiB   61.3%  51.3MiB
           Influenc...    408    49.1s   40.5%   120ms   11.8GiB   35.4%  29.6MiB
             Multiply     408    35.7s   29.4%  87.4ms   6.90GiB   20.7%  17.3MiB
             Alloca...    408    12.7s   10.5%  31.1ms   4.90GiB   14.7%  12.3MiB
             Set Ma...    408    767ms    0.6%  1.88ms     0.00B    0.0%    0.00B
           Allocation     408    12.2s   10.1%  30.0ms   4.31GiB   12.9%  10.8MiB
           Column M...    408    4.99s    4.1%  12.2ms   4.31GiB   12.9%  10.8MiB
           Set Matrix     408    779ms    0.6%  1.91ms   4.98MiB    0.0%  12.5KiB
           Vectors        408   12.2ms    0.0%  29.9μs   13.5MiB    0.0%  34.0KiB
           Bounds         408    297μs    0.0%   728ns     0.00B    0.0%    0.00B
       DiffZonotope...    255    44.6s   36.8%   175ms   5.25GiB   15.8%  21.1MiB
         Zonotope_D...    510    19.3s   15.9%  37.7ms   2.84GiB    8.5%  5.70MiB
     Compute Split         51    5.42s    4.5%   106ms   1.88GiB    5.6%  37.8MiB
     Property Check        51    578ms    0.5%  11.3ms   29.1MiB    0.1%   584KiB
 Initialize                 1   18.2ms    0.0%  18.2ms   27.0MiB    0.1%  27.0MiB
 ────────────────────────────────────────────────────────────────────────────────
[VERYDIFF_TIMER] 121.467072187

[VERYDIFF_EXPERIMENT] NETWORK: /home/i57/steuber/NeuroDiff/repos/VeryDiffExperiments/src/../benchmarks/mnist-prune/specs/mnist_73_global_5.vnnlib
[VERYDIFF_EXPERIMENT] TIME: 121.753837099
