
[VERYDIFF_EXPERIMENT] Running on /home/i57/steuber/NeuroDiff/repos/VeryDiffExperiments/src/../benchmarks/mnist-prune/specs/mnist_40_global_3.vnnlib /home/i57/steuber/NeuroDiff/repos/VeryDiffExperiments/src/../benchmarks/mnist-prune/nets/mnist_relu_4_1024.onnx
Found input X
op: matmul, weight: (1024, 784), bias: nothing
op: bias, weight: nothing, bias: (1024,)
op: relu, weight: nothing, bias: nothing
op: matmul, weight: (1024, 1024), bias: nothing
op: bias, weight: nothing, bias: (1024,)
op: relu, weight: nothing, bias: nothing
op: matmul, weight: (1024, 1024), bias: nothing
op: bias, weight: nothing, bias: (1024,)
op: relu, weight: nothing, bias: nothing
op: matmul, weight: (10, 1024), bias: nothing
op: bias, weight: nothing, bias: (10,)
op: relu, weight: nothing, bias: nothing
op: matmul, weight: (10, 10), bias: nothing
op: bias, weight: nothing, bias: (10,)
Found input X
op: gemm, weight: (1024, 784), bias: (1024,)
op: relu, weight: nothing, bias: nothing
op: gemm, weight: (1024, 1024), bias: (1024,)
op: relu, weight: nothing, bias: nothing
op: gemm, weight: (1024, 1024), bias: (1024,)
op: relu, weight: nothing, bias: nothing
op: gemm, weight: (10, 1024), bias: (10,)
op: relu, weight: nothing, bias: nothing
op: gemm, weight: (10, 10), bias: (10,)
Distance: 915.6394868631054
Distance: 1298.7052820973968
Distance: 1296.587532894263
Distance: 6.054483317080667
Distance: 0.04942679278974538
Running with 1 threads
[Thread 1] Time to first task: 0.01s
Instable Generators: 422
Instable Generators: 746
Instable Generators: 1024
Instable Generators: 10
Zono Bounds:
[-59.86888122727688, -61.05112326274178, -67.53291225519874, -66.8538824612163, -64.33682656554724, -67.90613287100132, -60.8728981670583, -63.47866315922209, -65.05967273567425, -67.73970172776222]
[59.737976083483495, 60.934286118550006, 67.30724580122379, 66.65521028272616, 64.3059398808543, 67.71992598428136, 60.86520855650526, 63.35888866565342, 64.90505790437307, 67.5484448197002]


TIMEOUT REACHED
UNKNOWN
[Thread 1] Total splits: 48
Processed 48 zonotopes (Work Done: 0.0%); Generated 96 (2.5493400957916665s/loop)
[Thread 1] Finished in 122.37s
 ────────────────────────────────────────────────────────────────────────────────
                                        Time                    Allocations      
                               ───────────────────────   ────────────────────────
       Tot / % measured:             122s / 100.0%           35.2GiB / 100.0%    

 Section               ncalls     time    %tot     avg     alloc    %tot      avg
 ────────────────────────────────────────────────────────────────────────────────
 Verify                     1     122s  100.0%    122s   35.2GiB   99.9%  35.2GiB
   Zonotope Loop            1     122s  100.0%    122s   35.2GiB   99.9%  35.2GiB
     Zonotope Propa...     48     117s   95.3%   2.43s   32.3GiB   91.7%   689MiB
       DiffZonotope...    192    73.4s   60.0%   382ms   26.7GiB   75.8%   142MiB
         Zonotope_R...    384    70.0s   57.2%   182ms   21.6GiB   61.4%  57.6MiB
           Influenc...    384    52.0s   42.5%   135ms   12.6GiB   35.7%  33.5MiB
             Multiply     384    35.9s   29.3%  93.5ms   7.44GiB   21.1%  19.8MiB
             Alloca...    384    15.2s   12.4%  39.7ms   5.11GiB   14.5%  13.6MiB
             Set Ma...    384    808ms    0.7%  2.10ms     0.00B    0.0%    0.00B
           Column M...    384    13.3s   10.9%  34.7ms   4.51GiB   12.8%  12.0MiB
           Allocation     384    3.88s    3.2%  10.1ms   4.51GiB   12.8%  12.0MiB
           Set Matrix     384    840ms    0.7%  2.19ms   5.28MiB    0.0%  14.1KiB
           Vectors        384   11.3ms    0.0%  29.4μs   12.7MiB    0.0%  34.0KiB
           Bounds         384    285μs    0.0%   741ns     0.00B    0.0%    0.00B
       DiffZonotope...    240    43.3s   35.4%   180ms   5.59GiB   15.9%  23.8MiB
         Zonotope_D...    480    16.4s   13.4%  34.3ms   2.93GiB    8.3%  6.26MiB
     Compute Split         48    4.99s    4.1%   104ms   1.93GiB    5.5%  41.1MiB
     Property Check        48    544ms    0.4%  11.3ms   27.7MiB    0.1%   591KiB
 Initialize                 1   15.1ms    0.0%  15.1ms   27.0MiB    0.1%  27.0MiB
 ────────────────────────────────────────────────────────────────────────────────
[VERYDIFF_TIMER] 122.463343481

[VERYDIFF_EXPERIMENT] NETWORK: /home/i57/steuber/NeuroDiff/repos/VeryDiffExperiments/src/../benchmarks/mnist-prune/specs/mnist_40_global_3.vnnlib
[VERYDIFF_EXPERIMENT] TIME: 122.750975462
