
[VERYDIFF_EXPERIMENT] Running on /home/i57/steuber/NeuroDiff/repos/VeryDiffExperiments/src/../benchmarks/mnist-retrained-new-label/specs/mnist_1_global_3.vnnlib /home/i57/steuber/NeuroDiff/repos/VeryDiffExperiments/src/../benchmarks/mnist-retrained-new-label/nets/2x512_5_label-old.onnx
Loading /home/i57/steuber/NeuroDiff/repos/VeryDiffExperiments/src/../benchmarks/mnist-retrained-new-label/nets/2x512_5_label-old.onnx and /home/i57/steuber/NeuroDiff/repos/VeryDiffExperiments/src/../benchmarks/mnist-retrained-new-label/nets_pruned/2x512_5_label-old_retrained.onnx
2024-04-17 23:42:23.012239498 [W:onnxruntime:, graph.cc:814 Graph] Initializer sequential_1_1/dense_2_1_1/Cast/ReadVariableOp:0 appears in graph inputs and will not be treated as constant value/weight. This may fail some of the graph optimizations, like const folding. Move it out of graph inputs if there is no need to override it, by either re-generating the model with latest exporter/converter or with the tool onnxruntime/tools/python/remove_initializer_from_input.py.
2024-04-17 23:42:23.012265290 [W:onnxruntime:, graph.cc:814 Graph] Initializer sequential_1_1/dense_2_1_1/Add/ReadVariableOp:0 appears in graph inputs and will not be treated as constant value/weight. This may fail some of the graph optimizations, like const folding. Move it out of graph inputs if there is no need to override it, by either re-generating the model with latest exporter/converter or with the tool onnxruntime/tools/python/remove_initializer_from_input.py.
2024-04-17 23:42:23.012271497 [W:onnxruntime:, graph.cc:814 Graph] Initializer sequential_1_1/dense_1_2_1/Cast/ReadVariableOp:0 appears in graph inputs and will not be treated as constant value/weight. This may fail some of the graph optimizations, like const folding. Move it out of graph inputs if there is no need to override it, by either re-generating the model with latest exporter/converter or with the tool onnxruntime/tools/python/remove_initializer_from_input.py.
2024-04-17 23:42:23.012277057 [W:onnxruntime:, graph.cc:814 Graph] Initializer sequential_1_1/dense_1_2_1/Add/ReadVariableOp:0 appears in graph inputs and will not be treated as constant value/weight. This may fail some of the graph optimizations, like const folding. Move it out of graph inputs if there is no need to override it, by either re-generating the model with latest exporter/converter or with the tool onnxruntime/tools/python/remove_initializer_from_input.py.
2024-04-17 23:42:23.012282641 [W:onnxruntime:, graph.cc:814 Graph] Initializer sequential_1_1/dense_1_1/Cast/ReadVariableOp:0 appears in graph inputs and will not be treated as constant value/weight. This may fail some of the graph optimizations, like const folding. Move it out of graph inputs if there is no need to override it, by either re-generating the model with latest exporter/converter or with the tool onnxruntime/tools/python/remove_initializer_from_input.py.
2024-04-17 23:42:23.012288042 [W:onnxruntime:, graph.cc:814 Graph] Initializer sequential_1_1/dense_1_1/Add/ReadVariableOp:0 appears in graph inputs and will not be treated as constant value/weight. This may fail some of the graph optimizations, like const folding. Move it out of graph inputs if there is no need to override it, by either re-generating the model with latest exporter/converter or with the tool onnxruntime/tools/python/remove_initializer_from_input.py.
2024-04-17 23:42:23.018513119 [W:onnxruntime:, graph.cc:814 Graph] Initializer sequential_1_1/dense_1_1/Cast/ReadVariableOp:0 appears in graph inputs and will not be treated as constant value/weight. This may fail some of the graph optimizations, like const folding. Move it out of graph inputs if there is no need to override it, by either re-generating the model with latest exporter/converter or with the tool onnxruntime/tools/python/remove_initializer_from_input.py.
2024-04-17 23:42:23.018536986 [W:onnxruntime:, graph.cc:814 Graph] Initializer sequential_1_1/dense_1_1/Add/ReadVariableOp:0 appears in graph inputs and will not be treated as constant value/weight. This may fail some of the graph optimizations, like const folding. Move it out of graph inputs if there is no need to override it, by either re-generating the model with latest exporter/converter or with the tool onnxruntime/tools/python/remove_initializer_from_input.py.
2024-04-17 23:42:23.068238298 [W:onnxruntime:, graph.cc:814 Graph] Initializer sequential_1_1/dense_1_2_1/Cast/ReadVariableOp:0 appears in graph inputs and will not be treated as constant value/weight. This may fail some of the graph optimizations, like const folding. Move it out of graph inputs if there is no need to override it, by either re-generating the model with latest exporter/converter or with the tool onnxruntime/tools/python/remove_initializer_from_input.py.
2024-04-17 23:42:23.068264072 [W:onnxruntime:, graph.cc:814 Graph] Initializer sequential_1_1/dense_1_2_1/Add/ReadVariableOp:0 appears in graph inputs and will not be treated as constant value/weight. This may fail some of the graph optimizations, like const folding. Move it out of graph inputs if there is no need to override it, by either re-generating the model with latest exporter/converter or with the tool onnxruntime/tools/python/remove_initializer_from_input.py.
2024-04-17 23:42:23.093578151 [W:onnxruntime:, graph.cc:814 Graph] Initializer sequential_1_1/dense_2_1_1/Cast/ReadVariableOp:0 appears in graph inputs and will not be treated as constant value/weight. This may fail some of the graph optimizations, like const folding. Move it out of graph inputs if there is no need to override it, by either re-generating the model with latest exporter/converter or with the tool onnxruntime/tools/python/remove_initializer_from_input.py.
2024-04-17 23:42:23.093602446 [W:onnxruntime:, graph.cc:814 Graph] Initializer sequential_1_1/dense_2_1_1/Add/ReadVariableOp:0 appears in graph inputs and will not be treated as constant value/weight. This may fail some of the graph optimizations, like const folding. Move it out of graph inputs if there is no need to override it, by either re-generating the model with latest exporter/converter or with the tool onnxruntime/tools/python/remove_initializer_from_input.py.
2024-04-17 23:42:23.123554699 [W:onnxruntime:, graph.cc:814 Graph] Initializer sequential_1_1/dense_2_1_1/Cast/ReadVariableOp:0 appears in graph inputs and will not be treated as constant value/weight. This may fail some of the graph optimizations, like const folding. Move it out of graph inputs if there is no need to override it, by either re-generating the model with latest exporter/converter or with the tool onnxruntime/tools/python/remove_initializer_from_input.py.
2024-04-17 23:42:23.123579428 [W:onnxruntime:, graph.cc:814 Graph] Initializer sequential_1_1/dense_2_1_1/Add/ReadVariableOp:0 appears in graph inputs and will not be treated as constant value/weight. This may fail some of the graph optimizations, like const folding. Move it out of graph inputs if there is no need to override it, by either re-generating the model with latest exporter/converter or with the tool onnxruntime/tools/python/remove_initializer_from_input.py.
2024-04-17 23:42:23.123585684 [W:onnxruntime:, graph.cc:814 Graph] Initializer sequential_1_1/dense_1_2_1/Cast/ReadVariableOp:0 appears in graph inputs and will not be treated as constant value/weight. This may fail some of the graph optimizations, like const folding. Move it out of graph inputs if there is no need to override it, by either re-generating the model with latest exporter/converter or with the tool onnxruntime/tools/python/remove_initializer_from_input.py.
2024-04-17 23:42:23.123591325 [W:onnxruntime:, graph.cc:814 Graph] Initializer sequential_1_1/dense_1_2_1/Add/ReadVariableOp:0 appears in graph inputs and will not be treated as constant value/weight. This may fail some of the graph optimizations, like const folding. Move it out of graph inputs if there is no need to override it, by either re-generating the model with latest exporter/converter or with the tool onnxruntime/tools/python/remove_initializer_from_input.py.
2024-04-17 23:42:23.123596763 [W:onnxruntime:, graph.cc:814 Graph] Initializer sequential_1_1/dense_1_1/Cast/ReadVariableOp:0 appears in graph inputs and will not be treated as constant value/weight. This may fail some of the graph optimizations, like const folding. Move it out of graph inputs if there is no need to override it, by either re-generating the model with latest exporter/converter or with the tool onnxruntime/tools/python/remove_initializer_from_input.py.
2024-04-17 23:42:23.123610135 [W:onnxruntime:, graph.cc:814 Graph] Initializer sequential_1_1/dense_1_1/Add/ReadVariableOp:0 appears in graph inputs and will not be treated as constant value/weight. This may fail some of the graph optimizations, like const folding. Move it out of graph inputs if there is no need to override it, by either re-generating the model with latest exporter/converter or with the tool onnxruntime/tools/python/remove_initializer_from_input.py.
2024-04-17 23:42:23.129692129 [W:onnxruntime:, graph.cc:814 Graph] Initializer sequential_1_1/dense_1_1/Cast/ReadVariableOp:0 appears in graph inputs and will not be treated as constant value/weight. This may fail some of the graph optimizations, like const folding. Move it out of graph inputs if there is no need to override it, by either re-generating the model with latest exporter/converter or with the tool onnxruntime/tools/python/remove_initializer_from_input.py.
2024-04-17 23:42:23.129716486 [W:onnxruntime:, graph.cc:814 Graph] Initializer sequential_1_1/dense_1_1/Add/ReadVariableOp:0 appears in graph inputs and will not be treated as constant value/weight. This may fail some of the graph optimizations, like const folding. Move it out of graph inputs if there is no need to override it, by either re-generating the model with latest exporter/converter or with the tool onnxruntime/tools/python/remove_initializer_from_input.py.
2024-04-17 23:42:23.178994011 [W:onnxruntime:, graph.cc:814 Graph] Initializer sequential_1_1/dense_1_2_1/Cast/ReadVariableOp:0 appears in graph inputs and will not be treated as constant value/weight. This may fail some of the graph optimizations, like const folding. Move it out of graph inputs if there is no need to override it, by either re-generating the model with latest exporter/converter or with the tool onnxruntime/tools/python/remove_initializer_from_input.py.
2024-04-17 23:42:23.179019544 [W:onnxruntime:, graph.cc:814 Graph] Initializer sequential_1_1/dense_1_2_1/Add/ReadVariableOp:0 appears in graph inputs and will not be treated as constant value/weight. This may fail some of the graph optimizations, like const folding. Move it out of graph inputs if there is no need to override it, by either re-generating the model with latest exporter/converter or with the tool onnxruntime/tools/python/remove_initializer_from_input.py.
2024-04-17 23:42:23.204361874 [W:onnxruntime:, graph.cc:814 Graph] Initializer sequential_1_1/dense_2_1_1/Cast/ReadVariableOp:0 appears in graph inputs and will not be treated as constant value/weight. This may fail some of the graph optimizations, like const folding. Move it out of graph inputs if there is no need to override it, by either re-generating the model with latest exporter/converter or with the tool onnxruntime/tools/python/remove_initializer_from_input.py.
2024-04-17 23:42:23.204386257 [W:onnxruntime:, graph.cc:814 Graph] Initializer sequential_1_1/dense_2_1_1/Add/ReadVariableOp:0 appears in graph inputs and will not be treated as constant value/weight. This may fail some of the graph optimizations, like const folding. Move it out of graph inputs if there is no need to override it, by either re-generating the model with latest exporter/converter or with the tool onnxruntime/tools/python/remove_initializer_from_input.py.
INPUT SHAPE: 784
Skipping 0 row
Skipping 0 row
Skipping 0 row
Skipping 0 row
Skipping 0 row
Skipping 0 row
Skipping 0 row
Skipping 0 row
Skipping 0 row
Skipping 0 row
Skipping 0 row
Skipping 0 row
Skipping 0 row
Skipping 0 row
Skipping 0 row
Skipping 0 row
Skipping 0 row
Skipping 0 row
Skipping 0 row
Skipping 0 row
NETWORKS EQUIVALENT
Refined: 0 | Refine Limit: -1 | Wrong: 0 | Right: 1 | Total: 1 | Total Zonos Considered: 1 | Expected 2 (50.0%)

time: 0.969127967

[VERYDIFF_TIMER] 1.005108263

[VERYDIFF_EXPERIMENT] Running on /home/i57/steuber/NeuroDiff/repos/VeryDiffExperiments/src/../benchmarks/mnist-retrained-new-label/specs/mnist_1_global_3.vnnlib /home/i57/steuber/NeuroDiff/repos/VeryDiffExperiments/src/../benchmarks/mnist-retrained-new-label/nets/3x100_5_label-old.onnx
Loading /home/i57/steuber/NeuroDiff/repos/VeryDiffExperiments/src/../benchmarks/mnist-retrained-new-label/nets/3x100_5_label-old.onnx and /home/i57/steuber/NeuroDiff/repos/VeryDiffExperiments/src/../benchmarks/mnist-retrained-new-label/nets_pruned/3x100_5_label-old_retrained.onnx
2024-04-17 23:42:24.288638671 [W:onnxruntime:, graph.cc:814 Graph] Initializer sequential_2_1_1/dense_9_1_1/Cast/ReadVariableOp:0 appears in graph inputs and will not be treated as constant value/weight. This may fail some of the graph optimizations, like const folding. Move it out of graph inputs if there is no need to override it, by either re-generating the model with latest exporter/converter or with the tool onnxruntime/tools/python/remove_initializer_from_input.py.
2024-04-17 23:42:24.288663673 [W:onnxruntime:, graph.cc:814 Graph] Initializer sequential_2_1_1/dense_8_1_1/Cast/ReadVariableOp:0 appears in graph inputs and will not be treated as constant value/weight. This may fail some of the graph optimizations, like const folding. Move it out of graph inputs if there is no need to override it, by either re-generating the model with latest exporter/converter or with the tool onnxruntime/tools/python/remove_initializer_from_input.py.
2024-04-17 23:42:24.288670572 [W:onnxruntime:, graph.cc:814 Graph] Initializer sequential_2_1_1/dense_8_1_1/Add/ReadVariableOp:0 appears in graph inputs and will not be treated as constant value/weight. This may fail some of the graph optimizations, like const folding. Move it out of graph inputs if there is no need to override it, by either re-generating the model with latest exporter/converter or with the tool onnxruntime/tools/python/remove_initializer_from_input.py.
2024-04-17 23:42:24.288676880 [W:onnxruntime:, graph.cc:814 Graph] Initializer sequential_2_1_1/dense_7_1_1/Cast/ReadVariableOp:0 appears in graph inputs and will not be treated as constant value/weight. This may fail some of the graph optimizations, like const folding. Move it out of graph inputs if there is no need to override it, by either re-generating the model with latest exporter/converter or with the tool onnxruntime/tools/python/remove_initializer_from_input.py.
2024-04-17 23:42:24.288683004 [W:onnxruntime:, graph.cc:814 Graph] Initializer sequential_2_1_1/dense_7_1_1/Add/ReadVariableOp:0 appears in graph inputs and will not be treated as constant value/weight. This may fail some of the graph optimizations, like const folding. Move it out of graph inputs if there is no need to override it, by either re-generating the model with latest exporter/converter or with the tool onnxruntime/tools/python/remove_initializer_from_input.py.
2024-04-17 23:42:24.288689620 [W:onnxruntime:, graph.cc:814 Graph] Initializer sequential_2_1_1/dense_6_1_1/Cast/ReadVariableOp:0 appears in graph inputs and will not be treated as constant value/weight. This may fail some of the graph optimizations, like const folding. Move it out of graph inputs if there is no need to override it, by either re-generating the model with latest exporter/converter or with the tool onnxruntime/tools/python/remove_initializer_from_input.py.
2024-04-17 23:42:24.288695645 [W:onnxruntime:, graph.cc:814 Graph] Initializer sequential_2_1_1/dense_6_1_1/Add/ReadVariableOp:0 appears in graph inputs and will not be treated as constant value/weight. This may fail some of the graph optimizations, like const folding. Move it out of graph inputs if there is no need to override it, by either re-generating the model with latest exporter/converter or with the tool onnxruntime/tools/python/remove_initializer_from_input.py.
2024-04-17 23:42:24.292028297 [W:onnxruntime:, graph.cc:814 Graph] Initializer sequential_2_1_1/dense_6_1_1/Cast/ReadVariableOp:0 appears in graph inputs and will not be treated as constant value/weight. This may fail some of the graph optimizations, like const folding. Move it out of graph inputs if there is no need to override it, by either re-generating the model with latest exporter/converter or with the tool onnxruntime/tools/python/remove_initializer_from_input.py.
2024-04-17 23:42:24.292054586 [W:onnxruntime:, graph.cc:814 Graph] Initializer sequential_2_1_1/dense_6_1_1/Add/ReadVariableOp:0 appears in graph inputs and will not be treated as constant value/weight. This may fail some of the graph optimizations, like const folding. Move it out of graph inputs if there is no need to override it, by either re-generating the model with latest exporter/converter or with the tool onnxruntime/tools/python/remove_initializer_from_input.py.
2024-04-17 23:42:24.325336559 [W:onnxruntime:, graph.cc:814 Graph] Initializer sequential_2_1_1/dense_7_1_1/Cast/ReadVariableOp:0 appears in graph inputs and will not be treated as constant value/weight. This may fail some of the graph optimizations, like const folding. Move it out of graph inputs if there is no need to override it, by either re-generating the model with latest exporter/converter or with the tool onnxruntime/tools/python/remove_initializer_from_input.py.
2024-04-17 23:42:24.325359752 [W:onnxruntime:, graph.cc:814 Graph] Initializer sequential_2_1_1/dense_7_1_1/Add/ReadVariableOp:0 appears in graph inputs and will not be treated as constant value/weight. This may fail some of the graph optimizations, like const folding. Move it out of graph inputs if there is no need to override it, by either re-generating the model with latest exporter/converter or with the tool onnxruntime/tools/python/remove_initializer_from_input.py.
2024-04-17 23:42:24.329702237 [W:onnxruntime:, graph.cc:814 Graph] Initializer sequential_2_1_1/dense_8_1_1/Cast/ReadVariableOp:0 appears in graph inputs and will not be treated as constant value/weight. This may fail some of the graph optimizations, like const folding. Move it out of graph inputs if there is no need to override it, by either re-generating the model with latest exporter/converter or with the tool onnxruntime/tools/python/remove_initializer_from_input.py.
2024-04-17 23:42:24.329715855 [W:onnxruntime:, graph.cc:814 Graph] Initializer sequential_2_1_1/dense_8_1_1/Add/ReadVariableOp:0 appears in graph inputs and will not be treated as constant value/weight. This may fail some of the graph optimizations, like const folding. Move it out of graph inputs if there is no need to override it, by either re-generating the model with latest exporter/converter or with the tool onnxruntime/tools/python/remove_initializer_from_input.py.
2024-04-17 23:42:24.333370955 [W:onnxruntime:, graph.cc:814 Graph] Initializer sequential_2_1_1/dense_9_1_1/Cast/ReadVariableOp:0 appears in graph inputs and will not be treated as constant value/weight. This may fail some of the graph optimizations, like const folding. Move it out of graph inputs if there is no need to override it, by either re-generating the model with latest exporter/converter or with the tool onnxruntime/tools/python/remove_initializer_from_input.py.
2024-04-17 23:42:24.345063432 [W:onnxruntime:, graph.cc:814 Graph] Initializer sequential_2_1_1/dense_9_1_1/Cast/ReadVariableOp:0 appears in graph inputs and will not be treated as constant value/weight. This may fail some of the graph optimizations, like const folding. Move it out of graph inputs if there is no need to override it, by either re-generating the model with latest exporter/converter or with the tool onnxruntime/tools/python/remove_initializer_from_input.py.
2024-04-17 23:42:24.345086787 [W:onnxruntime:, graph.cc:814 Graph] Initializer sequential_2_1_1/dense_8_1_1/Cast/ReadVariableOp:0 appears in graph inputs and will not be treated as constant value/weight. This may fail some of the graph optimizations, like const folding. Move it out of graph inputs if there is no need to override it, by either re-generating the model with latest exporter/converter or with the tool onnxruntime/tools/python/remove_initializer_from_input.py.
2024-04-17 23:42:24.345100308 [W:onnxruntime:, graph.cc:814 Graph] Initializer sequential_2_1_1/dense_8_1_1/Add/ReadVariableOp:0 appears in graph inputs and will not be treated as constant value/weight. This may fail some of the graph optimizations, like const folding. Move it out of graph inputs if there is no need to override it, by either re-generating the model with latest exporter/converter or with the tool onnxruntime/tools/python/remove_initializer_from_input.py.
2024-04-17 23:42:24.345106102 [W:onnxruntime:, graph.cc:814 Graph] Initializer sequential_2_1_1/dense_7_1_1/Cast/ReadVariableOp:0 appears in graph inputs and will not be treated as constant value/weight. This may fail some of the graph optimizations, like const folding. Move it out of graph inputs if there is no need to override it, by either re-generating the model with latest exporter/converter or with the tool onnxruntime/tools/python/remove_initializer_from_input.py.
2024-04-17 23:42:24.345111518 [W:onnxruntime:, graph.cc:814 Graph] Initializer sequential_2_1_1/dense_7_1_1/Add/ReadVariableOp:0 appears in graph inputs and will not be treated as constant value/weight. This may fail some of the graph optimizations, like const folding. Move it out of graph inputs if there is no need to override it, by either re-generating the model with latest exporter/converter or with the tool onnxruntime/tools/python/remove_initializer_from_input.py.
2024-04-17 23:42:24.345116951 [W:onnxruntime:, graph.cc:814 Graph] Initializer sequential_2_1_1/dense_6_1_1/Cast/ReadVariableOp:0 appears in graph inputs and will not be treated as constant value/weight. This may fail some of the graph optimizations, like const folding. Move it out of graph inputs if there is no need to override it, by either re-generating the model with latest exporter/converter or with the tool onnxruntime/tools/python/remove_initializer_from_input.py.
2024-04-17 23:42:24.345122301 [W:onnxruntime:, graph.cc:814 Graph] Initializer sequential_2_1_1/dense_6_1_1/Add/ReadVariableOp:0 appears in graph inputs and will not be treated as constant value/weight. This may fail some of the graph optimizations, like const folding. Move it out of graph inputs if there is no need to override it, by either re-generating the model with latest exporter/converter or with the tool onnxruntime/tools/python/remove_initializer_from_input.py.
2024-04-17 23:42:24.348156020 [W:onnxruntime:, graph.cc:814 Graph] Initializer sequential_2_1_1/dense_6_1_1/Cast/ReadVariableOp:0 appears in graph inputs and will not be treated as constant value/weight. This may fail some of the graph optimizations, like const folding. Move it out of graph inputs if there is no need to override it, by either re-generating the model with latest exporter/converter or with the tool onnxruntime/tools/python/remove_initializer_from_input.py.
2024-04-17 23:42:24.348173883 [W:onnxruntime:, graph.cc:814 Graph] Initializer sequential_2_1_1/dense_6_1_1/Add/ReadVariableOp:0 appears in graph inputs and will not be treated as constant value/weight. This may fail some of the graph optimizations, like const folding. Move it out of graph inputs if there is no need to override it, by either re-generating the model with latest exporter/converter or with the tool onnxruntime/tools/python/remove_initializer_from_input.py.
2024-04-17 23:42:24.378379582 [W:onnxruntime:, graph.cc:814 Graph] Initializer sequential_2_1_1/dense_7_1_1/Cast/ReadVariableOp:0 appears in graph inputs and will not be treated as constant value/weight. This may fail some of the graph optimizations, like const folding. Move it out of graph inputs if there is no need to override it, by either re-generating the model with latest exporter/converter or with the tool onnxruntime/tools/python/remove_initializer_from_input.py.
2024-04-17 23:42:24.378400151 [W:onnxruntime:, graph.cc:814 Graph] Initializer sequential_2_1_1/dense_7_1_1/Add/ReadVariableOp:0 appears in graph inputs and will not be treated as constant value/weight. This may fail some of the graph optimizations, like const folding. Move it out of graph inputs if there is no need to override it, by either re-generating the model with latest exporter/converter or with the tool onnxruntime/tools/python/remove_initializer_from_input.py.
2024-04-17 23:42:24.382765539 [W:onnxruntime:, graph.cc:814 Graph] Initializer sequential_2_1_1/dense_8_1_1/Cast/ReadVariableOp:0 appears in graph inputs and will not be treated as constant value/weight. This may fail some of the graph optimizations, like const folding. Move it out of graph inputs if there is no need to override it, by either re-generating the model with latest exporter/converter or with the tool onnxruntime/tools/python/remove_initializer_from_input.py.
2024-04-17 23:42:24.382779538 [W:onnxruntime:, graph.cc:814 Graph] Initializer sequential_2_1_1/dense_8_1_1/Add/ReadVariableOp:0 appears in graph inputs and will not be treated as constant value/weight. This may fail some of the graph optimizations, like const folding. Move it out of graph inputs if there is no need to override it, by either re-generating the model with latest exporter/converter or with the tool onnxruntime/tools/python/remove_initializer_from_input.py.
2024-04-17 23:42:24.386485639 [W:onnxruntime:, graph.cc:814 Graph] Initializer sequential_2_1_1/dense_9_1_1/Cast/ReadVariableOp:0 appears in graph inputs and will not be treated as constant value/weight. This may fail some of the graph optimizations, like const folding. Move it out of graph inputs if there is no need to override it, by either re-generating the model with latest exporter/converter or with the tool onnxruntime/tools/python/remove_initializer_from_input.py.
INPUT SHAPE: 784
Skipping 0 row
Skipping 0 row
Skipping 0 row
Skipping 0 row
Skipping 0 row
Skipping 0 row
Skipping 0 row
Skipping 0 row
Skipping 0 row
Skipping 0 row
Skipping 0 row
Skipping 0 row
Skipping 0 row
Skipping 0 row
Skipping 0 row
Skipping 0 row
Skipping 0 row
Skipping 0 row
Skipping 0 row
Skipping 0 row
Skipping 0 row
Skipping 0 row
Skipping 0 row
Skipping 0 row
Skipping 0 row
Skipping 0 row
Skipping 0 row
Skipping 0 row
Skipping 0 row
Skipping 0 row
Skipping 0 row
Skipping 0 row
Skipping 0 row
Skipping 0 row
Skipping 0 row
Skipping 0 row
Skipping 0 row
Skipping 0 row
Skipping 0 row
Skipping 0 row
Skipping 0 row
Skipping 0 row
Skipping 0 row
Skipping 0 row
Skipping 0 row
Skipping 0 row
Skipping 0 row
Skipping 0 row
Skipping 0 row
Skipping 0 row
Skipping 0 row
Skipping 0 row
Skipping 0 row
Skipping 0 row
Skipping 0 row
Skipping 0 row
Skipping 0 row
Skipping 0 row
Skipping 0 row
Skipping 0 row
Skipping 0 row
Skipping 0 row
Skipping 0 row
Skipping 0 row
Skipping 0 row
Skipping 0 row
Skipping 0 row
Skipping 0 row
Skipping 0 row
Skipping 0 row
Skipping 0 row
Skipping 0 row
NETWORKS EQUIVALENT
Refined: 0 | Refine Limit: -1 | Wrong: 0 | Right: 1 | Total: 1 | Total Zonos Considered: 1 | Expected 2 (50.0%)

time: 0.289197475

[VERYDIFF_TIMER] 0.312976361

[VERYDIFF_EXPERIMENT] NETWORK: /home/i57/steuber/NeuroDiff/repos/VeryDiffExperiments/src/../benchmarks/mnist-retrained-new-label/specs/mnist_1_global_3.vnnlib
[VERYDIFF_EXPERIMENT] TIME: 1.893677125
