
[VERYDIFF_EXPERIMENT] Running on /home/i57/steuber/NeuroDiff/repos/VeryDiffExperiments/src/../benchmarks/mnist-prune/specs/mnist_40_global_6.vnnlib /home/i57/steuber/NeuroDiff/repos/VeryDiffExperiments/src/../benchmarks/mnist-prune/nets/mnist_relu_2_512.onnx
Found input X
op: matmul, weight: (512, 784), bias: nothing
op: bias, weight: nothing, bias: (512,)
op: relu, weight: nothing, bias: nothing
op: matmul, weight: (512, 512), bias: nothing
op: bias, weight: nothing, bias: (512,)
op: relu, weight: nothing, bias: nothing
op: matmul, weight: (10, 512), bias: nothing
op: bias, weight: nothing, bias: (10,)
Found input X
op: gemm, weight: (512, 784), bias: (512,)
op: relu, weight: nothing, bias: nothing
op: gemm, weight: (512, 512), bias: (512,)
op: relu, weight: nothing, bias: nothing
op: gemm, weight: (10, 512), bias: (10,)
Distance: 973.3044369037136
Distance: 481.63499746812613
Distance: 8.744412635378467
Running with 1 threads
[Thread 1] Time to first task: 0.01s
Instable Generators: 315
Instable Generators: 511
Zono Bounds:
[-31.134782256233812, -30.87796616053579, -27.245752025209622, -28.952849660923885, -30.46874609368836, -27.401009462572354, -28.883199276124245, -29.343434288235475, -25.459603377009316, -24.89957539354846]
[36.58738110866667, 34.703956942612606, 30.36761647735806, 31.960841275426507, 33.632479686909754, 30.469567289640587, 33.859467874683546, 32.307325420972326, 28.865478083835136, 27.59039506702159]
[Thread 1] Processed 100 zonotopes (Work Done: 0.0%; Expected Zonos: Inf)
[Thread 1] Processed 200 zonotopes (Work Done: 0.0%; Expected Zonos: Inf)


TIMEOUT REACHED
UNKNOWN
[Thread 1] Total splits: 222
Processed 222 zonotopes (Work Done: 0.0%); Generated 444 (0.5422645697027028s/loop)
[Thread 1] Finished in 120.38s
 ────────────────────────────────────────────────────────────────────────────────
                                        Time                    Allocations      
                               ───────────────────────   ────────────────────────
       Tot / % measured:             120s / 100.0%           45.4GiB / 100.0%    

 Section               ncalls     time    %tot     avg     alloc    %tot      avg
 ────────────────────────────────────────────────────────────────────────────────
 Verify                     1     120s  100.0%    120s   45.4GiB  100.0%  45.4GiB
   Zonotope Loop            1     120s  100.0%    120s   45.4GiB  100.0%  45.4GiB
     Zonotope Propa...    222     116s   96.2%   522ms   35.7GiB   78.6%   165MiB
       DiffZonotope...    444    81.6s   67.8%   184ms   30.3GiB   66.6%  69.8MiB
         Zonotope_R...    888    79.9s   66.3%  89.9ms   25.9GiB   57.1%  29.9MiB
           Influenc...    888    50.9s   42.3%  57.3ms   16.7GiB   36.9%  19.3MiB
             Alloca...    888    27.0s   22.4%  30.4ms   7.03GiB   15.5%  8.10MiB
             Multiply     888    22.9s   19.0%  25.8ms   9.70GiB   21.4%  11.2MiB
             Set Ma...    888    951ms    0.8%  1.07ms     0.00B    0.0%    0.00B
           Column M...    888    27.9s   23.1%  31.4ms   4.59GiB   10.1%  5.29MiB
           Set Matrix     888    717ms    0.6%   807μs   9.27MiB    0.0%  10.7KiB
           Allocation     888    386ms    0.3%   435μs   4.59GiB   10.1%  5.29MiB
           Vectors        888   19.6ms    0.0%  22.1μs   21.7MiB    0.0%  25.0KiB
           Bounds         888    699μs    0.0%   787ns     0.00B    0.0%    0.00B
       DiffZonotope...    666    34.2s   28.4%  51.4ms   5.43GiB   12.0%  8.36MiB
         Zonotope_D...  1.33k    12.1s   10.1%  9.11ms   3.25GiB    7.2%  2.50MiB
     Compute Split        222    3.51s    2.9%  15.8ms   5.29GiB   11.7%  24.4MiB
     Property Check       222    198ms    0.2%   891μs   79.2MiB    0.2%   365KiB
 Initialize                 1   2.27ms    0.0%  2.27ms   9.84MiB    0.0%  9.84MiB
 ────────────────────────────────────────────────────────────────────────────────
[VERYDIFF_TIMER] 120.417989516

[VERYDIFF_EXPERIMENT] NETWORK: /home/i57/steuber/NeuroDiff/repos/VeryDiffExperiments/src/../benchmarks/mnist-prune/specs/mnist_40_global_6.vnnlib
[VERYDIFF_EXPERIMENT] TIME: 120.800557908
