
[VERYDIFF_EXPERIMENT] Running on /home/i57/steuber/NeuroDiff/repos/VeryDiffExperiments/src/../benchmarks/mnist-prune/specs/mnist_98_global_6.vnnlib /home/i57/steuber/NeuroDiff/repos/VeryDiffExperiments/src/../benchmarks/mnist-prune/nets/mnist_relu_3_100.onnx
Found input X
op: matmul, weight: (100, 784), bias: nothing
op: bias, weight: nothing, bias: (100,)
op: relu, weight: nothing, bias: nothing
op: matmul, weight: (100, 100), bias: nothing
op: bias, weight: nothing, bias: (100,)
op: relu, weight: nothing, bias: nothing
op: matmul, weight: (10, 100), bias: nothing
op: bias, weight: nothing, bias: (10,)
op: relu, weight: nothing, bias: nothing
op: matmul, weight: (10, 10), bias: nothing
op: bias, weight: nothing, bias: (10,)
Found input X
op: gemm, weight: (100, 784), bias: (100,)
op: relu, weight: nothing, bias: nothing
op: gemm, weight: (100, 100), bias: (100,)
op: relu, weight: nothing, bias: nothing
op: gemm, weight: (10, 100), bias: (10,)
op: relu, weight: nothing, bias: nothing
op: gemm, weight: (10, 10), bias: (10,)
Distance: 1623.4465197373434
Distance: 201.62056963066925
Distance: 13.962962507051998
Distance: 0.183768135302671
Running with 1 threads
[Thread 1] Time to first task: 0.0s
Instable Generators: 46
Instable Generators: 64
Instable Generators: 8
Zono Bounds:
[-7.400187662228013, -7.2254633700248485, -7.53107845497088, -7.202446918847357, -8.51986929623482, -8.299049975239638, -7.444479047713971, -0.9693503159444424, -7.332843087999776, -7.590205512399961]
[7.330348245989662, 7.005648355987225, 6.965652029138461, 7.222582957626848, 8.486192074282958, 8.165794808906371, 7.405802447011787, 1.0764544281823956, 7.202902087140246, 7.576433584285014]
[Thread 1] Processed 100 zonotopes (Work Done: 0.0%; Expected Zonos: Inf)
[Thread 1] Processed 200 zonotopes (Work Done: 0.0%; Expected Zonos: Inf)
[Thread 1] Processed 300 zonotopes (Work Done: 0.0%; Expected Zonos: Inf)
[Thread 1] Processed 400 zonotopes (Work Done: 0.0%; Expected Zonos: Inf)
[Thread 1] Processed 500 zonotopes (Work Done: 0.0%; Expected Zonos: Inf)


TIMEOUT REACHED
UNKNOWN
[Thread 1] Total splits: 564
Processed 564 zonotopes (Work Done: 0.0%); Generated 1128 (0.21328897844680852s/loop)
[Thread 1] Finished in 120.3s
 ────────────────────────────────────────────────────────────────────────────────
                                        Time                    Allocations      
                               ───────────────────────   ────────────────────────
       Tot / % measured:             120s / 100.0%           61.5GiB / 100.0%    

 Section               ncalls     time    %tot     avg     alloc    %tot      avg
 ────────────────────────────────────────────────────────────────────────────────
 Verify                     1     120s  100.0%    120s   61.5GiB  100.0%  61.5GiB
   Zonotope Loop            1     120s  100.0%    120s   61.5GiB  100.0%  61.5GiB
     Zonotope Propa...    564    72.7s   60.4%   129ms   41.7GiB   67.9%  75.8MiB
       DiffZonotope...  1.69k    62.8s   52.2%  37.1ms   39.4GiB   64.1%  23.8MiB
         Zonotope_R...  3.38k    62.1s   51.6%  18.3ms   38.4GiB   62.5%  11.6MiB
           Influenc...  3.38k    57.8s   48.1%  17.1ms   35.4GiB   57.5%  10.7MiB
             Multiply   3.38k    29.3s   24.4%  8.67ms   18.1GiB   29.4%  5.47MiB
             Alloca...  3.38k    26.0s   21.6%  7.68ms   17.3GiB   28.1%  5.23MiB
             Set Ma...  3.38k    2.50s    2.1%   740μs     0.00B    0.0%    0.00B
           Allocation   3.38k    3.56s    3.0%  1.05ms   1.52GiB    2.5%   472KiB
           Column M...  3.38k    474ms    0.4%   140μs   1.52GiB    2.5%   472KiB
           Set Matrix   3.38k    193ms    0.2%  57.1μs   4.02MiB    0.0%  1.22KiB
           Vectors      3.38k   17.7ms    0.0%  5.23μs   10.8MiB    0.0%  3.26KiB
           Bounds       3.38k   2.48ms    0.0%   734ns     0.00B    0.0%    0.00B
       DiffZonotope...  2.26k    9.92s    8.2%  4.40ms   2.32GiB    3.8%  1.05MiB
         Zonotope_D...  4.51k    4.78s    4.0%  1.06ms   1.51GiB    2.5%   351KiB
     Compute Split        564    31.4s   26.1%  55.7ms   8.72GiB   14.2%  15.8MiB
     Property Check       564    622ms    0.5%  1.10ms   65.3MiB    0.1%   119KiB
 Initialize                 1    538μs    0.0%   538μs   5.41MiB    0.0%  5.41MiB
 ────────────────────────────────────────────────────────────────────────────────
[VERYDIFF_TIMER] 120.326094157

[VERYDIFF_EXPERIMENT] NETWORK: /home/i57/steuber/NeuroDiff/repos/VeryDiffExperiments/src/../benchmarks/mnist-prune/specs/mnist_98_global_6.vnnlib
[VERYDIFF_EXPERIMENT] TIME: 120.795282324
