
[VERYDIFF_EXPERIMENT] Running on /home/i57/steuber/NeuroDiff/repos/VeryDiffExperiments/src/../benchmarks/mnist-prune/specs/mnist_26_local_24.vnnlib /home/i57/steuber/NeuroDiff/repos/VeryDiffExperiments/src/../benchmarks/mnist-prune/nets/mnist_relu_2_512.onnx
Found input X
op: matmul, weight: (512, 784), bias: nothing
op: bias, weight: nothing, bias: (512,)
op: relu, weight: nothing, bias: nothing
op: matmul, weight: (512, 512), bias: nothing
op: bias, weight: nothing, bias: (512,)
op: relu, weight: nothing, bias: nothing
op: matmul, weight: (10, 512), bias: nothing
op: bias, weight: nothing, bias: (10,)
Found input X
op: gemm, weight: (512, 784), bias: (512,)
op: relu, weight: nothing, bias: nothing
op: gemm, weight: (512, 512), bias: (512,)
op: relu, weight: nothing, bias: nothing
op: gemm, weight: (10, 512), bias: (10,)
Distance: 973.3044369037136
Distance: 481.63499746812613
Distance: 8.744412635378467
Running with 1 threads
[Thread 1] Time to first task: 0.0s
Instable Generators: 232
Instable Generators: 423
Zono Bounds:
[-26.313234844861615, -26.266244798202138, -22.90079505614438, -24.941225956531916, -25.591623311612448, -23.482374375577944, -24.03488781932158, -24.493482292673885, -21.64049681753583, -21.588063148337504]
[33.283149194531475, 31.217998408355577, 26.88265944755231, 27.744273845804912, 29.273819619713397, 26.774680925211374, 29.89189962172095, 29.60521306096548, 24.42404674849998, 24.36217502799729]

Found counterexample: ([0.0, 0.0, 0.0, 0.0, 0.0, 0.0, 0.0, 0.0, 0.0, 0.0, 0.0, 0.0, 0.0, 0.0, 1.0, 0.0, 0.0, 0.0, 1.0, 0.0, 0.0, 0.0, 0.0, 0.0, 0.0, 0.0, 0.0, 0.0, 0.0, 0.0, 0.0, 0.0, 0.0, 0.0, 0.0, 0.0, 0.0, 0.0, 0.0, 0.0, 0.0, 0.0, 0.0, 0.0, 0.0, 0.0, 0.0, 0.0, 0.0, 0.0, 0.0, 0.0, 0.0, 0.0, 0.0, 0.0, 0.0, 0.0, 0.0, 0.0, 0.0, 0.0, 0.0, 0.0, 0.0, 0.0, 0.0, 0.0, 0.0, 0.0, 0.0, 0.0, 0.0, 0.0, 0.0, 0.0, 0.0, 0.0, 0.0, 0.0, 0.0, 0.0, 0.0, 0.0, 0.0, 0.0, 0.0, 0.0, 0.0, 0.0, 0.0, 1.0, 0.0, 0.0, 0.0, 0.0, 0.0, 0.0, 0.0, 0.0, 0.0, 0.0, 0.0, 0.0, 0.0, 0.0, 0.0, 0.0, 0.0, 0.0, 0.0, 0.0, 0.0, 0.0, 0.0, 0.0, 0.0, 0.0, 0.0, 0.0, 0.0, 0.0, 0.0, 0.0, 0.0, 0.0, 0.0, 0.0, 0.0, 0.0, 0.0, 0.0, 0.0, 0.0, 0.0, 0.0, 0.0, 0.0, 0.0, 0.0, 0.0, 0.0, 0.0, 0.0, 0.0, 0.0, 0.0, 0.0, 0.0, 0.0, 0.0, 0.0, 0.0, 0.0, 0.0, 0.0, 0.0, 0.0, 0.0, 0.0, 0.0, 0.0, 0.0, 0.0, 0.0, 0.0, 0.0, 0.0, 0.0, 0.0, 0.0, 0.0, 0.0, 1.0, 0.0, 0.0, 0.0, 0.0, 0.0, 0.0, 1.0, 0.0, 0.0, 0.0, 0.0, 0.0, 0.0, 0.0, 0.0, 0.0, 0.0, 0.0, 0.0, 0.0, 0.0, 0.0, 0.0, 0.0, 0.0, 0.0, 0.0, 0.0, 0.0, 0.0, 0.0, 0.0, 0.0, 0.0, 0.0, 0.0, 0.0, 0.0, 0.0, 0.0, 0.0, 0.0, 0.0, 0.0, 0.0, 0.0, 0.0, 0.0, 0.0, 0.0, 0.0, 0.0, 0.0, 0.0, 0.0, 0.0, 0.08235294, 0.0, 0.0, 0.0, 0.04313726, 0.36078432, 0.67843139, 0.99215686, 0.99607843, 0.99215686, 0.99607843, 0.99215686, 0.24313726, 0.0, 0.0, 0.0, 0.0, 0.0, 0.0, 0.0, 0.0, 0.0, 0.0, 0.0, 0.0, 0.0, 0.0, 0.0, 0.55686277, 0.0, 0.08235294, 0.40000001, 0.83529413, 1.0, 0.9137255, 0.59215689, 0.51372552, 0.51372552, 0.99215686, 0.98823529, 0.55686277, 0.0, 0.0, 0.0, 0.0, 0.0, 0.0, 0.0, 0.0, 0.0, 0.0, 1.0, 0.0, 0.0, 1.0, 0.63921571, 0.59607846, 0.59607846, 0.8392157, 0.9137255, 0.71764708, 0.40000001, 0.0, 0.0, 0.0, 0.0, 0.51764709, 0.99215686, 1.0, 0.19607843, 0.0, 0.0, 0.0, 0.0, 0.0, 0.0, 0.0, 0.0, 0.0, 0.0, 0.0, 0.0, 0.32156864, 0.95294118, 0.99215686, 0.98823529, 0.51372552, 0.11764706, 0.0, 0.0, 0.0, 0.0, 0.0, 0.0, 0.03921569, 0.83137256, 0.99215686, 0.51372552, 0.0, 0.0, 0.0, 0.0, 0.0, 0.0, 0.0, 0.0, 0.0, 0.0, 0.0, 0.0, 1.0, 0.79607844, 0.40000001, 0.07843138, 0.0, 0.0, 0.0, 0.0, 0.0, 0.0, 0.0, 0.0, 0.0, 0.79607844, 1.0, 0.59215689, 0.0, 0.0, 0.0, 0.0, 0.0, 0.0, 0.0, 0.0, 0.0, 0.0, 0.0, 0.0, 0.0, 0.0, 0.0, 0.0, 0.0, 0.0, 0.0, 0.0, 0.0, 0.0, 0.0, 0.0, 0.0, 0.63529414, 0.99215686, 0.59215689, 0.0, 0.0, 0.0, 0.0, 0.0, 0.0, 0.0, 0.0, 0.0, 0.0, 0.0, 0.0, 0.0, 0.0, 0.0, 0.0, 0.0, 0.0, 0.0, 0.0, 0.0, 0.0, 0.0, 0.0, 0.0, 0.40000001, 0.99607843, 0.59215689, 0.0, 0.0, 0.0, 0.0, 0.0, 0.0, 0.0, 0.0, 0.0, 0.0, 0.0, 0.0, 0.0, 0.0, 0.0, 0.0, 0.0, 0.0, 0.0, 0.0, 0.0, 0.0, 0.0, 1.0, 0.0, 0.40000001, 0.99215686, 0.59215689, 0.0, 0.0, 0.0, 0.0, 0.0, 0.0, 0.0, 0.0, 0.0, 0.0, 0.0, 0.0, 0.0, 0.0, 0.0, 0.0, 0.0, 0.0, 0.0, 0.0, 0.0, 0.0, 0.0, 0.0, 0.0, 0.63921571, 0.99607843, 0.35686275, 0.0, 0.0, 0.0, 0.0, 0.0, 0.0, 0.0, 0.0, 0.0, 0.0, 0.0, 0.0, 0.0, 0.0, 0.0, 0.0, 0.0, 0.0, 0.0, 0.0, 0.0, 0.0, 0.0, 0.0, 0.0, 0.79607844, 0.99215686, 0.19607843, 0.0, 0.0, 0.0, 0.0, 0.0, 0.0, 0.0, 0.0, 0.0, 0.0, 0.0, 0.0, 0.0, 0.0, 0.0, 0.0, 0.0, 0.0, 0.0, 0.0, 0.0, 0.0, 0.0, 0.0, 0.0, 0.79607844, 0.79607844, 0.0, 0.0, 0.0, 0.0, 0.0, 0.0, 0.0, 0.0, 0.0, 0.0, 0.0, 0.0, 0.0, 0.0, 0.0, 0.0, 0.0, 0.0, 0.0, 0.0, 0.0, 0.0, 0.0, 0.0, 0.0, 0.08235294, 0.87450981, 0.47843137, 0.0, 0.0, 0.0, 0.0, 0.0, 0.0, 0.0, 0.0, 0.0, 0.0, 0.0, 0.0, 0.0, 0.0, 0.0, 0.0, 0.0, 0.0, 0.0, 0.0, 0.0, 0.0, 0.0, 0.0, 0.0, 0.28235295, 0.99215686, 0.40000001, 0.0, 0.0, 0.0, 0.0, 0.0, 0.0, 0.0, 0.0, 0.0, 0.0, 0.0, 0.0, 0.0, 0.0, 0.0, 0.0, 0.0, 0.0, 0.0, 0.0, 0.0, 0.0, 0.0, 0.0, 0.0, 0.0, 0.98823529, 0.40000001, 0.0, 0.0, 0.0, 0.0, 0.0, 0.0, 0.0, 0.0, 0.0, 0.0, 0.0, 0.0, 0.0, 0.0, 0.0, 0.0, 0.0, 0.0, 0.0, 0.0, 0.0, 0.0, 0.0, 0.0, 0.0, 0.99607843, 0.9137255, 0.0, 0.0, 0.0, 0.0, 0.0, 0.0, 0.0, 0.0, 0.0, 0.0, 0.0, 0.0, 0.0, 0.0, 0.0, 0.0, 0.0, 0.0, 0.0, 0.0, 0.0, 0.0, 0.0, 0.0, 0.0, 0.16078432, 0.99215686, 0.59215689, 0.0, 0.0, 0.0, 0.0, 0.0, 0.0, 0.0, 0.0, 0.0, 0.0, 0.0, 0.0, 0.0, 0.0, 0.0, 0.0, 0.0, 0.0, 0.0, 0.0, 0.0, 0.0, 0.0, 0.0, 0.0, 0.48235294, 0.99607843, 0.19607843, 0.0, 0.0, 0.0, 0.0, 0.0, 0.0, 0.0, 0.0, 0.0, 0.0, 0.0, 0.0, 0.0, 0.0, 0.0, 0.0, 0.0, 0.0, 0.0, 0.0, 0.0, 0.0, 0.0, 0.0, 0.08235294, 0.87450981, 0.9137255, 0.11764706, 0.0, 0.0, 0.0, 0.0, 0.0, 0.0, 0.0, 0.0, 0.0, 0.0, 0.0, 0.0, 0.0, 0.0, 0.0, 0.0, 0.0, 0.0, 0.0, 0.0, 0.0, 1.0, 0.0, 0.0, 0.2, 0.99215686, 0.71764708, 0.0, 0.0, 1.0, 0.0, 0.0, 0.0, 0.0, 0.0, 0.0, 0.0, 0.0, 1.0, 0.0, 0.0, 0.0, 0.0, 0.0, 0.0, 0.0, 0.0, 0.0, 0.0, 0.0, 0.0, 0.0, 0.2, 0.98823529, 0.07843138, 0.0, 0.0, 0.0, 0.0, 0.0, 0.0, 0.0, 0.0, 0.0, 0.0, 0.0], ([-112.83720052103705, -100.61721499836797, -70.9157986601817, -68.22244079283377, -136.0216832952405, -94.51225612051037, -143.27518399036157, 37.995921360292456, -146.17046870879258, -67.34998371899668], [-113.03254807705791, -100.29284272589392, -70.7198880419366, -67.557955630683, -135.28288976680088, -94.44422476814901, -143.08240128594437, 37.67519113751157, -145.82925567596027, -66.27651740505961], 1.0734663139370753))
[Thread 1] Total splits: 0
Processed 1 zonotopes (Work Done: 0.0%); Generated 0 (0.044990201s/loop)
[Thread 1] Finished in 0.05s
 ────────────────────────────────────────────────────────────────────────────────
                                        Time                    Allocations      
                               ───────────────────────   ────────────────────────
       Tot / % measured:           46.9ms / 100.0%           40.4MiB / 100.0%    

 Section               ncalls     time    %tot     avg     alloc    %tot      avg
 ────────────────────────────────────────────────────────────────────────────────
 Verify                     1   45.0ms   95.9%  45.0ms   35.1MiB   86.9%  35.1MiB
   Zonotope Loop            1   45.0ms   95.8%  45.0ms   35.1MiB   86.9%  35.1MiB
     Zonotope Propa...      1   42.3ms   90.0%  42.3ms   33.5MiB   83.1%  33.5MiB
       DiffZonotope...      3   28.4ms   60.6%  9.48ms   5.41MiB   13.4%  1.80MiB
         Zonotope_D...      6   10.0ms   21.2%  1.66ms   2.33MiB    5.8%   398KiB
       DiffZonotope...      2   13.8ms   29.3%  6.89ms   28.1MiB   69.7%  14.1MiB
         Zonotope_R...      4   4.19ms    8.9%  1.05ms   17.2MiB   42.5%  4.29MiB
           Column M...      4   1.93ms    4.1%   483μs   7.30MiB   18.1%  1.83MiB
           Influenc...      4   1.11ms    2.4%   278μs   2.43MiB    6.0%   623KiB
             Multiply       4   1.04ms    2.2%   259μs   2.09MiB    5.2%   535KiB
             Alloca...      4   53.5μs    0.1%  13.4μs    351KiB    0.8%  87.7KiB
             Set Ma...      4   13.2μs    0.0%  3.29μs     0.00B    0.0%    0.00B
           Set Matrix       4    744μs    1.6%   186μs   34.8KiB    0.1%  8.70KiB
           Allocation       4    314μs    0.7%  78.5μs   7.30MiB   18.1%  1.83MiB
           Vectors          4   78.5μs    0.2%  19.6μs    100KiB    0.2%  25.0KiB
           Bounds           4   2.27μs    0.0%   568ns     0.00B    0.0%    0.00B
     Property Check         1   2.29ms    4.9%  2.29ms    196KiB    0.5%   196KiB
 Initialize                 1   1.93ms    4.1%  1.93ms   5.28MiB   13.1%  5.28MiB
 ────────────────────────────────────────────────────────────────────────────────
[VERYDIFF_TIMER] 0.077052944

[VERYDIFF_EXPERIMENT] NETWORK: /home/i57/steuber/NeuroDiff/repos/VeryDiffExperiments/src/../benchmarks/mnist-prune/specs/mnist_26_local_24.vnnlib
[VERYDIFF_EXPERIMENT] TIME: 0.378467029
