
[VERYDIFF_EXPERIMENT] Running on /home/i57/steuber/NeuroDiff/repos/VeryDiffExperiments/src/../benchmarks/mnist-prune/specs/mnist_98_global_5.vnnlib /home/i57/steuber/NeuroDiff/repos/VeryDiffExperiments/src/../benchmarks/mnist-prune/nets/mnist_relu_2_512.onnx
Parsing /home/i57/steuber/NeuroDiff/repos/VeryDiffExperiments/src/../benchmarks/mnist-prune/nets/mnist_relu_2_512.onnx...
Found input X
op: matmul, weight: (512, 784), bias: nothing
op: bias, weight: nothing, bias: (512,)
op: relu, weight: nothing, bias: nothing
op: matmul, weight: (512, 512), bias: nothing
op: bias, weight: nothing, bias: (512,)
op: relu, weight: nothing, bias: nothing
op: matmul, weight: (10, 512), bias: nothing
op: bias, weight: nothing, bias: (10,)
Parsing /home/i57/steuber/NeuroDiff/repos/VeryDiffExperiments/src/../benchmarks/mnist-prune/nets_pruned/mnist_relu_2_512_pruned5.onnx...
Found input X
op: matmul, weight: (512, 784), bias: nothing
op: bias, weight: nothing, bias: (512,)
op: relu, weight: nothing, bias: nothing
op: matmul, weight: (512, 512), bias: nothing
op: bias, weight: nothing, bias: (512,)
op: relu, weight: nothing, bias: nothing
op: matmul, weight: (10, 512), bias: nothing
op: bias, weight: nothing, bias: (10,)
Distance: 1085.5985166831802
Distance: 1719.8468985003963
Distance: 31.228482716001736
Running with 1 threads
[Thread 1] Time to first task: 0.01s
Instable Generators: 138
Instable Generators: 231
Zono Bounds:
[-15.932932311795426, -17.246797927638152, -20.302311283018696, -17.288244724794737, -13.616119915401091, -11.247609490783589, -7.981764354786019, -19.858218887495518, -15.284430710625799, -15.788349578526578]
[7.3802335974355335, 6.924366489163323, 0.351455365480998, 3.797678578421764, 9.316327369679348, 7.869760554289744, 12.171804206890087, 2.5974275977629517, 4.2387482509671, 5.285542881656796]
[Thread 1] Processed 100 zonotopes (Work Done: 1.5625%; Expected Zonos: 6400.0)


TIMEOUT REACHED
UNKNOWN
[Thread 1] Total splits: 184
Processed 194 zonotopes (Work Done: 9.4%); Generated 368 (0.6201423140927835s/loop)
[Thread 1] Finished in 120.31s
 ────────────────────────────────────────────────────────────────────────────────
                                        Time                    Allocations      
                               ───────────────────────   ────────────────────────
       Tot / % measured:             120s / 100.0%           49.5GiB / 100.0%    

 Section               ncalls     time    %tot     avg     alloc    %tot      avg
 ────────────────────────────────────────────────────────────────────────────────
 Verify                     1     120s  100.0%    120s   49.5GiB  100.0%  49.5GiB
   Zonotope Loop            1     120s  100.0%    120s   49.5GiB  100.0%  49.5GiB
     Property Check       194    75.2s   62.5%   388ms   19.3GiB   39.1%   102MiB
     Zonotope Propa...    194    34.0s   28.3%   175ms   23.0GiB   46.4%   121MiB
       DiffZonotope...    582    20.7s   17.2%  35.6ms   4.06GiB    8.2%  7.15MiB
         Zonotope_D...  1.16k    9.74s    8.1%  8.36ms   2.57GiB    5.2%  2.26MiB
       DiffZonotope...    388    13.3s   11.0%  34.3ms   18.9GiB   38.2%  49.9MiB
         Zonotope_R...    776    9.02s    7.5%  11.6ms   16.5GiB   33.4%  21.8MiB
           Influenc...    776    7.17s    6.0%  9.24ms   10.3GiB   20.9%  13.6MiB
             Multiply     776    6.09s    5.1%  7.85ms   5.64GiB   11.4%  7.44MiB
             Set Ma...    776    620ms    0.5%   799μs     0.00B    0.0%    0.00B
             Alloca...    776    458ms    0.4%   591μs   4.71GiB    9.5%  6.21MiB
           Column M...    776    1.17s    1.0%  1.50ms   3.07GiB    6.2%  4.06MiB
           Set Matrix     776    377ms    0.3%   486μs   3.91MiB    0.0%  5.16KiB
           Allocation     776    279ms    0.2%   360μs   3.07GiB    6.2%  4.06MiB
           Vectors        776   15.4ms    0.0%  19.8μs   18.9MiB    0.0%  25.0KiB
           Bounds         776    604μs    0.0%   778ns     0.00B    0.0%    0.00B
     Compute Split        184    10.3s    8.6%  56.0ms   3.40GiB    6.9%  18.9MiB
 Initialize                 1   2.21ms    0.0%  2.21ms   9.84MiB    0.0%  9.84MiB
 ────────────────────────────────────────────────────────────────────────────────
[VERYDIFF_TIMER] 120.344005317

[VERYDIFF_EXPERIMENT] Running on /home/i57/steuber/NeuroDiff/repos/VeryDiffExperiments/src/../benchmarks/mnist-prune/specs/mnist_98_global_5.vnnlib /home/i57/steuber/NeuroDiff/repos/VeryDiffExperiments/src/../benchmarks/mnist-prune/nets/mnist_relu_3_100.onnx
Parsing /home/i57/steuber/NeuroDiff/repos/VeryDiffExperiments/src/../benchmarks/mnist-prune/nets/mnist_relu_3_100.onnx...
Found input X
op: matmul, weight: (100, 784), bias: nothing
op: bias, weight: nothing, bias: (100,)
op: relu, weight: nothing, bias: nothing
op: matmul, weight: (100, 100), bias: nothing
op: bias, weight: nothing, bias: (100,)
op: relu, weight: nothing, bias: nothing
op: matmul, weight: (10, 100), bias: nothing
op: bias, weight: nothing, bias: (10,)
op: relu, weight: nothing, bias: nothing
op: matmul, weight: (10, 10), bias: nothing
op: bias, weight: nothing, bias: (10,)
Parsing /home/i57/steuber/NeuroDiff/repos/VeryDiffExperiments/src/../benchmarks/mnist-prune/nets_pruned/mnist_relu_3_100_pruned5.onnx...
Found input X
op: matmul, weight: (100, 784), bias: nothing
op: bias, weight: nothing, bias: (100,)
op: relu, weight: nothing, bias: nothing
op: matmul, weight: (100, 100), bias: nothing
op: bias, weight: nothing, bias: (100,)
op: relu, weight: nothing, bias: nothing
op: matmul, weight: (10, 100), bias: nothing
op: bias, weight: nothing, bias: (10,)
op: relu, weight: nothing, bias: nothing
op: matmul, weight: (10, 10), bias: nothing
op: bias, weight: nothing, bias: (10,)
Distance: 296.6600370998244
Distance: 77.24290861755458
Distance: 5.7170369567975285
Distance: 0.0
Running with 1 threads
[Thread 1] Time to first task: 0.0s
Instable Generators: 41
Instable Generators: 56
Instable Generators: 7
Zono Bounds:
[-1.5027818388186676, -1.817208613921757, -2.2437943592514418, 0.0, -2.0790520466391964, -2.897655922694149, -1.0047739196277334, 0.0, -1.5766183526529454, -1.8789254723609017]
[1.5027818388186676, 1.2774905719339644, 2.2437943592514418, 0.0, 1.3305029491430778, 2.897655922694149, 2.2447853179036557, 0.0, 1.2352007033529606, 1.0005012107309534]
[Thread 1] Processed 100 zonotopes (Work Done: 0.0%; Expected Zonos: Inf)
[Thread 1] Processed 200 zonotopes (Work Done: 0.0%; Expected Zonos: Inf)
[Thread 1] Processed 300 zonotopes (Work Done: 0.0%; Expected Zonos: Inf)


TIMEOUT REACHED
UNKNOWN
[Thread 1] Total splits: 334
Processed 334 zonotopes (Work Done: 0.0%); Generated 668 (0.3600703346257485s/loop)
[Thread 1] Finished in 120.26s
 ────────────────────────────────────────────────────────────────────────────────
                                        Time                    Allocations      
                               ───────────────────────   ────────────────────────
       Tot / % measured:             120s / 100.0%           58.4GiB / 100.0%    

 Section               ncalls     time    %tot     avg     alloc    %tot      avg
 ────────────────────────────────────────────────────────────────────────────────
 Verify                     1     120s  100.0%    120s   58.4GiB  100.0%  58.4GiB
   Zonotope Loop            1     120s  100.0%    120s   58.4GiB  100.0%  58.4GiB
     Property Check       334     100s   83.3%   300ms   22.4GiB   38.3%  68.6MiB
     Zonotope Propa...    334    15.6s   13.0%  46.9ms   24.4GiB   41.8%  74.9MiB
       DiffZonotope...  1.00k    10.3s    8.6%  10.3ms   23.1GiB   39.5%  23.6MiB
         Zonotope_R...  2.00k    9.94s    8.3%  4.96ms   22.5GiB   38.5%  11.5MiB
           Influenc...  2.00k    9.46s    7.9%  4.72ms   20.7GiB   35.4%  10.6MiB
             Multiply   2.00k    7.11s    5.9%  3.55ms   10.6GiB   18.1%  5.40MiB
             Set Ma...  2.00k    1.43s    1.2%   715μs     0.00B    0.0%    0.00B
             Alloca...  2.00k    910ms    0.8%   454μs   10.1GiB   17.3%  5.18MiB
           Column M...  2.00k    310ms    0.3%   154μs    916MiB    1.5%   468KiB
           Set Matrix   2.00k    105ms    0.1%  52.3μs   2.29MiB    0.0%  1.17KiB
           Allocation   2.00k   51.1ms    0.0%  25.5μs    916MiB    1.5%   468KiB
           Vectors      2.00k   9.69ms    0.0%  4.84μs   6.37MiB    0.0%  3.26KiB
           Bounds       2.00k   1.30ms    0.0%   649ns     0.00B    0.0%    0.00B
       DiffZonotope...  1.34k    5.30s    4.4%  3.96ms   1.37GiB    2.3%  1.05MiB
         Zonotope_D...  2.67k    2.55s    2.1%   953μs    914MiB    1.5%   350KiB
     Compute Split        334    2.12s    1.8%  6.34ms   5.12GiB    8.8%  15.7MiB
 Initialize                 1    534μs    0.0%   534μs   5.41MiB    0.0%  5.41MiB
 ────────────────────────────────────────────────────────────────────────────────
[VERYDIFF_TIMER] 120.300146186

[VERYDIFF_EXPERIMENT] NETWORK: /home/i57/steuber/NeuroDiff/repos/VeryDiffExperiments/src/../benchmarks/mnist-prune/specs/mnist_98_global_5.vnnlib
[VERYDIFF_EXPERIMENT] TIME: 241.475244
