
[VERYDIFF_EXPERIMENT] Running on /home/i57/steuber/NeuroDiff/repos/VeryDiffExperiments/src/../benchmarks/mnist-prune/specs/mnist_20_local_21.vnnlib /home/i57/steuber/NeuroDiff/repos/VeryDiffExperiments/src/../benchmarks/mnist-prune/nets/mnist_relu_2_512.onnx
Found input X
op: matmul, weight: (512, 784), bias: nothing
op: bias, weight: nothing, bias: (512,)
op: relu, weight: nothing, bias: nothing
op: matmul, weight: (512, 512), bias: nothing
op: bias, weight: nothing, bias: (512,)
op: relu, weight: nothing, bias: nothing
op: matmul, weight: (10, 512), bias: nothing
op: bias, weight: nothing, bias: (10,)
Found input X
op: matmul, weight: (512, 784), bias: nothing
op: bias, weight: nothing, bias: (512,)
op: relu, weight: nothing, bias: nothing
op: matmul, weight: (512, 512), bias: nothing
op: bias, weight: nothing, bias: (512,)
op: relu, weight: nothing, bias: nothing
op: matmul, weight: (10, 512), bias: nothing
op: bias, weight: nothing, bias: (10,)
Distance: 1085.5985166831802
Distance: 1719.8468985003963
Distance: 31.228482716001736
Running with 1 threads
[Thread 1] Time to first task: 0.0s
Instable Generators: 146
Instable Generators: 437
Zono Bounds:
[-11.783526599804372, -11.431622352229372, -12.090363443830451, -11.478371778123545, -13.122166215721752, -12.531626236962536, -14.253915612223299, -12.204931394581063, -6.866364022044122, -9.292080356670098]
[28.71836352767328, 25.48021297617144, 20.90402363249053, 23.06639807261533, 23.150658869528176, 19.104295200024076, 22.753103706438804, 20.576895681214214, 20.89634084632437, 19.062610835746327]
[Thread 1] Processed 100 zonotopes (Work Done: 0.0%; Expected Zonos: Inf)
[Thread 1] Processed 200 zonotopes (Work Done: 0.0%; Expected Zonos: Inf)
[Thread 1] Processed 300 zonotopes (Work Done: 0.0%; Expected Zonos: Inf)
[Thread 1] Processed 400 zonotopes (Work Done: 0.0%; Expected Zonos: Inf)
[Thread 1] Processed 500 zonotopes (Work Done: 0.0%; Expected Zonos: Inf)
[Thread 1] Processed 600 zonotopes (Work Done: 0.0%; Expected Zonos: Inf)
[Thread 1] Processed 700 zonotopes (Work Done: 0.0%; Expected Zonos: Inf)
[Thread 1] Processed 800 zonotopes (Work Done: 0.0%; Expected Zonos: Inf)
[Thread 1] Processed 900 zonotopes (Work Done: 0.0%; Expected Zonos: Inf)
[Thread 1] Processed 1000 zonotopes (Work Done: 0.0%; Expected Zonos: Inf)
[Thread 1] Processed 1100 zonotopes (Work Done: 0.0%; Expected Zonos: Inf)
[Thread 1] Processed 1200 zonotopes (Work Done: 0.0%; Expected Zonos: Inf)
[Thread 1] Processed 1300 zonotopes (Work Done: 0.0%; Expected Zonos: Inf)
[Thread 1] Processed 1400 zonotopes (Work Done: 0.0%; Expected Zonos: Inf)
[Thread 1] Processed 1500 zonotopes (Work Done: 0.0%; Expected Zonos: Inf)
[Thread 1] Processed 1600 zonotopes (Work Done: 0.0%; Expected Zonos: Inf)
[Thread 1] Processed 1700 zonotopes (Work Done: 0.0%; Expected Zonos: Inf)
[Thread 1] Processed 1800 zonotopes (Work Done: 0.0%; Expected Zonos: Inf)
[Thread 1] Processed 1900 zonotopes (Work Done: 0.0%; Expected Zonos: Inf)
[Thread 1] Processed 2000 zonotopes (Work Done: 0.0%; Expected Zonos: Inf)
[Thread 1] Processed 2100 zonotopes (Work Done: 0.0%; Expected Zonos: Inf)
[Thread 1] Processed 2200 zonotopes (Work Done: 0.0%; Expected Zonos: Inf)
[Thread 1] Processed 2300 zonotopes (Work Done: 0.0%; Expected Zonos: Inf)
[Thread 1] Processed 2400 zonotopes (Work Done: 0.0%; Expected Zonos: Inf)
[Thread 1] Processed 2500 zonotopes (Work Done: 0.0%; Expected Zonos: Inf)
[Thread 1] Processed 2600 zonotopes (Work Done: 0.0%; Expected Zonos: Inf)
[Thread 1] Processed 2700 zonotopes (Work Done: 0.0%; Expected Zonos: Inf)
[Thread 1] Processed 2800 zonotopes (Work Done: 0.0%; Expected Zonos: Inf)
[Thread 1] Processed 2900 zonotopes (Work Done: 0.0%; Expected Zonos: Inf)
[Thread 1] Processed 3000 zonotopes (Work Done: 0.0%; Expected Zonos: Inf)
[Thread 1] Processed 3100 zonotopes (Work Done: 0.0%; Expected Zonos: Inf)
[Thread 1] Processed 3200 zonotopes (Work Done: 0.0%; Expected Zonos: Inf)
[Thread 1] Processed 3300 zonotopes (Work Done: 0.0%; Expected Zonos: Inf)
[Thread 1] Processed 3400 zonotopes (Work Done: 0.0%; Expected Zonos: Inf)
[Thread 1] Processed 3500 zonotopes (Work Done: 0.0%; Expected Zonos: Inf)
[Thread 1] Processed 3600 zonotopes (Work Done: 0.0%; Expected Zonos: Inf)
[Thread 1] Processed 3700 zonotopes (Work Done: 0.0%; Expected Zonos: Inf)
[Thread 1] Processed 3800 zonotopes (Work Done: 0.0%; Expected Zonos: Inf)
[Thread 1] Processed 3900 zonotopes (Work Done: 0.0%; Expected Zonos: Inf)
[Thread 1] Processed 4000 zonotopes (Work Done: 0.0%; Expected Zonos: Inf)
[Thread 1] Processed 4100 zonotopes (Work Done: 0.0%; Expected Zonos: Inf)
[Thread 1] Processed 4200 zonotopes (Work Done: 0.0%; Expected Zonos: Inf)
[Thread 1] Processed 4300 zonotopes (Work Done: 0.0%; Expected Zonos: Inf)
[Thread 1] Processed 4400 zonotopes (Work Done: 0.0%; Expected Zonos: Inf)
[Thread 1] Processed 4500 zonotopes (Work Done: 0.0%; Expected Zonos: Inf)
[Thread 1] Processed 4600 zonotopes (Work Done: 0.0%; Expected Zonos: Inf)


TIMEOUT REACHED
UNKNOWN
[Thread 1] Total splits: 4663
Processed 4663 zonotopes (Work Done: 0.0%); Generated 9326 (0.025740576147544502s/loop)
[Thread 1] Finished in 120.03s
 ────────────────────────────────────────────────────────────────────────────────
                                        Time                    Allocations      
                               ───────────────────────   ────────────────────────
       Tot / % measured:             120s / 100.0%           93.0GiB / 100.0%    

 Section               ncalls     time    %tot     avg     alloc    %tot      avg
 ────────────────────────────────────────────────────────────────────────────────
 Verify                     1     120s  100.0%    120s   93.0GiB  100.0%  93.0GiB
   Zonotope Loop            1     120s  100.0%    120s   93.0GiB  100.0%  93.0GiB
     Zonotope Propa...  4.66k     108s   89.8%  23.1ms   86.6GiB   93.1%  19.0MiB
       DiffZonotope...  14.0k    79.6s   66.4%  5.69ms   12.6GiB   13.6%   945KiB
         Zonotope_D...  28.0k    30.9s   25.8%  1.11ms   5.75GiB    6.2%   216KiB
       DiffZonotope...  9.33k    28.0s   23.4%  3.01ms   74.0GiB   79.5%  8.12MiB
         Zonotope_R...  18.7k    14.7s   12.3%   789μs   44.2GiB   47.6%  2.43MiB
           Column M...  18.7k    8.00s    6.7%   429μs   19.6GiB   21.1%  1.08MiB
           Influenc...  18.7k    2.87s    2.4%   154μs   4.45GiB    4.8%   250KiB
             Multiply   18.7k    2.49s    2.1%   133μs   3.64GiB    3.9%   205KiB
             Alloca...  18.7k    319ms    0.3%  17.1μs    826MiB    0.9%  45.3KiB
             Set Ma...  18.7k   36.6ms    0.0%  1.96μs     0.00B    0.0%    0.00B
           Set Matrix   18.7k    1.73s    1.4%  92.6μs    103MiB    0.1%  5.66KiB
           Allocation   18.7k    1.62s    1.4%  87.0μs   19.6GiB   21.1%  1.08MiB
           Vectors      18.7k    455ms    0.4%  24.4μs    455MiB    0.5%  25.0KiB
           Bounds       18.7k   10.8ms    0.0%   579ns     0.00B    0.0%    0.00B
     Property Check     4.66k    10.8s    9.0%  2.32ms    911MiB    1.0%   200KiB
     Compute Split      4.66k    869ms    0.7%   186μs   1.58GiB    1.7%   354KiB
 Initialize                 1   1.95ms    0.0%  1.95ms   5.26MiB    0.0%  5.26MiB
 ────────────────────────────────────────────────────────────────────────────────
[VERYDIFF_TIMER] 120.063275725

[VERYDIFF_EXPERIMENT] Running on /home/i57/steuber/NeuroDiff/repos/VeryDiffExperiments/src/../benchmarks/mnist-prune/specs/mnist_20_local_21.vnnlib /home/i57/steuber/NeuroDiff/repos/VeryDiffExperiments/src/../benchmarks/mnist-prune/nets/mnist_relu_3_100.onnx
Found input X
op: matmul, weight: (100, 784), bias: nothing
op: bias, weight: nothing, bias: (100,)
op: relu, weight: nothing, bias: nothing
op: matmul, weight: (100, 100), bias: nothing
op: bias, weight: nothing, bias: (100,)
op: relu, weight: nothing, bias: nothing
op: matmul, weight: (10, 100), bias: nothing
op: bias, weight: nothing, bias: (10,)
op: relu, weight: nothing, bias: nothing
op: matmul, weight: (10, 10), bias: nothing
op: bias, weight: nothing, bias: (10,)
Found input X
op: matmul, weight: (100, 784), bias: nothing
op: bias, weight: nothing, bias: (100,)
op: relu, weight: nothing, bias: nothing
op: matmul, weight: (100, 100), bias: nothing
op: bias, weight: nothing, bias: (100,)
op: relu, weight: nothing, bias: nothing
op: matmul, weight: (10, 100), bias: nothing
op: bias, weight: nothing, bias: (10,)
op: relu, weight: nothing, bias: nothing
op: matmul, weight: (10, 10), bias: nothing
op: bias, weight: nothing, bias: (10,)
Distance: 296.6600370998244
Distance: 77.24290861755458
Distance: 5.7170369567975285
Distance: 0.0
Running with 1 threads
[Thread 1] Time to first task: 0.0s
Instable Generators: 32
Instable Generators: 56
Instable Generators: 6
Zono Bounds:
[-0.9955879859956254, -1.029189181554031, 0.0, -1.012276029412182, -1.1740673950743106, -1.9086939034875634, 0.0, -0.650090751318019, -1.1257061722741066, -0.7742966562294162]
[0.66921768186771, 1.029189181554031, 0.0, 1.012276029412182, 1.1218718824351357, 1.2055757692936346, 0.0, 1.529205708060509, 1.1257061722741066, 1.0083426274448717]
[Thread 1] Total splits: 1
Processed 3 zonotopes (Work Done: 100.0%); Generated 2 (0.0016752476666666667s/loop)
[Thread 1] Finished in 0.01s
 ────────────────────────────────────────────────────────────────────────────────
                                        Time                    Allocations      
                               ───────────────────────   ────────────────────────
       Tot / % measured:           5.39ms /  99.9%           8.35MiB / 100.0%    

 Section               ncalls     time    %tot     avg     alloc    %tot      avg
 ────────────────────────────────────────────────────────────────────────────────
 Verify                     1   5.06ms   93.9%  5.06ms   7.51MiB   90.0%  7.51MiB
   Zonotope Loop            1   5.03ms   93.3%  5.03ms   7.50MiB   89.9%  7.50MiB
     Zonotope Propa...      3   4.51ms   83.8%  1.50ms   4.62MiB   55.4%  1.54MiB
       DiffZonotope...     12   2.95ms   54.8%   246μs    956KiB   11.2%  79.7KiB
         Zonotope_D...     24   1.34ms   24.9%  55.8μs    483KiB    5.7%  20.1KiB
       DiffZonotope...      9   1.54ms   28.6%   171μs   3.69MiB   44.2%   419KiB
         Zonotope_R...     18    745μs   13.8%  41.4μs   2.44MiB   29.2%   139KiB
           Influenc...     18    303μs    5.6%  16.9μs    770KiB    9.0%  42.8KiB
             Multiply      18    215μs    4.0%  12.0μs    491KiB    5.7%  27.3KiB
             Alloca...     18   56.8μs    1.1%  3.16μs    277KiB    3.2%  15.4KiB
             Set Ma...     18   20.3μs    0.4%  1.13μs     0.00B    0.0%    0.00B
           Column M...     18    213μs    4.0%  11.8μs    823KiB    9.6%  45.7KiB
           Set Matrix      18   85.3μs    1.6%  4.74μs   19.3KiB    0.2%  1.07KiB
           Allocation      18   75.4μs    1.4%  4.19μs    822KiB    9.6%  45.6KiB
           Vectors         18   46.9μs    0.9%  2.61μs   58.6KiB    0.7%  3.26KiB
           Bounds          18   3.93μs    0.1%   218ns     0.00B    0.0%    0.00B
     Property Check         3    164μs    3.0%  54.6μs   68.6KiB    0.8%  22.9KiB
     Compute Split          1   49.9μs    0.9%  49.9μs    206KiB    2.4%   206KiB
 Initialize                 1    331μs    6.1%   331μs    858KiB   10.0%   858KiB
 ────────────────────────────────────────────────────────────────────────────────
[VERYDIFF_TIMER] 0.06810396

[VERYDIFF_EXPERIMENT] Running on /home/i57/steuber/NeuroDiff/repos/VeryDiffExperiments/src/../benchmarks/mnist-prune/specs/mnist_20_local_21.vnnlib /home/i57/steuber/NeuroDiff/repos/VeryDiffExperiments/src/../benchmarks/mnist-prune/nets/mnist_relu_4_1024.onnx
Found input X
op: matmul, weight: (1024, 784), bias: nothing
op: bias, weight: nothing, bias: (1024,)
op: relu, weight: nothing, bias: nothing
op: matmul, weight: (1024, 1024), bias: nothing
op: bias, weight: nothing, bias: (1024,)
op: relu, weight: nothing, bias: nothing
op: matmul, weight: (1024, 1024), bias: nothing
op: bias, weight: nothing, bias: (1024,)
op: relu, weight: nothing, bias: nothing
op: matmul, weight: (10, 1024), bias: nothing
op: bias, weight: nothing, bias: (10,)
op: relu, weight: nothing, bias: nothing
op: matmul, weight: (10, 10), bias: nothing
op: bias, weight: nothing, bias: (10,)
Found input X
op: matmul, weight: (1024, 784), bias: nothing
op: bias, weight: nothing, bias: (1024,)
op: relu, weight: nothing, bias: nothing
op: matmul, weight: (1024, 1024), bias: nothing
op: bias, weight: nothing, bias: (1024,)
op: relu, weight: nothing, bias: nothing
op: matmul, weight: (1024, 1024), bias: nothing
op: bias, weight: nothing, bias: (1024,)
op: relu, weight: nothing, bias: nothing
op: matmul, weight: (10, 1024), bias: nothing
op: bias, weight: nothing, bias: (10,)
op: relu, weight: nothing, bias: nothing
op: matmul, weight: (10, 10), bias: nothing
op: bias, weight: nothing, bias: (10,)
Distance: 1266.8815759184893
Distance: 2876.6944248261216
Distance: 2831.8843567411013
Distance: 34.033756025192815
Distance: 0.0
Running with 1 threads
[Thread 1] Time to first task: 0.0s
Instable Generators: 410
Instable Generators: 788
Instable Generators: 973
Instable Generators: 10
Zono Bounds:
[-99.56918105895579, -101.43516890495088, -113.5623092761277, -113.33489885592839, -107.70098466633556, -114.199637463779, -104.19435367754164, -107.60664935513554, -107.85037647382882, -116.39137801654333]
[99.56918105895579, 101.43516890495088, 109.81954449451533, 113.33489885592839, 107.70098466633556, 111.66953758376937, 97.89159540241181, 107.60664935513554, 107.85037647382882, 116.39137801654333]

Found counterexample: ([0.0, 0.0, 0.0, 0.0, 0.0, 0.0, 0.0, 0.0, 0.0, 0.0, 0.0, 0.0, 0.0, 1.0, 0.0, 0.0, 0.0, 0.0, 0.0, 0.0, 0.0, 0.0, 0.0, 0.0, 0.0, 0.0, 0.0, 0.0, 0.0, 0.0, 0.0, 0.0, 0.0, 0.0, 0.0, 0.0, 0.0, 0.0, 0.0, 0.0, 0.0, 0.0, 0.0, 0.0, 0.0, 0.0, 0.0, 0.0, 0.0, 0.0, 0.0, 0.0, 0.0, 0.0, 0.0, 0.0, 0.0, 0.0, 0.0, 0.0, 0.0, 0.0, 0.0, 0.0, 0.0, 0.0, 0.0, 0.0, 0.0, 0.0, 0.0, 0.0, 0.0, 0.0, 0.0, 0.0, 0.0, 0.0, 0.0, 0.0, 0.0, 0.0, 0.0, 0.0, 0.0, 0.0, 0.0, 0.0, 0.0, 0.0, 0.0, 0.0, 0.0, 0.0, 0.0, 0.0, 0.0, 0.0, 0.0, 0.0, 0.0, 0.0, 0.0, 0.0, 0.0, 0.0, 0.0, 0.0, 0.0, 0.0, 0.0, 0.0, 0.0, 0.0, 1.0, 0.0, 0.0, 0.0, 0.0, 0.0, 0.0, 0.0, 0.0, 0.0, 0.0, 0.0, 0.0, 0.0, 0.0, 0.0, 0.0, 0.0, 0.0, 0.0, 0.0, 0.0, 0.0, 0.0, 0.0, 0.0, 0.0, 0.0, 0.0, 0.0, 0.0, 0.0, 0.0, 0.0, 0.0, 0.0, 0.0, 0.0, 0.0, 0.0, 0.0, 0.0, 0.0, 0.0, 0.0, 0.0, 0.0, 0.0, 0.0, 0.0, 0.0, 0.0, 0.0, 0.0, 0.0, 0.0, 0.0, 0.0, 1.0, 0.0, 0.0, 0.0, 0.0, 0.0, 0.0, 0.0, 0.0, 0.0, 0.0, 0.12156863, 0.54901963, 0.75686276, 0.17254902, 0.0, 0.0, 0.0, 0.0, 0.0, 1.0, 0.0, 0.0, 0.0, 0.0, 0.0, 0.0, 0.0, 0.0, 0.0, 1.0, 0.0, 0.0, 0.0, 0.0, 0.0, 0.0, 0.14901961, 0.57254905, 0.94117647, 0.0, 0.99607843, 0.89411765, 0.1882353, 0.3019608, 0.18039216, 0.0, 0.0, 0.0, 0.0, 0.0, 0.0, 0.0, 0.0, 0.0, 0.0, 0.0, 0.0, 0.0, 0.0, 0.0, 0.0, 0.0, 0.00784314, 0.16862746, 0.90196079, 0.99607843, 0.99607843, 0.99607843, 0.99607843, 0.99607843, 0.94509804, 0.99607843, 0.77254903, 0.00784314, 0.0, 0.0, 0.0, 0.0, 0.0, 0.0, 0.0, 0.0, 0.0, 0.0, 0.0, 0.0, 0.0, 0.0, 0.0, 0.08235294, 0.50980395, 0.99607843, 0.99607843, 0.99607843, 0.93725491, 0.98823529, 0.99607843, 0.99607843, 0.99607843, 0.99607843, 0.92941177, 0.01568628, 0.0, 0.0, 0.0, 0.0, 0.0, 0.0, 0.0, 0.0, 0.0, 0.0, 0.0, 0.0, 0.0, 0.0, 0.0, 0.60392159, 0.99607843, 0.99607843, 0.97647059, 0.40784314, 0.27843139, 0.7764706, 0.99607843, 0.0, 0.99607843, 0.91764706, 0.22352941, 0.0, 0.0, 0.0, 0.0, 0.0, 0.0, 0.0, 0.0, 0.0, 0.0, 0.0, 0.0, 0.0, 0.0, 0.00784314, 0.67843139, 0.98823529, 0.98823529, 0.80784315, 0.2, 0.47058824, 0.84313726, 0.99607843, 0.99607843, 0.99607843, 0.99607843, 0.72156864, 0.0, 0.0, 0.0, 0.0, 0.0, 0.0, 0.0, 0.0, 0.0, 0.0, 0.0, 0.0, 0.0, 0.0, 0.0, 0.43921569, 0.0, 0.99607843, 0.84313726, 0.34117648, 0.96862745, 0.99607843, 0.99607843, 0.99607843, 0.99607843, 0.99607843, 0.8509804, 0.12156863, 0.0, 0.0, 0.0, 0.0, 0.0, 0.0, 0.0, 0.0, 0.0, 0.0, 0.0, 0.0, 0.0, 0.0, 0.01960784, 0.90588236, 0.99607843, 0.99607843, 0.99607843, 0.99607843, 0.99607843, 0.9254902, 0.50196081, 0.76862746, 0.99607843, 1.0, 0.46666667, 0.0, 0.0, 0.0, 0.0, 0.0, 0.0, 0.0, 0.0, 0.0, 0.0, 0.0, 0.0, 0.0, 0.0, 0.0, 0.01176471, 0.77254903, 0.99607843, 0.99607843, 0.96078432, 0.93333334, 0.51372552, 0.06666667, 0.18039216, 0.96862745, 0.99607843, 0.78039217, 0.05490196, 0.0, 0.0, 0.0, 0.0, 0.0, 0.0, 0.0, 0.0, 0.0, 0.0, 0.0, 0.0, 0.0, 0.0, 0.0, 0.0, 0.0627451, 0.36078432, 0.34509805, 0.15686275, 0.0, 0.0, 0.04705882, 0.67843139, 0.99607843, 0.94901961, 0.14901961, 0.0, 0.0, 0.0, 0.0, 0.0, 0.0, 0.0, 0.0, 0.0, 0.0, 0.0, 0.0, 0.0, 0.0, 0.0, 0.0, 0.0, 0.0, 0.0, 0.0, 0.0, 0.0, 0.0, 0.37254903, 0.99607843, 0.99607843, 0.60784316, 0.0, 0.0, 0.0, 0.0, 0.0, 0.0, 0.0, 0.0, 0.0, 0.0, 0.0, 0.0, 0.0, 0.0, 0.0, 0.0, 0.0, 0.0, 0.0, 0.0, 0.0, 0.0, 0.0, 0.07058824, 0.82352942, 0.99607843, 0.88235295, 0.02352941, 0.0, 0.0, 1.0, 0.0, 0.0, 0.0, 0.0, 0.0, 0.0, 0.0, 0.0, 0.0, 0.0, 0.0, 0.0, 0.0, 0.0, 0.0, 0.0, 0.0, 0.0, 0.0, 0.0, 0.77254903, 0.99607843, 0.99607843, 0.3882353, 0.0, 0.0, 0.0, 0.0, 0.0, 0.0, 0.0, 0.0, 0.0, 0.0, 0.0, 1.0, 0.0, 0.0, 0.0, 0.0, 0.0, 0.0, 0.0, 0.0, 0.0, 0.0, 0.0, 0.13333334, 0.94901961, 0.99607843, 0.7019608, 0.01176471, 0.0, 0.0, 0.0, 0.0, 1.0, 0.0, 0.0, 0.0, 0.0, 0.0, 0.0, 0.0, 0.0, 0.0, 0.0, 0.0, 0.0, 0.0, 0.0, 0.0, 0.0, 0.0, 0.10588235, 0.87450981, 0.99607843, 0.88235295, 0.11764706, 0.0, 0.0, 0.0, 0.0, 0.0, 0.0, 0.0, 0.0, 0.0, 0.0, 0.0, 0.0, 0.0, 0.0, 0.0, 0.0, 0.0, 0.0, 0.0, 0.0, 0.0, 0.0, 0.0, 0.3019608, 0.99607843, 1.0, 0.49803922, 0.0, 0.0, 0.0, 0.0, 0.0, 0.0, 0.0, 0.0, 0.0, 0.0, 0.0, 0.0, 0.0, 0.0, 0.0, 0.0, 0.0, 0.0, 0.0, 0.0, 0.0, 0.0, 0.0, 0.21176471, 0.93333334, 0.99607843, 0.97254902, 0.20784314, 0.0, 0.0, 0.0, 0.0, 0.0, 0.0, 0.0, 0.0, 0.0, 0.0, 0.0, 0.0, 0.0, 0.0, 0.0, 0.0, 0.0, 0.0, 0.0, 0.0, 0.0, 0.0, 0.04313726, 0.71764708, 0.99607843, 0.99607843, 0.90588236, 0.16078432, 0.0, 0.0, 0.0, 0.0, 0.0, 0.0, 0.0, 0.0, 0.0, 0.0, 0.0, 0.0, 0.0, 0.0, 0.0, 0.0, 0.0, 0.0, 0.0, 0.0, 0.0, 0.0, 0.44313726, 0.99607843, 0.99607843, 0.90196079, 0.1882353, 0.0, 0.0, 0.0, 1.0, 0.0, 0.0, 0.0, 0.0, 0.0, 1.0, 0.0, 0.0, 0.0, 0.0, 0.0, 0.0, 0.0, 0.0, 0.0, 0.0, 0.0, 0.0, 0.0, 0.43137255, 0.93725491, 0.49411765, 0.09803922, 0.0, 0.0, 0.0, 0.0, 0.0, 0.0, 0.0, 0.0, 0.0, 0.0, 0.0, 0.0, 0.0, 0.0, 0.0, 0.0, 0.0, 0.0, 0.0, 0.0, 0.0, 0.0, 0.0, 0.0, 0.0, 0.0, 0.0, 0.0, 0.0, 0.0, 0.0, 0.0, 0.0, 0.0, 0.0, 0.0, 0.0, 0.0, 0.0, 0.0, 0.0, 0.0, 0.0, 0.0, 0.0, 0.0, 0.0, 0.0, 0.0, 0.0, 0.0, 0.0, 0.0, 0.0, 0.0, 0.0, 0.0, 0.0, 0.0, 0.0, 0.0, 0.0, 0.0, 0.0, 0.0, 0.0, 0.0, 0.0, 0.0, 0.0, 0.0], ([0.0, 12.78924008119396, 0.0, 6.057212681852594, 0.9299901105766215, 0.0, 0.0, 14.417683846378496, 0.0, 8.94765819916297], [0.38144178747378926, 10.843469252606248, 0.0, 5.292114829794755, 0.0, 0.0, 0.0, 11.064406299645162, 0.0, 5.265217922870573], 4.561951577765058))
[Thread 1] Total splits: 0
Processed 1 zonotopes (Work Done: 0.0%); Generated 0 (1.297453992s/loop)
[Thread 1] Finished in 1.3s
 ────────────────────────────────────────────────────────────────────────────────
                                        Time                    Allocations      
                               ───────────────────────   ────────────────────────
       Tot / % measured:            1.32s / 100.0%            339MiB / 100.0%    

 Section               ncalls     time    %tot     avg     alloc    %tot      avg
 ────────────────────────────────────────────────────────────────────────────────
 Verify                     1    1.30s   98.3%   1.30s    317MiB   93.4%   317MiB
   Zonotope Loop            1    1.30s   98.3%   1.30s    317MiB   93.4%   317MiB
     Zonotope Propa...      1    1.29s   97.5%   1.29s    315MiB   92.9%   315MiB
       DiffZonotope...      4    717ms   54.4%   179ms    247MiB   72.9%  61.8MiB
         Zonotope_R...      8    390ms   29.5%  48.7ms    154MiB   45.5%  19.3MiB
           Column M...      8    266ms   20.2%  33.3ms   62.3MiB   18.4%  7.79MiB
           Allocation       8   94.9ms    7.2%  11.9ms   62.3MiB   18.4%  7.79MiB
           Influenc...      8   18.6ms    1.4%  2.32ms   29.3MiB    8.6%  3.66MiB
             Multiply       8   18.1ms    1.4%  2.26ms   27.3MiB    8.1%  3.41MiB
             Alloca...      8    337μs    0.0%  42.2μs   2.00MiB    0.6%   256KiB
             Set Ma...      8    131μs    0.0%  16.3μs     0.00B    0.0%    0.00B
           Set Matrix       8   10.1ms    0.8%  1.27ms    115KiB    0.0%  14.4KiB
           Vectors          8    203μs    0.0%  25.4μs    272KiB    0.1%  34.0KiB
           Bounds           8   5.47μs    0.0%   683ns     0.00B    0.0%    0.00B
       DiffZonotope...      5    569ms   43.1%   114ms   67.9MiB   20.0%  13.6MiB
         Zonotope_D...     10    165ms   12.5%  16.5ms   27.8MiB    8.2%  2.78MiB
     Property Check         1   10.8ms    0.8%  10.8ms    539KiB    0.2%   539KiB
 Initialize                 1   22.0ms    1.7%  22.0ms   22.4MiB    6.6%  22.4MiB
 ────────────────────────────────────────────────────────────────────────────────
[VERYDIFF_TIMER] 1.419963882

[VERYDIFF_EXPERIMENT] NETWORK: /home/i57/steuber/NeuroDiff/repos/VeryDiffExperiments/src/../benchmarks/mnist-prune/specs/mnist_20_local_21.vnnlib
[VERYDIFF_EXPERIMENT] TIME: 122.430116887
