Parsing new_benchmarks/rice-1/nets/2_80.onnx...
Found input onnx::Gemm_0
op: gemm, weight: (80, 7), bias: (80,)
op: relu, weight: nothing, bias: nothing
op: gemm, weight: (80, 80), bias: (80,)
op: relu, weight: nothing, bias: nothing
op: gemm, weight: (2, 80), bias: (2,)
Parsing new_benchmarks/rice-1/nets_pruned/2_80-0.5.onnx...
Found input onnx::Gemm_0
op: gemm, weight: (80, 7), bias: (80,)
op: relu, weight: nothing, bias: nothing
op: gemm, weight: (80, 80), bias: (80,)
op: relu, weight: nothing, bias: nothing
op: gemm, weight: (2, 80), bias: (2,)
Distance: 51.170901549063274
Distance: 160.6413631222458
Distance: 0.0
Running with 1 threads
[Thread 1] Time to first task: 0.0s
Zono Bounds:
[0.0, 0.0, 0.0, 0.0, 0.0, 0.0, 0.0]
[0.0, 0.0, 0.0, 0.0, 0.0, 0.0, 0.0]
[TOP-1] required confidence (1.0≥0.999) is feasible for index 1
Found cex
N1 Probability: 0.9999632905463304 >= 0.999

Found counterexample: ([1.9999999999999996, 0.0, 0.19999999999999996, -2.6, -3.2375000000000007, 1.8875, 0.22499999999999987], (1, 2))
[Thread 1] Total splits: 22
Processed 23 zonotopes (Work Done: 0.0%); Generated 44 (0.0030636970869565216s/loop)
[Thread 1] Finished in 0.07s
 ────────────────────────────────────────────────────────────────────────────────
                                        Time                    Allocations      
                               ───────────────────────   ────────────────────────
       Tot / % measured:           70.5ms / 100.0%           38.5MiB / 100.0%    

 Section               ncalls     time    %tot     avg     alloc    %tot      avg
 ────────────────────────────────────────────────────────────────────────────────
 Verify                     1   70.5ms   99.9%  70.5ms   38.5MiB   99.8%  38.5MiB
   Zonotope Loop            1   70.5ms   99.9%  70.5ms   38.5MiB   99.8%  38.5MiB
     Property Check        23   64.4ms   91.3%  2.80ms   21.1MiB   54.7%   939KiB
     Zonotope Propa...     23   5.55ms    7.9%   241μs   16.8MiB   43.7%   749KiB
       DiffZonotope...     46   3.62ms    5.1%  78.7μs   14.5MiB   37.6%   322KiB
         Zonotope_R...     92   3.43ms    4.9%  37.3μs   14.2MiB   36.8%   158KiB
           Column M...     92   1.19ms    1.7%  12.9μs   5.46MiB   14.2%  60.8KiB
           Influenc...     92    919μs    1.3%  10.0μs   2.75MiB    7.1%  30.6KiB
             Multiply      92    773μs    1.1%  8.40μs   2.26MiB    5.9%  25.1KiB
             Alloca...     92   63.9μs    0.1%   695ns    505KiB    1.3%  5.48KiB
             Set Ma...     92   30.8μs    0.0%   334ns     0.00B    0.0%    0.00B
           Set Matrix      92    719μs    1.0%  7.82μs    166KiB    0.4%  1.80KiB
           Vectors         92    272μs    0.4%  2.96μs    341KiB    0.9%  3.70KiB
           Allocation      92    223μs    0.3%  2.42μs   5.45MiB   14.1%  60.7KiB
           Bounds          92   16.4μs    0.0%   178ns     0.00B    0.0%    0.00B
       DiffZonotope...     69   1.82ms    2.6%  26.4μs   2.33MiB    6.0%  34.5KiB
         Zonotope_D...    138   1.79ms    2.5%  13.0μs   2.32MiB    6.0%  17.2KiB
     Compute Split         22    412μs    0.6%  18.7μs    495KiB    1.3%  22.5KiB
 Initialize                 1   38.7μs    0.1%  38.7μs   61.7KiB    0.2%  61.7KiB
 ────────────────────────────────────────────────────────────────────────────────[VERYDIFF_TIMER] 0.071935648
