
[VERYDIFF_EXPERIMENT] Running on /home/i57/steuber/NeuroDiff/repos/VeryDiffExperiments/src/../benchmarks/mnist-prune/specs/mnist_49_global_4.vnnlib /home/i57/steuber/NeuroDiff/repos/VeryDiffExperiments/src/../benchmarks/mnist-prune/nets/mnist_relu_3_100.onnx
Found input X
op: matmul, weight: (100, 784), bias: nothing
op: bias, weight: nothing, bias: (100,)
op: relu, weight: nothing, bias: nothing
op: matmul, weight: (100, 100), bias: nothing
op: bias, weight: nothing, bias: (100,)
op: relu, weight: nothing, bias: nothing
op: matmul, weight: (10, 100), bias: nothing
op: bias, weight: nothing, bias: (10,)
op: relu, weight: nothing, bias: nothing
op: matmul, weight: (10, 10), bias: nothing
op: bias, weight: nothing, bias: (10,)
Found input X
op: gemm, weight: (100, 784), bias: (100,)
op: relu, weight: nothing, bias: nothing
op: gemm, weight: (100, 100), bias: (100,)
op: relu, weight: nothing, bias: nothing
op: gemm, weight: (10, 100), bias: (10,)
op: relu, weight: nothing, bias: nothing
op: gemm, weight: (10, 10), bias: (10,)
Distance: 368.62397500800625
Distance: 47.56803950402309
Distance: 2.8977568827249343
Distance: 0.01885471428334995
Running with 1 threads
[Thread 1] Time to first task: 0.0s
Instable Generators: 29
Instable Generators: 27
Instable Generators: 6
Zono Bounds:
[5.165909231120308e-7, -0.0005802933926876504, -0.5664643076794975, -0.0008535668013532888, -0.6469782564843798, -0.5716427736414846, -0.7787981352939827, -0.6115812314033235, -0.6673163605970068, -0.6908483742434923]
[0.00043990240161863173, 0.00017038700545067098, 0.5546750717346083, 0.0005624977063772174, 0.680206853110322, 0.5705167371994413, 0.6965587941681602, 0.5785532694315012, 0.6679361054810015, 0.6929175083455634]
[Thread 1] Total splits: 0
Processed 1 zonotopes (Work Done: 100.0%); Generated 0 (0.053781632s/loop)
[Thread 1] Finished in 0.05s
 ────────────────────────────────────────────────────────────────────────────────
                                        Time                    Allocations      
                               ───────────────────────   ────────────────────────
       Tot / % measured:           54.4ms / 100.0%           97.1MiB / 100.0%    

 Section               ncalls     time    %tot     avg     alloc    %tot      avg
 ────────────────────────────────────────────────────────────────────────────────
 Verify                     1   53.8ms   99.0%  53.8ms   91.7MiB   94.4%  91.7MiB
   Zonotope Loop            1   53.8ms   99.0%  53.8ms   91.7MiB   94.4%  91.7MiB
     Zonotope Propa...      1   50.5ms   92.9%  50.5ms   71.7MiB   73.9%  71.7MiB
       DiffZonotope...      3   25.9ms   47.6%  8.63ms   67.6MiB   69.6%  22.5MiB
         Zonotope_R...      6   25.0ms   46.0%  4.16ms   66.1MiB   68.0%  11.0MiB
           Influenc...      6   23.8ms   43.7%  3.96ms   60.7MiB   62.5%  10.1MiB
             Multiply       6   18.4ms   33.8%  3.06ms   30.7MiB   31.7%  5.12MiB
             Set Ma...      6   4.06ms    7.5%   677μs     0.00B    0.0%    0.00B
             Alloca...      6   1.31ms    2.4%   219μs   30.0MiB   30.9%  4.99MiB
           Column M...      6    722μs    1.3%   120μs   2.66MiB    2.7%   454KiB
           Set Matrix       6    300μs    0.6%  50.1μs   4.83KiB    0.0%     824B
           Allocation       6    123μs    0.2%  20.4μs   2.66MiB    2.7%   454KiB
           Vectors          6   54.3μs    0.1%  9.05μs   19.5KiB    0.0%  3.26KiB
           Bounds           6   4.01μs    0.0%   669ns     0.00B    0.0%    0.00B
       DiffZonotope...      4   24.6ms   45.3%  6.15ms   4.12MiB    4.2%  1.03MiB
         Zonotope_D...      8   9.01ms   16.6%  1.13ms   2.70MiB    2.8%   346KiB
     Property Check         1   10.8μs    0.0%  10.8μs   1.23KiB    0.0%  1.23KiB
 Initialize                 1    543μs    1.0%   543μs   5.41MiB    5.6%  5.41MiB
 ────────────────────────────────────────────────────────────────────────────────
[VERYDIFF_TIMER] 0.087821762

[VERYDIFF_EXPERIMENT] NETWORK: /home/i57/steuber/NeuroDiff/repos/VeryDiffExperiments/src/../benchmarks/mnist-prune/specs/mnist_49_global_4.vnnlib
[VERYDIFF_EXPERIMENT] TIME: 0.390398088
