
[VERYDIFF_EXPERIMENT] Running on /home/i57/steuber/NeuroDiff/repos/VeryDiffExperiments/src/../benchmarks/mnist-prune/specs/mnist_62_global_4.vnnlib /home/i57/steuber/NeuroDiff/repos/VeryDiffExperiments/src/../benchmarks/mnist-prune/nets/mnist_relu_3_100.onnx
Parsing /home/i57/steuber/NeuroDiff/repos/VeryDiffExperiments/src/../benchmarks/mnist-prune/nets/mnist_relu_3_100.onnx...
Found input X
op: matmul, weight: (100, 784), bias: nothing
op: bias, weight: nothing, bias: (100,)
op: relu, weight: nothing, bias: nothing
op: matmul, weight: (100, 100), bias: nothing
op: bias, weight: nothing, bias: (100,)
op: relu, weight: nothing, bias: nothing
op: matmul, weight: (10, 100), bias: nothing
op: bias, weight: nothing, bias: (10,)
op: relu, weight: nothing, bias: nothing
op: matmul, weight: (10, 10), bias: nothing
op: bias, weight: nothing, bias: (10,)
Parsing /home/i57/steuber/NeuroDiff/repos/VeryDiffExperiments/src/../benchmarks/mnist-prune/nets_pruned/mnist_relu_3_100_0.79_adam_1_stepsize-old.onnx...
Found input X
op: gemm, weight: (100, 784), bias: (100,)
op: relu, weight: nothing, bias: nothing
op: gemm, weight: (100, 100), bias: (100,)
op: relu, weight: nothing, bias: nothing
op: gemm, weight: (10, 100), bias: (10,)
op: relu, weight: nothing, bias: nothing
op: gemm, weight: (10, 10), bias: (10,)
Distance: 368.62397500800625
Distance: 47.56803950402309
Distance: 2.8977568827249343
Distance: 0.01885471428334995
Running with 1 threads
[Thread 1] Time to first task: 0.0s
Instable Generators: 44
Instable Generators: 72
Instable Generators: 9
Zono Bounds:
[-1.3347004528039994, -0.0007101494946907757, -1.6112458865133932, -1.3344425316322777, -1.610253791376428, -1.716559302142373, -1.557136679464465, -1.6153959959362778, -1.4412614604448013, -1.6189308608196091]
[1.3352854757896369, 0.0005696180073925718, 1.5175826520893128, 1.3319606677084448, 1.6073970623937752, 1.6029613807297145, 1.5561490837784135, 1.4771201591657266, 1.4316313589943137, 1.613281312911913]
Found cex
N1 Scale: 1.0309933985392694 >= 1.0

Found counterexample: ([0.01568628, 0.0, 0.01568628, 0.0, 0.01568628, 0.01568628, 0.0, 0.01568628, 0.01568628, 0.0, 0.0, 0.0, 0.01568628, 0.01568628, 0.0, 0.0, 0.01568628, 0.0, 0.01568628, 0.01568628, 0.01568628, 0.0, 0.01568628, 0.0, 0.01568628, 0.0, 0.01568628, 0.01568628, 0.01568628, 0.01568628, 0.0, 0.0, 0.0, 0.01568628, 0.0, 0.01568628, 0.0, 0.01568628, 0.0, 0.01568628, 0.0, 0.0, 0.0, 0.01568628, 0.01568628, 0.0, 0.01568628, 0.0, 0.01568628, 0.0, 0.0, 0.0, 0.01568628, 0.0, 0.01568628, 0.0, 0.01568628, 0.0, 0.01568628, 0.01568628, 0.0, 0.01568628, 0.0, 0.01568628, 0.0, 0.0, 0.01568628, 0.01568628, 0.01568628, 0.01568628, 0.0, 0.01568628, 0.01568628, 0.0, 0.01568628, 0.01568628, 0.0, 0.0, 0.01568628, 0.01568628, 0.01568628, 0.01568628, 0.01568628, 0.01568628, 0.01568628, 0.0, 0.01568628, 0.0, 0.0, 0.01568628, 0.0, 0.01568628, 0.01568628, 0.0, 0.01568628, 0.0, 0.01568628, 0.01568628, 0.01568628, 0.01568628, 0.01568628, 0.0, 0.01568628, 0.0, 0.01568628, 0.0, 0.0, 0.01568628, 0.01568628, 0.0, 0.01568628, 0.01568628, 0.0, 0.01568628, 0.0, 0.01568628, 0.0, 0.0, 0.0, 0.0, 0.01568628, 0.01568628, 0.01568628, 0.01568628, 0.01568628, 0.01568628, 0.01568628, 0.01568628, 0.01568628, 0.01568628, 0.01568628, 0.01568628, 0.01568628, 0.01568628, 0.0, 0.01568628, 0.01568628, 0.0, 0.0, 0.01568628, 0.01568628, 0.0, 0.0, 0.01568628, 0.0, 0.0, 0.0, 0.01568628, 0.01568628, 0.01568628, 0.01568628, 0.0, 0.0, 0.01568628, 0.01568628, 0.01568628, 0.01568628, 0.01568628, 0.01568628, 0.01568628, 0.01568628, 0.0, 0.0, 0.0, 0.0, 0.0, 0.0, 0.01568628, 0.01568628, 0.01568628, 0.0, 0.01568628, 0.0, 0.01568628, 0.0, 0.01568628, 0.01568628, 0.01568628, 0.5725490499999999, 1.0, 0.78431374, 0.6901961, 0.7647059, 0.5647059100000001, 0.34117648, 0.09019608, 0.02352941, 0.01568628, 0.0, 0.01568628, 0.01568628, 0.0, 0.01568628, 0.01568628, 0.0, 0.01568628, 0.0, 0.01568628, 0.0, 0.01568628, 0.01568628, 0.01568628, 0.01568628, 0.01568628, 0.01568628, 0.25098041, 0.88627452, 0.33333334, 0.27450982, 0.58431375, 0.74117649, 0.9137255, 0.9137255, 0.96470588, 0.7764705999999999, 0.09803922, 0.0, 0.0, 0.0, 0.0, 0.0, 0.01568628, 0.01568628, 0.01568628, 0.01568628, 0.01568628, 0.01568628, 0.0, 0.01568628, 0.0, 0.01568628, 0.0, 0.01568628, 0.63529414, 0.78431374, 0.01568628, 0.01568628, 0.01568628, 0.01568628, 0.0, 0.0, 0.43529412, 0.3019608, 0.05882353, 0.0, 0.01568628, 0.0, 0.0, 0.0, 0.0, 0.0, 0.0, 0.0, 0.01568628, 0.01568628, 0.0, 0.01568628, 0.0, 0.0, 0.0, 0.0, 0.81960785, 0.60784316, 0.01568628, 0.01568628, 0.01568628, 0.0, 0.0, 0.0, 0.0, 0.0, 0.0, 0.0, 0.0, 0.0, 0.0, 0.01568628, 0.0, 0.0, 0.0, 0.01568628, 0.0, 0.0, 0.0, 0.01568628, 0.0, 0.01568628, 0.01568628, 0.011764709999999998, 0.84705883, 0.46666666999999995, 0.01568628, 0.01568628, 0.01568628, 0.0, 0.01568628, 0.0, 0.0, 0.0, 0.0, 0.0, 0.0, 0.01568628, 0.0, 0.0, 0.0, 0.01568628, 0.01568628, 0.01568628, 0.01568628, 0.0, 0.01568628, 0.0, 0.0, 0.0, 0.0, 0.11764706, 0.94901961, 0.49411765, 0.0, 0.0, 0.01568628, 0.01568628, 0.0, 0.01568628, 0.01568628, 0.0, 0.0, 0.0, 0.0, 0.0030591892417466933, 0.0, 0.01568628, 0.0, 0.0, 0.0, 0.0, 0.0, 0.01568628, 0.01568628, 0.01568628, 0.0, 0.0, 0.0, 0.0, 0.64313728, 0.94901961, 0.06666667, 0.0, 0.0, 0.0, 0.0, 0.52549022, 0.25490198, 0.01568628, 0.01568628, 0.0, 0.0, 0.01568628, 0.0, 0.01568628, 0.0, 0.01568628, 0.0, 0.01568628, 0.01568628, 0.01568628, 0.0, 0.0, 0.01568628, 0.0, 0.0, 0.0, 0.49803922, 0.98039216, 0.37254903, 0.0, 0.0, 0.0, 0.0, 0.72549021, 0.52941179, 0.0, 0.01568628, 0.0, 0.0, 0.0, 0.01568628, 0.01568628, 0.01568628, 0.01568628, 0.01568628, 0.01568628, 0.01568628, 0.0, 0.0, 0.0, 0.0, 0.01568628, 0.0, 0.0, 0.33725490999999996, 0.98039216, 0.40392157, 0.0, 0.0, 0.0, 0.31764707, 0.88235295, 0.33333334, 0.01568628, 0.0, 0.01568628, 0.01568628, 0.01568628, 0.01568628, 0.01568628, 0.0, 0.0, 0.0, 0.01568628, 0.0, 0.01568628, 0.01568628, 0.01568628, 0.01568628, 0.01568628, 0.01568628, 0.0, 0.0, 0.75294119, 0.87843138, 0.02745098, 0.0, 0.0, 0.58823532, 0.98039216, 0.20784314, 0.01568628, 0.0, 0.01568628, 0.01568628, 0.01568628, 0.01568628, 0.01568628, 0.01568628, 0.01568628, 0.01568628, 0.0, 0.01568628, 0.01568628, 0.01568628, 0.01568628, 0.01568628, 0.01568628, 0.01568628, 0.01568628, 0.01568628, 0.41568628, 0.98039216, 0.49019608, 0.0, 0.05098039, 0.79607844, 0.98431373, 0.20784314, 0.01568628, 0.01568628, 0.01568628, 0.01568628, 0.0, 0.01568628, 0.01568628, 0.01568628, 0.01568628, 0.0, 0.01568628, 0.01568628, 0.01568628, 0.01568628, 0.01568628, 0.01568628, 0.01568628, 0.0, 0.01568628, 0.01568628, 0.01568628, 0.74117649, 0.98039216, 0.7019608, 0.72156864, 0.7019607999999999, 0.98039216, 0.20784314, 0.01568628, 0.01568628, 0.01568628, 0.01568628, 0.0, 0.01568628, 0.01568628, 0.0, 0.0, 0.01568628, 0.0, 0.0, 0.0, 0.0, 0.01568628, 0.01568628, 0.01568628, 0.01568628, 0.01568628, 0.01568628, 0.0, 0.08235294, 0.47058824000000005, 0.56078434, 0.07058824, 0.55686277, 0.98039216, 0.20784314, 0.01568628, 0.01568628, 0.01568628, 0.01568628, 0.01568628, 0.01568628, 0.01568628, 0.01568628, 0.0, 0.0, 0.01568628, 0.01568628, 0.01568628, 0.01568628, 0.01568628, 0.01568628, 0.01568628, 0.01568628, 0.01568628, 0.01568628, 0.01568628, 0.01568628, 0.01568628, 0.01568628, 0.01568628, 0.40392157, 1.0, 0.23921569, 0.01568628, 0.01568628, 0.01568628, 0.01568628, 0.01568628, 0.01568628, 0.01568628, 0.0, 0.0, 0.0, 0.01568628, 0.0, 0.0, 0.0, 0.01568628, 0.01568628, 0.01568628, 0.01568628, 0.01568628, 0.01568628, 0.01568628, 0.01568628, 0.01568628, 0.01568628, 0.01568628, 0.40392157, 1.0, 0.23921569, 0.01568628, 0.01568628, 0.01568628, 0.01568628, 0.0, 0.01568628, 0.0, 0.0, 0.01568628, 0.01568628, 0.0, 0.0, 0.01568628, 0.0, 0.01568628, 0.01568628, 0.01568628, 0.01568628, 0.01568628, 0.01568628, 0.01568628, 0.01568628, 0.01568628, 0.01568628, 0.01568628, 0.67058825, 1.0, 0.23921569, 0.01568628, 0.01568628, 0.01568628, 0.01568628, 0.0, 0.01568628, 0.0, 0.01568628, 0.0, 0.0, 0.0, 0.0, 0.01568628, 0.01568628, 0.01568628, 0.01568628, 0.0, 0.01568628, 0.01568628, 0.01568628, 0.0, 0.0, 0.01568628, 0.01568628, 0.01568628, 0.54509807, 0.9254902000000002, 0.04705882, 0.01568628, 0.01568628, 0.01568628, 0.01568628, 0.0, 0.0, 0.01568628, 0.0, 0.01568628, 0.01568628, 0.0, 0.01568628, 0.0, 0.01568628, 0.01568628, 0.0, 0.01568628, 0.01568628, 0.0, 0.01568628, 0.0, 0.0, 0.0, 0.01568628, 0.01568628, 0.37254903, 0.96862745, 0.1882353, 0.01568628, 0.0, 0.01568628, 0.0, 0.01568628, 0.0, 0.0, 0.0, 0.0, 0.0, 0.0, 0.0, 0.0, 0.01568628, 0.01568628, 0.0, 0.01568628, 0.0, 0.01568628, 0.01568628, 0.0, 0.01568628, 0.0, 0.01568628, 0.01568628, 0.40392157, 0.94901961, 0.17647059, 0.0, 0.01568628, 0.0, 0.0, 0.01568628, 0.0, 0.0, 0.01568628, 0.01568628, 0.0, 0.0, 0.0, 0.0, 0.0, 0.01568628, 0.0, 0.01568628, 0.0, 0.01568628, 0.0, 0.01568628, 0.0, 0.0, 0.01568628, 0.0, 0.47843137, 0.88235295, 0.0, 0.01568628, 0.0, 0.0, 0.0, 0.01568628, 0.01568628, 0.01568628, 0.0, 0.0, 0.01568628, 0.0, 0.01568628, 0.0, 0.0, 0.01568628, 0.01568628, 0.0, 0.0, 0.0, 0.0, 0.0, 0.01568628, 0.0, 0.01568628, 0.0, 0.01568628, 0.0, 0.0, 0.01568628, 0.0, 0.0, 0.01568628, 0.0, 0.01568628, 0.01568628, 0.0, 0.0, 0.0, 0.0, 0.0, 0.01568628, 0.0, 0.0, 0.01568628, 0.0, 0.01568628, 0.0, 0.0, 0.01568628, 0.0, 0.01568628, 0.01568628, 0.01568628, 0.01568628, 0.0, 0.01568628, 0.01568628, 0.01568628, 0.01568628, 0.01568628, 0.0, 0.0, 0.01568628, 0.01568628, 0.01568628, 0.01568628], (9, 10))
[Thread 1] Total splits: 0
Processed 1 zonotopes (Work Done: 0.0%); Generated 0 (0.170281568s/loop)
[Thread 1] Finished in 0.17s
 ────────────────────────────────────────────────────────────────────────────────
                                        Time                    Allocations      
                               ───────────────────────   ────────────────────────
       Tot / % measured:            171ms / 100.0%            141MiB / 100.0%    

 Section               ncalls     time    %tot     avg     alloc    %tot      avg
 ────────────────────────────────────────────────────────────────────────────────
 Verify                     1    170ms   99.7%   170ms    136MiB   96.2%   136MiB
   Zonotope Loop            1    170ms   99.7%   170ms    136MiB   96.2%   136MiB
     Property Check         1    112ms   65.8%   112ms   39.0MiB   27.7%  39.0MiB
     Zonotope Propa...      1   53.6ms   31.4%  53.6ms   76.1MiB   54.0%  76.1MiB
       DiffZonotope...      3   30.2ms   17.7%  10.1ms   71.9MiB   51.0%  24.0MiB
         Zonotope_R...      6   29.0ms   17.0%  4.84ms   70.1MiB   49.8%  11.7MiB
           Influenc...      6   27.8ms   16.2%  4.63ms   64.5MiB   45.8%  10.8MiB
             Multiply       6   20.4ms   11.9%  3.39ms   33.0MiB   23.4%  5.51MiB
             Set Ma...      6   4.54ms    2.7%   756μs     0.00B    0.0%    0.00B
             Alloca...      6   2.82ms    1.7%   470μs   31.5MiB   22.4%  5.25MiB
           Column M...      6    733μs    0.4%   122μs   2.77MiB    2.0%   473KiB
           Set Matrix       6    323μs    0.2%  53.8μs   7.78KiB    0.0%  1.30KiB
           Allocation       6    154μs    0.1%  25.7μs   2.77MiB    2.0%   473KiB
           Vectors          6   29.8μs    0.0%  4.97μs   19.5KiB    0.0%  3.26KiB
           Bounds           6   3.65μs    0.0%   608ns     0.00B    0.0%    0.00B
       DiffZonotope...      4   23.4ms   13.7%  5.86ms   4.22MiB    3.0%  1.05MiB
         Zonotope_D...      8   8.74ms    5.1%  1.09ms   2.74MiB    1.9%   351KiB
 Initialize                 1    559μs    0.3%   559μs   5.41MiB    3.8%  5.41MiB
 ────────────────────────────────────────────────────────────────────────────────
[VERYDIFF_TIMER] 0.215914444

[VERYDIFF_EXPERIMENT] NETWORK: /home/i57/steuber/NeuroDiff/repos/VeryDiffExperiments/src/../benchmarks/mnist-prune/specs/mnist_62_global_4.vnnlib
[VERYDIFF_EXPERIMENT] TIME: 0.631817035
