
[VERYDIFF_EXPERIMENT] Running on /home/i57/steuber/NeuroDiff/repos/VeryDiffExperiments/src/../benchmarks/mnist-prune/specs/mnist_16_local_15.vnnlib /home/i57/steuber/NeuroDiff/repos/VeryDiffExperiments/src/../benchmarks/mnist-prune/nets/mnist_relu_3_100.onnx
Total difference: 2125.6743
Average difference: 0.0238
Initial output delta:
[-3.387038 -0.069112 -4.317728 -3.334970 -4.871657 -4.106691 -0.561797 -4.335047 -4.041528 -3.060609 ]
[3.188962 0.025245 2.981670 3.729648 3.737185 3.206340 0.030797 4.565437 3.274463 4.556756 ]
setenv(`timeout -k 5 120 ../NeuroDiff/DiffNN-Code/delta_network_test 416 /home/i57/steuber/NeuroDiff/repos/VeryDiffExperiments/src/../benchmarks/mnist-prune/nets/mnist_relu_3_100.nnet /home/i57/steuber/NeuroDiff/repos/VeryDiffExperiments/src/../benchmarks/mnist-prune/nets_pruned/mnist_relu_3_100_0.77.nnet 1.0 -x 15`,["OMP_NUM_THREADS=1"])TIMEOUT
ProcessFailedException(Base.Process[Process(setenv(`timeout -k 5 120 ../NeuroDiff/DiffNN-Code/delta_network_test 416 /home/i57/steuber/NeuroDiff/repos/VeryDiffExperiments/src/../benchmarks/mnist-prune/nets/mnist_relu_3_100.nnet /home/i57/steuber/NeuroDiff/repos/VeryDiffExperiments/src/../benchmarks/mnist-prune/nets_pruned/mnist_relu_3_100_0.77.nnet 1.0 -x 15`,["OMP_NUM_THREADS=1"]), ProcessExited(124))])
nothing

[VERYDIFF_TIMER] 120.005642402

[VERYDIFF_EXPERIMENT] NETWORK: /home/i57/steuber/NeuroDiff/repos/VeryDiffExperiments/src/../benchmarks/mnist-prune/specs/mnist_16_local_15.vnnlib
[VERYDIFF_EXPERIMENT] TIME: 120.232126652
