
[VERYDIFF_EXPERIMENT] Running on /home/i57/steuber/NeuroDiff/repos/VeryDiffExperiments/src/../benchmarks/mnist-prune/specs/mnist_51_global_4.vnnlib /home/i57/steuber/NeuroDiff/repos/VeryDiffExperiments/src/../benchmarks/mnist-prune/nets/mnist_relu_3_100.onnx
Found input X
op: matmul, weight: (100, 784), bias: nothing
op: bias, weight: nothing, bias: (100,)
op: relu, weight: nothing, bias: nothing
op: matmul, weight: (100, 100), bias: nothing
op: bias, weight: nothing, bias: (100,)
op: relu, weight: nothing, bias: nothing
op: matmul, weight: (10, 100), bias: nothing
op: bias, weight: nothing, bias: (10,)
op: relu, weight: nothing, bias: nothing
op: matmul, weight: (10, 10), bias: nothing
op: bias, weight: nothing, bias: (10,)
Found input X
op: gemm, weight: (100, 784), bias: (100,)
op: relu, weight: nothing, bias: nothing
op: gemm, weight: (100, 100), bias: (100,)
op: relu, weight: nothing, bias: nothing
op: gemm, weight: (10, 100), bias: (10,)
op: relu, weight: nothing, bias: nothing
op: gemm, weight: (10, 10), bias: (10,)
Distance: 1958.4889029213523
Distance: 144.28197153992141
Distance: 22.063573056613677
Distance: 0.8412832540489035
Running with 1 threads
[Thread 1] Time to first task: 0.0s
Instable Generators: 24
Instable Generators: 41
Instable Generators: 5
Zono Bounds:
[-0.008051343941423825, -2.8344993461545167, -4.05011642285587, -2.6718481062502755, -0.026494795308555467, -3.3022879179490663, -0.001439977984050397, -3.740597802065967, -3.0370935615765533, -3.553193659954876]
[0.0022526759542375405, 2.4925877028381196, 2.921188472188884, 3.758116930711218, -0.010987424106442836, 4.102324258599157, 0.006443295412932901, 3.088204561995949, 3.134576300687273, 3.7329626852745124]
[Thread 1] Processed 100 zonotopes (Work Done: 0.0%; Expected Zonos: Inf)
[Thread 1] Processed 200 zonotopes (Work Done: 0.0%; Expected Zonos: Inf)
[Thread 1] Processed 300 zonotopes (Work Done: 0.0%; Expected Zonos: Inf)
[Thread 1] Processed 400 zonotopes (Work Done: 0.0%; Expected Zonos: Inf)
[Thread 1] Processed 500 zonotopes (Work Done: 0.0%; Expected Zonos: Inf)


TIMEOUT REACHED
UNKNOWN
[Thread 1] Total splits: 570
Processed 570 zonotopes (Work Done: 0.0%); Generated 1140 (0.2111124860385965s/loop)
[Thread 1] Finished in 120.33s
 ────────────────────────────────────────────────────────────────────────────────
                                        Time                    Allocations      
                               ───────────────────────   ────────────────────────
       Tot / % measured:             120s / 100.0%           59.9GiB / 100.0%    

 Section               ncalls     time    %tot     avg     alloc    %tot      avg
 ────────────────────────────────────────────────────────────────────────────────
 Verify                     1     120s  100.0%    120s   59.9GiB  100.0%  59.9GiB
   Zonotope Loop            1     120s  100.0%    120s   59.9GiB  100.0%  59.9GiB
     Zonotope Propa...    570    67.4s   56.0%   118ms   40.2GiB   67.1%  72.2MiB
       DiffZonotope...  1.71k    57.4s   47.7%  33.6ms   37.9GiB   63.3%  22.7MiB
         Zonotope_R...  3.42k    56.7s   47.1%  16.6ms   37.0GiB   61.8%  11.1MiB
           Influenc...  3.42k    32.8s   27.2%  9.59ms   34.0GiB   56.8%  10.2MiB
             Multiply   3.42k    16.8s   14.0%  4.92ms   17.3GiB   28.8%  5.17MiB
             Alloca...  3.42k    13.5s   11.2%  3.95ms   16.8GiB   28.0%  5.02MiB
             Set Ma...  3.42k    2.43s    2.0%   710μs     0.00B    0.0%    0.00B
           Column M...  3.42k    23.6s   19.6%  6.90ms   1.48GiB    2.5%   455KiB
           Set Matrix   3.42k    187ms    0.2%  54.7μs   2.92MiB    0.0%     896B
           Allocation   3.42k   82.7ms    0.1%  24.2μs   1.48GiB    2.5%   455KiB
           Vectors      3.42k   17.5ms    0.0%  5.12μs   10.9MiB    0.0%  3.26KiB
           Bounds       3.42k   2.50ms    0.0%   731ns     0.00B    0.0%    0.00B
       DiffZonotope...  2.28k    10.0s    8.3%  4.40ms   2.29GiB    3.8%  1.03MiB
         Zonotope_D...  4.56k    4.85s    4.0%  1.06ms   1.50GiB    2.5%   346KiB
     Compute Split        570    26.9s   22.4%  47.2ms   8.52GiB   14.2%  15.3MiB
     Property Check       570    633ms    0.5%  1.11ms   65.7MiB    0.1%   118KiB
 Initialize                 1    571μs    0.0%   571μs   5.41MiB    0.0%  5.41MiB
 ────────────────────────────────────────────────────────────────────────────────
[VERYDIFF_TIMER] 120.365689564

[VERYDIFF_EXPERIMENT] NETWORK: /home/i57/steuber/NeuroDiff/repos/VeryDiffExperiments/src/../benchmarks/mnist-prune/specs/mnist_51_global_4.vnnlib
[VERYDIFF_EXPERIMENT] TIME: 120.84857234
