Parsing new_benchmarks/rice-1-retrained/nets/2_20.onnx...
Found input onnx::Gemm_0
op: gemm, weight: (20, 7), bias: (20,)
op: relu, weight: nothing, bias: nothing
op: gemm, weight: (20, 20), bias: (20,)
op: relu, weight: nothing, bias: nothing
op: gemm, weight: (2, 20), bias: (2,)
Parsing new_benchmarks/rice-1-retrained/nets_pruned/2_20-0.1.onnx...
Found input onnx::Gemm_0
op: gemm, weight: (20, 7), bias: (20,)
op: relu, weight: nothing, bias: nothing
op: gemm, weight: (20, 20), bias: (20,)
op: relu, weight: nothing, bias: nothing
op: gemm, weight: (2, 20), bias: (2,)
Distance: 5.347014582133852
Distance: 15.481465053143005
Distance: 1.6484688056618833
Running with 1 threads
[Thread 1] Time to first task: 0.0s
Zono Bounds:
[0.0, 0.0, 0.0, 0.0, 0.0, 0.0, 0.0]
[0.0, 0.0, 0.0, 0.0, 0.0, 0.0, 0.0]
[TOP-1] required confidence (1.0≥0.9) is feasible for index 1
[Thread 1] Processed 100 zonotopes (Work Done: 0.0%; Expected Zonos: Inf)
[Thread 1] Processed 200 zonotopes (Work Done: 0.0%; Expected Zonos: Inf)
[Thread 1] Processed 300 zonotopes (Work Done: 0.0%; Expected Zonos: Inf)
[Thread 1] Processed 400 zonotopes (Work Done: 0.0%; Expected Zonos: Inf)
[Thread 1] Processed 500 zonotopes (Work Done: 0.78125%; Expected Zonos: 64000.0)
[Thread 1] Processed 600 zonotopes (Work Done: 2.34375%; Expected Zonos: 25600.0)
[Thread 1] Processed 700 zonotopes (Work Done: 2.34375%; Expected Zonos: 29866.666666666668)
[Thread 1] Processed 800 zonotopes (Work Done: 2.34375%; Expected Zonos: 34133.333333333336)
Found cex
N1: 0.9368783659948866 (vs. 0.06312163400511345)
N2: 0.06312163400511345
N1 Probability: 0.9368783659948866 >= 0.9

Found counterexample: ([3.6499999999999995, 0.0, 0.20000000000000018, 3.7, -1.1750000000000007, -1.3375000000000004, 0.22499999999999987], (2, 1))
[Thread 1] Total splits: 864
Processed 868 zonotopes (Work Done: 2.3%); Generated 1728 (0.0022301332004608294s/loop)
[Thread 1] Finished in 1.94s
 ────────────────────────────────────────────────────────────────────────────────
                                        Time                    Allocations      
                               ───────────────────────   ────────────────────────
       Tot / % measured:            1.94s / 100.0%            446MiB / 100.0%    

 Section               ncalls     time    %tot     avg     alloc    %tot      avg
 ────────────────────────────────────────────────────────────────────────────────
 Verify                     1    1.94s  100.0%   1.94s    446MiB  100.0%   446MiB
   Zonotope Loop            1    1.94s  100.0%   1.94s    446MiB  100.0%   446MiB
     Property Check       868    1.86s   96.3%  2.15ms    351MiB   78.8%   415KiB
     Zonotope Propa...    868   55.1ms    2.8%  63.5μs   83.3MiB   18.7%  98.3KiB
       DiffZonotope...  1.74k   41.4ms    2.1%  23.9μs   70.8MiB   15.9%  41.8KiB
         Zonotope_R...  3.47k   36.9ms    1.9%  10.6μs   66.9MiB   15.0%  19.7KiB
           Influenc...  3.47k   14.3ms    0.7%  4.12μs   22.7MiB    5.1%  6.69KiB
             Multiply   3.47k   9.91ms    0.5%  2.85μs   15.9MiB    3.6%  4.68KiB
             Alloca...  3.47k   1.86ms    0.1%   534ns   6.81MiB    1.5%  2.01KiB
             Set Ma...  3.47k    876μs    0.0%   252ns     0.00B    0.0%    0.00B
           Column M...  3.47k   6.51ms    0.3%  1.87μs   19.1MiB    4.3%  5.63KiB
           Set Matrix   3.47k   5.78ms    0.3%  1.67μs   2.32MiB    0.5%     702B
           Vectors      3.47k   4.26ms    0.2%  1.23μs   4.03MiB    0.9%  1.19KiB
           Allocation   3.47k   2.84ms    0.1%   818ns   18.6MiB    4.2%  5.50KiB
           Bounds       3.47k    549μs    0.0%   158ns     0.00B    0.0%    0.00B
       DiffZonotope...  2.60k   10.3ms    0.5%  3.95μs   12.3MiB    2.8%  4.85KiB
         Zonotope_D...  5.21k   9.50ms    0.5%  1.82μs   12.2MiB    2.7%  2.39KiB
     Compute Split        864   12.8ms    0.7%  14.8μs   9.07MiB    2.0%  10.7KiB
 Initialize                 1   30.2μs    0.0%  30.2μs   9.70KiB    0.0%  9.70KiB
 ────────────────────────────────────────────────────────────────────────────────[VERYDIFF_TIMER] 1.93722736
