
[VERYDIFF_EXPERIMENT] Running on /home/i57/steuber/NeuroDiff/repos/VeryDiffExperiments/src/../benchmarks/mnist-prune/specs/mnist_44_global_3.vnnlib /home/i57/steuber/NeuroDiff/repos/VeryDiffExperiments/src/../benchmarks/mnist-prune/nets/mnist_relu_4_1024.onnx
Found input X
op: matmul, weight: (1024, 784), bias: nothing
op: bias, weight: nothing, bias: (1024,)
op: relu, weight: nothing, bias: nothing
op: matmul, weight: (1024, 1024), bias: nothing
op: bias, weight: nothing, bias: (1024,)
op: relu, weight: nothing, bias: nothing
op: matmul, weight: (1024, 1024), bias: nothing
op: bias, weight: nothing, bias: (1024,)
op: relu, weight: nothing, bias: nothing
op: matmul, weight: (10, 1024), bias: nothing
op: bias, weight: nothing, bias: (10,)
op: relu, weight: nothing, bias: nothing
op: matmul, weight: (10, 10), bias: nothing
op: bias, weight: nothing, bias: (10,)
Found input X
op: gemm, weight: (1024, 784), bias: (1024,)
op: relu, weight: nothing, bias: nothing
op: gemm, weight: (1024, 1024), bias: (1024,)
op: relu, weight: nothing, bias: nothing
op: gemm, weight: (1024, 1024), bias: (1024,)
op: relu, weight: nothing, bias: nothing
op: gemm, weight: (10, 1024), bias: (10,)
op: relu, weight: nothing, bias: nothing
op: gemm, weight: (10, 10), bias: (10,)
Distance: 915.6394868631054
Distance: 1298.7052820973968
Distance: 1296.587532894263
Distance: 6.054483317080667
Distance: 0.04942679278974538
Running with 1 threads
[Thread 1] Time to first task: 0.01s
Instable Generators: 238
Instable Generators: 365
Instable Generators: 671
Instable Generators: 6
Zono Bounds:
[-0.0029337234662777005, -19.96006353278217, -22.591356267090884, -20.996715383513493, -21.6371957930445, -22.723072656117807, -0.002102193919375459, -21.335143607057468, -21.63069742730683, -22.305827909831706]
[0.005718284902379908, 20.238091733406574, 22.09912860783214, 21.68346621825479, 21.634990101077673, 22.67067397323182, 0.0061129638496641705, 20.69376872440349, 21.68666762649543, 22.206964676553817]


TIMEOUT REACHED
UNKNOWN
[Thread 1] Total splits: 66
Processed 66 zonotopes (Work Done: 0.0%); Generated 132 (1.8393868309090908s/loop)
[Thread 1] Finished in 121.4s
 ────────────────────────────────────────────────────────────────────────────────
                                        Time                    Allocations      
                               ───────────────────────   ────────────────────────
       Tot / % measured:             121s / 100.0%           34.0GiB / 100.0%    

 Section               ncalls     time    %tot     avg     alloc    %tot      avg
 ────────────────────────────────────────────────────────────────────────────────
 Verify                     1     121s  100.0%    121s   34.0GiB   99.9%  34.0GiB
   Zonotope Loop            1     121s  100.0%    121s   34.0GiB   99.9%  34.0GiB
     Zonotope Propa...     66     119s   98.1%   1.81s   30.7GiB   90.4%   477MiB
       DiffZonotope...    264    63.0s   51.9%   239ms   25.0GiB   73.5%  97.0MiB
         Zonotope_R...    528    48.2s   39.7%  91.3ms   20.5GiB   60.3%  39.8MiB
           Influenc...    528    35.8s   29.5%  67.7ms   11.5GiB   33.8%  22.3MiB
             Multiply     528    28.2s   23.3%  53.5ms   6.48GiB   19.0%  12.6MiB
             Alloca...    528    6.73s    5.5%  12.8ms   5.02GiB   14.7%  9.73MiB
             Set Ma...    528    785ms    0.6%  1.49ms     0.00B    0.0%    0.00B
           Column M...    528    10.1s    8.3%  19.2ms   4.50GiB   13.2%  8.73MiB
           Allocation     528    1.52s    1.3%  2.88ms   4.50GiB   13.2%  8.73MiB
           Set Matrix     528    780ms    0.6%  1.48ms   4.46MiB    0.0%  8.65KiB
           Vectors        528   16.2ms    0.0%  30.8μs   17.5MiB    0.1%  34.0KiB
           Bounds         528    402μs    0.0%   761ns     0.00B    0.0%    0.00B
       DiffZonotope...    330    56.1s   46.2%   170ms   5.75GiB   16.9%  17.8MiB
         Zonotope_D...    660    29.9s   24.7%  45.4ms   3.26GiB    9.6%  5.05MiB
     Compute Split         66    1.75s    1.4%  26.5ms   1.92GiB    5.6%  29.8MiB
     Property Check        66    246ms    0.2%  3.73ms   34.3MiB    0.1%   532KiB
 Initialize                 1   15.0ms    0.0%  15.0ms   27.0MiB    0.1%  27.0MiB
 ────────────────────────────────────────────────────────────────────────────────
[VERYDIFF_TIMER] 121.492905714

[VERYDIFF_EXPERIMENT] NETWORK: /home/i57/steuber/NeuroDiff/repos/VeryDiffExperiments/src/../benchmarks/mnist-prune/specs/mnist_44_global_3.vnnlib
[VERYDIFF_EXPERIMENT] TIME: 121.842006884
