
[VERYDIFF_EXPERIMENT] Running on /home/i57/steuber/NeuroDiff/repos/VeryDiffExperiments/src/../benchmarks/mnist-prune/specs/mnist_25_global_5.vnnlib /home/i57/steuber/NeuroDiff/repos/VeryDiffExperiments/src/../benchmarks/mnist-prune/nets/mnist_relu_3_100.onnx
Found input X
op: matmul, weight: (100, 784), bias: nothing
op: bias, weight: nothing, bias: (100,)
op: relu, weight: nothing, bias: nothing
op: matmul, weight: (100, 100), bias: nothing
op: bias, weight: nothing, bias: (100,)
op: relu, weight: nothing, bias: nothing
op: matmul, weight: (10, 100), bias: nothing
op: bias, weight: nothing, bias: (10,)
op: relu, weight: nothing, bias: nothing
op: matmul, weight: (10, 10), bias: nothing
op: bias, weight: nothing, bias: (10,)
Found input X
op: gemm, weight: (100, 784), bias: (100,)
op: relu, weight: nothing, bias: nothing
op: gemm, weight: (100, 100), bias: (100,)
op: relu, weight: nothing, bias: nothing
op: gemm, weight: (10, 100), bias: (10,)
op: relu, weight: nothing, bias: nothing
op: gemm, weight: (10, 10), bias: (10,)
Distance: 1958.4889029213523
Distance: 144.28197153992141
Distance: 22.063573056613677
Distance: 0.8412832540489035
Running with 1 threads
[Thread 1] Time to first task: 0.0s
Instable Generators: 17
Instable Generators: 29
Instable Generators: 2
Zono Bounds:
[-2.296144258629547, -0.016994498330845053, -2.0497026222627825, -0.02010041031249756, -2.7676854321962296, -0.0021813381388375184, -2.825941923074537, 0.028971828250364606, 0.02386354552424841, -2.392580738423781]
[2.326241648792866, -0.009174493896914281, 2.2115012321365093, -0.014568174085240018, 1.8711805534367316, 0.004962796157465819, 2.4500678359726296, 0.04135613722674403, 0.03679658360592043, 2.5280350367463833]
[Thread 1] Processed 100 zonotopes (Work Done: 0.0%; Expected Zonos: Inf)
[Thread 1] Processed 200 zonotopes (Work Done: 0.0%; Expected Zonos: Inf)
[Thread 1] Processed 300 zonotopes (Work Done: 0.0%; Expected Zonos: Inf)
[Thread 1] Processed 400 zonotopes (Work Done: 0.0%; Expected Zonos: Inf)
[Thread 1] Processed 500 zonotopes (Work Done: 0.0%; Expected Zonos: Inf)


TIMEOUT REACHED
UNKNOWN
[Thread 1] Total splits: 587
Processed 587 zonotopes (Work Done: 0.0%); Generated 1174 (0.20465569012436116s/loop)
[Thread 1] Finished in 120.13s
 ────────────────────────────────────────────────────────────────────────────────
                                        Time                    Allocations      
                               ───────────────────────   ────────────────────────
       Tot / % measured:             120s / 100.0%           60.5GiB / 100.0%    

 Section               ncalls     time    %tot     avg     alloc    %tot      avg
 ────────────────────────────────────────────────────────────────────────────────
 Verify                     1     120s  100.0%    120s   60.5GiB  100.0%  60.5GiB
   Zonotope Loop            1     120s  100.0%    120s   60.5GiB  100.0%  60.5GiB
     Zonotope Propa...    587    70.5s   58.7%   120ms   40.4GiB   66.7%  70.4MiB
       DiffZonotope...  1.76k    57.7s   48.0%  32.7ms   38.0GiB   62.9%  22.1MiB
         Zonotope_R...  3.52k    57.2s   47.6%  16.2ms   37.2GiB   61.4%  10.8MiB
           Influenc...  3.52k    56.4s   47.0%  16.0ms   34.2GiB   56.4%  9.93MiB
             Alloca...  3.52k    29.1s   24.2%  8.26ms   16.9GiB   27.9%  4.92MiB
             Multiply   3.52k    24.9s   20.7%  7.07ms   17.2GiB   28.5%  5.01MiB
             Set Ma...  3.52k    2.42s    2.0%   689μs     0.00B    0.0%    0.00B
           Column M...  3.52k    482ms    0.4%   137μs   1.50GiB    2.5%   447KiB
           Set Matrix   3.52k    185ms    0.2%  52.6μs   2.34MiB    0.0%     695B
           Allocation   3.52k   79.2ms    0.1%  22.5μs   1.50GiB    2.5%   447KiB
           Vectors      3.52k   17.4ms    0.0%  4.95μs   11.2MiB    0.0%  3.26KiB
           Bounds       3.52k   2.49ms    0.0%   706ns     0.00B    0.0%    0.00B
       DiffZonotope...  2.35k    12.8s   10.7%  5.47ms   2.33GiB    3.8%  1.02MiB
         Zonotope_D...  4.70k    7.58s    6.3%  1.61ms   1.54GiB    2.5%   343KiB
     Compute Split        587    6.97s    5.8%  11.9ms   8.60GiB   14.2%  15.0MiB
     Property Check       587    115ms    0.1%   196μs    118MiB    0.2%   206KiB
 Initialize                 1    532μs    0.0%   532μs   5.41MiB    0.0%  5.41MiB
 ────────────────────────────────────────────────────────────────────────────────
[VERYDIFF_TIMER] 120.164581242

[VERYDIFF_EXPERIMENT] NETWORK: /home/i57/steuber/NeuroDiff/repos/VeryDiffExperiments/src/../benchmarks/mnist-prune/specs/mnist_25_global_5.vnnlib
[VERYDIFF_EXPERIMENT] TIME: 120.629825329
