
[VERYDIFF_EXPERIMENT] Running on /home/i57/steuber/NeuroDiff/repos/VeryDiffExperiments/src/../benchmarks/mnist-prune/specs/mnist_66_local_15.vnnlib /home/i57/steuber/NeuroDiff/repos/VeryDiffExperiments/src/../benchmarks/mnist-prune/nets/mnist_relu_3_100.onnx
Total difference: 419.1098
Average difference: 0.0047
Initial output delta:
[-1.052505 -0.960763 -1.302346 -1.188732 -1.241196 -1.268629 -1.323680 -1.313977 -0.990776 -1.171433 ]
[1.090470 1.156854 1.225795 1.266315 1.227320 1.235387 1.285761 1.345091 1.131604 1.341212 ]

No adv!
time: 1.838425 


numSplits: 6
setenv(`timeout -k 5 120 ../NeuroDiff/DiffNN-Code/delta_network_test 466 /home/i57/steuber/NeuroDiff/repos/VeryDiffExperiments/src/../benchmarks/mnist-prune/nets/mnist_relu_3_100.nnet /home/i57/steuber/NeuroDiff/repos/VeryDiffExperiments/src/../benchmarks/mnist-prune/nets_pruned/mnist_relu_3_100_0.79_adam_1_stepsize.nnet 1.0 -x 15`,["OMP_NUM_THREADS=1"])
[VERYDIFF_TIMER] 1.901763163

[VERYDIFF_EXPERIMENT] NETWORK: /home/i57/steuber/NeuroDiff/repos/VeryDiffExperiments/src/../benchmarks/mnist-prune/specs/mnist_66_local_15.vnnlib
[VERYDIFF_EXPERIMENT] TIME: 2.131441645
