
[VERYDIFF_EXPERIMENT] Running on /home/i57/steuber/NeuroDiff/repos/VeryDiffExperiments/src/../benchmarks/mnist-prune/specs/mnist_41_global_5.vnnlib /home/i57/steuber/NeuroDiff/repos/VeryDiffExperiments/src/../benchmarks/mnist-prune/nets/mnist_relu_3_100.onnx
Found input X
op: matmul, weight: (100, 784), bias: nothing
op: bias, weight: nothing, bias: (100,)
op: relu, weight: nothing, bias: nothing
op: matmul, weight: (100, 100), bias: nothing
op: bias, weight: nothing, bias: (100,)
op: relu, weight: nothing, bias: nothing
op: matmul, weight: (10, 100), bias: nothing
op: bias, weight: nothing, bias: (10,)
op: relu, weight: nothing, bias: nothing
op: matmul, weight: (10, 10), bias: nothing
op: bias, weight: nothing, bias: (10,)
Found input X
op: gemm, weight: (100, 784), bias: (100,)
op: relu, weight: nothing, bias: nothing
op: gemm, weight: (100, 100), bias: (100,)
op: relu, weight: nothing, bias: nothing
op: gemm, weight: (10, 100), bias: (10,)
op: relu, weight: nothing, bias: nothing
op: gemm, weight: (10, 10), bias: (10,)
Distance: 368.62397500800625
Distance: 47.56803950402309
Distance: 2.8977568827249343
Distance: 0.01885471428334995
Running with 1 threads
[Thread 1] Time to first task: 0.0s
Instable Generators: 41
Instable Generators: 50
Instable Generators: 5
Zono Bounds:
[0.00015039590114873766, -1.2536208991741407, -1.317604614005276, -1.2184844661814644, -0.0006053868388610492, -1.4382401344702433, 5.3452112448159456e-5, -1.3302016979385465, -1.2818159263599607, -1.2800240314558722]
[0.0007351939990640181, 1.253524715182302, 1.3181056280698737, 1.2757321304770357, 0.0011392526393722308, 1.2942588913844775, 0.0007011851971530165, 1.4039693360270038, 1.2793767963009537, 1.2365158147520003]
[Thread 1] Processed 100 zonotopes (Work Done: 0.0%; Expected Zonos: Inf)
[Thread 1] Processed 200 zonotopes (Work Done: 0.0%; Expected Zonos: Inf)
[Thread 1] Processed 300 zonotopes (Work Done: 0.0%; Expected Zonos: Inf)
[Thread 1] Processed 400 zonotopes (Work Done: 0.0%; Expected Zonos: Inf)
[Thread 1] Processed 500 zonotopes (Work Done: 0.0%; Expected Zonos: Inf)


TIMEOUT REACHED
UNKNOWN
[Thread 1] Total splits: 571
Processed 571 zonotopes (Work Done: 0.0%); Generated 1142 (0.21021986041330998s/loop)
[Thread 1] Finished in 120.04s
 ────────────────────────────────────────────────────────────────────────────────
                                        Time                    Allocations      
                               ───────────────────────   ────────────────────────
       Tot / % measured:             120s / 100.0%           61.2GiB / 100.0%    

 Section               ncalls     time    %tot     avg     alloc    %tot      avg
 ────────────────────────────────────────────────────────────────────────────────
 Verify                     1     120s  100.0%    120s   61.2GiB  100.0%  61.2GiB
   Zonotope Loop            1     120s  100.0%    120s   61.2GiB  100.0%  61.2GiB
     Zonotope Propa...    571    71.9s   59.9%   126ms   41.4GiB   67.6%  74.2MiB
       DiffZonotope...  1.71k    61.8s   51.5%  36.1ms   39.0GiB   63.7%  23.3MiB
         Zonotope_R...  3.43k    61.3s   51.1%  17.9ms   38.1GiB   62.2%  11.4MiB
           Influenc...  3.43k    53.5s   44.6%  15.6ms   35.0GiB   57.2%  10.5MiB
             Alloca...  3.43k    26.0s   21.7%  7.59ms   17.2GiB   28.1%  5.14MiB
             Multiply   3.43k    25.0s   20.8%  7.30ms   17.8GiB   29.1%  5.33MiB
             Set Ma...  3.43k    2.49s    2.1%   728μs     0.00B    0.0%    0.00B
           Allocation   3.43k    7.08s    5.9%  2.07ms   1.52GiB    2.5%   465KiB
           Column M...  3.43k    469ms    0.4%   137μs   1.52GiB    2.5%   465KiB
           Set Matrix   3.43k    192ms    0.2%  56.0μs   3.56MiB    0.0%  1.06KiB
           Vectors      3.43k   18.0ms    0.0%  5.24μs   10.9MiB    0.0%  3.26KiB
           Bounds       3.43k   2.30ms    0.0%   672ns     0.00B    0.0%    0.00B
       DiffZonotope...  2.28k    10.1s    8.4%  4.40ms   2.33GiB    3.8%  1.05MiB
         Zonotope_D...  4.57k    4.86s    4.0%  1.06ms   1.52GiB    2.5%   350KiB
     Compute Split        571    31.7s   26.4%  55.5ms   8.68GiB   14.2%  15.6MiB
     Property Check       571    629ms    0.5%  1.10ms   66.1MiB    0.1%   118KiB
 Initialize                 1    543μs    0.0%   543μs   5.41MiB    0.0%  5.41MiB
 ────────────────────────────────────────────────────────────────────────────────
[VERYDIFF_TIMER] 120.068067992

[VERYDIFF_EXPERIMENT] NETWORK: /home/i57/steuber/NeuroDiff/repos/VeryDiffExperiments/src/../benchmarks/mnist-prune/specs/mnist_41_global_5.vnnlib
[VERYDIFF_EXPERIMENT] TIME: 120.533115629
