
[VERYDIFF_EXPERIMENT] Running on /home/i57/steuber/NeuroDiff/repos/VeryDiffExperiments/src/../benchmarks/mnist-prune/specs/mnist_20_local_18.vnnlib /home/i57/steuber/NeuroDiff/repos/VeryDiffExperiments/src/../benchmarks/mnist-prune/nets/mnist_relu_2_512.onnx
Found input X
op: matmul, weight: (512, 784), bias: nothing
op: bias, weight: nothing, bias: (512,)
op: relu, weight: nothing, bias: nothing
op: matmul, weight: (512, 512), bias: nothing
op: bias, weight: nothing, bias: (512,)
op: relu, weight: nothing, bias: nothing
op: matmul, weight: (10, 512), bias: nothing
op: bias, weight: nothing, bias: (10,)
Found input X
op: matmul, weight: (512, 784), bias: nothing
op: bias, weight: nothing, bias: (512,)
op: relu, weight: nothing, bias: nothing
op: matmul, weight: (512, 512), bias: nothing
op: bias, weight: nothing, bias: (512,)
op: relu, weight: nothing, bias: nothing
op: matmul, weight: (10, 512), bias: nothing
op: bias, weight: nothing, bias: (10,)
Distance: 1085.5985166831802
Distance: 1719.8468985003963
Distance: 31.228482716001736
Running with 1 threads
[Thread 1] Time to first task: 0.0s
Instable Generators: 124
Instable Generators: 356
Zono Bounds:
[-8.099377894397449, -7.852614680994025, -8.722451827748355, -8.005780166621452, -10.671685542356245, -9.475640752452122, -10.457794287364667, -9.438013977047108, -4.017859422256293, -7.3346482506265565]
[21.925423576860197, 20.028755195128078, 16.985233070335727, 17.477212075386017, 16.208344002460443, 13.622444798233445, 16.547025168915933, 15.286338194006627, 16.21711225297156, 13.851914178069777]
[Thread 1] Processed 100 zonotopes (Work Done: 0.0%; Expected Zonos: Inf)
[Thread 1] Processed 200 zonotopes (Work Done: 0.0%; Expected Zonos: Inf)
[Thread 1] Processed 300 zonotopes (Work Done: 0.0%; Expected Zonos: Inf)
[Thread 1] Processed 400 zonotopes (Work Done: 0.0%; Expected Zonos: Inf)
[Thread 1] Processed 500 zonotopes (Work Done: 0.0%; Expected Zonos: Inf)
[Thread 1] Processed 600 zonotopes (Work Done: 0.0%; Expected Zonos: Inf)
[Thread 1] Processed 700 zonotopes (Work Done: 0.0%; Expected Zonos: Inf)
[Thread 1] Processed 800 zonotopes (Work Done: 0.0%; Expected Zonos: Inf)
[Thread 1] Processed 900 zonotopes (Work Done: 0.0%; Expected Zonos: Inf)
[Thread 1] Processed 1000 zonotopes (Work Done: 0.0%; Expected Zonos: Inf)
[Thread 1] Processed 1100 zonotopes (Work Done: 0.0%; Expected Zonos: Inf)
[Thread 1] Processed 1200 zonotopes (Work Done: 0.0%; Expected Zonos: Inf)
[Thread 1] Processed 1300 zonotopes (Work Done: 0.0%; Expected Zonos: Inf)
[Thread 1] Processed 1400 zonotopes (Work Done: 0.0%; Expected Zonos: Inf)
[Thread 1] Processed 1500 zonotopes (Work Done: 0.0%; Expected Zonos: Inf)
[Thread 1] Processed 1600 zonotopes (Work Done: 0.0%; Expected Zonos: Inf)
[Thread 1] Processed 1700 zonotopes (Work Done: 0.0%; Expected Zonos: Inf)
[Thread 1] Processed 1800 zonotopes (Work Done: 0.0%; Expected Zonos: Inf)
[Thread 1] Processed 1900 zonotopes (Work Done: 0.0%; Expected Zonos: Inf)
[Thread 1] Processed 2000 zonotopes (Work Done: 0.0%; Expected Zonos: Inf)
[Thread 1] Processed 2100 zonotopes (Work Done: 0.0%; Expected Zonos: Inf)
[Thread 1] Processed 2200 zonotopes (Work Done: 0.0%; Expected Zonos: Inf)
[Thread 1] Processed 2300 zonotopes (Work Done: 0.0%; Expected Zonos: Inf)
[Thread 1] Processed 2400 zonotopes (Work Done: 0.0%; Expected Zonos: Inf)
[Thread 1] Processed 2500 zonotopes (Work Done: 0.0%; Expected Zonos: Inf)
[Thread 1] Processed 2600 zonotopes (Work Done: 0.0%; Expected Zonos: Inf)
[Thread 1] Processed 2700 zonotopes (Work Done: 0.0%; Expected Zonos: Inf)
[Thread 1] Processed 2800 zonotopes (Work Done: 0.0%; Expected Zonos: Inf)
[Thread 1] Processed 2900 zonotopes (Work Done: 0.0%; Expected Zonos: Inf)
[Thread 1] Processed 3000 zonotopes (Work Done: 0.0%; Expected Zonos: Inf)
[Thread 1] Processed 3100 zonotopes (Work Done: 0.0%; Expected Zonos: Inf)
[Thread 1] Processed 3200 zonotopes (Work Done: 0.0%; Expected Zonos: Inf)
[Thread 1] Processed 3300 zonotopes (Work Done: 0.0%; Expected Zonos: Inf)
[Thread 1] Processed 3400 zonotopes (Work Done: 0.0%; Expected Zonos: Inf)
[Thread 1] Processed 3500 zonotopes (Work Done: 0.0%; Expected Zonos: Inf)
[Thread 1] Processed 3600 zonotopes (Work Done: 0.0%; Expected Zonos: Inf)
[Thread 1] Processed 3700 zonotopes (Work Done: 0.0%; Expected Zonos: Inf)
[Thread 1] Processed 3800 zonotopes (Work Done: 0.0%; Expected Zonos: Inf)
[Thread 1] Processed 3900 zonotopes (Work Done: 0.0%; Expected Zonos: Inf)
[Thread 1] Processed 4000 zonotopes (Work Done: 0.0%; Expected Zonos: Inf)
[Thread 1] Processed 4100 zonotopes (Work Done: 0.0%; Expected Zonos: Inf)
[Thread 1] Processed 4200 zonotopes (Work Done: 0.0%; Expected Zonos: Inf)
[Thread 1] Processed 4300 zonotopes (Work Done: 0.0%; Expected Zonos: Inf)
[Thread 1] Processed 4400 zonotopes (Work Done: 0.0%; Expected Zonos: Inf)
[Thread 1] Processed 4500 zonotopes (Work Done: 0.0%; Expected Zonos: Inf)
[Thread 1] Processed 4600 zonotopes (Work Done: 0.0%; Expected Zonos: Inf)
[Thread 1] Processed 4700 zonotopes (Work Done: 0.0%; Expected Zonos: Inf)
[Thread 1] Processed 4800 zonotopes (Work Done: 0.0%; Expected Zonos: Inf)
[Thread 1] Processed 4900 zonotopes (Work Done: 0.0%; Expected Zonos: Inf)
[Thread 1] Processed 5000 zonotopes (Work Done: 0.0%; Expected Zonos: Inf)
[Thread 1] Processed 5100 zonotopes (Work Done: 0.0%; Expected Zonos: Inf)
[Thread 1] Processed 5200 zonotopes (Work Done: 0.0%; Expected Zonos: Inf)
[Thread 1] Processed 5300 zonotopes (Work Done: 0.0%; Expected Zonos: Inf)
[Thread 1] Processed 5400 zonotopes (Work Done: 0.0%; Expected Zonos: Inf)
[Thread 1] Processed 5500 zonotopes (Work Done: 0.0%; Expected Zonos: Inf)
[Thread 1] Processed 5600 zonotopes (Work Done: 0.0%; Expected Zonos: Inf)


TIMEOUT REACHED
UNKNOWN
[Thread 1] Total splits: 5610
Processed 5610 zonotopes (Work Done: 0.0%); Generated 11220 (0.0213935871714795s/loop)
[Thread 1] Finished in 120.02s
 ────────────────────────────────────────────────────────────────────────────────
                                        Time                    Allocations      
                               ───────────────────────   ────────────────────────
       Tot / % measured:             120s / 100.0%           82.9GiB / 100.0%    

 Section               ncalls     time    %tot     avg     alloc    %tot      avg
 ────────────────────────────────────────────────────────────────────────────────
 Verify                     1     120s  100.0%    120s   82.9GiB  100.0%  82.9GiB
   Zonotope Loop            1     120s  100.0%    120s   82.9GiB  100.0%  82.9GiB
     Zonotope Propa...  5.61k     104s   86.8%  18.6ms   75.9GiB   91.6%  13.9MiB
       DiffZonotope...  16.8k    80.2s   66.8%  4.77ms   11.8GiB   14.3%   738KiB
         Zonotope_D...  33.7k    31.4s   26.1%   932μs   5.48GiB    6.6%   171KiB
       DiffZonotope...  11.2k    23.9s   19.9%  2.13ms   64.1GiB   77.3%  5.85MiB
         Zonotope_R...  22.4k    11.4s    9.5%   507μs   37.9GiB   45.7%  1.73MiB
           Column M...  22.4k    5.71s    4.8%   254μs   17.1GiB   20.7%   800KiB
           Allocation   22.4k    2.06s    1.7%  91.6μs   17.1GiB   20.7%   800KiB
           Influenc...  22.4k    1.90s    1.6%  84.6μs   3.05GiB    3.7%   142KiB
             Multiply   22.4k    1.66s    1.4%  73.9μs   2.44GiB    2.9%   114KiB
             Alloca...  22.4k    183ms    0.2%  8.14μs    619MiB    0.7%  28.2KiB
             Set Ma...  22.4k   33.2ms    0.0%  1.48μs     0.00B    0.0%    0.00B
           Set Matrix   22.4k    1.13s    0.9%  50.2μs   92.0MiB    0.1%  4.20KiB
           Vectors      22.4k    537ms    0.4%  23.9μs    547MiB    0.6%  25.0KiB
           Bounds       22.4k   12.5ms    0.0%   559ns     0.00B    0.0%    0.00B
     Property Check     5.61k    13.6s   11.3%  2.42ms   1.05GiB    1.3%   196KiB
     Compute Split      5.61k    860ms    0.7%   153μs   1.40GiB    1.7%   262KiB
 Initialize                 1   1.96ms    0.0%  1.96ms   5.24MiB    0.0%  5.24MiB
 ────────────────────────────────────────────────────────────────────────────────
[VERYDIFF_TIMER] 120.054156949

[VERYDIFF_EXPERIMENT] Running on /home/i57/steuber/NeuroDiff/repos/VeryDiffExperiments/src/../benchmarks/mnist-prune/specs/mnist_20_local_18.vnnlib /home/i57/steuber/NeuroDiff/repos/VeryDiffExperiments/src/../benchmarks/mnist-prune/nets/mnist_relu_3_100.onnx
Found input X
op: matmul, weight: (100, 784), bias: nothing
op: bias, weight: nothing, bias: (100,)
op: relu, weight: nothing, bias: nothing
op: matmul, weight: (100, 100), bias: nothing
op: bias, weight: nothing, bias: (100,)
op: relu, weight: nothing, bias: nothing
op: matmul, weight: (10, 100), bias: nothing
op: bias, weight: nothing, bias: (10,)
op: relu, weight: nothing, bias: nothing
op: matmul, weight: (10, 10), bias: nothing
op: bias, weight: nothing, bias: (10,)
Found input X
op: matmul, weight: (100, 784), bias: nothing
op: bias, weight: nothing, bias: (100,)
op: relu, weight: nothing, bias: nothing
op: matmul, weight: (100, 100), bias: nothing
op: bias, weight: nothing, bias: (100,)
op: relu, weight: nothing, bias: nothing
op: matmul, weight: (10, 100), bias: nothing
op: bias, weight: nothing, bias: (10,)
op: relu, weight: nothing, bias: nothing
op: matmul, weight: (10, 10), bias: nothing
op: bias, weight: nothing, bias: (10,)
Distance: 296.6600370998244
Distance: 77.24290861755458
Distance: 5.7170369567975285
Distance: 0.0
Running with 1 threads
[Thread 1] Time to first task: 0.0s
Instable Generators: 28
Instable Generators: 43
Instable Generators: 6
Zono Bounds:
[-0.5693310245565235, -0.6965493836622936, 0.0, -0.701270130658851, -0.7220878015780752, -1.3192923081710424, 0.0, -0.2210332904230783, -0.871724340210888, -0.3869480005755226]
[0.3340288031360096, 0.6965493836622936, 0.0, 0.701270130658851, 0.6836930438164657, 0.5115792726700783, 0.0, 1.1127958253011196, 0.8717243402108877, 0.6574855511888991]
[Thread 1] Total splits: 0
Processed 1 zonotopes (Work Done: 100.0%); Generated 0 (0.00168874s/loop)
[Thread 1] Finished in 0.0s
 ────────────────────────────────────────────────────────────────────────────────
                                        Time                    Allocations      
                               ───────────────────────   ────────────────────────
       Tot / % measured:           2.07ms /  99.8%           2.97MiB /  99.9%    

 Section               ncalls     time    %tot     avg     alloc    %tot      avg
 ────────────────────────────────────────────────────────────────────────────────
 Verify                     1   1.71ms   82.7%  1.71ms   2.14MiB   72.3%  2.14MiB
   Zonotope Loop            1   1.69ms   81.7%  1.69ms   2.14MiB   72.2%  2.14MiB
     Zonotope Propa...      1   1.56ms   75.5%  1.56ms   1.30MiB   43.9%  1.30MiB
       DiffZonotope...      4   1.04ms   50.4%   261μs    277KiB    9.1%  69.3KiB
         Zonotope_D...      8    449μs   21.7%  56.1μs    140KiB    4.6%  17.5KiB
       DiffZonotope...      3    509μs   24.6%   170μs   1.03MiB   34.7%   351KiB
         Zonotope_R...      6    241μs   11.7%  40.2μs    681KiB   22.5%   114KiB
           Influenc...      6   89.4μs    4.3%  14.9μs    189KiB    6.2%  31.4KiB
             Multiply       6   64.4μs    3.1%  10.7μs    119KiB    3.9%  19.9KiB
             Alloca...      6   13.8μs    0.7%  2.29μs   67.0KiB    2.2%  11.2KiB
             Set Ma...      6   6.35μs    0.3%  1.06μs     0.00B    0.0%    0.00B
           Column M...      6   77.6μs    3.8%  12.9μs    232KiB    7.6%  38.6KiB
           Set Matrix       6   26.3μs    1.3%  4.38μs   5.62KiB    0.2%     960B
           Allocation       6   19.7μs    1.0%  3.28μs    231KiB    7.6%  38.6KiB
           Vectors          6   18.9μs    0.9%  3.14μs   19.5KiB    0.6%  3.26KiB
           Bounds           6   1.83μs    0.1%   306ns     0.00B    0.0%    0.00B
     Property Check         1   3.71μs    0.2%  3.71μs      992B    0.0%     992B
 Initialize                 1    357μs   17.3%   357μs    839KiB   27.7%   839KiB
 ────────────────────────────────────────────────────────────────────────────────
[VERYDIFF_TIMER] 0.047049429

[VERYDIFF_EXPERIMENT] Running on /home/i57/steuber/NeuroDiff/repos/VeryDiffExperiments/src/../benchmarks/mnist-prune/specs/mnist_20_local_18.vnnlib /home/i57/steuber/NeuroDiff/repos/VeryDiffExperiments/src/../benchmarks/mnist-prune/nets/mnist_relu_4_1024.onnx
Found input X
op: matmul, weight: (1024, 784), bias: nothing
op: bias, weight: nothing, bias: (1024,)
op: relu, weight: nothing, bias: nothing
op: matmul, weight: (1024, 1024), bias: nothing
op: bias, weight: nothing, bias: (1024,)
op: relu, weight: nothing, bias: nothing
op: matmul, weight: (1024, 1024), bias: nothing
op: bias, weight: nothing, bias: (1024,)
op: relu, weight: nothing, bias: nothing
op: matmul, weight: (10, 1024), bias: nothing
op: bias, weight: nothing, bias: (10,)
op: relu, weight: nothing, bias: nothing
op: matmul, weight: (10, 10), bias: nothing
op: bias, weight: nothing, bias: (10,)
Found input X
op: matmul, weight: (1024, 784), bias: nothing
op: bias, weight: nothing, bias: (1024,)
op: relu, weight: nothing, bias: nothing
op: matmul, weight: (1024, 1024), bias: nothing
op: bias, weight: nothing, bias: (1024,)
op: relu, weight: nothing, bias: nothing
op: matmul, weight: (1024, 1024), bias: nothing
op: bias, weight: nothing, bias: (1024,)
op: relu, weight: nothing, bias: nothing
op: matmul, weight: (10, 1024), bias: nothing
op: bias, weight: nothing, bias: (10,)
op: relu, weight: nothing, bias: nothing
op: matmul, weight: (10, 10), bias: nothing
op: bias, weight: nothing, bias: (10,)
Distance: 1266.8815759184893
Distance: 2876.6944248261216
Distance: 2831.8843567411013
Distance: 34.033756025192815
Distance: 0.0
Running with 1 threads
[Thread 1] Time to first task: 0.0s
Instable Generators: 355
Instable Generators: 647
Instable Generators: 973
Instable Generators: 10
Zono Bounds:
[-71.28716336482375, -72.24672286075432, -81.29101887960536, -80.8607579646453, -76.93198439877888, -81.46543876617494, -74.7180389645473, -77.12147798720741, -77.02003969074347, -83.65666196358967]
[71.28716336482378, 72.24672286075432, 77.85592191603888, 80.8607579646453, 76.93198439877888, 79.3198725592649, 69.47893574082764, 77.12147798720741, 76.72053885717959, 83.65666196358967]

Found counterexample: ([0.0, 0.0, 0.0, 0.0, 0.0, 0.0, 0.0, 0.0, 0.0, 0.0, 0.0, 0.0, 0.0, 1.0, 0.0, 0.0, 0.0, 0.0, 0.0, 0.0, 0.0, 0.0, 0.0, 0.0, 0.0, 0.0, 0.0, 0.0, 0.0, 0.0, 0.0, 0.0, 0.0, 0.0, 0.0, 0.0, 0.0, 0.0, 0.0, 0.0, 0.0, 0.0, 0.0, 0.0, 0.0, 0.0, 0.0, 0.0, 0.0, 0.0, 0.0, 0.0, 0.0, 0.0, 0.0, 0.0, 0.0, 0.0, 0.0, 0.0, 0.0, 0.0, 0.0, 0.0, 0.0, 0.0, 0.0, 0.0, 0.0, 0.0, 0.0, 0.0, 0.0, 0.0, 0.0, 0.0, 0.0, 0.0, 0.0, 0.0, 0.0, 0.0, 0.0, 0.0, 0.0, 0.0, 0.0, 0.0, 0.0, 0.0, 0.0, 0.0, 0.0, 0.0, 0.0, 0.0, 0.0, 0.0, 0.0, 0.0, 0.0, 0.0, 0.0, 0.0, 0.0, 0.0, 0.0, 0.0, 0.0, 0.0, 0.0, 0.0, 0.0, 0.0, 1.0, 0.0, 0.0, 0.0, 0.0, 0.0, 0.0, 0.0, 0.0, 0.0, 0.0, 0.0, 0.0, 0.0, 0.0, 0.0, 0.0, 0.0, 0.0, 0.0, 0.0, 0.0, 0.0, 0.0, 0.0, 0.0, 0.0, 0.0, 0.0, 0.0, 0.0, 0.0, 0.0, 0.0, 0.0, 0.0, 0.0, 0.0, 0.0, 0.0, 0.0, 0.0, 0.0, 0.0, 0.0, 0.0, 0.0, 0.0, 0.0, 0.0, 0.0, 0.0, 0.0, 0.0, 0.0, 0.0, 0.0, 0.0, 1.0, 0.0, 0.0, 0.0, 0.0, 0.0, 0.0, 0.0, 0.0, 0.0, 0.0, 0.12156863, 0.54901963, 0.75686276, 0.17254902, 0.0, 0.0, 0.0, 0.0, 0.0, 1.0, 0.0, 0.0, 0.0, 0.0, 0.0, 0.0, 0.0, 0.0, 0.0, 1.0, 0.0, 0.0, 0.0, 0.0, 0.0, 0.0, 0.14901961, 0.57254905, 0.94117647, 0.0, 0.99607843, 0.89411765, 0.1882353, 0.3019608, 0.18039216, 0.0, 0.0, 0.0, 0.0, 0.0, 0.0, 0.0, 0.0, 0.0, 0.0, 0.0, 0.0, 0.0, 0.0, 0.0, 0.0, 0.0, 0.00784314, 0.16862746, 0.90196079, 0.99607843, 0.99607843, 0.99607843, 0.99607843, 0.99607843, 0.94509804, 0.99607843, 0.77254903, 0.00784314, 0.0, 0.0, 0.0, 0.0, 0.0, 0.0, 0.0, 0.0, 0.0, 0.0, 0.0, 0.0, 0.0, 0.0, 0.0, 0.08235294, 0.50980395, 0.99607843, 0.99607843, 0.99607843, 0.93725491, 0.98823529, 0.99607843, 0.99607843, 0.99607843, 0.99607843, 0.92941177, 0.01568628, 0.0, 0.0, 0.0, 0.0, 0.0, 0.0, 0.0, 0.0, 0.0, 0.0, 0.0, 0.0, 0.0, 0.0, 0.0, 0.60392159, 0.99607843, 0.99607843, 0.97647059, 0.40784314, 0.27843139, 0.7764706, 0.99607843, 0.99607843, 0.99607843, 0.91764706, 0.22352941, 1.0, 0.0, 0.0, 0.0, 0.0, 0.0, 0.0, 0.0, 0.0, 0.0, 0.0, 0.0, 0.0, 0.0, 0.00784314, 0.67843139, 0.98823529, 0.98823529, 0.80784315, 0.2, 0.47058824, 0.84313726, 0.99607843, 0.99607843, 0.99607843, 0.99607843, 0.72156864, 0.0, 0.0, 0.0, 0.0, 0.0, 0.0, 0.0, 0.0, 0.0, 0.0, 0.0, 0.0, 0.0, 0.0, 0.0, 0.43921569, 0.99607843, 0.99607843, 0.84313726, 0.34117648, 0.96862745, 0.99607843, 0.99607843, 0.99607843, 0.99607843, 0.99607843, 0.8509804, 0.12156863, 0.0, 0.0, 0.0, 0.0, 0.0, 0.0, 0.0, 0.0, 0.0, 0.0, 0.0, 0.0, 0.0, 0.0, 0.01960784, 0.90588236, 0.99607843, 0.99607843, 0.99607843, 0.99607843, 0.99607843, 0.9254902, 0.50196081, 0.76862746, 0.99607843, 1.0, 0.46666667, 0.0, 0.0, 0.0, 0.0, 0.0, 0.0, 0.0, 0.0, 0.0, 0.0, 0.0, 0.0, 0.0, 0.0, 0.0, 0.01176471, 0.77254903, 0.99607843, 0.99607843, 0.96078432, 0.93333334, 0.51372552, 0.06666667, 0.18039216, 0.96862745, 0.99607843, 0.78039217, 0.05490196, 0.0, 0.0, 0.0, 0.0, 0.0, 0.0, 0.0, 0.0, 0.0, 0.0, 0.0, 0.0, 0.0, 0.0, 0.0, 0.0, 0.0627451, 0.36078432, 0.34509805, 0.15686275, 0.0, 0.0, 0.04705882, 0.67843139, 0.99607843, 0.94901961, 0.14901961, 0.0, 0.0, 0.0, 0.0, 0.0, 0.0, 0.0, 0.0, 0.0, 0.0, 0.0, 0.0, 0.0, 0.0, 0.0, 0.0, 0.0, 0.0, 0.0, 0.0, 0.0, 0.0, 0.0, 0.37254903, 0.99607843, 0.99607843, 0.60784316, 0.0, 0.0, 0.0, 0.0, 0.0, 0.0, 0.0, 0.0, 0.0, 0.0, 0.0, 0.0, 0.0, 0.0, 0.0, 0.0, 0.0, 0.0, 0.0, 0.0, 0.0, 0.0, 0.0, 0.07058824, 0.82352942, 0.99607843, 0.88235295, 0.02352941, 0.0, 0.0, 1.0, 0.0, 0.0, 0.0, 0.0, 0.0, 0.0, 0.0, 0.0, 0.0, 0.0, 0.0, 0.0, 0.0, 0.0, 0.0, 0.0, 0.0, 0.0, 0.0, 0.0, 0.77254903, 0.99607843, 0.99607843, 0.3882353, 0.0, 0.0, 0.0, 0.0, 0.0, 0.0, 0.0, 0.0, 0.0, 0.0, 0.0, 1.0, 0.0, 0.0, 0.0, 0.0, 0.0, 0.0, 0.0, 0.0, 0.0, 0.0, 0.0, 0.13333334, 0.94901961, 0.99607843, 0.7019608, 0.01176471, 0.0, 0.0, 0.0, 0.0, 1.0, 0.0, 0.0, 0.0, 0.0, 0.0, 0.0, 0.0, 0.0, 0.0, 0.0, 0.0, 0.0, 0.0, 0.0, 0.0, 0.0, 0.0, 0.10588235, 0.87450981, 0.99607843, 0.88235295, 0.11764706, 0.0, 0.0, 0.0, 0.0, 0.0, 0.0, 0.0, 0.0, 0.0, 0.0, 0.0, 0.0, 0.0, 0.0, 0.0, 0.0, 0.0, 0.0, 0.0, 0.0, 0.0, 0.0, 0.0, 0.3019608, 0.99607843, 1.0, 0.49803922, 0.0, 0.0, 0.0, 0.0, 0.0, 0.0, 0.0, 0.0, 0.0, 0.0, 0.0, 0.0, 0.0, 0.0, 0.0, 0.0, 0.0, 0.0, 0.0, 0.0, 0.0, 0.0, 0.0, 0.21176471, 0.93333334, 0.99607843, 0.97254902, 0.20784314, 0.0, 0.0, 0.0, 0.0, 0.0, 0.0, 0.0, 0.0, 0.0, 0.0, 0.0, 0.0, 0.0, 0.0, 0.0, 0.0, 0.0, 0.0, 0.0, 0.0, 0.0, 0.0, 0.04313726, 0.71764708, 0.99607843, 0.99607843, 0.90588236, 0.16078432, 0.0, 0.0, 0.0, 0.0, 0.0, 0.0, 0.0, 0.0, 0.0, 0.0, 0.0, 0.0, 0.0, 0.0, 0.0, 0.0, 0.0, 0.0, 0.0, 0.0, 0.0, 0.0, 0.44313726, 0.99607843, 0.99607843, 0.90196079, 0.1882353, 0.0, 0.0, 0.0, 1.0, 0.0, 0.0, 0.0, 0.0, 0.0, 1.0, 0.0, 0.0, 0.0, 0.0, 0.0, 0.0, 0.0, 0.0, 0.0, 0.0, 0.0, 0.0, 0.0, 0.43137255, 0.93725491, 0.49411765, 0.09803922, 0.0, 0.0, 0.0, 0.0, 0.0, 0.0, 0.0, 0.0, 0.0, 0.0, 0.0, 0.0, 0.0, 0.0, 0.0, 0.0, 0.0, 0.0, 0.0, 0.0, 0.0, 0.0, 0.0, 0.0, 0.0, 0.0, 0.0, 0.0, 0.0, 0.0, 0.0, 0.0, 0.0, 0.0, 0.0, 0.0, 0.0, 0.0, 0.0, 0.0, 0.0, 0.0, 0.0, 0.0, 0.0, 0.0, 0.0, 0.0, 0.0, 0.0, 0.0, 0.0, 0.0, 0.0, 0.0, 0.0, 0.0, 0.0, 0.0, 0.0, 0.0, 0.0, 0.0, 0.0, 0.0, 0.0, 0.0, 0.0, 0.0, 0.0, 0.0], ([0.0, 12.435758192973518, 0.0, 6.427184036018304, 0.0, 0.0, 0.0, 14.895765912768397, 0.0, 8.949432696885522], [0.799718975977718, 10.59716179769742, 0.0, 5.54970883058928, 0.0, 0.0, 0.0, 11.525785711653793, 0.0, 4.989164072556643], 4.586674286554632))
[Thread 1] Total splits: 0
Processed 1 zonotopes (Work Done: 0.0%); Generated 0 (0.948930262s/loop)
[Thread 1] Finished in 0.95s
 ────────────────────────────────────────────────────────────────────────────────
                                        Time                    Allocations      
                               ───────────────────────   ────────────────────────
       Tot / % measured:            968ms / 100.0%            296MiB / 100.0%    

 Section               ncalls     time    %tot     avg     alloc    %tot      avg
 ────────────────────────────────────────────────────────────────────────────────
 Verify                     1    949ms   98.1%   949ms    274MiB   92.4%   274MiB
   Zonotope Loop            1    949ms   98.1%   949ms    274MiB   92.4%   274MiB
     Zonotope Propa...      1    938ms   96.9%   938ms    272MiB   91.8%   272MiB
       DiffZonotope...      5    495ms   51.1%  98.9ms   57.2MiB   19.3%  11.4MiB
         Zonotope_D...     10    139ms   14.4%  13.9ms   23.4MiB    7.9%  2.34MiB
       DiffZonotope...      4    443ms   45.8%   111ms    215MiB   72.5%  53.7MiB
         Zonotope_R...      8   68.0ms    7.0%  8.50ms    133MiB   44.9%  16.6MiB
           Column M...      8   27.9ms    2.9%  3.48ms   54.7MiB   18.5%  6.83MiB
           Allocation       8   19.2ms    2.0%  2.40ms   54.7MiB   18.5%  6.83MiB
           Influenc...      8   12.4ms    1.3%  1.55ms   23.4MiB    7.9%  2.92MiB
             Multiply       8   12.1ms    1.2%  1.51ms   21.8MiB    7.4%  2.73MiB
             Alloca...      8    190μs    0.0%  23.7μs   1.52MiB    0.5%   195KiB
             Set Ma...      8    101μs    0.0%  12.7μs     0.00B    0.0%    0.00B
           Set Matrix       8   8.34ms    0.9%  1.04ms    105KiB    0.0%  13.1KiB
           Vectors          8    233μs    0.0%  29.2μs    272KiB    0.1%  34.0KiB
           Bounds           8   5.05μs    0.0%   631ns     0.00B    0.0%    0.00B
     Property Check         1   10.8ms    1.1%  10.8ms    533KiB    0.2%   533KiB
 Initialize                 1   18.7ms    1.9%  18.7ms   22.4MiB    7.6%  22.4MiB
 ────────────────────────────────────────────────────────────────────────────────
[VERYDIFF_TIMER] 1.067058678

[VERYDIFF_EXPERIMENT] NETWORK: /home/i57/steuber/NeuroDiff/repos/VeryDiffExperiments/src/../benchmarks/mnist-prune/specs/mnist_20_local_18.vnnlib
[VERYDIFF_EXPERIMENT] TIME: 122.040971886
