
[VERYDIFF_EXPERIMENT] Running on /home/i57/steuber/NeuroDiff/repos/VeryDiffExperiments/src/../benchmarks/mnist-prune/specs/mnist_72_local_18.vnnlib /home/i57/steuber/NeuroDiff/repos/VeryDiffExperiments/src/../benchmarks/mnist-prune/nets/mnist_relu_4_1024.onnx
Found input X
op: matmul, weight: (1024, 784), bias: nothing
op: bias, weight: nothing, bias: (1024,)
op: relu, weight: nothing, bias: nothing
op: matmul, weight: (1024, 1024), bias: nothing
op: bias, weight: nothing, bias: (1024,)
op: relu, weight: nothing, bias: nothing
op: matmul, weight: (1024, 1024), bias: nothing
op: bias, weight: nothing, bias: (1024,)
op: relu, weight: nothing, bias: nothing
op: matmul, weight: (10, 1024), bias: nothing
op: bias, weight: nothing, bias: (10,)
op: relu, weight: nothing, bias: nothing
op: matmul, weight: (10, 10), bias: nothing
op: bias, weight: nothing, bias: (10,)
Found input X
op: gemm, weight: (1024, 784), bias: (1024,)
op: relu, weight: nothing, bias: nothing
op: gemm, weight: (1024, 1024), bias: (1024,)
op: relu, weight: nothing, bias: nothing
op: gemm, weight: (1024, 1024), bias: (1024,)
op: relu, weight: nothing, bias: nothing
op: gemm, weight: (10, 1024), bias: (10,)
op: relu, weight: nothing, bias: nothing
op: gemm, weight: (10, 10), bias: (10,)
Distance: 915.6394868631054
Distance: 1298.7052820973968
Distance: 1296.587532894263
Distance: 6.054483317080667
Distance: 0.04942679278974538
Running with 1 threads
[Thread 1] Time to first task: 0.0s
Instable Generators: 380
Instable Generators: 684
Instable Generators: 1022
Instable Generators: 10
Zono Bounds:
[-93.7363692488302, -95.85907629363834, -105.47046609092895, -105.28347715458267, -100.56846035743875, -106.35233889866385, -95.77960226081505, -99.596412898307, -101.87256436425793, -106.45907467060019]
[93.72056218749732, 95.48747774652676, 105.39159012805702, 105.14697358876464, 100.28546746611569, 106.05843301642005, 94.97685809030118, 99.50349645027546, 101.47617515690325, 106.36312833451828]
[Thread 1] Processed 100 zonotopes (Work Done: 0.0%; Expected Zonos: Inf)


TIMEOUT REACHED
UNKNOWN
[Thread 1] Total splits: 155
Processed 155 zonotopes (Work Done: 0.0%); Generated 310 (0.776439678232258s/loop)
[Thread 1] Finished in 120.35s
 ────────────────────────────────────────────────────────────────────────────────
                                        Time                    Allocations      
                               ───────────────────────   ────────────────────────
       Tot / % measured:             120s / 100.0%           37.0GiB / 100.0%    

 Section               ncalls     time    %tot     avg     alloc    %tot      avg
 ────────────────────────────────────────────────────────────────────────────────
 Verify                     1     120s  100.0%    120s   37.0GiB   99.9%  37.0GiB
   Zonotope Loop            1     120s  100.0%    120s   37.0GiB   99.9%  37.0GiB
     Zonotope Propa...    155     120s   99.5%   772ms   36.6GiB   99.0%   242MiB
       DiffZonotope...    620    62.7s   52.1%   101ms   29.0GiB   78.5%  47.9MiB
         Zonotope_R...  1.24k    33.2s   27.6%  26.8ms   17.8GiB   48.2%  14.7MiB
           Allocation   1.24k    25.0s   20.8%  20.2ms   7.42GiB   20.1%  6.13MiB
           Column M...  1.24k    5.32s    4.4%  4.29ms   7.42GiB   20.1%  6.13MiB
           Influenc...  1.24k    1.71s    1.4%  1.38ms   2.94GiB    7.9%  2.43MiB
             Multiply   1.24k    1.67s    1.4%  1.35ms   2.73GiB    7.4%  2.25MiB
             Alloca...  1.24k   26.2ms    0.0%  21.1μs    213MiB    0.6%   176KiB
             Set Ma...  1.24k   14.5ms    0.0%  11.7μs     0.00B    0.0%    0.00B
           Set Matrix   1.24k    1.16s    1.0%   939μs   14.6MiB    0.0%  12.1KiB
           Vectors      1.24k   37.0ms    0.0%  29.8μs   41.1MiB    0.1%  34.0KiB
           Bounds       1.24k    813μs    0.0%   655ns     0.00B    0.0%    0.00B
       DiffZonotope...    775    57.0s   47.4%  73.5ms   7.61GiB   20.6%  10.1MiB
         Zonotope_D...  1.55k    19.4s   16.1%  12.5ms   3.10GiB    8.4%  2.05MiB
     Property Check       155    565ms    0.5%  3.65ms   67.4MiB    0.2%   445KiB
     Compute Split        155   52.4ms    0.0%   338μs    144MiB    0.4%   951KiB
 Initialize                 1   14.4ms    0.0%  14.4ms   22.4MiB    0.1%  22.4MiB
 ────────────────────────────────────────────────────────────────────────────────
[VERYDIFF_TIMER] 120.441258501

[VERYDIFF_EXPERIMENT] NETWORK: /home/i57/steuber/NeuroDiff/repos/VeryDiffExperiments/src/../benchmarks/mnist-prune/specs/mnist_72_local_18.vnnlib
[VERYDIFF_EXPERIMENT] TIME: 120.690333944
