
[VERYDIFF_EXPERIMENT] Running on /home/i57/steuber/NeuroDiff/repos/VeryDiffExperiments/src/../benchmarks/mnist-prune/specs/mnist_8_local_21.vnnlib /home/i57/steuber/NeuroDiff/repos/VeryDiffExperiments/src/../benchmarks/mnist-prune/nets/mnist_relu_2_512.onnx
Parsing /home/i57/steuber/NeuroDiff/repos/VeryDiffExperiments/src/../benchmarks/mnist-prune/nets/mnist_relu_2_512.onnx...
Found input X
op: matmul, weight: (512, 784), bias: nothing
op: bias, weight: nothing, bias: (512,)
op: relu, weight: nothing, bias: nothing
op: matmul, weight: (512, 512), bias: nothing
op: bias, weight: nothing, bias: (512,)
op: relu, weight: nothing, bias: nothing
op: matmul, weight: (10, 512), bias: nothing
op: bias, weight: nothing, bias: (10,)
Parsing /home/i57/steuber/NeuroDiff/repos/VeryDiffExperiments/src/../benchmarks/mnist-prune/nets_pruned/mnist_relu_2_512_pruned5.onnx...
Found input X
op: matmul, weight: (512, 784), bias: nothing
op: bias, weight: nothing, bias: (512,)
op: relu, weight: nothing, bias: nothing
op: matmul, weight: (512, 512), bias: nothing
op: bias, weight: nothing, bias: (512,)
op: relu, weight: nothing, bias: nothing
op: matmul, weight: (10, 512), bias: nothing
op: bias, weight: nothing, bias: (10,)
Distance: 1085.5985166831802
Distance: 1719.8468985003963
Distance: 31.228482716001736
Running with 1 threads
[Thread 1] Time to first task: 0.0s
Instable Generators: 130
Instable Generators: 220
Zono Bounds:
[-21.945863331730777, -19.3906732746477, -22.772757204948785, -15.404378194064343, -10.997874919174489, -6.82161048570989, -16.34336595702217, -19.826664118035715, -17.852419741765537, -14.40444602231011]
[7.982652170706543, 8.952956646067218, 3.41862875513662, 11.155157694091468, 15.386230778191873, 16.642484271218596, 11.34713107360289, 5.821845001682119, 5.904772791270117, 7.4542442539843865]
Found cex
N1 Scale: 13363.927677877778 >= 1.0

Found counterexample: ([0.0, 0.0, 0.0, 0.0, 0.0, 0.0, 0.0, 0.0, 0.0, 0.0, 0.0, 0.0, 0.0, 0.0, 0.0, 0.0, 0.0, 0.0, 0.0, 0.0, 0.0, 0.0, 0.0, 0.0, 0.0, 0.0, 0.0, 0.0, 0.0, 0.0, 0.0, 0.0, 0.0, 0.0, 0.0, 0.0, 0.0, 0.0, 0.0, 0.0, 0.0, 0.0, 0.0, 0.0, 0.0, 0.0, 0.0, 0.0, 0.0, 0.0, 0.0, 0.0, 0.0, 0.0, 0.0, 0.0, 0.0, 0.0, 0.0, 0.0, 0.0, 0.0, 1.0, 0.0, 0.0, 0.0, 0.0, 0.0, 0.0, 0.0, 0.0, 0.0, 0.0, 0.0, 0.0, 0.0, 0.0, 0.0, 0.0, 0.0, 0.0, 0.0, 0.0, 0.0, 0.0, 0.0, 0.0, 0.0, 0.0, 0.0, 0.0, 0.0, 0.0, 0.0, 0.0, 0.0, 0.0, 0.0, 0.0, 0.0, 0.0, 0.0, 0.0, 0.0, 0.0, 0.0, 0.0, 0.0, 0.0, 0.0, 0.0, 0.0, 0.0, 0.0, 0.0, 0.0, 0.0, 0.0, 1.0, 0.0, 0.0, 0.0, 0.0, 0.0, 0.0, 0.0, 0.0, 0.0, 0.0, 0.06666667, 0.18431373, 0.18431373, 0.18431373, 0.0627451, 0.50588238, 0.33333334, 0.18431373, 0.0, 0.0, 0.0, 0.0, 0.0, 0.0, 0.0, 0.0, 0.0, 0.0, 0.0, 0.0, 0.0, 0.0, 0.0, 0.0, 0.0, 0.0, 1.0, 0.60000002, 0.8509804, 0.99215686, 0.99215686, 0.99215686, 0.84313726, 0.96470588, 0.99215686, 0.99215686, 0.0, 0.0, 1.0, 0.0, 0.0, 1.0, 0.0, 0.0, 0.0, 0.0, 0.0, 0.0, 0.0, 0.0, 0.0, 0.13725491, 0.55686277, 0.95686275, 0.98823529, 0.99215686, 0.99215686, 0.99215686, 0.99215686, 0.99215686, 0.99215686, 0.99215686, 0.99215686, 0.99215686, 0.0, 0.0, 0.0, 0.0, 0.0, 0.0, 0.0, 0.0, 0.0, 0.0, 0.0, 0.0, 0.0, 0.0, 0.0, 0.24705882, 0.99215686, 0.99215686, 0.99215686, 0.99215686, 0.99215686, 0.99215686, 0.99215686, 0.83529413, 0.66666669, 1.0, 0.66666669, 0.66666669, 0.0, 0.0, 0.0, 0.0, 0.0, 0.0, 0.0, 0.0, 0.0, 0.0, 0.0, 0.07843138, 0.51764709, 0.28235295, 0.0, 0.22352941, 0.93333334, 0.89019608, 0.93333334, 0.65882355, 0.48627451, 0.27058825, 0.07843138, 0.04313726, 0.0, 0.0, 0.0, 0.0, 0.0, 0.0, 0.0, 0.0, 0.0, 0.0, 0.0, 0.0, 0.0, 0.0, 0.04313726, 0.80784315, 0.99215686, 0.30588236, 0.0, 0.0, 0.1254902, 0.0, 0.11764706, 0.00784314, 0.0, 0.0, 0.0, 0.0, 0.0, 0.0, 0.0, 0.0, 0.0, 0.0, 0.0, 0.0, 0.0, 0.0, 0.0, 0.0, 0.0, 0.02352941, 0.69411767, 0.99215686, 0.51764709, 0.03921569, 0.0, 1.0, 0.0, 0.0, 0.0, 0.0, 0.0, 0.0, 0.0, 0.0, 0.0, 0.0, 0.0, 0.0, 0.0, 0.0, 0.0, 0.0, 0.0, 0.0, 0.0, 0.0, 0.04705882, 0.52156866, 0.99215686, 0.9137255, 0.05882353, 0.0, 0.0, 0.0, 0.0, 0.0, 0.0, 0.0, 0.0, 0.0, 0.0, 0.0, 0.0, 0.0, 0.0, 0.0, 0.0, 0.0, 0.0, 0.0, 0.0, 0.0, 0.0, 0.0, 0.36078432, 0.99215686, 0.87450981, 0.10980392, 0.0, 0.0, 0.0, 0.0, 0.0, 0.0, 0.0, 0.0, 0.0, 0.0, 0.0, 0.0, 0.0, 0.0, 0.0, 0.0, 0.0, 0.0, 0.0, 0.0, 0.0, 0.0, 0.0, 0.0, 0.58823532, 0.99215686, 0.68235296, 0.0, 0.0, 0.0, 0.0, 0.0, 0.0, 0.0, 0.0, 0.0, 0.0, 0.0, 0.0, 0.0, 0.0, 0.0, 0.0, 0.0, 0.0, 0.0, 0.0, 0.0, 0.0, 0.0, 0.0, 0.0, 0.91764706, 0.99215686, 0.96470588, 0.49803922, 0.19215687, 0.0, 0.0, 0.0, 0.0, 0.0, 0.0, 0.0, 0.0, 0.0, 0.0, 0.0, 0.0, 0.0, 0.0, 0.0, 0.0, 0.5, 0.0, 0.0, 0.0, 0.0, 0.0, 0.0, 1.0, 0.99215686, 0.99215686, 0.99215686, 0.98431373, 0.57647061, 0.35686275, 0.47450981, 0.33333334, 0.16470589, 0.16470589, 0.33333334, 0.10980392, 0.0, 0.0, 0.0, 0.0, 0.0, 0.0, 0.0, 0.0, 0.0, 0.0, 0.0, 0.0, 0.0, 0.0, 0.0, 0.54509807, 0.99215686, 0.99215686, 0.99215686, 0.99215686, 0.99215686, 0.99215686, 0.99215686, 0.99215686, 0.99215686, 0.99215686, 0.99215686, 0.90980393, 0.65882355, 0.0, 0.0, 0.0, 0.0, 0.0, 0.0, 0.0, 0.0, 0.0, 0.0, 0.0, 0.0, 0.0, 0.0, 0.01176471, 0.20784314, 0.0, 0.87058824, 0.98431373, 0.99215686, 0.99215686, 0.99215686, 0.99215686, 0.99215686, 0.99215686, 0.99215686, 0.99215686, 0.98823529, 0.48627451, 0.0, 0.0, 0.0, 0.0, 0.0, 0.0, 0.0, 0.0, 0.0, 0.0, 0.0, 0.0, 0.0, 0.0, 0.0, 0.0, 0.0, 0.26274511, 0.28235295, 0.78431374, 0.99215686, 0.99215686, 0.99215686, 0.99215686, 0.99215686, 0.99215686, 0.99215686, 0.68627453, 0.0, 0.0, 0.0, 0.0, 0.0, 0.0, 0.0, 0.0, 0.0, 0.0, 0.0, 0.0, 0.0, 0.0, 0.0, 0.0, 0.0, 0.0, 0.0, 0.47058824, 0.99215686, 0.97647059, 0.59607846, 0.2, 0.64313728, 0.99215686, 0.99215686, 0.68627453, 0.0, 0.0, 0.0, 0.0, 0.0, 0.0, 0.0, 0.0, 0.0, 0.0, 0.0, 0.0, 0.0, 0.0, 0.0, 0.0, 0.0, 0.0, 0.0, 0.19607843, 0.99215686, 0.99215686, 0.99215686, 0.73725492, 0.98823529, 0.99215686, 1.0, 0.58039218, 0.0, 0.0, 0.0, 0.0, 0.0, 0.0, 0.0, 0.0, 0.0, 0.0, 0.0, 0.0, 0.0, 0.0, 0.0, 0.0, 0.0, 0.0, 0.5894160341645327, 0.03529412, 0.65490198, 0.99215686, 0.99215686, 0.99215686, 0.99215686, 0.98039216, 0.68627453, 0.04313726, 0.0, 0.0, 0.0, 0.0, 0.0, 1.0, 0.0, 0.0, 0.0, 0.0, 0.0, 0.0, 0.0, 0.0, 0.0, 0.0, 0.0, 0.0, 0.0, 0.0, 0.09019608, 0.70588237, 0.90588236, 0.99215686, 0.86666667, 0.0, 0.0, 0.0, 0.0, 0.0, 0.0, 0.0, 0.0, 0.0, 0.0, 0.0, 0.0, 0.0, 0.0, 0.0, 0.0, 0.0, 0.0, 0.0, 0.0, 0.0, 1.0, 0.0, 0.0, 0.0, 1.0, 0.58431375, 0.08627451, 0.0, 0.0, 0.0, 0.0, 0.0, 0.0, 0.0, 0.0, 0.0, 0.0, 0.0, 0.0, 0.0, 0.0, 0.0, 0.0, 0.0, 0.0, 0.0, 0.0, 0.0, 0.0, 0.0, 0.0, 0.0, 0.0, 0.0, 0.0, 0.0, 0.0, 0.0, 0.0, 0.0, 0.0, 0.0, 0.0, 0.0, 0.0, 0.0, 0.0, 0.0, 0.0, 0.0, 0.0, 0.0, 0.0, 0.0, 0.0, 0.0, 0.0, 0.0, 0.0, 0.0, 0.0, 0.0, 0.0, 0.0, 0.0, 0.0, 0.0, 0.0, 0.0, 0.0, 0.0, 0.0, 0.0, 0.0, 0.0, 0.0, 0.0, 0.0, 0.0, 0.0, 0.0, 0.0, 0.0, 0.0, 0.0, 0.0, 0.0, 0.0, 0.0, 0.0, 0.0, 0.0, 0.0, 0.0, 0.0, 0.0, 0.0, 0.0, 0.0, 0.0, 0.0, 0.0, 0.0, 0.0, 0.0, 0.0, 0.0, 0.0, 0.0, 1.0, 0.0, 0.0, 0.0, 0.0, 0.0, 0.0, 0.0, 0.0, 0.0, 0.0, 0.0, 0.0, 0.0, 0.0, 0.0, 0.0, 0.0, 0.0, 0.0, 0.0], (6, 7))
[Thread 1] Total splits: 1
Processed 2 zonotopes (Work Done: 0.0%); Generated 2 (0.1200516265s/loop)
[Thread 1] Finished in 0.24s
 ────────────────────────────────────────────────────────────────────────────────
                                        Time                    Allocations      
                               ───────────────────────   ────────────────────────
       Tot / % measured:            242ms / 100.0%            125MiB / 100.0%    

 Section               ncalls     time    %tot     avg     alloc    %tot      avg
 ────────────────────────────────────────────────────────────────────────────────
 Verify                     1    240ms   99.2%   240ms    120MiB   95.8%   120MiB
   Zonotope Loop            1    240ms   99.2%   240ms    120MiB   95.8%   120MiB
     Property Check         2    187ms   77.4%  93.6ms   79.8MiB   63.9%  39.9MiB
     Zonotope Propa...      2   52.2ms   21.6%  26.1ms   37.3MiB   29.9%  18.7MiB
       DiffZonotope...      6   43.9ms   18.1%  7.31ms   6.48MiB    5.2%  1.08MiB
         Zonotope_D...     12   21.7ms    9.0%  1.81ms   2.91MiB    2.3%   248KiB
       DiffZonotope...      4   8.29ms    3.4%  2.07ms   30.8MiB   24.7%  7.71MiB
         Zonotope_R...      8   4.04ms    1.7%   504μs   18.5MiB   14.8%  2.31MiB
           Column M...      8   2.11ms    0.9%   263μs   8.22MiB    6.6%  1.03MiB
           Influenc...      8    842μs    0.3%   105μs   1.80MiB    1.4%   231KiB
             Multiply       8    774μs    0.3%  96.7μs   1.46MiB    1.2%   187KiB
             Alloca...      8   42.7μs    0.0%  5.33μs    346KiB    0.3%  43.2KiB
             Set Ma...      8   16.3μs    0.0%  2.04μs     0.00B    0.0%    0.00B
           Set Matrix       8    567μs    0.2%  70.9μs   40.0KiB    0.0%  5.00KiB
           Allocation       8    363μs    0.2%  45.4μs   8.22MiB    6.6%  1.03MiB
           Vectors          8    135μs    0.1%  16.9μs    200KiB    0.2%  25.0KiB
           Bounds           8   3.47μs    0.0%   434ns     0.00B    0.0%    0.00B
     Compute Split          1    129μs    0.1%   129μs    339KiB    0.3%   339KiB
 Initialize                 1   1.94ms    0.8%  1.94ms   5.26MiB    4.2%  5.26MiB
 ────────────────────────────────────────────────────────────────────────────────
[VERYDIFF_TIMER] 0.272729395

[VERYDIFF_EXPERIMENT] Running on /home/i57/steuber/NeuroDiff/repos/VeryDiffExperiments/src/../benchmarks/mnist-prune/specs/mnist_8_local_21.vnnlib /home/i57/steuber/NeuroDiff/repos/VeryDiffExperiments/src/../benchmarks/mnist-prune/nets/mnist_relu_3_100.onnx
Parsing /home/i57/steuber/NeuroDiff/repos/VeryDiffExperiments/src/../benchmarks/mnist-prune/nets/mnist_relu_3_100.onnx...
Found input X
op: matmul, weight: (100, 784), bias: nothing
op: bias, weight: nothing, bias: (100,)
op: relu, weight: nothing, bias: nothing
op: matmul, weight: (100, 100), bias: nothing
op: bias, weight: nothing, bias: (100,)
op: relu, weight: nothing, bias: nothing
op: matmul, weight: (10, 100), bias: nothing
op: bias, weight: nothing, bias: (10,)
op: relu, weight: nothing, bias: nothing
op: matmul, weight: (10, 10), bias: nothing
op: bias, weight: nothing, bias: (10,)
Parsing /home/i57/steuber/NeuroDiff/repos/VeryDiffExperiments/src/../benchmarks/mnist-prune/nets_pruned/mnist_relu_3_100_pruned5.onnx...
Found input X
op: matmul, weight: (100, 784), bias: nothing
op: bias, weight: nothing, bias: (100,)
op: relu, weight: nothing, bias: nothing
op: matmul, weight: (100, 100), bias: nothing
op: bias, weight: nothing, bias: (100,)
op: relu, weight: nothing, bias: nothing
op: matmul, weight: (10, 100), bias: nothing
op: bias, weight: nothing, bias: (10,)
op: relu, weight: nothing, bias: nothing
op: matmul, weight: (10, 10), bias: nothing
op: bias, weight: nothing, bias: (10,)
Distance: 296.6600370998244
Distance: 77.24290861755458
Distance: 5.7170369567975285
Distance: 0.0
Running with 1 threads
[Thread 1] Time to first task: 0.0s
Instable Generators: 38
Instable Generators: 67
Instable Generators: 9
Zono Bounds:
[-1.2106795144438207, -1.5135679039291419, -1.9014807745932196, -1.121143336419434, -1.458937313257399, -3.5887939778949107, -2.3095570643007965, 0.0, -1.4560958485715334, -1.2537562466052008]
[0.856106800596776, 0.6347310672691342, 0.7549030353762617, 1.0077753236802702, 0.7518396057331398, 3.5887939778949107, 2.3095570643007965, 0.0, 1.4560958485715334, 0.8961429383892381]
Found cex
N1 Scale: 1.844967566142696 >= 1.0

Found counterexample: ([0.0, 0.0, 1.0, 0.0, 0.0, 0.0, 0.0, 0.0, 0.0, 0.0, 0.0, 0.0, 0.0, 0.0, 0.0, 0.0, 0.0, 0.0, 0.0, 0.0, 0.0, 0.0, 0.0, 0.0, 0.0, 0.0, 0.0, 0.0, 0.0, 0.0, 0.0, 0.0, 0.0, 0.0, 0.0, 0.0, 0.0, 0.0, 0.0, 0.0, 0.0, 0.0, 0.0, 0.0, 0.0, 0.0, 0.0, 0.0, 0.0, 0.0, 0.0, 0.0, 0.0, 0.0, 0.0, 0.0, 0.0, 0.0, 0.0, 0.0, 0.0, 0.0, 0.0, 0.0, 0.0, 0.0, 0.0, 0.0, 0.0, 0.0, 0.0, 0.0, 0.0, 0.0, 0.0, 0.0, 0.0, 0.0, 0.0, 0.0, 0.0, 0.0, 0.0, 0.0, 0.0, 0.0, 0.0, 0.0, 0.0, 0.0, 0.0, 0.0, 0.0, 0.0, 0.0, 0.0, 0.0, 0.0, 0.0, 0.0, 0.0, 0.0, 0.0, 0.0, 0.0, 0.0, 0.0, 0.0, 0.0, 0.0, 0.0, 0.0, 0.0, 0.0, 0.0, 0.0, 0.0, 0.0, 0.0, 0.0, 0.0, 0.0, 0.0, 0.0, 0.0, 0.0, 0.0, 0.0, 0.0, 0.06666667, 0.18431373, 0.18431373, 0.18431373, 0.0627451, 0.50588238, 0.33333334, 0.18431373, 0.0, 0.0, 0.0, 0.0, 0.0, 0.0, 0.0, 0.0, 0.0, 0.0, 0.0, 0.0, 0.0, 0.0, 0.0, 0.0, 0.0, 0.0, 0.0, 0.60000002, 0.8509804, 0.99215686, 0.99215686, 0.99215686, 0.84313726, 0.96470588, 0.99215686, 0.99215686, 0.0, 0.0, 0.0, 0.0, 0.0, 0.0, 0.0, 0.0, 0.0, 0.0, 0.0, 0.0, 0.0, 0.0, 0.0, 0.13725491, 0.55686277, 0.95686275, 0.98823529, 0.99215686, 0.99215686, 0.99215686, 0.99215686, 0.99215686, 0.99215686, 0.99215686, 0.99215686, 0.99215686, 0.0, 0.0, 0.0, 0.0, 0.0, 0.0, 0.0, 0.0, 0.0, 0.0, 0.0, 0.0, 0.0, 0.0, 0.0, 0.24705882, 0.99215686, 0.99215686, 0.99215686, 0.99215686, 0.99215686, 0.99215686, 0.99215686, 0.83529413, 0.66666669, 1.0, 0.66666669, 0.66666669, 0.0, 0.0, 0.0, 0.0, 0.0, 0.0, 0.0, 0.0, 0.0, 0.0, 0.0, 0.07843138, 0.51764709, 0.28235295, 0.0, 0.22352941, 0.93333334, 0.89019608, 0.93333334, 0.65882355, 0.48627451, 0.27058825, 0.07843138, 0.04313726, 0.0, 0.0, 0.0, 0.0, 0.0, 0.0, 0.0, 0.0, 0.0, 0.0, 0.0, 0.0, 0.0, 0.0, 0.04313726, 0.80784315, 0.99215686, 0.30588236, 0.0, 0.0, 0.1254902, 0.0, 0.11764706, 0.00784314, 0.0, 0.0, 0.0, 0.0, 0.0, 0.0, 0.0, 0.0, 0.0, 0.0, 0.0, 0.0, 0.0, 0.0, 0.0, 0.0, 0.0, 0.02352941, 0.69411767, 0.99215686, 0.51764709, 0.03921569, 0.0, 0.2803677492559054, 0.0, 0.0, 0.0, 0.0, 0.0, 0.0, 0.0, 0.0, 0.0, 0.0, 0.0, 0.0, 0.0, 0.0, 0.0, 0.0, 0.0, 0.0, 0.0, 0.0, 0.04705882, 0.52156866, 0.99215686, 0.9137255, 0.05882353, 0.0, 0.0, 0.0, 0.0, 0.0, 0.0, 0.0, 0.0, 0.0, 0.0, 0.0, 0.0, 0.0, 0.0, 0.0, 0.0, 0.0, 0.0, 0.0, 0.0, 0.0, 0.0, 0.0, 0.36078432, 0.99215686, 0.87450981, 0.10980392, 0.0, 0.0, 0.0, 0.0, 0.0, 0.0, 0.0, 0.0, 0.0, 0.0, 0.0, 0.0, 0.0, 0.0, 0.0, 0.0, 0.0, 0.0, 0.0, 0.0, 0.0, 0.0, 0.0, 0.0, 0.58823532, 0.99215686, 0.68235296, 0.0, 0.0, 0.0, 0.0, 0.0, 0.0, 0.0, 0.0, 0.0, 0.0, 0.0, 0.0, 0.0, 0.0, 0.0, 0.0, 0.0, 0.0, 0.0, 0.0, 0.0, 0.0, 0.0, 0.0, 0.0, 0.91764706, 0.99215686, 0.96470588, 0.49803922, 0.19215687, 0.0, 0.0, 0.0, 0.0, 0.0, 0.0, 0.0, 0.0, 0.0, 0.0, 0.0, 0.0, 0.0, 0.0, 0.0, 0.0, 0.18443848741186736, 0.0, 0.0, 0.0, 0.0, 0.0, 0.0, 1.0, 0.99215686, 0.99215686, 0.99215686, 0.98431373, 0.57647061, 0.35686275, 0.47450981, 0.33333334, 0.16470589, 0.16470589, 0.33333334, 0.10980392, 0.0, 0.0, 0.0, 0.0, 0.0, 0.0, 0.0, 0.0, 0.0, 0.0, 0.0, 0.0, 0.0, 0.0, 0.0, 0.54509807, 0.99215686, 0.99215686, 0.99215686, 0.99215686, 0.99215686, 0.99215686, 0.99215686, 0.99215686, 0.99215686, 0.99215686, 0.99215686, 0.90980393, 0.65882355, 0.0, 0.0, 0.0, 0.0, 0.0, 0.0, 0.0, 0.0, 0.0, 0.0, 0.0, 0.0, 0.0, 0.0, 0.01176471, 0.20784314, 0.0, 0.87058824, 0.98431373, 0.99215686, 0.99215686, 0.99215686, 0.99215686, 0.99215686, 0.99215686, 0.99215686, 0.99215686, 0.98823529, 0.48627451, 0.0, 0.0, 0.0, 0.0, 0.0, 0.0, 0.0, 0.0, 0.0, 0.0, 0.0, 0.0, 0.0, 0.0, 0.0, 0.0, 0.0, 0.26274511, 0.28235295, 0.78431374, 0.99215686, 0.99215686, 0.99215686, 0.99215686, 0.99215686, 0.99215686, 0.99215686, 0.68627453, 0.0, 0.0, 0.0, 0.0, 0.0, 0.0, 0.0, 0.0, 0.0, 0.0, 0.0, 0.0, 0.0, 0.0, 0.0, 0.0, 0.0, 0.0, 0.0, 0.47058824, 0.99215686, 0.97647059, 0.59607846, 0.2, 0.64313728, 0.99215686, 0.99215686, 0.68627453, 0.0, 0.0, 0.0, 0.0, 0.0, 0.0, 0.0, 0.0, 0.0, 0.0, 0.0, 0.0, 0.0, 0.0, 0.0, 0.0, 0.0, 0.0, 0.0, 0.19607843, 0.99215686, 0.99215686, 0.99215686, 0.73725492, 0.98823529, 0.99215686, 0.0, 0.58039218, 0.0, 0.0, 0.0, 0.0, 0.0, 0.0, 0.0, 0.0, 0.0, 0.0, 0.0, 0.0, 0.0, 0.0, 0.0, 0.0, 0.0, 0.0, 0.0, 0.03529412, 0.65490198, 0.99215686, 0.99215686, 0.99215686, 0.99215686, 0.98039216, 0.68627453, 0.04313726, 0.0, 0.0, 0.0, 0.0, 0.0, 1.0, 0.0, 0.0, 0.0, 0.0, 0.0, 0.0, 0.0, 0.0, 0.0, 0.0, 0.0, 0.0, 0.0, 0.0, 0.09019608, 0.70588237, 0.90588236, 0.99215686, 0.86666667, 0.0, 0.0, 0.0, 0.0, 0.0, 0.0, 0.0, 0.0, 0.0, 0.0, 0.0, 0.0, 0.0, 0.0, 0.0, 0.0, 0.0, 0.0, 0.0, 0.0, 0.0, 1.0, 0.0, 0.0, 0.0, 0.0, 0.58431375, 0.08627451, 0.0, 0.0, 0.0, 0.0, 0.0, 0.0, 0.0, 0.0, 0.0, 0.0, 0.0, 0.0, 0.0, 0.0, 0.0, 0.0, 0.0, 0.0, 0.0, 0.0, 0.0, 0.0, 0.0, 0.0, 0.0, 0.0, 0.0, 0.0, 0.0, 0.0, 0.0, 0.0, 0.0, 0.0, 0.0, 0.0, 0.0, 0.0, 0.0, 0.0, 0.0, 0.0, 0.0, 0.0, 0.0, 1.0, 0.0, 0.0, 0.0, 0.0, 0.0, 0.0, 0.0, 0.0, 0.0, 0.0, 0.0, 0.0, 0.0, 0.0, 0.0, 0.0, 0.0, 0.0, 0.0, 0.0, 0.0, 0.0, 0.0, 0.0, 0.0, 0.0, 0.0, 0.0, 0.0, 0.0, 0.0, 0.0, 0.0, 0.0, 0.0, 0.0, 0.0, 0.0, 0.0, 0.0, 0.0, 0.0, 0.0, 0.0, 0.0, 0.0, 0.0, 1.0, 0.0, 0.0, 0.0, 0.0, 0.0, 0.0, 0.0, 0.0, 0.0, 0.0, 0.0, 0.0, 1.0, 0.0, 0.0, 0.0, 0.0, 0.0, 0.0, 0.0, 0.0, 0.0, 0.0, 0.0, 0.0, 0.0, 0.0, 0.0, 0.0], (6, 7))
[Thread 1] Total splits: 0
Processed 1 zonotopes (Work Done: 0.0%); Generated 0 (0.009259682s/loop)
[Thread 1] Finished in 0.01s
 ────────────────────────────────────────────────────────────────────────────────
                                        Time                    Allocations      
                               ───────────────────────   ────────────────────────
       Tot / % measured:           9.60ms /  99.9%           5.60MiB / 100.0%    

 Section               ncalls     time    %tot     avg     alloc    %tot      avg
 ────────────────────────────────────────────────────────────────────────────────
 Verify                     1   9.28ms   96.8%  9.28ms   4.76MiB   85.0%  4.76MiB
   Zonotope Loop            1   9.26ms   96.5%  9.26ms   4.76MiB   85.0%  4.76MiB
     Property Check         1   7.14ms   74.4%  7.14ms   1.67MiB   29.9%  1.67MiB
     Zonotope Propa...      1   1.73ms   18.1%  1.73ms   1.79MiB   31.9%  1.79MiB
       DiffZonotope...      4   1.17ms   12.2%   293μs    359KiB    6.3%  89.8KiB
         Zonotope_D...      8    516μs    5.4%  64.6μs    177KiB    3.1%  22.2KiB
       DiffZonotope...      3    551μs    5.7%   184μs   1.43MiB   25.6%   489KiB
         Zonotope_R...      6    307μs    3.2%  51.1μs   0.96MiB   17.1%   163KiB
           Influenc...      6    126μs    1.3%  21.0μs    315KiB    5.5%  52.5KiB
             Multiply       6   88.7μs    0.9%  14.8μs    206KiB    3.6%  34.3KiB
             Alloca...      6   22.6μs    0.2%  3.76μs    107KiB    1.9%  17.9KiB
             Set Ma...      6   9.11μs    0.1%  1.52μs     0.00B    0.0%    0.00B
           Column M...      6   88.6μs    0.9%  14.8μs    316KiB    5.5%  52.7KiB
           Set Matrix       6   39.9μs    0.4%  6.65μs   7.41KiB    0.1%  1.23KiB
           Vectors          6   21.4μs    0.2%  3.57μs   19.5KiB    0.3%  3.26KiB
           Allocation       6   20.5μs    0.2%  3.41μs    316KiB    5.5%  52.6KiB
           Bounds           6   1.80μs    0.0%   300ns     0.00B    0.0%    0.00B
 Initialize                 1    311μs    3.2%   311μs    858KiB   15.0%   858KiB
 ────────────────────────────────────────────────────────────────────────────────
[VERYDIFF_TIMER] 0.034876022

[VERYDIFF_EXPERIMENT] NETWORK: /home/i57/steuber/NeuroDiff/repos/VeryDiffExperiments/src/../benchmarks/mnist-prune/specs/mnist_8_local_21.vnnlib
[VERYDIFF_EXPERIMENT] TIME: 0.914085121
