
[VERYDIFF_EXPERIMENT] Running on /home/i57/steuber/NeuroDiff/repos/VeryDiffExperiments/src/../benchmarks/mnist-prune/specs/mnist_53_local_21.vnnlib /home/i57/steuber/NeuroDiff/repos/VeryDiffExperiments/src/../benchmarks/mnist-prune/nets/mnist_relu_4_1024.onnx
Found input X
op: matmul, weight: (1024, 784), bias: nothing
op: bias, weight: nothing, bias: (1024,)
op: relu, weight: nothing, bias: nothing
op: matmul, weight: (1024, 1024), bias: nothing
op: bias, weight: nothing, bias: (1024,)
op: relu, weight: nothing, bias: nothing
op: matmul, weight: (1024, 1024), bias: nothing
op: bias, weight: nothing, bias: (1024,)
op: relu, weight: nothing, bias: nothing
op: matmul, weight: (10, 1024), bias: nothing
op: bias, weight: nothing, bias: (10,)
op: relu, weight: nothing, bias: nothing
op: matmul, weight: (10, 10), bias: nothing
op: bias, weight: nothing, bias: (10,)
Found input X
op: gemm, weight: (1024, 784), bias: (1024,)
op: relu, weight: nothing, bias: nothing
op: gemm, weight: (1024, 1024), bias: (1024,)
op: relu, weight: nothing, bias: nothing
op: gemm, weight: (1024, 1024), bias: (1024,)
op: relu, weight: nothing, bias: nothing
op: gemm, weight: (10, 1024), bias: (10,)
op: relu, weight: nothing, bias: nothing
op: gemm, weight: (10, 10), bias: (10,)
Distance: 915.6394868631054
Distance: 1298.7052820973968
Distance: 1296.587532894263
Distance: 6.054483317080667
Distance: 0.04942679278974538
Running with 1 threads
[Thread 1] Time to first task: 0.0s
Instable Generators: 602
Instable Generators: 1020
Instable Generators: 1024
Instable Generators: 10
Zono Bounds:
[-204.5805360439935, -209.00975586048997, -230.3551999704858, -228.63078411136004, -219.8205195227902, -232.62709403766326, -207.90400969535423, -217.63133696813233, -222.45369084674192, -231.79042263045605]
[204.36513841302303, 208.48990510064692, 229.6342767506405, 228.3580769635718, 219.68498829476184, 232.41171233436035, 207.8583500173053, 216.5087376569957, 222.60268453456044, 231.50376250113075]


TIMEOUT REACHED
UNKNOWN
[Thread 1] Total splits: 84
Processed 84 zonotopes (Work Done: 0.0%); Generated 168 (1.4295234156666667s/loop)
[Thread 1] Finished in 120.08s
 ────────────────────────────────────────────────────────────────────────────────
                                        Time                    Allocations      
                               ───────────────────────   ────────────────────────
       Tot / % measured:             120s / 100.0%           31.6GiB / 100.0%    

 Section               ncalls     time    %tot     avg     alloc    %tot      avg
 ────────────────────────────────────────────────────────────────────────────────
 Verify                     1     120s  100.0%    120s   31.6GiB   99.9%  31.6GiB
   Zonotope Loop            1     120s  100.0%    120s   31.6GiB   99.9%  31.6GiB
     Zonotope Propa...     84     119s   99.2%   1.42s   31.4GiB   99.2%   383MiB
       DiffZonotope...    420    78.2s   65.1%   186ms   6.96GiB   22.0%  17.0MiB
         Zonotope_D...    840    23.0s   19.1%  27.3ms   2.82GiB    8.9%  3.44MiB
       DiffZonotope...    336    40.9s   34.1%   122ms   24.4GiB   77.2%  74.4MiB
         Zonotope_R...    672    28.7s   23.9%  42.7ms   15.3GiB   48.4%  23.3MiB
           Allocation     672    22.7s   18.9%  33.8ms   6.07GiB   19.2%  9.25MiB
           Column M...    672    2.83s    2.4%  4.20ms   6.07GiB   19.2%  9.25MiB
           Influenc...    672    2.05s    1.7%  3.05ms   3.14GiB    9.9%  4.78MiB
             Multiply     672    2.01s    1.7%  2.99ms   2.95GiB    9.3%  4.49MiB
             Alloca...    672   26.7ms    0.0%  39.7μs    197MiB    0.6%   300KiB
             Set Ma...    672   12.8ms    0.0%  19.1μs     0.00B    0.0%    0.00B
           Set Matrix     672    1.09s    0.9%  1.62ms   10.7MiB    0.0%  16.3KiB
           Vectors        672   17.3ms    0.0%  25.7μs   22.3MiB    0.1%  34.0KiB
           Bounds         672    422μs    0.0%   629ns     0.00B    0.0%    0.00B
     Property Check        84    895ms    0.7%  10.7ms   46.1MiB    0.1%   562KiB
     Compute Split         84   54.0ms    0.0%   643μs    115MiB    0.4%  1.37MiB
 Initialize                 1   16.5ms    0.0%  16.5ms   22.4MiB    0.1%  22.4MiB
 ────────────────────────────────────────────────────────────────────────────────
[VERYDIFF_TIMER] 120.187842305

[VERYDIFF_EXPERIMENT] NETWORK: /home/i57/steuber/NeuroDiff/repos/VeryDiffExperiments/src/../benchmarks/mnist-prune/specs/mnist_53_local_21.vnnlib
[VERYDIFF_EXPERIMENT] TIME: 120.441236731
