
[VERYDIFF_EXPERIMENT] Running on /home/i57/steuber/NeuroDiff/repos/VeryDiffExperiments/src/../benchmarks/mnist-prune/specs/mnist_34_global_4.vnnlib /home/i57/steuber/NeuroDiff/repos/VeryDiffExperiments/src/../benchmarks/mnist-prune/nets/mnist_relu_2_512.onnx
/home/i57/steuber/NeuroDiff/repos/VeryDiffExperiments/src/../benchmarks/mnist-prune/nets/mnist_relu_2_512.onnx
/home/i57/steuber/NeuroDiff/repos/VeryDiffExperiments/src/../benchmarks/mnist-prune/nets_pruned/mnist_relu_2_512_pruned5.onnx
[[0.         0.01568628]
 [0.         0.01568628]
 [0.         0.01568628]
 ...
 [0.         0.01568628]
 [0.         0.01568628]
 [0.         0.01568628]]
1.0
120
False
512
512
512
512
Set parameter TimeLimit to value 120
Set parameter Threads to value 1
Set parameter BestObjStop to value 1
Set parameter BestBdStop to value 1
Gurobi Optimizer version 10.0.0 build v10.0.0rc2 (linux64)

CPU model: Intel(R) Core(TM) i5-6500 CPU @ 3.20GHz, instruction set [SSE2|AVX|AVX2]
Thread count: 4 physical cores, 4 logical processors, using up to 1 threads

Optimize a model with 14479 rows, 7010 columns and 1321743 nonzeros
Model fingerprint: 0xa1aa156b
Variable types: 4932 continuous, 2078 integer (2078 binary)
Coefficient statistics:
  Matrix range     [1e-07, 2e+06]
  Objective range  [1e+00, 1e+00]
  Bounds range     [2e-02, 1e+00]
  RHS range        [1e-04, 2e+06]
Warning: Model contains large matrix coefficient range
         Consider reformulating model or setting NumericFocus parameter
         to avoid numerical issues.
Presolve removed 8303 rows and 2437 columns
Presolve time: 1.92s
Presolved: 6176 rows, 4573 columns, 525616 nonzeros
Variable types: 3380 continuous, 1193 integer (1193 binary)

Root relaxation: objective 4.263137e+02, 4588 iterations, 2.53 seconds (5.69 work units)
Total elapsed time = 5.07s

    Nodes    |    Current Node    |     Objective Bounds      |     Work
 Expl Unexpl |  Obj  Depth IntInf | Incumbent    BestBd   Gap | It/Node Time

     0     0  426.31367    0  592          -  426.31367      -     -    5s
     0     0  426.23209    0  906          -  426.23209      -     -   10s
     0     0  423.09082    0  762          -  423.09082      -     -   10s
     0     0  423.02356    0  782          -  423.02356      -     -   13s
     0     0  423.01251    0  714          -  423.01251      -     -   13s
     0     0  423.00324    0  719          -  423.00324      -     -   14s
     0     0  423.00266    0  717          -  423.00266      -     -   14s
     0     0  422.99957    0  719          -  422.99957      -     -   14s
     0     0  422.99609    0  721          -  422.99609      -     -   15s
     0     0  422.99523    0  722          -  422.99523      -     -   15s
     0     0  422.99399    0  729          -  422.99399      -     -   15s
     0     0  422.99331    0  727          -  422.99331      -     -   16s
     0     0  422.99319    0  729          -  422.99319      -     -   16s
     0     0  422.97914    0  740          -  422.97914      -     -   23s
     0     0  422.97397    0  779          -  422.97397      -     -   24s
     0     0  422.97074    0  777          -  422.97074      -     -   24s
     0     0  422.96782    0  776          -  422.96782      -     -   25s
     0     0  422.96593    0  768          -  422.96593      -     -   27s
     0     0  422.96430    0  768          -  422.96430      -     -   28s
     0     0  422.96347    0  766          -  422.96347      -     -   29s
     0     0  422.95900    0  768          -  422.95900      -     -   37s
     0     0  422.95614    0  788          -  422.95614      -     -   38s
     0     0  422.95610    0  793          -  422.95610      -     -   38s
     0     0  422.95456    0  794          -  422.95456      -     -   43s
     0     0  422.95400    0  792          -  422.95400      -     -   45s
     0     0  422.95307    0  802          -  422.95307      -     -   49s
     0     0  422.95307    0  717          -  422.95307      -     -   58s
     0     2  422.95307    0  717          -  422.95307      -     -   83s
     1     3  413.22964    1  616          -  422.95307      -  8574   94s
     3     5  399.07735    2  612          -  422.95307      -  4588   99s
     4     6  385.45311    3  597          -  422.95307      -  4807  105s
     7     9  376.83556    4  612          -  422.95307      -  3742  112s
     8    10  366.52373    5  599          -  422.95307      -  4094  119s

Cutting planes:
  Gomory: 1
  Implied bound: 1
  MIR: 222
  Flow cover: 18
  RLT: 566
  Relax-and-lift: 2

Explored 10 nodes (55094 simplex iterations) in 120.00 seconds (191.13 work units)
Thread count was 1 (of 4 available processors)

Solution count 0

Time limit reached
Best objective -, best bound 4.229530736000e+02, gap -


TIMEOUT
time: 152.267024427

[VERYDIFF_TIMER] 152.312707401

[VERYDIFF_EXPERIMENT] Running on /home/i57/steuber/NeuroDiff/repos/VeryDiffExperiments/src/../benchmarks/mnist-prune/specs/mnist_34_global_4.vnnlib /home/i57/steuber/NeuroDiff/repos/VeryDiffExperiments/src/../benchmarks/mnist-prune/nets/mnist_relu_3_100.onnx
/home/i57/steuber/NeuroDiff/repos/VeryDiffExperiments/src/../benchmarks/mnist-prune/nets/mnist_relu_3_100.onnx
/home/i57/steuber/NeuroDiff/repos/VeryDiffExperiments/src/../benchmarks/mnist-prune/nets_pruned/mnist_relu_3_100_pruned5.onnx
[[0.         0.01568628]
 [0.         0.01568628]
 [0.         0.01568628]
 ...
 [0.         0.01568628]
 [0.         0.01568628]
 [0.         0.01568628]]
1.0
120
False
100
100
10
100
100
10
Set parameter TimeLimit to value 120
Set parameter Threads to value 1
Set parameter BestObjStop to value 1
Set parameter BestBdStop to value 1
Gurobi Optimizer version 10.0.0 build v10.0.0rc2 (linux64)

CPU model: Intel(R) Core(TM) i5-6500 CPU @ 3.20GHz, instruction set [SSE2|AVX|AVX2]
Thread count: 4 physical cores, 4 logical processors, using up to 1 threads

Optimize a model with 3083 rows, 2126 columns and 179668 nonzeros
Model fingerprint: 0xca72bb62
Variable types: 1676 continuous, 450 integer (450 binary)
Coefficient statistics:
  Matrix range     [1e-06, 2e+06]
  Objective range  [1e+00, 1e+00]
  Bounds range     [2e-02, 1e+00]
  RHS range        [1e-03, 2e+06]
Warning: Model contains large matrix coefficient range
         Consider reformulating model or setting NumericFocus parameter
         to avoid numerical issues.
Presolve removed 1662 rows and 524 columns
Presolve time: 0.50s
Presolved: 1421 rows, 1602 columns, 89884 nonzeros
Variable types: 1351 continuous, 251 integer (251 binary)

Root relaxation: objective 3.353885e+01, 783 iterations, 0.05 seconds (0.12 work units)

    Nodes    |    Current Node    |     Objective Bounds      |     Work
 Expl Unexpl |  Obj  Depth IntInf | Incumbent    BestBd   Gap | It/Node Time

     0     0   33.53885    0  110          -   33.53885      -     -    0s
     0     0   33.46349    0  120          -   33.46349      -     -    1s
     0     0   32.38803    0  116          -   32.38803      -     -    1s
     0     0   32.32979    0  137          -   32.32979      -     -    1s
     0     0   32.30409    0  136          -   32.30409      -     -    2s
     0     0   32.30374    0  137          -   32.30374      -     -    2s
     0     0   32.20108    0  133          -   32.20108      -     -    2s
     0     0   32.18885    0  138          -   32.18885      -     -    2s
     0     0   32.18804    0  139          -   32.18804      -     -    2s
     0     0   32.18803    0  139          -   32.18803      -     -    2s
     0     0   32.17010    0  140          -   32.17010      -     -    3s
     0     0   32.16441    0  141          -   32.16441      -     -    3s
     0     0   32.16356    0  142          -   32.16356      -     -    3s
     0     0   32.16350    0  142          -   32.16350      -     -    3s
     0     0   32.16040    0  142          -   32.16040      -     -    3s
     0     0   32.15897    0  140          -   32.15897      -     -    3s
     0     0   32.15878    0  139          -   32.15878      -     -    3s
     0     0   32.15753    0  139          -   32.15753      -     -    4s
     0     0   32.15753    0  131          -   32.15753      -     -    5s
     0     2   32.15744    0  129          -   32.15744      -     -    7s
*  185   103             108       0.9429289   23.59616  2402%  56.4    9s
   246   146    5.02050   44   63    0.94293   22.03529  2237%  62.0   10s
H  266   152                       0.9429289   22.03529  2237%  58.9   10s
   511   278    3.45649   38  131    0.94293   21.99725  2233%  61.0   15s
   582   286    7.69990   17   91    0.94293   11.36877  1106%  60.1   20s
  1059   305 infeasible   77         0.94293    9.37623   894%  54.9   25s
  1405   224 infeasible   76         0.94293    9.37623   894%  67.2   30s
  1751   302    9.37623   50   18    0.94293    9.37623   894%  71.2   35s
  2159   464 infeasible   65         0.94293    9.37623   894%  72.5   40s
  2470   554    9.37623   46    9    0.94293    9.37623   894%  74.1   45s
  2762   713    9.37623   72   16    0.94293    9.37623   894%  74.6   50s
H 2966   783                       0.9923339    9.37623   845%  75.3   54s
  3005   802    9.37623   57   13    0.99233    9.37623   845%  75.5   55s
  3307   887    9.37623   54   13    0.99233    9.37623   845%  76.9   60s
  3589   978 infeasible   65         0.99233    9.37623   845%  78.5   65s
  3918  1072    9.37623   59   19    0.99233    9.37623   845%  79.9   70s
H 4060  1117                       0.9923339    9.37623   845%  80.4   73s
  4189  1132 infeasible   53         0.99233    9.37623   845%  80.6   75s
  4506  1231    9.37623   58   16    0.99233    9.37623   845%  81.9   80s
H 4578  1236                       0.9924054    9.37623   845%  82.2   81s
  4888  1338    9.37623   58   18    0.99241    9.37623   845%  81.3   85s
H 5227  1500                       1.0082547    9.37623   830%  79.7   91s

Explored 5228 nodes (421523 simplex iterations) in 91.92 seconds (149.35 work units)
Thread count was 1 (of 4 available processors)

Solution count 6: 1.00825 0.992405 0.992334 ... 0.942929

Optimization achieved user objective limit
Best objective 1.008254714834e+00, best bound 9.376229861333e+00, gap 829.9465%


100
100
10
100
100
10
NETWORKS NOT EQUIVALENT
100
100
10
x_3_0 : 0.0
x_3_1 : 0.0
x_3_2 : 3.203511244750825
x_3_3 : 3.7710893339814
x_3_4 : 0.0
x_3_5 : 0.0
x_3_6 : 0.0
x_3_7 : 14.769573477896534
x_3_8 : 0.0
x_3_9 : 1.841127685357229
100
100
10
x_3_0 : 0.0
x_3_1 : 0.0
x_3_2 : 3.7274343775373757
x_3_3 : 3.4811209722116065
x_3_4 : 0.0
x_3_5 : 0.0
x_3_6 : 0.0
x_3_7 : 13.761318763764832
x_3_8 : 0.0
x_3_9 : 1.746917193153603
100
100
10
100
100
10
Distance:  1.0082547141317022
Input:  [0.0, 0.01568628, 0.01568628, 0.01568628, 0.01568628, 0.0, 0.01568628, 0.0, 0.01568628, 0.01568628, 0.0, 0.01568628, 0.01568628, 0.0, 0.0, 0.01568628, 0.0, 0.0, 0.0, 0.0, 0.01568628, 0.01568628, 0.01568628, 0.01568628, 0.01568628, 0.0, 0.01568628, 0.01568628, 0.01568628, 0.01568628, 0.01568628, 0.01568628, 0.01568628, 0.01568628, 0.01568628, 0.0, 0.01568628, 0.0, 0.01568628, 0.0, 0.0, 0.0, 0.01568628, 0.0, 0.0, 0.0, 0.0, 0.0, 0.01568628, 0.0, 0.01568628, 0.01568628, 0.0, 0.0, 0.0, 0.0, 0.01568628, 0.0, 0.01568628, 0.01568628, 0.01568628, 0.0, 0.0, 0.01568628, 0.01568628, 0.01568628, 0.01568628, 0.0, 0.01568628, 0.0, 0.0, 0.01568628, 0.0, 0.0, 0.0, 0.01568628, 0.01568628, 0.01568628, 0.0, 0.01568628, 0.01568628, 0.0, 0.01568628, 0.0, 0.01568628, 0.0, 0.01568628, 0.0, 0.01568628, 0.01568628, 0.0, 0.0, 0.0, 0.0, 0.0, 0.0, 0.0, 0.0, 0.0, 0.0, 0.01568628, 0.01568628, 0.0, 0.01568628, 0.0, 0.0, 0.0, 0.0, 0.01568628, 0.01568628, 0.01568628, 0.0, 0.01568628, 0.0, 0.013309525091244084, 0.01568628, 0.0, 0.01568628, 0.0, 0.01568628, 0.0, 0.0, 0.0, 0.0, 0.0, 0.0, 0.0, 0.0, 0.0, 0.0, 0.0, 0.0, 0.01568628, 0.0, 0.0, 0.0, 0.0, 0.01568628, 0.01568628, 0.01568628, 0.01568628, 0.0, 0.0, 0.0, 0.0, 0.0, 0.01568628, 0.01568628, 0.0, 0.0, 0.01568628, 0.0, 0.0, 0.0, 0.0, 0.0, 0.0, 0.0, 0.0, 0.0, 0.0, 0.0, 0.01568628, 0.0, 0.01568628, 0.01568628, 0.0, 0.0, 0.01568628, 0.01568628, 0.01568628, 0.01568628, 0.01568628, 0.0, 0.0, 0.87843138, 0.81176472, 0.36470589, 0.0, 0.01568628, 0.0, 0.0, 0.01568628, 0.0, 0.18431373, 0.45882353, 0.49019608, 0.90196079, 0.97647059, 0.9254902, 0.1882353, 0.01568628, 0.01568628, 0.01568628, 0.0, 0.0, 0.0, 0.0, 0.01568628, 0.01568628, 0.0, 0.01568628, 0.01568628, 0.25490198, 0.93725491, 0.99215686, 0.95686275, 0.95686275, 0.9561018823416481, 0.9254902, 0.9254902, 0.92941177, 0.94509804, 0.97254902, 0.97254902, 1.0, 1.0, 1.0, 0.38039216, 0.01568628, 0.01568628, 0.0, 0.0, 0.01568628, 0.0, 0.0, 0.0, 0.0, 0.01568628, 0.0, 0.004665767837700043, 0.01568628, 0.26666668, 0.73333335, 1.0, 1.0, 0.97254902, 1.0, 0.97254902, 0.9910351378158059, 1.0, 1.0, 1.0, 1.0, 1.0, 1.0, 0.38039216, 0.01568628, 0.0, 0.0, 0.01568628, 0.0, 0.01568628, 0.01568628, 0.0, 0.0, 0.0, 0.01568628, 0.01568628, 0.0, 0.01568628, 0.05882353, 0.16862746, 0.16862746, 0.19215687, 0.3882353, 0.13725491, 0.16862746, 0.13725491, 0.16862746, 0.87450981, 1.0, 1.0, 0.78823531, 0.23137255, 0.0, 0.01568628, 0.0, 0.01568628, 0.0, 0.0, 0.01568628, 0.0, 0.0, 0.0, 0.01568628, 0.01568628, 0.0, 0.01568628, 0.01568628, 0.01568628, 0.01568628, 0.01568628, 0.0, 0.0, 0.01568628, 0.0, 0.30980393, 0.94117647, 1.0, 0.83529413, 0.05098039, 0.0, 0.0, 0.01568628, 0.0, 0.01568628, 0.0, 0.0, 0.0, 0.01568628, 0.0, 0.0, 0.01568628, 0.01568628, 0.01568628, 0.0, 0.0, 0.01568628, 0.0, 0.0, 0.0, 0.0, 0.0, 0.0, 0.4627451, 0.97254902, 1.0, 0.76078433, 0.0, 0.0, 0.01568628, 0.01568628, 0.01568628, 0.0, 0.01568628, 0.0, 0.0, 0.01568628, 0.0, 0.0, 0.01568628, 0.01568628, 0.0, 0.01568628, 0.0, 0.01568628, 0.01568628, 0.01568628, 0.0, 0.0, 0.0, 0.3882353, 0.94117647, 1.0, 0.97254902, 0.67843139, 0.0, 0.0, 0.01568628, 0.01568628, 0.0, 0.01568628, 0.01568628, 0.0, 0.0, 0.0, 0.01568628, 0.0, 0.0, 0.01568628, 0.01568628, 0.01568628, 0.0, 0.0, 0.0, 0.0, 0.0, 0.0, 0.06666667, 0.96078432, 1.0, 1.0, 0.47843137, 0.10980392, 0.0, 0.0, 0.0, 0.0, 0.01568628, 0.0, 0.0, 0.0, 0.0, 0.0, 0.01568628, 0.01568628, 0.0, 0.0, 0.01568628, 0.01568628, 0.0, 0.01568628, 0.0, 0.0, 0.0, 0.04705882, 0.78823531, 1.0, 1.0, 0.98823529, 0.21176471, 0.0, 0.01568628, 0.0, 0.01568628, 0.01568628, 0.0, 0.01568628, 0.0, 0.0, 0.01568628, 0.01568628, 0.01568628, 0.0, 0.01568628, 0.0, 0.0, 0.01568628, 0.01568628, 0.0, 0.0, 0.0, 0.04705882, 0.78431374, 1.0, 1.0, 1.0, 0.41568628, 0.01568628, 0.0, 0.01568628, 0.0, 0.01568628, 0.0, 0.0, 0.01568628, 0.0, 0.0, 0.0, 0.0, 0.0, 0.01568628, 0.0, 0.01568628, 0.01568628, 0.0, 0.0, 0.01568628, 0.0, 0.03529412, 0.75686276, 0.97647059, 1.0, 1.0, 0.60784316, 0.0, 0.01568628, 0.01568628, 0.0, 0.01568628, 0.0, 0.01568628, 0.01568628, 0.01568628, 0.0, 0.01568628, 0.01568628, 0.01568628, 0.0, 0.0, 0.01568628, 0.0, 0.0, 0.0, 0.0, 0.0, 0.05098039, 0.46666667, 0.97254902, 1.0, 1.0, 1.0, 0.3882353, 0.0, 0.0, 0.0, 0.0, 0.0, 0.01568628, 0.01568628, 0.0, 0.0, 0.01568628, 0.0, 0.01568628, 0.01568628, 0.0, 0.0, 0.01568628, 0.0, 0.01568628, 0.0, 0.0, 0.0, 0.33725491, 0.97254902, 0.97254902, 1.0, 1.0, 0.16078432, 0.0, 0.0, 0.0, 0.0, 0.0, 0.0, 0.0, 0.01568628, 0.01568628, 0.0, 0.007540449402881652, 0.0, 0.0, 0.01568628, 0.0, 0.01568628, 0.01568628, 0.01568628, 0.0, 0.0, 0.0, 0.05098039, 0.76078433, 0.97254902, 0.97254902, 0.83529413, 0.44705883, 0.0, 0.0, 0.0, 0.0, 0.01568628, 0.0, 0.0, 0.01568628, 0.0, 0.01568628, 0.0, 0.0, 0.01568628, 0.0, 0.0, 0.0, 0.0, 0.01568628, 0.0, 0.0, 0.0, 0.05490196, 0.67450982, 0.97254902, 0.97254902, 0.95686275, 0.32941177, 0.0, 0.0, 0.0, 0.0, 0.0, 0.0, 0.0, 0.01568628, 0.01568628, 0.01568628, 0.01568628, 0.01568628, 0.01568628, 0.0, 0.01568628, 0.01568628, 0.0, 0.0, 0.01568628, 0.01568628, 0.0, 0.05098039, 0.40392157, 0.97254902, 0.97254902, 0.97254902, 0.56470591, 0.01568628, 0.0, 0.0, 0.0, 0.0, 0.0, 0.01568628, 0.0, 0.01568628, 0.0, 0.01568628, 0.01568628, 0.01568628, 0.01568628, 0.01568628, 0.0, 0.01568628, 0.01568628, 0.01568628, 0.0, 0.01568628, 0.01568628, 0.65490198, 1.0, 1.0, 1.0, 0.89803922, 0.11372549, 0.01568628, 0.0, 0.01568628, 0.0, 0.0, 0.0, 0.0, 0.0, 0.01568628, 0.01568628, 0.01568628, 0.01568628, 0.01568628, 0.01568628, 0.01568628, 0.01568628, 0.0, 0.01568628, 0.01568628, 0.01568628, 0.01568628, 0.05490196, 0.86666667, 1.0, 1.0, 1.0, 0.53333336, 0.01568628, 0.0, 0.0, 0.0, 0.0, 0.0, 0.0, 0.0, 0.0, 0.0, 0.01568628, 0.0, 0.01568628, 0.0, 0.01568628, 0.01568628, 0.0, 0.0, 0.01568628, 0.01568628, 0.0, 0.01568628, 0.36470589, 0.99607843, 0.97254902, 0.97254902, 0.8509804, 0.16862746, 0.0, 0.0, 0.0, 0.01568628, 0.01568628, 0.0, 0.01568628, 0.0, 0.01568628, 0.01568628, 0.01568628, 0.01568628, 0.01568628, 0.01568628, 0.01568628, 0.0, 0.01568628, 0.01568628, 0.01568628, 0.0, 0.0, 0.01568628, 0.01568628, 0.8509804, 0.86666667, 0.86666667, 0.32549021, 0.01568628, 0.01568628, 0.0, 0.01568628, 0.01568628, 0.01568628, 0.0, 0.01568628, 0.0, 0.0, 0.01568628, 0.0, 0.0, 0.0, 0.01568628, 0.0, 0.01568628, 0.0, 0.01568628, 0.0, 0.01568628, 0.01568628, 0.01568628, 0.0, 0.01568628, 0.01568628, 0.01568628, 0.01568628, 0.0, 0.01568628, 0.01568628, 0.01568628, 0.01568628, 0.01568628, 0.0, 0.01568628, 0.0, 0.01568628, 0.01568628, 0.0, 0.01568628, 0.01568628, 0.0, 0.0, 0.0, 0.01568628, 0.0, 0.01568628, 0.01568628, 0.0, 0.0, 0.01568628, 0.01568628, 0.01568628, 0.0, 0.01568628, 0.0, 0.0, 0.01568628, 0.0, 0.0, 0.0, 0.0, 0.01568628, 0.01568628, 0.0, 0.01568628, 0.01568628, 0.0, 0.0, 0.0, 0.0]
time: 101.324744039

[VERYDIFF_TIMER] 101.357718188

[VERYDIFF_EXPERIMENT] Running on /home/i57/steuber/NeuroDiff/repos/VeryDiffExperiments/src/../benchmarks/mnist-prune/specs/mnist_34_global_4.vnnlib /home/i57/steuber/NeuroDiff/repos/VeryDiffExperiments/src/../benchmarks/mnist-prune/nets/mnist_relu_4_1024.onnx
/home/i57/steuber/NeuroDiff/repos/VeryDiffExperiments/src/../benchmarks/mnist-prune/nets/mnist_relu_4_1024.onnx
/home/i57/steuber/NeuroDiff/repos/VeryDiffExperiments/src/../benchmarks/mnist-prune/nets_pruned/mnist_relu_4_1024_pruned5.onnx
[[0.         0.01568628]
 [0.         0.01568628]
 [0.         0.01568628]
 ...
 [0.         0.01568628]
 [0.         0.01568628]
 [0.         0.01568628]]
1.0
120
False
1024
1024
1024
10
1024
1024
1024
10
Set parameter TimeLimit to value 120
Set parameter Threads to value 1
Set parameter BestObjStop to value 1
Set parameter BestBdStop to value 1
Gurobi Optimizer version 10.0.0 build v10.0.0rc2 (linux64)

CPU model: Intel(R) Core(TM) i5-6500 CPU @ 3.20GHz, instruction set [SSE2|AVX|AVX2]
Thread count: 4 physical cores, 4 logical processors, using up to 1 threads

Optimize a model with 43291 rows, 19358 columns and 5656712 nonzeros
Model fingerprint: 0x1fb8d73e
Variable types: 13164 continuous, 6194 integer (6194 binary)
Coefficient statistics:
  Matrix range     [2e-08, 2e+06]
  Objective range  [1e+00, 1e+00]
  Bounds range     [2e-02, 1e+00]
  RHS range        [1e-07, 2e+06]
Warning: Model contains large matrix coefficient range
         Consider reformulating model or setting NumericFocus parameter
         to avoid numerical issues.
Presolve removed 19398 rows and 4263 columns (presolve time = 5s) ...
Presolve removed 19909 rows and 4263 columns (presolve time = 10s) ...
Presolve removed 19909 rows and 4263 columns (presolve time = 15s) ...
Presolve removed 19909 rows and 4263 columns
Presolve time: 15.37s
Presolved: 23382 rows, 15095 columns, 4229512 nonzeros
Variable types: 10560 continuous, 4535 integer (4535 binary)

Root simplex log...

Iteration    Objective       Primal Inf.    Dual Inf.      Time
       0    5.0082431e+06   1.414672e+06   0.000000e+00     25s
     637    9.9999900e+05   2.726628e+05   0.000000e+00     26s
    2737    9.9999900e+05   1.343771e+04   0.000000e+00     30s
    4377    9.9999900e+05   4.563984e+03   0.000000e+00     36s
    5747    9.9999900e+05   1.380380e+04   0.000000e+00     40s
    7167    9.9999900e+05   1.388833e+02   0.000000e+00     46s
    8637    9.9999900e+05   1.636324e+00   0.000000e+00     51s
    9619    9.9999900e+05   0.000000e+00   0.000000e+00     52s

Root relaxation: objective 9.999990e+05, 9619 iterations, 30.58 seconds (69.32 work units)
Total elapsed time = 75.97s
Total elapsed time = 90.25s

    Nodes    |    Current Node    |     Objective Bounds      |     Work
 Expl Unexpl |  Obj  Depth IntInf | Incumbent    BestBd   Gap | It/Node Time

     0     0 999999.000    0    4          - 999999.000      -     -   92s
     0     0 999999.000    0    8          - 999999.000      -     -   93s
     0     0          -    0               - 999999.000      -     -  120s

Explored 1 nodes (24099 simplex iterations) in 120.02 seconds (236.33 work units)
Thread count was 1 (of 4 available processors)

Solution count 0

Time limit reached
Best objective -, best bound 9.999990000000e+05, gap -


TIMEOUT
time: 264.687042841

[VERYDIFF_TIMER] 264.715423364

[VERYDIFF_EXPERIMENT] NETWORK: /home/i57/steuber/NeuroDiff/repos/VeryDiffExperiments/src/../benchmarks/mnist-prune/specs/mnist_34_global_4.vnnlib
[VERYDIFF_EXPERIMENT] TIME: 519.295044644
