
[VERYDIFF_EXPERIMENT] Running on /home/i57/steuber/NeuroDiff/repos/VeryDiffExperiments/src/../benchmarks/mnist-prune/specs/mnist_1_global_4.vnnlib /home/i57/steuber/NeuroDiff/repos/VeryDiffExperiments/src/../benchmarks/mnist-prune/nets/mnist_relu_2_512.onnx
Found input X
op: matmul, weight: (512, 784), bias: nothing
op: bias, weight: nothing, bias: (512,)
op: relu, weight: nothing, bias: nothing
op: matmul, weight: (512, 512), bias: nothing
op: bias, weight: nothing, bias: (512,)
op: relu, weight: nothing, bias: nothing
op: matmul, weight: (10, 512), bias: nothing
op: bias, weight: nothing, bias: (10,)
Found input X
op: gemm, weight: (512, 784), bias: (512,)
op: relu, weight: nothing, bias: nothing
op: gemm, weight: (512, 512), bias: (512,)
op: relu, weight: nothing, bias: nothing
op: gemm, weight: (10, 512), bias: (10,)
Distance: 973.3044369037136
Distance: 481.63499746812613
Distance: 8.744412635378467
Running with 1 threads
[Thread 1] Time to first task: 0.01s
Instable Generators: 99
Instable Generators: 124
Zono Bounds:
[-5.2867560642895235, -5.011857522708989, -4.175833255168246, -5.204248192230998, -5.500222674308077, -5.6643091356898285, -5.001551885811515, -5.84424895292253, -4.400641299264245, -5.2286198661906695]
[6.998845150581232, 7.084306341379825, 6.6773526009622834, 6.478074404318323, 8.059768355069941, 5.540824519558958, 6.336877301615815, 7.366034822012627, 5.947842700117593, 6.039174636562656]
[Thread 1] Processed 100 zonotopes (Work Done: 0.0%; Expected Zonos: Inf)
[Thread 1] Processed 200 zonotopes (Work Done: 0.0%; Expected Zonos: Inf)
[Thread 1] Processed 300 zonotopes (Work Done: 0.0%; Expected Zonos: Inf)


TIMEOUT REACHED
UNKNOWN
[Thread 1] Total splits: 330
Processed 330 zonotopes (Work Done: 0.0%); Generated 660 (0.3649402177818182s/loop)
[Thread 1] Finished in 120.43s
 ────────────────────────────────────────────────────────────────────────────────
                                        Time                    Allocations      
                               ───────────────────────   ────────────────────────
       Tot / % measured:             120s / 100.0%           47.0GiB / 100.0%    

 Section               ncalls     time    %tot     avg     alloc    %tot      avg
 ────────────────────────────────────────────────────────────────────────────────
 Verify                     1     120s  100.0%    120s   46.9GiB  100.0%  46.9GiB
   Zonotope Loop            1     120s  100.0%    120s   46.9GiB  100.0%  46.9GiB
     Zonotope Propa...    330    97.6s   81.0%   296ms   34.9GiB   74.4%   108MiB
       DiffZonotope...    660    52.6s   43.7%  79.7ms   28.3GiB   60.3%  43.9MiB
         Zonotope_R...  1.32k    46.0s   38.2%  34.9ms   25.0GiB   53.2%  19.4MiB
           Influenc...  1.32k    25.3s   21.0%  19.2ms   15.5GiB   32.9%  12.0MiB
             Multiply   1.32k    17.0s   14.1%  12.8ms   8.18GiB   17.4%  6.35MiB
             Alloca...  1.32k    7.36s    6.1%  5.57ms   7.27GiB   15.5%  5.64MiB
             Set Ma...  1.32k    979ms    0.8%   742μs     0.00B    0.0%    0.00B
           Allocation   1.32k    14.5s   12.0%  11.0ms   4.75GiB   10.1%  3.68MiB
           Column M...  1.32k    5.62s    4.7%  4.26ms   4.75GiB   10.1%  3.68MiB
           Set Matrix   1.32k    577ms    0.5%   437μs   4.43MiB    0.0%  3.43KiB
           Vectors      1.32k   25.5ms    0.0%  19.3μs   32.2MiB    0.1%  25.0KiB
           Bounds       1.32k   1.01ms    0.0%   765ns     0.00B    0.0%    0.00B
       DiffZonotope...    990    45.0s   37.3%  45.4ms   6.64GiB   14.1%  6.87MiB
         Zonotope_D...  1.98k    25.2s   20.9%  12.7ms   4.26GiB    9.1%  2.20MiB
     Compute Split        330    7.62s    6.3%  23.1ms   5.51GiB   11.7%  17.1MiB
     Property Check       330    296ms    0.2%   896μs   87.3MiB    0.2%   271KiB
 Initialize                 1   2.18ms    0.0%  2.18ms   9.84MiB    0.0%  9.84MiB
 ────────────────────────────────────────────────────────────────────────────────
[VERYDIFF_TIMER] 120.466027229

[VERYDIFF_EXPERIMENT] NETWORK: /home/i57/steuber/NeuroDiff/repos/VeryDiffExperiments/src/../benchmarks/mnist-prune/specs/mnist_1_global_4.vnnlib
[VERYDIFF_EXPERIMENT] TIME: 120.87591997
