
[VERYDIFF_EXPERIMENT] Running on /home/i57/steuber/NeuroDiff/repos/VeryDiffExperiments/src/../benchmarks/mnist-prune/specs/mnist_77_global_6.vnnlib /home/i57/steuber/NeuroDiff/repos/VeryDiffExperiments/src/../benchmarks/mnist-prune/nets/mnist_relu_2_512.onnx
Found input X
op: matmul, weight: (512, 784), bias: nothing
op: bias, weight: nothing, bias: (512,)
op: relu, weight: nothing, bias: nothing
op: matmul, weight: (512, 512), bias: nothing
op: bias, weight: nothing, bias: (512,)
op: relu, weight: nothing, bias: nothing
op: matmul, weight: (10, 512), bias: nothing
op: bias, weight: nothing, bias: (10,)
Found input X
op: matmul, weight: (512, 784), bias: nothing
op: bias, weight: nothing, bias: (512,)
op: relu, weight: nothing, bias: nothing
op: matmul, weight: (512, 512), bias: nothing
op: bias, weight: nothing, bias: (512,)
op: relu, weight: nothing, bias: nothing
op: matmul, weight: (10, 512), bias: nothing
op: bias, weight: nothing, bias: (10,)
Distance: 1085.5985166831802
Distance: 1719.8468985003963
Distance: 31.228482716001736
Running with 1 threads
[Thread 1] Time to first task: 0.02s
Instable Generators: 171
Instable Generators: 370
Zono Bounds:
[-17.584017934539446, -9.581923890401924, -7.6621809456054555, -15.866962972686272, -19.237297230163414, -13.68330880490095, -16.460375704989485, -10.553137751770329, -13.885240987435983, -18.09895978541752]
[18.02717150805106, 23.73537521314453, 22.82763057908018, 17.423199800046525, 12.485012308699313, 14.695231940790968, 15.839731640376874, 20.965544088053612, 13.317426292042699, 9.302878387173644]

Found counterexample: ([0.0, 0.02352941, 0.02352941, 0.0, 0.0, 0.02352941, 0.0, 0.02352941, 0.0, 0.0, 0.0, 0.02352941, 0.0, 0.02352941, 0.02352941, 0.0, 0.02352941, 0.0, 0.02352941, 0.02352941, 0.0, 0.02352941, 0.0, 0.0, 0.0, 0.02352941, 0.02352941, 0.02352941, 0.0, 0.0, 0.0, 0.02352941, 0.0, 0.02352941, 0.0, 0.0, 0.02352941, 0.0, 0.02352941, 0.02352941, 0.02352941, 0.02352941, 0.02352941, 0.02352941, 0.02352941, 0.02352941, 0.02352941, 0.02352941, 0.02352941, 0.02352941, 0.0, 0.02352941, 0.02352941, 0.0, 0.02352941, 0.02352941, 0.0, 0.02352941, 0.02352941, 0.0, 0.02352941, 0.02352941, 0.02352941, 0.0, 0.02352941, 0.02352941, 0.02352941, 0.02352941, 0.02352941, 0.02352941, 0.0, 0.02352941, 0.0, 0.02352941, 0.02352941, 0.02352941, 0.0, 0.02352941, 0.02352941, 0.02352941, 0.02352941, 0.02352941, 0.0, 0.02352941, 0.0, 0.02352941, 0.0, 0.02352941, 0.02352941, 0.02352941, 0.02352941, 0.02352941, 0.02352941, 0.02352941, 0.02352941, 0.02352941, 0.02352941, 0.02352941, 0.02352941, 0.02352941, 0.0, 0.0, 0.0, 0.0, 0.0, 0.0, 0.02352941, 0.02352941, 0.02352941, 0.02352941, 0.02352941, 0.02352941, 0.0, 0.0, 0.0, 0.0, 0.02352941, 0.0, 0.02352941, 0.02352941, 0.02352941, 0.0, 0.0, 0.02352941, 0.02352941, 0.02352941, 0.02352941, 0.0, 0.0, 0.0, 0.0, 0.0, 0.0, 0.0, 0.0, 0.02352941, 0.02352941, 0.02352941, 0.02352941, 0.0, 0.02352941, 0.02352941, 0.02352941, 0.0, 0.02352941, 0.0, 0.02352941, 0.0, 0.0, 0.0, 0.0, 0.02352941, 0.02352941, 0.02352941, 0.02352941, 0.02352941, 0.0, 0.0, 0.0, 0.0, 0.0, 0.0, 0.0, 0.0, 0.02352941, 0.02352941, 0.02352941, 0.02352941, 0.02352941, 0.02352941, 0.02352941, 0.02352941, 0.02352941, 0.0, 0.0, 0.0, 0.0, 0.02352941, 0.0, 0.02352941, 0.02352941, 0.02352941, 0.02352941, 0.02352941, 0.02352941, 0.0, 0.0, 0.0, 0.0, 0.0, 0.0, 0.0, 0.0, 0.02352941, 0.02352941, 0.02352941, 0.0, 0.02352941, 0.02352941, 0.02352941, 0.02352941, 0.0, 0.0, 0.0, 0.02352941, 0.03921569, 0.12156863, 0.52549022, 0.5725490500000001, 0.5725490500000001, 0.52549022, 0.25098041, 0.03921569, 0.0, 0.0, 0.0, 0.0, 0.0, 0.0, 0.0, 0.0, 0.02352941, 0.02352941, 0.0, 0.0, 0.0, 0.02352941, 0.02352941, 0.0, 0.0, 0.02352941, 0.16078432, 0.48627451000000005, 0.73725492, 0.96862745, 1.0, 1.0, 1.0, 0.96862745, 0.96862745, 0.81960785, 0.29019609, 0.0, 0.0, 0.0, 0.0, 0.0, 0.0, 0.02352941, 0.02352941, 0.02352941, 0.02352941, 0.0, 0.0, 0.02352941, 0.02352941, 0.02352941, 0.02352941, 0.42352941999999993, 0.75294119, 1.0, 0.87450981, 0.58431375, 0.10588235, 0.05490196, 0.05490196, 0.14117648, 0.4627451, 0.96078432, 0.9921568600000001, 0.61176473, 0.0, 0.0, 0.0, 0.0, 0.0, 0.02352941, 0.02352941, 0.02352941, 0.0, 0.0, 0.0, 0.02352941, 0.02352941, 0.02352941, 0.27058825, 0.9490196100000001, 0.9764705900000001, 0.43529412000000006, 0.0, 0.0, 0.0, 0.0, 0.0, 0.0, 0.0, 0.43529412000000006, 1.0, 0.98039216, 0.17647059, 0.0, 0.0, 0.0, 0.02352941, 0.02352941, 0.02352941, 0.0, 0.0, 0.02352941, 0.0, 0.0, 0.02352941, 0.02352941, 0.97254902, 1.0, 0.51764709, 0.02352941, 0.0, 0.0, 0.02352941, 0.0, 0.0, 0.0, 0.0, 0.0, 0.8039215800000001, 0.96862745, 0.3058823600000001, 0.02352941, 0.0, 0.02352941, 0.02352941, 0.02352941, 0.02352941, 0.02352941, 0.0, 0.0, 0.0, 0.0, 0.02352941, 0.02352941, 0.9999999999999999, 1.0, 0.42352942, 0.0, 0.0, 0.0, 0.0, 0.0, 0.0, 0.0, 0.0, 0.0, 0.7764706000000001, 1.0, 0.3058823600000001, 0.02352941, 0.02352941, 0.02352941, 0.02352941, 0.02352941, 0.02352941, 0.0, 0.0, 0.02352941, 0.02352941, 0.0, 0.02352941, 0.02352941, 0.4274509799999999, 0.27450982, 0.05098039, 0.0, 0.0, 0.02352941, 0.02352941, 0.02352941, 0.0, 0.0, 0.0, 0.11372549, 0.93333334, 0.9137254999999999, 0.07058824, 0.0, 0.02352941, 0.02352941, 0.02352941, 0.02352941, 0.02352941, 0.02352941, 0.02352941, 0.0, 0.0, 0.0, 0.0, 0.02352941, 0.0, 0.0, 0.0, 0.0, 0.0, 0.02352941, 0.02352941, 0.02352941, 0.0, 0.0, 0.0, 0.47450981, 0.96862745, 0.56078434, 0.02352941, 0.02352941, 0.02352941, 0.02352941, 0.02352941, 0.02352941, 0.02352941, 0.02352941, 0.02352941, 0.0, 0.0, 0.0, 0.02352941, 0.02352941, 0.0, 0.0, 0.0, 0.0, 0.02352941, 0.02352941, 0.02352941, 0.02352941, 0.0, 0.0, 0.44705883, 1.0, 0.53333336, 0.03529412, 0.02352941, 0.02352941, 0.0, 0.02352941, 0.02352941, 0.02352941, 0.02352941, 0.02352941, 0.02352941, 0.02352941, 0.02352941, 0.0, 0.02352941, 0.02352941, 0.0, 0.02352941, 0.0, 0.0, 0.02352941, 0.02352941, 0.02352941, 0.02352941, 0.0, 0.24705882, 0.96862745, 0.81176472, 0.08235294, 0.02352941, 0.02352941, 0.02352941, 0.0, 0.02352941, 0.02352941, 0.0, 0.02352941, 0.02352941, 0.02352941, 0.02352941, 0.02352941, 0.0, 0.02352941, 0.02352941, 0.02352941, 0.0, 0.0, 0.0, 0.0, 0.02352941, 0.02352941, 0.02352941, 0.49411764999999996, 0.9254901999999999, 0.69411767, 0.13333334, 0.02352941, 0.0, 0.0, 0.0, 0.0, 0.02352941, 0.0, 0.02352941, 0.02352941, 0.02352941, 0.02352941, 0.0, 0.0, 0.0, 0.0, 0.02352941, 0.02352941, 0.02352941, 0.0, 0.0, 0.0, 0.02352941, 0.10980392, 0.65098041, 1.0, 0.68235296, 0.0, 0.0, 0.0, 0.0, 0.02352941, 0.0, 0.0, 0.02352941, 0.02352941, 0.02352941, 0.02352941, 0.02352941, 0.0, 0.0, 0.02352941, 0.0, 0.0, 0.02352941, 0.02352941, 0.0, 0.02352941, 0.02352941, 0.0, 0.02352941, 0.78431374, 1.0, 0.83529413, 0.3333333399999999, 0.03921569, 0.10196079, 0.0, 0.02352941, 0.02352941, 0.0, 0.0, 0.0, 0.04705882, 0.20784314, 0.02352941, 0.02352941, 0.02352941, 0.0, 0.02352941, 0.0, 0.0, 0.0, 0.02352941, 0.0, 0.02352941, 0.0, 0.02745098, 0.627451, 1.0, 1.0, 0.96862745, 1.0, 0.93725491, 0.89803922, 0.8509804, 0.87058824, 0.87058824, 0.87058824, 0.81176472, 0.48235294, 0.9411764699999999, 0.9764705900000001, 0.02352941, 0.02352941, 0.02352941, 0.0, 0.02352941, 0.02352941, 0.02352941, 0.02352941, 0.02352941, 0.0, 0.0, 0.0, 0.24705882, 0.96862745, 0.48627451, 0.34901962000000003, 0.3019608, 0.3019608, 0.3019608, 0.24705882, 0.52941179, 0.53725493, 0.58039218, 0.33333334, 0.81568629, 0.53725493, 0.92156863, 1.0, 0.02352941, 0.0, 0.02352941, 0.0, 0.0, 0.02352941, 0.02352941, 0.02352941, 0.02352941, 0.0, 0.02352941, 0.0, 0.0, 0.11764706, 0.09803922, 0.02352941, 0.02352941, 0.02352941, 0.02352941, 0.02352941, 0.0, 0.0, 0.0, 0.02352941, 0.08235294, 0.02352941, 0.11372549, 0.16470589, 0.02352941, 0.02352941, 0.0, 0.02352941, 0.0, 0.0, 0.02352941, 0.02352941, 0.02352941, 0.0, 0.0, 0.02352941, 0.02352941, 0.02352941, 0.02352941, 0.02352941, 0.02352941, 0.02352941, 0.02352941, 0.02352941, 0.02352941, 0.02352941, 0.0, 0.02352941, 0.02352941, 0.02352941, 0.02352941, 0.02352941, 0.02352941, 0.0, 0.0, 0.02352941, 0.0, 0.0, 0.0, 0.0, 0.0, 0.0, 0.0, 0.0, 0.0, 0.0, 0.02352941, 0.02352941, 0.02352941, 0.02352941, 0.02352941, 0.02352941, 0.02352941, 0.0, 0.02352941, 0.02352941, 0.02352941, 0.02352941, 0.02352941, 0.02352941, 0.02352941, 0.02352941, 0.02352941, 0.02352941, 0.0, 0.0, 0.0, 0.02352941, 0.0, 0.0, 0.02352941, 0.0, 0.0, 0.02352941, 0.02352941, 0.02352941, 0.02352941, 0.02352941, 0.02352941, 0.02352941, 0.02352941, 0.02352941, 0.02352941, 0.02352941, 0.02352941, 0.02352941, 0.02352941, 0.02352941, 0.0, 0.02352941, 0.02352941, 0.02352941, 0.02352941, 0.02352941, 0.02352941, 0.02352941, 0.02352941, 0.02352941, 0.02352941, 0.0, 0.02352941, 0.0, 0.02352941, 0.02352941, 0.02352941, 0.02352941, 0.02352941, 0.02352941, 0.02352941, 0.02352941, 0.02352941, 0.02352941, 0.02352941, 0.02352941, 0.0, 0.0, 0.02352941, 0.0, 0.0, 0.02352941, 0.0, 0.02352941, 0.02352941, 0.0, 0.02352941, 0.02352941, 0.0, 0.0, 0.0, 0.02352941, 0.02352941, 0.0, 0.0, 0.02352941, 0.02352941, 0.02352941, 0.02352941, 0.02352941, 0.02352941, 0.02352941, 0.02352941, 0.0, 0.0, 0.0, 0.02352941, 0.02352941, 0.0], ([-58.39369748485597, -33.27897556483872, 12.545926103119772, -41.32150975288079, -92.39893283452186, -62.108795034743665, -62.60058337335815, -38.77293503270921, -48.48181476292833, -57.67392221524269], [-54.02529247757918, -34.62077840098837, 10.01127103653266, -37.127098152635526, -84.88058836986596, -59.74569739508337, -57.2564347819334, -39.294824938323416, -44.548137077541355, -50.7849458798976], 7.518344464655897))
[Thread 1] Total splits: 0
Processed 1 zonotopes (Work Done: 0.0%); Generated 0 (0.553613122s/loop)
[Thread 1] Finished in 0.55s
 ────────────────────────────────────────────────────────────────────────────────
                                        Time                    Allocations      
                               ───────────────────────   ────────────────────────
       Tot / % measured:            556ms / 100.0%            167MiB / 100.0%    

 Section               ncalls     time    %tot     avg     alloc    %tot      avg
 ────────────────────────────────────────────────────────────────────────────────
 Verify                     1    554ms   99.6%   554ms    157MiB   94.1%   157MiB
   Zonotope Loop            1    554ms   99.6%   554ms    157MiB   94.1%   157MiB
     Zonotope Propa...      1    526ms   94.6%   526ms    136MiB   81.7%   136MiB
       DiffZonotope...      2    407ms   73.2%   204ms    114MiB   68.4%  57.0MiB
         Zonotope_R...      4    390ms   70.2%  97.5ms   98.7MiB   59.2%  24.7MiB
           Column M...      4    248ms   44.5%  61.9ms   18.0MiB   10.8%  4.49MiB
           Influenc...      4    134ms   24.1%  33.6ms   62.7MiB   37.6%  15.7MiB
             Multiply       4    118ms   21.3%  29.5ms   35.2MiB   21.1%  8.79MiB
             Alloca...      4   12.5ms    2.2%  3.12ms   27.5MiB   16.5%  6.87MiB
             Set Ma...      4   3.51ms    0.6%   878μs     0.00B    0.0%    0.00B
           Allocation       4   5.57ms    1.0%  1.39ms   18.0MiB   10.8%  4.49MiB
           Set Matrix       4   2.48ms    0.4%   619μs   29.7KiB    0.0%  7.43KiB
           Vectors          4   81.7μs    0.0%  20.4μs    100KiB    0.1%  25.0KiB
           Bounds           4   2.69μs    0.0%   673ns     0.00B    0.0%    0.00B
       DiffZonotope...      3    119ms   21.3%  39.5ms   22.2MiB   13.3%  7.40MiB
         Zonotope_D...      6   57.7ms   10.4%  9.62ms   13.9MiB    8.3%  2.31MiB
     Property Check         1   2.66ms    0.5%  2.66ms    229KiB    0.1%   229KiB
 Initialize                 1   2.28ms    0.4%  2.28ms   9.84MiB    5.9%  9.84MiB
 ────────────────────────────────────────────────────────────────────────────────
[VERYDIFF_TIMER] 0.589441084

[VERYDIFF_EXPERIMENT] Running on /home/i57/steuber/NeuroDiff/repos/VeryDiffExperiments/src/../benchmarks/mnist-prune/specs/mnist_77_global_6.vnnlib /home/i57/steuber/NeuroDiff/repos/VeryDiffExperiments/src/../benchmarks/mnist-prune/nets/mnist_relu_3_100.onnx
Found input X
op: matmul, weight: (100, 784), bias: nothing
op: bias, weight: nothing, bias: (100,)
op: relu, weight: nothing, bias: nothing
op: matmul, weight: (100, 100), bias: nothing
op: bias, weight: nothing, bias: (100,)
op: relu, weight: nothing, bias: nothing
op: matmul, weight: (10, 100), bias: nothing
op: bias, weight: nothing, bias: (10,)
op: relu, weight: nothing, bias: nothing
op: matmul, weight: (10, 10), bias: nothing
op: bias, weight: nothing, bias: (10,)
Found input X
op: matmul, weight: (100, 784), bias: nothing
op: bias, weight: nothing, bias: (100,)
op: relu, weight: nothing, bias: nothing
op: matmul, weight: (100, 100), bias: nothing
op: bias, weight: nothing, bias: (100,)
op: relu, weight: nothing, bias: nothing
op: matmul, weight: (10, 100), bias: nothing
op: bias, weight: nothing, bias: (10,)
op: relu, weight: nothing, bias: nothing
op: matmul, weight: (10, 10), bias: nothing
op: bias, weight: nothing, bias: (10,)
Distance: 296.6600370998244
Distance: 77.24290861755458
Distance: 5.7170369567975285
Distance: 0.0
Running with 1 threads
[Thread 1] Time to first task: 0.0s
Instable Generators: 50
Instable Generators: 69
Instable Generators: 8
Zono Bounds:
[-1.0201609531380034, -1.215192271354347, -1.0992345380798119, -1.336689680573698, -0.16106033321878488, -1.814256603314383, -1.3997753748679664, -1.6884969712224236, -1.3392538577560447, -1.0841254637219815]
[0.8894837074737052, 1.215192271354347, 1.0594816966519711, 1.336689680573698, 0.16368896827322565, 0.9459615352483961, 0.8711180044677045, 1.6884969712224236, 1.3392538577560447, 1.0841254637219815]
[Thread 1] Processed 100 zonotopes (Work Done: 0.0%; Expected Zonos: Inf)
[Thread 1] Processed 200 zonotopes (Work Done: 0.0%; Expected Zonos: Inf)
[Thread 1] Processed 300 zonotopes (Work Done: 0.0%; Expected Zonos: Inf)
[Thread 1] Processed 400 zonotopes (Work Done: 0.0%; Expected Zonos: Inf)
[Thread 1] Processed 500 zonotopes (Work Done: 0.0%; Expected Zonos: Inf)


TIMEOUT REACHED
UNKNOWN
[Thread 1] Total splits: 555
Processed 555 zonotopes (Work Done: 0.0%); Generated 1110 (0.2166629341891892s/loop)
[Thread 1] Finished in 120.25s
 ────────────────────────────────────────────────────────────────────────────────
                                        Time                    Allocations      
                               ───────────────────────   ────────────────────────
       Tot / % measured:             120s / 100.0%           61.2GiB / 100.0%    

 Section               ncalls     time    %tot     avg     alloc    %tot      avg
 ────────────────────────────────────────────────────────────────────────────────
 Verify                     1     120s  100.0%    120s   61.2GiB  100.0%  61.2GiB
   Zonotope Loop            1     120s  100.0%    120s   61.2GiB  100.0%  61.2GiB
     Zonotope Propa...    555     112s   93.0%   201ms   41.7GiB   68.1%  76.9MiB
       DiffZonotope...  2.22k    77.4s   64.3%  34.8ms   2.30GiB    3.8%  1.06MiB
         Zonotope_D...  4.44k    72.3s   60.1%  16.3ms   1.50GiB    2.4%   353KiB
       DiffZonotope...  1.67k    34.4s   28.6%  20.7ms   39.4GiB   64.3%  24.2MiB
         Zonotope_R...  3.33k    33.8s   28.1%  10.1ms   38.4GiB   62.7%  11.8MiB
           Influenc...  3.33k    32.7s   27.2%  9.82ms   35.3GiB   57.7%  10.9MiB
             Alloca...  3.33k    18.2s   15.2%  5.48ms   17.2GiB   28.1%  5.30MiB
             Multiply   3.33k    11.9s    9.9%  3.58ms   18.1GiB   29.6%  5.57MiB
             Set Ma...  3.33k    2.53s    2.1%   760μs     0.00B    0.0%    0.00B
           Column M...  3.33k    506ms    0.4%   152μs   1.52GiB    2.5%   478KiB
           Allocation   3.33k    355ms    0.3%   107μs   1.52GiB    2.5%   478KiB
           Set Matrix   3.33k    191ms    0.2%  57.4μs   4.42MiB    0.0%  1.36KiB
           Vectors      3.33k   17.1ms    0.0%  5.12μs   10.6MiB    0.0%  3.26KiB
           Bounds       3.33k   2.33ms    0.0%   700ns     0.00B    0.0%    0.00B
     Compute Split        555    4.17s    3.5%  7.51ms   8.67GiB   14.2%  16.0MiB
     Property Check       555    612ms    0.5%  1.10ms   64.9MiB    0.1%   120KiB
 Initialize                 1    594μs    0.0%   594μs   5.41MiB    0.0%  5.41MiB
 ────────────────────────────────────────────────────────────────────────────────
[VERYDIFF_TIMER] 120.279848265

[VERYDIFF_EXPERIMENT] Running on /home/i57/steuber/NeuroDiff/repos/VeryDiffExperiments/src/../benchmarks/mnist-prune/specs/mnist_77_global_6.vnnlib /home/i57/steuber/NeuroDiff/repos/VeryDiffExperiments/src/../benchmarks/mnist-prune/nets/mnist_relu_4_1024.onnx
Found input X
op: matmul, weight: (1024, 784), bias: nothing
op: bias, weight: nothing, bias: (1024,)
op: relu, weight: nothing, bias: nothing
op: matmul, weight: (1024, 1024), bias: nothing
op: bias, weight: nothing, bias: (1024,)
op: relu, weight: nothing, bias: nothing
op: matmul, weight: (1024, 1024), bias: nothing
op: bias, weight: nothing, bias: (1024,)
op: relu, weight: nothing, bias: nothing
op: matmul, weight: (10, 1024), bias: nothing
op: bias, weight: nothing, bias: (10,)
op: relu, weight: nothing, bias: nothing
op: matmul, weight: (10, 10), bias: nothing
op: bias, weight: nothing, bias: (10,)
Found input X
op: matmul, weight: (1024, 784), bias: nothing
op: bias, weight: nothing, bias: (1024,)
op: relu, weight: nothing, bias: nothing
op: matmul, weight: (1024, 1024), bias: nothing
op: bias, weight: nothing, bias: (1024,)
op: relu, weight: nothing, bias: nothing
op: matmul, weight: (1024, 1024), bias: nothing
op: bias, weight: nothing, bias: (1024,)
op: relu, weight: nothing, bias: nothing
op: matmul, weight: (10, 1024), bias: nothing
op: bias, weight: nothing, bias: (10,)
op: relu, weight: nothing, bias: nothing
op: matmul, weight: (10, 10), bias: nothing
op: bias, weight: nothing, bias: (10,)
Distance: 1266.8815759184893
Distance: 2876.6944248261216
Distance: 2831.8843567411013
Distance: 34.033756025192815
Distance: 0.0
Running with 1 threads
[Thread 1] Time to first task: 0.01s
Instable Generators: 503
Instable Generators: 932
Instable Generators: 973
Instable Generators: 10
Zono Bounds:
[-103.13596289338031, -105.64935955261478, -116.8086222271647, -116.94496004744282, -111.0090380667971, -120.03287304365634, -106.96473603486514, -111.74600068529838, -112.9067303068258, -118.76863983845286]
[103.13596289338031, 105.64935955261478, 116.80862222716473, 116.94496004744282, 109.77794929702824, 114.93654212741293, 102.35726100181888, 111.74600068529838, 112.9067303068258, 118.76863983845286]

Found counterexample: ([0.02352941, 0.02352941, 0.0, 0.02352941, 0.02352941, 0.02352941, 0.0, 0.02352941, 0.02352941, 0.02352941, 0.02352941, 0.02352941, 0.02352941, 0.0, 0.0, 0.02352941, 0.02352941, 0.0, 0.0, 0.02352941, 0.02352941, 0.0, 0.02352941, 0.02352941, 0.02352941, 0.02352941, 0.0, 0.02352941, 0.02352941, 0.02352941, 0.0, 0.0, 0.02352941, 0.02352941, 0.0, 0.0, 0.02352941, 0.0, 0.02352941, 0.0, 0.02352941, 0.02352941, 0.02352941, 0.02352941, 0.0, 0.0, 0.0, 0.0, 0.02352941, 0.0, 0.02352941, 0.0, 0.0, 0.02352941, 0.0, 0.0, 0.02352941, 0.02352941, 0.0, 0.02352941, 0.02352941, 0.0, 0.02352941, 0.02352941, 0.02352941, 0.02352941, 0.02352941, 0.02352941, 0.02352941, 0.0, 0.02352941, 0.02352941, 0.0, 0.02352941, 0.02352941, 0.0, 0.02352941, 0.02352941, 0.02352941, 0.0, 0.02352941, 0.02352941, 0.02352941, 0.02352941, 0.0, 0.02352941, 0.02352941, 0.0, 0.0, 0.02352941, 0.0, 0.02352941, 0.02352941, 0.0, 0.02352941, 0.02352941, 0.02352941, 0.0, 0.02352941, 0.02352941, 0.02352941, 0.02352941, 0.0, 0.0, 0.0, 0.0, 0.0, 0.02352941, 0.02352941, 0.02352941, 0.02352941, 0.0, 0.02352941, 0.02352941, 0.02352941, 0.02352941, 0.02352941, 0.02352941, 0.02352941, 0.02352941, 0.02352941, 0.02352941, 0.02352941, 0.0, 0.02352941, 0.02352941, 0.02352941, 0.02352941, 0.02352941, 0.0, 0.0, 0.0, 0.02352941, 0.0, 0.0, 0.0, 0.0, 0.0, 0.02352941, 0.0, 0.02352941, 0.02352941, 0.02352941, 0.02352941, 0.02352941, 0.02352941, 0.02352941, 0.02352941, 0.02352941, 0.02352941, 0.0, 0.0, 0.02352941, 0.02352941, 0.02352941, 0.02352941, 0.0, 0.0, 0.02352941, 0.02352941, 0.02352941, 0.0, 0.0, 0.0, 0.0, 0.02352941, 0.02352941, 0.02352941, 0.0, 0.02352941, 0.02352941, 0.02352941, 0.02352941, 0.0, 0.02352941, 0.02352941, 0.0, 0.02352941, 0.02352941, 0.02352941, 0.02352941, 0.02352941, 0.02352941, 0.02352941, 0.02352941, 0.02352941, 0.02352941, 0.0, 0.0, 0.0, 0.0, 0.0, 0.0, 0.0, 0.0, 0.02352941, 0.0, 0.02352941, 0.0, 0.02352941, 0.0, 0.02352941, 0.02352941, 0.0, 0.0, 0.0, 0.12156863, 0.52549022, 0.5725490500000001, 0.5725490500000001, 0.52549022, 0.20392157, 0.03921569, 0.02352941, 0.02352941, 0.02352941, 0.0, 0.0, 0.0, 0.0, 0.0, 0.0, 0.02352941, 0.0, 0.02352941, 0.02352941, 0.0, 0.02352941, 0.02352941, 0.0, 0.02352941, 0.20784314, 0.48627451000000005, 0.73725492, 1.0, 0.96862745, 0.96862745, 0.96862745, 0.96862745, 0.96862745, 0.81960785, 0.33725490999999996, 0.02352941, 0.02352941, 0.0, 0.0, 0.0, 0.0, 0.0, 0.0, 0.02352941, 0.02352941, 0.02352941, 0.0, 0.0, 0.02352941, 0.02352941, 0.02352941, 0.3764706, 0.75294119, 0.96862745, 0.87450981, 0.6313725700000001, 0.10588235, 0.05490196, 0.05490196, 0.14117648, 0.4627451, 0.96078432, 0.9921568600000001, 0.6588235500000001, 0.02352941, 0.02352941, 0.02352941, 0.0, 0.0, 0.0, 0.0, 0.02352941, 0.0, 0.0, 0.0, 0.02352941, 0.02352941, 0.0, 0.27058825, 0.9490196100000001, 0.9764705900000001, 0.3882353, 0.0, 0.0, 0.0, 0.0, 0.0, 0.0, 0.0, 0.43529412000000006, 1.0, 0.98039216, 0.22352941, 0.02352941, 0.0, 0.02352941, 0.0, 0.0, 0.0, 0.0, 0.0, 0.02352941, 0.0, 0.02352941, 0.0, 0.0, 0.97254902, 0.96862745, 0.47058824, 0.02352941, 0.02352941, 0.0, 0.02352941, 0.0, 0.0, 0.0, 0.0, 0.04313726, 0.8039215800000001, 1.0, 0.3058823600000001, 0.02352941, 0.02352941, 0.02352941, 0.02352941, 0.0, 0.02352941, 0.02352941, 0.0, 0.02352941, 0.02352941, 0.02352941, 0.0, 0.02352941, 0.97647059, 0.96862745, 0.42352942, 0.0, 0.0, 0.0, 0.0, 0.0, 0.0, 0.0, 0.02352941, 0.02352941, 0.7764706000000001, 1.0, 0.3058823600000001, 0.02352941, 0.02352941, 0.02352941, 0.02352941, 0.02352941, 0.02352941, 0.02352941, 0.0, 0.0, 0.02352941, 0.02352941, 0.0, 0.02352941, 0.38039216, 0.22745098, 0.05098039, 0.02352941, 0.0, 0.02352941, 0.0, 0.0, 0.0, 0.0, 0.02352941, 0.16078432000000004, 0.98039216, 0.9137254999999999, 0.07058824, 0.02352941, 0.02352941, 0.02352941, 0.02352941, 0.0, 0.02352941, 0.02352941, 0.02352941, 0.0, 0.0, 0.0, 0.02352941, 0.02352941, 0.02352941, 0.02352941, 0.0, 0.02352941, 0.02352941, 0.0, 0.0, 0.02352941, 0.0, 0.0, 0.0, 0.52156866, 1.0, 0.56078434, 0.02352941, 0.02352941, 0.02352941, 0.02352941, 0.0, 0.02352941, 0.02352941, 0.02352941, 0.02352941, 0.02352941, 0.0, 0.0, 0.02352941, 0.0, 0.0, 0.0, 0.0, 0.0, 0.0, 0.0, 0.02352941, 0.0, 0.02352941, 0.02352941, 0.49411764999999996, 1.0, 0.5803921799999999, 0.0, 0.02352941, 0.0, 0.0, 0.02352941, 0.0, 0.02352941, 0.02352941, 0.0, 0.02352941, 0.02352941, 0.0, 0.0, 0.02352941, 0.02352941, 0.0, 0.02352941, 0.02352941, 0.02352941, 0.0, 0.02352941, 0.02352941, 0.02352941, 0.02352941, 0.29411766000000006, 1.0, 0.8588235400000002, 0.12941177000000004, 0.02352941, 0.0, 0.0, 0.0, 0.02352941, 0.0, 0.0, 0.0, 0.02352941, 0.0, 0.02352941, 0.02352941, 0.0, 0.02352941, 0.02352941, 0.0, 0.0, 0.0, 0.0, 0.0, 0.0, 0.02352941, 0.02352941, 0.49411764999999996, 0.9254901999999999, 0.74117649, 0.13333334, 0.02352941, 0.0, 0.0, 0.0, 0.0, 0.0, 0.0, 0.0, 0.02352941, 0.02352941, 0.0, 0.02352941, 0.02352941, 0.0, 0.02352941, 0.0, 0.0, 0.0, 0.0, 0.0, 0.0, 0.0, 0.0627451, 0.65098041, 1.0, 0.72941178, 0.03529412, 0.0, 0.02352941, 0.02352941, 0.0, 0.0, 0.0, 0.0, 0.0, 0.0, 0.02352941, 0.02352941, 0.02352941, 0.02352941, 0.02352941, 0.02352941, 0.02352941, 0.02352941, 0.0, 0.0, 0.0, 0.0, 0.0, 0.0, 0.78431374, 0.96862745, 0.83529413, 0.3333333399999999, 0.08627451, 0.14901961, 0.02352941, 0.0, 0.0, 0.0, 0.0, 0.0, 0.04705882, 0.16078432, 0.02352941, 0.02352941, 0.02352941, 0.02352941, 0.0, 0.0, 0.02352941, 0.0, 0.0, 0.0, 0.02352941, 0.0, 0.02745098, 0.58039218, 0.95686275, 1.0, 0.96862745, 0.96862745, 0.89019608, 0.89803922, 0.8509804, 0.87058824, 0.91764706, 0.87058824, 0.81176472, 0.48235294, 0.89411765, 0.92941177, 0.02352941, 0.02352941, 0.0, 0.0, 0.02352941, 0.02352941, 0.02352941, 0.02352941, 0.0, 0.0, 0.0, 0.0, 0.24705882, 0.96862745, 0.48627451, 0.3019608, 0.3019608, 0.3019608, 0.3019608, 0.24705882, 0.52941179, 0.53725493, 0.627451, 0.33333334, 0.81568629, 0.58431375, 0.87450981, 0.96862745, 0.0, 0.02352941, 0.0, 0.02352941, 0.0, 0.02352941, 0.02352941, 0.02352941, 0.0, 0.02352941, 0.02352941, 0.02352941, 0.03921569, 0.16470589, 0.05098039, 0.0, 0.0, 0.0, 0.0, 0.0, 0.0, 0.0, 0.02352941, 0.02352941, 0.08235294, 0.02352941, 0.06666667, 0.11764706, 0.0, 0.0, 0.0, 0.02352941, 0.02352941, 0.0, 0.0, 0.0, 0.0, 0.02352941, 0.02352941, 0.02352941, 0.0, 0.02352941, 0.0, 0.0, 0.02352941, 0.0, 0.0, 0.0, 0.0, 0.02352941, 0.02352941, 0.02352941, 0.02352941, 0.0, 0.0, 0.02352941, 0.02352941, 0.02352941, 0.02352941, 0.02352941, 0.0, 0.02352941, 0.02352941, 0.0, 0.02352941, 0.02352941, 0.02352941, 0.0, 0.0, 0.0, 0.0, 0.0, 0.0, 0.0, 0.02352941, 0.02352941, 0.0, 0.0, 0.02352941, 0.02352941, 0.0, 0.0, 0.0, 0.02352941, 0.02352941, 0.02352941, 0.02352941, 0.02352941, 0.02352941, 0.02352941, 0.0, 0.02352941, 0.02352941, 0.02352941, 0.02352941, 0.02352941, 0.0, 0.02352941, 0.02352941, 0.0, 0.0, 0.02352941, 0.02352941, 0.0, 0.0, 0.0, 0.0, 0.0, 0.0, 0.0, 0.02352941, 0.0, 0.0, 0.02352941, 0.02352941, 0.0, 0.0, 0.02352941, 0.02352941, 0.02352941, 0.0, 0.0, 0.02352941, 0.02352941, 0.02352941, 0.0, 0.0, 0.02352941, 0.02352941, 0.02352941, 0.02352941, 0.02352941, 0.0, 0.02352941, 0.0, 0.02352941, 0.0, 0.0, 0.02352941, 0.02352941, 0.0, 0.02352941, 0.02352941, 0.02352941, 0.0, 0.0, 0.0, 0.0, 0.02352941, 0.0, 0.02352941, 0.02352941, 0.02352941, 0.0, 0.0, 0.02352941, 0.02352941, 0.0, 0.02352941, 0.02352941, 0.02352941, 0.0, 0.02352941, 0.02352941, 0.02352941, 0.02352941, 0.0, 0.02352941, 0.02352941, 0.0, 0.0], ([0.0, 5.602737411180407, 20.57825795177685, 1.9565480517941516, 0.0, 0.0, 0.0, 5.55639832714561, 0.8830550967866426, 0.0], [0.0, 5.500098342936576, 18.05749798941713, 1.9782100784886, 0.0, 0.0, 0.0, 3.7478719563909437, 0.7378547300056699, 0.0], 2.520759962359719))
[Thread 1] Total splits: 0
Processed 1 zonotopes (Work Done: 0.0%); Generated 0 (2.85768941s/loop)
[Thread 1] Finished in 2.86s
 ────────────────────────────────────────────────────────────────────────────────
                                        Time                    Allocations      
                               ───────────────────────   ────────────────────────
       Tot / % measured:            2.88s / 100.0%            824MiB / 100.0%    

 Section               ncalls     time    %tot     avg     alloc    %tot      avg
 ────────────────────────────────────────────────────────────────────────────────
 Verify                     1    2.86s   99.3%   2.86s    797MiB   96.7%   797MiB
   Zonotope Loop            1    2.86s   99.3%   2.86s    797MiB   96.7%   797MiB
     Zonotope Propa...      1    2.83s   98.4%   2.83s    776MiB   94.2%   776MiB
       DiffZonotope...      4    1.80s   62.4%   449ms    641MiB   77.8%   160MiB
         Zonotope_R...      8    1.62s   56.1%   202ms    517MiB   62.7%  64.6MiB
           Influenc...      8    715ms   24.8%  89.3ms    302MiB   36.7%  37.7MiB
             Multiply       8    401ms   13.9%  50.1ms    181MiB   22.0%  22.6MiB
             Alloca...      8    295ms   10.3%  36.9ms    121MiB   14.7%  15.1MiB
             Set Ma...      8   18.9ms    0.7%  2.36ms     0.00B    0.0%    0.00B
           Allocation       8    524ms   18.2%  65.5ms    107MiB   13.0%  13.4MiB
           Column M...      8    357ms   12.4%  44.7ms    107MiB   13.0%  13.4MiB
           Set Matrix       8   19.7ms    0.7%  2.46ms    126KiB    0.0%  15.8KiB
           Vectors          8    243μs    0.0%  30.3μs    272KiB    0.0%  34.0KiB
           Bounds           8   5.77μs    0.0%   721ns     0.00B    0.0%    0.00B
       DiffZonotope...      5    1.03s   35.9%   207ms    135MiB   16.4%  27.0MiB
         Zonotope_D...     10    452ms   15.7%  45.2ms   69.1MiB    8.4%  6.91MiB
     Property Check         1   11.2ms    0.4%  11.2ms    584KiB    0.1%   584KiB
 Initialize                 1   21.1ms    0.7%  21.1ms   27.0MiB    3.3%  27.0MiB
 ────────────────────────────────────────────────────────────────────────────────
[VERYDIFF_TIMER] 2.99058371

[VERYDIFF_EXPERIMENT] NETWORK: /home/i57/steuber/NeuroDiff/repos/VeryDiffExperiments/src/../benchmarks/mnist-prune/specs/mnist_77_global_6.vnnlib
[VERYDIFF_EXPERIMENT] TIME: 124.964092477
