
[VERYDIFF_EXPERIMENT] Running on /home/i57/steuber/NeuroDiff/repos/VeryDiffExperiments/src/../benchmarks/mnist-prune/specs/mnist_25_global_6.vnnlib /home/i57/steuber/NeuroDiff/repos/VeryDiffExperiments/src/../benchmarks/mnist-prune/nets/mnist_relu_4_1024.onnx
Found input X
op: matmul, weight: (1024, 784), bias: nothing
op: bias, weight: nothing, bias: (1024,)
op: relu, weight: nothing, bias: nothing
op: matmul, weight: (1024, 1024), bias: nothing
op: bias, weight: nothing, bias: (1024,)
op: relu, weight: nothing, bias: nothing
op: matmul, weight: (1024, 1024), bias: nothing
op: bias, weight: nothing, bias: (1024,)
op: relu, weight: nothing, bias: nothing
op: matmul, weight: (10, 1024), bias: nothing
op: bias, weight: nothing, bias: (10,)
op: relu, weight: nothing, bias: nothing
op: matmul, weight: (10, 10), bias: nothing
op: bias, weight: nothing, bias: (10,)
Found input X
op: gemm, weight: (1024, 784), bias: (1024,)
op: relu, weight: nothing, bias: nothing
op: gemm, weight: (1024, 1024), bias: (1024,)
op: relu, weight: nothing, bias: nothing
op: gemm, weight: (1024, 1024), bias: (1024,)
op: relu, weight: nothing, bias: nothing
op: gemm, weight: (10, 1024), bias: (10,)
op: relu, weight: nothing, bias: nothing
op: gemm, weight: (10, 10), bias: (10,)
Distance: 915.6394868631054
Distance: 1298.7052820973968
Distance: 1296.587532894263
Distance: 6.054483317080667
Distance: 0.04942679278974538
Running with 1 threads
[Thread 1] Time to first task: 0.01s
Instable Generators: 319
Instable Generators: 603
Instable Generators: 1019
Instable Generators: 10
Zono Bounds:
[-105.75828200096046, -108.29726777648074, -119.59576047528951, -118.47473955300619, -114.98245584513909, -119.99135276547615, -107.9997884874706, -112.73963292897936, -115.80269868395062, -119.90785838088482]
[105.68502108484725, 107.58209859222097, 119.2486388517308, 118.44070175126554, 114.93836770524634, 119.67266718708235, 108.02190338438629, 112.38671402557968, 114.8048025021253, 119.85145606988021]


TIMEOUT REACHED
UNKNOWN
[Thread 1] Total splits: 51
Processed 51 zonotopes (Work Done: 0.0%); Generated 102 (2.394888992372549s/loop)
[Thread 1] Finished in 122.14s
 ────────────────────────────────────────────────────────────────────────────────
                                        Time                    Allocations      
                               ───────────────────────   ────────────────────────
       Tot / % measured:             122s / 100.0%           33.4GiB / 100.0%    

 Section               ncalls     time    %tot     avg     alloc    %tot      avg
 ────────────────────────────────────────────────────────────────────────────────
 Verify                     1     122s  100.0%    122s   33.4GiB   99.9%  33.4GiB
   Zonotope Loop            1     122s  100.0%    122s   33.4GiB   99.9%  33.4GiB
     Zonotope Propa...     51     116s   94.9%   2.27s   30.5GiB   91.2%   612MiB
       DiffZonotope...    204    71.1s   58.2%   349ms   25.2GiB   75.5%   127MiB
         Zonotope_R...    408    67.7s   55.4%   166ms   20.5GiB   61.4%  51.5MiB
           Influenc...    408    49.5s   40.5%   121ms   11.9GiB   35.5%  29.8MiB
             Multiply     408    36.0s   29.5%  88.3ms   6.95GiB   20.8%  17.4MiB
             Alloca...    408    12.7s   10.4%  31.1ms   4.92GiB   14.7%  12.3MiB
             Set Ma...    408    775ms    0.6%  1.90ms     0.00B    0.0%    0.00B
           Allocation     408    12.4s   10.1%  30.3ms   4.32GiB   12.9%  10.8MiB
           Column M...    408    5.03s    4.1%  12.3ms   4.32GiB   12.9%  10.8MiB
           Set Matrix     408    787ms    0.6%  1.93ms   5.02MiB    0.0%  12.6KiB
           Vectors        408   12.3ms    0.0%  30.1μs   13.5MiB    0.0%  34.0KiB
           Bounds         408    328μs    0.0%   804ns     0.00B    0.0%    0.00B
       DiffZonotope...    255    44.8s   36.7%   176ms   5.25GiB   15.7%  21.1MiB
         Zonotope_D...    510    19.4s   15.9%  38.0ms   2.84GiB    8.5%  5.71MiB
     Compute Split         51    5.41s    4.4%   106ms   1.89GiB    5.7%  38.0MiB
     Property Check        51    582ms    0.5%  11.4ms   29.1MiB    0.1%   585KiB
 Initialize                 1   15.8ms    0.0%  15.8ms   27.0MiB    0.1%  27.0MiB
 ────────────────────────────────────────────────────────────────────────────────
[VERYDIFF_TIMER] 122.236991003

[VERYDIFF_EXPERIMENT] NETWORK: /home/i57/steuber/NeuroDiff/repos/VeryDiffExperiments/src/../benchmarks/mnist-prune/specs/mnist_25_global_6.vnnlib
[VERYDIFF_EXPERIMENT] TIME: 122.526023692
