
[VERYDIFF_EXPERIMENT] Running on /home/i57/steuber/NeuroDiff/repos/VeryDiffExperiments/src/../benchmarks/mnist-prune/specs/mnist_17_global_5.vnnlib /home/i57/steuber/NeuroDiff/repos/VeryDiffExperiments/src/../benchmarks/mnist-prune/nets/mnist_relu_3_100.onnx
Found input X
op: matmul, weight: (100, 784), bias: nothing
op: bias, weight: nothing, bias: (100,)
op: relu, weight: nothing, bias: nothing
op: matmul, weight: (100, 100), bias: nothing
op: bias, weight: nothing, bias: (100,)
op: relu, weight: nothing, bias: nothing
op: matmul, weight: (10, 100), bias: nothing
op: bias, weight: nothing, bias: (10,)
op: relu, weight: nothing, bias: nothing
op: matmul, weight: (10, 10), bias: nothing
op: bias, weight: nothing, bias: (10,)
Found input X
op: gemm, weight: (100, 784), bias: (100,)
op: relu, weight: nothing, bias: nothing
op: gemm, weight: (100, 100), bias: (100,)
op: relu, weight: nothing, bias: nothing
op: gemm, weight: (10, 100), bias: (10,)
op: relu, weight: nothing, bias: nothing
op: gemm, weight: (10, 10), bias: (10,)
Distance: 368.62397500800625
Distance: 47.56803950402309
Distance: 2.8977568827249343
Distance: 0.01885471428334995
Running with 1 threads
[Thread 1] Time to first task: 0.0s
Instable Generators: 33
Instable Generators: 34
Instable Generators: 2
Zono Bounds:
[-0.07819490604165916, -0.7218442337408383, -0.7319043431936688, -0.8629384801413954, -0.00038857158276395704, -0.9607512271641608, 0.00021001432846892625, -0.8382007084959586, -0.0011793293008808576, -0.7775877996411039]
[0.0806231978063246, 0.7221078736234067, 0.7614535622005335, 0.8483171585962045, 0.0005332125282324271, 0.9590257735554965, 0.0006328919826141804, 0.791785343065752, -0.000288314498548965, 0.7871922574804383]
[Thread 1] Processed 100 zonotopes (Work Done: 0.0%; Expected Zonos: Inf)
[Thread 1] Processed 200 zonotopes (Work Done: 0.0%; Expected Zonos: Inf)
[Thread 1] Processed 300 zonotopes (Work Done: 0.0%; Expected Zonos: Inf)
[Thread 1] Processed 400 zonotopes (Work Done: 0.0%; Expected Zonos: Inf)
[Thread 1] Processed 500 zonotopes (Work Done: 0.0%; Expected Zonos: Inf)


TIMEOUT REACHED
UNKNOWN
[Thread 1] Total splits: 576
Processed 576 zonotopes (Work Done: 0.0%); Generated 1152 (0.20846738318055558s/loop)
[Thread 1] Finished in 120.08s
 ────────────────────────────────────────────────────────────────────────────────
                                        Time                    Allocations      
                               ───────────────────────   ────────────────────────
       Tot / % measured:             120s / 100.0%           60.6GiB / 100.0%    

 Section               ncalls     time    %tot     avg     alloc    %tot      avg
 ────────────────────────────────────────────────────────────────────────────────
 Verify                     1     120s  100.0%    120s   60.6GiB  100.0%  60.6GiB
   Zonotope Loop            1     120s  100.0%    120s   60.6GiB  100.0%  60.6GiB
     Zonotope Propa...    576    67.4s   56.1%   117ms   40.7GiB   67.1%  72.3MiB
       DiffZonotope...  1.73k    57.3s   47.7%  33.1ms   38.4GiB   63.3%  22.7MiB
         Zonotope_R...  3.46k    56.8s   47.3%  16.4ms   37.5GiB   61.8%  11.1MiB
           Influenc...  3.46k    32.8s   27.3%  9.48ms   34.4GiB   56.8%  10.2MiB
             Multiply   3.46k    16.7s   13.9%  4.83ms   17.5GiB   28.8%  5.17MiB
             Alloca...  3.46k    13.6s   11.3%  3.94ms   17.0GiB   28.0%  5.03MiB
             Set Ma...  3.46k    2.47s    2.1%   714μs     0.00B    0.0%    0.00B
           Column M...  3.46k    23.7s   19.8%  6.87ms   1.51GiB    2.5%   457KiB
           Set Matrix   3.46k    190ms    0.2%  54.9μs   2.90MiB    0.0%     880B
           Allocation   3.46k   82.6ms    0.1%  23.9μs   1.51GiB    2.5%   457KiB
           Vectors      3.46k   17.8ms    0.0%  5.14μs   11.0MiB    0.0%  3.26KiB
           Bounds       3.46k   2.46ms    0.0%   711ns     0.00B    0.0%    0.00B
       DiffZonotope...  2.30k    10.1s    8.4%  4.39ms   2.33GiB    3.8%  1.03MiB
         Zonotope_D...  4.61k    4.89s    4.1%  1.06ms   1.53GiB    2.5%   347KiB
     Compute Split        576    27.1s   22.5%  47.0ms   8.59GiB   14.2%  15.3MiB
     Property Check       576    114ms    0.1%   198μs    118MiB    0.2%   209KiB
 Initialize                 1   1.27ms    0.0%  1.27ms   5.41MiB    0.0%  5.41MiB
 ────────────────────────────────────────────────────────────────────────────────
[VERYDIFF_TIMER] 120.108908326

[VERYDIFF_EXPERIMENT] NETWORK: /home/i57/steuber/NeuroDiff/repos/VeryDiffExperiments/src/../benchmarks/mnist-prune/specs/mnist_17_global_5.vnnlib
[VERYDIFF_EXPERIMENT] TIME: 120.581493101
