
[VERYDIFF_EXPERIMENT] Running on /home/i57/steuber/NeuroDiff/repos/VeryDiffExperiments/src/../benchmarks/mnist-prune/specs/mnist_83_local_24.vnnlib /home/i57/steuber/NeuroDiff/repos/VeryDiffExperiments/src/../benchmarks/mnist-prune/nets/mnist_relu_2_512.onnx
Loading /home/i57/steuber/NeuroDiff/repos/VeryDiffExperiments/src/../benchmarks/mnist-prune/nets/mnist_relu_2_512.onnx and /home/i57/steuber/NeuroDiff/repos/VeryDiffExperiments/src/../benchmarks/mnist-prune/nets_pruned/mnist_relu_2_512_0.79-old.onnx
INPUT SHAPE: 784

[NEQUIV] 178.79463294169045

[-51.56765758 -56.9653912  -45.10880449 -51.50647466 -62.93053604
 -49.55840733 -72.19232865  17.08889881 -83.27764459 -33.98024191]
[-52.57164816 -56.87737257 -45.31796216 -51.45521649 -62.92790324
 -49.44253157 -73.1640801   16.73564328 -83.9790973  -33.80679468]
NETWORKS NOT EQUIVALENT
Refined: 6 | Refine Limit: 5 | Wrong: 0 | Right: 1 | Total: 1 | Total Zonos Considered: 7 | Expected 8192 (0.01220703125%)

time: 7.8194762

[VERYDIFF_TIMER] 7.842693473

[VERYDIFF_EXPERIMENT] NETWORK: /home/i57/steuber/NeuroDiff/repos/VeryDiffExperiments/src/../benchmarks/mnist-prune/specs/mnist_83_local_24.vnnlib
[VERYDIFF_EXPERIMENT] TIME: 8.132322594
