
[VERYDIFF_EXPERIMENT] Running on /home/i57/steuber/NeuroDiff/repos/VeryDiffExperiments/src/../benchmarks/mnist-prune/specs/mnist_46_global_5.vnnlib /home/i57/steuber/NeuroDiff/repos/VeryDiffExperiments/src/../benchmarks/mnist-prune/nets/mnist_relu_2_512.onnx
/home/i57/steuber/NeuroDiff/repos/VeryDiffExperiments/src/../benchmarks/mnist-prune/nets/mnist_relu_2_512.onnx
/home/i57/steuber/NeuroDiff/repos/VeryDiffExperiments/src/../benchmarks/mnist-prune/nets_pruned/mnist_relu_2_512_pruned5.onnx
[[0.         0.01960784]
 [0.         0.01960784]
 [0.         0.01960784]
 ...
 [0.         0.01960784]
 [0.         0.01960784]
 [0.         0.01960784]]
top
120
False
512
512
512
512
### Vars ###
### Constraints ###
A_pi_3_0 = 0 --> (A_x_2_0 + 0.0001) <= A_top_3_0
A_pi_3_1 = 0 --> (A_x_2_1 + 0.0001) <= A_top_3_0
A_pi_3_2 = 0 --> (A_x_2_2 + 0.0001) <= A_top_3_0
A_pi_3_3 = 0 --> (A_x_2_3 + 0.0001) <= A_top_3_0
A_pi_3_4 = 0 --> (A_x_2_4 + 0.0001) <= A_top_3_0
A_pi_3_5 = 0 --> (A_x_2_5 + 0.0001) <= A_top_3_0
A_pi_3_6 = 0 --> (A_x_2_6 + 0.0001) <= A_top_3_0
A_pi_3_7 = 0 --> (A_x_2_7 + 0.0001) <= A_top_3_0
A_pi_3_8 = 0 --> (A_x_2_8 + 0.0001) <= A_top_3_0
A_pi_3_9 = 0 --> (A_x_2_9 + 0.0001) <= A_top_3_0
Set parameter TimeLimit to value 120
Set parameter Threads to value 1
Gurobi Optimizer version 10.0.0 build v10.0.0rc2 (linux64)

CPU model: Intel(R) Core(TM) i5-6500 CPU @ 3.20GHz, instruction set [SSE2|AVX|AVX2]
Thread count: 4 physical cores, 4 logical processors, using up to 1 threads

Optimize a model with 14522 rows, 7012 columns and 1321876 nonzeros
Model fingerprint: 0x86cd1c3b
Variable types: 4934 continuous, 2078 integer (2078 binary)
Coefficient statistics:
  Matrix range     [1e-07, 2e+06]
  Objective range  [1e+00, 1e+00]
  Bounds range     [4e-03, 1e+00]
  RHS range        [1e-04, 2e+06]
Warning: Model contains large matrix coefficient range
         Consider reformulating model or setting NumericFocus parameter
         to avoid numerical issues.
Presolve removed 7698 rows and 2090 columns
Presolve time: 2.32s
Presolved: 6824 rows, 4922 columns, 603598 nonzeros
Variable types: 3595 continuous, 1327 integer (1327 binary)

Root relaxation: objective 4.944757e+02, 3069 iterations, 1.05 seconds (2.18 work units)

    Nodes    |    Current Node    |     Objective Bounds      |     Work
 Expl Unexpl |  Obj  Depth IntInf | Incumbent    BestBd   Gap | It/Node Time

     0     0  494.47569    0  450          -  494.47569      -     -    4s
     0     0  493.09740    0  510          -  493.09740      -     -    8s
     0     0  491.94163    0  497          -  491.94163      -     -    9s
     0     0  491.16665    0  482          -  491.16665      -     -    9s
     0     0  490.85386    0  468          -  490.85386      -     -    9s
     0     0  490.78325    0  474          -  490.78325      -     -   10s
     0     0  490.76335    0  473          -  490.76335      -     -   10s
     0     0  490.76335    0  473          -  490.76335      -     -   10s
     0     0  489.91555    0  492          -  489.91555      -     -   12s
     0     0  489.77125    0  488          -  489.77125      -     -   13s
     0     0  489.66795    0  491          -  489.66795      -     -   13s
     0     0  489.66029    0  497          -  489.66029      -     -   14s
     0     0  489.65956    0  498          -  489.65956      -     -   14s
     0     0  488.99520    0  501          -  488.99520      -     -   18s
     0     0  488.87121    0  504          -  488.87121      -     -   19s
     0     0  488.76225    0  507          -  488.76225      -     -   19s
     0     0  488.71941    0  505          -  488.71941      -     -   20s
     0     0  488.68415    0  509          -  488.68415      -     -   21s
     0     0  488.67419    0  505          -  488.67419      -     -   21s
     0     0  488.66936    0  509          -  488.66936      -     -   21s
     0     0  488.66866    0  509          -  488.66866      -     -   22s
     0     0  488.57722    0  509          -  488.57722      -     -   27s
     0     0  488.51628    0  514          -  488.51628      -     -   28s
     0     0  488.48210    0  515          -  488.48210      -     -   29s
     0     0  488.46438    0  513          -  488.46438      -     -   30s
     0     0  488.44850    0  515          -  488.44850      -     -   31s
     0     0  488.43345    0  514          -  488.43345      -     -   32s
     0     0  488.42588    0  516          -  488.42588      -     -   32s
     0     0  488.42040    0  517          -  488.42040      -     -   33s
     0     0  488.41859    0  517          -  488.41859      -     -   34s
     0     0  488.38561    0  516          -  488.38561      -     -   37s
     0     0  488.35770    0  519          -  488.35770      -     -   39s
     0     0  488.33882    0  517          -  488.33882      -     -   40s
     0     0  488.32647    0  518          -  488.32647      -     -   41s
     0     0  488.32004    0  519          -  488.32004      -     -   42s
     0     0  488.31471    0  518          -  488.31471      -     -   44s
     0     0  488.31238    0  519          -  488.31238      -     -   45s
     0     0  488.29136    0  516          -  488.29136      -     -   49s
     0     0  488.28267    0  517          -  488.28267      -     -   51s
     0     0  488.27026    0  518          -  488.27026      -     -   53s
     0     0  488.26458    0  517          -  488.26458      -     -   54s
     0     0  488.25971    0  517          -  488.25971      -     -   56s
     0     0  488.25546    0  518          -  488.25546      -     -   58s
     0     0  488.25267    0  517          -  488.25267      -     -   60s
     0     0  488.23793    0  519          -  488.23793      -     -   65s
     0     0  488.22836    0  521          -  488.22836      -     -   67s
     0     0  488.22368    0  519          -  488.22368      -     -   69s
     0     0  488.22027    0  519          -  488.22027      -     -   72s
     0     0  488.21284    0  517          -  488.21284      -     -   77s
     0     0  488.21284    0  490          -  488.21284      -     -   87s

Cutting planes:
  Gomory: 84
  Implied bound: 5
  MIR: 293
  Flow cover: 64
  RLT: 646
  Relax-and-lift: 1

Explored 1 nodes (30912 simplex iterations) in 120.00 seconds (191.32 work units)
Thread count was 1 (of 4 available processors)

Solution count 0

Time limit reached
Best objective -, best bound 4.882128392827e+02, gap -


TIMEOUT
time: 151.384473471

[VERYDIFF_TIMER] 151.41034163

[VERYDIFF_EXPERIMENT] Running on /home/i57/steuber/NeuroDiff/repos/VeryDiffExperiments/src/../benchmarks/mnist-prune/specs/mnist_46_global_5.vnnlib /home/i57/steuber/NeuroDiff/repos/VeryDiffExperiments/src/../benchmarks/mnist-prune/nets/mnist_relu_3_100.onnx
/home/i57/steuber/NeuroDiff/repos/VeryDiffExperiments/src/../benchmarks/mnist-prune/nets/mnist_relu_3_100.onnx
/home/i57/steuber/NeuroDiff/repos/VeryDiffExperiments/src/../benchmarks/mnist-prune/nets_pruned/mnist_relu_3_100_pruned5.onnx
[[0.         0.01960784]
 [0.         0.01960784]
 [0.         0.01960784]
 ...
 [0.         0.01960784]
 [0.         0.01960784]
 [0.         0.01960784]]
top
120
False
100
100
10
100
100
10
### Vars ###
### Constraints ###
A_pi_4_0 = 0 --> (A_x_3_0 + 0.0001) <= A_top_4_0
A_pi_4_1 = 0 --> (A_x_3_1 + 0.0001) <= A_top_4_0
A_pi_4_2 = 0 --> (A_x_3_2 + 0.0001) <= A_top_4_0
A_pi_4_3 = 0 --> (A_x_3_3 + 0.0001) <= A_top_4_0
A_pi_4_4 = 0 --> (A_x_3_4 + 0.0001) <= A_top_4_0
A_pi_4_5 = 0 --> (A_x_3_5 + 0.0001) <= A_top_4_0
A_pi_4_6 = 0 --> (A_x_3_6 + 0.0001) <= A_top_4_0
A_pi_4_7 = 0 --> (A_x_3_7 + 0.0001) <= A_top_4_0
A_pi_4_8 = 0 --> (A_x_3_8 + 0.0001) <= A_top_4_0
A_pi_4_9 = 0 --> (A_x_3_9 + 0.0001) <= A_top_4_0
Set parameter TimeLimit to value 120
Set parameter Threads to value 1
Gurobi Optimizer version 10.0.0 build v10.0.0rc2 (linux64)

CPU model: Intel(R) Core(TM) i5-6500 CPU @ 3.20GHz, instruction set [SSE2|AVX|AVX2]
Thread count: 4 physical cores, 4 logical processors, using up to 1 threads

Optimize a model with 3126 rows, 2128 columns and 179801 nonzeros
Model fingerprint: 0xfb06cef6
Variable types: 1678 continuous, 450 integer (450 binary)
Coefficient statistics:
  Matrix range     [1e-06, 2e+06]
  Objective range  [1e+00, 1e+00]
  Bounds range     [4e-03, 1e+00]
  RHS range        [1e-04, 2e+06]
Warning: Model contains large matrix coefficient range
         Consider reformulating model or setting NumericFocus parameter
         to avoid numerical issues.
Presolve removed 1541 rows and 424 columns
Presolve time: 0.49s
Presolved: 1585 rows, 1704 columns, 94290 nonzeros
Variable types: 1408 continuous, 296 integer (296 binary)

Root relaxation: objective 2.370847e+01, 613 iterations, 0.04 seconds (0.07 work units)

    Nodes    |    Current Node    |     Objective Bounds      |     Work
 Expl Unexpl |  Obj  Depth IntInf | Incumbent    BestBd   Gap | It/Node Time

     0     0   23.70847    0   66          -   23.70847      -     -    0s
     0     0   23.52259    0  100          -   23.52259      -     -    0s
     0     0   23.47694    0  112          -   23.47694      -     -    0s
     0     0   23.40760    0  113          -   23.40760      -     -    1s
     0     0   23.38127    0  112          -   23.38127      -     -    1s
     0     0   23.20375    0  101          -   23.20375      -     -    2s
     0     0   23.18537    0   84          -   23.18537      -     -    2s
     0     0   22.45122    0   85          -   22.45122      -     -    2s
     0     0   21.35649    0   87          -   21.35649      -     -    2s
     0     0   21.34902    0   87          -   21.34902      -     -    2s
     0     0   21.19956    0   94          -   21.19956      -     -    3s
     0     0   20.86467    0   96          -   20.86467      -     -    3s
     0     0   20.27204    0   91          -   20.27204      -     -    3s
     0     0   20.26158    0  105          -   20.26158      -     -    3s
     0     0   20.25521    0  103          -   20.25521      -     -    3s
     0     0   20.25291    0  102          -   20.25291      -     -    3s
     0     0   20.25198    0  102          -   20.25198      -     -    3s
     0     0   20.25187    0  102          -   20.25187      -     -    3s
     0     0   20.24315    0   99          -   20.24315      -     -    3s
     0     0   20.00762    0   86          -   20.00762      -     -    4s
     0     0   20.00546    0   97          -   20.00546      -     -    4s
     0     0   20.00109    0   92          -   20.00109      -     -    4s
     0     0   19.76002    0   90          -   19.76002      -     -    4s
     0     0   19.75811    0  105          -   19.75811      -     -    4s
     0     0   19.74360    0  101          -   19.74360      -     -    4s
     0     0   19.71425    0   89          -   19.71425      -     -    5s
     0     0   19.70604    0   84          -   19.70604      -     -    5s
     0     0   19.70457    0   84          -   19.70457      -     -    5s
     0     0   19.55601    0   71          -   19.55601      -     -    5s
     0     0   19.55491    0   73          -   19.55491      -     -    5s
     0     0   19.52052    0   71          -   19.52052      -     -    5s
     0     0   19.51816    0   95          -   19.51816      -     -    5s
     0     0   19.51357    0   92          -   19.51357      -     -    5s
     0     0   19.51201    0   97          -   19.51201      -     -    5s
     0     0   19.50646    0   98          -   19.50646      -     -    6s
     0     0   19.50646    0   91          -   19.50646      -     -    7s
H    0     0                       0.0000000   19.50646      -     -    8s
     0     2   19.50418    0   91    0.00000   19.50418      -     -    9s
    12    14   16.36383    9   86    0.00000   19.34329      -   233   10s
   454   237    9.05497   49   25    0.00000   11.31208      -  64.5   15s
   517   266    9.93765   13   44    0.00000   11.20896      -  64.5   20s
   582   271   10.06232   28   49    0.00000   11.07014      -  74.5   25s
  1080   421 infeasible   33         0.00000   10.23468      -  57.2   30s
  1988   994   10.06233   22   34    0.00000   10.16745      -  45.1   35s
  2355  1275    8.85894   61   17    0.00000   10.13611      -  40.9   41s
  3150  1883    8.06392  121    6    0.00000   10.12055      -  36.7   45s
  4361  2682    7.95864   42   91    0.00000   10.05355      -  33.8   50s
  4823  2919   10.04446   31   58    0.00000   10.04446      -  35.1   55s
  5182  3059    8.62461   34   64    0.00000   10.04446      -  36.7   60s
H 5187  3054                       0.0000000   10.04446      -  36.7   60s
  5438  3047    9.94536   31   65    0.00000   10.03823      -  39.1   65s
  5708  3074 infeasible   29         0.00000   10.03722      -  41.7   70s
  6044  3105 infeasible   30         0.00000   10.02655      -  43.5   75s
  6335  3155    7.94379   34   93    0.00000   10.01841      -  45.3   80s
  6643  3195 infeasible   32         0.00000   10.00660      -  47.3   85s
  7013  3302    9.45822   29   52    0.00000    9.98529      -  49.0   90s
  7278  3325    9.97779   31   66    0.00000    9.97779      -  50.7   95s
  7583  3389    9.10949   36   92    0.00000    9.96888      -  52.1  100s
  7843  3431    9.96072   36   46    0.00000    9.96072      -  53.1  105s
  8127  3467    8.08967   27   87    0.00000    9.95729      -  54.7  110s
  8228  3496    9.87269   37   76    0.00000    9.95377      -  54.8  115s
  8439  3517    9.93162   34   67    0.00000    9.95290      -  56.0  120s

Cutting planes:
  Gomory: 20
  Implied bound: 19
  Projected implied bound: 2
  MIR: 23
  Flow cover: 12
  RLT: 20
  Relax-and-lift: 9

Explored 8440 nodes (483725 simplex iterations) in 120.01 seconds (178.28 work units)
Thread count was 1 (of 4 available processors)

Solution count 2: 2.29604e-08 1.16415e-10 

Time limit reached
Best objective 2.296035539473e-08, best bound 9.952898140140e+00, gap -


TIMEOUT
time: 124.209558705

[VERYDIFF_TIMER] 124.24338976

[VERYDIFF_EXPERIMENT] Running on /home/i57/steuber/NeuroDiff/repos/VeryDiffExperiments/src/../benchmarks/mnist-prune/specs/mnist_46_global_5.vnnlib /home/i57/steuber/NeuroDiff/repos/VeryDiffExperiments/src/../benchmarks/mnist-prune/nets/mnist_relu_4_1024.onnx
/home/i57/steuber/NeuroDiff/repos/VeryDiffExperiments/src/../benchmarks/mnist-prune/nets/mnist_relu_4_1024.onnx
/home/i57/steuber/NeuroDiff/repos/VeryDiffExperiments/src/../benchmarks/mnist-prune/nets_pruned/mnist_relu_4_1024_pruned5.onnx
[[0.         0.01960784]
 [0.         0.01960784]
 [0.         0.01960784]
 ...
 [0.         0.01960784]
 [0.         0.01960784]
 [0.         0.01960784]]
top
120
False
1024
1024
1024
10
1024
1024
1024
10
### Vars ###
### Constraints ###
A_pi_5_0 = 0 --> (A_x_4_0 + 0.0001) <= A_top_5_0
A_pi_5_1 = 0 --> (A_x_4_1 + 0.0001) <= A_top_5_0
A_pi_5_2 = 0 --> (A_x_4_2 + 0.0001) <= A_top_5_0
A_pi_5_3 = 0 --> (A_x_4_3 + 0.0001) <= A_top_5_0
A_pi_5_4 = 0 --> (A_x_4_4 + 0.0001) <= A_top_5_0
A_pi_5_5 = 0 --> (A_x_4_5 + 0.0001) <= A_top_5_0
A_pi_5_6 = 0 --> (A_x_4_6 + 0.0001) <= A_top_5_0
A_pi_5_7 = 0 --> (A_x_4_7 + 0.0001) <= A_top_5_0
A_pi_5_8 = 0 --> (A_x_4_8 + 0.0001) <= A_top_5_0
A_pi_5_9 = 0 --> (A_x_4_9 + 0.0001) <= A_top_5_0
Set parameter TimeLimit to value 120
Set parameter Threads to value 1
Gurobi Optimizer version 10.0.0 build v10.0.0rc2 (linux64)

CPU model: Intel(R) Core(TM) i5-6500 CPU @ 3.20GHz, instruction set [SSE2|AVX|AVX2]
Thread count: 4 physical cores, 4 logical processors, using up to 1 threads

Optimize a model with 43334 rows, 19360 columns and 5656845 nonzeros
Model fingerprint: 0x370ef8b2
Variable types: 13166 continuous, 6194 integer (6194 binary)
Coefficient statistics:
  Matrix range     [2e-08, 2e+06]
  Objective range  [1e+00, 1e+00]
  Bounds range     [4e-03, 1e+00]
  RHS range        [1e-07, 2e+06]
Warning: Model contains large matrix coefficient range
         Consider reformulating model or setting NumericFocus parameter
         to avoid numerical issues.
Presolve removed 17688 rows and 3504 columns (presolve time = 5s) ...
Presolve removed 17738 rows and 3504 columns (presolve time = 10s) ...
Presolve removed 18556 rows and 3504 columns (presolve time = 15s) ...
Presolve removed 18556 rows and 3504 columns
Presolve time: 19.02s
Presolved: 24778 rows, 15856 columns, 4457523 nonzeros
Variable types: 11004 continuous, 4852 integer (4852 binary)

Root simplex log...

Iteration    Objective       Primal Inf.    Dual Inf.      Time
       0    1.4804002e+04   4.574784e+03   0.000000e+00     33s
    3655    1.7994092e+03   3.067460e+03   0.000000e+00     35s
    6055    1.7989613e+03   1.371416e+03   0.000000e+00     41s
    7395    1.7989431e+03   3.387528e+03   0.000000e+00     46s
    8575    1.7989293e+03   1.418390e+04   0.000000e+00     50s
    9795    1.7989207e+03   1.027216e+03   0.000000e+00     55s
   11765    1.7989036e+03   3.851098e+03   0.000000e+00     61s
   13265    1.7988959e+03   7.410320e+02   0.000000e+00     66s
   14555    1.7988933e+03   6.749566e+01   0.000000e+00     71s
   14933    1.7989002e+03   0.000000e+00   0.000000e+00     72s

Root relaxation: objective 1.798900e+03, 14933 iterations, 42.23 seconds (106.36 work units)
Total elapsed time = 108.34s
Total elapsed time = 114.40s
Total elapsed time = 117.54s

    Nodes    |    Current Node    |     Objective Bounds      |     Work
 Expl Unexpl |  Obj  Depth IntInf | Incumbent    BestBd   Gap | It/Node Time

     0     0 1798.90017    0 1266          - 1798.90017      -     -  120s

Explored 1 nodes (28532 simplex iterations) in 120.03 seconds (222.32 work units)
Thread count was 1 (of 4 available processors)

Solution count 0

Time limit reached
Best objective -, best bound 1.798900166386e+03, gap -


TIMEOUT
time: 263.131691204

[VERYDIFF_TIMER] 263.164807002

[VERYDIFF_EXPERIMENT] NETWORK: /home/i57/steuber/NeuroDiff/repos/VeryDiffExperiments/src/../benchmarks/mnist-prune/specs/mnist_46_global_5.vnnlib
[VERYDIFF_EXPERIMENT] TIME: 539.855772871
