
[VERYDIFF_EXPERIMENT] Running on /home/i57/steuber/NeuroDiff/repos/VeryDiffExperiments/src/../benchmarks/mnist-prune/specs/mnist_25_local_21.vnnlib /home/i57/steuber/NeuroDiff/repos/VeryDiffExperiments/src/../benchmarks/mnist-prune/nets/mnist_relu_2_512.onnx
/home/i57/steuber/NeuroDiff/repos/VeryDiffExperiments/src/../benchmarks/mnist-prune/nets/mnist_relu_2_512.onnx
/home/i57/steuber/NeuroDiff/repos/VeryDiffExperiments/src/../benchmarks/mnist-prune/nets_pruned/mnist_relu_2_512_pruned5.onnx
[[0. 0.]
 [0. 0.]
 [0. 0.]
 ...
 [0. 0.]
 [0. 1.]
 [0. 0.]]
top
120
False
512
512
512
512
### Vars ###
### Constraints ###
A_pi_3_0 = 0 --> (A_x_2_0 + 0.0001) <= A_top_3_0
A_pi_3_1 = 0 --> (A_x_2_1 + 0.0001) <= A_top_3_0
A_pi_3_2 = 0 --> (A_x_2_2 + 0.0001) <= A_top_3_0
A_pi_3_3 = 0 --> (A_x_2_3 + 0.0001) <= A_top_3_0
A_pi_3_4 = 0 --> (A_x_2_4 + 0.0001) <= A_top_3_0
A_pi_3_5 = 0 --> (A_x_2_5 + 0.0001) <= A_top_3_0
A_pi_3_6 = 0 --> (A_x_2_6 + 0.0001) <= A_top_3_0
A_pi_3_7 = 0 --> (A_x_2_7 + 0.0001) <= A_top_3_0
A_pi_3_8 = 0 --> (A_x_2_8 + 0.0001) <= A_top_3_0
A_pi_3_9 = 0 --> (A_x_2_9 + 0.0001) <= A_top_3_0
Set parameter TimeLimit to value 120
Set parameter Threads to value 1
Gurobi Optimizer version 10.0.0 build v10.0.0rc2 (linux64)

CPU model: Intel(R) Core(TM) i5-6500 CPU @ 3.20GHz, instruction set [SSE2|AVX|AVX2]
Thread count: 4 physical cores, 4 logical processors, using up to 1 threads

Optimize a model with 14522 rows, 7012 columns and 1321876 nonzeros
Model fingerprint: 0xb06196e5
Variable types: 4934 continuous, 2078 integer (2078 binary)
Coefficient statistics:
  Matrix range     [1e-07, 2e+06]
  Objective range  [1e+00, 1e+00]
  Bounds range     [1e-02, 1e+00]
  RHS range        [1e-04, 2e+06]
Warning: Model contains large matrix coefficient range
         Consider reformulating model or setting NumericFocus parameter
         to avoid numerical issues.
Presolve removed 8711 rows and 3426 columns
Presolve time: 2.40s
Presolved: 5811 rows, 3586 columns, 204859 nonzeros
Variable types: 2480 continuous, 1106 integer (1106 binary)

Root relaxation: objective 5.015689e+02, 1925 iterations, 0.24 seconds (0.72 work units)

    Nodes    |    Current Node    |     Objective Bounds      |     Work
 Expl Unexpl |  Obj  Depth IntInf | Incumbent    BestBd   Gap | It/Node Time

     0     0  501.56892    0  318          -  501.56892      -     -    4s
     0     0  496.72618    0  359          -  496.72618      -     -    6s
     0     0  463.51185    0  363          -  463.51185      -     -    6s
     0     0  461.66004    0  324          -  461.66004      -     -    6s
     0     0  461.64392    0  325          -  461.64392      -     -    6s
     0     0  460.50098    0  345          -  460.50098      -     -    7s
     0     0  455.85988    0  416          -  455.85988      -     -    8s
     0     0  455.70245    0  429          -  455.70245      -     -    8s
     0     0  455.67909    0  428          -  455.67909      -     -    8s
     0     0  455.67909    0  428          -  455.67909      -     -    8s
     0     0  455.44827    0  432          -  455.44827      -     -   10s
     0     0  455.17054    0  420          -  455.17054      -     -   11s
     0     0  454.31101    0  426          -  454.31101      -     -   11s
     0     0  454.22909    0  425          -  454.22909      -     -   12s
     0     0  453.74192    0  425          -  453.74192      -     -   12s
     0     0  453.73313    0  433          -  453.73313      -     -   12s
     0     0  452.37165    0  431          -  452.37165      -     -   14s
     0     0  451.76829    0  458          -  451.76829      -     -   14s
     0     0  451.62414    0  458          -  451.62414      -     -   15s
     0     0  451.23554    0  457          -  451.23554      -     -   15s
     0     0  451.16865    0  460          -  451.16865      -     -   15s
     0     0  451.16139    0  459          -  451.16139      -     -   15s
     0     0  451.03065    0  456          -  451.03065      -     -   16s
     0     0  450.53121    0  465          -  450.53121      -     -   17s
     0     0  450.34242    0  469          -  450.34242      -     -   17s
     0     0  450.20451    0  469          -  450.20451      -     -   17s
     0     0  450.07862    0  473          -  450.07862      -     -   18s
     0     0  450.06964    0  472          -  450.06964      -     -   18s
     0     0  449.99357    0  470          -  449.99357      -     -   19s
     0     0  449.35067    0  431          -  449.35067      -     -   20s
     0     0  448.98455    0  430          -  448.98455      -     -   21s
     0     0  448.92447    0  427          -  448.92447      -     -   21s
     0     0  448.82308    0  429          -  448.82308      -     -   21s
     0     0  448.79699    0  430          -  448.79699      -     -   21s
     0     0  448.69843    0  430          -  448.69843      -     -   22s
     0     0  448.48285    0  429          -  448.48285      -     -   23s
     0     0  448.29049    0  428          -  448.29049      -     -   23s
     0     0  448.27184    0  431          -  448.27184      -     -   24s
     0     0  448.17762    0  423          -  448.17762      -     -   25s
     0     0  447.98259    0  444          -  447.98259      -     -   25s
     0     0  447.91435    0  444          -  447.91435      -     -   25s
     0     0  447.81447    0  452          -  447.81447      -     -   26s
     0     0  447.77627    0  448          -  447.77627      -     -   26s
     0     0  447.76987    0  447          -  447.76987      -     -   26s
     0     0  447.68478    0  446          -  447.68478      -     -   27s
     0     0  447.63146    0  461          -  447.63146      -     -   28s
     0     0  447.57192    0  465          -  447.57192      -     -   28s
     0     0  447.55437    0  468          -  447.55437      -     -   29s
     0     0  447.53247    0  468          -  447.53247      -     -   30s
     0     0  447.53247    0  375          -  447.53247      -     -   35s
H    0     0                       0.0000000  447.53247      -     -   40s
     0     2  447.53244    0  375    0.00000  447.53244      -     -   43s
     2     4  439.20540    2  435    0.00000  444.44644      -  1354   45s
     8    10  230.23195    5  662    0.00000  434.65580      -  1750   51s
    15    15 infeasible    9         0.00000  434.65580      -  1862   55s
    80    46    1.09978   51  259    0.00000  434.65580      -   453   65s
   101    53 infeasible   10         0.00000  416.00675      -   455   70s
   165    75  213.11917    4  626    0.00000  230.56965      -   331   75s
   246   121  135.16214   22  545    0.00000  229.47783      -   248   80s
   297   149   76.18528   33  511    0.00000  228.95932      -   240   85s
   409   227  123.38453   57  498    0.00000  226.17738      -   193   90s
   511   328   84.18709   20  375    0.00000  226.17738      -   157  106s
   513   329   64.21128   38  312    0.00000  226.17738      -   156  110s
   516   333    7.76203   21  375    0.00000  226.17738      -   160  116s

Explored 517 nodes (109016 simplex iterations) in 120.01 seconds (181.62 work units)
Thread count was 1 (of 4 available processors)

Solution count 1: 1.16415e-10 

Time limit reached
Best objective 1.164153218269e-10, best bound 2.261773845719e+02, gap -


TIMEOUT
time: 151.233443405

[VERYDIFF_TIMER] 151.259613549

[VERYDIFF_EXPERIMENT] Running on /home/i57/steuber/NeuroDiff/repos/VeryDiffExperiments/src/../benchmarks/mnist-prune/specs/mnist_25_local_21.vnnlib /home/i57/steuber/NeuroDiff/repos/VeryDiffExperiments/src/../benchmarks/mnist-prune/nets/mnist_relu_3_100.onnx
/home/i57/steuber/NeuroDiff/repos/VeryDiffExperiments/src/../benchmarks/mnist-prune/nets/mnist_relu_3_100.onnx
/home/i57/steuber/NeuroDiff/repos/VeryDiffExperiments/src/../benchmarks/mnist-prune/nets_pruned/mnist_relu_3_100_pruned5.onnx
[[0. 0.]
 [0. 0.]
 [0. 0.]
 ...
 [0. 0.]
 [0. 1.]
 [0. 0.]]
top
120
False
100
100
10
100
100
10
### Vars ###
### Constraints ###
A_pi_4_0 = 0 --> (A_x_3_0 + 0.0001) <= A_top_4_0
A_pi_4_1 = 0 --> (A_x_3_1 + 0.0001) <= A_top_4_0
A_pi_4_2 = 0 --> (A_x_3_2 + 0.0001) <= A_top_4_0
A_pi_4_3 = 0 --> (A_x_3_3 + 0.0001) <= A_top_4_0
A_pi_4_4 = 0 --> (A_x_3_4 + 0.0001) <= A_top_4_0
A_pi_4_5 = 0 --> (A_x_3_5 + 0.0001) <= A_top_4_0
A_pi_4_6 = 0 --> (A_x_3_6 + 0.0001) <= A_top_4_0
A_pi_4_7 = 0 --> (A_x_3_7 + 0.0001) <= A_top_4_0
A_pi_4_8 = 0 --> (A_x_3_8 + 0.0001) <= A_top_4_0
A_pi_4_9 = 0 --> (A_x_3_9 + 0.0001) <= A_top_4_0
Set parameter TimeLimit to value 120
Set parameter Threads to value 1
Gurobi Optimizer version 10.0.0 build v10.0.0rc2 (linux64)

CPU model: Intel(R) Core(TM) i5-6500 CPU @ 3.20GHz, instruction set [SSE2|AVX|AVX2]
Thread count: 4 physical cores, 4 logical processors, using up to 1 threads

Optimize a model with 3126 rows, 2128 columns and 179801 nonzeros
Model fingerprint: 0x4e44897c
Variable types: 1678 continuous, 450 integer (450 binary)
Coefficient statistics:
  Matrix range     [1e-06, 2e+06]
  Objective range  [1e+00, 1e+00]
  Bounds range     [1e-02, 1e+00]
  RHS range        [1e-04, 2e+06]
Warning: Model contains large matrix coefficient range
         Consider reformulating model or setting NumericFocus parameter
         to avoid numerical issues.
Presolve removed 2014 rows and 1425 columns
Presolve time: 0.29s
Presolved: 1112 rows, 703 columns, 11040 nonzeros
Variable types: 490 continuous, 213 integer (213 binary)

Root relaxation: objective 2.280899e+01, 385 iterations, 0.01 seconds (0.01 work units)

    Nodes    |    Current Node    |     Objective Bounds      |     Work
 Expl Unexpl |  Obj  Depth IntInf | Incumbent    BestBd   Gap | It/Node Time

     0     0   22.80899    0   44          -   22.80899      -     -    0s
     0     0   21.45697    0   58          -   21.45697      -     -    0s
     0     0   21.34009    0   62          -   21.34009      -     -    0s
     0     0   20.97127    0   56          -   20.97127      -     -    0s
     0     0   20.96276    0   57          -   20.96276      -     -    0s
     0     0   20.96218    0   56          -   20.96218      -     -    0s
     0     0   20.96215    0   57          -   20.96215      -     -    0s
     0     0   20.73259    0   69          -   20.73259      -     -    0s
     0     0   20.70394    0   67          -   20.70394      -     -    0s
     0     0   20.65580    0   65          -   20.65580      -     -    0s
     0     0   20.65535    0   66          -   20.65535      -     -    0s
     0     0   20.51616    0   66          -   20.51616      -     -    0s
     0     0   20.51163    0   66          -   20.51163      -     -    0s
     0     0   20.50999    0   66          -   20.50999      -     -    0s
     0     0   20.50836    0   67          -   20.50836      -     -    0s
     0     0   20.50821    0   65          -   20.50821      -     -    0s
     0     0   20.38226    0   70          -   20.38226      -     -    1s
     0     0   20.37793    0   70          -   20.37793      -     -    1s
     0     0   20.37715    0   72          -   20.37715      -     -    1s
     0     0   20.33400    0   70          -   20.33400      -     -    1s
     0     0   20.33049    0   72          -   20.33049      -     -    1s
     0     0   20.32987    0   69          -   20.32987      -     -    1s
     0     0   20.31455    0   72          -   20.31455      -     -    1s
     0     0   20.28987    0   70          -   20.28987      -     -    1s
     0     0   20.28651    0   74          -   20.28651      -     -    1s
     0     0   20.28539    0   71          -   20.28539      -     -    1s
     0     0   20.28524    0   71          -   20.28524      -     -    1s
     0     0   20.27265    0   72          -   20.27265      -     -    1s
     0     0   20.27136    0   69          -   20.27136      -     -    1s
     0     0   20.27056    0   70          -   20.27056      -     -    1s
     0     0   20.26855    0   73          -   20.26855      -     -    1s
     0     0   20.26826    0   67          -   20.26826      -     -    1s
     0     0   20.26777    0   72          -   20.26777      -     -    1s
     0     0   20.26777    0   72          -   20.26777      -     -    2s
H    0     0                      -0.0000000   20.26777      -     -    2s
     0     2   20.26584    0   71   -0.00000   20.26584      -     -    2s
   524   294   13.42559   19   73   -0.00000   13.42559      -  26.4    5s

Cutting planes:
  Learned: 1

Explored 525 nodes (17785 simplex iterations) in 5.42 seconds (5.59 work units)
Thread count was 1 (of 4 available processors)

Solution count 1: -0 
No other solutions better than -0

Optimal solution found (tolerance 1.00e-04)
Best objective -0.000000000000e+00, best bound -0.000000000000e+00, gap 0.0000%


100
100
10
100
100
10
NETWORKS EQUIVALENT
time: 11.575428399

[VERYDIFF_TIMER] 11.606786136

[VERYDIFF_EXPERIMENT] Running on /home/i57/steuber/NeuroDiff/repos/VeryDiffExperiments/src/../benchmarks/mnist-prune/specs/mnist_25_local_21.vnnlib /home/i57/steuber/NeuroDiff/repos/VeryDiffExperiments/src/../benchmarks/mnist-prune/nets/mnist_relu_4_1024.onnx
/home/i57/steuber/NeuroDiff/repos/VeryDiffExperiments/src/../benchmarks/mnist-prune/nets/mnist_relu_4_1024.onnx
/home/i57/steuber/NeuroDiff/repos/VeryDiffExperiments/src/../benchmarks/mnist-prune/nets_pruned/mnist_relu_4_1024_pruned5.onnx
[[0. 0.]
 [0. 0.]
 [0. 0.]
 ...
 [0. 0.]
 [0. 1.]
 [0. 0.]]
top
120
False
1024
1024
1024
10
1024
1024
1024
10
### Vars ###
### Constraints ###
A_pi_5_0 = 0 --> (A_x_4_0 + 0.0001) <= A_top_5_0
A_pi_5_1 = 0 --> (A_x_4_1 + 0.0001) <= A_top_5_0
A_pi_5_2 = 0 --> (A_x_4_2 + 0.0001) <= A_top_5_0
A_pi_5_3 = 0 --> (A_x_4_3 + 0.0001) <= A_top_5_0
A_pi_5_4 = 0 --> (A_x_4_4 + 0.0001) <= A_top_5_0
A_pi_5_5 = 0 --> (A_x_4_5 + 0.0001) <= A_top_5_0
A_pi_5_6 = 0 --> (A_x_4_6 + 0.0001) <= A_top_5_0
A_pi_5_7 = 0 --> (A_x_4_7 + 0.0001) <= A_top_5_0
A_pi_5_8 = 0 --> (A_x_4_8 + 0.0001) <= A_top_5_0
A_pi_5_9 = 0 --> (A_x_4_9 + 0.0001) <= A_top_5_0
Set parameter TimeLimit to value 120
Set parameter Threads to value 1
Gurobi Optimizer version 10.0.0 build v10.0.0rc2 (linux64)

CPU model: Intel(R) Core(TM) i5-6500 CPU @ 3.20GHz, instruction set [SSE2|AVX|AVX2]
Thread count: 4 physical cores, 4 logical processors, using up to 1 threads

Optimize a model with 43334 rows, 19360 columns and 5656845 nonzeros
Model fingerprint: 0x4e26cd4b
Variable types: 13166 continuous, 6194 integer (6194 binary)
Coefficient statistics:
  Matrix range     [2e-08, 2e+06]
  Objective range  [1e+00, 1e+00]
  Bounds range     [1e-02, 1e+00]
  RHS range        [1e-07, 2e+06]
Warning: Model contains large matrix coefficient range
         Consider reformulating model or setting NumericFocus parameter
         to avoid numerical issues.
Presolve removed 18655 rows and 4667 columns (presolve time = 5s) ...
Presolve removed 19334 rows and 4667 columns (presolve time = 10s) ...
Presolve removed 19334 rows and 4667 columns (presolve time = 15s) ...
Presolve removed 19334 rows and 4667 columns
Presolve time: 17.44s
Presolved: 24000 rows, 14693 columns, 3413938 nonzeros
Variable types: 10030 continuous, 4663 integer (4663 binary)

Root simplex log...

Iteration    Objective       Primal Inf.    Dual Inf.      Time
       0    2.2731478e+04   7.668655e+03   0.000000e+00     24s
    2620    2.4562142e+03   9.757038e+03   0.000000e+00     25s
    5480    2.4557207e+03   1.489628e+03   0.000000e+00     30s
    7740    2.4556999e+03   1.373623e+03   0.000000e+00     36s
    9170    2.4556884e+03   3.217315e+02   0.000000e+00     40s
   10510    2.4556858e+03   1.504939e+02   0.000000e+00     46s
   10870    2.4556950e+03   0.000000e+00   0.000000e+00     48s

Root relaxation: objective 2.455695e+03, 10870 iterations, 26.42 seconds (65.18 work units)
Total elapsed time = 116.27s

    Nodes    |    Current Node    |     Objective Bounds      |     Work
 Expl Unexpl |  Obj  Depth IntInf | Incumbent    BestBd   Gap | It/Node Time

     0     0 2455.69497    0 1270          - 2455.69497      -     -  120s

Explored 1 nodes (30676 simplex iterations) in 120.15 seconds (243.77 work units)
Thread count was 1 (of 4 available processors)

Solution count 0

Time limit reached
Best objective -, best bound 2.455694969741e+03, gap -


TIMEOUT
time: 261.900919471

[VERYDIFF_TIMER] 261.925984081

[VERYDIFF_EXPERIMENT] NETWORK: /home/i57/steuber/NeuroDiff/repos/VeryDiffExperiments/src/../benchmarks/mnist-prune/specs/mnist_25_local_21.vnnlib
[VERYDIFF_EXPERIMENT] TIME: 425.703586408
