
[VERYDIFF_EXPERIMENT] Running on /home/i57/steuber/NeuroDiff/repos/VeryDiffExperiments/src/../benchmarks/mnist-prune/specs/mnist_8_local_15.vnnlib /home/i57/steuber/NeuroDiff/repos/VeryDiffExperiments/src/../benchmarks/mnist-prune/nets/mnist_relu_3_100.onnx
Loading /home/i57/steuber/NeuroDiff/repos/VeryDiffExperiments/src/../benchmarks/mnist-prune/nets/mnist_relu_3_100.onnx and /home/i57/steuber/NeuroDiff/repos/VeryDiffExperiments/src/../benchmarks/mnist-prune/nets_pruned/mnist_relu_3_100_0.77-old.onnx
INPUT SHAPE: 784
Skipping 0 row
Skipping 0 row
Skipping 0 row
Skipping 0 row
Skipping 0 row
Skipping 0 row
Skipping 0 row
Skipping 0 row
Skipping 0 row
Skipping 0 row
Skipping 0 row
Skipping 0 row

[NEQUIV] 0

[0.         0.         0.         0.         0.         5.04648271
 5.11062302 0.         2.13824857 0.54171625]
[-7.50026094e-05 -4.23191149e-03 -4.94186290e-03  8.75969833e-03
  1.07870988e-02  5.34212058e+00  5.02072262e+00  5.92098847e-03
  1.97936187e+00  4.23881843e-01]
NETWORKS NOT EQUIVALENT
Refined: 3 | Refine Limit: 2 | Wrong: 0 | Right: 2 | Total: 2 | Total Zonos Considered: 5 | Expected 15 (13.333333333333334%)

time: 0.346848022

[VERYDIFF_TIMER] 0.373901852

[VERYDIFF_EXPERIMENT] NETWORK: /home/i57/steuber/NeuroDiff/repos/VeryDiffExperiments/src/../benchmarks/mnist-prune/specs/mnist_8_local_15.vnnlib
[VERYDIFF_EXPERIMENT] TIME: 0.662519623
