
[VERYDIFF_EXPERIMENT] Running on /home/i57/steuber/NeuroDiff/repos/VeryDiffExperiments/src/../benchmarks/mnist-prune/specs/mnist_40_global_3.vnnlib /home/i57/steuber/NeuroDiff/repos/VeryDiffExperiments/src/../benchmarks/mnist-prune/nets/mnist_relu_3_100.onnx
Found input X
op: matmul, weight: (100, 784), bias: nothing
op: bias, weight: nothing, bias: (100,)
op: relu, weight: nothing, bias: nothing
op: matmul, weight: (100, 100), bias: nothing
op: bias, weight: nothing, bias: (100,)
op: relu, weight: nothing, bias: nothing
op: matmul, weight: (10, 100), bias: nothing
op: bias, weight: nothing, bias: (10,)
op: relu, weight: nothing, bias: nothing
op: matmul, weight: (10, 10), bias: nothing
op: bias, weight: nothing, bias: (10,)
Found input X
op: gemm, weight: (100, 784), bias: (100,)
op: relu, weight: nothing, bias: nothing
op: gemm, weight: (100, 100), bias: (100,)
op: relu, weight: nothing, bias: nothing
op: gemm, weight: (10, 100), bias: (10,)
op: relu, weight: nothing, bias: nothing
op: gemm, weight: (10, 10), bias: (10,)
Distance: 368.62397500800625
Distance: 47.56803950402309
Distance: 2.8977568827249343
Distance: 0.01885471428334995
Running with 1 threads
[Thread 1] Time to first task: 0.0s
Instable Generators: 39
Instable Generators: 48
Instable Generators: 6
Zono Bounds:
[2.865941276661044e-5, -0.6679384765683333, -1.0008020013651913, -0.9808423034266961, -0.9253063114502199, -0.8624462502811439, -0.00022539317630641912, -0.8002131176411972, -0.7666486950750709, -0.8656362968901732]
[0.0003517251152972209, 0.75252928628758, 0.9224432186447328, 0.8064620808531623, 0.9294236775981836, 0.8327009368299769, 0.00036853973083505483, 0.8783106505562513, 0.7486381292836156, 0.8647027388460917]
[Thread 1] Total splits: 0
Processed 1 zonotopes (Work Done: 100.0%); Generated 0 (0.06175338s/loop)
[Thread 1] Finished in 0.06s
 ────────────────────────────────────────────────────────────────────────────────
                                        Time                    Allocations      
                               ───────────────────────   ────────────────────────
       Tot / % measured:           62.3ms / 100.0%           99.3MiB / 100.0%    

 Section               ncalls     time    %tot     avg     alloc    %tot      avg
 ────────────────────────────────────────────────────────────────────────────────
 Verify                     1   61.8ms   99.1%  61.8ms   93.9MiB   94.5%  93.9MiB
   Zonotope Loop            1   61.8ms   99.1%  61.8ms   93.9MiB   94.5%  93.9MiB
     Zonotope Propa...      1   58.5ms   93.8%  58.5ms   73.9MiB   74.5%  73.9MiB
       DiffZonotope...      3   34.8ms   55.9%  11.6ms   69.8MiB   70.2%  23.3MiB
         Zonotope_R...      6   33.9ms   54.3%  5.64ms   68.1MiB   68.6%  11.3MiB
           Influenc...      6   32.6ms   52.3%  5.44ms   62.6MiB   63.1%  10.4MiB
             Multiply       6   22.7ms   36.5%  3.79ms   31.9MiB   32.1%  5.31MiB
             Alloca...      6   5.68ms    9.1%   946μs   30.7MiB   31.0%  5.12MiB
             Set Ma...      6   4.18ms    6.7%   697μs     0.00B    0.0%    0.00B
           Column M...      6    736μs    1.2%   123μs   2.72MiB    2.7%   464KiB
           Set Matrix       6    303μs    0.5%  50.5μs   6.19KiB    0.0%  1.03KiB
           Allocation       6    143μs    0.2%  23.8μs   2.72MiB    2.7%   464KiB
           Vectors          6   29.1μs    0.0%  4.85μs   19.5KiB    0.0%  3.26KiB
           Bounds           6   3.32μs    0.0%   554ns     0.00B    0.0%    0.00B
       DiffZonotope...      4   23.6ms   37.9%  5.90ms   4.18MiB    4.2%  1.04MiB
         Zonotope_D...      8   8.90ms   14.3%  1.11ms   2.73MiB    2.7%   349KiB
     Property Check         1   9.39μs    0.0%  9.39μs      992B    0.0%     992B
 Initialize                 1    563μs    0.9%   563μs   5.41MiB    5.5%  5.41MiB
 ────────────────────────────────────────────────────────────────────────────────
[VERYDIFF_TIMER] 0.091916808

[VERYDIFF_EXPERIMENT] NETWORK: /home/i57/steuber/NeuroDiff/repos/VeryDiffExperiments/src/../benchmarks/mnist-prune/specs/mnist_40_global_3.vnnlib
[VERYDIFF_EXPERIMENT] TIME: 0.395079536
