
[VERYDIFF_EXPERIMENT] Running on /home/i57/steuber/NeuroDiff/repos/VeryDiffExperiments/src/../benchmarks/mnist-prune/specs/mnist_91_global_5.vnnlib /home/i57/steuber/NeuroDiff/repos/VeryDiffExperiments/src/../benchmarks/mnist-prune/nets/mnist_relu_4_1024.onnx
Found input X
op: matmul, weight: (1024, 784), bias: nothing
op: bias, weight: nothing, bias: (1024,)
op: relu, weight: nothing, bias: nothing
op: matmul, weight: (1024, 1024), bias: nothing
op: bias, weight: nothing, bias: (1024,)
op: relu, weight: nothing, bias: nothing
op: matmul, weight: (1024, 1024), bias: nothing
op: bias, weight: nothing, bias: (1024,)
op: relu, weight: nothing, bias: nothing
op: matmul, weight: (10, 1024), bias: nothing
op: bias, weight: nothing, bias: (10,)
op: relu, weight: nothing, bias: nothing
op: matmul, weight: (10, 10), bias: nothing
op: bias, weight: nothing, bias: (10,)
Found input X
op: gemm, weight: (1024, 784), bias: (1024,)
op: relu, weight: nothing, bias: nothing
op: gemm, weight: (1024, 1024), bias: (1024,)
op: relu, weight: nothing, bias: nothing
op: gemm, weight: (1024, 1024), bias: (1024,)
op: relu, weight: nothing, bias: nothing
op: gemm, weight: (10, 1024), bias: (10,)
op: relu, weight: nothing, bias: nothing
op: gemm, weight: (10, 10), bias: (10,)
Distance: 915.6394868631054
Distance: 1298.7052820973968
Distance: 1296.587532894263
Distance: 6.054483317080667
Distance: 0.04942679278974538
Running with 1 threads
[Thread 1] Time to first task: 0.01s
Instable Generators: 397
Instable Generators: 761
Instable Generators: 1024
Instable Generators: 10
Zono Bounds:
[-106.92155546886038, -108.87589948704445, -120.40803474579411, -119.19394319480453, -114.73801201764148, -121.68312785879318, -108.72603304622484, -113.36832525923717, -116.15451919089149, -121.094588936668]
[106.85429146905598, 108.53055298447109, 119.85876842586327, 119.0145145294852, 114.70138360115142, 121.62440988276838, 108.69602242773118, 112.69549391639103, 116.08930754300435, 120.89024318332116]


TIMEOUT REACHED
UNKNOWN
[Thread 1] Total splits: 47
Processed 47 zonotopes (Work Done: 0.0%); Generated 94 (2.5540570988297873s/loop)
[Thread 1] Finished in 120.04s
 ────────────────────────────────────────────────────────────────────────────────
                                        Time                    Allocations      
                               ───────────────────────   ────────────────────────
       Tot / % measured:             120s / 100.0%           34.3GiB / 100.0%    

 Section               ncalls     time    %tot     avg     alloc    %tot      avg
 ────────────────────────────────────────────────────────────────────────────────
 Verify                     1     120s  100.0%    120s   34.3GiB   99.9%  34.3GiB
   Zonotope Loop            1     120s  100.0%    120s   34.3GiB   99.9%  34.3GiB
     Zonotope Propa...     47     114s   95.3%   2.43s   31.5GiB   91.7%   686MiB
       DiffZonotope...    188    72.2s   60.1%   384ms   26.0GiB   75.9%   142MiB
         Zonotope_R...    376    68.8s   57.3%   183ms   21.1GiB   61.4%  57.4MiB
           Influenc...    376    51.2s   42.7%   136ms   12.3GiB   35.7%  33.4MiB
             Multiply     376    35.3s   29.4%  94.0ms   7.27GiB   21.2%  19.8MiB
             Alloca...    376    15.1s   12.6%  40.1ms   4.99GiB   14.5%  13.6MiB
             Set Ma...    376    793ms    0.7%  2.11ms     0.00B    0.0%    0.00B
           Column M...    376    13.3s   11.1%  35.3ms   4.40GiB   12.8%  12.0MiB
           Allocation     376    3.47s    2.9%  9.22ms   4.40GiB   12.8%  12.0MiB
           Set Matrix     376    828ms    0.7%  2.20ms   5.17MiB    0.0%  14.1KiB
           Vectors        376   11.6ms    0.0%  30.8μs   12.5MiB    0.0%  34.0KiB
           Bounds         376    279μs    0.0%   742ns     0.00B    0.0%    0.00B
       DiffZonotope...    235    42.2s   35.2%   180ms   5.43GiB   15.8%  23.7MiB
         Zonotope_D...    470    16.1s   13.4%  34.2ms   2.86GiB    8.3%  6.22MiB
     Compute Split         47    4.95s    4.1%   105ms   1.88GiB    5.5%  41.1MiB
     Property Check        47    537ms    0.4%  11.4ms   27.2MiB    0.1%   593KiB
 Initialize                 1   16.8ms    0.0%  16.8ms   27.0MiB    0.1%  27.0MiB
 ────────────────────────────────────────────────────────────────────────────────
[VERYDIFF_TIMER] 120.136596521

[VERYDIFF_EXPERIMENT] NETWORK: /home/i57/steuber/NeuroDiff/repos/VeryDiffExperiments/src/../benchmarks/mnist-prune/specs/mnist_91_global_5.vnnlib
[VERYDIFF_EXPERIMENT] TIME: 120.428738759
