
[VERYDIFF_EXPERIMENT] Running on /home/i57/steuber/NeuroDiff/repos/VeryDiffExperiments/src/../benchmarks/mnist-prune/specs/mnist_8_local_18.vnnlib /home/i57/steuber/NeuroDiff/repos/VeryDiffExperiments/src/../benchmarks/mnist-prune/nets/mnist_relu_2_512.onnx
Found input X
op: matmul, weight: (512, 784), bias: nothing
op: bias, weight: nothing, bias: (512,)
op: relu, weight: nothing, bias: nothing
op: matmul, weight: (512, 512), bias: nothing
op: bias, weight: nothing, bias: (512,)
op: relu, weight: nothing, bias: nothing
op: matmul, weight: (10, 512), bias: nothing
op: bias, weight: nothing, bias: (10,)
Found input X
op: matmul, weight: (512, 784), bias: nothing
op: bias, weight: nothing, bias: (512,)
op: relu, weight: nothing, bias: nothing
op: matmul, weight: (512, 512), bias: nothing
op: bias, weight: nothing, bias: (512,)
op: relu, weight: nothing, bias: nothing
op: matmul, weight: (10, 512), bias: nothing
op: bias, weight: nothing, bias: (10,)
Distance: 1085.5985166831802
Distance: 1719.8468985003963
Distance: 31.228482716001736
Running with 1 threads
[Thread 1] Time to first task: 0.0s
Instable Generators: 111
Instable Generators: 186
Zono Bounds:
[-20.051640699653486, -17.512358752951886, -20.50768367102264, -13.41355652857797, -8.977238882378261, -4.621417954117013, -14.35496215815003, -18.1259828780762, -16.33376555489441, -12.756779465242467]
[4.466304659592748, 5.564354747722238, 0.5236632526003948, 7.779945487742456, 12.31423329419434, 13.769493496452185, 7.731667075788241, 3.1096632932370074, 2.6347640395486174, 4.5235837214751635]

Found counterexample: ([0.0, 0.0, 1.0, 0.0, 0.0, 0.0, 0.0, 0.0, 0.0, 0.0, 0.0, 0.0, 0.0, 0.0, 0.0, 0.0, 0.0, 0.0, 0.0, 0.0, 0.0, 0.0, 0.0, 0.0, 0.0, 0.0, 0.0, 0.0, 0.0, 0.0, 0.0, 0.0, 0.0, 0.0, 0.0, 0.0, 0.0, 0.0, 0.0, 0.0, 0.0, 0.0, 0.0, 0.0, 0.0, 0.0, 0.0, 0.0, 0.0, 0.0, 0.0, 0.0, 0.0, 0.0, 0.0, 0.0, 0.0, 0.0, 0.0, 0.0, 0.0, 0.0, 0.0, 0.0, 0.0, 0.0, 0.0, 0.0, 0.0, 0.0, 0.0, 0.0, 0.0, 0.0, 0.0, 0.0, 0.0, 0.0, 0.0, 0.0, 0.0, 0.0, 0.0, 0.0, 0.0, 0.0, 0.0, 0.0, 0.0, 0.0, 0.0, 0.0, 0.0, 0.0, 0.0, 0.0, 0.0, 0.0, 0.0, 0.0, 0.0, 0.0, 0.0, 0.0, 0.0, 0.0, 0.0, 0.0, 0.0, 0.0, 0.0, 0.0, 0.0, 0.0, 0.0, 0.0, 0.0, 0.0, 1.0, 0.0, 0.0, 0.0, 0.0, 0.0, 0.0, 0.0, 0.0, 0.0, 0.0, 0.06666667, 0.18431373, 0.18431373, 0.18431373, 0.0627451, 0.50588238, 0.33333334, 0.18431373, 0.0, 0.0, 0.0, 0.0, 0.0, 0.0, 0.0, 0.0, 0.0, 0.0, 0.0, 0.0, 0.0, 0.0, 0.0, 0.0, 0.0, 0.0, 0.0, 0.60000002, 0.8509804, 0.99215686, 0.99215686, 0.99215686, 0.84313726, 0.96470588, 0.99215686, 0.99215686, 0.0, 0.0, 1.0, 0.0, 0.0, 1.0, 0.0, 0.0, 0.0, 0.0, 0.0, 0.0, 0.0, 0.0, 0.0, 0.13725491, 0.55686277, 0.95686275, 0.98823529, 0.99215686, 0.99215686, 0.99215686, 0.99215686, 0.99215686, 0.99215686, 0.99215686, 0.99215686, 0.99215686, 0.0, 0.0, 0.0, 0.0, 0.0, 0.0, 0.0, 0.0, 0.0, 0.0, 0.0, 0.0, 0.0, 0.0, 0.0, 0.24705882, 0.99215686, 0.99215686, 0.99215686, 0.99215686, 0.99215686, 0.99215686, 0.99215686, 0.83529413, 0.66666669, 1.0, 0.66666669, 0.66666669, 0.0, 0.0, 0.0, 0.0, 0.0, 0.0, 0.0, 0.0, 0.0, 0.0, 0.0, 0.07843138, 0.51764709, 0.28235295, 0.0, 0.22352941, 0.93333334, 0.89019608, 0.93333334, 0.65882355, 0.48627451, 0.27058825, 0.07843138, 0.04313726, 0.0, 0.0, 0.0, 0.0, 0.0, 0.0, 0.0, 0.0, 0.0, 0.0, 0.0, 0.0, 0.0, 0.0, 0.04313726, 0.80784315, 0.99215686, 0.30588236, 0.0, 0.0, 0.1254902, 0.0, 0.11764706, 0.00784314, 0.0, 0.0, 0.0, 0.0, 0.0, 0.0, 0.0, 0.0, 0.0, 0.0, 0.0, 0.0, 0.0, 0.0, 0.0, 0.0, 0.0, 0.02352941, 0.69411767, 0.99215686, 0.51764709, 0.03921569, 0.0, 0.0, 0.0, 0.0, 0.0, 0.0, 0.0, 0.0, 0.0, 0.0, 0.0, 0.0, 0.0, 0.0, 0.0, 0.0, 0.0, 0.0, 0.0, 0.0, 0.0, 0.0, 0.04705882, 0.52156866, 0.99215686, 0.9137255, 0.05882353, 0.0, 0.0, 0.0, 0.0, 0.0, 0.0, 0.0, 0.0, 0.0, 0.0, 0.0, 0.0, 0.0, 0.0, 0.0, 0.0, 0.0, 0.0, 0.0, 0.0, 0.0, 0.0, 0.0, 0.36078432, 0.99215686, 0.87450981, 0.10980392, 0.0, 0.0, 0.0, 0.0, 0.0, 0.0, 0.0, 0.0, 0.0, 0.0, 0.0, 0.0, 0.0, 0.0, 0.0, 0.0, 0.0, 0.0, 0.0, 0.0, 0.0, 0.0, 0.0, 0.0, 0.58823532, 0.99215686, 0.68235296, 0.0, 0.0, 0.0, 0.0, 0.0, 0.0, 0.0, 0.0, 0.0, 0.0, 0.0, 0.0, 0.0, 0.0, 0.0, 0.0, 0.0, 0.0, 0.0, 0.0, 0.0, 0.0, 0.0, 0.0, 0.0, 0.91764706, 0.99215686, 0.96470588, 0.49803922, 0.19215687, 0.0, 0.0, 0.0, 0.0, 0.0, 0.0, 0.0, 0.0, 0.0, 0.0, 0.0, 0.0, 0.0, 0.0, 0.0, 0.0, 0.0, 0.0, 0.0, 0.0, 0.0, 0.0, 0.0, 1.0, 0.99215686, 0.99215686, 0.99215686, 0.98431373, 0.57647061, 0.35686275, 0.47450981, 0.33333334, 0.16470589, 0.16470589, 0.33333334, 0.10980392, 0.0, 0.0, 0.0, 0.0, 0.0, 0.0, 0.0, 0.0, 0.0, 0.0, 0.0, 0.0, 0.0, 0.0, 0.0, 0.54509807, 0.99215686, 0.99215686, 0.99215686, 0.99215686, 0.99215686, 0.99215686, 0.99215686, 0.99215686, 0.99215686, 0.99215686, 0.99215686, 0.90980393, 0.65882355, 0.0, 0.0, 0.0, 0.0, 0.0, 0.0, 0.0, 0.0, 0.0, 0.0, 0.0, 0.0, 0.0, 0.0, 0.01176471, 0.20784314, 1.0, 0.87058824, 0.98431373, 0.99215686, 0.99215686, 0.99215686, 0.99215686, 0.99215686, 0.99215686, 0.99215686, 0.99215686, 0.98823529, 0.48627451, 0.0, 0.0, 0.0, 0.0, 0.0, 0.0, 0.0, 0.0, 0.0, 0.0, 0.0, 0.0, 0.0, 0.0, 0.0, 0.0, 0.0, 0.26274511, 0.28235295, 0.78431374, 0.99215686, 0.99215686, 0.99215686, 0.99215686, 0.99215686, 0.99215686, 0.99215686, 0.68627453, 0.0, 0.0, 0.0, 0.0, 0.0, 0.0, 0.0, 0.0, 0.0, 0.0, 0.0, 0.0, 0.0, 0.0, 0.0, 0.0, 0.0, 0.0, 0.0, 0.47058824, 0.99215686, 0.97647059, 0.59607846, 0.2, 0.64313728, 0.99215686, 0.99215686, 0.68627453, 0.0, 0.0, 0.0, 0.0, 0.0, 0.0, 0.0, 0.0, 0.0, 0.0, 0.0, 0.0, 0.0, 0.0, 0.0, 0.0, 0.0, 0.0, 0.0, 0.19607843, 0.99215686, 0.99215686, 0.99215686, 0.73725492, 0.98823529, 0.99215686, 1.0, 0.58039218, 0.0, 0.0, 0.0, 0.0, 0.0, 0.0, 0.0, 0.0, 0.0, 0.0, 0.0, 0.0, 0.0, 0.0, 0.0, 0.0, 0.0, 0.0, 0.0, 0.03529412, 0.65490198, 0.99215686, 0.99215686, 0.99215686, 0.99215686, 0.98039216, 0.68627453, 0.04313726, 0.0, 0.0, 0.0, 0.0, 0.0, 0.0, 0.0, 0.0, 0.0, 0.0, 0.0, 0.0, 0.0, 0.0, 0.0, 0.0, 0.0, 0.0, 0.0, 0.0, 0.09019608, 0.70588237, 0.90588236, 0.99215686, 0.86666667, 1.0, 0.0, 0.0, 0.0, 0.0, 0.0, 0.0, 0.0, 0.0, 0.0, 0.0, 0.0, 0.0, 0.0, 0.0, 0.0, 0.0, 0.0, 0.0, 0.0, 0.0, 1.0, 0.0, 0.0, 0.0, 1.0, 0.58431375, 0.08627451, 0.0, 0.0, 0.0, 0.0, 0.0, 0.0, 0.0, 0.0, 0.0, 0.0, 0.0, 0.0, 0.0, 0.0, 0.0, 0.0, 0.0, 0.0, 0.0, 0.0, 0.0, 0.0, 0.0, 0.0, 0.0, 0.0, 0.0, 0.0, 0.0, 0.0, 0.0, 0.0, 0.0, 0.0, 0.0, 0.0, 0.0, 0.0, 0.0, 0.0, 0.0, 0.0, 0.0, 0.0, 0.0, 0.0, 0.0, 0.0, 0.0, 0.0, 0.0, 0.0, 0.0, 0.0, 0.0, 0.0, 0.0, 0.0, 0.0, 0.0, 0.0, 0.0, 0.0, 0.0, 0.0, 0.0, 0.0, 0.0, 0.0, 0.0, 0.0, 0.0, 0.0, 0.0, 0.0, 0.0, 0.0, 0.0, 0.0, 0.0, 0.0, 0.0, 0.0, 0.0, 0.0, 0.0, 0.0, 0.0, 0.0, 0.0, 0.0, 0.0, 0.0, 0.0, 0.0, 0.0, 0.0, 0.0, 0.0, 0.0, 0.0, 0.0, 1.0, 0.0, 0.0, 0.0, 1.0, 0.0, 0.0, 0.0, 0.0, 0.0, 0.0, 0.0, 0.0, 0.0, 0.0, 0.0, 0.0, 0.0, 0.0, 0.0, 0.0], ([-112.70511282751292, -107.53187114187315, -90.30040287735439, -89.87912040852856, -78.50471162401541, -17.148065467124454, -34.79146527469291, -119.26777071075199, -70.91675977356807, -74.2735848841167], [-100.70507279541896, -97.18785438948622, -76.88123796042282, -84.5189287088746, -77.82325479169064, -19.205621527332283, -27.9007258038227, -109.15922546485689, -60.34800422816694, -67.53327935416965], 13.419164916931564))
[Thread 1] Total splits: 0
Processed 1 zonotopes (Work Done: 0.0%); Generated 0 (0.035443955s/loop)
[Thread 1] Finished in 0.04s
 ────────────────────────────────────────────────────────────────────────────────
                                        Time                    Allocations      
                               ───────────────────────   ────────────────────────
       Tot / % measured:           37.5ms / 100.0%           22.9MiB / 100.0%    

 Section               ncalls     time    %tot     avg     alloc    %tot      avg
 ────────────────────────────────────────────────────────────────────────────────
 Verify                     1   35.5ms   94.7%  35.5ms   17.6MiB   77.1%  17.6MiB
   Zonotope Loop            1   35.4ms   94.6%  35.4ms   17.6MiB   77.0%  17.6MiB
     Zonotope Propa...      1   32.7ms   87.2%  32.7ms   16.2MiB   70.7%  16.2MiB
       DiffZonotope...      3   28.7ms   76.7%  9.58ms   2.83MiB   12.4%   966KiB
         Zonotope_D...      6   18.2ms   48.5%  3.03ms   1.27MiB    5.6%   217KiB
       DiffZonotope...      2   3.91ms   10.4%  1.96ms   13.3MiB   58.3%  6.66MiB
         Zonotope_R...      4   1.88ms    5.0%   470μs   7.91MiB   34.6%  1.98MiB
           Column M...      4    978μs    2.6%   244μs   3.56MiB   15.6%   911KiB
           Influenc...      4    417μs    1.1%   104μs    691KiB    3.0%   173KiB
             Multiply       4    369μs    1.0%  92.1μs    560KiB    2.4%   140KiB
             Alloca...      4   35.5μs    0.1%  8.87μs    128KiB    0.5%  32.1KiB
             Set Ma...      4   7.61μs    0.0%  1.90μs     0.00B    0.0%    0.00B
           Set Matrix       4    240μs    0.6%  60.0μs   17.5KiB    0.1%  4.38KiB
           Allocation       4    163μs    0.4%  40.7μs   3.56MiB   15.6%   911KiB
           Vectors          4   71.4μs    0.2%  17.8μs    100KiB    0.4%  25.0KiB
           Bounds           4   1.65μs    0.0%   413ns     0.00B    0.0%    0.00B
     Property Check         1   2.29ms    6.1%  2.29ms    185KiB    0.8%   185KiB
 Initialize                 1   2.00ms    5.3%  2.00ms   5.24MiB   22.9%  5.24MiB
 ────────────────────────────────────────────────────────────────────────────────
[VERYDIFF_TIMER] 0.067679933

[VERYDIFF_EXPERIMENT] Running on /home/i57/steuber/NeuroDiff/repos/VeryDiffExperiments/src/../benchmarks/mnist-prune/specs/mnist_8_local_18.vnnlib /home/i57/steuber/NeuroDiff/repos/VeryDiffExperiments/src/../benchmarks/mnist-prune/nets/mnist_relu_3_100.onnx
Found input X
op: matmul, weight: (100, 784), bias: nothing
op: bias, weight: nothing, bias: (100,)
op: relu, weight: nothing, bias: nothing
op: matmul, weight: (100, 100), bias: nothing
op: bias, weight: nothing, bias: (100,)
op: relu, weight: nothing, bias: nothing
op: matmul, weight: (10, 100), bias: nothing
op: bias, weight: nothing, bias: (10,)
op: relu, weight: nothing, bias: nothing
op: matmul, weight: (10, 10), bias: nothing
op: bias, weight: nothing, bias: (10,)
Found input X
op: matmul, weight: (100, 784), bias: nothing
op: bias, weight: nothing, bias: (100,)
op: relu, weight: nothing, bias: nothing
op: matmul, weight: (100, 100), bias: nothing
op: bias, weight: nothing, bias: (100,)
op: relu, weight: nothing, bias: nothing
op: matmul, weight: (10, 100), bias: nothing
op: bias, weight: nothing, bias: (10,)
op: relu, weight: nothing, bias: nothing
op: matmul, weight: (10, 10), bias: nothing
op: bias, weight: nothing, bias: (10,)
Distance: 296.6600370998244
Distance: 77.24290861755458
Distance: 5.7170369567975285
Distance: 0.0
Running with 1 threads
[Thread 1] Time to first task: 0.0s
Instable Generators: 31
Instable Generators: 59
Instable Generators: 7
Zono Bounds:
[-0.9602569051603604, -1.2231452521166295, -1.5318736365159353, -0.14644528108041233, -1.146202322643434, -3.135860207195112, -0.05957761236652548, 0.0, -1.2296849415818685, -0.9289483831554657]
[0.6068501708895362, 0.3010854803330769, 0.411207884325256, 0.15060905641288702, 0.4545407375919122, 3.135860207195112, 1.8716426344867463, 0.0, 1.2296849415818685, 0.6191279528164053]

Found counterexample: ([0.0, 0.0, 1.0, 0.0, 0.0, 0.0, 0.0, 0.0, 0.0, 0.0, 0.0, 0.0, 0.0, 0.0, 0.0, 0.0, 0.0, 0.0, 0.0, 0.0, 0.0, 0.0, 0.0, 0.0, 0.0, 0.0, 0.0, 0.0, 0.0, 0.0, 0.0, 0.0, 0.0, 0.0, 0.0, 0.0, 0.0, 0.0, 0.0, 0.0, 0.0, 0.0, 0.0, 0.0, 0.0, 0.0, 0.0, 0.0, 0.0, 0.0, 0.0, 0.0, 0.0, 0.0, 0.0, 0.0, 0.0, 0.0, 0.0, 0.0, 0.0, 0.0, 0.0, 0.0, 0.0, 0.0, 0.0, 0.0, 0.0, 0.0, 0.0, 0.0, 0.0, 0.0, 0.0, 0.0, 0.0, 0.0, 0.0, 0.0, 0.0, 0.0, 0.0, 0.0, 0.0, 0.0, 0.0, 0.0, 0.0, 0.0, 0.0, 0.0, 0.0, 0.0, 0.0, 0.0, 0.0, 0.0, 0.0, 0.0, 0.0, 0.0, 0.0, 0.0, 0.0, 0.0, 0.0, 0.0, 0.0, 0.0, 0.0, 0.0, 0.0, 0.0, 0.0, 0.0, 0.0, 0.0, 1.0, 0.0, 0.0, 0.0, 0.0, 0.0, 0.0, 0.0, 0.0, 0.0, 0.0, 0.06666667, 0.18431373, 0.18431373, 0.18431373, 0.0627451, 0.50588238, 0.33333334, 0.18431373, 0.0, 0.0, 0.0, 0.0, 0.0, 0.0, 0.0, 0.0, 0.0, 0.0, 0.0, 0.0, 0.0, 0.0, 0.0, 0.0, 0.0, 0.0, 1.0, 0.60000002, 0.8509804, 0.99215686, 0.99215686, 0.99215686, 0.84313726, 0.96470588, 0.99215686, 0.99215686, 0.0, 0.0, 1.0, 0.0, 0.0, 0.0, 0.0, 0.0, 0.0, 0.0, 0.0, 0.0, 0.0, 0.0, 0.0, 0.13725491, 0.55686277, 0.95686275, 0.98823529, 0.99215686, 0.99215686, 0.99215686, 0.99215686, 0.99215686, 0.99215686, 0.99215686, 0.99215686, 0.99215686, 0.0, 0.0, 0.0, 0.0, 0.0, 0.0, 0.0, 0.0, 0.0, 0.0, 0.0, 0.0, 0.0, 0.0, 0.0, 0.24705882, 0.99215686, 0.99215686, 0.99215686, 0.99215686, 0.99215686, 0.99215686, 0.99215686, 0.83529413, 0.66666669, 0.0, 0.66666669, 0.66666669, 0.0, 0.0, 0.0, 0.0, 0.0, 0.0, 0.0, 0.0, 0.0, 0.0, 0.0, 0.07843138, 0.51764709, 0.28235295, 0.0, 0.22352941, 0.93333334, 0.89019608, 0.93333334, 0.65882355, 0.48627451, 0.27058825, 0.07843138, 0.04313726, 0.0, 0.0, 0.0, 0.0, 0.0, 0.0, 0.0, 0.0, 0.0, 0.0, 0.0, 0.0, 0.0, 0.0, 0.04313726, 0.80784315, 0.99215686, 0.30588236, 0.0, 0.0, 0.1254902, 0.0, 0.11764706, 0.00784314, 0.0, 0.0, 0.0, 0.0, 0.0, 0.0, 0.0, 0.0, 0.0, 0.0, 0.0, 0.0, 0.0, 0.0, 0.0, 0.0, 0.0, 0.02352941, 0.69411767, 0.99215686, 0.51764709, 0.03921569, 0.0, 0.0, 0.0, 0.0, 0.0, 0.0, 0.0, 0.0, 0.0, 0.0, 0.0, 0.0, 0.0, 0.0, 0.0, 0.0, 0.0, 0.0, 0.0, 0.0, 0.0, 0.0, 0.04705882, 0.52156866, 0.99215686, 0.9137255, 0.05882353, 0.0, 0.0, 0.0, 0.0, 0.0, 0.0, 0.0, 0.0, 0.0, 0.0, 0.0, 0.0, 0.0, 0.0, 0.0, 0.0, 0.0, 0.0, 0.0, 0.0, 0.0, 0.0, 0.0, 0.36078432, 0.99215686, 0.87450981, 0.10980392, 0.0, 0.0, 0.0, 0.0, 0.0, 0.0, 0.0, 0.0, 0.0, 0.0, 0.0, 0.0, 0.0, 0.0, 0.0, 0.0, 0.0, 0.0, 0.0, 0.0, 0.0, 0.0, 0.0, 0.0, 0.58823532, 0.99215686, 0.68235296, 0.0, 0.0, 0.0, 0.0, 0.0, 0.0, 0.0, 0.0, 0.0, 0.0, 0.0, 0.0, 0.0, 0.0, 0.0, 0.0, 0.0, 0.0, 0.0, 0.0, 0.0, 0.0, 0.0, 0.0, 0.0, 0.91764706, 0.99215686, 0.96470588, 0.49803922, 0.19215687, 0.0, 0.0, 0.0, 0.0, 0.0, 0.0, 0.0, 0.0, 0.0, 0.0, 0.0, 0.0, 0.0, 0.0, 0.0, 0.0, 0.0, 0.0, 0.0, 0.0, 0.0, 0.0, 0.0, 1.0, 0.99215686, 0.99215686, 0.99215686, 0.98431373, 0.57647061, 0.35686275, 0.47450981, 0.33333334, 0.16470589, 0.16470589, 0.33333334, 0.10980392, 0.0, 0.0, 0.0, 0.0, 0.0, 0.0, 0.0, 0.0, 0.0, 0.0, 0.0, 0.0, 0.0, 0.0, 0.0, 0.54509807, 0.99215686, 0.99215686, 0.99215686, 0.99215686, 0.99215686, 0.99215686, 0.99215686, 0.99215686, 0.99215686, 0.99215686, 0.99215686, 0.90980393, 0.65882355, 0.0, 0.0, 0.0, 0.0, 0.0, 0.0, 0.0, 0.0, 0.0, 0.0, 0.0, 0.0, 0.0, 0.0, 0.01176471, 0.20784314, 1.0, 0.87058824, 0.98431373, 0.99215686, 0.99215686, 0.99215686, 0.99215686, 0.99215686, 0.99215686, 0.99215686, 0.99215686, 0.98823529, 0.48627451, 0.0, 0.0, 0.0, 0.0, 0.0, 0.0, 0.0, 0.0, 0.0, 0.0, 0.0, 0.0, 0.0, 0.0, 0.0, 0.0, 0.0, 0.26274511, 0.28235295, 0.78431374, 0.99215686, 0.99215686, 0.99215686, 0.99215686, 0.99215686, 0.99215686, 0.99215686, 0.68627453, 0.0, 0.0, 0.0, 0.0, 0.0, 0.0, 0.0, 0.0, 0.0, 0.0, 0.0, 0.0, 0.0, 0.0, 0.0, 0.0, 0.0, 0.0, 0.0, 0.47058824, 0.99215686, 0.97647059, 0.59607846, 0.2, 0.64313728, 0.99215686, 0.99215686, 0.68627453, 0.0, 0.0, 0.0, 0.0, 0.0, 0.0, 0.0, 0.0, 0.0, 0.0, 0.0, 0.0, 0.0, 0.0, 0.0, 0.0, 0.0, 0.0, 0.0, 0.19607843, 0.99215686, 0.99215686, 0.99215686, 0.73725492, 0.98823529, 0.99215686, 0.0, 0.58039218, 0.0, 0.0, 0.0, 0.0, 0.0, 0.0, 0.0, 0.0, 0.0, 0.0, 0.0, 0.0, 0.0, 0.0, 0.0, 0.0, 0.0, 0.0, 0.0, 0.03529412, 0.65490198, 0.99215686, 0.99215686, 0.99215686, 0.99215686, 0.98039216, 0.68627453, 0.04313726, 0.0, 0.0, 0.0, 0.0, 0.0, 0.0, 0.0, 0.0, 0.0, 0.0, 0.0, 0.0, 0.0, 0.0, 0.0, 0.0, 0.0, 0.0, 0.0, 0.0, 0.09019608, 0.70588237, 0.90588236, 0.99215686, 0.86666667, 0.0, 0.0, 0.0, 0.0, 0.0, 0.0, 0.0, 0.0, 0.0, 0.0, 0.0, 0.0, 0.0, 0.0, 0.0, 0.0, 0.0, 0.0, 0.0, 0.0, 0.0, 0.0, 0.0, 0.0, 0.0, 0.0, 0.58431375, 0.08627451, 0.0, 0.0, 0.0, 0.0, 0.0, 0.0, 0.0, 0.0, 0.0, 0.0, 0.0, 0.0, 0.0, 0.0, 0.0, 0.0, 0.0, 0.0, 0.0, 0.0, 0.0, 0.0, 0.0, 0.0, 0.0, 0.0, 0.0, 0.0, 0.0, 0.0, 0.0, 0.0, 0.0, 0.0, 0.0, 0.0, 0.0, 0.0, 0.0, 0.0, 0.0, 0.0, 0.0, 0.0, 0.0, 0.0, 0.0, 0.0, 0.0, 0.0, 0.0, 0.0, 0.0, 0.0, 0.0, 0.0, 0.0, 0.0, 0.0, 0.0, 0.0, 0.0, 0.0, 0.0, 0.0, 0.0, 0.0, 0.0, 0.0, 0.0, 0.0, 0.0, 0.0, 0.0, 0.0, 0.0, 0.0, 0.0, 0.0, 0.0, 0.0, 0.0, 0.0, 0.0, 0.0, 0.0, 0.0, 0.0, 0.0, 0.0, 0.0, 0.0, 0.0, 0.0, 0.0, 0.0, 0.0, 0.0, 0.0, 0.0, 0.0, 0.0, 1.0, 0.0, 0.0, 0.0, 0.0, 0.0, 0.0, 0.0, 0.0, 0.0, 0.0, 0.0, 0.0, 0.0, 0.0, 0.0, 0.0, 0.0, 0.0, 0.0, 0.0], ([0.0, 0.0, 0.8057460662336478, 0.0, 0.9045315455034356, 2.857208229476652, 4.44684286083503, 0.0, 1.050784102348947, 1.1358537451916204], [0.0, 0.0, 1.0700001197007452, 0.0, 1.1231917923623191, 1.8030816361643964, 3.762583765272916, 0.0, 0.7392771711141412, 1.2877840929453768], 1.652830830312726))
[Thread 1] Total splits: 0
Processed 1 zonotopes (Work Done: 0.0%); Generated 0 (0.002302664s/loop)
[Thread 1] Finished in 0.0s
 ────────────────────────────────────────────────────────────────────────────────
                                        Time                    Allocations      
                               ───────────────────────   ────────────────────────
       Tot / % measured:           2.71ms /  99.8%           3.65MiB / 100.0%    

 Section               ncalls     time    %tot     avg     alloc    %tot      avg
 ────────────────────────────────────────────────────────────────────────────────
 Verify                     1   2.33ms   86.0%  2.33ms   2.83MiB   77.6%  2.83MiB
   Zonotope Loop            1   2.30ms   85.2%  2.30ms   2.83MiB   77.5%  2.83MiB
     Zonotope Propa...      1   1.72ms   63.8%  1.72ms   1.51MiB   41.3%  1.51MiB
       DiffZonotope...      4   1.08ms   39.9%   270μs    305KiB    8.1%  76.2KiB
         Zonotope_D...      8    475μs   17.6%  59.4μs    151KiB    4.0%  18.9KiB
       DiffZonotope...      3    634μs   23.5%   211μs   1.21MiB   33.1%   412KiB
         Zonotope_R...      6    307μs   11.4%  51.2μs    804KiB   21.5%   134KiB
           Influenc...      6    120μs    4.5%  20.1μs    233KiB    6.2%  38.9KiB
             Multiply       6   86.7μs    3.2%  14.5μs    152KiB    4.1%  25.3KiB
             Alloca...      6   21.4μs    0.8%  3.57μs   79.0KiB    2.1%  13.2KiB
             Set Ma...      6   6.92μs    0.3%  1.15μs     0.00B    0.0%    0.00B
           Column M...      6   90.2μs    3.3%  15.0μs    270KiB    7.2%  45.1KiB
           Set Matrix       6   34.0μs    1.3%  5.67μs   6.61KiB    0.2%  1.10KiB
           Allocation       6   31.9μs    1.2%  5.31μs    270KiB    7.2%  45.0KiB
           Vectors          6   19.5μs    0.7%  3.25μs   19.5KiB    0.5%  3.26KiB
           Bounds           6   2.16μs    0.1%   360ns     0.00B    0.0%    0.00B
     Property Check         1    164μs    6.0%   164μs   55.0KiB    1.5%  55.0KiB
 Initialize                 1    378μs   14.0%   378μs    839KiB   22.4%   839KiB
 ────────────────────────────────────────────────────────────────────────────────
[VERYDIFF_TIMER] 0.02755294

[VERYDIFF_EXPERIMENT] Running on /home/i57/steuber/NeuroDiff/repos/VeryDiffExperiments/src/../benchmarks/mnist-prune/specs/mnist_8_local_18.vnnlib /home/i57/steuber/NeuroDiff/repos/VeryDiffExperiments/src/../benchmarks/mnist-prune/nets/mnist_relu_4_1024.onnx
Found input X
op: matmul, weight: (1024, 784), bias: nothing
op: bias, weight: nothing, bias: (1024,)
op: relu, weight: nothing, bias: nothing
op: matmul, weight: (1024, 1024), bias: nothing
op: bias, weight: nothing, bias: (1024,)
op: relu, weight: nothing, bias: nothing
op: matmul, weight: (1024, 1024), bias: nothing
op: bias, weight: nothing, bias: (1024,)
op: relu, weight: nothing, bias: nothing
op: matmul, weight: (10, 1024), bias: nothing
op: bias, weight: nothing, bias: (10,)
op: relu, weight: nothing, bias: nothing
op: matmul, weight: (10, 10), bias: nothing
op: bias, weight: nothing, bias: (10,)
Found input X
op: matmul, weight: (1024, 784), bias: nothing
op: bias, weight: nothing, bias: (1024,)
op: relu, weight: nothing, bias: nothing
op: matmul, weight: (1024, 1024), bias: nothing
op: bias, weight: nothing, bias: (1024,)
op: relu, weight: nothing, bias: nothing
op: matmul, weight: (1024, 1024), bias: nothing
op: bias, weight: nothing, bias: (1024,)
op: relu, weight: nothing, bias: nothing
op: matmul, weight: (10, 1024), bias: nothing
op: bias, weight: nothing, bias: (10,)
op: relu, weight: nothing, bias: nothing
op: matmul, weight: (10, 10), bias: nothing
op: bias, weight: nothing, bias: (10,)
Distance: 1266.8815759184893
Distance: 2876.6944248261216
Distance: 2831.8843567411013
Distance: 34.033756025192815
Distance: 0.0
Running with 1 threads
[Thread 1] Time to first task: 0.0s
Instable Generators: 316
Instable Generators: 613
Instable Generators: 973
Instable Generators: 10
Zono Bounds:
[-62.68615225754561, -63.158230514628684, -72.10294799260261, -70.48251240055703, -68.7210325397438, -70.47040243182312, -63.72807282643036, -66.92363926235114, -67.95561327848793, -72.16564435894773]
[61.531509647453085, 62.99101227003089, 68.01051679192902, 67.94856928788022, 68.7210325397438, 70.47040243182312, 63.72807282643038, 66.92363926235114, 67.0435912617192, 72.16564435894773]

Found counterexample: ([0.0, 1.0, 0.0, 0.0, 0.0, 0.0, 0.0, 0.0, 0.0, 0.0, 0.0, 0.0, 0.0, 0.0, 0.0, 0.0, 0.0, 0.0, 0.0, 0.0, 0.0, 0.0, 0.0, 0.0, 0.0, 0.0, 0.0, 0.0, 0.0, 0.0, 0.0, 0.0, 0.0, 0.0, 0.0, 0.0, 0.0, 0.0, 0.0, 0.0, 0.0, 0.0, 0.0, 0.0, 0.0, 0.0, 0.0, 0.0, 0.0, 0.0, 0.0, 0.0, 0.0, 0.0, 0.0, 0.0, 0.0, 0.0, 0.0, 0.0, 0.0, 0.0, 0.0, 0.0, 0.0, 0.0, 0.0, 0.0, 0.0, 0.0, 0.0, 0.0, 0.0, 0.0, 0.0, 0.0, 0.0, 0.0, 0.0, 0.0, 0.0, 0.0, 0.0, 0.0, 0.0, 0.0, 0.0, 0.0, 0.0, 0.0, 0.0, 0.0, 0.0, 0.0, 0.0, 0.0, 0.0, 0.0, 0.0, 0.0, 0.0, 0.0, 0.0, 0.0, 0.0, 0.0, 0.0, 0.0, 0.0, 0.0, 0.0, 0.0, 0.0, 0.0, 0.0, 0.0, 0.0, 0.0, 0.0, 0.0, 0.0, 0.0, 0.0, 0.0, 0.0, 0.0, 0.0, 0.0, 0.0, 0.06666667, 0.18431373, 0.18431373, 0.18431373, 0.0627451, 0.50588238, 0.33333334, 0.18431373, 0.0, 0.0, 0.0, 0.0, 0.0, 0.0, 0.0, 0.0, 0.0, 0.0, 0.0, 0.0, 0.0, 0.0, 0.0, 0.0, 0.0, 0.0, 1.0, 0.60000002, 0.8509804, 0.99215686, 0.99215686, 0.99215686, 0.84313726, 0.96470588, 0.99215686, 0.99215686, 0.0, 0.0, 0.0, 0.0, 0.0, 1.0, 0.0, 0.0, 0.0, 0.0, 0.0, 0.0, 0.0, 0.0, 0.0, 0.13725491, 0.55686277, 0.95686275, 0.98823529, 0.99215686, 0.99215686, 0.99215686, 0.99215686, 0.99215686, 0.99215686, 0.99215686, 0.99215686, 0.99215686, 0.0, 0.0, 0.0, 0.0, 0.0, 0.0, 0.0, 0.0, 0.0, 0.0, 0.0, 0.0, 0.0, 0.0, 0.0, 0.24705882, 0.99215686, 0.99215686, 0.99215686, 0.99215686, 0.99215686, 0.99215686, 0.99215686, 0.83529413, 0.66666669, 0.0, 0.66666669, 0.66666669, 0.0, 0.0, 0.0, 0.0, 0.0, 0.0, 0.0, 0.0, 0.0, 0.0, 0.0, 0.07843138, 0.51764709, 0.28235295, 0.0, 0.22352941, 0.93333334, 0.89019608, 0.93333334, 0.65882355, 0.48627451, 0.27058825, 0.07843138, 0.04313726, 0.0, 0.0, 0.0, 0.0, 0.0, 0.0, 0.0, 0.0, 0.0, 0.0, 0.0, 0.0, 0.0, 0.0, 0.04313726, 0.80784315, 0.99215686, 0.30588236, 0.0, 0.0, 0.1254902, 0.0, 0.11764706, 0.00784314, 0.0, 0.0, 0.0, 0.0, 0.0, 0.0, 0.0, 0.0, 0.0, 0.0, 0.0, 0.0, 0.0, 0.0, 0.0, 0.0, 0.0, 0.02352941, 0.69411767, 0.99215686, 0.51764709, 0.03921569, 0.0, 0.0, 0.0, 0.0, 0.0, 0.0, 0.0, 0.0, 0.0, 0.0, 0.0, 0.0, 0.0, 0.0, 0.0, 0.0, 0.0, 0.0, 0.0, 0.0, 0.0, 0.0, 0.04705882, 0.52156866, 0.99215686, 0.9137255, 0.05882353, 0.0, 0.0, 0.0, 0.0, 0.0, 0.0, 0.0, 0.0, 0.0, 0.0, 0.0, 0.0, 0.0, 0.0, 0.0, 0.0, 0.0, 0.0, 0.0, 0.0, 0.0, 0.0, 0.0, 0.36078432, 0.99215686, 0.87450981, 0.10980392, 0.0, 0.0, 0.0, 0.0, 0.0, 0.0, 0.0, 0.0, 0.0, 0.0, 0.0, 0.0, 0.0, 0.0, 0.0, 0.0, 0.0, 0.0, 0.0, 0.0, 0.0, 0.0, 0.0, 0.0, 0.58823532, 0.99215686, 0.68235296, 0.0, 0.0, 0.0, 0.0, 0.0, 0.0, 0.0, 0.0, 0.0, 0.0, 0.0, 0.0, 0.0, 0.0, 0.0, 0.0, 0.0, 0.0, 0.0, 0.0, 0.0, 0.0, 0.0, 0.0, 0.0, 0.91764706, 0.99215686, 0.96470588, 0.49803922, 0.19215687, 0.0, 0.0, 0.0, 0.0, 0.0, 0.0, 0.0, 0.0, 0.0, 0.0, 0.0, 0.0, 0.0, 0.0, 0.0, 0.0, 1.0, 0.0, 0.0, 0.0, 0.0, 0.0, 0.0, 1.0, 0.99215686, 0.99215686, 0.99215686, 0.98431373, 0.57647061, 0.35686275, 0.47450981, 0.33333334, 0.16470589, 0.16470589, 0.33333334, 0.10980392, 0.0, 0.0, 0.0, 0.0, 0.0, 0.0, 0.0, 0.0, 0.0, 0.0, 0.0, 0.0, 0.0, 0.0, 0.0, 0.54509807, 0.99215686, 0.99215686, 0.99215686, 0.99215686, 0.99215686, 0.99215686, 0.99215686, 0.99215686, 0.99215686, 0.99215686, 0.99215686, 0.90980393, 0.65882355, 0.0, 0.0, 0.0, 0.0, 0.0, 0.0, 0.0, 0.0, 0.0, 0.0, 0.0, 0.0, 0.0, 0.0, 0.01176471, 0.20784314, 0.0, 0.87058824, 0.98431373, 0.99215686, 0.99215686, 0.99215686, 0.99215686, 0.99215686, 0.99215686, 0.99215686, 0.99215686, 0.98823529, 0.48627451, 0.0, 0.0, 0.0, 0.0, 0.0, 0.0, 0.0, 0.0, 0.0, 0.0, 0.0, 0.0, 0.0, 0.0, 0.0, 0.0, 0.0, 0.26274511, 0.28235295, 0.78431374, 0.99215686, 0.99215686, 0.99215686, 0.99215686, 0.99215686, 0.99215686, 0.99215686, 0.68627453, 0.0, 0.0, 0.0, 0.0, 0.0, 0.0, 0.0, 0.0, 0.0, 0.0, 0.0, 0.0, 0.0, 0.0, 0.0, 0.0, 0.0, 0.0, 0.0, 0.47058824, 0.99215686, 0.97647059, 0.59607846, 0.2, 0.64313728, 0.99215686, 0.99215686, 0.68627453, 0.0, 0.0, 0.0, 0.0, 0.0, 0.0, 0.0, 0.0, 0.0, 0.0, 0.0, 0.0, 0.0, 0.0, 0.0, 0.0, 0.0, 0.0, 0.0, 0.19607843, 0.99215686, 0.99215686, 0.99215686, 0.73725492, 0.98823529, 0.99215686, 1.0, 0.58039218, 0.0, 0.0, 0.0, 0.0, 0.0, 0.0, 0.0, 0.0, 0.0, 0.0, 0.0, 0.0, 0.0, 0.0, 0.0, 0.0, 0.0, 0.0, 1.0, 0.03529412, 0.65490198, 0.99215686, 0.99215686, 0.99215686, 0.99215686, 0.98039216, 0.68627453, 0.04313726, 0.0, 0.0, 0.0, 0.0, 0.0, 0.0, 0.0, 0.0, 0.0, 0.0, 0.0, 0.0, 0.0, 0.0, 0.0, 0.0, 0.0, 0.0, 0.0, 0.0, 0.09019608, 0.70588237, 0.90588236, 0.99215686, 0.86666667, 1.0, 0.0, 0.0, 0.0, 0.0, 0.0, 0.0, 0.0, 0.0, 0.0, 0.0, 0.0, 0.0, 0.0, 0.0, 0.0, 0.0, 0.0, 0.0, 0.0, 0.0, 1.0, 0.0, 0.0, 0.0, 0.0, 0.58431375, 0.08627451, 0.0, 0.0, 0.0, 0.0, 0.0, 0.0, 0.0, 0.0, 0.0, 0.0, 0.0, 0.0, 0.0, 0.0, 0.0, 0.0, 0.0, 0.0, 0.0, 0.0, 0.0, 0.0, 0.0, 0.0, 0.0, 0.0, 0.0, 0.0, 0.0, 0.0, 0.0, 0.0, 0.0, 0.0, 0.0, 0.0, 0.0, 0.0, 0.0, 0.0, 0.0, 0.0, 0.0, 0.0, 0.0, 0.0, 0.0, 0.0, 0.0, 0.0, 0.0, 0.0, 0.0, 0.0, 0.0, 0.0, 0.0, 0.0, 0.0, 0.0, 0.0, 0.0, 0.0, 0.0, 0.0, 0.0, 0.0, 0.0, 0.0, 0.0, 0.0, 0.0, 0.0, 0.0, 0.0, 0.0, 0.0, 0.0, 0.0, 0.0, 0.0, 0.0, 0.0, 0.0, 0.0, 0.0, 0.0, 0.0, 0.0, 0.0, 0.0, 0.0, 0.0, 0.0, 0.0, 0.0, 0.0, 0.0, 0.0, 0.0, 0.0, 0.0, 0.0, 0.0, 0.0, 0.0, 1.0, 0.0, 0.0, 0.0, 0.0, 0.0, 0.0, 0.0, 0.0, 0.0, 0.0, 0.0, 0.0, 0.0, 0.0, 0.0, 0.0], ([0.0, 0.0, 0.0, 0.0, 0.0, 16.009334631752576, 10.488110387550567, 0.0, 6.9571039797870196, 2.4328643556703415], [0.0, 0.0, 0.0, 0.0, 0.0, 15.222535239061594, 9.445617837608955, 0.0, 8.523063191497428, 0.6587422165610348], 2.0026383513728456))
[Thread 1] Total splits: 0
Processed 1 zonotopes (Work Done: 0.0%); Generated 0 (0.92040749s/loop)
[Thread 1] Finished in 0.92s
 ────────────────────────────────────────────────────────────────────────────────
                                        Time                    Allocations      
                               ───────────────────────   ────────────────────────
       Tot / % measured:            939ms / 100.0%            279MiB / 100.0%    

 Section               ncalls     time    %tot     avg     alloc    %tot      avg
 ────────────────────────────────────────────────────────────────────────────────
 Verify                     1    920ms   98.0%   920ms    257MiB   92.0%   257MiB
   Zonotope Loop            1    920ms   98.0%   920ms    257MiB   92.0%   257MiB
     Zonotope Propa...      1    909ms   96.8%   909ms    255MiB   91.3%   255MiB
       DiffZonotope...      5    468ms   49.8%  93.6ms   52.5MiB   18.8%  10.5MiB
         Zonotope_D...     10    133ms   14.2%  13.3ms   21.5MiB    7.7%  2.15MiB
       DiffZonotope...      4    441ms   47.0%   110ms    202MiB   72.5%  50.6MiB
         Zonotope_R...      8   66.2ms    7.0%  8.27ms    125MiB   44.8%  15.6MiB
           Column M...      8   25.6ms    2.7%  3.20ms   51.6MiB   18.5%  6.45MiB
           Allocation       8   18.3ms    2.0%  2.29ms   51.6MiB   18.5%  6.45MiB
           Influenc...      8   14.2ms    1.5%  1.78ms   21.4MiB    7.7%  2.68MiB
             Multiply       8   14.0ms    1.5%  1.75ms   20.0MiB    7.2%  2.49MiB
             Alloca...      8    127μs    0.0%  15.9μs   1.45MiB    0.5%   185KiB
             Set Ma...      8   96.5μs    0.0%  12.1μs     0.00B    0.0%    0.00B
           Set Matrix       8   7.78ms    0.8%   973μs    102KiB    0.0%  12.7KiB
           Vectors          8    210μs    0.0%  26.2μs    272KiB    0.1%  34.0KiB
           Bounds           8   4.73μs    0.0%   592ns     0.00B    0.0%    0.00B
     Property Check         1   10.7ms    1.1%  10.7ms    531KiB    0.2%   531KiB
 Initialize                 1   18.7ms    2.0%  18.7ms   22.4MiB    8.0%  22.4MiB
 ────────────────────────────────────────────────────────────────────────────────
[VERYDIFF_TIMER] 1.031576357

[VERYDIFF_EXPERIMENT] NETWORK: /home/i57/steuber/NeuroDiff/repos/VeryDiffExperiments/src/../benchmarks/mnist-prune/specs/mnist_8_local_18.vnnlib
[VERYDIFF_EXPERIMENT] TIME: 1.988454382
