
[VERYDIFF_EXPERIMENT] Running on /home/i57/steuber/NeuroDiff/repos/VeryDiffExperiments/src/../benchmarks/mnist-prune/specs/mnist_15_global_3.vnnlib /home/i57/steuber/NeuroDiff/repos/VeryDiffExperiments/src/../benchmarks/mnist-prune/nets/mnist_relu_3_100.onnx
Found input X
op: matmul, weight: (100, 784), bias: nothing
op: bias, weight: nothing, bias: (100,)
op: relu, weight: nothing, bias: nothing
op: matmul, weight: (100, 100), bias: nothing
op: bias, weight: nothing, bias: (100,)
op: relu, weight: nothing, bias: nothing
op: matmul, weight: (10, 100), bias: nothing
op: bias, weight: nothing, bias: (10,)
op: relu, weight: nothing, bias: nothing
op: matmul, weight: (10, 10), bias: nothing
op: bias, weight: nothing, bias: (10,)
Found input X
op: gemm, weight: (100, 784), bias: (100,)
op: relu, weight: nothing, bias: nothing
op: gemm, weight: (100, 100), bias: (100,)
op: relu, weight: nothing, bias: nothing
op: gemm, weight: (10, 100), bias: (10,)
op: relu, weight: nothing, bias: nothing
op: gemm, weight: (10, 10), bias: (10,)
Distance: 1958.4889029213523
Distance: 144.28197153992141
Distance: 22.063573056613677
Distance: 0.8412832540489035
Running with 1 threads
[Thread 1] Time to first task: 0.0s
Instable Generators: 24
Instable Generators: 27
Instable Generators: 3
Zono Bounds:
[-1.731825042410408, 0.006453365321263843, -0.001846235500128461, -1.9292156411094878, -0.028223533127480653, -2.6277915798436013, -1.7935270893633302, -0.0055880621153395395, -1.8438810101077296, -1.8659815519321337]
[1.72608993175792, 0.012831333063826162, 0.005449874842713021, 2.1077947598965516, -0.01867231376170391, 1.7554620120572193, 1.7958466710795538, 0.0007288341648439786, 1.8876006403130756, 1.5753958669078483]
[Thread 1] Processed 100 zonotopes (Work Done: 0.0%; Expected Zonos: Inf)
[Thread 1] Processed 200 zonotopes (Work Done: 0.0%; Expected Zonos: Inf)
[Thread 1] Processed 300 zonotopes (Work Done: 0.0%; Expected Zonos: Inf)
[Thread 1] Processed 400 zonotopes (Work Done: 0.0%; Expected Zonos: Inf)
[Thread 1] Processed 500 zonotopes (Work Done: 0.0%; Expected Zonos: Inf)


TIMEOUT REACHED
UNKNOWN
[Thread 1] Total splits: 575
Processed 575 zonotopes (Work Done: 0.0%); Generated 1150 (0.20891081736173914s/loop)
[Thread 1] Finished in 120.12s
 ────────────────────────────────────────────────────────────────────────────────
                                        Time                    Allocations      
                               ───────────────────────   ────────────────────────
       Tot / % measured:             120s / 100.0%           59.7GiB / 100.0%    

 Section               ncalls     time    %tot     avg     alloc    %tot      avg
 ────────────────────────────────────────────────────────────────────────────────
 Verify                     1     120s  100.0%    120s   59.6GiB  100.0%  59.6GiB
   Zonotope Loop            1     120s  100.0%    120s   59.6GiB  100.0%  59.6GiB
     Zonotope Propa...    575    84.1s   70.0%   146ms   39.9GiB   66.9%  71.1MiB
       DiffZonotope...  1.73k    73.8s   61.4%  42.8ms   37.6GiB   63.1%  22.3MiB
         Zonotope_R...  3.45k    67.4s   56.1%  19.5ms   36.7GiB   61.6%  10.9MiB
           Influenc...  3.45k    66.6s   55.4%  19.3ms   33.8GiB   56.6%  10.0MiB
             Multiply   3.45k    37.8s   31.4%  10.9ms   17.1GiB   28.6%  5.07MiB
             Alloca...  3.45k    26.4s   22.0%  7.65ms   16.7GiB   28.0%  4.95MiB
             Set Ma...  3.45k    2.42s    2.0%   703μs     0.00B    0.0%    0.00B
           Column M...  3.45k    467ms    0.4%   135μs   1.48GiB    2.5%   450KiB
           Set Matrix   3.45k    187ms    0.2%  54.2μs   2.45MiB    0.0%     746B
           Allocation   3.45k   78.4ms    0.1%  22.7μs   1.48GiB    2.5%   450KiB
           Vectors      3.45k   17.8ms    0.0%  5.15μs   11.0MiB    0.0%  3.26KiB
           Bounds       3.45k   2.51ms    0.0%   727ns     0.00B    0.0%    0.00B
       DiffZonotope...  2.30k    10.3s    8.5%  4.46ms   2.30GiB    3.9%  1.02MiB
         Zonotope_D...  4.60k    5.01s    4.2%  1.09ms   1.51GiB    2.5%   345KiB
     Compute Split        575    4.44s    3.7%  7.73ms   8.47GiB   14.2%  15.1MiB
     Property Check       575    643ms    0.5%  1.12ms   66.0MiB    0.1%   117KiB
 Initialize                 1    566μs    0.0%   566μs   5.41MiB    0.0%  5.41MiB
 ────────────────────────────────────────────────────────────────────────────────
[VERYDIFF_TIMER] 120.154949886

[VERYDIFF_EXPERIMENT] NETWORK: /home/i57/steuber/NeuroDiff/repos/VeryDiffExperiments/src/../benchmarks/mnist-prune/specs/mnist_15_global_3.vnnlib
[VERYDIFF_EXPERIMENT] TIME: 120.626259928
