
[VERYDIFF_EXPERIMENT] Running on /home/i57/steuber/NeuroDiff/repos/VeryDiffExperiments/src/../benchmarks/mnist-prune/specs/mnist_4_global_3.vnnlib /home/i57/steuber/NeuroDiff/repos/VeryDiffExperiments/src/../benchmarks/mnist-prune/nets/mnist_relu_2_512.onnx
Found input X
op: matmul, weight: (512, 784), bias: nothing
op: bias, weight: nothing, bias: (512,)
op: relu, weight: nothing, bias: nothing
op: matmul, weight: (512, 512), bias: nothing
op: bias, weight: nothing, bias: (512,)
op: relu, weight: nothing, bias: nothing
op: matmul, weight: (10, 512), bias: nothing
op: bias, weight: nothing, bias: (10,)
Found input X
op: gemm, weight: (512, 784), bias: (512,)
op: relu, weight: nothing, bias: nothing
op: gemm, weight: (512, 512), bias: (512,)
op: relu, weight: nothing, bias: nothing
op: gemm, weight: (10, 512), bias: (10,)
Distance: 973.3044369037136
Distance: 481.63499746812613
Distance: 8.744412635378467
Running with 1 threads
[Thread 1] Time to first task: 0.01s
Instable Generators: 96
Instable Generators: 171
Zono Bounds:
[-4.653590173083708, -4.044272219018739, -3.2078915423186727, -4.077700023669776, -3.9121884654222954, -3.7590035279106737, -4.285467357182006, -3.6631137416347888, -3.7197137251298553, -3.394838676645523]
[6.383199807227554, 5.029791806984466, 5.1420540052941925, 6.067102249441106, 4.6419555985305525, 4.913667033640184, 5.40521880474093, 5.360522452854045, 4.224983486867764, 4.596190760865447]
[Thread 1] Processed 100 zonotopes (Work Done: 0.0%; Expected Zonos: Inf)
[Thread 1] Processed 200 zonotopes (Work Done: 0.0%; Expected Zonos: Inf)
[Thread 1] Processed 300 zonotopes (Work Done: 0.0%; Expected Zonos: Inf)


TIMEOUT REACHED
UNKNOWN
[Thread 1] Total splits: 340
Processed 340 zonotopes (Work Done: 0.0%); Generated 680 (0.35355637382058824s/loop)
[Thread 1] Finished in 120.21s
 ────────────────────────────────────────────────────────────────────────────────
                                        Time                    Allocations      
                               ───────────────────────   ────────────────────────
       Tot / % measured:             120s / 100.0%           49.4GiB / 100.0%    

 Section               ncalls     time    %tot     avg     alloc    %tot      avg
 ────────────────────────────────────────────────────────────────────────────────
 Verify                     1     120s  100.0%    120s   49.4GiB  100.0%  49.4GiB
   Zonotope Loop            1     120s  100.0%    120s   49.4GiB  100.0%  49.4GiB
     Zonotope Propa...    340    94.5s   78.6%   278ms   36.8GiB   74.6%   111MiB
       DiffZonotope...  1.02k    48.8s   40.6%  47.9ms   6.82GiB   13.8%  6.85MiB
         Zonotope_D...  2.04k    19.9s   16.6%  9.76ms   4.38GiB    8.9%  2.20MiB
       DiffZonotope...    680    45.7s   38.0%  67.2ms   30.0GiB   60.7%  45.2MiB
         Zonotope_R...  1.36k    43.4s   36.1%  31.9ms   26.4GiB   53.5%  19.9MiB
           Influenc...  1.36k    27.7s   23.0%  20.3ms   16.4GiB   33.2%  12.4MiB
             Alloca...  1.36k    15.4s   12.9%  11.4ms   7.64GiB   15.5%  5.75MiB
             Multiply   1.36k    11.2s    9.3%  8.23ms   8.77GiB   17.8%  6.60MiB
             Set Ma...  1.36k    1.02s    0.8%   748μs     0.00B    0.0%    0.00B
           Allocation   1.36k    13.3s   11.1%  9.77ms   4.99GiB   10.1%  3.76MiB
           Column M...  1.36k    1.76s    1.5%  1.30ms   4.99GiB   10.1%  3.76MiB
           Set Matrix   1.36k    607ms    0.5%   446μs   5.25MiB    0.0%  3.95KiB
           Vectors      1.36k   27.7ms    0.0%  20.4μs   33.2MiB    0.1%  25.0KiB
           Bounds       1.36k   1.04ms    0.0%   762ns     0.00B    0.0%    0.00B
     Compute Split        340    3.59s    3.0%  10.6ms   5.84GiB   11.8%  17.6MiB
     Property Check       340    300ms    0.2%   883μs   92.0MiB    0.2%   277KiB
 Initialize                 1   2.16ms    0.0%  2.16ms   9.84MiB    0.0%  9.84MiB
 ────────────────────────────────────────────────────────────────────────────────
[VERYDIFF_TIMER] 120.251366149

[VERYDIFF_EXPERIMENT] NETWORK: /home/i57/steuber/NeuroDiff/repos/VeryDiffExperiments/src/../benchmarks/mnist-prune/specs/mnist_4_global_3.vnnlib
[VERYDIFF_EXPERIMENT] TIME: 120.661384432
