
[VERYDIFF_EXPERIMENT] Running on /home/i57/steuber/NeuroDiff/repos/VeryDiffExperiments/src/../benchmarks/mnist-prune/specs/mnist_73_global_3.vnnlib /home/i57/steuber/NeuroDiff/repos/VeryDiffExperiments/src/../benchmarks/mnist-prune/nets/mnist_relu_3_100.onnx
Found input X
op: matmul, weight: (100, 784), bias: nothing
op: bias, weight: nothing, bias: (100,)
op: relu, weight: nothing, bias: nothing
op: matmul, weight: (100, 100), bias: nothing
op: bias, weight: nothing, bias: (100,)
op: relu, weight: nothing, bias: nothing
op: matmul, weight: (10, 100), bias: nothing
op: bias, weight: nothing, bias: (10,)
op: relu, weight: nothing, bias: nothing
op: matmul, weight: (10, 10), bias: nothing
op: bias, weight: nothing, bias: (10,)
Found input X
op: gemm, weight: (100, 784), bias: (100,)
op: relu, weight: nothing, bias: nothing
op: gemm, weight: (100, 100), bias: (100,)
op: relu, weight: nothing, bias: nothing
op: gemm, weight: (10, 100), bias: (10,)
op: relu, weight: nothing, bias: nothing
op: gemm, weight: (10, 10), bias: (10,)
Distance: 368.62397500800625
Distance: 47.56803950402309
Distance: 2.8977568827249343
Distance: 0.01885471428334995
Running with 1 threads
[Thread 1] Time to first task: 0.0s
Instable Generators: 21
Instable Generators: 20
Instable Generators: 2
Zono Bounds:
[0.0005098480585612132, -0.304045771309884, 0.0005917599965097088, -0.43124132698405626, -0.38363855070933434, 0.0002467158868297165, -2.5259493759070465e-5, -0.3627271142555991, -0.32880655963515965, -0.352272310872747]
[0.0006621007513844316, 0.3585150357545696, 0.001503131573491839, 0.38919040118582027, 0.41321071648085755, 0.0009087894283539186, 0.00031348950503941905, 0.4694606655363961, 0.32582156924077116, 0.3898196702661878]
[Thread 1] Total splits: 0
Processed 1 zonotopes (Work Done: 100.0%); Generated 0 (0.059428486s/loop)
[Thread 1] Finished in 0.06s
 ────────────────────────────────────────────────────────────────────────────────
                                        Time                    Allocations      
                               ───────────────────────   ────────────────────────
       Tot / % measured:           60.0ms / 100.0%           95.6MiB / 100.0%    

 Section               ncalls     time    %tot     avg     alloc    %tot      avg
 ────────────────────────────────────────────────────────────────────────────────
 Verify                     1   59.5ms   99.0%  59.5ms   90.1MiB   94.3%  90.1MiB
   Zonotope Loop            1   59.4ms   99.0%  59.4ms   90.1MiB   94.3%  90.1MiB
     Zonotope Propa...      1   56.1ms   93.5%  56.1ms   70.2MiB   73.5%  70.2MiB
       DiffZonotope...      3   32.9ms   54.7%  11.0ms   66.1MiB   69.2%  22.0MiB
         Zonotope_R...      6   32.0ms   53.3%  5.33ms   64.6MiB   67.6%  10.8MiB
           Influenc...      6   30.8ms   51.2%  5.13ms   59.4MiB   62.1%  9.89MiB
             Multiply       6   19.8ms   33.0%  3.30ms   29.9MiB   31.3%  4.99MiB
             Alloca...      6   6.91ms   11.5%  1.15ms   29.4MiB   30.8%  4.90MiB
             Set Ma...      6   4.00ms    6.7%   666μs     0.00B    0.0%    0.00B
           Column M...      6    737μs    1.2%   123μs   2.62MiB    2.7%   446KiB
           Set Matrix       6    318μs    0.5%  53.0μs   3.89KiB    0.0%     664B
           Allocation       6    146μs    0.2%  24.4μs   2.62MiB    2.7%   446KiB
           Vectors          6   26.4μs    0.0%  4.41μs   19.5KiB    0.0%  3.26KiB
           Bounds           6   3.32μs    0.0%   554ns     0.00B    0.0%    0.00B
       DiffZonotope...      4   23.2ms   38.7%  5.81ms   4.07MiB    4.3%  1.02MiB
         Zonotope_D...      8   8.74ms   14.6%  1.09ms   2.69MiB    2.8%   344KiB
     Property Check         1   9.38μs    0.0%  9.38μs      992B    0.0%     992B
 Initialize                 1    580μs    1.0%   580μs   5.41MiB    5.7%  5.41MiB
 ────────────────────────────────────────────────────────────────────────────────
[VERYDIFF_TIMER] 0.09157175

[VERYDIFF_EXPERIMENT] NETWORK: /home/i57/steuber/NeuroDiff/repos/VeryDiffExperiments/src/../benchmarks/mnist-prune/specs/mnist_73_global_3.vnnlib
[VERYDIFF_EXPERIMENT] TIME: 0.39500872
