
[VERYDIFF_EXPERIMENT] Running on /home/i57/steuber/NeuroDiff/repos/VeryDiffExperiments/src/../benchmarks/mnist-prune/specs/mnist_0_global_5.vnnlib /home/i57/steuber/NeuroDiff/repos/VeryDiffExperiments/src/../benchmarks/mnist-prune/nets/mnist_relu_2_512.onnx
Found input X
op: matmul, weight: (512, 784), bias: nothing
op: bias, weight: nothing, bias: (512,)
op: relu, weight: nothing, bias: nothing
op: matmul, weight: (512, 512), bias: nothing
op: bias, weight: nothing, bias: (512,)
op: relu, weight: nothing, bias: nothing
op: matmul, weight: (10, 512), bias: nothing
op: bias, weight: nothing, bias: (10,)
Found input X
op: gemm, weight: (512, 784), bias: (512,)
op: relu, weight: nothing, bias: nothing
op: gemm, weight: (512, 512), bias: (512,)
op: relu, weight: nothing, bias: nothing
op: gemm, weight: (10, 512), bias: (10,)
Distance: 973.3044369037136
Distance: 481.63499746812613
Distance: 8.744412635378467
Running with 1 threads
[Thread 1] Time to first task: 0.01s
Instable Generators: 179
Instable Generators: 297
Zono Bounds:
[-13.878383256436878, -13.758322979804586, -11.61050090841402, -12.977922763631577, -12.801949745171244, -12.2247820874391, -13.208423780993517, -12.020417185970016, -11.365532000622624, -10.654240885535645]
[17.03752584612557, 18.54837149642813, 13.521013809241628, 15.451222496229553, 17.750507712514583, 14.474134141412948, 16.911864331780887, 14.861326027289932, 13.677896745462602, 13.797930702986884]
[Thread 1] Processed 100 zonotopes (Work Done: 0.0%; Expected Zonos: Inf)
[Thread 1] Processed 200 zonotopes (Work Done: 0.0%; Expected Zonos: Inf)


TIMEOUT REACHED
UNKNOWN
[Thread 1] Total splits: 263
Processed 263 zonotopes (Work Done: 0.0%); Generated 526 (0.4576681437262357s/loop)
[Thread 1] Finished in 120.37s
 ────────────────────────────────────────────────────────────────────────────────
                                        Time                    Allocations      
                               ───────────────────────   ────────────────────────
       Tot / % measured:             120s / 100.0%           43.9GiB / 100.0%    

 Section               ncalls     time    %tot     avg     alloc    %tot      avg
 ────────────────────────────────────────────────────────────────────────────────
 Verify                     1     120s  100.0%    120s   43.9GiB  100.0%  43.9GiB
   Zonotope Loop            1     120s  100.0%    120s   43.9GiB  100.0%  43.9GiB
     Zonotope Propa...    263     110s   91.3%   418ms   33.6GiB   76.4%   131MiB
       DiffZonotope...    526    75.8s   63.0%   144ms   27.8GiB   63.4%  54.2MiB
         Zonotope_R...  1.05k    65.7s   54.6%  62.5ms   24.2GiB   55.1%  23.6MiB
           Influenc...  1.05k    39.6s   32.9%  37.6ms   15.3GiB   34.8%  14.9MiB
             Multiply   1.05k    28.3s   23.5%  26.9ms   8.47GiB   19.3%  8.24MiB
             Alloca...  1.05k    10.4s    8.6%  9.85ms   6.81GiB   15.5%  6.63MiB
             Set Ma...  1.05k    910ms    0.8%   865μs     0.00B    0.0%    0.00B
           Column M...  1.05k    17.4s   14.4%  16.5ms   4.45GiB   10.1%  4.33MiB
           Allocation   1.05k    8.15s    6.8%  7.74ms   4.45GiB   10.1%  4.33MiB
           Set Matrix   1.05k    602ms    0.5%   573μs   6.71MiB    0.0%  6.53KiB
           Vectors      1.05k   20.8ms    0.0%  19.8μs   25.7MiB    0.1%  25.0KiB
           Bounds       1.05k    774μs    0.0%   736ns     0.00B    0.0%    0.00B
       DiffZonotope...    789    34.2s   28.4%  43.3ms   5.71GiB   13.0%  7.42MiB
         Zonotope_D...  1.58k    13.4s   11.2%  8.51ms   3.56GiB    8.1%  2.31MiB
     Compute Split        263    4.62s    3.8%  17.6ms   5.17GiB   11.8%  20.1MiB
     Property Check       263    806ms    0.7%  3.07ms   62.9MiB    0.1%   245KiB
 Initialize                 1   2.25ms    0.0%  2.25ms   9.84MiB    0.0%  9.84MiB
 ────────────────────────────────────────────────────────────────────────────────
[VERYDIFF_TIMER] 120.403767322

[VERYDIFF_EXPERIMENT] NETWORK: /home/i57/steuber/NeuroDiff/repos/VeryDiffExperiments/src/../benchmarks/mnist-prune/specs/mnist_0_global_5.vnnlib
[VERYDIFF_EXPERIMENT] TIME: 120.790918111
