
[VERYDIFF_EXPERIMENT] Running on /home/i57/steuber/NeuroDiff/repos/VeryDiffExperiments/src/../benchmarks/mnist-prune/specs/mnist_43_local_21.vnnlib /home/i57/steuber/NeuroDiff/repos/VeryDiffExperiments/src/../benchmarks/mnist-prune/nets/mnist_relu_2_512.onnx
Parsing /home/i57/steuber/NeuroDiff/repos/VeryDiffExperiments/src/../benchmarks/mnist-prune/nets/mnist_relu_2_512.onnx...
Found input X
op: matmul, weight: (512, 784), bias: nothing
op: bias, weight: nothing, bias: (512,)
op: relu, weight: nothing, bias: nothing
op: matmul, weight: (512, 512), bias: nothing
op: bias, weight: nothing, bias: (512,)
op: relu, weight: nothing, bias: nothing
op: matmul, weight: (10, 512), bias: nothing
op: bias, weight: nothing, bias: (10,)
Parsing /home/i57/steuber/NeuroDiff/repos/VeryDiffExperiments/src/../benchmarks/mnist-prune/nets_pruned/mnist_relu_2_512_0.79-old.onnx...
Found input X
op: gemm, weight: (512, 784), bias: (512,)
op: relu, weight: nothing, bias: nothing
op: gemm, weight: (512, 512), bias: (512,)
op: relu, weight: nothing, bias: nothing
op: gemm, weight: (10, 512), bias: (10,)
Distance: 973.3044369037136
Distance: 481.63499746812613
Distance: 8.744412635378467
Running with 1 threads
[Thread 1] Time to first task: 0.0s
Instable Generators: 201
Instable Generators: 378
Zono Bounds:
[-20.913275879485944, -20.139834826446496, -18.744642982643708, -19.943208638733367, -20.895027698903366, -18.217821448162876, -21.05451001653203, -19.057019185795333, -17.356741621730237, -15.711428984023398]
[26.11990470636652, 24.48289299762864, 23.33669952474332, 23.620310844544967, 24.45815969732867, 21.31765371822154, 24.285039756787935, 23.695673809169172, 18.905476223757432, 18.612654497717994]
[Thread 1] Processed 100 zonotopes (Work Done: 0.0%; Expected Zonos: Inf)
[Thread 1] Processed 200 zonotopes (Work Done: 0.0%; Expected Zonos: Inf)
[Thread 1] Processed 300 zonotopes (Work Done: 0.0%; Expected Zonos: Inf)
[Thread 1] Processed 400 zonotopes (Work Done: 0.0%; Expected Zonos: Inf)
[Thread 1] Processed 500 zonotopes (Work Done: 0.0%; Expected Zonos: Inf)
[Thread 1] Processed 600 zonotopes (Work Done: 0.0%; Expected Zonos: Inf)


TIMEOUT REACHED
UNKNOWN
[Thread 1] Total splits: 640
Processed 640 zonotopes (Work Done: 0.0%); Generated 1280 (0.1876260541671875s/loop)
[Thread 1] Finished in 120.08s
 ────────────────────────────────────────────────────────────────────────────────
                                        Time                    Allocations      
                               ───────────────────────   ────────────────────────
       Tot / % measured:             120s / 100.0%           49.0GiB / 100.0%    

 Section               ncalls     time    %tot     avg     alloc    %tot      avg
 ────────────────────────────────────────────────────────────────────────────────
 Verify                     1     120s  100.0%    120s   49.0GiB  100.0%  49.0GiB
   Zonotope Loop            1     120s  100.0%    120s   49.0GiB  100.0%  49.0GiB
     Property Check       640     103s   85.7%   161ms   34.2GiB   69.8%  54.7MiB
     Zonotope Propa...    640    16.9s   14.1%  26.5ms   14.1GiB   28.7%  22.5MiB
       DiffZonotope...  1.92k    12.6s   10.5%  6.55ms   2.39GiB    4.9%  1.28MiB
         Zonotope_D...  3.84k    4.77s    4.0%  1.24ms   1.05GiB    2.1%   287KiB
       DiffZonotope...  1.28k    4.35s    3.6%  3.40ms   11.7GiB   23.8%  9.33MiB
         Zonotope_R...  2.56k    2.21s    1.8%   864μs   7.01GiB   14.3%  2.80MiB
           Column M...  2.56k    1.06s    0.9%   415μs   3.09GiB    6.3%  1.24MiB
           Allocation   2.56k    400ms    0.3%   156μs   3.09GiB    6.3%  1.24MiB
           Influenc...  2.56k    394ms    0.3%   154μs    777MiB    1.5%   311KiB
             Multiply   2.56k    358ms    0.3%   140μs    647MiB    1.3%   259KiB
             Alloca...  2.56k   27.0ms    0.0%  10.5μs    130MiB    0.3%  51.9KiB
             Set Ma...  2.56k   6.03ms    0.0%  2.35μs     0.00B    0.0%    0.00B
           Set Matrix   2.56k    271ms    0.2%   106μs   15.0MiB    0.0%  5.98KiB
           Vectors      2.56k   77.9ms    0.1%  30.4μs   62.4MiB    0.1%  25.0KiB
           Bounds       2.56k   1.43ms    0.0%   557ns     0.00B    0.0%    0.00B
     Compute Split        640    125ms    0.1%   195μs    233MiB    0.5%   373KiB
 Initialize                 1   1.95ms    0.0%  1.95ms   5.26MiB    0.0%  5.26MiB
 ────────────────────────────────────────────────────────────────────────────────
[VERYDIFF_TIMER] 120.113229841

[VERYDIFF_EXPERIMENT] NETWORK: /home/i57/steuber/NeuroDiff/repos/VeryDiffExperiments/src/../benchmarks/mnist-prune/specs/mnist_43_local_21.vnnlib
[VERYDIFF_EXPERIMENT] TIME: 120.418555604
