
[VERYDIFF_EXPERIMENT] Running on /home/i57/steuber/NeuroDiff/repos/VeryDiffExperiments/src/../benchmarks/mnist-prune/specs/mnist_62_local_18.vnnlib /home/i57/steuber/NeuroDiff/repos/VeryDiffExperiments/src/../benchmarks/mnist-prune/nets/mnist_relu_4_1024.onnx
Found input X
op: matmul, weight: (1024, 784), bias: nothing
op: bias, weight: nothing, bias: (1024,)
op: relu, weight: nothing, bias: nothing
op: matmul, weight: (1024, 1024), bias: nothing
op: bias, weight: nothing, bias: (1024,)
op: relu, weight: nothing, bias: nothing
op: matmul, weight: (1024, 1024), bias: nothing
op: bias, weight: nothing, bias: (1024,)
op: relu, weight: nothing, bias: nothing
op: matmul, weight: (10, 1024), bias: nothing
op: bias, weight: nothing, bias: (10,)
op: relu, weight: nothing, bias: nothing
op: matmul, weight: (10, 10), bias: nothing
op: bias, weight: nothing, bias: (10,)
Found input X
op: gemm, weight: (1024, 784), bias: (1024,)
op: relu, weight: nothing, bias: nothing
op: gemm, weight: (1024, 1024), bias: (1024,)
op: relu, weight: nothing, bias: nothing
op: gemm, weight: (1024, 1024), bias: (1024,)
op: relu, weight: nothing, bias: nothing
op: gemm, weight: (10, 1024), bias: (10,)
op: relu, weight: nothing, bias: nothing
op: gemm, weight: (10, 10), bias: (10,)
Distance: 915.6394868631054
Distance: 1298.7052820973968
Distance: 1296.587532894263
Distance: 6.054483317080667
Distance: 0.04942679278974538
Running with 1 threads
[Thread 1] Time to first task: 0.0s
Instable Generators: 586
Instable Generators: 1008
Instable Generators: 1024
Instable Generators: 10
Zono Bounds:
[-167.9897029366233, -171.45613704297364, -189.29232369099145, -187.8206426231013, -180.54395747030944, -191.04631015853332, -170.85474222511868, -178.63494043437163, -182.62627712740138, -190.4631231159667]
[167.6626154832075, 171.06911132770665, 188.39689103484773, 187.2407170643435, 180.42376132821872, 190.87716491839254, 170.8266715823347, 177.85483413936538, 182.74150190132926, 190.23285795091203]


TIMEOUT REACHED
UNKNOWN
[Thread 1] Total splits: 90
Processed 90 zonotopes (Work Done: 0.0%); Generated 180 (1.3420308876111111s/loop)
[Thread 1] Finished in 120.78s
 ────────────────────────────────────────────────────────────────────────────────
                                        Time                    Allocations      
                               ───────────────────────   ────────────────────────
       Tot / % measured:             121s / 100.0%           32.4GiB / 100.0%    

 Section               ncalls     time    %tot     avg     alloc    %tot      avg
 ────────────────────────────────────────────────────────────────────────────────
 Verify                     1     121s  100.0%    121s   32.4GiB   99.9%  32.4GiB
   Zonotope Loop            1     121s  100.0%    121s   32.4GiB   99.9%  32.4GiB
     Zonotope Propa...     90     120s   99.7%   1.34s   32.1GiB   99.2%   366MiB
       DiffZonotope...    450    77.6s   64.2%   172ms   7.09GiB   21.9%  16.1MiB
         Zonotope_D...    900    24.0s   19.8%  26.6ms   2.87GiB    8.9%  3.26MiB
       DiffZonotope...    360    42.8s   35.4%   119ms   25.0GiB   77.3%  71.2MiB
         Zonotope_R...    720    29.3s   24.3%  40.7ms   15.6GiB   48.3%  22.3MiB
           Column M...    720    14.7s   12.2%  20.4ms   6.25GiB   19.3%  8.89MiB
           Allocation     720    11.4s    9.4%  15.8ms   6.25GiB   19.3%  8.89MiB
           Influenc...    720    1.84s    1.5%  2.56ms   3.11GiB    9.6%  4.43MiB
             Multiply     720    1.80s    1.5%  2.50ms   2.94GiB    9.1%  4.18MiB
             Alloca...    720   26.7ms    0.0%  37.2μs    174MiB    0.5%   248KiB
             Set Ma...    720   11.4ms    0.0%  15.9μs     0.00B    0.0%    0.00B
           Set Matrix     720    1.33s    1.1%  1.85ms   11.1MiB    0.0%  15.8KiB
           Vectors        720   17.6ms    0.0%  24.4μs   23.9MiB    0.1%  34.0KiB
           Bounds         720    497μs    0.0%   690ns     0.00B    0.0%    0.00B
     Property Check        90    329ms    0.3%  3.65ms   48.0MiB    0.1%   546KiB
     Compute Split         90   43.0ms    0.0%   477μs    108MiB    0.3%  1.20MiB
 Initialize                 1   13.9ms    0.0%  13.9ms   22.4MiB    0.1%  22.4MiB
 ────────────────────────────────────────────────────────────────────────────────
[VERYDIFF_TIMER] 120.874223615

[VERYDIFF_EXPERIMENT] NETWORK: /home/i57/steuber/NeuroDiff/repos/VeryDiffExperiments/src/../benchmarks/mnist-prune/specs/mnist_62_local_18.vnnlib
[VERYDIFF_EXPERIMENT] TIME: 121.122747458
