
[VERYDIFF_EXPERIMENT] Running on /home/i57/steuber/NeuroDiff/repos/VeryDiffExperiments/src/../benchmarks/mnist-prune/specs/mnist_28_local_18.vnnlib /home/i57/steuber/NeuroDiff/repos/VeryDiffExperiments/src/../benchmarks/mnist-prune/nets/mnist_relu_3_100.onnx
Found input X
op: matmul, weight: (100, 784), bias: nothing
op: bias, weight: nothing, bias: (100,)
op: relu, weight: nothing, bias: nothing
op: matmul, weight: (100, 100), bias: nothing
op: bias, weight: nothing, bias: (100,)
op: relu, weight: nothing, bias: nothing
op: matmul, weight: (10, 100), bias: nothing
op: bias, weight: nothing, bias: (10,)
op: relu, weight: nothing, bias: nothing
op: matmul, weight: (10, 10), bias: nothing
op: bias, weight: nothing, bias: (10,)
Found input X
op: gemm, weight: (100, 784), bias: (100,)
op: relu, weight: nothing, bias: nothing
op: gemm, weight: (100, 100), bias: (100,)
op: relu, weight: nothing, bias: nothing
op: gemm, weight: (10, 100), bias: (10,)
op: relu, weight: nothing, bias: nothing
op: gemm, weight: (10, 10), bias: (10,)
Distance: 1623.4465197373434
Distance: 201.62056963066925
Distance: 13.962962507051998
Distance: 0.183768135302671
Running with 1 threads
[Thread 1] Time to first task: 0.0s
Instable Generators: 28
Instable Generators: 30
Instable Generators: 5
Zono Bounds:
[-2.637072722398747, -0.008689688382511747, -3.030099403971955, -3.8715288450781764, -0.0023915599515707308, -3.3249121515610978, -3.350586127733385, -3.31650499133726, -0.07806926510871197, -2.971663937091058]
[3.486660164362082, 0.0006295314473835825, 2.8909054162409755, 3.1728424920260756, 0.0053812140850368366, 3.267141965031287, 3.334954860870971, 3.2191881233760617, 0.07854979417497816, 2.915439118330435]
[Thread 1] Processed 100 zonotopes (Work Done: 0.0%; Expected Zonos: Inf)
[Thread 1] Processed 200 zonotopes (Work Done: 0.0%; Expected Zonos: Inf)
[Thread 1] Processed 300 zonotopes (Work Done: 0.0%; Expected Zonos: Inf)
[Thread 1] Processed 400 zonotopes (Work Done: 0.0%; Expected Zonos: Inf)
[Thread 1] Processed 500 zonotopes (Work Done: 0.0%; Expected Zonos: Inf)
[Thread 1] Processed 600 zonotopes (Work Done: 0.0%; Expected Zonos: Inf)
[Thread 1] Processed 700 zonotopes (Work Done: 0.0%; Expected Zonos: Inf)
[Thread 1] Processed 800 zonotopes (Work Done: 0.0%; Expected Zonos: Inf)
[Thread 1] Processed 900 zonotopes (Work Done: 0.0%; Expected Zonos: Inf)
[Thread 1] Processed 1000 zonotopes (Work Done: 0.0%; Expected Zonos: Inf)
[Thread 1] Processed 1100 zonotopes (Work Done: 0.0%; Expected Zonos: Inf)
[Thread 1] Processed 1200 zonotopes (Work Done: 0.0%; Expected Zonos: Inf)
[Thread 1] Processed 1300 zonotopes (Work Done: 0.0%; Expected Zonos: Inf)
[Thread 1] Processed 1400 zonotopes (Work Done: 0.0%; Expected Zonos: Inf)
[Thread 1] Processed 1500 zonotopes (Work Done: 0.0%; Expected Zonos: Inf)
[Thread 1] Processed 1600 zonotopes (Work Done: 0.0%; Expected Zonos: Inf)
[Thread 1] Processed 1700 zonotopes (Work Done: 0.0%; Expected Zonos: Inf)
[Thread 1] Processed 1800 zonotopes (Work Done: 0.0%; Expected Zonos: Inf)
[Thread 1] Processed 1900 zonotopes (Work Done: 0.0%; Expected Zonos: Inf)
[Thread 1] Processed 2000 zonotopes (Work Done: 0.0%; Expected Zonos: Inf)
[Thread 1] Processed 2100 zonotopes (Work Done: 0.0%; Expected Zonos: Inf)
[Thread 1] Processed 2200 zonotopes (Work Done: 0.0%; Expected Zonos: Inf)
[Thread 1] Processed 2300 zonotopes (Work Done: 0.0%; Expected Zonos: Inf)
[Thread 1] Processed 2400 zonotopes (Work Done: 0.0%; Expected Zonos: Inf)
[Thread 1] Processed 2500 zonotopes (Work Done: 0.0%; Expected Zonos: Inf)
[Thread 1] Processed 2600 zonotopes (Work Done: 0.0%; Expected Zonos: Inf)
[Thread 1] Processed 2700 zonotopes (Work Done: 0.0%; Expected Zonos: Inf)
[Thread 1] Processed 2800 zonotopes (Work Done: 0.0%; Expected Zonos: Inf)
[Thread 1] Processed 2900 zonotopes (Work Done: 0.0%; Expected Zonos: Inf)
[Thread 1] Processed 3000 zonotopes (Work Done: 0.0%; Expected Zonos: Inf)
[Thread 1] Processed 3100 zonotopes (Work Done: 0.0%; Expected Zonos: Inf)
[Thread 1] Processed 3200 zonotopes (Work Done: 0.0%; Expected Zonos: Inf)
[Thread 1] Processed 3300 zonotopes (Work Done: 0.0%; Expected Zonos: Inf)
[Thread 1] Processed 3400 zonotopes (Work Done: 0.0%; Expected Zonos: Inf)
[Thread 1] Processed 3500 zonotopes (Work Done: 0.0%; Expected Zonos: Inf)
[Thread 1] Processed 3600 zonotopes (Work Done: 0.0%; Expected Zonos: Inf)
[Thread 1] Processed 3700 zonotopes (Work Done: 0.0%; Expected Zonos: Inf)
[Thread 1] Processed 3800 zonotopes (Work Done: 0.0%; Expected Zonos: Inf)
[Thread 1] Processed 3900 zonotopes (Work Done: 0.0%; Expected Zonos: Inf)
[Thread 1] Processed 4000 zonotopes (Work Done: 0.0%; Expected Zonos: Inf)
[Thread 1] Processed 4100 zonotopes (Work Done: 0.0%; Expected Zonos: Inf)
[Thread 1] Processed 4200 zonotopes (Work Done: 0.0%; Expected Zonos: Inf)
[Thread 1] Processed 4300 zonotopes (Work Done: 0.0%; Expected Zonos: Inf)
[Thread 1] Processed 4400 zonotopes (Work Done: 0.0%; Expected Zonos: Inf)
[Thread 1] Processed 4500 zonotopes (Work Done: 0.0%; Expected Zonos: Inf)
[Thread 1] Processed 4600 zonotopes (Work Done: 0.0%; Expected Zonos: Inf)
[Thread 1] Processed 4700 zonotopes (Work Done: 0.0%; Expected Zonos: Inf)
[Thread 1] Processed 4800 zonotopes (Work Done: 0.0%; Expected Zonos: Inf)
[Thread 1] Processed 4900 zonotopes (Work Done: 0.0%; Expected Zonos: Inf)
[Thread 1] Processed 5000 zonotopes (Work Done: 0.0%; Expected Zonos: Inf)
[Thread 1] Processed 5100 zonotopes (Work Done: 0.0%; Expected Zonos: Inf)
[Thread 1] Processed 5200 zonotopes (Work Done: 0.0%; Expected Zonos: Inf)
[Thread 1] Processed 5300 zonotopes (Work Done: 0.0%; Expected Zonos: Inf)
[Thread 1] Processed 5400 zonotopes (Work Done: 0.0%; Expected Zonos: Inf)
[Thread 1] Processed 5500 zonotopes (Work Done: 0.0%; Expected Zonos: Inf)
[Thread 1] Processed 5600 zonotopes (Work Done: 0.0%; Expected Zonos: Inf)
[Thread 1] Processed 5700 zonotopes (Work Done: 0.0%; Expected Zonos: Inf)
[Thread 1] Processed 5800 zonotopes (Work Done: 0.0%; Expected Zonos: Inf)
[Thread 1] Processed 5900 zonotopes (Work Done: 0.0%; Expected Zonos: Inf)
[Thread 1] Processed 6000 zonotopes (Work Done: 0.0%; Expected Zonos: Inf)
[Thread 1] Processed 6100 zonotopes (Work Done: 0.0%; Expected Zonos: Inf)
[Thread 1] Processed 6200 zonotopes (Work Done: 0.0%; Expected Zonos: Inf)
[Thread 1] Processed 6300 zonotopes (Work Done: 0.0%; Expected Zonos: Inf)
[Thread 1] Processed 6400 zonotopes (Work Done: 0.0%; Expected Zonos: Inf)
[Thread 1] Processed 6500 zonotopes (Work Done: 0.0%; Expected Zonos: Inf)
[Thread 1] Processed 6600 zonotopes (Work Done: 0.0%; Expected Zonos: Inf)
[Thread 1] Processed 6700 zonotopes (Work Done: 0.0%; Expected Zonos: Inf)
[Thread 1] Processed 6800 zonotopes (Work Done: 0.0%; Expected Zonos: Inf)
[Thread 1] Processed 6900 zonotopes (Work Done: 0.0%; Expected Zonos: Inf)
[Thread 1] Processed 7000 zonotopes (Work Done: 0.0%; Expected Zonos: Inf)
[Thread 1] Processed 7100 zonotopes (Work Done: 0.0%; Expected Zonos: Inf)
[Thread 1] Processed 7200 zonotopes (Work Done: 0.0%; Expected Zonos: Inf)
[Thread 1] Processed 7300 zonotopes (Work Done: 0.0%; Expected Zonos: Inf)
[Thread 1] Processed 7400 zonotopes (Work Done: 0.0%; Expected Zonos: Inf)
[Thread 1] Processed 7500 zonotopes (Work Done: 0.0%; Expected Zonos: Inf)
[Thread 1] Processed 7600 zonotopes (Work Done: 0.0%; Expected Zonos: Inf)
[Thread 1] Processed 7700 zonotopes (Work Done: 0.0%; Expected Zonos: Inf)
[Thread 1] Processed 7800 zonotopes (Work Done: 0.0%; Expected Zonos: Inf)
[Thread 1] Processed 7900 zonotopes (Work Done: 0.0%; Expected Zonos: Inf)
[Thread 1] Processed 8000 zonotopes (Work Done: 0.0%; Expected Zonos: Inf)
[Thread 1] Processed 8100 zonotopes (Work Done: 0.0%; Expected Zonos: Inf)
[Thread 1] Processed 8200 zonotopes (Work Done: 0.0%; Expected Zonos: Inf)
[Thread 1] Processed 8300 zonotopes (Work Done: 0.0%; Expected Zonos: Inf)
[Thread 1] Processed 8400 zonotopes (Work Done: 0.0%; Expected Zonos: Inf)
[Thread 1] Processed 8500 zonotopes (Work Done: 0.0%; Expected Zonos: Inf)
[Thread 1] Processed 8600 zonotopes (Work Done: 0.0%; Expected Zonos: Inf)
[Thread 1] Processed 8700 zonotopes (Work Done: 0.0%; Expected Zonos: Inf)
[Thread 1] Processed 8800 zonotopes (Work Done: 0.0%; Expected Zonos: Inf)
[Thread 1] Processed 8900 zonotopes (Work Done: 0.0%; Expected Zonos: Inf)
[Thread 1] Processed 9000 zonotopes (Work Done: 0.0%; Expected Zonos: Inf)
[Thread 1] Processed 9100 zonotopes (Work Done: 0.0%; Expected Zonos: Inf)
[Thread 1] Processed 9200 zonotopes (Work Done: 0.0%; Expected Zonos: Inf)
[Thread 1] Processed 9300 zonotopes (Work Done: 0.0%; Expected Zonos: Inf)
[Thread 1] Processed 9400 zonotopes (Work Done: 0.0%; Expected Zonos: Inf)
[Thread 1] Processed 9500 zonotopes (Work Done: 0.0%; Expected Zonos: Inf)
[Thread 1] Processed 9600 zonotopes (Work Done: 0.0%; Expected Zonos: Inf)
[Thread 1] Processed 9700 zonotopes (Work Done: 0.0%; Expected Zonos: Inf)
[Thread 1] Processed 9800 zonotopes (Work Done: 0.0%; Expected Zonos: Inf)
[Thread 1] Processed 9900 zonotopes (Work Done: 0.0%; Expected Zonos: Inf)
[Thread 1] Processed 10000 zonotopes (Work Done: 0.0%; Expected Zonos: Inf)
[Thread 1] Processed 10100 zonotopes (Work Done: 0.0%; Expected Zonos: Inf)
[Thread 1] Processed 10200 zonotopes (Work Done: 0.0%; Expected Zonos: Inf)
[Thread 1] Processed 10300 zonotopes (Work Done: 0.0%; Expected Zonos: Inf)
[Thread 1] Processed 10400 zonotopes (Work Done: 0.0%; Expected Zonos: Inf)
[Thread 1] Processed 10500 zonotopes (Work Done: 0.0%; Expected Zonos: Inf)
[Thread 1] Processed 10600 zonotopes (Work Done: 0.0%; Expected Zonos: Inf)
[Thread 1] Processed 10700 zonotopes (Work Done: 0.0%; Expected Zonos: Inf)
[Thread 1] Processed 10800 zonotopes (Work Done: 0.0%; Expected Zonos: Inf)
[Thread 1] Processed 10900 zonotopes (Work Done: 0.0%; Expected Zonos: Inf)
[Thread 1] Processed 11000 zonotopes (Work Done: 0.0%; Expected Zonos: Inf)
[Thread 1] Processed 11100 zonotopes (Work Done: 0.0%; Expected Zonos: Inf)
[Thread 1] Processed 11200 zonotopes (Work Done: 0.0%; Expected Zonos: Inf)
[Thread 1] Processed 11300 zonotopes (Work Done: 0.0%; Expected Zonos: Inf)
[Thread 1] Processed 11400 zonotopes (Work Done: 0.0%; Expected Zonos: Inf)
[Thread 1] Processed 11500 zonotopes (Work Done: 0.0%; Expected Zonos: Inf)
[Thread 1] Processed 11600 zonotopes (Work Done: 0.0%; Expected Zonos: Inf)
[Thread 1] Processed 11700 zonotopes (Work Done: 0.0%; Expected Zonos: Inf)
[Thread 1] Processed 11800 zonotopes (Work Done: 0.0%; Expected Zonos: Inf)
[Thread 1] Processed 11900 zonotopes (Work Done: 0.0%; Expected Zonos: Inf)
[Thread 1] Processed 12000 zonotopes (Work Done: 0.0%; Expected Zonos: Inf)
[Thread 1] Processed 12100 zonotopes (Work Done: 0.0%; Expected Zonos: Inf)
[Thread 1] Processed 12200 zonotopes (Work Done: 0.0%; Expected Zonos: Inf)
[Thread 1] Processed 12300 zonotopes (Work Done: 0.0%; Expected Zonos: Inf)
[Thread 1] Processed 12400 zonotopes (Work Done: 0.0%; Expected Zonos: Inf)
[Thread 1] Processed 12500 zonotopes (Work Done: 0.0%; Expected Zonos: Inf)
[Thread 1] Processed 12600 zonotopes (Work Done: 0.0%; Expected Zonos: Inf)
[Thread 1] Processed 12700 zonotopes (Work Done: 0.0%; Expected Zonos: Inf)
[Thread 1] Processed 12800 zonotopes (Work Done: 0.0%; Expected Zonos: Inf)
[Thread 1] Processed 12900 zonotopes (Work Done: 0.0%; Expected Zonos: Inf)
[Thread 1] Processed 13000 zonotopes (Work Done: 0.0%; Expected Zonos: Inf)
[Thread 1] Processed 13100 zonotopes (Work Done: 0.0%; Expected Zonos: Inf)
[Thread 1] Processed 13200 zonotopes (Work Done: 0.0%; Expected Zonos: Inf)
[Thread 1] Processed 13300 zonotopes (Work Done: 0.0%; Expected Zonos: Inf)
[Thread 1] Processed 13400 zonotopes (Work Done: 0.0%; Expected Zonos: Inf)
[Thread 1] Processed 13500 zonotopes (Work Done: 0.0%; Expected Zonos: Inf)
[Thread 1] Processed 13600 zonotopes (Work Done: 0.0%; Expected Zonos: Inf)
[Thread 1] Processed 13700 zonotopes (Work Done: 0.0%; Expected Zonos: Inf)
[Thread 1] Processed 13800 zonotopes (Work Done: 0.0%; Expected Zonos: Inf)
[Thread 1] Processed 13900 zonotopes (Work Done: 0.0%; Expected Zonos: Inf)
[Thread 1] Processed 14000 zonotopes (Work Done: 0.0%; Expected Zonos: Inf)
[Thread 1] Processed 14100 zonotopes (Work Done: 0.0%; Expected Zonos: Inf)
[Thread 1] Processed 14200 zonotopes (Work Done: 0.0%; Expected Zonos: Inf)
[Thread 1] Processed 14300 zonotopes (Work Done: 0.0%; Expected Zonos: Inf)
[Thread 1] Processed 14400 zonotopes (Work Done: 0.0%; Expected Zonos: Inf)
[Thread 1] Processed 14500 zonotopes (Work Done: 0.0%; Expected Zonos: Inf)
[Thread 1] Processed 14600 zonotopes (Work Done: 0.0%; Expected Zonos: Inf)
[Thread 1] Processed 14700 zonotopes (Work Done: 0.0%; Expected Zonos: Inf)
[Thread 1] Processed 14800 zonotopes (Work Done: 0.0%; Expected Zonos: Inf)
[Thread 1] Processed 14900 zonotopes (Work Done: 0.0%; Expected Zonos: Inf)
[Thread 1] Processed 15000 zonotopes (Work Done: 0.0%; Expected Zonos: Inf)
[Thread 1] Processed 15100 zonotopes (Work Done: 0.0%; Expected Zonos: Inf)
[Thread 1] Processed 15200 zonotopes (Work Done: 0.0%; Expected Zonos: Inf)
[Thread 1] Processed 15300 zonotopes (Work Done: 0.0%; Expected Zonos: Inf)
[Thread 1] Processed 15400 zonotopes (Work Done: 0.0%; Expected Zonos: Inf)
[Thread 1] Processed 15500 zonotopes (Work Done: 0.0%; Expected Zonos: Inf)
[Thread 1] Processed 15600 zonotopes (Work Done: 0.0%; Expected Zonos: Inf)
[Thread 1] Processed 15700 zonotopes (Work Done: 0.0%; Expected Zonos: Inf)
[Thread 1] Processed 15800 zonotopes (Work Done: 0.0%; Expected Zonos: Inf)
[Thread 1] Processed 15900 zonotopes (Work Done: 0.0%; Expected Zonos: Inf)
[Thread 1] Processed 16000 zonotopes (Work Done: 0.0%; Expected Zonos: Inf)
[Thread 1] Processed 16100 zonotopes (Work Done: 0.0%; Expected Zonos: Inf)
[Thread 1] Processed 16200 zonotopes (Work Done: 0.0%; Expected Zonos: Inf)
[Thread 1] Processed 16300 zonotopes (Work Done: 0.0%; Expected Zonos: Inf)
[Thread 1] Processed 16400 zonotopes (Work Done: 0.0%; Expected Zonos: Inf)
[Thread 1] Processed 16500 zonotopes (Work Done: 0.0%; Expected Zonos: Inf)
[Thread 1] Processed 16600 zonotopes (Work Done: 0.0%; Expected Zonos: Inf)
[Thread 1] Processed 16700 zonotopes (Work Done: 0.0%; Expected Zonos: Inf)
[Thread 1] Processed 16800 zonotopes (Work Done: 0.0%; Expected Zonos: Inf)
[Thread 1] Processed 16900 zonotopes (Work Done: 0.0%; Expected Zonos: Inf)
[Thread 1] Processed 17000 zonotopes (Work Done: 0.0061%; Expected Zonos: 2.78528e8)
[Thread 1] Processed 17100 zonotopes (Work Done: 0.0061%; Expected Zonos: 2.801664e8)
[Thread 1] Processed 17200 zonotopes (Work Done: 0.0061%; Expected Zonos: 2.818048e8)
[Thread 1] Processed 17300 zonotopes (Work Done: 0.0061%; Expected Zonos: 2.834432e8)
[Thread 1] Processed 17400 zonotopes (Work Done: 0.0061%; Expected Zonos: 2.850816e8)
[Thread 1] Processed 17500 zonotopes (Work Done: 0.0061%; Expected Zonos: 2.8672e8)
[Thread 1] Processed 17600 zonotopes (Work Done: 0.0061%; Expected Zonos: 2.883584e8)
[Thread 1] Processed 17700 zonotopes (Work Done: 0.0061%; Expected Zonos: 2.899968e8)
[Thread 1] Processed 17800 zonotopes (Work Done: 0.0061%; Expected Zonos: 2.916352e8)
[Thread 1] Processed 17900 zonotopes (Work Done: 0.0061%; Expected Zonos: 2.932736e8)
[Thread 1] Processed 18000 zonotopes (Work Done: 0.0061%; Expected Zonos: 2.94912e8)
[Thread 1] Processed 18100 zonotopes (Work Done: 0.0061%; Expected Zonos: 2.965504e8)
[Thread 1] Processed 18200 zonotopes (Work Done: 0.0061%; Expected Zonos: 2.981888e8)
[Thread 1] Processed 18300 zonotopes (Work Done: 0.0061%; Expected Zonos: 2.998272e8)
[Thread 1] Processed 18400 zonotopes (Work Done: 0.0061%; Expected Zonos: 3.014656e8)
[Thread 1] Processed 18500 zonotopes (Work Done: 0.0061%; Expected Zonos: 3.03104e8)
[Thread 1] Processed 18600 zonotopes (Work Done: 0.0061%; Expected Zonos: 3.047424e8)
[Thread 1] Processed 18700 zonotopes (Work Done: 0.0061%; Expected Zonos: 3.063808e8)
[Thread 1] Processed 18800 zonotopes (Work Done: 0.0061%; Expected Zonos: 3.080192e8)
[Thread 1] Processed 18900 zonotopes (Work Done: 0.0061%; Expected Zonos: 3.096576e8)
[Thread 1] Processed 19000 zonotopes (Work Done: 0.0061%; Expected Zonos: 3.11296e8)
[Thread 1] Processed 19100 zonotopes (Work Done: 0.0061%; Expected Zonos: 3.129344e8)
[Thread 1] Processed 19200 zonotopes (Work Done: 0.0061%; Expected Zonos: 3.145728e8)
[Thread 1] Processed 19300 zonotopes (Work Done: 0.0061%; Expected Zonos: 3.162112e8)
[Thread 1] Processed 19400 zonotopes (Work Done: 0.0061%; Expected Zonos: 3.178496e8)
[Thread 1] Processed 19500 zonotopes (Work Done: 0.0061%; Expected Zonos: 3.19488e8)
[Thread 1] Processed 19600 zonotopes (Work Done: 0.0061%; Expected Zonos: 3.211264e8)
[Thread 1] Processed 19700 zonotopes (Work Done: 0.0061%; Expected Zonos: 3.227648e8)
[Thread 1] Processed 19800 zonotopes (Work Done: 0.0061%; Expected Zonos: 3.244032e8)
[Thread 1] Processed 19900 zonotopes (Work Done: 0.0061%; Expected Zonos: 3.260416e8)
[Thread 1] Processed 20000 zonotopes (Work Done: 0.0061%; Expected Zonos: 3.2768e8)
[Thread 1] Processed 20100 zonotopes (Work Done: 0.0061%; Expected Zonos: 3.293184e8)
[Thread 1] Processed 20200 zonotopes (Work Done: 0.0061%; Expected Zonos: 3.309568e8)
[Thread 1] Processed 20300 zonotopes (Work Done: 0.0061%; Expected Zonos: 3.325952e8)
[Thread 1] Processed 20400 zonotopes (Work Done: 0.0061%; Expected Zonos: 3.342336e8)
[Thread 1] Processed 20500 zonotopes (Work Done: 0.0061%; Expected Zonos: 3.35872e8)
[Thread 1] Processed 20600 zonotopes (Work Done: 0.0061%; Expected Zonos: 3.375104e8)
[Thread 1] Processed 20700 zonotopes (Work Done: 0.0061%; Expected Zonos: 3.391488e8)
[Thread 1] Processed 20800 zonotopes (Work Done: 0.0061%; Expected Zonos: 3.407872e8)
[Thread 1] Processed 20900 zonotopes (Work Done: 0.0061%; Expected Zonos: 3.424256e8)
[Thread 1] Processed 21000 zonotopes (Work Done: 0.0061%; Expected Zonos: 3.44064e8)
[Thread 1] Processed 21100 zonotopes (Work Done: 0.0061%; Expected Zonos: 3.457024e8)
[Thread 1] Processed 21200 zonotopes (Work Done: 0.0061%; Expected Zonos: 3.473408e8)
[Thread 1] Processed 21300 zonotopes (Work Done: 0.0061%; Expected Zonos: 3.489792e8)
[Thread 1] Processed 21400 zonotopes (Work Done: 0.0061%; Expected Zonos: 3.506176e8)
[Thread 1] Processed 21500 zonotopes (Work Done: 0.0061%; Expected Zonos: 3.52256e8)
[Thread 1] Processed 21600 zonotopes (Work Done: 0.0061%; Expected Zonos: 3.538944e8)
[Thread 1] Processed 21700 zonotopes (Work Done: 0.0061%; Expected Zonos: 3.555328e8)
[Thread 1] Processed 21800 zonotopes (Work Done: 0.0061%; Expected Zonos: 3.571712e8)
[Thread 1] Processed 21900 zonotopes (Work Done: 0.0061%; Expected Zonos: 3.588096e8)
[Thread 1] Processed 22000 zonotopes (Work Done: 0.0061%; Expected Zonos: 3.60448e8)
[Thread 1] Processed 22100 zonotopes (Work Done: 0.0061%; Expected Zonos: 3.620864e8)
[Thread 1] Processed 22200 zonotopes (Work Done: 0.0061%; Expected Zonos: 3.637248e8)
[Thread 1] Processed 22300 zonotopes (Work Done: 0.0061%; Expected Zonos: 3.653632e8)
[Thread 1] Processed 22400 zonotopes (Work Done: 0.0061%; Expected Zonos: 3.670016e8)
[Thread 1] Processed 22500 zonotopes (Work Done: 0.0061%; Expected Zonos: 3.6864e8)
[Thread 1] Processed 22600 zonotopes (Work Done: 0.0061%; Expected Zonos: 3.702784e8)
[Thread 1] Processed 22700 zonotopes (Work Done: 0.0061%; Expected Zonos: 3.719168e8)
[Thread 1] Processed 22800 zonotopes (Work Done: 0.0061%; Expected Zonos: 3.735552e8)
[Thread 1] Processed 22900 zonotopes (Work Done: 0.0061%; Expected Zonos: 3.751936e8)
[Thread 1] Processed 23000 zonotopes (Work Done: 0.0061%; Expected Zonos: 3.76832e8)
[Thread 1] Processed 23100 zonotopes (Work Done: 0.0061%; Expected Zonos: 3.784704e8)
[Thread 1] Processed 23200 zonotopes (Work Done: 0.0061%; Expected Zonos: 3.801088e8)
[Thread 1] Processed 23300 zonotopes (Work Done: 0.0061%; Expected Zonos: 3.817472e8)
[Thread 1] Processed 23400 zonotopes (Work Done: 0.0061%; Expected Zonos: 3.833856e8)
[Thread 1] Processed 23500 zonotopes (Work Done: 0.0061%; Expected Zonos: 3.85024e8)
[Thread 1] Processed 23600 zonotopes (Work Done: 0.0061%; Expected Zonos: 3.866624e8)
[Thread 1] Processed 23700 zonotopes (Work Done: 0.0061%; Expected Zonos: 3.883008e8)
[Thread 1] Processed 23800 zonotopes (Work Done: 0.0061%; Expected Zonos: 3.899392e8)
[Thread 1] Processed 23900 zonotopes (Work Done: 0.0061%; Expected Zonos: 3.915776e8)
[Thread 1] Processed 24000 zonotopes (Work Done: 0.0061%; Expected Zonos: 3.93216e8)
[Thread 1] Processed 24100 zonotopes (Work Done: 0.0061%; Expected Zonos: 3.948544e8)
[Thread 1] Processed 24200 zonotopes (Work Done: 0.0061%; Expected Zonos: 3.964928e8)
[Thread 1] Processed 24300 zonotopes (Work Done: 0.0061%; Expected Zonos: 3.981312e8)
[Thread 1] Processed 24400 zonotopes (Work Done: 0.0061%; Expected Zonos: 3.997696e8)
[Thread 1] Processed 24500 zonotopes (Work Done: 0.0061%; Expected Zonos: 4.01408e8)
[Thread 1] Processed 24600 zonotopes (Work Done: 0.0061%; Expected Zonos: 4.030464e8)
[Thread 1] Processed 24700 zonotopes (Work Done: 0.0061%; Expected Zonos: 4.046848e8)
[Thread 1] Processed 24800 zonotopes (Work Done: 0.0061%; Expected Zonos: 4.063232e8)
[Thread 1] Processed 24900 zonotopes (Work Done: 0.0061%; Expected Zonos: 4.079616e8)
[Thread 1] Processed 25000 zonotopes (Work Done: 0.0061%; Expected Zonos: 4.096e8)
[Thread 1] Processed 25100 zonotopes (Work Done: 0.0061%; Expected Zonos: 4.112384e8)
[Thread 1] Processed 25200 zonotopes (Work Done: 0.0061%; Expected Zonos: 4.128768e8)
[Thread 1] Processed 25300 zonotopes (Work Done: 0.0061%; Expected Zonos: 4.145152e8)
[Thread 1] Processed 25400 zonotopes (Work Done: 0.0061%; Expected Zonos: 4.161536e8)
[Thread 1] Processed 25500 zonotopes (Work Done: 0.0061%; Expected Zonos: 4.17792e8)
[Thread 1] Processed 25600 zonotopes (Work Done: 0.00916%; Expected Zonos: 2.796202666666667e8)
[Thread 1] Processed 25700 zonotopes (Work Done: 0.00916%; Expected Zonos: 2.807125333333333e8)
[Thread 1] Processed 25800 zonotopes (Work Done: 0.00916%; Expected Zonos: 2.818048e8)
[Thread 1] Processed 25900 zonotopes (Work Done: 0.01221%; Expected Zonos: 2.121728e8)
[Thread 1] Processed 26000 zonotopes (Work Done: 0.01221%; Expected Zonos: 2.12992e8)
[Thread 1] Processed 26100 zonotopes (Work Done: 0.01221%; Expected Zonos: 2.138112e8)
[Thread 1] Processed 26200 zonotopes (Work Done: 0.01221%; Expected Zonos: 2.146304e8)
[Thread 1] Processed 26300 zonotopes (Work Done: 0.01221%; Expected Zonos: 2.154496e8)
[Thread 1] Processed 26400 zonotopes (Work Done: 0.01526%; Expected Zonos: 1.7301504e8)
[Thread 1] Processed 26500 zonotopes (Work Done: 0.01526%; Expected Zonos: 1.736704e8)
[Thread 1] Processed 26600 zonotopes (Work Done: 0.01526%; Expected Zonos: 1.7432576e8)
[Thread 1] Processed 26700 zonotopes (Work Done: 0.01526%; Expected Zonos: 1.7498112e8)
[Thread 1] Processed 26800 zonotopes (Work Done: 0.01526%; Expected Zonos: 1.7563648e8)
[Thread 1] Processed 26900 zonotopes (Work Done: 0.01526%; Expected Zonos: 1.7629184e8)
[Thread 1] Processed 27000 zonotopes (Work Done: 0.01526%; Expected Zonos: 1.769472e8)
[Thread 1] Processed 27100 zonotopes (Work Done: 0.01526%; Expected Zonos: 1.7760256e8)
[Thread 1] Processed 27200 zonotopes (Work Done: 0.01526%; Expected Zonos: 1.7825792e8)
[Thread 1] Processed 27300 zonotopes (Work Done: 0.01831%; Expected Zonos: 1.490944e8)
[Thread 1] Processed 27400 zonotopes (Work Done: 0.01831%; Expected Zonos: 1.4964053333333334e8)
[Thread 1] Processed 27500 zonotopes (Work Done: 0.01831%; Expected Zonos: 1.5018666666666666e8)
[Thread 1] Processed 27600 zonotopes (Work Done: 0.01831%; Expected Zonos: 1.507328e8)
[Thread 1] Processed 27700 zonotopes (Work Done: 0.01831%; Expected Zonos: 1.5127893333333334e8)
[Thread 1] Processed 27800 zonotopes (Work Done: 0.01831%; Expected Zonos: 1.5182506666666666e8)
[Thread 1] Processed 27900 zonotopes (Work Done: 0.01831%; Expected Zonos: 1.523712e8)
[Thread 1] Processed 28000 zonotopes (Work Done: 0.01831%; Expected Zonos: 1.5291733333333334e8)
[Thread 1] Processed 28100 zonotopes (Work Done: 0.01831%; Expected Zonos: 1.5346346666666666e8)
[Thread 1] Processed 28200 zonotopes (Work Done: 0.01831%; Expected Zonos: 1.540096e8)
[Thread 1] Processed 28300 zonotopes (Work Done: 0.01831%; Expected Zonos: 1.5455573333333334e8)
[Thread 1] Processed 28400 zonotopes (Work Done: 0.01831%; Expected Zonos: 1.5510186666666666e8)
[Thread 1] Processed 28500 zonotopes (Work Done: 0.01831%; Expected Zonos: 1.55648e8)
[Thread 1] Processed 28600 zonotopes (Work Done: 0.01831%; Expected Zonos: 1.5619413333333334e8)
[Thread 1] Processed 28700 zonotopes (Work Done: 0.01831%; Expected Zonos: 1.5674026666666666e8)
[Thread 1] Processed 28800 zonotopes (Work Done: 0.01831%; Expected Zonos: 1.572864e8)
[Thread 1] Processed 28900 zonotopes (Work Done: 0.01831%; Expected Zonos: 1.5783253333333334e8)
[Thread 1] Processed 29000 zonotopes (Work Done: 0.01831%; Expected Zonos: 1.5837866666666666e8)
[Thread 1] Processed 29100 zonotopes (Work Done: 0.02136%; Expected Zonos: 1.3622125714285713e8)
[Thread 1] Processed 29200 zonotopes (Work Done: 0.02136%; Expected Zonos: 1.3668937142857143e8)
[Thread 1] Processed 29300 zonotopes (Work Done: 0.02136%; Expected Zonos: 1.371574857142857e8)
[Thread 1] Processed 29400 zonotopes (Work Done: 0.02136%; Expected Zonos: 1.376256e8)
[Thread 1] Processed 29500 zonotopes (Work Done: 0.02136%; Expected Zonos: 1.380937142857143e8)
[Thread 1] Processed 29600 zonotopes (Work Done: 0.02136%; Expected Zonos: 1.3856182857142857e8)
[Thread 1] Processed 29700 zonotopes (Work Done: 0.02136%; Expected Zonos: 1.3902994285714287e8)
[Thread 1] Processed 29800 zonotopes (Work Done: 0.02136%; Expected Zonos: 1.3949805714285713e8)
[Thread 1] Processed 29900 zonotopes (Work Done: 0.02136%; Expected Zonos: 1.3996617142857143e8)
[Thread 1] Processed 30000 zonotopes (Work Done: 0.02136%; Expected Zonos: 1.404342857142857e8)
[Thread 1] Processed 30100 zonotopes (Work Done: 0.02518%; Expected Zonos: 1.1955355151515152e8)
[Thread 1] Processed 30200 zonotopes (Work Done: 0.0267%; Expected Zonos: 1.1309641142857143e8)
[Thread 1] Processed 30300 zonotopes (Work Done: 0.0267%; Expected Zonos: 1.1347090285714285e8)
[Thread 1] Processed 30400 zonotopes (Work Done: 0.0267%; Expected Zonos: 1.1384539428571428e8)
[Thread 1] Processed 30500 zonotopes (Work Done: 0.0267%; Expected Zonos: 1.1421988571428572e8)
[Thread 1] Processed 30600 zonotopes (Work Done: 0.0267%; Expected Zonos: 1.1459437714285715e8)
[Thread 1] Processed 30700 zonotopes (Work Done: 0.03281%; Expected Zonos: 9.357931162790698e7)
[Thread 1] Processed 30800 zonotopes (Work Done: 0.03357%; Expected Zonos: 9.17504e7)
[Thread 1] Processed 30900 zonotopes (Work Done: 0.03357%; Expected Zonos: 9.20482909090909e7)
[Thread 1] Processed 31000 zonotopes (Work Done: 0.03357%; Expected Zonos: 9.234618181818181e7)
[Thread 1] Processed 31100 zonotopes (Work Done: 0.03357%; Expected Zonos: 9.264407272727273e7)
[Thread 1] Processed 31200 zonotopes (Work Done: 0.03662%; Expected Zonos: 8.51968e7)
[Thread 1] Processed 31300 zonotopes (Work Done: 0.03662%; Expected Zonos: 8.546986666666667e7)
[Thread 1] Processed 31400 zonotopes (Work Done: 0.03662%; Expected Zonos: 8.574293333333333e7)
[Thread 1] Processed 31500 zonotopes (Work Done: 0.03662%; Expected Zonos: 8.6016e7)
[Thread 1] Processed 31600 zonotopes (Work Done: 0.03662%; Expected Zonos: 8.628906666666667e7)
[Thread 1] Processed 31700 zonotopes (Work Done: 0.03662%; Expected Zonos: 8.656213333333333e7)
[Thread 1] Processed 31800 zonotopes (Work Done: 0.03662%; Expected Zonos: 8.68352e7)
[Thread 1] Processed 31900 zonotopes (Work Done: 0.03662%; Expected Zonos: 8.710826666666667e7)
[Thread 1] Processed 32000 zonotopes (Work Done: 0.03662%; Expected Zonos: 8.738133333333333e7)
[Thread 1] Processed 32100 zonotopes (Work Done: 0.03815%; Expected Zonos: 8.4148224e7)
[Thread 1] Processed 32200 zonotopes (Work Done: 0.03815%; Expected Zonos: 8.4410368e7)
[Thread 1] Processed 32300 zonotopes (Work Done: 0.03815%; Expected Zonos: 8.4672512e7)
[Thread 1] Processed 32400 zonotopes (Work Done: 0.03815%; Expected Zonos: 8.4934656e7)
[Thread 1] Processed 32500 zonotopes (Work Done: 0.03815%; Expected Zonos: 8.51968e7)
[Thread 1] Processed 32600 zonotopes (Work Done: 0.03815%; Expected Zonos: 8.5458944e7)
[Thread 1] Processed 32700 zonotopes (Work Done: 0.03815%; Expected Zonos: 8.5721088e7)
[Thread 1] Processed 32800 zonotopes (Work Done: 0.03815%; Expected Zonos: 8.5983232e7)
[Thread 1] Processed 32900 zonotopes (Work Done: 0.03815%; Expected Zonos: 8.6245376e7)
[Thread 1] Processed 33000 zonotopes (Work Done: 0.0412%; Expected Zonos: 8.009955555555555e7)
[Thread 1] Processed 33100 zonotopes (Work Done: 0.0412%; Expected Zonos: 8.034228148148148e7)
[Thread 1] Processed 33200 zonotopes (Work Done: 0.0412%; Expected Zonos: 8.05850074074074e7)
[Thread 1] Processed 33300 zonotopes (Work Done: 0.0412%; Expected Zonos: 8.082773333333333e7)
[Thread 1] Processed 33400 zonotopes (Work Done: 0.04272%; Expected Zonos: 7.817508571428572e7)
[Thread 1] Processed 33500 zonotopes (Work Done: 0.04272%; Expected Zonos: 7.840914285714285e7)
[Thread 1] Processed 33600 zonotopes (Work Done: 0.04272%; Expected Zonos: 7.86432e7)
[Thread 1] Processed 33700 zonotopes (Work Done: 0.04272%; Expected Zonos: 7.887725714285715e7)
[Thread 1] Processed 33800 zonotopes (Work Done: 0.04272%; Expected Zonos: 7.911131428571428e7)
[Thread 1] Processed 33900 zonotopes (Work Done: 0.04272%; Expected Zonos: 7.934537142857143e7)
[Thread 1] Processed 34000 zonotopes (Work Done: 0.04272%; Expected Zonos: 7.957942857142857e7)
[Thread 1] Processed 34100 zonotopes (Work Done: 0.04272%; Expected Zonos: 7.981348571428572e7)
[Thread 1] Processed 34200 zonotopes (Work Done: 0.04272%; Expected Zonos: 8.004754285714285e7)
[Thread 1] Processed 34300 zonotopes (Work Done: 0.04272%; Expected Zonos: 8.02816e7)
[Thread 1] Processed 34400 zonotopes (Work Done: 0.04425%; Expected Zonos: 7.77392551724138e7)
[Thread 1] Processed 34500 zonotopes (Work Done: 0.04425%; Expected Zonos: 7.796524137931034e7)
[Thread 1] Processed 34600 zonotopes (Work Done: 0.04425%; Expected Zonos: 7.81912275862069e7)
[Thread 1] Processed 34700 zonotopes (Work Done: 0.04501%; Expected Zonos: 7.708810847457626e7)
[Thread 1] Processed 34800 zonotopes (Work Done: 0.04654%; Expected Zonos: 7.477550163934426e7)
[Thread 1] Processed 34900 zonotopes (Work Done: 0.04654%; Expected Zonos: 7.499037377049181e7)
[Thread 1] Processed 35000 zonotopes (Work Done: 0.04654%; Expected Zonos: 7.520524590163934e7)
[Thread 1] Processed 35100 zonotopes (Work Done: 0.04654%; Expected Zonos: 7.542011803278689e7)
[Thread 1] Processed 35200 zonotopes (Work Done: 0.04654%; Expected Zonos: 7.563499016393442e7)
[Thread 1] Processed 35300 zonotopes (Work Done: 0.04807%; Expected Zonos: 7.344193015873016e7)
[Thread 1] Processed 35400 zonotopes (Work Done: 0.04807%; Expected Zonos: 7.364998095238096e7)
[Thread 1] Processed 35500 zonotopes (Work Done: 0.04845%; Expected Zonos: 7.327647244094488e7)
[Thread 1] Processed 35600 zonotopes (Work Done: 0.04845%; Expected Zonos: 7.348288503937007e7)
[Thread 1] Processed 35700 zonotopes (Work Done: 0.04845%; Expected Zonos: 7.368929763779527e7)
[Thread 1] Processed 35800 zonotopes (Work Done: 0.04845%; Expected Zonos: 7.389571023622048e7)
[Thread 1] Processed 35900 zonotopes (Work Done: 0.04845%; Expected Zonos: 7.410212283464567e7)
[Thread 1] Processed 36000 zonotopes (Work Done: 0.04845%; Expected Zonos: 7.430853543307087e7)
[Thread 1] Processed 36100 zonotopes (Work Done: 0.04845%; Expected Zonos: 7.451494803149606e7)
[Thread 1] Processed 36200 zonotopes (Work Done: 0.04845%; Expected Zonos: 7.472136062992126e7)
[Thread 1] Processed 36300 zonotopes (Work Done: 0.04845%; Expected Zonos: 7.492777322834645e7)
[Thread 1] Processed 36400 zonotopes (Work Done: 0.04845%; Expected Zonos: 7.513418582677165e7)
[Thread 1] Processed 36500 zonotopes (Work Done: 0.04845%; Expected Zonos: 7.534059842519686e7)
[Thread 1] Processed 36600 zonotopes (Work Done: 0.04845%; Expected Zonos: 7.554701102362205e7)
[Thread 1] Processed 36700 zonotopes (Work Done: 0.04845%; Expected Zonos: 7.575342362204725e7)
[Thread 1] Processed 36800 zonotopes (Work Done: 0.04845%; Expected Zonos: 7.595983622047244e7)
[Thread 1] Processed 36900 zonotopes (Work Done: 0.04921%; Expected Zonos: 7.498537674418604e7)
[Thread 1] Processed 37000 zonotopes (Work Done: 0.05531%; Expected Zonos: 6.689191724137931e7)
[Thread 1] Processed 37100 zonotopes (Work Done: 0.05608%; Expected Zonos: 6.616015238095238e7)
[Thread 1] Processed 37200 zonotopes (Work Done: 0.05608%; Expected Zonos: 6.633848163265306e7)
[Thread 1] Processed 37300 zonotopes (Work Done: 0.05608%; Expected Zonos: 6.651681088435374e7)
[Thread 1] Processed 37400 zonotopes (Work Done: 0.05608%; Expected Zonos: 6.669514013605442e7)
[Thread 1] Processed 37500 zonotopes (Work Done: 0.05608%; Expected Zonos: 6.68734693877551e7)
[Thread 1] Processed 37600 zonotopes (Work Done: 0.05608%; Expected Zonos: 6.705179863945578e7)
[Thread 1] Processed 37700 zonotopes (Work Done: 0.05608%; Expected Zonos: 6.723012789115646e7)
[Thread 1] Processed 37800 zonotopes (Work Done: 0.05684%; Expected Zonos: 6.650364563758389e7)
[Thread 1] Processed 37900 zonotopes (Work Done: 0.05684%; Expected Zonos: 6.667958120805369e7)
[Thread 1] Processed 38000 zonotopes (Work Done: 0.05989%; Expected Zonos: 6.344886624203822e7)
[Thread 1] Processed 38100 zonotopes (Work Done: 0.05989%; Expected Zonos: 6.361583694267516e7)
[Thread 1] Processed 38200 zonotopes (Work Done: 0.06065%; Expected Zonos: 6.298050817610063e7)
[Thread 1] Processed 38300 zonotopes (Work Done: 0.06065%; Expected Zonos: 6.31453786163522e7)
[Thread 1] Processed 38400 zonotopes (Work Done: 0.06065%; Expected Zonos: 6.3310249056603774e7)
[Thread 1] Processed 38500 zonotopes (Work Done: 0.06065%; Expected Zonos: 6.347511949685535e7)
[Thread 1] Processed 38600 zonotopes (Work Done: 0.06104%; Expected Zonos: 6.324224e7)
[Thread 1] Processed 38700 zonotopes (Work Done: 0.06104%; Expected Zonos: 6.340608e7)
[Thread 1] Processed 38800 zonotopes (Work Done: 0.06104%; Expected Zonos: 6.356992e7)
[Thread 1] Processed 38900 zonotopes (Work Done: 0.06104%; Expected Zonos: 6.373376e7)
[Thread 1] Processed 39000 zonotopes (Work Done: 0.0618%; Expected Zonos: 6.310874074074074e7)
[Thread 1] Processed 39100 zonotopes (Work Done: 0.0618%; Expected Zonos: 6.327055802469136e7)
[Thread 1] Processed 39200 zonotopes (Work Done: 0.06256%; Expected Zonos: 6.265880975609756e7)
[Thread 1] Processed 39300 zonotopes (Work Done: 0.06561%; Expected Zonos: 5.989685581395349e7)
[Thread 1] Processed 39400 zonotopes (Work Done: 0.06866%; Expected Zonos: 5.738040888888889e7)
[Thread 1] Processed 39500 zonotopes (Work Done: 0.06866%; Expected Zonos: 5.752604444444445e7)
[Thread 1] Processed 39600 zonotopes (Work Done: 0.06866%; Expected Zonos: 5.767168e7)
[Thread 1] Processed 39700 zonotopes (Work Done: 0.06866%; Expected Zonos: 5.781731555555555e7)
[Thread 1] Processed 39800 zonotopes (Work Done: 0.06866%; Expected Zonos: 5.796295111111111e7)
[Thread 1] Processed 39900 zonotopes (Work Done: 0.06866%; Expected Zonos: 5.8108586666666664e7)
[Thread 1] Processed 40000 zonotopes (Work Done: 0.06866%; Expected Zonos: 5.8254222222222224e7)
[Thread 1] Processed 40100 zonotopes (Work Done: 0.07629%; Expected Zonos: 5.2559872e7)
[Thread 1] Processed 40200 zonotopes (Work Done: 0.07629%; Expected Zonos: 5.2690944e7)
[Thread 1] Processed 40300 zonotopes (Work Done: 0.07629%; Expected Zonos: 5.2822016e7)
[Thread 1] Processed 40400 zonotopes (Work Done: 0.07629%; Expected Zonos: 5.2953088e7)
[Thread 1] Processed 40500 zonotopes (Work Done: 0.07858%; Expected Zonos: 5.153801941747573e7)
[Thread 1] Processed 40600 zonotopes (Work Done: 0.07858%; Expected Zonos: 5.166527378640777e7)
[Thread 1] Processed 40700 zonotopes (Work Done: 0.07858%; Expected Zonos: 5.179252815533981e7)
[Thread 1] Processed 40800 zonotopes (Work Done: 0.07858%; Expected Zonos: 5.1919782524271846e7)
[Thread 1] Processed 40900 zonotopes (Work Done: 0.07858%; Expected Zonos: 5.2047036893203884e7)
[Thread 1] Processed 41000 zonotopes (Work Done: 0.07858%; Expected Zonos: 5.217429126213592e7)
[Thread 1] Processed 41100 zonotopes (Work Done: 0.08011%; Expected Zonos: 5.130532571428572e7)
[Thread 1] Processed 41200 zonotopes (Work Done: 0.08011%; Expected Zonos: 5.1430156190476194e7)
[Thread 1] Processed 41300 zonotopes (Work Done: 0.08011%; Expected Zonos: 5.1554986666666664e7)
[Thread 1] Processed 41400 zonotopes (Work Done: 0.08087%; Expected Zonos: 5.119227169811321e7)
[Thread 1] Processed 41500 zonotopes (Work Done: 0.08316%; Expected Zonos: 4.9903559633027524e7)
[Thread 1] Processed 41600 zonotopes (Work Done: 0.08316%; Expected Zonos: 5.002380917431193e7)
[Thread 1] Processed 41700 zonotopes (Work Done: 0.08926%; Expected Zonos: 4.671540512820513e7)
[Thread 1] Processed 41800 zonotopes (Work Done: 0.09232%; Expected Zonos: 4.527941818181818e7)
[Thread 1] Processed 41900 zonotopes (Work Done: 0.09232%; Expected Zonos: 4.538774214876033e7)
[Thread 1] Processed 42000 zonotopes (Work Done: 0.0946%; Expected Zonos: 4.4395354838709675e7)
[Thread 1] Processed 42100 zonotopes (Work Done: 0.09537%; Expected Zonos: 4.41450496e7)
[Thread 1] Processed 42200 zonotopes (Work Done: 0.09689%; Expected Zonos: 4.3553058267716534e7)
[Thread 1] Processed 42300 zonotopes (Work Done: 0.09766%; Expected Zonos: 4.33152e7)
[Thread 1] Processed 42400 zonotopes (Work Done: 0.09766%; Expected Zonos: 4.34176e7)
[Thread 1] Processed 42500 zonotopes (Work Done: 0.09766%; Expected Zonos: 4.352e7)
[Thread 1] Processed 42600 zonotopes (Work Done: 0.09766%; Expected Zonos: 4.36224e7)
[Thread 1] Processed 42700 zonotopes (Work Done: 0.09995%; Expected Zonos: 4.272346870229007e7)
[Thread 1] Processed 42800 zonotopes (Work Done: 0.103%; Expected Zonos: 4.1554678518518515e7)
[Thread 1] Processed 42900 zonotopes (Work Done: 0.10452%; Expected Zonos: 4.104371386861314e7)
[Thread 1] Processed 43000 zonotopes (Work Done: 0.10452%; Expected Zonos: 4.113938686131387e7)
[Thread 1] Processed 43100 zonotopes (Work Done: 0.1049%; Expected Zonos: 4.108511418181818e7)
[Thread 1] Processed 43200 zonotopes (Work Done: 0.10643%; Expected Zonos: 4.059003870967742e7)
[Thread 1] Processed 43300 zonotopes (Work Done: 0.10719%; Expected Zonos: 4.039443131672598e7)
[Thread 1] Processed 43400 zonotopes (Work Done: 0.10719%; Expected Zonos: 4.048772099644128e7)
[Thread 1] Processed 43500 zonotopes (Work Done: 0.10719%; Expected Zonos: 4.058101067615658e7)
[Thread 1] Processed 43600 zonotopes (Work Done: 0.10796%; Expected Zonos: 4.038684946996466e7)
[Thread 1] Processed 43700 zonotopes (Work Done: 0.10948%; Expected Zonos: 3.991530592334495e7)
[Thread 1] Processed 43800 zonotopes (Work Done: 0.11063%; Expected Zonos: 3.9592783448275864e7)
[Thread 1] Processed 43900 zonotopes (Work Done: 0.11063%; Expected Zonos: 3.968317793103448e7)
[Thread 1] Processed 44000 zonotopes (Work Done: 0.11215%; Expected Zonos: 3.923243537414966e7)
[Thread 1] Processed 44100 zonotopes (Work Done: 0.11215%; Expected Zonos: 3.93216e7)
[Thread 1] Processed 44200 zonotopes (Work Done: 0.11215%; Expected Zonos: 3.941076462585034e7)
[Thread 1] Processed 44300 zonotopes (Work Done: 0.11292%; Expected Zonos: 3.923303783783784e7)
[Thread 1] Processed 44400 zonotopes (Work Done: 0.11406%; Expected Zonos: 3.892706889632107e7)
[Thread 1] Processed 44500 zonotopes (Work Done: 0.11406%; Expected Zonos: 3.901474247491639e7)
[Thread 1] Processed 44600 zonotopes (Work Done: 0.11711%; Expected Zonos: 3.8083460586319216e7)
[Thread 1] Processed 44700 zonotopes (Work Done: 0.11787%; Expected Zonos: 3.7921801941747576e7)
[Thread 1] Processed 44800 zonotopes (Work Done: 0.11787%; Expected Zonos: 3.800663818770227e7)
[Thread 1] Processed 44900 zonotopes (Work Done: 0.11787%; Expected Zonos: 3.809147443365696e7)
[Thread 1] Processed 45000 zonotopes (Work Done: 0.1255%; Expected Zonos: 3.585556231003039e7)
[Thread 1] Processed 45100 zonotopes (Work Done: 0.1255%; Expected Zonos: 3.593524133738602e7)
[Thread 1] Processed 45200 zonotopes (Work Done: 0.12703%; Expected Zonos: 3.558230870870871e7)
[Thread 1] Processed 45300 zonotopes (Work Done: 0.12779%; Expected Zonos: 3.544812895522388e7)
[Thread 1] Processed 45400 zonotopes (Work Done: 0.12932%; Expected Zonos: 3.5107190560471974e7)
[Thread 1] Processed 45500 zonotopes (Work Done: 0.13847%; Expected Zonos: 3.285826997245179e7)
[Thread 1] Processed 45600 zonotopes (Work Done: 0.13847%; Expected Zonos: 3.2930485950413223e7)
[Thread 1] Processed 45700 zonotopes (Work Done: 0.13924%; Expected Zonos: 3.282186520547945e7)
[Thread 1] Processed 45800 zonotopes (Work Done: 0.14%; Expected Zonos: 3.271442833787466e7)


TIMEOUT REACHED
UNKNOWN
[Thread 1] Total splits: 45781
Processed 45857 zonotopes (Work Done: 0.1%); Generated 91562 (0.002621001043286739s/loop)
[Thread 1] Finished in 120.19s
 ────────────────────────────────────────────────────────────────────────────────
                                        Time                    Allocations      
                               ───────────────────────   ────────────────────────
       Tot / % measured:             120s / 100.0%           86.1GiB / 100.0%    

 Section               ncalls     time    %tot     avg     alloc    %tot      avg
 ────────────────────────────────────────────────────────────────────────────────
 Verify                     1     120s  100.0%    120s   86.1GiB  100.0%  86.1GiB
   Zonotope Loop            1     120s  100.0%    120s   86.1GiB  100.0%  86.1GiB
     Zonotope Propa...  45.9k    75.6s   62.9%  1.65ms   39.5GiB   45.8%   903KiB
       DiffZonotope...   183k    44.5s   37.0%   243μs   9.34GiB   10.8%  53.4KiB
         Zonotope_D...   367k    20.8s   17.3%  56.6μs   5.02GiB    5.8%  14.4KiB
       DiffZonotope...   138k    30.8s   25.7%   224μs   30.1GiB   35.0%   230KiB
         Zonotope_R...   275k    17.3s   14.4%  62.7μs   18.9GiB   21.9%  72.0KiB
           Column M...   275k    4.95s    4.1%  18.0μs   6.67GiB    7.8%  25.4KiB
           Influenc...   275k    4.25s    3.5%  15.4μs   4.55GiB    5.3%  17.4KiB
             Multiply    275k    3.15s    2.6%  11.5μs   2.70GiB    3.1%  10.3KiB
             Alloca...   275k    742ms    0.6%  2.70μs   1.85GiB    2.1%  7.05KiB
             Set Ma...   275k    196ms    0.2%   712ns     0.00B    0.0%    0.00B
           Allocation    275k    3.79s    3.2%  13.8μs   6.64GiB    7.7%  25.3KiB
           Vectors       275k    1.66s    1.4%  6.03μs    875MiB    1.0%  3.26KiB
           Set Matrix    275k    884ms    0.7%  3.21μs    161MiB    0.2%     612B
           Bounds        275k   61.3ms    0.1%   223ns     0.00B    0.0%    0.00B
     Property Check     45.9k    7.93s    6.6%   173μs   2.83GiB    3.3%  64.6KiB
     Compute Split      45.8k    7.42s    6.2%   162μs   6.77GiB    7.9%   155KiB
 Initialize                 1    333μs    0.0%   333μs    839KiB    0.0%   839KiB
 ────────────────────────────────────────────────────────────────────────────────
[VERYDIFF_TIMER] 120.222861912

[VERYDIFF_EXPERIMENT] NETWORK: /home/i57/steuber/NeuroDiff/repos/VeryDiffExperiments/src/../benchmarks/mnist-prune/specs/mnist_28_local_18.vnnlib
[VERYDIFF_EXPERIMENT] TIME: 120.916621673
