
[VERYDIFF_EXPERIMENT] Running on /home/i57/steuber/NeuroDiff/repos/VeryDiffExperiments/src/../benchmarks/mnist-prune/specs/mnist_29_global_5.vnnlib /home/i57/steuber/NeuroDiff/repos/VeryDiffExperiments/src/../benchmarks/mnist-prune/nets/mnist_relu_3_100.onnx
Parsing /home/i57/steuber/NeuroDiff/repos/VeryDiffExperiments/src/../benchmarks/mnist-prune/nets/mnist_relu_3_100.onnx...
Found input X
op: matmul, weight: (100, 784), bias: nothing
op: bias, weight: nothing, bias: (100,)
op: relu, weight: nothing, bias: nothing
op: matmul, weight: (100, 100), bias: nothing
op: bias, weight: nothing, bias: (100,)
op: relu, weight: nothing, bias: nothing
op: matmul, weight: (10, 100), bias: nothing
op: bias, weight: nothing, bias: (10,)
op: relu, weight: nothing, bias: nothing
op: matmul, weight: (10, 10), bias: nothing
op: bias, weight: nothing, bias: (10,)
Parsing /home/i57/steuber/NeuroDiff/repos/VeryDiffExperiments/src/../benchmarks/mnist-prune/nets_pruned/mnist_relu_3_100_0.79_adam_1_stepsize-old.onnx...
Found input X
op: gemm, weight: (100, 784), bias: (100,)
op: relu, weight: nothing, bias: nothing
op: gemm, weight: (100, 100), bias: (100,)
op: relu, weight: nothing, bias: nothing
op: gemm, weight: (10, 100), bias: (10,)
op: relu, weight: nothing, bias: nothing
op: gemm, weight: (10, 10), bias: (10,)
Distance: 368.62397500800625
Distance: 47.56803950402309
Distance: 2.8977568827249343
Distance: 0.01885471428334995
Running with 1 threads
[Thread 1] Time to first task: 0.0s
Instable Generators: 42
Instable Generators: 60
Instable Generators: 8
Zono Bounds:
[-0.0006362631126175817, -1.1868192765896308, -1.4612602874122878, -1.4728289026486954, -1.674673793170029, -1.6842785465118604, -1.6065799397947766, -1.4205212483265945, -1.4039208110985504, -1.3603487434832746]
[0.0006244046437293793, 1.3237980109859981, 1.3334296543453663, 1.411028334569825, 1.6780111990724715, 1.5041668525565954, 1.561657306258215, 1.4062462969463934, 1.3435436017558882, 1.3565980176211583]
[Thread 1] Total splits: 1
Processed 3 zonotopes (Work Done: 100.0%); Generated 2 (0.3512070033333334s/loop)
[Thread 1] Finished in 1.05s
 ────────────────────────────────────────────────────────────────────────────────
                                        Time                    Allocations      
                               ───────────────────────   ────────────────────────
       Tot / % measured:            1.05s / 100.0%            504MiB / 100.0%    

 Section               ncalls     time    %tot     avg     alloc    %tot      avg
 ────────────────────────────────────────────────────────────────────────────────
 Verify                     1    1.05s   99.9%   1.05s    499MiB   98.9%   499MiB
   Zonotope Loop            1    1.05s   99.9%   1.05s    499MiB   98.9%   499MiB
     Property Check         3    824ms   78.1%   275ms    198MiB   39.2%  65.9MiB
     Zonotope Propa...      3    212ms   20.1%  70.8ms    225MiB   44.7%  75.1MiB
       DiffZonotope...      9    159ms   15.1%  17.6ms    213MiB   42.2%  23.6MiB
         Zonotope_R...     18    156ms   14.8%  8.69ms    208MiB   41.2%  11.5MiB
           Influenc...     18    153ms   14.5%  8.48ms    191MiB   37.9%  10.6MiB
             Alloca...     18   75.3ms    7.1%  4.18ms   93.5MiB   18.6%  5.20MiB
             Multiply      18   64.5ms    6.1%  3.58ms   97.6MiB   19.4%  5.42MiB
             Set Ma...     18   12.8ms    1.2%   712μs     0.00B    0.0%    0.00B
           Column M...     18   2.17ms    0.2%   121μs   8.25MiB    1.6%   469KiB
           Set Matrix      18    954μs    0.1%  53.0μs   21.1KiB    0.0%  1.17KiB
           Allocation      18    447μs    0.0%  24.8μs   8.25MiB    1.6%   469KiB
           Vectors         18   83.8μs    0.0%  4.65μs   58.6KiB    0.0%  3.26KiB
           Bounds          18   11.6μs    0.0%   646ns     0.00B    0.0%    0.00B
       DiffZonotope...     12   53.5ms    5.1%  4.46ms   12.6MiB    2.5%  1.05MiB
         Zonotope_D...     24   23.6ms    2.2%   981μs   8.21MiB    1.6%   350KiB
     Compute Split          1   6.23ms    0.6%  6.23ms   15.8MiB    3.1%  15.8MiB
 Initialize                 1    550μs    0.1%   550μs   5.41MiB    1.1%  5.41MiB
 ────────────────────────────────────────────────────────────────────────────────
[VERYDIFF_TIMER] 1.083677159

[VERYDIFF_EXPERIMENT] NETWORK: /home/i57/steuber/NeuroDiff/repos/VeryDiffExperiments/src/../benchmarks/mnist-prune/specs/mnist_29_global_5.vnnlib
[VERYDIFF_EXPERIMENT] TIME: 1.395894599
