[VERYDIFF_EXPERIMENT] Sigma: 0.5
Parsing new_benchmarks/rice-1/nets/2_40.onnx...
Found input onnx::Gemm_0
op: gemm, weight: (40, 7), bias: (40,)
op: relu, weight: nothing, bias: nothing
op: gemm, weight: (40, 40), bias: (40,)
op: relu, weight: nothing, bias: nothing
op: gemm, weight: (2, 40), bias: (2,)
Parsing new_benchmarks/rice-1/nets_pruned/2_40-0.4.onnx...
Found input onnx::Gemm_0
op: gemm, weight: (40, 7), bias: (40,)
op: relu, weight: nothing, bias: nothing
op: gemm, weight: (40, 40), bias: (40,)
op: relu, weight: nothing, bias: nothing
op: gemm, weight: (2, 40), bias: (2,)
Distance: 22.95577340584714
Distance: 54.537872249611866
Distance: 0.0
Running with 1 threads
[Thread 1] Time to first task: 0.0s
Zono Bounds:
[0.0, 0.0, 0.0, 0.0, 0.0, 0.0, 0.0]
[0.0, 0.0, 0.0, 0.0, 0.0, 0.0, 0.0]
[TOP-1] did not find required confidence yet.
[TOP-1] required confidence (0.9999932714145836≥0.99999) is feasible for index 2
[Thread 1] Total splits: 34
Processed 69 zonotopes (Work Done: 100.0%); Generated 68 (0.002107966014492754s/loop)
[Thread 1] Finished in 0.15s
 ────────────────────────────────────────────────────────────────────────────────
                                        Time                    Allocations      
                               ───────────────────────   ────────────────────────
       Tot / % measured:            146ms / 100.0%           47.4MiB / 100.0%    

 Section               ncalls     time    %tot     avg     alloc    %tot      avg
 ────────────────────────────────────────────────────────────────────────────────
 Verify                     1    145ms  100.0%   145ms   47.4MiB  100.0%  47.4MiB
   Zonotope Loop            1    145ms  100.0%   145ms   47.4MiB   99.9%  47.4MiB
     Property Check        69    138ms   94.5%  1.99ms   31.6MiB   66.7%   469KiB
     Zonotope Propa...     69   6.91ms    4.7%   100μs   15.2MiB   31.9%   225KiB
       DiffZonotope...    138   4.92ms    3.4%  35.7μs   12.9MiB   27.2%  95.9KiB
         Zonotope_R...    276   4.48ms    3.1%  16.2μs   12.4MiB   26.1%  45.9KiB
           Influenc...    276   1.50ms    1.0%  5.42μs   3.05MiB    6.4%  11.3KiB
             Multiply     276   1.13ms    0.8%  4.09μs   2.27MiB    4.8%  8.43KiB
             Alloca...    276    145μs    0.1%   525ns    794KiB    1.6%  2.88KiB
             Set Ma...    276   64.7μs    0.0%   234ns     0.00B    0.0%    0.00B
           Column M...    276   1.17ms    0.8%  4.22μs   4.27MiB    9.0%  15.9KiB
           Set Matrix     276    787μs    0.5%  2.85μs    264KiB    0.5%     980B
           Vectors        276    475μs    0.3%  1.72μs    565KiB    1.2%  2.05KiB
           Allocation     276    258μs    0.2%   935ns   4.23MiB    8.9%  15.7KiB
           Bounds         276   52.0μs    0.0%   188ns     0.00B    0.0%    0.00B
       DiffZonotope...    207   1.72ms    1.2%  8.31μs   2.21MiB    4.7%  11.0KiB
         Zonotope_D...    414   1.66ms    1.1%  4.00μs   2.20MiB    4.6%  5.44KiB
     Compute Split         34    594μs    0.4%  17.5μs    475KiB    1.0%  14.0KiB
 Initialize                 1   33.3μs    0.0%  33.3μs   20.8KiB    0.0%  20.8KiB
 ────────────────────────────────────────────────────────────────────────────────[VERYDIFF_TIMER] 0.146977625
[VERYDIFF_EXPERIMENT] Sigma: 1.0
Parsing new_benchmarks/rice-1/nets/2_40.onnx...
Found input onnx::Gemm_0
op: gemm, weight: (40, 7), bias: (40,)
op: relu, weight: nothing, bias: nothing
op: gemm, weight: (40, 40), bias: (40,)
op: relu, weight: nothing, bias: nothing
op: gemm, weight: (2, 40), bias: (2,)
Parsing new_benchmarks/rice-1/nets_pruned/2_40-0.4.onnx...
Found input onnx::Gemm_0
op: gemm, weight: (40, 7), bias: (40,)
op: relu, weight: nothing, bias: nothing
op: gemm, weight: (40, 40), bias: (40,)
op: relu, weight: nothing, bias: nothing
op: gemm, weight: (2, 40), bias: (2,)
Distance: 22.95577340584714
Distance: 54.537872249611866
Distance: 0.0
Running with 1 threads
[Thread 1] Time to first task: 0.0s
Zono Bounds:
[0.0, 0.0, 0.0, 0.0, 0.0, 0.0, 0.0]
[0.0, 0.0, 0.0, 0.0, 0.0, 0.0, 0.0]
[TOP-1] required confidence (0.9999998926272176≥0.99999) is feasible for index 1
[Thread 1] Processed 100 zonotopes (Work Done: 0.0%; Expected Zonos: Inf)
[Thread 1] Processed 200 zonotopes (Work Done: 4.6875%; Expected Zonos: 4266.666666666667)
[Thread 1] Processed 300 zonotopes (Work Done: 7.42188%; Expected Zonos: 4042.1052631578946)
[Thread 1] Processed 400 zonotopes (Work Done: 13.67188%; Expected Zonos: 2925.714285714286)
[Thread 1] Processed 500 zonotopes (Work Done: 18.35938%; Expected Zonos: 2723.404255319149)
[Thread 1] Processed 600 zonotopes (Work Done: 24.41406%; Expected Zonos: 2457.6)
[Thread 1] Processed 700 zonotopes (Work Done: 29.10156%; Expected Zonos: 2405.3691275167785)
[Thread 1] Processed 800 zonotopes (Work Done: 32.12891%; Expected Zonos: 2489.969604863222)
[Thread 1] Processed 900 zonotopes (Work Done: 34.47266%; Expected Zonos: 2610.7648725212466)
[Thread 1] Processed 1000 zonotopes (Work Done: 37.5%; Expected Zonos: 2666.6666666666665)
[Thread 1] Processed 1100 zonotopes (Work Done: 41.30859%; Expected Zonos: 2662.8841607565014)
[Thread 1] Processed 1200 zonotopes (Work Done: 43.26172%; Expected Zonos: 2773.8148984198647)
[Thread 1] Processed 1300 zonotopes (Work Done: 45.11719%; Expected Zonos: 2881.3852813852814)
[Thread 1] Processed 1400 zonotopes (Work Done: 47.31445%; Expected Zonos: 2958.9267285861715)
[Thread 1] Processed 1500 zonotopes (Work Done: 49.16992%; Expected Zonos: 3050.6454816286)
[Thread 1] Processed 1600 zonotopes (Work Done: 50.09766%; Expected Zonos: 3193.7621832358673)
[Thread 1] Processed 1700 zonotopes (Work Done: 51.5625%; Expected Zonos: 3296.969696969697)
[Thread 1] Processed 1800 zonotopes (Work Done: 52.53906%; Expected Zonos: 3426.022304832714)
[Thread 1] Processed 1900 zonotopes (Work Done: 53.56445%; Expected Zonos: 3547.1285323609845)
[Thread 1] Processed 2000 zonotopes (Work Done: 54.3457%; Expected Zonos: 3680.1437556154538)
[Thread 1] Processed 2100 zonotopes (Work Done: 55.24902%; Expected Zonos: 3800.9721608484315)
[Thread 1] Processed 2200 zonotopes (Work Done: 55.88379%; Expected Zonos: 3936.7409349060727)
[Thread 1] Processed 2300 zonotopes (Work Done: 56.71387%; Expected Zonos: 4055.4455445544554)
[Thread 1] Processed 2400 zonotopes (Work Done: 57.01904%; Expected Zonos: 4209.120102761722)
[Thread 1] Processed 2500 zonotopes (Work Done: 57.49512%; Expected Zonos: 4348.195329087049)
[Thread 1] Processed 2600 zonotopes (Work Done: 58.03223%; Expected Zonos: 4480.269246949937)
[Thread 1] Processed 2700 zonotopes (Work Done: 58.36182%; Expected Zonos: 4626.312486927421)
[Thread 1] Processed 2800 zonotopes (Work Done: 58.78296%; Expected Zonos: 4763.285224794933)
[Thread 1] Processed 2900 zonotopes (Work Done: 59.08508%; Expected Zonos: 4908.176230566603)
[Thread 1] Processed 3000 zonotopes (Work Done: 59.32922%; Expected Zonos: 5056.530013888175)
[Thread 1] Processed 3100 zonotopes (Work Done: 59.55658%; Expected Zonos: 5205.134380364326)
[Thread 1] Processed 3200 zonotopes (Work Done: 59.79462%; Expected Zonos: 5351.652333682088)
[Thread 1] Processed 3300 zonotopes (Work Done: 59.96552%; Expected Zonos: 5503.162930354462)
[Thread 1] Processed 3400 zonotopes (Work Done: 60.14252%; Expected Zonos: 5653.238614740581)
[Thread 1] Processed 3500 zonotopes (Work Done: 60.3653%; Expected Zonos: 5798.033416748818)
[Thread 1] Processed 3600 zonotopes (Work Done: 60.55145%; Expected Zonos: 5945.356953859336)
[Thread 1] Processed 3700 zonotopes (Work Done: 60.62317%; Expected Zonos: 6103.2771205638055)
[Thread 1] Processed 3800 zonotopes (Work Done: 60.86426%; Expected Zonos: 6243.401524267951)
[Thread 1] Processed 3900 zonotopes (Work Done: 60.9787%; Expected Zonos: 6395.676000300277)
[Thread 1] Processed 4000 zonotopes (Work Done: 61.15265%; Expected Zonos: 6541.00855852484)
[Thread 1] Processed 4100 zonotopes (Work Done: 61.31897%; Expected Zonos: 6686.34847957)
[Thread 1] Processed 4200 zonotopes (Work Done: 61.39679%; Expected Zonos: 6840.748564753833)
[Thread 1] Processed 4300 zonotopes (Work Done: 61.63177%; Expected Zonos: 6976.920601124013)
[Thread 1] Processed 4400 zonotopes (Work Done: 61.81335%; Expected Zonos: 7118.202912861022)
[Thread 1] Processed 4500 zonotopes (Work Done: 62.22534%; Expected Zonos: 7231.780284453163)
[Thread 1] Processed 4600 zonotopes (Work Done: 62.62054%; Expected Zonos: 7345.83201345062)
[Thread 1] Processed 4700 zonotopes (Work Done: 62.74567%; Expected Zonos: 7490.557136256414)
[Thread 1] Processed 4800 zonotopes (Work Done: 62.88757%; Expected Zonos: 7632.668510700248)
[Thread 1] Processed 4900 zonotopes (Work Done: 63.01422%; Expected Zonos: 7776.022471365959)
[Thread 1] Processed 5000 zonotopes (Work Done: 63.3728%; Expected Zonos: 7889.819897910045)
[Thread 1] Processed 5100 zonotopes (Work Done: 63.50403%; Expected Zonos: 8030.986592339853)
[Thread 1] Processed 5200 zonotopes (Work Done: 63.7619%; Expected Zonos: 8155.340177567186)
[Thread 1] Processed 5300 zonotopes (Work Done: 64.08386%; Expected Zonos: 8270.412876803657)
[Thread 1] Processed 5400 zonotopes (Work Done: 64.33258%; Expected Zonos: 8393.880600555016)
[Thread 1] Processed 5500 zonotopes (Work Done: 64.44397%; Expected Zonos: 8534.545626746223)
[Thread 1] Processed 5600 zonotopes (Work Done: 64.60114%; Expected Zonos: 8668.578312114698)
[Thread 1] Processed 5700 zonotopes (Work Done: 64.77814%; Expected Zonos: 8799.265069606388)
[Thread 1] Processed 5800 zonotopes (Work Done: 64.99023%; Expected Zonos: 8924.417731029302)
[Thread 1] Processed 5900 zonotopes (Work Done: 65.15503%; Expected Zonos: 9055.325526932083)
[Thread 1] Processed 6000 zonotopes (Work Done: 65.56778%; Expected Zonos: 9150.836038677697)
[Thread 1] Processed 6100 zonotopes (Work Done: 65.78598%; Expected Zonos: 9272.492374778201)
[Thread 1] Processed 6200 zonotopes (Work Done: 65.9996%; Expected Zonos: 9393.995861606576)
[Thread 1] Processed 6300 zonotopes (Work Done: 66.15677%; Expected Zonos: 9522.8350996967)
[Thread 1] Processed 6400 zonotopes (Work Done: 66.44287%; Expected Zonos: 9632.335109314716)
[Thread 1] Processed 6500 zonotopes (Work Done: 66.67023%; Expected Zonos: 9749.479321630468)
[Thread 1] Processed 6600 zonotopes (Work Done: 66.91971%; Expected Zonos: 9862.565412196596)
[Thread 1] Processed 6700 zonotopes (Work Done: 67.19437%; Expected Zonos: 9971.073995435605)
[Thread 1] Processed 6800 zonotopes (Work Done: 67.43927%; Expected Zonos: 10083.1459148811)
[Thread 1] Processed 6900 zonotopes (Work Done: 67.7536%; Expected Zonos: 10183.96054320654)
[Thread 1] Processed 7000 zonotopes (Work Done: 67.95349%; Expected Zonos: 10301.163156240176)
[Thread 1] Processed 7100 zonotopes (Work Done: 68.2579%; Expected Zonos: 10401.725775984441)
[Thread 1] Processed 7200 zonotopes (Work Done: 68.47305%; Expected Zonos: 10515.085404851308)
[Thread 1] Processed 7300 zonotopes (Work Done: 68.81714%; Expected Zonos: 10607.822616407982)
[Thread 1] Processed 7400 zonotopes (Work Done: 69.17725%; Expected Zonos: 10697.15899064761)
[Thread 1] Processed 7500 zonotopes (Work Done: 69.52591%; Expected Zonos: 10787.345411449704)
[Thread 1] Processed 7600 zonotopes (Work Done: 69.70596%; Expected Zonos: 10902.940951130082)
[Thread 1] Processed 7700 zonotopes (Work Done: 69.97757%; Expected Zonos: 11003.525910096925)
[Thread 1] Processed 7800 zonotopes (Work Done: 70.39719%; Expected Zonos: 11079.9882953474)
[Thread 1] Processed 7900 zonotopes (Work Done: 70.77637%; Expected Zonos: 11161.917902725078)
[Thread 1] Processed 8000 zonotopes (Work Done: 71.05484%; Expected Zonos: 11258.909301751259)
[Thread 1] Processed 8100 zonotopes (Work Done: 71.38062%; Expected Zonos: 11347.618640444634)
[Thread 1] Processed 8200 zonotopes (Work Done: 72.00928%; Expected Zonos: 11387.421596880828)
[Thread 1] Processed 8300 zonotopes (Work Done: 72.3793%; Expected Zonos: 11467.366579177602)
[Thread 1] Processed 8400 zonotopes (Work Done: 72.76688%; Expected Zonos: 11543.713893286642)
[Thread 1] Processed 8500 zonotopes (Work Done: 73.11096%; Expected Zonos: 11626.163543014567)
[Thread 1] Processed 8600 zonotopes (Work Done: 73.48862%; Expected Zonos: 11702.492654921462)
[Thread 1] Processed 8700 zonotopes (Work Done: 73.92807%; Expected Zonos: 11768.195750214141)
[Thread 1] Processed 8800 zonotopes (Work Done: 74.35074%; Expected Zonos: 11835.793664638339)
[Thread 1] Processed 8900 zonotopes (Work Done: 74.85542%; Expected Zonos: 11889.586146797874)
[Thread 1] Processed 9000 zonotopes (Work Done: 75.13313%; Expected Zonos: 11978.736475474343)
[Thread 1] Processed 9100 zonotopes (Work Done: 75.43297%; Expected Zonos: 12063.690750115049)
[Thread 1] Processed 9200 zonotopes (Work Done: 75.79079%; Expected Zonos: 12138.678585269854)
[Thread 1] Processed 9300 zonotopes (Work Done: 76.09444%; Expected Zonos: 12221.655629471066)
[Thread 1] Processed 9400 zonotopes (Work Done: 76.42326%; Expected Zonos: 12299.919636216613)
[Thread 1] Processed 9500 zonotopes (Work Done: 76.82114%; Expected Zonos: 12366.38825714314)
[Thread 1] Processed 9600 zonotopes (Work Done: 77.49748%; Expected Zonos: 12387.499200118136)
[Thread 1] Processed 9700 zonotopes (Work Done: 77.82478%; Expected Zonos: 12463.895928200654)
[Thread 1] Processed 9800 zonotopes (Work Done: 78.17497%; Expected Zonos: 12535.98137909833)
[Thread 1] Processed 9900 zonotopes (Work Done: 78.47862%; Expected Zonos: 12614.900329076883)
[Thread 1] Processed 10000 zonotopes (Work Done: 78.89595%; Expected Zonos: 12674.92179227448)
[Thread 1] Processed 10100 zonotopes (Work Done: 79.09737%; Expected Zonos: 12769.072433433486)
[Thread 1] Processed 10200 zonotopes (Work Done: 79.39873%; Expected Zonos: 12846.553505109567)
[Thread 1] Processed 10300 zonotopes (Work Done: 79.69017%; Expected Zonos: 12925.057083909756)
[Thread 1] Processed 10400 zonotopes (Work Done: 80.0808%; Expected Zonos: 12986.884012061335)
[Thread 1] Processed 10500 zonotopes (Work Done: 80.52559%; Expected Zonos: 13039.333374389487)
[Thread 1] Processed 10600 zonotopes (Work Done: 80.88684%; Expected Zonos: 13104.727409922656)
[Thread 1] Processed 10700 zonotopes (Work Done: 81.33812%; Expected Zonos: 13154.963582727942)
[Thread 1] Processed 10800 zonotopes (Work Done: 81.73332%; Expected Zonos: 13213.704908545265)
[Thread 1] Processed 10900 zonotopes (Work Done: 82.2422%; Expected Zonos: 13253.536061003835)
[Thread 1] Processed 11000 zonotopes (Work Done: 82.66411%; Expected Zonos: 13306.863437302432)
[Thread 1] Processed 11100 zonotopes (Work Done: 83.10585%; Expected Zonos: 13356.460430465857)
[Thread 1] Processed 11200 zonotopes (Work Done: 83.48007%; Expected Zonos: 13416.375583765159)
[Thread 1] Processed 11300 zonotopes (Work Done: 83.79364%; Expected Zonos: 13485.510334152781)
[Thread 1] Processed 11400 zonotopes (Work Done: 84.18655%; Expected Zonos: 13541.35484163306)
[Thread 1] Processed 11500 zonotopes (Work Done: 84.54857%; Expected Zonos: 13601.649529189357)
[Thread 1] Processed 11600 zonotopes (Work Done: 85.21729%; Expected Zonos: 13612.261853602637)
[Thread 1] Processed 11700 zonotopes (Work Done: 85.60562%; Expected Zonos: 13667.326767969342)
[Thread 1] Processed 11800 zonotopes (Work Done: 85.83794%; Expected Zonos: 13746.835600549288)
[Thread 1] Processed 11900 zonotopes (Work Done: 86.07941%; Expected Zonos: 13824.444720188609)
[Thread 1] Processed 12000 zonotopes (Work Done: 86.50589%; Expected Zonos: 13871.887815848657)
[Thread 1] Processed 12100 zonotopes (Work Done: 86.83624%; Expected Zonos: 13934.274016412166)
[Thread 1] Processed 12200 zonotopes (Work Done: 87.15019%; Expected Zonos: 13998.821670409132)
[Thread 1] Processed 12300 zonotopes (Work Done: 87.63733%; Expected Zonos: 14035.115088623463)
[Thread 1] Processed 12400 zonotopes (Work Done: 88.04474%; Expected Zonos: 14083.748981820072)
[Thread 1] Processed 12500 zonotopes (Work Done: 88.59596%; Expected Zonos: 14108.995087169375)
[Thread 1] Processed 12600 zonotopes (Work Done: 89.04839%; Expected Zonos: 14149.610812431727)
[Thread 1] Processed 12700 zonotopes (Work Done: 89.5031%; Expected Zonos: 14189.4530467508)
[Thread 1] Processed 12800 zonotopes (Work Done: 89.85062%; Expected Zonos: 14245.867758068762)
[Thread 1] Processed 12900 zonotopes (Work Done: 90.13996%; Expected Zonos: 14311.07781960376)
[Thread 1] Processed 13000 zonotopes (Work Done: 90.74612%; Expected Zonos: 14325.681893179702)
[Thread 1] Processed 13100 zonotopes (Work Done: 91.24947%; Expected Zonos: 14356.2484061788)
[Thread 1] Processed 13200 zonotopes (Work Done: 91.67328%; Expected Zonos: 14398.96136753275)
[Thread 1] Processed 13300 zonotopes (Work Done: 91.97655%; Expected Zonos: 14460.207954012882)
[Thread 1] Processed 13400 zonotopes (Work Done: 92.44747%; Expected Zonos: 14494.71766548172)
[Thread 1] Processed 13500 zonotopes (Work Done: 92.74769%; Expected Zonos: 14555.61884980412)
[Thread 1] Processed 13600 zonotopes (Work Done: 92.96017%; Expected Zonos: 14629.922093483716)
[Thread 1] Processed 13700 zonotopes (Work Done: 93.26725%; Expected Zonos: 14688.971735560513)
[Thread 1] Processed 13800 zonotopes (Work Done: 93.49117%; Expected Zonos: 14760.751831533591)
[Thread 1] Processed 13900 zonotopes (Work Done: 93.75296%; Expected Zonos: 14826.199124986902)
[Thread 1] Processed 14000 zonotopes (Work Done: 93.98203%; Expected Zonos: 14896.46494627453)
[Thread 1] Processed 14100 zonotopes (Work Done: 94.26899%; Expected Zonos: 14957.198613631812)
[Thread 1] Processed 14200 zonotopes (Work Done: 94.50254%; Expected Zonos: 15026.050451545063)
[Thread 1] Processed 14300 zonotopes (Work Done: 94.74936%; Expected Zonos: 15092.450974767467)
[Thread 1] Processed 14400 zonotopes (Work Done: 95.17164%; Expected Zonos: 15130.557434412849)
[Thread 1] Processed 14500 zonotopes (Work Done: 95.469%; Expected Zonos: 15188.176591929596)
[Thread 1] Processed 14600 zonotopes (Work Done: 95.75701%; Expected Zonos: 15246.925907667179)
[Thread 1] Processed 14700 zonotopes (Work Done: 95.98913%; Expected Zonos: 15314.233710441631)
[Thread 1] Processed 14800 zonotopes (Work Done: 96.43087%; Expected Zonos: 15347.781686414788)
[Thread 1] Processed 14900 zonotopes (Work Done: 96.70305%; Expected Zonos: 15407.993451708819)
[Thread 1] Processed 15000 zonotopes (Work Done: 96.99144%; Expected Zonos: 15465.28171763047)
[Thread 1] Processed 15100 zonotopes (Work Done: 97.19152%; Expected Zonos: 15536.334136962321)
[Thread 1] Processed 15200 zonotopes (Work Done: 97.47248%; Expected Zonos: 15594.145623649192)
[Thread 1] Processed 15300 zonotopes (Work Done: 97.73245%; Expected Zonos: 15654.98483117177)
[Thread 1] Processed 15400 zonotopes (Work Done: 97.95465%; Expected Zonos: 15721.56019351026)
[Thread 1] Processed 15500 zonotopes (Work Done: 98.17266%; Expected Zonos: 15788.50900754312)
[Thread 1] Processed 15600 zonotopes (Work Done: 98.40288%; Expected Zonos: 15853.19427928465)
[Thread 1] Processed 15700 zonotopes (Work Done: 98.58494%; Expected Zonos: 15925.353619582525)
[Thread 1] Processed 15800 zonotopes (Work Done: 98.83862%; Expected Zonos: 15985.654931792613)
[Thread 1] Processed 15900 zonotopes (Work Done: 99.00455%; Expected Zonos: 16059.867185287505)
[Thread 1] Processed 16000 zonotopes (Work Done: 99.39213%; Expected Zonos: 16097.854350692092)
[Thread 1] Processed 16100 zonotopes (Work Done: 99.66087%; Expected Zonos: 16154.785171575664)
[Thread 1] Processed 16200 zonotopes (Work Done: 99.90311%; Expected Zonos: 16215.711940127534)
[Thread 1] Total splits: 8113
Processed 16227 zonotopes (Work Done: 100.0%); Generated 16226 (0.0019778098405743515s/loop)
[Thread 1] Finished in 32.09s
 ────────────────────────────────────────────────────────────────────────────────
                                        Time                    Allocations      
                               ───────────────────────   ────────────────────────
       Tot / % measured:            32.1s / 100.0%           9.37GiB / 100.0%    

 Section               ncalls     time    %tot     avg     alloc    %tot      avg
 ────────────────────────────────────────────────────────────────────────────────
 Verify                     1    32.1s  100.0%   32.1s   9.37GiB  100.0%  9.37GiB
   Zonotope Loop            1    32.1s  100.0%   32.1s   9.37GiB  100.0%  9.37GiB
     Property Check     16.2k    30.0s   93.5%  1.85ms   6.49GiB   69.2%   419KiB
     Zonotope Propa...  16.2k    1.89s    5.9%   116μs   2.75GiB   29.4%   178KiB
       DiffZonotope...  32.5k    1.37s    4.3%  42.3μs   2.32GiB   24.8%  75.1KiB
         Zonotope_R...  64.9k    1.27s    4.0%  19.6μs   2.20GiB   23.5%  35.5KiB
           Column M...  64.9k    375ms    1.2%  5.78μs    783MiB    8.2%  12.4KiB
           Influenc...  64.9k    357ms    1.1%  5.49μs    514MiB    5.4%  8.11KiB
             Multiply   64.9k    276ms    0.9%  4.25μs    371MiB    3.9%  5.86KiB
             Alloca...  64.9k   34.9ms    0.1%   537ns    143MiB    1.5%  2.25KiB
             Set Ma...  64.9k   14.6ms    0.0%   225ns     0.00B    0.0%    0.00B
           Set Matrix   64.9k    206ms    0.6%  3.17μs   49.6MiB    0.5%     802B
           Vectors      64.9k    147ms    0.5%  2.27μs    130MiB    1.4%  2.05KiB
           Allocation   64.9k   93.6ms    0.3%  1.44μs    774MiB    8.1%  12.2KiB
           Bounds       64.9k   11.7ms    0.0%   180ns     0.00B    0.0%    0.00B
       DiffZonotope...  48.7k    455ms    1.4%  9.34μs    433MiB    4.5%  9.10KiB
         Zonotope_D...  97.4k    439ms    1.4%  4.51μs    430MiB    4.5%  4.52KiB
     Compute Split      8.11k    119ms    0.4%  14.7μs   95.9MiB    1.0%  12.1KiB
 Initialize                 1   32.2μs    0.0%  32.2μs   20.8KiB    0.0%  20.8KiB
 ────────────────────────────────────────────────────────────────────────────────[VERYDIFF_TIMER] 32.095333887
[VERYDIFF_EXPERIMENT] Sigma: 2.0
Parsing new_benchmarks/rice-1/nets/2_40.onnx...
Found input onnx::Gemm_0
op: gemm, weight: (40, 7), bias: (40,)
op: relu, weight: nothing, bias: nothing
op: gemm, weight: (40, 40), bias: (40,)
op: relu, weight: nothing, bias: nothing
op: gemm, weight: (2, 40), bias: (2,)
Parsing new_benchmarks/rice-1/nets_pruned/2_40-0.4.onnx...
Found input onnx::Gemm_0
op: gemm, weight: (40, 7), bias: (40,)
op: relu, weight: nothing, bias: nothing
op: gemm, weight: (40, 40), bias: (40,)
op: relu, weight: nothing, bias: nothing
op: gemm, weight: (2, 40), bias: (2,)
Distance: 22.95577340584714
Distance: 54.537872249611866
Distance: 0.0
Running with 1 threads
[Thread 1] Time to first task: 0.0s
Zono Bounds:
[0.0, 0.0, 0.0, 0.0, 0.0, 0.0, 0.0]
[0.0, 0.0, 0.0, 0.0, 0.0, 0.0, 0.0]
[TOP-1] required confidence (0.9999999999999922≥0.99999) is feasible for index 1
[Thread 1] Processed 100 zonotopes (Work Done: 0.0%; Expected Zonos: Inf)
[Thread 1] Processed 200 zonotopes (Work Done: 0.0%; Expected Zonos: Inf)
[Thread 1] Processed 300 zonotopes (Work Done: 0.0%; Expected Zonos: Inf)
[Thread 1] Processed 400 zonotopes (Work Done: 0.0%; Expected Zonos: Inf)
[Thread 1] Processed 500 zonotopes (Work Done: 0.0%; Expected Zonos: Inf)
Found cex
N1 Probability: 0.9999901030722946 >= 0.99999

Found counterexample: ([1.0, 1.0, 1.0, -1.0, -1.5, 1.5, 1.0], (1, 2))
[Thread 1] Total splits: 592
Processed 593 zonotopes (Work Done: 0.0%); Generated 1184 (0.002494158259696459s/loop)
[Thread 1] Finished in 1.48s
 ────────────────────────────────────────────────────────────────────────────────
                                        Time                    Allocations      
                               ───────────────────────   ────────────────────────
       Tot / % measured:            1.48s / 100.0%            443MiB / 100.0%    

 Section               ncalls     time    %tot     avg     alloc    %tot      avg
 ────────────────────────────────────────────────────────────────────────────────
 Verify                     1    1.48s  100.0%   1.48s    443MiB  100.0%   443MiB
   Zonotope Loop            1    1.48s  100.0%   1.48s    443MiB  100.0%   443MiB
     Property Check       593    1.34s   90.3%  2.25ms    294MiB   66.3%   507KiB
     Zonotope Propa...    593    132ms    8.9%   222μs    140MiB   31.5%   241KiB
       DiffZonotope...  1.19k    116ms    7.8%  97.4μs    119MiB   26.9%   103KiB
         Zonotope_R...  2.37k    112ms    7.6%  47.2μs    115MiB   25.9%  49.5KiB
           Influenc...  2.37k   48.3ms    3.3%  20.4μs   28.9MiB    6.5%  12.5KiB
             Multiply   2.37k   45.1ms    3.0%  19.0μs   21.8MiB    4.9%  9.39KiB
             Alloca...  2.37k   1.32ms    0.1%   556ns   7.16MiB    1.6%  3.09KiB
             Set Ma...  2.37k    593μs    0.0%   250ns     0.00B    0.0%    0.00B
           Column M...  2.37k   12.3ms    0.8%  5.21μs   39.5MiB    8.9%  17.1KiB
           Set Matrix   2.37k   7.00ms    0.5%  2.95μs   2.37MiB    0.5%  1.02KiB
           Vectors      2.37k   4.04ms    0.3%  1.70μs   4.74MiB    1.1%  2.05KiB
           Allocation   2.37k   3.35ms    0.2%  1.41μs   39.1MiB    8.8%  16.9KiB
           Bounds       2.37k    429μs    0.0%   181ns     0.00B    0.0%    0.00B
       DiffZonotope...  1.78k   13.7ms    0.9%  7.71μs   20.1MiB    4.5%  11.6KiB
         Zonotope_D...  3.56k   13.1ms    0.9%  3.69μs   20.0MiB    4.5%  5.77KiB
     Compute Split        592   8.55ms    0.6%  14.4μs   8.33MiB    1.9%  14.4KiB
 Initialize                 1   31.6μs    0.0%  31.6μs   20.8KiB    0.0%  20.8KiB
 ────────────────────────────────────────────────────────────────────────────────[VERYDIFF_TIMER] 1.480584144
[VERYDIFF_EXPERIMENT] Sigma: 3.0
Parsing new_benchmarks/rice-1/nets/2_40.onnx...
Found input onnx::Gemm_0
op: gemm, weight: (40, 7), bias: (40,)
op: relu, weight: nothing, bias: nothing
op: gemm, weight: (40, 40), bias: (40,)
op: relu, weight: nothing, bias: nothing
op: gemm, weight: (2, 40), bias: (2,)
Parsing new_benchmarks/rice-1/nets_pruned/2_40-0.4.onnx...
Found input onnx::Gemm_0
op: gemm, weight: (40, 7), bias: (40,)
op: relu, weight: nothing, bias: nothing
op: gemm, weight: (40, 40), bias: (40,)
op: relu, weight: nothing, bias: nothing
op: gemm, weight: (2, 40), bias: (2,)
Distance: 22.95577340584714
Distance: 54.537872249611866
Distance: 0.0
Running with 1 threads
[Thread 1] Time to first task: 0.0s
Zono Bounds:
[0.0, 0.0, 0.0, 0.0, 0.0, 0.0, 0.0]
[0.0, 0.0, 0.0, 0.0, 0.0, 0.0, 0.0]
[TOP-1] required confidence (1.0≥0.99999) is feasible for index 1
Found cex
N1: 0.9999905037689845 (vs. 9.49623101549792e-6)
N2: 9.49623101549792e-6
N1 Probability: 0.9999905037689845 >= 0.99999

Found counterexample: ([3.0, 0.0, 0.0, -3.0, 3.0, 0.0, -3.0], (1, 2))
[Thread 1] Total splits: 24
Processed 25 zonotopes (Work Done: 0.0%); Generated 48 (0.00233339028s/loop)
[Thread 1] Finished in 0.06s
 ────────────────────────────────────────────────────────────────────────────────
                                        Time                    Allocations      
                               ───────────────────────   ────────────────────────
       Tot / % measured:           58.4ms / 100.0%           19.0MiB / 100.0%    

 Section               ncalls     time    %tot     avg     alloc    %tot      avg
 ────────────────────────────────────────────────────────────────────────────────
 Verify                     1   58.4ms   99.9%  58.4ms   18.9MiB   99.9%  18.9MiB
   Zonotope Loop            1   58.3ms   99.9%  58.3ms   18.9MiB   99.9%  18.9MiB
     Property Check        25   55.3ms   94.8%  2.21ms   12.5MiB   65.9%   512KiB
     Zonotope Propa...     25   2.52ms    4.3%   101μs   6.03MiB   31.8%   247KiB
       DiffZonotope...     50   1.78ms    3.1%  35.7μs   5.15MiB   27.2%   106KiB
         Zonotope_R...    100   1.64ms    2.8%  16.4μs   4.96MiB   26.1%  50.7KiB
           Influenc...    100    527μs    0.9%  5.27μs   1.26MiB    6.6%  12.9KiB
             Multiply     100    399μs    0.7%  3.99μs    968KiB    5.0%  9.68KiB
             Alloca...    100   52.9μs    0.1%   529ns    316KiB    1.6%  3.16KiB
             Set Ma...    100   24.9μs    0.0%   249ns     0.00B    0.0%    0.00B
           Column M...    100    456μs    0.8%  4.56μs   1.70MiB    9.0%  17.4KiB
           Set Matrix     100    283μs    0.5%  2.83μs    105KiB    0.5%  1.05KiB
           Vectors        100    165μs    0.3%  1.65μs    205KiB    1.1%  2.05KiB
           Allocation     100    110μs    0.2%  1.10μs   1.69MiB    8.9%  17.3KiB
           Bounds         100   17.6μs    0.0%   176ns     0.00B    0.0%    0.00B
       DiffZonotope...     75    639μs    1.1%  8.51μs    888KiB    4.6%  11.8KiB
         Zonotope_D...    150    616μs    1.1%  4.10μs    883KiB    4.5%  5.89KiB
     Compute Split         24    342μs    0.6%  14.3μs    351KiB    1.8%  14.6KiB
 Initialize                 1   32.8μs    0.1%  32.8μs   20.8KiB    0.1%  20.8KiB
 ────────────────────────────────────────────────────────────────────────────────[VERYDIFF_TIMER] 0.059798756
