
[VERYDIFF_EXPERIMENT] Running on /home/i57/steuber/NeuroDiff/repos/VeryDiffExperiments/src/../benchmarks/mnist-prune/specs/mnist_63_local_18.vnnlib /home/i57/steuber/NeuroDiff/repos/VeryDiffExperiments/src/../benchmarks/mnist-prune/nets/mnist_relu_4_1024.onnx
Loading /home/i57/steuber/NeuroDiff/repos/VeryDiffExperiments/src/../benchmarks/mnist-prune/nets/mnist_relu_4_1024.onnx and /home/i57/steuber/NeuroDiff/repos/VeryDiffExperiments/src/../benchmarks/mnist-prune/nets_pruned/mnist_relu_4_1024_0.79-old.onnx
INPUT SHAPE: 784
Skipping 0 row
Skipping 0 row
Skipping 0 row
Skipping 0 row
Skipping 0 row
Skipping 0 row
Skipping 0 row
Skipping 0 row
Skipping 0 row
Skipping 0 row
Skipping 0 row
Skipping 0 row
Refined: 8 | Refine Limit: 6 | Wrong: 0 | Right: 1 | Total: 1 | Total Zonos Considered: 9 | Expected 32768 (0.0030517578125%)Skipping 0 row
Skipping 0 row
Skipping 0 row
Skipping 0 row
Skipping 0 row
Skipping 0 row
Skipping 0 row
Skipping 0 row
Skipping 0 row
Skipping 0 row
Skipping 0 row
Skipping 0 row
Skipping 0 row
Skipping 0 row
Skipping 0 row
Skipping 0 row
Skipping 0 row
Skipping 0 row
Skipping 0 row
Skipping 0 row
Refined: 9 | Refine Limit: 8 | Wrong: 0 | Right: 3 | Total: 3 | Total Zonos Considered: 12 | Expected 87381 (0.0034332406358361656%)Skipping 0 row
Skipping 0 row
Skipping 0 row
Skipping 0 row
Skipping 0 row
Skipping 0 row
Skipping 0 row
Skipping 0 row
Skipping 0 row
Skipping 0 row
Skipping 0 row
Skipping 0 row
Refined: 10 | Refine Limit: 7 | Wrong: 0 | Right: 4 | Total: 4 | Total Zonos Considered: 14 | Expected 95325 (0.004196170993968004%)UNKNOWN
TIMEOUT
Refined: 12 | Refine Limit: 7 | Wrong: 0 | Right: 4 | Total: 4 | Total Zonos Considered: 16 | Expected 95325 (0.004196170993968004%)

time: 123.368529172

[VERYDIFF_TIMER] 123.407211872

[VERYDIFF_EXPERIMENT] NETWORK: /home/i57/steuber/NeuroDiff/repos/VeryDiffExperiments/src/../benchmarks/mnist-prune/specs/mnist_63_local_18.vnnlib
[VERYDIFF_EXPERIMENT] TIME: 123.648548414
