
[VERYDIFF_EXPERIMENT] Running on /home/i57/steuber/NeuroDiff/repos/VeryDiffExperiments/src/../benchmarks/mnist-prune/specs/mnist_31_global_6.vnnlib /home/i57/steuber/NeuroDiff/repos/VeryDiffExperiments/src/../benchmarks/mnist-prune/nets/mnist_relu_2_512.onnx
Found input X
op: matmul, weight: (512, 784), bias: nothing
op: bias, weight: nothing, bias: (512,)
op: relu, weight: nothing, bias: nothing
op: matmul, weight: (512, 512), bias: nothing
op: bias, weight: nothing, bias: (512,)
op: relu, weight: nothing, bias: nothing
op: matmul, weight: (10, 512), bias: nothing
op: bias, weight: nothing, bias: (10,)
Found input X
op: matmul, weight: (512, 784), bias: nothing
op: bias, weight: nothing, bias: (512,)
op: relu, weight: nothing, bias: nothing
op: matmul, weight: (512, 512), bias: nothing
op: bias, weight: nothing, bias: (512,)
op: relu, weight: nothing, bias: nothing
op: matmul, weight: (10, 512), bias: nothing
op: bias, weight: nothing, bias: (10,)
Distance: 1085.5985166831802
Distance: 1719.8468985003963
Distance: 31.228482716001736
Running with 1 threads
[Thread 1] Time to first task: 0.01s
Zono Bounds:
[0.0, 0.0, 0.0, 0.0, 0.0, 0.0, 0.0, 0.0, 0.0, 0.0, 0.0, 0.0, 0.0, 0.0, 0.0, 0.0, 0.0, 0.0, 0.0, 0.0, 0.0, 0.0, 0.0, 0.0, 0.0, 0.0, 0.0, 0.0, 0.0, 0.0, 0.0, 0.0, 0.0, 0.0, 0.0, 0.0, 0.0, 0.0, 0.0, 0.0, 0.0, 0.0, 0.0, 0.0, 0.0, 0.0, 0.0, 0.0, 0.0, 0.0, 0.0, 0.0, 0.0, 0.0, 0.0, 0.0, 0.0, 0.0, 0.0, 0.0, 0.0, 0.0, 0.0, 0.0, 0.0, 0.0, 0.0, 0.0, 0.0, 0.0, 0.0, 0.0, 0.0, 0.0, 0.0, 0.0, 0.0, 0.0, 0.0, 0.0, 0.0, 0.0, 0.0, 0.0, 0.0, 0.0, 0.0, 0.0, 0.0, 0.0, 0.0, 0.0, 0.0, 0.0, 0.0, 0.0, 0.0, 0.0, 0.0, 0.0, 0.0, 0.0, 0.0, 0.0, 0.0, 0.0, 0.0, 0.0, 0.0, 0.0, 0.0, 0.0, 0.0, 0.0, 0.0, 0.0, 0.0, 0.0, 0.0, 0.0, 0.0, 0.0, 0.0, 0.0, 0.0, 0.0, 0.0, 0.0, 0.0, 0.0, 0.0, 0.0, 0.0, 0.0, 0.0, 0.0, 0.0, 0.0, 0.0, 0.0, 0.0, 0.0, 0.0, 0.0, 0.0, 0.0, 0.0, 0.0, 0.0, 0.0, 0.0, 0.0, 0.0, 0.0, 0.0, 0.0, 0.0, 0.0, 0.0, 0.0, 0.0, 0.0, 0.0, 0.0, 0.0, 0.0, 0.0, 0.0, 0.0, 0.0, 0.0, 0.0, 0.0, 0.0, 0.0, 0.0, 0.0, 0.0, 0.0, 0.0, 0.0, 0.0, 0.0, 0.0, 0.0, 0.0, 0.0, 0.0, 0.0, 0.0, 0.0, 0.0, 0.0, 0.0, 0.0, 0.0, 0.0, 0.0, 0.0, 0.0, 0.0, 0.0, 0.0, 0.0, 0.0, 0.0, 0.0, 0.0, 0.0, 0.0, 0.0, 0.0, 0.0, 0.0, 0.0, 0.0, 0.0, 0.0, 0.0, 0.0, 0.0, 0.0, 0.0, 0.0, 0.0, 0.0, 0.0, 0.0, 0.0, 0.0, 0.0, 0.0, 0.0, 0.0, 0.0, 0.0, 0.0, 0.0, 0.0, 0.0, 0.0, 0.0, 0.0, 0.0, 0.0, 0.0, 0.0, 0.0, 0.0, 0.0, 0.0, 0.0, 0.0, 0.0, 0.0, 0.0, 0.0, 0.0, 0.0, 0.0, 0.0, 0.0, 0.0, 0.0, 0.0, 0.0, 0.0, 0.0, 0.0, 0.0, 0.0, 0.0, 0.0, 0.0, 0.0, 0.0, 0.0, 0.0, 0.0, 0.0, 0.0, 0.0, 0.0, 0.0, 0.0, 0.0, 0.0, 0.0, 0.0, 0.0, 0.0, 0.0, 0.0, 0.0, 0.0, 0.0, 0.0, 0.0, 0.0, 0.0, 0.0, 0.0, 0.0, 0.0, 0.0, 0.0, 0.0, 0.0, 0.0, 0.0, 0.0, 0.0, 0.0, 0.0, 0.0, 0.0, 0.0, 0.0, 0.0, 0.0, 0.0, 0.0, 0.0, 0.0, 0.0, 0.0, 0.0, 0.0, 0.0, 0.0, 0.0, 0.0, 0.0, 0.0, 0.0, 0.0, 0.0, 0.0, 0.0, 0.0, 0.0, 0.0, 0.0, 0.0, 0.0, 0.0, 0.0, 0.0, 0.0, 0.0, 0.0, 0.0, 0.0, 0.0, 0.0, 0.0, 0.0, 0.0, 0.0, 0.0, 0.0, 0.0, 0.0, 0.0, 0.0, 0.0, 0.0, 0.0, 0.0, 0.0, 0.0, 0.0, 0.0, 0.0, 0.0, 0.0, 0.0, 0.0, 0.0, 0.0, 0.0, 0.0, 0.0, 0.0, 0.0, 0.0, 0.0, 0.0, 0.0, 0.0, 0.0, 0.0, 0.0, 0.0, 0.0, 0.0, 0.0, 0.0, 0.0, 0.0, 0.0, 0.0, 0.0, 0.0, 0.0, 0.0, 0.0, 0.0, 0.0, 0.0, 0.0, 0.0, 0.0, 0.0, 0.0, 0.0, 0.0, 0.0, 0.0, 0.0, 0.0, 0.0, 0.0, 0.0, 0.0, 0.0, 0.0, 0.0, 0.0, 0.0, 0.0, 0.0, 0.0, 0.0, 0.0, 0.0, 0.0, 0.0, 0.0, 0.0, 0.0, 0.0, 0.0, 0.0, 0.0, 0.0, 0.0, 0.0, 0.0, 0.0, 0.0, 0.0, 0.0, 0.0, 0.0, 0.0, 0.0, 0.0, 0.0, 0.0, 0.0, 0.0, 0.0, 0.0, 0.0, 0.0, 0.0, 0.0, 0.0, 0.0, 0.0, 0.0, 0.0, 0.0, 0.0, 0.0, 0.0, 0.0, 0.0, 0.0, 0.0, 0.0, 0.0, 0.0, 0.0, 0.0, 0.0, 0.0, 0.0, 0.0, 0.0, 0.0, 0.0, 0.0, 0.0, 0.0, 0.0, 0.0, 0.0, 0.0, 0.0, 0.0, 0.0, 0.0, 0.0, 0.0, 0.0, 0.0, 0.0, 0.0, 0.0, 0.0, 0.0, 0.0, 0.0, 0.0, 0.0, 0.0, 0.0, 0.0, 0.0, 0.0, 0.0, 0.0, 0.0, 0.0, 0.0, 0.0, 0.0, 0.0, 0.0, 0.0, 0.0, 0.0, 0.0, 0.0, 0.0, 0.0, 0.0, 0.0, 0.0, 0.0, 0.0, 0.0, 0.0, 0.0, 0.0, 0.0, 0.0, 0.0, 0.0, 0.0, 0.0, 0.0, 0.0, 0.0, 0.0, 0.0, 0.0, 0.0, 0.0, 0.0, 0.0, 0.0, 0.0, 0.0, 0.0, 0.0, 0.0, 0.0, 0.0, 0.0, 0.0, 0.0, 0.0, 0.0, 0.0, 0.0, 0.0, 0.0, 0.0, 0.0, 0.0, 0.0, 0.0, 0.0, 0.0, 0.0, 0.0, 0.0, 0.0, 0.0, 0.0, 0.0, 0.0, 0.0, 0.0, 0.0, 0.0, 0.0, 0.0, 0.0, 0.0, 0.0, 0.0, 0.0, 0.0, 0.0, 0.0, 0.0, 0.0, 0.0, 0.0, 0.0, 0.0, 0.0, 0.0, 0.0, 0.0, 0.0, 0.0, 0.0, 0.0, 0.0, 0.0, 0.0, 0.0, 0.0, 0.0, 0.0, 0.0, 0.0, 0.0, 0.0, 0.0, 0.0, 0.0, 0.0, 0.0, 0.0, 0.0, 0.0, 0.0, 0.0, 0.0, 0.0, 0.0, 0.0, 0.0, 0.0, 0.0, 0.0, 0.0, 0.0, 0.0, 0.0, 0.0, 0.0, 0.0, 0.0, 0.0, 0.0, 0.0, 0.0, 0.0, 0.0, 0.0, 0.0, 0.0, 0.0, 0.0, 0.0, 0.0, 0.0, 0.0, 0.0, 0.0, 0.0, 0.0, 0.0, 0.0, 0.0, 0.0, 0.0, 0.0, 0.0, 0.0, 0.0, 0.0, 0.0, 0.0, 0.0, 0.0, 0.0, 0.0, 0.0, 0.0, 0.0, 0.0, 0.0, 0.0, 0.0, 0.0, 0.0, 0.0, 0.0, 0.0, 0.0, 0.0, 0.0, 0.0, 0.0, 0.0, 0.0, 0.0, 0.0, 0.0, 0.0, 0.0, 0.0, 0.0, 0.0, 0.0, 0.0, 0.0, 0.0, 0.0, 0.0, 0.0, 0.0, 0.0, 0.0, 0.0, 0.0, 0.0, 0.0, 0.0, 0.0, 0.0, 0.0, 0.0, 0.0, 0.0, 0.0, 0.0, 0.0, 0.0, 0.0, 0.0, 0.0, 0.0, 0.0, 0.0, 0.0, 0.0, 0.0, 0.0, 0.0, 0.0, 0.0, 0.0, 0.0, 0.0, 0.0, 0.0, 0.0, 0.0, 0.0, 0.0, 0.0, 0.0, 0.0, 0.0, 0.0, 0.0, 0.0, 0.0, 0.0, 0.0, 0.0, 0.0, 0.0, 0.0, 0.0]
[0.0, 0.0, 0.0, 0.0, 0.0, 0.0, 0.0, 0.0, 0.0, 0.0, 0.0, 0.0, 0.0, 0.0, 0.0, 0.0, 0.0, 0.0, 0.0, 0.0, 0.0, 0.0, 0.0, 0.0, 0.0, 0.0, 0.0, 0.0, 0.0, 0.0, 0.0, 0.0, 0.0, 0.0, 0.0, 0.0, 0.0, 0.0, 0.0, 0.0, 0.0, 0.0, 0.0, 0.0, 0.0, 0.0, 0.0, 0.0, 0.0, 0.0, 0.0, 0.0, 0.0, 0.0, 0.0, 0.0, 0.0, 0.0, 0.0, 0.0, 0.0, 0.0, 0.0, 0.0, 0.0, 0.0, 0.0, 0.0, 0.0, 0.0, 0.0, 0.0, 0.0, 0.0, 0.0, 0.0, 0.0, 0.0, 0.0, 0.0, 0.0, 0.0, 0.0, 0.0, 0.0, 0.0, 0.0, 0.0, 0.0, 0.0, 0.0, 0.0, 0.0, 0.0, 0.0, 0.0, 0.0, 0.0, 0.0, 0.0, 0.0, 0.0, 0.0, 0.0, 0.0, 0.0, 0.0, 0.0, 0.0, 0.0, 0.0, 0.0, 0.0, 0.0, 0.0, 0.0, 0.0, 0.0, 0.0, 0.0, 0.0, 0.0, 0.0, 0.0, 0.0, 0.0, 0.0, 0.0, 0.0, 0.0, 0.0, 0.0, 0.0, 0.0, 0.0, 0.0, 0.0, 0.0, 0.0, 0.0, 0.0, 0.0, 0.0, 0.0, 0.0, 0.0, 0.0, 0.0, 0.0, 0.0, 0.0, 0.0, 0.0, 0.0, 0.0, 0.0, 0.0, 0.0, 0.0, 0.0, 0.0, 0.0, 0.0, 0.0, 0.0, 0.0, 0.0, 0.0, 0.0, 0.0, 0.0, 0.0, 0.0, 0.0, 0.0, 0.0, 0.0, 0.0, 0.0, 0.0, 0.0, 0.0, 0.0, 0.0, 0.0, 0.0, 0.0, 0.0, 0.0, 0.0, 0.0, 0.0, 0.0, 0.0, 0.0, 0.0, 0.0, 0.0, 0.0, 0.0, 0.0, 0.0, 0.0, 0.0, 0.0, 0.0, 0.0, 0.0, 0.0, 0.0, 0.0, 0.0, 0.0, 0.0, 0.0, 0.0, 0.0, 0.0, 0.0, 0.0, 0.0, 0.0, 0.0, 0.0, 0.0, 0.0, 0.0, 0.0, 0.0, 0.0, 0.0, 0.0, 0.0, 0.0, 0.0, 0.0, 0.0, 0.0, 0.0, 0.0, 0.0, 0.0, 0.0, 0.0, 0.0, 0.0, 0.0, 0.0, 0.0, 0.0, 0.0, 0.0, 0.0, 0.0, 0.0, 0.0, 0.0, 0.0, 0.0, 0.0, 0.0, 0.0, 0.0, 0.0, 0.0, 0.0, 0.0, 0.0, 0.0, 0.0, 0.0, 0.0, 0.0, 0.0, 0.0, 0.0, 0.0, 0.0, 0.0, 0.0, 0.0, 0.0, 0.0, 0.0, 0.0, 0.0, 0.0, 0.0, 0.0, 0.0, 0.0, 0.0, 0.0, 0.0, 0.0, 0.0, 0.0, 0.0, 0.0, 0.0, 0.0, 0.0, 0.0, 0.0, 0.0, 0.0, 0.0, 0.0, 0.0, 0.0, 0.0, 0.0, 0.0, 0.0, 0.0, 0.0, 0.0, 0.0, 0.0, 0.0, 0.0, 0.0, 0.0, 0.0, 0.0, 0.0, 0.0, 0.0, 0.0, 0.0, 0.0, 0.0, 0.0, 0.0, 0.0, 0.0, 0.0, 0.0, 0.0, 0.0, 0.0, 0.0, 0.0, 0.0, 0.0, 0.0, 0.0, 0.0, 0.0, 0.0, 0.0, 0.0, 0.0, 0.0, 0.0, 0.0, 0.0, 0.0, 0.0, 0.0, 0.0, 0.0, 0.0, 0.0, 0.0, 0.0, 0.0, 0.0, 0.0, 0.0, 0.0, 0.0, 0.0, 0.0, 0.0, 0.0, 0.0, 0.0, 0.0, 0.0, 0.0, 0.0, 0.0, 0.0, 0.0, 0.0, 0.0, 0.0, 0.0, 0.0, 0.0, 0.0, 0.0, 0.0, 0.0, 0.0, 0.0, 0.0, 0.0, 0.0, 0.0, 0.0, 0.0, 0.0, 0.0, 0.0, 0.0, 0.0, 0.0, 0.0, 0.0, 0.0, 0.0, 0.0, 0.0, 0.0, 0.0, 0.0, 0.0, 0.0, 0.0, 0.0, 0.0, 0.0, 0.0, 0.0, 0.0, 0.0, 0.0, 0.0, 0.0, 0.0, 0.0, 0.0, 0.0, 0.0, 0.0, 0.0, 0.0, 0.0, 0.0, 0.0, 0.0, 0.0, 0.0, 0.0, 0.0, 0.0, 0.0, 0.0, 0.0, 0.0, 0.0, 0.0, 0.0, 0.0, 0.0, 0.0, 0.0, 0.0, 0.0, 0.0, 0.0, 0.0, 0.0, 0.0, 0.0, 0.0, 0.0, 0.0, 0.0, 0.0, 0.0, 0.0, 0.0, 0.0, 0.0, 0.0, 0.0, 0.0, 0.0, 0.0, 0.0, 0.0, 0.0, 0.0, 0.0, 0.0, 0.0, 0.0, 0.0, 0.0, 0.0, 0.0, 0.0, 0.0, 0.0, 0.0, 0.0, 0.0, 0.0, 0.0, 0.0, 0.0, 0.0, 0.0, 0.0, 0.0, 0.0, 0.0, 0.0, 0.0, 0.0, 0.0, 0.0, 0.0, 0.0, 0.0, 0.0, 0.0, 0.0, 0.0, 0.0, 0.0, 0.0, 0.0, 0.0, 0.0, 0.0, 0.0, 0.0, 0.0, 0.0, 0.0, 0.0, 0.0, 0.0, 0.0, 0.0, 0.0, 0.0, 0.0, 0.0, 0.0, 0.0, 0.0, 0.0, 0.0, 0.0, 0.0, 0.0, 0.0, 0.0, 0.0, 0.0, 0.0, 0.0, 0.0, 0.0, 0.0, 0.0, 0.0, 0.0, 0.0, 0.0, 0.0, 0.0, 0.0, 0.0, 0.0, 0.0, 0.0, 0.0, 0.0, 0.0, 0.0, 0.0, 0.0, 0.0, 0.0, 0.0, 0.0, 0.0, 0.0, 0.0, 0.0, 0.0, 0.0, 0.0, 0.0, 0.0, 0.0, 0.0, 0.0, 0.0, 0.0, 0.0, 0.0, 0.0, 0.0, 0.0, 0.0, 0.0, 0.0, 0.0, 0.0, 0.0, 0.0, 0.0, 0.0, 0.0, 0.0, 0.0, 0.0, 0.0, 0.0, 0.0, 0.0, 0.0, 0.0, 0.0, 0.0, 0.0, 0.0, 0.0, 0.0, 0.0, 0.0, 0.0, 0.0, 0.0, 0.0, 0.0, 0.0, 0.0, 0.0, 0.0, 0.0, 0.0, 0.0, 0.0, 0.0, 0.0, 0.0, 0.0, 0.0, 0.0, 0.0, 0.0, 0.0, 0.0, 0.0, 0.0, 0.0, 0.0, 0.0, 0.0, 0.0, 0.0, 0.0, 0.0, 0.0, 0.0, 0.0, 0.0, 0.0, 0.0, 0.0, 0.0, 0.0, 0.0, 0.0, 0.0, 0.0, 0.0, 0.0, 0.0, 0.0, 0.0, 0.0, 0.0, 0.0, 0.0, 0.0, 0.0, 0.0, 0.0, 0.0, 0.0, 0.0, 0.0, 0.0, 0.0, 0.0, 0.0, 0.0, 0.0, 0.0, 0.0, 0.0, 0.0, 0.0, 0.0, 0.0, 0.0, 0.0, 0.0, 0.0, 0.0, 0.0, 0.0, 0.0, 0.0, 0.0, 0.0, 0.0, 0.0, 0.0, 0.0, 0.0, 0.0, 0.0, 0.0, 0.0, 0.0, 0.0, 0.0, 0.0, 0.0, 0.0, 0.0, 0.0, 0.0, 0.0, 0.0, 0.0, 0.0, 0.0, 0.0, 0.0, 0.0, 0.0, 0.0, 0.0, 0.0, 0.0, 0.0, 0.0, 0.0, 0.0, 0.0, 0.0, 0.0, 0.0, 0.0, 0.0, 0.0, 0.0, 0.0, 0.0, 0.0, 0.0, 0.0, 0.0, 0.0, 0.0, 0.0, 0.0, 0.0, 0.0, 0.0, 0.0, 0.0, 0.0, 0.0, 0.0, 0.0, 0.0, 0.0, 0.0, 0.0, 0.0, 0.0, 0.0]

Found counterexample: ([0.011764705, 0.011764705, 0.011764705, 0.011764705, 0.011764705, 0.011764705, 0.011764705, 0.011764705, 0.011764705, 0.011764705, 0.011764705, 0.011764705, 0.011764705, 0.011764705, 0.011764705, 0.011764705, 0.011764705, 0.011764705, 0.011764705, 0.011764705, 0.011764705, 0.011764705, 0.011764705, 0.011764705, 0.011764705, 0.011764705, 0.011764705, 0.011764705, 0.011764705, 0.011764705, 0.011764705, 0.011764705, 0.011764705, 0.011764705, 0.011764705, 0.011764705, 0.011764705, 0.011764705, 0.011764705, 0.011764705, 0.011764705, 0.011764705, 0.011764705, 0.011764705, 0.011764705, 0.011764705, 0.011764705, 0.011764705, 0.011764705, 0.011764705, 0.011764705, 0.011764705, 0.011764705, 0.011764705, 0.011764705, 0.011764705, 0.011764705, 0.011764705, 0.011764705, 0.011764705, 0.011764705, 0.011764705, 0.011764705, 0.011764705, 0.011764705, 0.011764705, 0.011764705, 0.011764705, 0.011764705, 0.011764705, 0.011764705, 0.011764705, 0.011764705, 0.011764705, 0.011764705, 0.011764705, 0.011764705, 0.011764705, 0.011764705, 0.011764705, 0.011764705, 0.011764705, 0.011764705, 0.011764705, 0.011764705, 0.011764705, 0.011764705, 0.011764705, 0.011764705, 0.011764705, 0.011764705, 0.011764705, 0.011764705, 0.011764705, 0.011764705, 0.011764705, 0.011764705, 0.011764705, 0.011764705, 0.011764705, 0.011764705, 0.011764705, 0.011764705, 0.011764705, 0.011764705, 0.011764705, 0.011764705, 0.011764705, 0.011764705, 0.011764705, 0.011764705, 0.011764705, 0.011764705, 0.011764705, 0.011764705, 0.011764705, 0.011764705, 0.011764705, 0.011764705, 0.011764705, 0.011764705, 0.011764705, 0.011764705, 0.011764705, 0.011764705, 0.011764705, 0.011764705, 0.011764705, 0.011764705, 0.011764705, 0.011764705, 0.011764705, 0.011764705, 0.011764705, 0.011764705, 0.011764705, 0.011764705, 0.011764705, 0.011764705, 0.011764705, 0.011764705, 0.011764705, 0.011764705, 0.011764705, 0.011764705, 0.011764705, 0.011764705, 0.011764705, 0.011764705, 0.011764705, 0.011764705, 0.011764705, 0.79607844, 0.75686276, 0.117647065, 0.011764705, 0.011764705, 0.011764705, 0.011764705, 0.011764705, 0.011764705, 0.011764705, 0.011764705, 0.011764705, 0.011764705, 0.011764705, 0.011764705, 0.011764705, 0.011764705, 0.011764705, 0.011764705, 0.011764705, 0.011764705, 0.011764705, 0.011764705, 0.011764705, 0.011764705, 0.011764705, 0.011764705, 0.011764705, 0.79607844, 0.984313725, 0.513725505, 0.011764705, 0.011764705, 0.011764705, 0.011764705, 0.011764705, 0.011764705, 0.011764705, 0.011764705, 0.011764705, 0.011764705, 0.011764705, 0.011764705, 0.011764705, 0.011764705, 0.011764705, 0.011764705, 0.011764705, 0.011764705, 0.011764705, 0.011764705, 0.011764705, 0.011764705, 0.011764705, 0.011764705, 0.011764705, 0.40000000999999996, 0.98627451, 0.59215689, 0.011764705, 0.011764705, 0.011764705, 0.011764705, 0.011764705, 0.011764705, 0.011764705, 0.011764705, 0.011764705, 0.011764705, 0.011764705, 0.011764705, 0.011764705, 0.011764705, 0.011764705, 0.011764705, 0.011764705, 0.011764705, 0.011764705, 0.011764705, 0.011764705, 0.011764705, 0.011764705, 0.011764705, 0.011764705, 0.40000000999999996, 0.984313725, 0.59215689, 0.011764705, 0.011764705, 0.011764705, 0.011764705, 0.011764705, 0.011764705, 0.011764705, 0.011764705, 0.011764705, 0.011764705, 0.011764705, 0.011764705, 0.011764705, 0.011764705, 0.011764705, 0.011764705, 0.011764705, 0.011764705, 0.011764705, 0.011764705, 0.011764705, 0.011764705, 0.011764705, 0.011764705, 0.011764705, 0.16078432, 0.98627451, 0.984313725, 0.011764705, 0.011764705, 0.011764705, 0.011764705, 0.011764705, 0.011764705, 0.011764705, 0.011764705, 0.011764705, 0.011764705, 0.011764705, 0.011764705, 0.011764705, 0.011764705, 0.011764705, 0.011764705, 0.011764705, 0.011764705, 0.011764705, 0.011764705, 0.011764705, 0.011764705, 0.011764705, 0.011764705, 0.011764705, 0.011764705, 0.984313725, 0.98235294, 0.32156863999999996, 0.011764705, 0.011764705, 0.011764705, 0.011764705, 0.011764705, 0.011764705, 0.011764705, 0.011764705, 0.011764705, 0.011764705, 0.011764705, 0.011764705, 0.011764705, 0.011764705, 0.011764705, 0.011764705, 0.011764705, 0.011764705, 0.011764705, 0.011764705, 0.011764705, 0.011764705, 0.011764705, 0.011764705, 0.011764705, 0.59607846, 0.984313725, 0.79607844, 0.011764705, 0.011764705, 0.011764705, 0.011764705, 0.011764705, 0.011764705, 0.011764705, 0.011764705, 0.011764705, 0.011764705, 0.011764705, 0.011764705, 0.011764705, 0.011764705, 0.011764705, 0.011764705, 0.011764705, 0.011764705, 0.011764705, 0.011764705, 0.011764705, 0.011764705, 0.011764705, 0.011764705, 0.011764705, 0.59607846, 0.98235294, 0.79607844, 0.011764705, 0.011764705, 0.011764705, 0.011764705, 0.011764705, 0.011764705, 0.011764705, 0.011764705, 0.011764705, 0.011764705, 0.011764705, 0.011764705, 0.011764705, 0.011764705, 0.011764705, 0.011764705, 0.011764705, 0.011764705, 0.011764705, 0.011764705, 0.011764705, 0.011764705, 0.011764705, 0.011764705, 0.011764705, 0.36078432000000005, 0.984313725, 0.8392157, 0.03921569, 0.011764705, 0.011764705, 0.011764705, 0.011764705, 0.011764705, 0.011764705, 0.011764705, 0.011764705, 0.011764705, 0.011764705, 0.011764705, 0.011764705, 0.011764705, 0.011764705, 0.011764705, 0.011764705, 0.011764705, 0.011764705, 0.011764705, 0.011764705, 0.011764705, 0.011764705, 0.011764705, 0.011764705, 0.03921569, 0.8313725599999999, 0.984313725, 0.19607843, 0.011764705, 0.011764705, 0.011764705, 0.011764705, 0.011764705, 0.011764705, 0.011764705, 0.011764705, 0.011764705, 0.011764705, 0.011764705, 0.011764705, 0.011764705, 0.011764705, 0.011764705, 0.011764705, 0.011764705, 0.011764705, 0.011764705, 0.011764705, 0.011764705, 0.011764705, 0.011764705, 0.011764705, 0.011764705, 0.79607844, 0.98627451, 0.43921569000000005, 0.011764705, 0.011764705, 0.011764705, 0.011764705, 0.011764705, 0.011764705, 0.011764705, 0.011764705, 0.011764705, 0.011764705, 0.011764705, 0.011764705, 0.011764705, 0.011764705, 0.011764705, 0.011764705, 0.011764705, 0.011764705, 0.011764705, 0.011764705, 0.011764705, 0.011764705, 0.011764705, 0.011764705, 0.011764705, 0.6352941400000001, 0.984313725, 0.59215689, 0.011764705, 0.011764705, 0.011764705, 0.011764705, 0.011764705, 0.011764705, 0.011764705, 0.011764705, 0.011764705, 0.011764705, 0.011764705, 0.011764705, 0.011764705, 0.011764705, 0.011764705, 0.011764705, 0.011764705, 0.011764705, 0.011764705, 0.011764705, 0.011764705, 0.011764705, 0.011764705, 0.011764705, 0.011764705, 0.40000000999999996, 0.98627451, 0.59215689, 0.011764705, 0.011764705, 0.011764705, 0.011764705, 0.011764705, 0.011764705, 0.011764705, 0.011764705, 0.011764705, 0.011764705, 0.011764705, 0.011764705, 0.011764705, 0.011764705, 0.011764705, 0.011764705, 0.011764705, 0.011764705, 0.011764705, 0.011764705, 0.011764705, 0.011764705, 0.011764705, 0.011764705, 0.011764705, 0.40000000999999996, 0.984313725, 0.75294119, 0.011764705, 0.011764705, 0.011764705, 0.011764705, 0.011764705, 0.011764705, 0.011764705, 0.011764705, 0.011764705, 0.011764705, 0.011764705, 0.011764705, 0.011764705, 0.011764705, 0.011764705, 0.011764705, 0.011764705, 0.011764705, 0.011764705, 0.011764705, 0.011764705, 0.011764705, 0.011764705, 0.011764705, 0.011764705, 0.40000000999999996, 0.98627451, 0.984313725, 0.011764705, 0.011764705, 0.011764705, 0.011764705, 0.011764705, 0.011764705, 0.011764705, 0.011764705, 0.011764705, 0.011764705, 0.011764705, 0.011764705, 0.011764705, 0.011764705, 0.011764705, 0.011764705, 0.011764705, 0.011764705, 0.011764705, 0.011764705, 0.011764705, 0.011764705, 0.011764705, 0.011764705, 0.011764705, 0.40000000999999996, 0.984313725, 0.98235294, 0.011764705, 0.011764705, 0.011764705, 0.011764705, 0.011764705, 0.011764705, 0.011764705, 0.011764705, 0.011764705, 0.011764705, 0.011764705, 0.011764705, 0.011764705, 0.011764705, 0.011764705, 0.011764705, 0.011764705, 0.011764705, 0.011764705, 0.011764705, 0.011764705, 0.011764705, 0.011764705, 0.011764705, 0.011764705, 0.16078432, 0.988235295, 0.984313725, 0.011764705, 0.011764705, 0.011764705, 0.011764705, 0.011764705, 0.011764705, 0.011764705, 0.011764705, 0.011764705, 0.011764705, 0.011764705, 0.011764705, 0.011764705, 0.011764705, 0.011764705, 0.011764705, 0.011764705, 0.011764705, 0.011764705, 0.011764705, 0.011764705, 0.011764705, 0.011764705, 0.011764705, 0.011764705, 0.011764705, 0.984313725, 0.98235294, 0.011764705, 0.011764705, 0.011764705, 0.011764705, 0.011764705, 0.011764705, 0.011764705, 0.011764705, 0.011764705, 0.011764705, 0.011764705, 0.011764705, 0.011764705, 0.011764705, 0.011764705, 0.011764705, 0.011764705, 0.011764705, 0.011764705, 0.011764705, 0.011764705, 0.011764705, 0.011764705, 0.011764705, 0.011764705, 0.011764705, 0.6784313900000001, 0.984313725, 0.24313726, 0.011764705, 0.011764705, 0.011764705, 0.011764705, 0.011764705, 0.011764705, 0.011764705, 0.011764705, 0.011764705, 0.011764705, 0.011764705, 0.011764705, 0.011764705, 0.011764705, 0.011764705, 0.011764705, 0.011764705, 0.011764705, 0.011764705, 0.011764705, 0.011764705, 0.011764705, 0.011764705, 0.011764705, 0.011764705, 0.2, 0.98235294, 0.40000000999999996, 0.011764705, 0.011764705, 0.011764705, 0.011764705, 0.011764705, 0.011764705, 0.011764705, 0.011764705, 0.011764705, 0.011764705, 0.011764705, 0.011764705, 0.011764705, 0.011764705, 0.011764705, 0.011764705, 0.011764705, 0.011764705, 0.011764705, 0.011764705, 0.011764705, 0.011764705, 0.011764705, 0.011764705, 0.011764705, 0.011764705, 0.011764705, 0.011764705, 0.011764705, 0.011764705, 0.011764705, 0.011764705, 0.011764705, 0.011764705, 0.011764705, 0.011764705, 0.011764705, 0.011764705, 0.011764705, 0.011764705, 0.011764705, 0.011764705, 0.011764705, 0.011764705, 0.011764705, 0.011764705, 0.011764705, 0.011764705, 0.011764705, 0.011764705, 0.011764705, 0.011764705, 0.011764705, 0.011764705, 0.011764705, 0.011764705, 0.011764705, 0.011764705, 0.011764705, 0.011764705, 0.011764705, 0.011764705, 0.011764705, 0.011764705, 0.011764705, 0.011764705, 0.011764705, 0.011764705, 0.011764705, 0.011764705, 0.011764705, 0.011764705, 0.011764705, 0.011764705, 0.011764705, 0.011764705, 0.011764705, 0.011764705, 0.011764705, 0.011764705, 0.011764705, 0.011764705, 0.011764705, 0.011764705, 0.011764705, 0.011764705, 0.011764705, 0.011764705, 0.011764705, 0.011764705, 0.011764705, 0.011764705, 0.011764705, 0.011764705], ([-59.9439364477606, 9.6470596032006, -35.960577555539274, -38.68736270855427, -26.929484980238282, -29.892742692314165, -37.13527970362769, -27.084150975316522, -27.799920075543, -29.631418152270122], [-58.70335374820912, 8.900077044233157, -35.767573808725686, -37.70350076581559, -24.63156878455501, -28.77924017581673, -35.78964182041383, -25.51842910733121, -29.470890153554535, -29.138732582471828], 2.297916195683271))
[Thread 1] Total splits: 0
Processed 1 zonotopes (Work Done: 0.0%); Generated 0 (0.474175949s/loop)
[Thread 1] Finished in 0.47s
 ────────────────────────────────────────────────────────────────────────────────
                                        Time                    Allocations      
                               ───────────────────────   ────────────────────────
       Tot / % measured:            476ms / 100.0%            158MiB / 100.0%    

 Section               ncalls     time    %tot     avg     alloc    %tot      avg
 ────────────────────────────────────────────────────────────────────────────────
 Verify                     1    474ms   99.5%   474ms    148MiB   93.8%   148MiB
   Zonotope Loop            1    474ms   99.5%   474ms    148MiB   93.8%   148MiB
     Zonotope Propa...      1    462ms   97.0%   462ms    127MiB   80.2%   127MiB
       DiffZonotope...      2    403ms   84.6%   201ms    112MiB   71.0%  56.2MiB
         Zonotope_R...      4    402ms   84.4%   101ms    112MiB   71.0%  28.1MiB
           Column M...      4    245ms   51.4%  61.2ms   20.0MiB   12.7%  5.00MiB
           Influenc...      4    150ms   31.5%  37.5ms   72.1MiB   45.6%  18.0MiB
             Multiply       4    132ms   27.8%  33.1ms   41.4MiB   26.2%  10.4MiB
             Alloca...      4   13.8ms    2.9%  3.44ms   30.6MiB   19.4%  7.66MiB
             Set Ma...      4   3.86ms    0.8%   965μs     0.00B    0.0%    0.00B
           Allocation       4   4.10ms    0.9%  1.02ms   20.0MiB   12.7%  5.00MiB
           Set Matrix       4   2.90ms    0.6%   725μs   38.6KiB    0.0%  9.64KiB
           Vectors          4    130μs    0.0%  32.5μs    100KiB    0.1%  25.0KiB
           Bounds           4   2.28μs    0.0%   569ns     0.00B    0.0%    0.00B
       DiffZonotope...      3   58.9ms   12.4%  19.6ms   14.5MiB    9.2%  4.83MiB
         Zonotope_D...      6   58.9ms   12.4%  9.82ms   14.5MiB    9.2%  2.42MiB
     Property Check         1   1.67ms    0.4%  1.67ms    402KiB    0.2%   402KiB
 Initialize                 1   2.15ms    0.5%  2.15ms   9.84MiB    6.2%  9.84MiB
 ────────────────────────────────────────────────────────────────────────────────
[VERYDIFF_TIMER] 0.508259898

[VERYDIFF_EXPERIMENT] Running on /home/i57/steuber/NeuroDiff/repos/VeryDiffExperiments/src/../benchmarks/mnist-prune/specs/mnist_31_global_6.vnnlib /home/i57/steuber/NeuroDiff/repos/VeryDiffExperiments/src/../benchmarks/mnist-prune/nets/mnist_relu_3_100.onnx
Found input X
op: matmul, weight: (100, 784), bias: nothing
op: bias, weight: nothing, bias: (100,)
op: relu, weight: nothing, bias: nothing
op: matmul, weight: (100, 100), bias: nothing
op: bias, weight: nothing, bias: (100,)
op: relu, weight: nothing, bias: nothing
op: matmul, weight: (10, 100), bias: nothing
op: bias, weight: nothing, bias: (10,)
op: relu, weight: nothing, bias: nothing
op: matmul, weight: (10, 10), bias: nothing
op: bias, weight: nothing, bias: (10,)
Found input X
op: matmul, weight: (100, 784), bias: nothing
op: bias, weight: nothing, bias: (100,)
op: relu, weight: nothing, bias: nothing
op: matmul, weight: (100, 100), bias: nothing
op: bias, weight: nothing, bias: (100,)
op: relu, weight: nothing, bias: nothing
op: matmul, weight: (10, 100), bias: nothing
op: bias, weight: nothing, bias: (10,)
op: relu, weight: nothing, bias: nothing
op: matmul, weight: (10, 10), bias: nothing
op: bias, weight: nothing, bias: (10,)
Distance: 296.6600370998244
Distance: 77.24290861755458
Distance: 5.7170369567975285
Distance: 0.0
Running with 1 threads
[Thread 1] Time to first task: 0.0s
Zono Bounds:
[0.0, 0.0, 0.0, 0.0, 0.0, 0.0, 0.0, 0.0, 0.0, 0.0, 0.0, 0.0, 0.0, 0.0, 0.0, 0.0, 0.0, 0.0, 0.0, 0.0, 0.0, 0.0, 0.0, 0.0, 0.0, 0.0, 0.0, 0.0, 0.0, 0.0, 0.0, 0.0, 0.0, 0.0, 0.0, 0.0, 0.0, 0.0, 0.0, 0.0, 0.0, 0.0, 0.0, 0.0, 0.0, 0.0, 0.0, 0.0, 0.0, 0.0, 0.0, 0.0, 0.0, 0.0, 0.0, 0.0, 0.0, 0.0, 0.0, 0.0, 0.0, 0.0, 0.0, 0.0, 0.0, 0.0, 0.0, 0.0, 0.0, 0.0, 0.0, 0.0, 0.0, 0.0, 0.0, 0.0, 0.0, 0.0, 0.0, 0.0, 0.0, 0.0, 0.0, 0.0, 0.0, 0.0, 0.0, 0.0, 0.0, 0.0, 0.0, 0.0, 0.0, 0.0, 0.0, 0.0, 0.0, 0.0, 0.0, 0.0, 0.0, 0.0, 0.0, 0.0, 0.0, 0.0, 0.0, 0.0, 0.0, 0.0, 0.0, 0.0, 0.0, 0.0, 0.0, 0.0, 0.0, 0.0, 0.0, 0.0, 0.0, 0.0, 0.0, 0.0, 0.0, 0.0, 0.0, 0.0, 0.0, 0.0, 0.0, 0.0, 0.0, 0.0, 0.0, 0.0, 0.0, 0.0, 0.0, 0.0, 0.0, 0.0, 0.0, 0.0, 0.0, 0.0, 0.0, 0.0, 0.0, 0.0, 0.0, 0.0, 0.0, 0.0, 0.0, 0.0, 0.0, 0.0, 0.0, 0.0, 0.0, 0.0, 0.0, 0.0, 0.0, 0.0, 0.0, 0.0, 0.0, 0.0, 0.0, 0.0, 0.0, 0.0, 0.0, 0.0, 0.0, 0.0, 0.0, 0.0, 0.0, 0.0, 0.0, 0.0, 0.0, 0.0, 0.0, 0.0, 0.0, 0.0, 0.0, 0.0, 0.0, 0.0, 0.0, 0.0, 0.0, 0.0, 0.0, 0.0, 0.0, 0.0, 0.0, 0.0, 0.0, 0.0, 0.0, 0.0, 0.0, 0.0, 0.0, 0.0, 0.0, 0.0, 0.0, 0.0, 0.0, 0.0, 0.0, 0.0, 0.0, 0.0, 0.0, 0.0, 0.0, 0.0, 0.0, 0.0, 0.0, 0.0, 0.0, 0.0, 0.0, 0.0, 0.0, 0.0, 0.0, 0.0, 0.0, 0.0, 0.0, 0.0, 0.0, 0.0, 0.0, 0.0, 0.0, 0.0, 0.0, 0.0, 0.0, 0.0, 0.0, 0.0, 0.0, 0.0, 0.0, 0.0, 0.0, 0.0, 0.0, 0.0, 0.0, 0.0, 0.0, 0.0, 0.0, 0.0, 0.0, 0.0, 0.0, 0.0, 0.0, 0.0, 0.0, 0.0, 0.0, 0.0, 0.0, 0.0, 0.0, 0.0, 0.0, 0.0, 0.0, 0.0, 0.0, 0.0, 0.0, 0.0, 0.0, 0.0, 0.0, 0.0, 0.0, 0.0, 0.0, 0.0, 0.0, 0.0, 0.0, 0.0, 0.0, 0.0, 0.0, 0.0, 0.0, 0.0, 0.0, 0.0, 0.0, 0.0, 0.0, 0.0, 0.0, 0.0, 0.0, 0.0, 0.0, 0.0, 0.0, 0.0, 0.0, 0.0, 0.0, 0.0, 0.0, 0.0, 0.0, 0.0, 0.0, 0.0, 0.0, 0.0, 0.0, 0.0, 0.0, 0.0, 0.0, 0.0, 0.0, 0.0, 0.0, 0.0, 0.0, 0.0, 0.0, 0.0, 0.0, 0.0, 0.0, 0.0, 0.0, 0.0, 0.0, 0.0, 0.0, 0.0, 0.0, 0.0, 0.0, 0.0, 0.0, 0.0, 0.0, 0.0, 0.0, 0.0, 0.0, 0.0, 0.0, 0.0, 0.0, 0.0, 0.0, 0.0, 0.0, 0.0, 0.0, 0.0, 0.0, 0.0, 0.0, 0.0, 0.0, 0.0, 0.0, 0.0, 0.0, 0.0, 0.0, 0.0, 0.0, 0.0, 0.0, 0.0, 0.0, 0.0, 0.0, 0.0, 0.0, 0.0, 0.0, 0.0, 0.0, 0.0, 0.0, 0.0, 0.0, 0.0, 0.0, 0.0, 0.0, 0.0, 0.0, 0.0, 0.0, 0.0, 0.0, 0.0, 0.0, 0.0, 0.0, 0.0, 0.0, 0.0, 0.0, 0.0, 0.0, 0.0, 0.0, 0.0, 0.0, 0.0, 0.0, 0.0, 0.0, 0.0, 0.0, 0.0, 0.0, 0.0, 0.0, 0.0, 0.0, 0.0, 0.0, 0.0, 0.0, 0.0, 0.0, 0.0, 0.0, 0.0, 0.0, 0.0, 0.0, 0.0, 0.0, 0.0, 0.0, 0.0, 0.0, 0.0, 0.0, 0.0, 0.0, 0.0, 0.0, 0.0, 0.0, 0.0, 0.0, 0.0, 0.0, 0.0, 0.0, 0.0, 0.0, 0.0, 0.0, 0.0, 0.0, 0.0, 0.0, 0.0, 0.0, 0.0, 0.0, 0.0, 0.0, 0.0, 0.0, 0.0, 0.0, 0.0, 0.0, 0.0, 0.0, 0.0, 0.0, 0.0, 0.0, 0.0, 0.0, 0.0, 0.0, 0.0, 0.0, 0.0, 0.0, 0.0, 0.0, 0.0, 0.0, 0.0, 0.0, 0.0, 0.0, 0.0, 0.0, 0.0, 0.0, 0.0, 0.0, 0.0, 0.0, 0.0, 0.0, 0.0, 0.0, 0.0, 0.0, 0.0, 0.0, 0.0, 0.0, 0.0, 0.0, 0.0, 0.0, 0.0, 0.0, 0.0, 0.0, 0.0, 0.0, 0.0, 0.0, 0.0, 0.0, 0.0, 0.0, 0.0, 0.0, 0.0, 0.0, 0.0, 0.0, 0.0, 0.0, 0.0, 0.0, 0.0, 0.0, 0.0, 0.0, 0.0, 0.0, 0.0, 0.0, 0.0, 0.0, 0.0, 0.0, 0.0, 0.0, 0.0, 0.0, 0.0, 0.0, 0.0, 0.0, 0.0, 0.0, 0.0, 0.0, 0.0, 0.0, 0.0, 0.0, 0.0, 0.0, 0.0, 0.0, 0.0, 0.0, 0.0, 0.0, 0.0, 0.0, 0.0, 0.0, 0.0, 0.0, 0.0, 0.0, 0.0, 0.0, 0.0, 0.0, 0.0, 0.0, 0.0, 0.0, 0.0, 0.0, 0.0, 0.0, 0.0, 0.0, 0.0, 0.0, 0.0, 0.0, 0.0, 0.0, 0.0, 0.0, 0.0, 0.0, 0.0, 0.0, 0.0, 0.0, 0.0, 0.0, 0.0, 0.0, 0.0, 0.0, 0.0, 0.0, 0.0, 0.0, 0.0, 0.0, 0.0, 0.0, 0.0, 0.0, 0.0, 0.0, 0.0, 0.0, 0.0, 0.0, 0.0, 0.0, 0.0, 0.0, 0.0, 0.0, 0.0, 0.0, 0.0, 0.0, 0.0, 0.0, 0.0, 0.0, 0.0, 0.0, 0.0, 0.0, 0.0, 0.0, 0.0, 0.0, 0.0, 0.0, 0.0, 0.0, 0.0, 0.0, 0.0, 0.0, 0.0, 0.0, 0.0, 0.0, 0.0, 0.0, 0.0, 0.0, 0.0, 0.0, 0.0, 0.0, 0.0, 0.0, 0.0, 0.0, 0.0, 0.0, 0.0, 0.0, 0.0, 0.0, 0.0, 0.0, 0.0, 0.0, 0.0, 0.0, 0.0, 0.0, 0.0, 0.0, 0.0, 0.0, 0.0, 0.0, 0.0, 0.0, 0.0, 0.0, 0.0, 0.0, 0.0, 0.0, 0.0, 0.0, 0.0, 0.0, 0.0, 0.0, 0.0, 0.0, 0.0, 0.0, 0.0, 0.0, 0.0, 0.0, 0.0, 0.0, 0.0, 0.0, 0.0, 0.0, 0.0, 0.0, 0.0, 0.0, 0.0, 0.0, 0.0, 0.0, 0.0, 0.0, 0.0, 0.0, 0.0, 0.0, 0.0, 0.0, 0.0, 0.0, 0.0, 0.0, 0.0, 0.0, 0.0, 0.0, 0.0, 0.0, 0.0, 0.0, 0.0, 0.0, 0.0, 0.0, 0.0]
[0.0, 0.0, 0.0, 0.0, 0.0, 0.0, 0.0, 0.0, 0.0, 0.0, 0.0, 0.0, 0.0, 0.0, 0.0, 0.0, 0.0, 0.0, 0.0, 0.0, 0.0, 0.0, 0.0, 0.0, 0.0, 0.0, 0.0, 0.0, 0.0, 0.0, 0.0, 0.0, 0.0, 0.0, 0.0, 0.0, 0.0, 0.0, 0.0, 0.0, 0.0, 0.0, 0.0, 0.0, 0.0, 0.0, 0.0, 0.0, 0.0, 0.0, 0.0, 0.0, 0.0, 0.0, 0.0, 0.0, 0.0, 0.0, 0.0, 0.0, 0.0, 0.0, 0.0, 0.0, 0.0, 0.0, 0.0, 0.0, 0.0, 0.0, 0.0, 0.0, 0.0, 0.0, 0.0, 0.0, 0.0, 0.0, 0.0, 0.0, 0.0, 0.0, 0.0, 0.0, 0.0, 0.0, 0.0, 0.0, 0.0, 0.0, 0.0, 0.0, 0.0, 0.0, 0.0, 0.0, 0.0, 0.0, 0.0, 0.0, 0.0, 0.0, 0.0, 0.0, 0.0, 0.0, 0.0, 0.0, 0.0, 0.0, 0.0, 0.0, 0.0, 0.0, 0.0, 0.0, 0.0, 0.0, 0.0, 0.0, 0.0, 0.0, 0.0, 0.0, 0.0, 0.0, 0.0, 0.0, 0.0, 0.0, 0.0, 0.0, 0.0, 0.0, 0.0, 0.0, 0.0, 0.0, 0.0, 0.0, 0.0, 0.0, 0.0, 0.0, 0.0, 0.0, 0.0, 0.0, 0.0, 0.0, 0.0, 0.0, 0.0, 0.0, 0.0, 0.0, 0.0, 0.0, 0.0, 0.0, 0.0, 0.0, 0.0, 0.0, 0.0, 0.0, 0.0, 0.0, 0.0, 0.0, 0.0, 0.0, 0.0, 0.0, 0.0, 0.0, 0.0, 0.0, 0.0, 0.0, 0.0, 0.0, 0.0, 0.0, 0.0, 0.0, 0.0, 0.0, 0.0, 0.0, 0.0, 0.0, 0.0, 0.0, 0.0, 0.0, 0.0, 0.0, 0.0, 0.0, 0.0, 0.0, 0.0, 0.0, 0.0, 0.0, 0.0, 0.0, 0.0, 0.0, 0.0, 0.0, 0.0, 0.0, 0.0, 0.0, 0.0, 0.0, 0.0, 0.0, 0.0, 0.0, 0.0, 0.0, 0.0, 0.0, 0.0, 0.0, 0.0, 0.0, 0.0, 0.0, 0.0, 0.0, 0.0, 0.0, 0.0, 0.0, 0.0, 0.0, 0.0, 0.0, 0.0, 0.0, 0.0, 0.0, 0.0, 0.0, 0.0, 0.0, 0.0, 0.0, 0.0, 0.0, 0.0, 0.0, 0.0, 0.0, 0.0, 0.0, 0.0, 0.0, 0.0, 0.0, 0.0, 0.0, 0.0, 0.0, 0.0, 0.0, 0.0, 0.0, 0.0, 0.0, 0.0, 0.0, 0.0, 0.0, 0.0, 0.0, 0.0, 0.0, 0.0, 0.0, 0.0, 0.0, 0.0, 0.0, 0.0, 0.0, 0.0, 0.0, 0.0, 0.0, 0.0, 0.0, 0.0, 0.0, 0.0, 0.0, 0.0, 0.0, 0.0, 0.0, 0.0, 0.0, 0.0, 0.0, 0.0, 0.0, 0.0, 0.0, 0.0, 0.0, 0.0, 0.0, 0.0, 0.0, 0.0, 0.0, 0.0, 0.0, 0.0, 0.0, 0.0, 0.0, 0.0, 0.0, 0.0, 0.0, 0.0, 0.0, 0.0, 0.0, 0.0, 0.0, 0.0, 0.0, 0.0, 0.0, 0.0, 0.0, 0.0, 0.0, 0.0, 0.0, 0.0, 0.0, 0.0, 0.0, 0.0, 0.0, 0.0, 0.0, 0.0, 0.0, 0.0, 0.0, 0.0, 0.0, 0.0, 0.0, 0.0, 0.0, 0.0, 0.0, 0.0, 0.0, 0.0, 0.0, 0.0, 0.0, 0.0, 0.0, 0.0, 0.0, 0.0, 0.0, 0.0, 0.0, 0.0, 0.0, 0.0, 0.0, 0.0, 0.0, 0.0, 0.0, 0.0, 0.0, 0.0, 0.0, 0.0, 0.0, 0.0, 0.0, 0.0, 0.0, 0.0, 0.0, 0.0, 0.0, 0.0, 0.0, 0.0, 0.0, 0.0, 0.0, 0.0, 0.0, 0.0, 0.0, 0.0, 0.0, 0.0, 0.0, 0.0, 0.0, 0.0, 0.0, 0.0, 0.0, 0.0, 0.0, 0.0, 0.0, 0.0, 0.0, 0.0, 0.0, 0.0, 0.0, 0.0, 0.0, 0.0, 0.0, 0.0, 0.0, 0.0, 0.0, 0.0, 0.0, 0.0, 0.0, 0.0, 0.0, 0.0, 0.0, 0.0, 0.0, 0.0, 0.0, 0.0, 0.0, 0.0, 0.0, 0.0, 0.0, 0.0, 0.0, 0.0, 0.0, 0.0, 0.0, 0.0, 0.0, 0.0, 0.0, 0.0, 0.0, 0.0, 0.0, 0.0, 0.0, 0.0, 0.0, 0.0, 0.0, 0.0, 0.0, 0.0, 0.0, 0.0, 0.0, 0.0, 0.0, 0.0, 0.0, 0.0, 0.0, 0.0, 0.0, 0.0, 0.0, 0.0, 0.0, 0.0, 0.0, 0.0, 0.0, 0.0, 0.0, 0.0, 0.0, 0.0, 0.0, 0.0, 0.0, 0.0, 0.0, 0.0, 0.0, 0.0, 0.0, 0.0, 0.0, 0.0, 0.0, 0.0, 0.0, 0.0, 0.0, 0.0, 0.0, 0.0, 0.0, 0.0, 0.0, 0.0, 0.0, 0.0, 0.0, 0.0, 0.0, 0.0, 0.0, 0.0, 0.0, 0.0, 0.0, 0.0, 0.0, 0.0, 0.0, 0.0, 0.0, 0.0, 0.0, 0.0, 0.0, 0.0, 0.0, 0.0, 0.0, 0.0, 0.0, 0.0, 0.0, 0.0, 0.0, 0.0, 0.0, 0.0, 0.0, 0.0, 0.0, 0.0, 0.0, 0.0, 0.0, 0.0, 0.0, 0.0, 0.0, 0.0, 0.0, 0.0, 0.0, 0.0, 0.0, 0.0, 0.0, 0.0, 0.0, 0.0, 0.0, 0.0, 0.0, 0.0, 0.0, 0.0, 0.0, 0.0, 0.0, 0.0, 0.0, 0.0, 0.0, 0.0, 0.0, 0.0, 0.0, 0.0, 0.0, 0.0, 0.0, 0.0, 0.0, 0.0, 0.0, 0.0, 0.0, 0.0, 0.0, 0.0, 0.0, 0.0, 0.0, 0.0, 0.0, 0.0, 0.0, 0.0, 0.0, 0.0, 0.0, 0.0, 0.0, 0.0, 0.0, 0.0, 0.0, 0.0, 0.0, 0.0, 0.0, 0.0, 0.0, 0.0, 0.0, 0.0, 0.0, 0.0, 0.0, 0.0, 0.0, 0.0, 0.0, 0.0, 0.0, 0.0, 0.0, 0.0, 0.0, 0.0, 0.0, 0.0, 0.0, 0.0, 0.0, 0.0, 0.0, 0.0, 0.0, 0.0, 0.0, 0.0, 0.0, 0.0, 0.0, 0.0, 0.0, 0.0, 0.0, 0.0, 0.0, 0.0, 0.0, 0.0, 0.0, 0.0, 0.0, 0.0, 0.0, 0.0, 0.0, 0.0, 0.0, 0.0, 0.0, 0.0, 0.0, 0.0, 0.0, 0.0, 0.0, 0.0, 0.0, 0.0, 0.0, 0.0, 0.0, 0.0, 0.0, 0.0, 0.0, 0.0, 0.0, 0.0, 0.0, 0.0, 0.0, 0.0, 0.0, 0.0, 0.0, 0.0, 0.0, 0.0, 0.0, 0.0, 0.0, 0.0, 0.0, 0.0, 0.0, 0.0, 0.0, 0.0, 0.0, 0.0, 0.0, 0.0, 0.0, 0.0, 0.0, 0.0, 0.0, 0.0, 0.0, 0.0, 0.0, 0.0, 0.0, 0.0, 0.0, 0.0, 0.0, 0.0, 0.0, 0.0, 0.0, 0.0, 0.0, 0.0, 0.0, 0.0, 0.0, 0.0, 0.0, 0.0, 0.0, 0.0, 0.0, 0.0, 0.0, 0.0, 0.0, 0.0, 0.0, 0.0, 0.0, 0.0, 0.0, 0.0, 0.0, 0.0, 0.0, 0.0, 0.0, 0.0, 0.0, 0.0, 0.0]
[Thread 1] Processed 100 zonotopes (Work Done: 0.0%; Expected Zonos: Inf)
[Thread 1] Processed 200 zonotopes (Work Done: 0.0%; Expected Zonos: Inf)
[Thread 1] Processed 300 zonotopes (Work Done: 0.0%; Expected Zonos: Inf)
[Thread 1] Processed 400 zonotopes (Work Done: 0.0%; Expected Zonos: Inf)
[Thread 1] Processed 500 zonotopes (Work Done: 0.0%; Expected Zonos: Inf)


TIMEOUT REACHED
UNKNOWN
[Thread 1] Total splits: 590
Processed 590 zonotopes (Work Done: 0.0%); Generated 1180 (0.20339163684406777s/loop)
[Thread 1] Finished in 120.0s
 ────────────────────────────────────────────────────────────────────────────────
                                        Time                    Allocations      
                               ───────────────────────   ────────────────────────
       Tot / % measured:             120s / 100.0%           63.3GiB / 100.0%    

 Section               ncalls     time    %tot     avg     alloc    %tot      avg
 ────────────────────────────────────────────────────────────────────────────────
 Verify                     1     120s  100.0%    120s   63.3GiB  100.0%  63.3GiB
   Zonotope Loop            1     120s  100.0%    120s   63.3GiB  100.0%  63.3GiB
     Zonotope Propa...    590    78.4s   65.3%   133ms   42.5GiB   67.1%  73.7MiB
       DiffZonotope...  1.77k    73.0s   60.8%  41.2ms   40.9GiB   64.6%  23.7MiB
         Zonotope_R...  3.54k    72.9s   60.7%  20.6ms   40.9GiB   64.6%  11.8MiB
           Influenc...  3.54k    69.3s   57.8%  19.6ms   37.6GiB   59.4%  10.9MiB
             Alloca...  3.54k    34.5s   28.8%  9.75ms   18.3GiB   29.0%  5.31MiB
             Multiply   3.54k    32.1s   26.7%  9.06ms   19.3GiB   30.5%  5.58MiB
             Set Ma...  3.54k    2.71s    2.3%   765μs     0.00B    0.0%    0.00B
           Column M...  3.54k    1.91s    1.6%   539μs   1.61GiB    2.5%   478KiB
           Allocation   3.54k    1.43s    1.2%   403μs   1.61GiB    2.5%   478KiB
           Set Matrix   3.54k    210ms    0.2%  59.3μs   4.72MiB    0.0%  1.36KiB
           Vectors      3.54k   17.8ms    0.0%  5.02μs   11.3MiB    0.0%  3.26KiB
           Bounds       3.54k   1.85ms    0.0%   522ns     0.00B    0.0%    0.00B
       DiffZonotope...  2.36k    5.40s    4.5%  2.29ms   1.59GiB    2.5%   706KiB
         Zonotope_D...  4.72k    5.39s    4.5%  1.14ms   1.59GiB    2.5%   353KiB
     Compute Split        590    34.1s   28.4%  57.8ms   9.24GiB   14.6%  16.0MiB
     Property Check       590    131ms    0.1%   222μs    126MiB    0.2%   219KiB
 Initialize                 1    514μs    0.0%   514μs   5.41MiB    0.0%  5.41MiB
 ────────────────────────────────────────────────────────────────────────────────
[VERYDIFF_TIMER] 120.02923803

[VERYDIFF_EXPERIMENT] Running on /home/i57/steuber/NeuroDiff/repos/VeryDiffExperiments/src/../benchmarks/mnist-prune/specs/mnist_31_global_6.vnnlib /home/i57/steuber/NeuroDiff/repos/VeryDiffExperiments/src/../benchmarks/mnist-prune/nets/mnist_relu_4_1024.onnx
Found input X
op: matmul, weight: (1024, 784), bias: nothing
op: bias, weight: nothing, bias: (1024,)
op: relu, weight: nothing, bias: nothing
op: matmul, weight: (1024, 1024), bias: nothing
op: bias, weight: nothing, bias: (1024,)
op: relu, weight: nothing, bias: nothing
op: matmul, weight: (1024, 1024), bias: nothing
op: bias, weight: nothing, bias: (1024,)
op: relu, weight: nothing, bias: nothing
op: matmul, weight: (10, 1024), bias: nothing
op: bias, weight: nothing, bias: (10,)
op: relu, weight: nothing, bias: nothing
op: matmul, weight: (10, 10), bias: nothing
op: bias, weight: nothing, bias: (10,)
Found input X
op: matmul, weight: (1024, 784), bias: nothing
op: bias, weight: nothing, bias: (1024,)
op: relu, weight: nothing, bias: nothing
op: matmul, weight: (1024, 1024), bias: nothing
op: bias, weight: nothing, bias: (1024,)
op: relu, weight: nothing, bias: nothing
op: matmul, weight: (1024, 1024), bias: nothing
op: bias, weight: nothing, bias: (1024,)
op: relu, weight: nothing, bias: nothing
op: matmul, weight: (10, 1024), bias: nothing
op: bias, weight: nothing, bias: (10,)
op: relu, weight: nothing, bias: nothing
op: matmul, weight: (10, 10), bias: nothing
op: bias, weight: nothing, bias: (10,)
Distance: 1266.8815759184893
Distance: 2876.6944248261216
Distance: 2831.8843567411013
Distance: 34.033756025192815
Distance: 0.0
Running with 1 threads
[Thread 1] Time to first task: 0.01s
Zono Bounds:
[0.0, 0.0, 0.0, 0.0, 0.0, 0.0, 0.0, 0.0, 0.0, 0.0, 0.0, 0.0, 0.0, 0.0, 0.0, 0.0, 0.0, 0.0, 0.0, 0.0, 0.0, 0.0, 0.0, 0.0, 0.0, 0.0, 0.0, 0.0, 0.0, 0.0, 0.0, 0.0, 0.0, 0.0, 0.0, 0.0, 0.0, 0.0, 0.0, 0.0, 0.0, 0.0, 0.0, 0.0, 0.0, 0.0, 0.0, 0.0, 0.0, 0.0, 0.0, 0.0, 0.0, 0.0, 0.0, 0.0, 0.0, 0.0, 0.0, 0.0, 0.0, 0.0, 0.0, 0.0, 0.0, 0.0, 0.0, 0.0, 0.0, 0.0, 0.0, 0.0, 0.0, 0.0, 0.0, 0.0, 0.0, 0.0, 0.0, 0.0, 0.0, 0.0, 0.0, 0.0, 0.0, 0.0, 0.0, 0.0, 0.0, 0.0, 0.0, 0.0, 0.0, 0.0, 0.0, 0.0, 0.0, 0.0, 0.0, 0.0, 0.0, 0.0, 0.0, 0.0, 0.0, 0.0, 0.0, 0.0, 0.0, 0.0, 0.0, 0.0, 0.0, 0.0, 0.0, 0.0, 0.0, 0.0, 0.0, 0.0, 0.0, 0.0, 0.0, 0.0, 0.0, 0.0, 0.0, 0.0, 0.0, 0.0, 0.0, 0.0, 0.0, 0.0, 0.0, 0.0, 0.0, 0.0, 0.0, 0.0, 0.0, 0.0, 0.0, 0.0, 0.0, 0.0, 0.0, 0.0, 0.0, 0.0, 0.0, 0.0, 0.0, 0.0, 0.0, 0.0, 0.0, 0.0, 0.0, 0.0, 0.0, 0.0, 0.0, 0.0, 0.0, 0.0, 0.0, 0.0, 0.0, 0.0, 0.0, 0.0, 0.0, 0.0, 0.0, 0.0, 0.0, 0.0, 0.0, 0.0, 0.0, 0.0, 0.0, 0.0, 0.0, 0.0, 0.0, 0.0, 0.0, 0.0, 0.0, 0.0, 0.0, 0.0, 0.0, 0.0, 0.0, 0.0, 0.0, 0.0, 0.0, 0.0, 0.0, 0.0, 0.0, 0.0, 0.0, 0.0, 0.0, 0.0, 0.0, 0.0, 0.0, 0.0, 0.0, 0.0, 0.0, 0.0, 0.0, 0.0, 0.0, 0.0, 0.0, 0.0, 0.0, 0.0, 0.0, 0.0, 0.0, 0.0, 0.0, 0.0, 0.0, 0.0, 0.0, 0.0, 0.0, 0.0, 0.0, 0.0, 0.0, 0.0, 0.0, 0.0, 0.0, 0.0, 0.0, 0.0, 0.0, 0.0, 0.0, 0.0, 0.0, 0.0, 0.0, 0.0, 0.0, 0.0, 0.0, 0.0, 0.0, 0.0, 0.0, 0.0, 0.0, 0.0, 0.0, 0.0, 0.0, 0.0, 0.0, 0.0, 0.0, 0.0, 0.0, 0.0, 0.0, 0.0, 0.0, 0.0, 0.0, 0.0, 0.0, 0.0, 0.0, 0.0, 0.0, 0.0, 0.0, 0.0, 0.0, 0.0, 0.0, 0.0, 0.0, 0.0, 0.0, 0.0, 0.0, 0.0, 0.0, 0.0, 0.0, 0.0, 0.0, 0.0, 0.0, 0.0, 0.0, 0.0, 0.0, 0.0, 0.0, 0.0, 0.0, 0.0, 0.0, 0.0, 0.0, 0.0, 0.0, 0.0, 0.0, 0.0, 0.0, 0.0, 0.0, 0.0, 0.0, 0.0, 0.0, 0.0, 0.0, 0.0, 0.0, 0.0, 0.0, 0.0, 0.0, 0.0, 0.0, 0.0, 0.0, 0.0, 0.0, 0.0, 0.0, 0.0, 0.0, 0.0, 0.0, 0.0, 0.0, 0.0, 0.0, 0.0, 0.0, 0.0, 0.0, 0.0, 0.0, 0.0, 0.0, 0.0, 0.0, 0.0, 0.0, 0.0, 0.0, 0.0, 0.0, 0.0, 0.0, 0.0, 0.0, 0.0, 0.0, 0.0, 0.0, 0.0, 0.0, 0.0, 0.0, 0.0, 0.0, 0.0, 0.0, 0.0, 0.0, 0.0, 0.0, 0.0, 0.0, 0.0, 0.0, 0.0, 0.0, 0.0, 0.0, 0.0, 0.0, 0.0, 0.0, 0.0, 0.0, 0.0, 0.0, 0.0, 0.0, 0.0, 0.0, 0.0, 0.0, 0.0, 0.0, 0.0, 0.0, 0.0, 0.0, 0.0, 0.0, 0.0, 0.0, 0.0, 0.0, 0.0, 0.0, 0.0, 0.0, 0.0, 0.0, 0.0, 0.0, 0.0, 0.0, 0.0, 0.0, 0.0, 0.0, 0.0, 0.0, 0.0, 0.0, 0.0, 0.0, 0.0, 0.0, 0.0, 0.0, 0.0, 0.0, 0.0, 0.0, 0.0, 0.0, 0.0, 0.0, 0.0, 0.0, 0.0, 0.0, 0.0, 0.0, 0.0, 0.0, 0.0, 0.0, 0.0, 0.0, 0.0, 0.0, 0.0, 0.0, 0.0, 0.0, 0.0, 0.0, 0.0, 0.0, 0.0, 0.0, 0.0, 0.0, 0.0, 0.0, 0.0, 0.0, 0.0, 0.0, 0.0, 0.0, 0.0, 0.0, 0.0, 0.0, 0.0, 0.0, 0.0, 0.0, 0.0, 0.0, 0.0, 0.0, 0.0, 0.0, 0.0, 0.0, 0.0, 0.0, 0.0, 0.0, 0.0, 0.0, 0.0, 0.0, 0.0, 0.0, 0.0, 0.0, 0.0, 0.0, 0.0, 0.0, 0.0, 0.0, 0.0, 0.0, 0.0, 0.0, 0.0, 0.0, 0.0, 0.0, 0.0, 0.0, 0.0, 0.0, 0.0, 0.0, 0.0, 0.0, 0.0, 0.0, 0.0, 0.0, 0.0, 0.0, 0.0, 0.0, 0.0, 0.0, 0.0, 0.0, 0.0, 0.0, 0.0, 0.0, 0.0, 0.0, 0.0, 0.0, 0.0, 0.0, 0.0, 0.0, 0.0, 0.0, 0.0, 0.0, 0.0, 0.0, 0.0, 0.0, 0.0, 0.0, 0.0, 0.0, 0.0, 0.0, 0.0, 0.0, 0.0, 0.0, 0.0, 0.0, 0.0, 0.0, 0.0, 0.0, 0.0, 0.0, 0.0, 0.0, 0.0, 0.0, 0.0, 0.0, 0.0, 0.0, 0.0, 0.0, 0.0, 0.0, 0.0, 0.0, 0.0, 0.0, 0.0, 0.0, 0.0, 0.0, 0.0, 0.0, 0.0, 0.0, 0.0, 0.0, 0.0, 0.0, 0.0, 0.0, 0.0, 0.0, 0.0, 0.0, 0.0, 0.0, 0.0, 0.0, 0.0, 0.0, 0.0, 0.0, 0.0, 0.0, 0.0, 0.0, 0.0, 0.0, 0.0, 0.0, 0.0, 0.0, 0.0, 0.0, 0.0, 0.0, 0.0, 0.0, 0.0, 0.0, 0.0, 0.0, 0.0, 0.0, 0.0, 0.0, 0.0, 0.0, 0.0, 0.0, 0.0, 0.0, 0.0, 0.0, 0.0, 0.0, 0.0, 0.0, 0.0, 0.0, 0.0, 0.0, 0.0, 0.0, 0.0, 0.0, 0.0, 0.0, 0.0, 0.0, 0.0, 0.0, 0.0, 0.0, 0.0, 0.0, 0.0, 0.0, 0.0, 0.0, 0.0, 0.0, 0.0, 0.0, 0.0, 0.0, 0.0, 0.0, 0.0, 0.0, 0.0, 0.0, 0.0, 0.0, 0.0, 0.0, 0.0, 0.0, 0.0, 0.0, 0.0, 0.0, 0.0, 0.0, 0.0, 0.0, 0.0, 0.0, 0.0, 0.0, 0.0, 0.0, 0.0, 0.0, 0.0, 0.0, 0.0, 0.0, 0.0, 0.0, 0.0, 0.0, 0.0, 0.0, 0.0, 0.0, 0.0, 0.0, 0.0, 0.0, 0.0, 0.0, 0.0, 0.0, 0.0, 0.0, 0.0, 0.0, 0.0, 0.0, 0.0, 0.0, 0.0, 0.0, 0.0, 0.0, 0.0, 0.0, 0.0, 0.0, 0.0, 0.0, 0.0, 0.0, 0.0, 0.0, 0.0, 0.0, 0.0, 0.0, 0.0, 0.0, 0.0, 0.0, 0.0, 0.0, 0.0, 0.0, 0.0, 0.0, 0.0, 0.0, 0.0]
[0.0, 0.0, 0.0, 0.0, 0.0, 0.0, 0.0, 0.0, 0.0, 0.0, 0.0, 0.0, 0.0, 0.0, 0.0, 0.0, 0.0, 0.0, 0.0, 0.0, 0.0, 0.0, 0.0, 0.0, 0.0, 0.0, 0.0, 0.0, 0.0, 0.0, 0.0, 0.0, 0.0, 0.0, 0.0, 0.0, 0.0, 0.0, 0.0, 0.0, 0.0, 0.0, 0.0, 0.0, 0.0, 0.0, 0.0, 0.0, 0.0, 0.0, 0.0, 0.0, 0.0, 0.0, 0.0, 0.0, 0.0, 0.0, 0.0, 0.0, 0.0, 0.0, 0.0, 0.0, 0.0, 0.0, 0.0, 0.0, 0.0, 0.0, 0.0, 0.0, 0.0, 0.0, 0.0, 0.0, 0.0, 0.0, 0.0, 0.0, 0.0, 0.0, 0.0, 0.0, 0.0, 0.0, 0.0, 0.0, 0.0, 0.0, 0.0, 0.0, 0.0, 0.0, 0.0, 0.0, 0.0, 0.0, 0.0, 0.0, 0.0, 0.0, 0.0, 0.0, 0.0, 0.0, 0.0, 0.0, 0.0, 0.0, 0.0, 0.0, 0.0, 0.0, 0.0, 0.0, 0.0, 0.0, 0.0, 0.0, 0.0, 0.0, 0.0, 0.0, 0.0, 0.0, 0.0, 0.0, 0.0, 0.0, 0.0, 0.0, 0.0, 0.0, 0.0, 0.0, 0.0, 0.0, 0.0, 0.0, 0.0, 0.0, 0.0, 0.0, 0.0, 0.0, 0.0, 0.0, 0.0, 0.0, 0.0, 0.0, 0.0, 0.0, 0.0, 0.0, 0.0, 0.0, 0.0, 0.0, 0.0, 0.0, 0.0, 0.0, 0.0, 0.0, 0.0, 0.0, 0.0, 0.0, 0.0, 0.0, 0.0, 0.0, 0.0, 0.0, 0.0, 0.0, 0.0, 0.0, 0.0, 0.0, 0.0, 0.0, 0.0, 0.0, 0.0, 0.0, 0.0, 0.0, 0.0, 0.0, 0.0, 0.0, 0.0, 0.0, 0.0, 0.0, 0.0, 0.0, 0.0, 0.0, 0.0, 0.0, 0.0, 0.0, 0.0, 0.0, 0.0, 0.0, 0.0, 0.0, 0.0, 0.0, 0.0, 0.0, 0.0, 0.0, 0.0, 0.0, 0.0, 0.0, 0.0, 0.0, 0.0, 0.0, 0.0, 0.0, 0.0, 0.0, 0.0, 0.0, 0.0, 0.0, 0.0, 0.0, 0.0, 0.0, 0.0, 0.0, 0.0, 0.0, 0.0, 0.0, 0.0, 0.0, 0.0, 0.0, 0.0, 0.0, 0.0, 0.0, 0.0, 0.0, 0.0, 0.0, 0.0, 0.0, 0.0, 0.0, 0.0, 0.0, 0.0, 0.0, 0.0, 0.0, 0.0, 0.0, 0.0, 0.0, 0.0, 0.0, 0.0, 0.0, 0.0, 0.0, 0.0, 0.0, 0.0, 0.0, 0.0, 0.0, 0.0, 0.0, 0.0, 0.0, 0.0, 0.0, 0.0, 0.0, 0.0, 0.0, 0.0, 0.0, 0.0, 0.0, 0.0, 0.0, 0.0, 0.0, 0.0, 0.0, 0.0, 0.0, 0.0, 0.0, 0.0, 0.0, 0.0, 0.0, 0.0, 0.0, 0.0, 0.0, 0.0, 0.0, 0.0, 0.0, 0.0, 0.0, 0.0, 0.0, 0.0, 0.0, 0.0, 0.0, 0.0, 0.0, 0.0, 0.0, 0.0, 0.0, 0.0, 0.0, 0.0, 0.0, 0.0, 0.0, 0.0, 0.0, 0.0, 0.0, 0.0, 0.0, 0.0, 0.0, 0.0, 0.0, 0.0, 0.0, 0.0, 0.0, 0.0, 0.0, 0.0, 0.0, 0.0, 0.0, 0.0, 0.0, 0.0, 0.0, 0.0, 0.0, 0.0, 0.0, 0.0, 0.0, 0.0, 0.0, 0.0, 0.0, 0.0, 0.0, 0.0, 0.0, 0.0, 0.0, 0.0, 0.0, 0.0, 0.0, 0.0, 0.0, 0.0, 0.0, 0.0, 0.0, 0.0, 0.0, 0.0, 0.0, 0.0, 0.0, 0.0, 0.0, 0.0, 0.0, 0.0, 0.0, 0.0, 0.0, 0.0, 0.0, 0.0, 0.0, 0.0, 0.0, 0.0, 0.0, 0.0, 0.0, 0.0, 0.0, 0.0, 0.0, 0.0, 0.0, 0.0, 0.0, 0.0, 0.0, 0.0, 0.0, 0.0, 0.0, 0.0, 0.0, 0.0, 0.0, 0.0, 0.0, 0.0, 0.0, 0.0, 0.0, 0.0, 0.0, 0.0, 0.0, 0.0, 0.0, 0.0, 0.0, 0.0, 0.0, 0.0, 0.0, 0.0, 0.0, 0.0, 0.0, 0.0, 0.0, 0.0, 0.0, 0.0, 0.0, 0.0, 0.0, 0.0, 0.0, 0.0, 0.0, 0.0, 0.0, 0.0, 0.0, 0.0, 0.0, 0.0, 0.0, 0.0, 0.0, 0.0, 0.0, 0.0, 0.0, 0.0, 0.0, 0.0, 0.0, 0.0, 0.0, 0.0, 0.0, 0.0, 0.0, 0.0, 0.0, 0.0, 0.0, 0.0, 0.0, 0.0, 0.0, 0.0, 0.0, 0.0, 0.0, 0.0, 0.0, 0.0, 0.0, 0.0, 0.0, 0.0, 0.0, 0.0, 0.0, 0.0, 0.0, 0.0, 0.0, 0.0, 0.0, 0.0, 0.0, 0.0, 0.0, 0.0, 0.0, 0.0, 0.0, 0.0, 0.0, 0.0, 0.0, 0.0, 0.0, 0.0, 0.0, 0.0, 0.0, 0.0, 0.0, 0.0, 0.0, 0.0, 0.0, 0.0, 0.0, 0.0, 0.0, 0.0, 0.0, 0.0, 0.0, 0.0, 0.0, 0.0, 0.0, 0.0, 0.0, 0.0, 0.0, 0.0, 0.0, 0.0, 0.0, 0.0, 0.0, 0.0, 0.0, 0.0, 0.0, 0.0, 0.0, 0.0, 0.0, 0.0, 0.0, 0.0, 0.0, 0.0, 0.0, 0.0, 0.0, 0.0, 0.0, 0.0, 0.0, 0.0, 0.0, 0.0, 0.0, 0.0, 0.0, 0.0, 0.0, 0.0, 0.0, 0.0, 0.0, 0.0, 0.0, 0.0, 0.0, 0.0, 0.0, 0.0, 0.0, 0.0, 0.0, 0.0, 0.0, 0.0, 0.0, 0.0, 0.0, 0.0, 0.0, 0.0, 0.0, 0.0, 0.0, 0.0, 0.0, 0.0, 0.0, 0.0, 0.0, 0.0, 0.0, 0.0, 0.0, 0.0, 0.0, 0.0, 0.0, 0.0, 0.0, 0.0, 0.0, 0.0, 0.0, 0.0, 0.0, 0.0, 0.0, 0.0, 0.0, 0.0, 0.0, 0.0, 0.0, 0.0, 0.0, 0.0, 0.0, 0.0, 0.0, 0.0, 0.0, 0.0, 0.0, 0.0, 0.0, 0.0, 0.0, 0.0, 0.0, 0.0, 0.0, 0.0, 0.0, 0.0, 0.0, 0.0, 0.0, 0.0, 0.0, 0.0, 0.0, 0.0, 0.0, 0.0, 0.0, 0.0, 0.0, 0.0, 0.0, 0.0, 0.0, 0.0, 0.0, 0.0, 0.0, 0.0, 0.0, 0.0, 0.0, 0.0, 0.0, 0.0, 0.0, 0.0, 0.0, 0.0, 0.0, 0.0, 0.0, 0.0, 0.0, 0.0, 0.0, 0.0, 0.0, 0.0, 0.0, 0.0, 0.0, 0.0, 0.0, 0.0, 0.0, 0.0, 0.0, 0.0, 0.0, 0.0, 0.0, 0.0, 0.0, 0.0, 0.0, 0.0, 0.0, 0.0, 0.0, 0.0, 0.0, 0.0, 0.0, 0.0, 0.0, 0.0, 0.0, 0.0, 0.0, 0.0, 0.0, 0.0, 0.0, 0.0, 0.0, 0.0, 0.0, 0.0, 0.0, 0.0, 0.0, 0.0, 0.0, 0.0, 0.0, 0.0, 0.0, 0.0, 0.0, 0.0, 0.0, 0.0, 0.0, 0.0, 0.0, 0.0, 0.0, 0.0, 0.0, 0.0, 0.0, 0.0, 0.0, 0.0, 0.0, 0.0, 0.0, 0.0, 0.0, 0.0, 0.0, 0.0, 0.0]

Found counterexample: ([0.011764705, 0.011764705, 0.011764705, 0.011764705, 0.011764705, 0.011764705, 0.011764705, 0.011764705, 0.011764705, 0.011764705, 0.011764705, 0.011764705, 0.011764705, 0.011764705, 0.011764705, 0.011764705, 0.011764705, 0.011764705, 0.011764705, 0.011764705, 0.011764705, 0.011764705, 0.011764705, 0.011764705, 0.011764705, 0.011764705, 0.011764705, 0.011764705, 0.011764705, 0.011764705, 0.011764705, 0.011764705, 0.011764705, 0.011764705, 0.011764705, 0.011764705, 0.011764705, 0.011764705, 0.011764705, 0.011764705, 0.011764705, 0.011764705, 0.011764705, 0.011764705, 0.011764705, 0.011764705, 0.011764705, 0.011764705, 0.011764705, 0.011764705, 0.011764705, 0.011764705, 0.011764705, 0.011764705, 0.011764705, 0.011764705, 0.011764705, 0.011764705, 0.011764705, 0.011764705, 0.011764705, 0.011764705, 0.011764705, 0.011764705, 0.011764705, 0.011764705, 0.011764705, 0.011764705, 0.011764705, 0.011764705, 0.011764705, 0.011764705, 0.011764705, 0.011764705, 0.011764705, 0.011764705, 0.011764705, 0.011764705, 0.011764705, 0.011764705, 0.011764705, 0.011764705, 0.011764705, 0.011764705, 0.011764705, 0.011764705, 0.011764705, 0.011764705, 0.011764705, 0.011764705, 0.011764705, 0.011764705, 0.011764705, 0.011764705, 0.011764705, 0.011764705, 0.011764705, 0.011764705, 0.011764705, 0.011764705, 0.011764705, 0.011764705, 0.011764705, 0.011764705, 0.011764705, 0.011764705, 0.011764705, 0.011764705, 0.011764705, 0.011764705, 0.011764705, 0.011764705, 0.011764705, 0.011764705, 0.011764705, 0.011764705, 0.011764705, 0.011764705, 0.011764705, 0.011764705, 0.011764705, 0.011764705, 0.011764705, 0.011764705, 0.011764705, 0.011764705, 0.011764705, 0.011764705, 0.011764705, 0.011764705, 0.011764705, 0.011764705, 0.011764705, 0.011764705, 0.011764705, 0.011764705, 0.011764705, 0.011764705, 0.011764705, 0.011764705, 0.011764705, 0.011764705, 0.011764705, 0.011764705, 0.011764705, 0.011764705, 0.011764705, 0.011764705, 0.011764705, 0.011764705, 0.011764705, 0.011764705, 0.79607844, 0.75686276, 0.117647065, 0.011764705, 0.011764705, 0.011764705, 0.011764705, 0.011764705, 0.011764705, 0.011764705, 0.011764705, 0.011764705, 0.011764705, 0.011764705, 0.011764705, 0.011764705, 0.011764705, 0.011764705, 0.011764705, 0.011764705, 0.011764705, 0.011764705, 0.011764705, 0.011764705, 0.011764705, 0.011764705, 0.011764705, 0.011764705, 0.79607844, 0.984313725, 0.513725505, 0.011764705, 0.011764705, 0.011764705, 0.011764705, 0.011764705, 0.011764705, 0.011764705, 0.011764705, 0.011764705, 0.011764705, 0.011764705, 0.011764705, 0.011764705, 0.011764705, 0.011764705, 0.011764705, 0.011764705, 0.011764705, 0.011764705, 0.011764705, 0.011764705, 0.011764705, 0.011764705, 0.011764705, 0.011764705, 0.40000000999999996, 0.98627451, 0.59215689, 0.011764705, 0.011764705, 0.011764705, 0.011764705, 0.011764705, 0.011764705, 0.011764705, 0.011764705, 0.011764705, 0.011764705, 0.011764705, 0.011764705, 0.011764705, 0.011764705, 0.011764705, 0.011764705, 0.011764705, 0.011764705, 0.011764705, 0.011764705, 0.011764705, 0.011764705, 0.011764705, 0.011764705, 0.011764705, 0.40000000999999996, 0.984313725, 0.59215689, 0.011764705, 0.011764705, 0.011764705, 0.011764705, 0.011764705, 0.011764705, 0.011764705, 0.011764705, 0.011764705, 0.011764705, 0.011764705, 0.011764705, 0.011764705, 0.011764705, 0.011764705, 0.011764705, 0.011764705, 0.011764705, 0.011764705, 0.011764705, 0.011764705, 0.011764705, 0.011764705, 0.011764705, 0.011764705, 0.16078432, 0.98627451, 0.984313725, 0.011764705, 0.011764705, 0.011764705, 0.011764705, 0.011764705, 0.011764705, 0.011764705, 0.011764705, 0.011764705, 0.011764705, 0.011764705, 0.011764705, 0.011764705, 0.011764705, 0.011764705, 0.011764705, 0.011764705, 0.011764705, 0.011764705, 0.011764705, 0.011764705, 0.011764705, 0.011764705, 0.011764705, 0.011764705, 0.011764705, 0.984313725, 0.98235294, 0.32156863999999996, 0.011764705, 0.011764705, 0.011764705, 0.011764705, 0.011764705, 0.011764705, 0.011764705, 0.011764705, 0.011764705, 0.011764705, 0.011764705, 0.011764705, 0.011764705, 0.011764705, 0.011764705, 0.011764705, 0.011764705, 0.011764705, 0.011764705, 0.011764705, 0.011764705, 0.011764705, 0.011764705, 0.011764705, 0.011764705, 0.59607846, 0.984313725, 0.79607844, 0.011764705, 0.011764705, 0.011764705, 0.011764705, 0.011764705, 0.011764705, 0.011764705, 0.011764705, 0.011764705, 0.011764705, 0.011764705, 0.011764705, 0.011764705, 0.011764705, 0.011764705, 0.011764705, 0.011764705, 0.011764705, 0.011764705, 0.011764705, 0.011764705, 0.011764705, 0.011764705, 0.011764705, 0.011764705, 0.59607846, 0.98235294, 0.79607844, 0.011764705, 0.011764705, 0.011764705, 0.011764705, 0.011764705, 0.011764705, 0.011764705, 0.011764705, 0.011764705, 0.011764705, 0.011764705, 0.011764705, 0.011764705, 0.011764705, 0.011764705, 0.011764705, 0.011764705, 0.011764705, 0.011764705, 0.011764705, 0.011764705, 0.011764705, 0.011764705, 0.011764705, 0.011764705, 0.36078432000000005, 0.984313725, 0.8392157, 0.03921569, 0.011764705, 0.011764705, 0.011764705, 0.011764705, 0.011764705, 0.011764705, 0.011764705, 0.011764705, 0.011764705, 0.011764705, 0.011764705, 0.011764705, 0.011764705, 0.011764705, 0.011764705, 0.011764705, 0.011764705, 0.011764705, 0.011764705, 0.011764705, 0.011764705, 0.011764705, 0.011764705, 0.011764705, 0.03921569, 0.8313725599999999, 0.984313725, 0.19607843, 0.011764705, 0.011764705, 0.011764705, 0.011764705, 0.011764705, 0.011764705, 0.011764705, 0.011764705, 0.011764705, 0.011764705, 0.011764705, 0.011764705, 0.011764705, 0.011764705, 0.011764705, 0.011764705, 0.011764705, 0.011764705, 0.011764705, 0.011764705, 0.011764705, 0.011764705, 0.011764705, 0.011764705, 0.011764705, 0.79607844, 0.98627451, 0.43921569000000005, 0.011764705, 0.011764705, 0.011764705, 0.011764705, 0.011764705, 0.011764705, 0.011764705, 0.011764705, 0.011764705, 0.011764705, 0.011764705, 0.011764705, 0.011764705, 0.011764705, 0.011764705, 0.011764705, 0.011764705, 0.011764705, 0.011764705, 0.011764705, 0.011764705, 0.011764705, 0.011764705, 0.011764705, 0.011764705, 0.6352941400000001, 0.984313725, 0.59215689, 0.011764705, 0.011764705, 0.011764705, 0.011764705, 0.011764705, 0.011764705, 0.011764705, 0.011764705, 0.011764705, 0.011764705, 0.011764705, 0.011764705, 0.011764705, 0.011764705, 0.011764705, 0.011764705, 0.011764705, 0.011764705, 0.011764705, 0.011764705, 0.011764705, 0.011764705, 0.011764705, 0.011764705, 0.011764705, 0.40000000999999996, 0.98627451, 0.59215689, 0.011764705, 0.011764705, 0.011764705, 0.011764705, 0.011764705, 0.011764705, 0.011764705, 0.011764705, 0.011764705, 0.011764705, 0.011764705, 0.011764705, 0.011764705, 0.011764705, 0.011764705, 0.011764705, 0.011764705, 0.011764705, 0.011764705, 0.011764705, 0.011764705, 0.011764705, 0.011764705, 0.011764705, 0.011764705, 0.40000000999999996, 0.984313725, 0.75294119, 0.011764705, 0.011764705, 0.011764705, 0.011764705, 0.011764705, 0.011764705, 0.011764705, 0.011764705, 0.011764705, 0.011764705, 0.011764705, 0.011764705, 0.011764705, 0.011764705, 0.011764705, 0.011764705, 0.011764705, 0.011764705, 0.011764705, 0.011764705, 0.011764705, 0.011764705, 0.011764705, 0.011764705, 0.011764705, 0.40000000999999996, 0.98627451, 0.984313725, 0.011764705, 0.011764705, 0.011764705, 0.011764705, 0.011764705, 0.011764705, 0.011764705, 0.011764705, 0.011764705, 0.011764705, 0.011764705, 0.011764705, 0.011764705, 0.011764705, 0.011764705, 0.011764705, 0.011764705, 0.011764705, 0.011764705, 0.011764705, 0.011764705, 0.011764705, 0.011764705, 0.011764705, 0.011764705, 0.40000000999999996, 0.984313725, 0.98235294, 0.011764705, 0.011764705, 0.011764705, 0.011764705, 0.011764705, 0.011764705, 0.011764705, 0.011764705, 0.011764705, 0.011764705, 0.011764705, 0.011764705, 0.011764705, 0.011764705, 0.011764705, 0.011764705, 0.011764705, 0.011764705, 0.011764705, 0.011764705, 0.011764705, 0.011764705, 0.011764705, 0.011764705, 0.011764705, 0.16078432, 0.988235295, 0.984313725, 0.011764705, 0.011764705, 0.011764705, 0.011764705, 0.011764705, 0.011764705, 0.011764705, 0.011764705, 0.011764705, 0.011764705, 0.011764705, 0.011764705, 0.011764705, 0.011764705, 0.011764705, 0.011764705, 0.011764705, 0.011764705, 0.011764705, 0.011764705, 0.011764705, 0.011764705, 0.011764705, 0.011764705, 0.011764705, 0.011764705, 0.984313725, 0.98235294, 0.011764705, 0.011764705, 0.011764705, 0.011764705, 0.011764705, 0.011764705, 0.011764705, 0.011764705, 0.011764705, 0.011764705, 0.011764705, 0.011764705, 0.011764705, 0.011764705, 0.011764705, 0.011764705, 0.011764705, 0.011764705, 0.011764705, 0.011764705, 0.011764705, 0.011764705, 0.011764705, 0.011764705, 0.011764705, 0.011764705, 0.6784313900000001, 0.984313725, 0.24313726, 0.011764705, 0.011764705, 0.011764705, 0.011764705, 0.011764705, 0.011764705, 0.011764705, 0.011764705, 0.011764705, 0.011764705, 0.011764705, 0.011764705, 0.011764705, 0.011764705, 0.011764705, 0.011764705, 0.011764705, 0.011764705, 0.011764705, 0.011764705, 0.011764705, 0.011764705, 0.011764705, 0.011764705, 0.011764705, 0.2, 0.98235294, 0.40000000999999996, 0.011764705, 0.011764705, 0.011764705, 0.011764705, 0.011764705, 0.011764705, 0.011764705, 0.011764705, 0.011764705, 0.011764705, 0.011764705, 0.011764705, 0.011764705, 0.011764705, 0.011764705, 0.011764705, 0.011764705, 0.011764705, 0.011764705, 0.011764705, 0.011764705, 0.011764705, 0.011764705, 0.011764705, 0.011764705, 0.011764705, 0.011764705, 0.011764705, 0.011764705, 0.011764705, 0.011764705, 0.011764705, 0.011764705, 0.011764705, 0.011764705, 0.011764705, 0.011764705, 0.011764705, 0.011764705, 0.011764705, 0.011764705, 0.011764705, 0.011764705, 0.011764705, 0.011764705, 0.011764705, 0.011764705, 0.011764705, 0.011764705, 0.011764705, 0.011764705, 0.011764705, 0.011764705, 0.011764705, 0.011764705, 0.011764705, 0.011764705, 0.011764705, 0.011764705, 0.011764705, 0.011764705, 0.011764705, 0.011764705, 0.011764705, 0.011764705, 0.011764705, 0.011764705, 0.011764705, 0.011764705, 0.011764705, 0.011764705, 0.011764705, 0.011764705, 0.011764705, 0.011764705, 0.011764705, 0.011764705, 0.011764705, 0.011764705, 0.011764705, 0.011764705, 0.011764705, 0.011764705, 0.011764705, 0.011764705, 0.011764705, 0.011764705, 0.011764705, 0.011764705, 0.011764705, 0.011764705, 0.011764705, 0.011764705, 0.011764705], ([0.0, 21.45442751854668, 0.0, 2.074812684327028, 3.292812096364698, 0.0, 0.0, 3.951947317233004, 0.0, 0.0], [0.0, 17.436268377897193, 0.0, 1.6067084810854446, 2.2449590168118023, 0.5233782968599021, 0.0, 2.7312647549818903, 0.0, 0.0], 4.018159140649487))
[Thread 1] Total splits: 0
Processed 1 zonotopes (Work Done: 0.0%); Generated 0 (2.210925462s/loop)
[Thread 1] Finished in 2.21s
 ────────────────────────────────────────────────────────────────────────────────
                                        Time                    Allocations      
                               ───────────────────────   ────────────────────────
       Tot / % measured:            2.23s / 100.0%            661MiB / 100.0%    

 Section               ncalls     time    %tot     avg     alloc    %tot      avg
 ────────────────────────────────────────────────────────────────────────────────
 Verify                     1    2.21s   99.0%   2.21s    634MiB   95.9%   634MiB
   Zonotope Loop            1    2.21s   99.0%   2.21s    634MiB   95.9%   634MiB
     Zonotope Propa...      1    2.19s   98.0%   2.19s    612MiB   92.6%   612MiB
       DiffZonotope...      4    1.70s   75.9%   424ms    540MiB   81.7%   135MiB
         Zonotope_R...      8    1.69s   75.7%   211ms    539MiB   81.7%  67.4MiB
           Influenc...      8    1.02s   45.8%   128ms    316MiB   47.8%  39.5MiB
             Multiply       8    664ms   29.7%  83.0ms    190MiB   28.8%  23.8MiB
             Alloca...      8    340ms   15.2%  42.5ms    126MiB   19.0%  15.7MiB
             Set Ma...      8   19.7ms    0.9%  2.46ms     0.00B    0.0%    0.00B
           Column M...      8    604ms   27.0%  75.5ms    112MiB   16.9%  14.0MiB
           Allocation       8   42.9ms    1.9%  5.36ms    112MiB   16.9%  14.0MiB
           Set Matrix       8   19.8ms    0.9%  2.48ms    131KiB    0.0%  16.4KiB
           Vectors          8    199μs    0.0%  24.9μs    272KiB    0.0%  34.0KiB
           Bounds           8   5.65μs    0.0%   706ns     0.00B    0.0%    0.00B
       DiffZonotope...      5    492ms   22.0%  98.4ms   72.0MiB   10.9%  14.4MiB
         Zonotope_D...     10    492ms   22.0%  49.2ms   72.0MiB   10.9%  7.20MiB
     Property Check         1   7.46ms    0.3%  7.46ms    887KiB    0.1%   887KiB
 Initialize                 1   22.7ms    1.0%  22.7ms   27.0MiB    4.1%  27.0MiB
 ────────────────────────────────────────────────────────────────────────────────
[VERYDIFF_TIMER] 2.363555168

[VERYDIFF_EXPERIMENT] NETWORK: /home/i57/steuber/NeuroDiff/repos/VeryDiffExperiments/src/../benchmarks/mnist-prune/specs/mnist_31_global_6.vnnlib
[VERYDIFF_EXPERIMENT] TIME: 124.027418954
