
[VERYDIFF_EXPERIMENT] Running on /home/i57/steuber/NeuroDiff/repos/VeryDiffExperiments/src/../benchmarks/mnist-prune/specs/mnist_30_local_15.vnnlib /home/i57/steuber/NeuroDiff/repos/VeryDiffExperiments/src/../benchmarks/mnist-prune/nets/mnist_relu_3_100.onnx
Found input X
op: matmul, weight: (100, 784), bias: nothing
op: bias, weight: nothing, bias: (100,)
op: relu, weight: nothing, bias: nothing
op: matmul, weight: (100, 100), bias: nothing
op: bias, weight: nothing, bias: (100,)
op: relu, weight: nothing, bias: nothing
op: matmul, weight: (10, 100), bias: nothing
op: bias, weight: nothing, bias: (10,)
op: relu, weight: nothing, bias: nothing
op: matmul, weight: (10, 10), bias: nothing
op: bias, weight: nothing, bias: (10,)
Found input X
op: gemm, weight: (100, 784), bias: (100,)
op: relu, weight: nothing, bias: nothing
op: gemm, weight: (100, 100), bias: (100,)
op: relu, weight: nothing, bias: nothing
op: gemm, weight: (10, 100), bias: (10,)
op: relu, weight: nothing, bias: nothing
op: gemm, weight: (10, 10), bias: (10,)
Distance: 1623.4465197373434
Distance: 201.62056963066925
Distance: 13.962962507051998
Distance: 0.183768135302671
Running with 1 threads
[Thread 1] Time to first task: 0.0s
Instable Generators: 19
Instable Generators: 31
Instable Generators: 5
Zono Bounds:
[-0.005569962803735298, -2.245655636301427, -2.5872065856016135, -1.8389526934646123, 0.0012959068000499094, -2.8387885524344245, -0.0007553383689469798, -2.623769176030236, -2.3187805153913983, -2.1784734825857104]
[4.837921064051532e-5, 1.8099393211776407, 2.4322143839873887, 2.695789093097487, 0.010094597007990707, 2.795914369134187, 0.0008293669997971126, 1.9261394747407836, 2.2747666662569346, 2.152371483285666]
[Thread 1] Processed 100 zonotopes (Work Done: 0.0%; Expected Zonos: Inf)
[Thread 1] Processed 200 zonotopes (Work Done: 0.0%; Expected Zonos: Inf)
[Thread 1] Processed 300 zonotopes (Work Done: 0.0%; Expected Zonos: Inf)
[Thread 1] Processed 400 zonotopes (Work Done: 0.0%; Expected Zonos: Inf)
[Thread 1] Processed 500 zonotopes (Work Done: 0.0%; Expected Zonos: Inf)
[Thread 1] Processed 600 zonotopes (Work Done: 0.0%; Expected Zonos: Inf)
[Thread 1] Processed 700 zonotopes (Work Done: 0.0%; Expected Zonos: Inf)
[Thread 1] Processed 800 zonotopes (Work Done: 0.0%; Expected Zonos: Inf)
[Thread 1] Processed 900 zonotopes (Work Done: 0.0%; Expected Zonos: Inf)
[Thread 1] Processed 1000 zonotopes (Work Done: 0.0%; Expected Zonos: Inf)
[Thread 1] Processed 1100 zonotopes (Work Done: 0.0%; Expected Zonos: Inf)
[Thread 1] Processed 1200 zonotopes (Work Done: 1.46484%; Expected Zonos: 81920.0)
[Thread 1] Processed 1300 zonotopes (Work Done: 5.56641%; Expected Zonos: 23354.385964912282)
[Thread 1] Processed 1400 zonotopes (Work Done: 9.81445%; Expected Zonos: 14264.676616915423)
[Thread 1] Processed 1500 zonotopes (Work Done: 15.13672%; Expected Zonos: 9909.677419354839)
[Thread 1] Processed 1600 zonotopes (Work Done: 21.5332%; Expected Zonos: 7430.385487528345)
[Thread 1] Processed 1700 zonotopes (Work Done: 28.95508%; Expected Zonos: 5871.163575042158)
[Thread 1] Processed 1800 zonotopes (Work Done: 35.98633%; Expected Zonos: 5001.899592944369)
[Thread 1] Processed 1900 zonotopes (Work Done: 42.62695%; Expected Zonos: 4457.273768613974)
[Thread 1] Processed 2000 zonotopes (Work Done: 49.16992%; Expected Zonos: 4067.527308838133)
[Thread 1] Processed 2100 zonotopes (Work Done: 55.32227%; Expected Zonos: 3795.9399823477493)
[Thread 1] Processed 2200 zonotopes (Work Done: 62.74414%; Expected Zonos: 3506.303501945525)
[Thread 1] Processed 2300 zonotopes (Work Done: 69.9707%; Expected Zonos: 3287.090020935101)
[Thread 1] Processed 2400 zonotopes (Work Done: 76.66016%; Expected Zonos: 3130.7006369426754)
[Thread 1] Processed 2500 zonotopes (Work Done: 82.71484%; Expected Zonos: 3022.432113341204)
[Thread 1] Processed 2600 zonotopes (Work Done: 88.03711%; Expected Zonos: 2953.300055463117)
[Thread 1] Processed 2700 zonotopes (Work Done: 93.43262%; Expected Zonos: 2889.7831199372877)
[Thread 1] Processed 2800 zonotopes (Work Done: 98.73047%; Expected Zonos: 2836.003956478734)
[Thread 1] Total splits: 1409
Processed 2819 zonotopes (Work Done: 100.0%); Generated 2818 (0.0015487964597374955s/loop)
[Thread 1] Finished in 4.37s
 ────────────────────────────────────────────────────────────────────────────────
                                        Time                    Allocations      
                               ───────────────────────   ────────────────────────
       Tot / % measured:            4.37s / 100.0%           4.43GiB / 100.0%    

 Section               ncalls     time    %tot     avg     alloc    %tot      avg
 ────────────────────────────────────────────────────────────────────────────────
 Verify                     1    4.37s  100.0%   4.37s   4.43GiB  100.0%  4.43GiB
   Zonotope Loop            1    4.37s  100.0%   4.37s   4.43GiB  100.0%  4.43GiB
     Zonotope Propa...  2.82k    3.38s   77.4%  1.20ms   2.03GiB   45.9%   757KiB
       DiffZonotope...  11.3k    2.52s   57.7%   223μs    476MiB   10.5%  43.2KiB
         Zonotope_D...  22.6k    1.34s   30.6%  59.2μs    260MiB    5.7%  11.8KiB
       DiffZonotope...  8.46k    846ms   19.4%   100μs   1.57GiB   35.4%   195KiB
         Zonotope_R...  16.9k    377ms    8.6%  22.3μs   0.96GiB   21.7%  59.7KiB
           Column M...  16.9k    120ms    2.7%  7.07μs    356MiB    7.8%  21.5KiB
           Influenc...  16.9k    110ms    2.5%  6.49μs    213MiB    4.7%  12.9KiB
             Multiply   16.9k   72.5ms    1.7%  4.29μs    129MiB    2.8%  7.80KiB
             Alloca...  16.9k   21.1ms    0.5%  1.25μs   84.3MiB    1.9%  5.10KiB
             Set Ma...  16.9k   8.44ms    0.2%   499ns     0.00B    0.0%    0.00B
           Allocation   16.9k   48.5ms    1.1%  2.87μs    353MiB    7.8%  21.4KiB
           Vectors      16.9k   39.4ms    0.9%  2.33μs   53.8MiB    1.2%  3.26KiB
           Set Matrix   16.9k   36.4ms    0.8%  2.15μs   9.48MiB    0.2%     587B
           Bounds       16.9k   3.41ms    0.1%   202ns     0.00B    0.0%    0.00B
     Compute Split      1.41k    364ms    8.3%   258μs    181MiB    4.0%   132KiB
     Property Check     2.82k   76.4ms    1.7%  27.1μs   48.6MiB    1.1%  17.7KiB
 Initialize                 1    331μs    0.0%   331μs    821KiB    0.0%   821KiB
 ────────────────────────────────────────────────────────────────────────────────
[VERYDIFF_TIMER] 4.396577356

[VERYDIFF_EXPERIMENT] NETWORK: /home/i57/steuber/NeuroDiff/repos/VeryDiffExperiments/src/../benchmarks/mnist-prune/specs/mnist_30_local_15.vnnlib
[VERYDIFF_EXPERIMENT] TIME: 4.700388237
