
[VERYDIFF_EXPERIMENT] Running on /home/i57/steuber/NeuroDiff/repos/VeryDiffExperiments/src/../benchmarks/mnist-prune/specs/mnist_95_global_4.vnnlib /home/i57/steuber/NeuroDiff/repos/VeryDiffExperiments/src/../benchmarks/mnist-prune/nets/mnist_relu_3_100.onnx
Found input X
op: matmul, weight: (100, 784), bias: nothing
op: bias, weight: nothing, bias: (100,)
op: relu, weight: nothing, bias: nothing
op: matmul, weight: (100, 100), bias: nothing
op: bias, weight: nothing, bias: (100,)
op: relu, weight: nothing, bias: nothing
op: matmul, weight: (10, 100), bias: nothing
op: bias, weight: nothing, bias: (10,)
op: relu, weight: nothing, bias: nothing
op: matmul, weight: (10, 10), bias: nothing
op: bias, weight: nothing, bias: (10,)
Found input X
op: gemm, weight: (100, 784), bias: (100,)
op: relu, weight: nothing, bias: nothing
op: gemm, weight: (100, 100), bias: (100,)
op: relu, weight: nothing, bias: nothing
op: gemm, weight: (10, 100), bias: (10,)
op: relu, weight: nothing, bias: nothing
op: gemm, weight: (10, 10), bias: (10,)
Distance: 368.62397500800625
Distance: 47.56803950402309
Distance: 2.8977568827249343
Distance: 0.01885471428334995
Running with 1 threads
[Thread 1] Time to first task: 0.0s
Instable Generators: 16
Instable Generators: 33
Instable Generators: 6
Zono Bounds:
[-0.00026959812894493455, -0.5245874526074871, -0.5917730763122158, -0.00048821950165681507, -0.5727328858200745, -0.0012554783093912858, -0.6054883528043356, -0.498888478127254, -0.4717305182029731, -0.5954825650197938]
[0.0004415175534718321, 0.4649556823062311, 0.5896204859947889, 0.0006169281181961806, 0.589343449378028, -0.00024285278541664535, 0.49336713535561927, 0.43469511662374627, 0.47166952743808627, 0.5804195794802393]
[Thread 1] Total splits: 0
Processed 1 zonotopes (Work Done: 100.0%); Generated 0 (0.052669779s/loop)
[Thread 1] Finished in 0.05s
 ────────────────────────────────────────────────────────────────────────────────
                                        Time                    Allocations      
                               ───────────────────────   ────────────────────────
       Tot / % measured:           53.2ms / 100.0%           96.0MiB / 100.0%    

 Section               ncalls     time    %tot     avg     alloc    %tot      avg
 ────────────────────────────────────────────────────────────────────────────────
 Verify                     1   52.7ms   99.0%  52.7ms   90.6MiB   94.4%  90.6MiB
   Zonotope Loop            1   52.7ms   98.9%  52.7ms   90.6MiB   94.4%  90.6MiB
     Zonotope Propa...      1   49.3ms   92.7%  49.3ms   70.7MiB   73.6%  70.7MiB
       DiffZonotope...      3   24.8ms   46.6%  8.27ms   66.6MiB   69.4%  22.2MiB
         Zonotope_R...      6   23.9ms   44.9%  3.99ms   65.1MiB   67.8%  10.9MiB
           Influenc...      6   22.6ms   42.5%  3.77ms   59.8MiB   62.3%  10.0MiB
             Multiply       6   17.1ms   32.1%  2.85ms   30.3MiB   31.5%  5.04MiB
             Set Ma...      6   4.13ms    7.7%   688μs     0.00B    0.0%    0.00B
             Alloca...      6   1.38ms    2.6%   231μs   29.6MiB   30.8%  4.93MiB
           Column M...      6    831μs    1.6%   139μs   2.62MiB    2.7%   447KiB
           Set Matrix       6    300μs    0.6%  50.0μs   4.50KiB    0.0%     768B
           Allocation       6    124μs    0.2%  20.7μs   2.62MiB    2.7%   447KiB
           Vectors          6   29.1μs    0.1%  4.85μs   19.5KiB    0.0%  3.26KiB
           Bounds           6   4.39μs    0.0%   732ns     0.00B    0.0%    0.00B
       DiffZonotope...      4   24.5ms   46.0%  6.12ms   4.06MiB    4.2%  1.02MiB
         Zonotope_D...      8   8.97ms   16.9%  1.12ms   2.68MiB    2.8%   343KiB
     Property Check         1   9.94μs    0.0%  9.94μs      992B    0.0%     992B
 Initialize                 1    546μs    1.0%   546μs   5.41MiB    5.6%  5.41MiB
 ────────────────────────────────────────────────────────────────────────────────
[VERYDIFF_TIMER] 0.086549094

[VERYDIFF_EXPERIMENT] NETWORK: /home/i57/steuber/NeuroDiff/repos/VeryDiffExperiments/src/../benchmarks/mnist-prune/specs/mnist_95_global_4.vnnlib
[VERYDIFF_EXPERIMENT] TIME: 0.389798283
