
[VERYDIFF_EXPERIMENT] Running on /home/i57/steuber/NeuroDiff/repos/VeryDiffExperiments/src/../benchmarks/mnist-prune/specs/mnist_13_global_6.vnnlib /home/i57/steuber/NeuroDiff/repos/VeryDiffExperiments/src/../benchmarks/mnist-prune/nets/mnist_relu_3_100.onnx
Found input X
op: matmul, weight: (100, 784), bias: nothing
op: bias, weight: nothing, bias: (100,)
op: relu, weight: nothing, bias: nothing
op: matmul, weight: (100, 100), bias: nothing
op: bias, weight: nothing, bias: (100,)
op: relu, weight: nothing, bias: nothing
op: matmul, weight: (10, 100), bias: nothing
op: bias, weight: nothing, bias: (10,)
op: relu, weight: nothing, bias: nothing
op: matmul, weight: (10, 10), bias: nothing
op: bias, weight: nothing, bias: (10,)
Found input X
op: gemm, weight: (100, 784), bias: (100,)
op: relu, weight: nothing, bias: nothing
op: gemm, weight: (100, 100), bias: (100,)
op: relu, weight: nothing, bias: nothing
op: gemm, weight: (10, 100), bias: (10,)
op: relu, weight: nothing, bias: nothing
op: gemm, weight: (10, 10), bias: (10,)
Distance: 1958.4889029213523
Distance: 144.28197153992141
Distance: 22.063573056613677
Distance: 0.8412832540489035
Running with 1 threads
[Thread 1] Time to first task: 0.0s
Instable Generators: 43
Instable Generators: 39
Instable Generators: 8
Zono Bounds:
[-5.43826683059597, -0.02143549754409323, -5.404202893013556, -6.776622537136317, -5.558305343828837, -6.190837799258625, -5.411323824503236, -6.6120772589321914, -6.21174551510415, -5.235549419216681]
[5.087399821187529, 0.00760965251965407, 5.505183223719113, 6.750848224896094, 5.57783544577127, 5.955605559034422, 5.2040037614901875, 6.978155786882401, 6.287991920663252, 5.42720963122025]
[Thread 1] Processed 100 zonotopes (Work Done: 0.0%; Expected Zonos: Inf)
[Thread 1] Processed 200 zonotopes (Work Done: 0.0%; Expected Zonos: Inf)
[Thread 1] Processed 300 zonotopes (Work Done: 0.0%; Expected Zonos: Inf)
[Thread 1] Processed 400 zonotopes (Work Done: 0.0%; Expected Zonos: Inf)
[Thread 1] Processed 500 zonotopes (Work Done: 0.0%; Expected Zonos: Inf)


TIMEOUT REACHED
UNKNOWN
[Thread 1] Total splits: 572
Processed 572 zonotopes (Work Done: 0.0%); Generated 1144 (0.21001467320279718s/loop)
[Thread 1] Finished in 120.13s
 ────────────────────────────────────────────────────────────────────────────────
                                        Time                    Allocations      
                               ───────────────────────   ────────────────────────
       Tot / % measured:             120s / 100.0%           61.3GiB / 100.0%    

 Section               ncalls     time    %tot     avg     alloc    %tot      avg
 ────────────────────────────────────────────────────────────────────────────────
 Verify                     1     120s  100.0%    120s   61.3GiB  100.0%  61.3GiB
   Zonotope Loop            1     120s  100.0%    120s   61.3GiB  100.0%  61.3GiB
     Zonotope Propa...    572    72.4s   60.2%   126ms   41.4GiB   67.5%  74.1MiB
       DiffZonotope...  1.72k    62.3s   51.9%  36.3ms   39.0GiB   63.7%  23.3MiB
         Zonotope_R...  3.43k    61.8s   51.5%  18.0ms   38.1GiB   62.2%  11.4MiB
           Influenc...  3.43k    54.0s   45.0%  15.7ms   35.1GiB   57.2%  10.5MiB
             Alloca...  3.43k    26.3s   21.9%  7.66ms   17.2GiB   28.1%  5.13MiB
             Multiply   3.43k    25.2s   21.0%  7.35ms   17.9GiB   29.1%  5.33MiB
             Set Ma...  3.43k    2.48s    2.1%   723μs     0.00B    0.0%    0.00B
           Allocation   3.43k    7.12s    5.9%  2.08ms   1.52GiB    2.5%   465KiB
           Column M...  3.43k    473ms    0.4%   138μs   1.52GiB    2.5%   465KiB
           Set Matrix   3.43k    192ms    0.2%  56.1μs   3.50MiB    0.0%  1.04KiB
           Vectors      3.43k   17.4ms    0.0%  5.07μs   10.9MiB    0.0%  3.26KiB
           Bounds       3.43k   2.44ms    0.0%   711ns     0.00B    0.0%    0.00B
       DiffZonotope...  2.29k    10.0s    8.3%  4.37ms   2.34GiB    3.8%  1.05MiB
         Zonotope_D...  4.58k    4.83s    4.0%  1.05ms   1.53GiB    2.5%   350KiB
     Compute Split        572    31.8s   26.5%  55.6ms   8.68GiB   14.2%  15.5MiB
     Property Check       572    113ms    0.1%   198μs    119MiB    0.2%   213KiB
 Initialize                 1    545μs    0.0%   545μs   5.41MiB    0.0%  5.41MiB
 ────────────────────────────────────────────────────────────────────────────────
[VERYDIFF_TIMER] 120.170575446

[VERYDIFF_EXPERIMENT] NETWORK: /home/i57/steuber/NeuroDiff/repos/VeryDiffExperiments/src/../benchmarks/mnist-prune/specs/mnist_13_global_6.vnnlib
[VERYDIFF_EXPERIMENT] TIME: 120.63408181
