
[VERYDIFF_EXPERIMENT] Running on /home/i57/steuber/NeuroDiff/repos/VeryDiffExperiments/src/../benchmarks/mnist-prune/specs/mnist_25_local_24.vnnlib /home/i57/steuber/NeuroDiff/repos/VeryDiffExperiments/src/../benchmarks/mnist-prune/nets/mnist_relu_2_512.onnx
Loading /home/i57/steuber/NeuroDiff/repos/VeryDiffExperiments/src/../benchmarks/mnist-prune/nets/mnist_relu_2_512.onnx and /home/i57/steuber/NeuroDiff/repos/VeryDiffExperiments/src/../benchmarks/mnist-prune/nets_pruned/mnist_relu_2_512_0.79-old.onnx
INPUT SHAPE: 784

[NEQUIV] 134.00358262281364

[   3.52041295 -138.53416547  -60.07661156  -97.90507993  -57.17884004
 -108.54747119  -59.40818758  -84.62203909  -86.76382884  -48.15870785]
[   2.93999663 -137.97346669  -59.79953643  -97.57635692  -56.42031187
 -107.69549503  -59.47829764  -83.62174143  -86.38424526  -47.71209705]
NETWORKS NOT EQUIVALENT
Refined: 0 | Refine Limit: -1 | Wrong: 0 | Right: 1 | Total: 1 | Total Zonos Considered: 1 | Expected 2 (50.0%)

time: 0.833860366

[VERYDIFF_TIMER] 0.857561906

[VERYDIFF_EXPERIMENT] NETWORK: /home/i57/steuber/NeuroDiff/repos/VeryDiffExperiments/src/../benchmarks/mnist-prune/specs/mnist_25_local_24.vnnlib
[VERYDIFF_EXPERIMENT] TIME: 1.146210744
