
[VERYDIFF_EXPERIMENT] Running on /home/i57/steuber/NeuroDiff/repos/VeryDiffExperiments/src/../benchmarks/mnist-prune/specs/mnist_54_local_15.vnnlib /home/i57/steuber/NeuroDiff/repos/VeryDiffExperiments/src/../benchmarks/mnist-prune/nets/mnist_relu_3_100.onnx
Found input X
op: matmul, weight: (100, 784), bias: nothing
op: bias, weight: nothing, bias: (100,)
op: relu, weight: nothing, bias: nothing
op: matmul, weight: (100, 100), bias: nothing
op: bias, weight: nothing, bias: (100,)
op: relu, weight: nothing, bias: nothing
op: matmul, weight: (10, 100), bias: nothing
op: bias, weight: nothing, bias: (10,)
op: relu, weight: nothing, bias: nothing
op: matmul, weight: (10, 10), bias: nothing
op: bias, weight: nothing, bias: (10,)
Found input X
op: gemm, weight: (100, 784), bias: (100,)
op: relu, weight: nothing, bias: nothing
op: gemm, weight: (100, 100), bias: (100,)
op: relu, weight: nothing, bias: nothing
op: gemm, weight: (10, 100), bias: (10,)
op: relu, weight: nothing, bias: nothing
op: gemm, weight: (10, 10), bias: (10,)
Distance: 1958.4889029213523
Distance: 144.28197153992141
Distance: 22.063573056613677
Distance: 0.8412832540489035
Running with 1 threads
[Thread 1] Time to first task: 0.0s
Instable Generators: 24
Instable Generators: 25
Instable Generators: 5
Zono Bounds:
[-2.2221580968968193, -1.956415543072871, -2.9593302635250422, -0.02250072308813937, -2.9851808723871933, -2.9003588397628306, -3.2416856471891182, -0.013942554858680178, -3.101150902346787, 0.0006975201642572103]
[1.6823841870922758, 1.871800440916446, 2.1485123477149104, -0.01484969569537322, 2.7711014383465677, 2.9702050829858377, 2.194701547235581, -0.007031198436115827, 3.2957564573963394, 0.01844074206533893]
[Thread 1] Processed 100 zonotopes (Work Done: 0.0%; Expected Zonos: Inf)
[Thread 1] Processed 200 zonotopes (Work Done: 0.0%; Expected Zonos: Inf)
[Thread 1] Processed 300 zonotopes (Work Done: 0.0%; Expected Zonos: Inf)
[Thread 1] Processed 400 zonotopes (Work Done: 0.0%; Expected Zonos: Inf)
[Thread 1] Processed 500 zonotopes (Work Done: 0.0%; Expected Zonos: Inf)
[Thread 1] Processed 600 zonotopes (Work Done: 0.0%; Expected Zonos: Inf)
[Thread 1] Processed 700 zonotopes (Work Done: 0.0%; Expected Zonos: Inf)
[Thread 1] Processed 800 zonotopes (Work Done: 0.0%; Expected Zonos: Inf)
[Thread 1] Processed 900 zonotopes (Work Done: 0.0%; Expected Zonos: Inf)
[Thread 1] Processed 1000 zonotopes (Work Done: 0.0%; Expected Zonos: Inf)
[Thread 1] Processed 1100 zonotopes (Work Done: 0.0%; Expected Zonos: Inf)
[Thread 1] Processed 1200 zonotopes (Work Done: 0.0%; Expected Zonos: Inf)
[Thread 1] Processed 1300 zonotopes (Work Done: 0.0%; Expected Zonos: Inf)
[Thread 1] Processed 1400 zonotopes (Work Done: 0.0%; Expected Zonos: Inf)
[Thread 1] Processed 1500 zonotopes (Work Done: 0.0%; Expected Zonos: Inf)
[Thread 1] Processed 1600 zonotopes (Work Done: 0.0%; Expected Zonos: Inf)
[Thread 1] Processed 1700 zonotopes (Work Done: 0.0%; Expected Zonos: Inf)
[Thread 1] Processed 1800 zonotopes (Work Done: 0.0%; Expected Zonos: Inf)
[Thread 1] Processed 1900 zonotopes (Work Done: 0.0%; Expected Zonos: Inf)
[Thread 1] Processed 2000 zonotopes (Work Done: 0.0%; Expected Zonos: Inf)
[Thread 1] Processed 2100 zonotopes (Work Done: 0.0%; Expected Zonos: Inf)
[Thread 1] Processed 2200 zonotopes (Work Done: 0.0%; Expected Zonos: Inf)
[Thread 1] Processed 2300 zonotopes (Work Done: 0.0%; Expected Zonos: Inf)
[Thread 1] Processed 2400 zonotopes (Work Done: 0.0%; Expected Zonos: Inf)
[Thread 1] Processed 2500 zonotopes (Work Done: 0.0%; Expected Zonos: Inf)
[Thread 1] Processed 2600 zonotopes (Work Done: 0.0%; Expected Zonos: Inf)
[Thread 1] Processed 2700 zonotopes (Work Done: 0.0%; Expected Zonos: Inf)
[Thread 1] Processed 2800 zonotopes (Work Done: 0.0%; Expected Zonos: Inf)
[Thread 1] Processed 2900 zonotopes (Work Done: 0.0%; Expected Zonos: Inf)
[Thread 1] Processed 3000 zonotopes (Work Done: 0.0%; Expected Zonos: Inf)
[Thread 1] Processed 3100 zonotopes (Work Done: 0.0%; Expected Zonos: Inf)
[Thread 1] Processed 3200 zonotopes (Work Done: 0.0%; Expected Zonos: Inf)
[Thread 1] Processed 3300 zonotopes (Work Done: 0.0%; Expected Zonos: Inf)
[Thread 1] Processed 3400 zonotopes (Work Done: 0.0%; Expected Zonos: Inf)
[Thread 1] Processed 3500 zonotopes (Work Done: 0.0%; Expected Zonos: Inf)
[Thread 1] Processed 3600 zonotopes (Work Done: 0.0%; Expected Zonos: Inf)
[Thread 1] Processed 3700 zonotopes (Work Done: 0.0%; Expected Zonos: Inf)
[Thread 1] Processed 3800 zonotopes (Work Done: 0.0%; Expected Zonos: Inf)
[Thread 1] Processed 3900 zonotopes (Work Done: 0.0%; Expected Zonos: Inf)
[Thread 1] Processed 4000 zonotopes (Work Done: 0.0%; Expected Zonos: Inf)
[Thread 1] Processed 4100 zonotopes (Work Done: 0.0%; Expected Zonos: Inf)
[Thread 1] Processed 4200 zonotopes (Work Done: 0.0%; Expected Zonos: Inf)
[Thread 1] Processed 4300 zonotopes (Work Done: 0.0%; Expected Zonos: Inf)
[Thread 1] Processed 4400 zonotopes (Work Done: 0.0%; Expected Zonos: Inf)
[Thread 1] Processed 4500 zonotopes (Work Done: 0.0%; Expected Zonos: Inf)
[Thread 1] Processed 4600 zonotopes (Work Done: 0.0%; Expected Zonos: Inf)
[Thread 1] Processed 4700 zonotopes (Work Done: 0.0%; Expected Zonos: Inf)
[Thread 1] Processed 4800 zonotopes (Work Done: 0.0%; Expected Zonos: Inf)
[Thread 1] Processed 4900 zonotopes (Work Done: 0.0%; Expected Zonos: Inf)
[Thread 1] Processed 5000 zonotopes (Work Done: 0.0%; Expected Zonos: Inf)
[Thread 1] Processed 5100 zonotopes (Work Done: 0.0%; Expected Zonos: Inf)
[Thread 1] Processed 5200 zonotopes (Work Done: 0.0%; Expected Zonos: Inf)
[Thread 1] Processed 5300 zonotopes (Work Done: 0.0%; Expected Zonos: Inf)
[Thread 1] Processed 5400 zonotopes (Work Done: 0.0%; Expected Zonos: Inf)
[Thread 1] Processed 5500 zonotopes (Work Done: 0.0%; Expected Zonos: Inf)
[Thread 1] Processed 5600 zonotopes (Work Done: 0.0%; Expected Zonos: Inf)
[Thread 1] Processed 5700 zonotopes (Work Done: 0.0%; Expected Zonos: Inf)
[Thread 1] Processed 5800 zonotopes (Work Done: 0.0%; Expected Zonos: Inf)
[Thread 1] Processed 5900 zonotopes (Work Done: 0.0%; Expected Zonos: Inf)
[Thread 1] Processed 6000 zonotopes (Work Done: 0.0%; Expected Zonos: Inf)
[Thread 1] Processed 6100 zonotopes (Work Done: 0.0%; Expected Zonos: Inf)
[Thread 1] Processed 6200 zonotopes (Work Done: 0.0%; Expected Zonos: Inf)
[Thread 1] Processed 6300 zonotopes (Work Done: 0.0%; Expected Zonos: Inf)
[Thread 1] Processed 6400 zonotopes (Work Done: 0.0%; Expected Zonos: Inf)
[Thread 1] Processed 6500 zonotopes (Work Done: 0.0%; Expected Zonos: Inf)
[Thread 1] Processed 6600 zonotopes (Work Done: 0.0%; Expected Zonos: Inf)
[Thread 1] Processed 6700 zonotopes (Work Done: 0.0%; Expected Zonos: Inf)
[Thread 1] Processed 6800 zonotopes (Work Done: 0.0%; Expected Zonos: Inf)
[Thread 1] Processed 6900 zonotopes (Work Done: 0.0%; Expected Zonos: Inf)
[Thread 1] Processed 7000 zonotopes (Work Done: 0.0%; Expected Zonos: Inf)
[Thread 1] Processed 7100 zonotopes (Work Done: 0.0%; Expected Zonos: Inf)
[Thread 1] Processed 7200 zonotopes (Work Done: 0.0%; Expected Zonos: Inf)
[Thread 1] Processed 7300 zonotopes (Work Done: 0.0%; Expected Zonos: Inf)
[Thread 1] Processed 7400 zonotopes (Work Done: 0.0%; Expected Zonos: Inf)
[Thread 1] Processed 7500 zonotopes (Work Done: 0.0%; Expected Zonos: Inf)
[Thread 1] Processed 7600 zonotopes (Work Done: 0.0%; Expected Zonos: Inf)
[Thread 1] Processed 7700 zonotopes (Work Done: 0.0%; Expected Zonos: Inf)
[Thread 1] Processed 7800 zonotopes (Work Done: 0.0%; Expected Zonos: Inf)
[Thread 1] Processed 7900 zonotopes (Work Done: 0.0%; Expected Zonos: Inf)
[Thread 1] Processed 8000 zonotopes (Work Done: 0.0%; Expected Zonos: Inf)
[Thread 1] Processed 8100 zonotopes (Work Done: 0.0%; Expected Zonos: Inf)
[Thread 1] Processed 8200 zonotopes (Work Done: 0.0%; Expected Zonos: Inf)
[Thread 1] Processed 8300 zonotopes (Work Done: 0.0%; Expected Zonos: Inf)
[Thread 1] Processed 8400 zonotopes (Work Done: 0.0%; Expected Zonos: Inf)
[Thread 1] Processed 8500 zonotopes (Work Done: 0.0%; Expected Zonos: Inf)
[Thread 1] Processed 8600 zonotopes (Work Done: 0.0%; Expected Zonos: Inf)
[Thread 1] Processed 8700 zonotopes (Work Done: 0.0%; Expected Zonos: Inf)
[Thread 1] Processed 8800 zonotopes (Work Done: 0.0%; Expected Zonos: Inf)
[Thread 1] Processed 8900 zonotopes (Work Done: 0.0%; Expected Zonos: Inf)
[Thread 1] Processed 9000 zonotopes (Work Done: 0.0%; Expected Zonos: Inf)
[Thread 1] Processed 9100 zonotopes (Work Done: 0.0%; Expected Zonos: Inf)
[Thread 1] Processed 9200 zonotopes (Work Done: 0.0%; Expected Zonos: Inf)
[Thread 1] Processed 9300 zonotopes (Work Done: 0.0%; Expected Zonos: Inf)
[Thread 1] Processed 9400 zonotopes (Work Done: 0.0%; Expected Zonos: Inf)
[Thread 1] Processed 9500 zonotopes (Work Done: 0.0%; Expected Zonos: Inf)
[Thread 1] Processed 9600 zonotopes (Work Done: 0.0%; Expected Zonos: Inf)
[Thread 1] Processed 9700 zonotopes (Work Done: 0.0%; Expected Zonos: Inf)
[Thread 1] Processed 9800 zonotopes (Work Done: 0.0%; Expected Zonos: Inf)
[Thread 1] Processed 9900 zonotopes (Work Done: 0.0%; Expected Zonos: Inf)
[Thread 1] Processed 10000 zonotopes (Work Done: 0.0%; Expected Zonos: Inf)
[Thread 1] Processed 10100 zonotopes (Work Done: 0.0%; Expected Zonos: Inf)
[Thread 1] Processed 10200 zonotopes (Work Done: 0.0%; Expected Zonos: Inf)
[Thread 1] Processed 10300 zonotopes (Work Done: 0.0%; Expected Zonos: Inf)
[Thread 1] Processed 10400 zonotopes (Work Done: 0.0%; Expected Zonos: Inf)
[Thread 1] Processed 10500 zonotopes (Work Done: 0.0%; Expected Zonos: Inf)
[Thread 1] Processed 10600 zonotopes (Work Done: 0.0%; Expected Zonos: Inf)
[Thread 1] Processed 10700 zonotopes (Work Done: 0.0%; Expected Zonos: Inf)
[Thread 1] Processed 10800 zonotopes (Work Done: 0.0%; Expected Zonos: Inf)
[Thread 1] Processed 10900 zonotopes (Work Done: 0.0%; Expected Zonos: Inf)
[Thread 1] Processed 11000 zonotopes (Work Done: 0.0%; Expected Zonos: Inf)
[Thread 1] Processed 11100 zonotopes (Work Done: 0.0%; Expected Zonos: Inf)
[Thread 1] Processed 11200 zonotopes (Work Done: 0.0%; Expected Zonos: Inf)
[Thread 1] Processed 11300 zonotopes (Work Done: 0.0%; Expected Zonos: Inf)
[Thread 1] Processed 11400 zonotopes (Work Done: 0.0%; Expected Zonos: Inf)
[Thread 1] Processed 11500 zonotopes (Work Done: 0.0%; Expected Zonos: Inf)
[Thread 1] Processed 11600 zonotopes (Work Done: 0.0%; Expected Zonos: Inf)
[Thread 1] Processed 11700 zonotopes (Work Done: 0.0%; Expected Zonos: Inf)
[Thread 1] Processed 11800 zonotopes (Work Done: 0.0%; Expected Zonos: Inf)
[Thread 1] Processed 11900 zonotopes (Work Done: 0.0%; Expected Zonos: Inf)
[Thread 1] Processed 12000 zonotopes (Work Done: 0.0%; Expected Zonos: Inf)
[Thread 1] Processed 12100 zonotopes (Work Done: 0.0%; Expected Zonos: Inf)
[Thread 1] Processed 12200 zonotopes (Work Done: 0.0%; Expected Zonos: Inf)
[Thread 1] Processed 12300 zonotopes (Work Done: 0.0%; Expected Zonos: Inf)
[Thread 1] Processed 12400 zonotopes (Work Done: 0.0%; Expected Zonos: Inf)
[Thread 1] Processed 12500 zonotopes (Work Done: 0.0%; Expected Zonos: Inf)
[Thread 1] Processed 12600 zonotopes (Work Done: 0.0%; Expected Zonos: Inf)
[Thread 1] Processed 12700 zonotopes (Work Done: 0.0%; Expected Zonos: Inf)
[Thread 1] Processed 12800 zonotopes (Work Done: 0.0%; Expected Zonos: Inf)
[Thread 1] Processed 12900 zonotopes (Work Done: 0.0%; Expected Zonos: Inf)
[Thread 1] Processed 13000 zonotopes (Work Done: 0.0%; Expected Zonos: Inf)
[Thread 1] Processed 13100 zonotopes (Work Done: 0.0%; Expected Zonos: Inf)
[Thread 1] Processed 13200 zonotopes (Work Done: 0.0%; Expected Zonos: Inf)
[Thread 1] Processed 13300 zonotopes (Work Done: 0.0%; Expected Zonos: Inf)
[Thread 1] Processed 13400 zonotopes (Work Done: 0.0%; Expected Zonos: Inf)
[Thread 1] Processed 13500 zonotopes (Work Done: 0.0%; Expected Zonos: Inf)
[Thread 1] Processed 13600 zonotopes (Work Done: 0.0%; Expected Zonos: Inf)
[Thread 1] Processed 13700 zonotopes (Work Done: 0.0%; Expected Zonos: Inf)
[Thread 1] Processed 13800 zonotopes (Work Done: 0.0%; Expected Zonos: Inf)
[Thread 1] Processed 13900 zonotopes (Work Done: 0.0%; Expected Zonos: Inf)
[Thread 1] Processed 14000 zonotopes (Work Done: 0.0%; Expected Zonos: Inf)
[Thread 1] Processed 14100 zonotopes (Work Done: 0.0%; Expected Zonos: Inf)
[Thread 1] Processed 14200 zonotopes (Work Done: 0.0%; Expected Zonos: Inf)
[Thread 1] Processed 14300 zonotopes (Work Done: 0.0%; Expected Zonos: Inf)
[Thread 1] Processed 14400 zonotopes (Work Done: 0.0%; Expected Zonos: Inf)
[Thread 1] Processed 14500 zonotopes (Work Done: 0.0%; Expected Zonos: Inf)
[Thread 1] Processed 14600 zonotopes (Work Done: 0.0%; Expected Zonos: Inf)
[Thread 1] Processed 14700 zonotopes (Work Done: 0.0%; Expected Zonos: Inf)
[Thread 1] Processed 14800 zonotopes (Work Done: 0.0%; Expected Zonos: Inf)
[Thread 1] Processed 14900 zonotopes (Work Done: 0.0%; Expected Zonos: Inf)
[Thread 1] Processed 15000 zonotopes (Work Done: 0.0%; Expected Zonos: Inf)
[Thread 1] Processed 15100 zonotopes (Work Done: 0.0%; Expected Zonos: Inf)
[Thread 1] Processed 15200 zonotopes (Work Done: 0.0%; Expected Zonos: Inf)
[Thread 1] Processed 15300 zonotopes (Work Done: 0.0%; Expected Zonos: Inf)
[Thread 1] Processed 15400 zonotopes (Work Done: 0.0%; Expected Zonos: Inf)
[Thread 1] Processed 15500 zonotopes (Work Done: 0.0%; Expected Zonos: Inf)
[Thread 1] Processed 15600 zonotopes (Work Done: 0.0%; Expected Zonos: Inf)
[Thread 1] Processed 15700 zonotopes (Work Done: 0.0%; Expected Zonos: Inf)
[Thread 1] Processed 15800 zonotopes (Work Done: 0.0%; Expected Zonos: Inf)
[Thread 1] Processed 15900 zonotopes (Work Done: 0.0%; Expected Zonos: Inf)
[Thread 1] Processed 16000 zonotopes (Work Done: 0.0%; Expected Zonos: Inf)
[Thread 1] Processed 16100 zonotopes (Work Done: 0.0%; Expected Zonos: Inf)
[Thread 1] Processed 16200 zonotopes (Work Done: 0.0%; Expected Zonos: Inf)
[Thread 1] Processed 16300 zonotopes (Work Done: 0.0%; Expected Zonos: Inf)
[Thread 1] Processed 16400 zonotopes (Work Done: 0.0%; Expected Zonos: Inf)
[Thread 1] Processed 16500 zonotopes (Work Done: 0.0%; Expected Zonos: Inf)
[Thread 1] Processed 16600 zonotopes (Work Done: 0.0%; Expected Zonos: Inf)
[Thread 1] Processed 16700 zonotopes (Work Done: 0.0%; Expected Zonos: Inf)
[Thread 1] Processed 16800 zonotopes (Work Done: 0.0%; Expected Zonos: Inf)
[Thread 1] Processed 16900 zonotopes (Work Done: 0.0%; Expected Zonos: Inf)
[Thread 1] Processed 17000 zonotopes (Work Done: 0.0%; Expected Zonos: Inf)
[Thread 1] Processed 17100 zonotopes (Work Done: 0.0%; Expected Zonos: Inf)
[Thread 1] Processed 17200 zonotopes (Work Done: 0.0%; Expected Zonos: Inf)
[Thread 1] Processed 17300 zonotopes (Work Done: 0.0%; Expected Zonos: Inf)
[Thread 1] Processed 17400 zonotopes (Work Done: 0.0%; Expected Zonos: Inf)
[Thread 1] Processed 17500 zonotopes (Work Done: 0.0%; Expected Zonos: Inf)
[Thread 1] Processed 17600 zonotopes (Work Done: 0.0%; Expected Zonos: Inf)
[Thread 1] Processed 17700 zonotopes (Work Done: 0.0%; Expected Zonos: Inf)
[Thread 1] Processed 17800 zonotopes (Work Done: 0.0%; Expected Zonos: Inf)
[Thread 1] Processed 17900 zonotopes (Work Done: 0.0%; Expected Zonos: Inf)
[Thread 1] Processed 18000 zonotopes (Work Done: 0.0%; Expected Zonos: Inf)
[Thread 1] Processed 18100 zonotopes (Work Done: 0.0%; Expected Zonos: Inf)
[Thread 1] Processed 18200 zonotopes (Work Done: 0.0%; Expected Zonos: Inf)
[Thread 1] Processed 18300 zonotopes (Work Done: 0.0%; Expected Zonos: Inf)
[Thread 1] Processed 18400 zonotopes (Work Done: 0.0%; Expected Zonos: Inf)
[Thread 1] Processed 18500 zonotopes (Work Done: 0.0%; Expected Zonos: Inf)
[Thread 1] Processed 18600 zonotopes (Work Done: 0.0%; Expected Zonos: Inf)
[Thread 1] Processed 18700 zonotopes (Work Done: 0.0%; Expected Zonos: Inf)
[Thread 1] Processed 18800 zonotopes (Work Done: 0.0%; Expected Zonos: Inf)
[Thread 1] Processed 18900 zonotopes (Work Done: 0.0%; Expected Zonos: Inf)
[Thread 1] Processed 19000 zonotopes (Work Done: 0.0%; Expected Zonos: Inf)
[Thread 1] Processed 19100 zonotopes (Work Done: 0.0%; Expected Zonos: Inf)
[Thread 1] Processed 19200 zonotopes (Work Done: 0.0%; Expected Zonos: Inf)
[Thread 1] Processed 19300 zonotopes (Work Done: 0.0%; Expected Zonos: Inf)
[Thread 1] Processed 19400 zonotopes (Work Done: 0.0%; Expected Zonos: Inf)
[Thread 1] Processed 19500 zonotopes (Work Done: 0.0%; Expected Zonos: Inf)
[Thread 1] Processed 19600 zonotopes (Work Done: 0.0%; Expected Zonos: Inf)
[Thread 1] Processed 19700 zonotopes (Work Done: 0.0%; Expected Zonos: Inf)
[Thread 1] Processed 19800 zonotopes (Work Done: 0.0%; Expected Zonos: Inf)
[Thread 1] Processed 19900 zonotopes (Work Done: 0.0%; Expected Zonos: Inf)
[Thread 1] Processed 20000 zonotopes (Work Done: 0.0%; Expected Zonos: Inf)
[Thread 1] Processed 20100 zonotopes (Work Done: 0.0%; Expected Zonos: Inf)
[Thread 1] Processed 20200 zonotopes (Work Done: 0.0%; Expected Zonos: Inf)
[Thread 1] Processed 20300 zonotopes (Work Done: 0.0%; Expected Zonos: Inf)
[Thread 1] Processed 20400 zonotopes (Work Done: 0.0%; Expected Zonos: Inf)
[Thread 1] Processed 20500 zonotopes (Work Done: 0.0%; Expected Zonos: Inf)
[Thread 1] Processed 20600 zonotopes (Work Done: 0.0%; Expected Zonos: Inf)
[Thread 1] Processed 20700 zonotopes (Work Done: 0.0%; Expected Zonos: Inf)
[Thread 1] Processed 20800 zonotopes (Work Done: 0.0%; Expected Zonos: Inf)
[Thread 1] Processed 20900 zonotopes (Work Done: 0.0%; Expected Zonos: Inf)
[Thread 1] Processed 21000 zonotopes (Work Done: 0.0%; Expected Zonos: Inf)
[Thread 1] Processed 21100 zonotopes (Work Done: 0.0%; Expected Zonos: Inf)
[Thread 1] Processed 21200 zonotopes (Work Done: 0.0%; Expected Zonos: Inf)
[Thread 1] Processed 21300 zonotopes (Work Done: 0.0%; Expected Zonos: Inf)
[Thread 1] Processed 21400 zonotopes (Work Done: 0.0%; Expected Zonos: Inf)
[Thread 1] Processed 21500 zonotopes (Work Done: 0.0%; Expected Zonos: Inf)
[Thread 1] Processed 21600 zonotopes (Work Done: 0.0%; Expected Zonos: Inf)
[Thread 1] Processed 21700 zonotopes (Work Done: 0.0%; Expected Zonos: Inf)
[Thread 1] Processed 21800 zonotopes (Work Done: 0.0%; Expected Zonos: Inf)
[Thread 1] Processed 21900 zonotopes (Work Done: 0.0%; Expected Zonos: Inf)
[Thread 1] Processed 22000 zonotopes (Work Done: 0.0%; Expected Zonos: Inf)
[Thread 1] Processed 22100 zonotopes (Work Done: 0.0%; Expected Zonos: Inf)
[Thread 1] Processed 22200 zonotopes (Work Done: 0.0%; Expected Zonos: Inf)
[Thread 1] Processed 22300 zonotopes (Work Done: 0.0%; Expected Zonos: Inf)
[Thread 1] Processed 22400 zonotopes (Work Done: 0.0%; Expected Zonos: Inf)
[Thread 1] Processed 22500 zonotopes (Work Done: 0.0%; Expected Zonos: Inf)
[Thread 1] Processed 22600 zonotopes (Work Done: 0.0%; Expected Zonos: Inf)
[Thread 1] Processed 22700 zonotopes (Work Done: 0.0%; Expected Zonos: Inf)
[Thread 1] Processed 22800 zonotopes (Work Done: 0.0%; Expected Zonos: Inf)
[Thread 1] Processed 22900 zonotopes (Work Done: 0.0%; Expected Zonos: Inf)
[Thread 1] Processed 23000 zonotopes (Work Done: 0.0%; Expected Zonos: Inf)
[Thread 1] Processed 23100 zonotopes (Work Done: 0.0%; Expected Zonos: Inf)
[Thread 1] Processed 23200 zonotopes (Work Done: 0.0%; Expected Zonos: Inf)
[Thread 1] Processed 23300 zonotopes (Work Done: 0.0%; Expected Zonos: Inf)
[Thread 1] Processed 23400 zonotopes (Work Done: 0.0%; Expected Zonos: Inf)
[Thread 1] Processed 23500 zonotopes (Work Done: 0.0%; Expected Zonos: Inf)
[Thread 1] Processed 23600 zonotopes (Work Done: 0.0%; Expected Zonos: Inf)
[Thread 1] Processed 23700 zonotopes (Work Done: 0.0%; Expected Zonos: Inf)
[Thread 1] Processed 23800 zonotopes (Work Done: 0.0%; Expected Zonos: Inf)
[Thread 1] Processed 23900 zonotopes (Work Done: 0.0%; Expected Zonos: Inf)
[Thread 1] Processed 24000 zonotopes (Work Done: 0.0%; Expected Zonos: Inf)
[Thread 1] Processed 24100 zonotopes (Work Done: 0.0%; Expected Zonos: Inf)
[Thread 1] Processed 24200 zonotopes (Work Done: 0.0%; Expected Zonos: Inf)
[Thread 1] Processed 24300 zonotopes (Work Done: 0.0%; Expected Zonos: Inf)
[Thread 1] Processed 24400 zonotopes (Work Done: 0.0%; Expected Zonos: Inf)
[Thread 1] Processed 24500 zonotopes (Work Done: 0.0%; Expected Zonos: Inf)
[Thread 1] Processed 24600 zonotopes (Work Done: 0.0%; Expected Zonos: Inf)
[Thread 1] Processed 24700 zonotopes (Work Done: 0.0%; Expected Zonos: Inf)
[Thread 1] Processed 24800 zonotopes (Work Done: 0.0%; Expected Zonos: Inf)
[Thread 1] Processed 24900 zonotopes (Work Done: 0.0%; Expected Zonos: Inf)
[Thread 1] Processed 25000 zonotopes (Work Done: 0.0%; Expected Zonos: Inf)
[Thread 1] Processed 25100 zonotopes (Work Done: 0.0%; Expected Zonos: Inf)
[Thread 1] Processed 25200 zonotopes (Work Done: 0.0%; Expected Zonos: Inf)
[Thread 1] Processed 25300 zonotopes (Work Done: 0.0%; Expected Zonos: Inf)
[Thread 1] Processed 25400 zonotopes (Work Done: 0.0%; Expected Zonos: Inf)
[Thread 1] Processed 25500 zonotopes (Work Done: 0.0%; Expected Zonos: Inf)
[Thread 1] Processed 25600 zonotopes (Work Done: 0.0%; Expected Zonos: Inf)
[Thread 1] Processed 25700 zonotopes (Work Done: 0.0%; Expected Zonos: Inf)
[Thread 1] Processed 25800 zonotopes (Work Done: 0.0%; Expected Zonos: Inf)
[Thread 1] Processed 25900 zonotopes (Work Done: 0.0%; Expected Zonos: Inf)
[Thread 1] Processed 26000 zonotopes (Work Done: 0.0%; Expected Zonos: Inf)
[Thread 1] Processed 26100 zonotopes (Work Done: 0.0%; Expected Zonos: Inf)
[Thread 1] Processed 26200 zonotopes (Work Done: 0.0%; Expected Zonos: Inf)
[Thread 1] Processed 26300 zonotopes (Work Done: 0.0%; Expected Zonos: Inf)
[Thread 1] Processed 26400 zonotopes (Work Done: 0.0%; Expected Zonos: Inf)
[Thread 1] Processed 26500 zonotopes (Work Done: 0.0%; Expected Zonos: Inf)
[Thread 1] Processed 26600 zonotopes (Work Done: 0.0%; Expected Zonos: Inf)
[Thread 1] Processed 26700 zonotopes (Work Done: 0.0%; Expected Zonos: Inf)
[Thread 1] Processed 26800 zonotopes (Work Done: 0.0%; Expected Zonos: Inf)
[Thread 1] Processed 26900 zonotopes (Work Done: 0.0%; Expected Zonos: Inf)
[Thread 1] Processed 27000 zonotopes (Work Done: 0.0%; Expected Zonos: Inf)
[Thread 1] Processed 27100 zonotopes (Work Done: 0.0%; Expected Zonos: Inf)
[Thread 1] Processed 27200 zonotopes (Work Done: 0.0%; Expected Zonos: Inf)
[Thread 1] Processed 27300 zonotopes (Work Done: 0.0%; Expected Zonos: Inf)
[Thread 1] Processed 27400 zonotopes (Work Done: 0.0%; Expected Zonos: Inf)
[Thread 1] Processed 27500 zonotopes (Work Done: 0.0%; Expected Zonos: Inf)
[Thread 1] Processed 27600 zonotopes (Work Done: 0.0%; Expected Zonos: Inf)
[Thread 1] Processed 27700 zonotopes (Work Done: 0.0%; Expected Zonos: Inf)
[Thread 1] Processed 27800 zonotopes (Work Done: 0.0%; Expected Zonos: Inf)
[Thread 1] Processed 27900 zonotopes (Work Done: 0.0%; Expected Zonos: Inf)
[Thread 1] Processed 28000 zonotopes (Work Done: 0.0%; Expected Zonos: Inf)
[Thread 1] Processed 28100 zonotopes (Work Done: 0.0%; Expected Zonos: Inf)
[Thread 1] Processed 28200 zonotopes (Work Done: 0.0%; Expected Zonos: Inf)
[Thread 1] Processed 28300 zonotopes (Work Done: 0.0%; Expected Zonos: Inf)
[Thread 1] Processed 28400 zonotopes (Work Done: 0.0%; Expected Zonos: Inf)
[Thread 1] Processed 28500 zonotopes (Work Done: 0.0%; Expected Zonos: Inf)
[Thread 1] Processed 28600 zonotopes (Work Done: 0.0%; Expected Zonos: Inf)
[Thread 1] Processed 28700 zonotopes (Work Done: 0.0%; Expected Zonos: Inf)
[Thread 1] Processed 28800 zonotopes (Work Done: 0.0%; Expected Zonos: Inf)
[Thread 1] Processed 28900 zonotopes (Work Done: 0.0%; Expected Zonos: Inf)
[Thread 1] Processed 29000 zonotopes (Work Done: 0.0%; Expected Zonos: Inf)
[Thread 1] Processed 29100 zonotopes (Work Done: 0.0%; Expected Zonos: Inf)
[Thread 1] Processed 29200 zonotopes (Work Done: 0.0%; Expected Zonos: Inf)
[Thread 1] Processed 29300 zonotopes (Work Done: 0.0%; Expected Zonos: Inf)
[Thread 1] Processed 29400 zonotopes (Work Done: 0.0%; Expected Zonos: Inf)
[Thread 1] Processed 29500 zonotopes (Work Done: 0.0%; Expected Zonos: Inf)
[Thread 1] Processed 29600 zonotopes (Work Done: 0.0%; Expected Zonos: Inf)
[Thread 1] Processed 29700 zonotopes (Work Done: 0.0%; Expected Zonos: Inf)
[Thread 1] Processed 29800 zonotopes (Work Done: 0.0%; Expected Zonos: Inf)
[Thread 1] Processed 29900 zonotopes (Work Done: 0.0%; Expected Zonos: Inf)
[Thread 1] Processed 30000 zonotopes (Work Done: 0.0%; Expected Zonos: Inf)
[Thread 1] Processed 30100 zonotopes (Work Done: 0.0%; Expected Zonos: Inf)
[Thread 1] Processed 30200 zonotopes (Work Done: 0.0%; Expected Zonos: Inf)
[Thread 1] Processed 30300 zonotopes (Work Done: 0.0%; Expected Zonos: Inf)
[Thread 1] Processed 30400 zonotopes (Work Done: 0.0%; Expected Zonos: Inf)
[Thread 1] Processed 30500 zonotopes (Work Done: 0.0%; Expected Zonos: Inf)
[Thread 1] Processed 30600 zonotopes (Work Done: 0.0%; Expected Zonos: Inf)
[Thread 1] Processed 30700 zonotopes (Work Done: 0.0%; Expected Zonos: Inf)
[Thread 1] Processed 30800 zonotopes (Work Done: 0.0%; Expected Zonos: Inf)
[Thread 1] Processed 30900 zonotopes (Work Done: 0.0%; Expected Zonos: Inf)
[Thread 1] Processed 31000 zonotopes (Work Done: 0.0%; Expected Zonos: Inf)
[Thread 1] Processed 31100 zonotopes (Work Done: 0.0%; Expected Zonos: Inf)
[Thread 1] Processed 31200 zonotopes (Work Done: 0.0%; Expected Zonos: Inf)
[Thread 1] Processed 31300 zonotopes (Work Done: 0.0%; Expected Zonos: Inf)
[Thread 1] Processed 31400 zonotopes (Work Done: 0.0%; Expected Zonos: Inf)
[Thread 1] Processed 31500 zonotopes (Work Done: 0.0%; Expected Zonos: Inf)
[Thread 1] Processed 31600 zonotopes (Work Done: 0.0%; Expected Zonos: Inf)
[Thread 1] Processed 31700 zonotopes (Work Done: 0.0%; Expected Zonos: Inf)
[Thread 1] Processed 31800 zonotopes (Work Done: 0.0%; Expected Zonos: Inf)
[Thread 1] Processed 31900 zonotopes (Work Done: 0.0%; Expected Zonos: Inf)
[Thread 1] Processed 32000 zonotopes (Work Done: 0.0%; Expected Zonos: Inf)
[Thread 1] Processed 32100 zonotopes (Work Done: 0.0%; Expected Zonos: Inf)
[Thread 1] Processed 32200 zonotopes (Work Done: 0.0%; Expected Zonos: Inf)
[Thread 1] Processed 32300 zonotopes (Work Done: 0.0%; Expected Zonos: Inf)
[Thread 1] Processed 32400 zonotopes (Work Done: 0.0%; Expected Zonos: Inf)
[Thread 1] Processed 32500 zonotopes (Work Done: 0.0%; Expected Zonos: Inf)
[Thread 1] Processed 32600 zonotopes (Work Done: 0.0%; Expected Zonos: Inf)
[Thread 1] Processed 32700 zonotopes (Work Done: 0.0%; Expected Zonos: Inf)
[Thread 1] Processed 32800 zonotopes (Work Done: 0.0%; Expected Zonos: Inf)
[Thread 1] Processed 32900 zonotopes (Work Done: 0.0%; Expected Zonos: Inf)
[Thread 1] Processed 33000 zonotopes (Work Done: 0.0%; Expected Zonos: Inf)
[Thread 1] Processed 33100 zonotopes (Work Done: 0.0%; Expected Zonos: Inf)
[Thread 1] Processed 33200 zonotopes (Work Done: 0.0%; Expected Zonos: Inf)
[Thread 1] Processed 33300 zonotopes (Work Done: 0.0%; Expected Zonos: Inf)
[Thread 1] Processed 33400 zonotopes (Work Done: 0.0%; Expected Zonos: Inf)
[Thread 1] Processed 33500 zonotopes (Work Done: 0.0%; Expected Zonos: Inf)
[Thread 1] Processed 33600 zonotopes (Work Done: 0.0%; Expected Zonos: Inf)
[Thread 1] Processed 33700 zonotopes (Work Done: 0.0%; Expected Zonos: Inf)
[Thread 1] Processed 33800 zonotopes (Work Done: 0.0%; Expected Zonos: Inf)
[Thread 1] Processed 33900 zonotopes (Work Done: 0.0%; Expected Zonos: Inf)
[Thread 1] Processed 34000 zonotopes (Work Done: 0.0%; Expected Zonos: Inf)
[Thread 1] Processed 34100 zonotopes (Work Done: 0.0%; Expected Zonos: Inf)
[Thread 1] Processed 34200 zonotopes (Work Done: 0.0%; Expected Zonos: Inf)
[Thread 1] Processed 34300 zonotopes (Work Done: 0.0%; Expected Zonos: Inf)
[Thread 1] Processed 34400 zonotopes (Work Done: 0.0%; Expected Zonos: Inf)
[Thread 1] Processed 34500 zonotopes (Work Done: 0.0%; Expected Zonos: Inf)
[Thread 1] Processed 34600 zonotopes (Work Done: 0.0%; Expected Zonos: Inf)
[Thread 1] Processed 34700 zonotopes (Work Done: 0.0%; Expected Zonos: Inf)
[Thread 1] Processed 34800 zonotopes (Work Done: 0.0%; Expected Zonos: Inf)
[Thread 1] Processed 34900 zonotopes (Work Done: 0.0%; Expected Zonos: Inf)
[Thread 1] Processed 35000 zonotopes (Work Done: 0.0%; Expected Zonos: Inf)
[Thread 1] Processed 35100 zonotopes (Work Done: 0.0%; Expected Zonos: Inf)
[Thread 1] Processed 35200 zonotopes (Work Done: 0.0%; Expected Zonos: Inf)
[Thread 1] Processed 35300 zonotopes (Work Done: 0.0%; Expected Zonos: Inf)
[Thread 1] Processed 35400 zonotopes (Work Done: 0.0%; Expected Zonos: Inf)
[Thread 1] Processed 35500 zonotopes (Work Done: 0.0%; Expected Zonos: Inf)
[Thread 1] Processed 35600 zonotopes (Work Done: 0.0%; Expected Zonos: Inf)
[Thread 1] Processed 35700 zonotopes (Work Done: 0.0%; Expected Zonos: Inf)
[Thread 1] Processed 35800 zonotopes (Work Done: 0.0%; Expected Zonos: Inf)
[Thread 1] Processed 35900 zonotopes (Work Done: 0.0%; Expected Zonos: Inf)
[Thread 1] Processed 36000 zonotopes (Work Done: 0.0%; Expected Zonos: Inf)
[Thread 1] Processed 36100 zonotopes (Work Done: 0.0%; Expected Zonos: Inf)
[Thread 1] Processed 36200 zonotopes (Work Done: 0.0%; Expected Zonos: Inf)
[Thread 1] Processed 36300 zonotopes (Work Done: 0.0%; Expected Zonos: Inf)
[Thread 1] Processed 36400 zonotopes (Work Done: 0.0%; Expected Zonos: Inf)
[Thread 1] Processed 36500 zonotopes (Work Done: 0.0%; Expected Zonos: Inf)
[Thread 1] Processed 36600 zonotopes (Work Done: 0.0%; Expected Zonos: Inf)
[Thread 1] Processed 36700 zonotopes (Work Done: 0.0%; Expected Zonos: Inf)
[Thread 1] Processed 36800 zonotopes (Work Done: 0.0%; Expected Zonos: Inf)
[Thread 1] Processed 36900 zonotopes (Work Done: 0.0%; Expected Zonos: Inf)
[Thread 1] Processed 37000 zonotopes (Work Done: 0.0%; Expected Zonos: Inf)
[Thread 1] Processed 37100 zonotopes (Work Done: 0.0%; Expected Zonos: Inf)
[Thread 1] Processed 37200 zonotopes (Work Done: 0.0%; Expected Zonos: Inf)
[Thread 1] Processed 37300 zonotopes (Work Done: 0.0%; Expected Zonos: Inf)
[Thread 1] Processed 37400 zonotopes (Work Done: 0.0%; Expected Zonos: Inf)
[Thread 1] Processed 37500 zonotopes (Work Done: 0.0%; Expected Zonos: Inf)
[Thread 1] Processed 37600 zonotopes (Work Done: 0.0%; Expected Zonos: Inf)
[Thread 1] Processed 37700 zonotopes (Work Done: 0.0%; Expected Zonos: Inf)
[Thread 1] Processed 37800 zonotopes (Work Done: 0.0%; Expected Zonos: Inf)
[Thread 1] Processed 37900 zonotopes (Work Done: 0.0%; Expected Zonos: Inf)
[Thread 1] Processed 38000 zonotopes (Work Done: 0.0%; Expected Zonos: Inf)
[Thread 1] Processed 38100 zonotopes (Work Done: 0.0%; Expected Zonos: Inf)
[Thread 1] Processed 38200 zonotopes (Work Done: 0.0%; Expected Zonos: Inf)
[Thread 1] Processed 38300 zonotopes (Work Done: 0.0%; Expected Zonos: Inf)
[Thread 1] Processed 38400 zonotopes (Work Done: 0.0%; Expected Zonos: Inf)
[Thread 1] Processed 38500 zonotopes (Work Done: 0.0%; Expected Zonos: Inf)
[Thread 1] Processed 38600 zonotopes (Work Done: 0.0%; Expected Zonos: Inf)
[Thread 1] Processed 38700 zonotopes (Work Done: 0.0%; Expected Zonos: Inf)
[Thread 1] Processed 38800 zonotopes (Work Done: 0.0%; Expected Zonos: Inf)
[Thread 1] Processed 38900 zonotopes (Work Done: 0.0%; Expected Zonos: Inf)
[Thread 1] Processed 39000 zonotopes (Work Done: 0.0%; Expected Zonos: Inf)
[Thread 1] Processed 39100 zonotopes (Work Done: 0.0%; Expected Zonos: Inf)
[Thread 1] Processed 39200 zonotopes (Work Done: 0.0%; Expected Zonos: Inf)
[Thread 1] Processed 39300 zonotopes (Work Done: 0.0%; Expected Zonos: Inf)
[Thread 1] Processed 39400 zonotopes (Work Done: 0.0%; Expected Zonos: Inf)
[Thread 1] Processed 39500 zonotopes (Work Done: 0.0%; Expected Zonos: Inf)
[Thread 1] Processed 39600 zonotopes (Work Done: 0.0%; Expected Zonos: Inf)
[Thread 1] Processed 39700 zonotopes (Work Done: 0.0%; Expected Zonos: Inf)
[Thread 1] Processed 39800 zonotopes (Work Done: 0.0%; Expected Zonos: Inf)
[Thread 1] Processed 39900 zonotopes (Work Done: 0.0%; Expected Zonos: Inf)
[Thread 1] Processed 40000 zonotopes (Work Done: 0.0%; Expected Zonos: Inf)
[Thread 1] Processed 40100 zonotopes (Work Done: 0.0%; Expected Zonos: Inf)
[Thread 1] Processed 40200 zonotopes (Work Done: 0.0%; Expected Zonos: Inf)
[Thread 1] Processed 40300 zonotopes (Work Done: 0.0%; Expected Zonos: Inf)
[Thread 1] Processed 40400 zonotopes (Work Done: 0.0%; Expected Zonos: Inf)
[Thread 1] Processed 40500 zonotopes (Work Done: 0.0%; Expected Zonos: Inf)
[Thread 1] Processed 40600 zonotopes (Work Done: 0.0%; Expected Zonos: Inf)
[Thread 1] Processed 40700 zonotopes (Work Done: 0.0%; Expected Zonos: Inf)
[Thread 1] Processed 40800 zonotopes (Work Done: 0.0%; Expected Zonos: Inf)
[Thread 1] Processed 40900 zonotopes (Work Done: 0.0%; Expected Zonos: Inf)
[Thread 1] Processed 41000 zonotopes (Work Done: 0.0%; Expected Zonos: Inf)
[Thread 1] Processed 41100 zonotopes (Work Done: 0.0%; Expected Zonos: Inf)
[Thread 1] Processed 41200 zonotopes (Work Done: 0.0%; Expected Zonos: Inf)
[Thread 1] Processed 41300 zonotopes (Work Done: 0.0%; Expected Zonos: Inf)
[Thread 1] Processed 41400 zonotopes (Work Done: 0.0%; Expected Zonos: Inf)
[Thread 1] Processed 41500 zonotopes (Work Done: 0.0%; Expected Zonos: Inf)
[Thread 1] Processed 41600 zonotopes (Work Done: 0.0%; Expected Zonos: Inf)
[Thread 1] Processed 41700 zonotopes (Work Done: 0.0%; Expected Zonos: Inf)
[Thread 1] Processed 41800 zonotopes (Work Done: 0.0%; Expected Zonos: Inf)
[Thread 1] Processed 41900 zonotopes (Work Done: 0.0%; Expected Zonos: Inf)
[Thread 1] Processed 42000 zonotopes (Work Done: 0.0%; Expected Zonos: Inf)
[Thread 1] Processed 42100 zonotopes (Work Done: 0.0%; Expected Zonos: Inf)
[Thread 1] Processed 42200 zonotopes (Work Done: 0.0%; Expected Zonos: Inf)
[Thread 1] Processed 42300 zonotopes (Work Done: 0.0%; Expected Zonos: Inf)
[Thread 1] Processed 42400 zonotopes (Work Done: 0.0%; Expected Zonos: Inf)
[Thread 1] Processed 42500 zonotopes (Work Done: 0.0%; Expected Zonos: Inf)
[Thread 1] Processed 42600 zonotopes (Work Done: 0.0%; Expected Zonos: Inf)
[Thread 1] Processed 42700 zonotopes (Work Done: 0.0%; Expected Zonos: Inf)
[Thread 1] Processed 42800 zonotopes (Work Done: 0.0%; Expected Zonos: Inf)
[Thread 1] Processed 42900 zonotopes (Work Done: 0.0%; Expected Zonos: Inf)
[Thread 1] Processed 43000 zonotopes (Work Done: 0.0%; Expected Zonos: Inf)
[Thread 1] Processed 43100 zonotopes (Work Done: 0.0%; Expected Zonos: Inf)
[Thread 1] Processed 43200 zonotopes (Work Done: 0.0%; Expected Zonos: Inf)
[Thread 1] Processed 43300 zonotopes (Work Done: 0.0%; Expected Zonos: Inf)
[Thread 1] Processed 43400 zonotopes (Work Done: 0.0%; Expected Zonos: Inf)
[Thread 1] Processed 43500 zonotopes (Work Done: 0.0%; Expected Zonos: Inf)
[Thread 1] Processed 43600 zonotopes (Work Done: 0.0%; Expected Zonos: Inf)
[Thread 1] Processed 43700 zonotopes (Work Done: 0.0%; Expected Zonos: Inf)
[Thread 1] Processed 43800 zonotopes (Work Done: 0.0%; Expected Zonos: Inf)
[Thread 1] Processed 43900 zonotopes (Work Done: 0.0%; Expected Zonos: Inf)
[Thread 1] Processed 44000 zonotopes (Work Done: 0.0%; Expected Zonos: Inf)
[Thread 1] Processed 44100 zonotopes (Work Done: 0.0%; Expected Zonos: Inf)
[Thread 1] Processed 44200 zonotopes (Work Done: 0.0%; Expected Zonos: Inf)
[Thread 1] Processed 44300 zonotopes (Work Done: 0.0%; Expected Zonos: Inf)
[Thread 1] Processed 44400 zonotopes (Work Done: 0.0%; Expected Zonos: Inf)
[Thread 1] Processed 44500 zonotopes (Work Done: 0.0%; Expected Zonos: Inf)
[Thread 1] Processed 44600 zonotopes (Work Done: 0.0%; Expected Zonos: Inf)
[Thread 1] Processed 44700 zonotopes (Work Done: 0.0%; Expected Zonos: Inf)
[Thread 1] Processed 44800 zonotopes (Work Done: 0.0%; Expected Zonos: Inf)
[Thread 1] Processed 44900 zonotopes (Work Done: 0.0%; Expected Zonos: Inf)
[Thread 1] Processed 45000 zonotopes (Work Done: 0.0%; Expected Zonos: Inf)
[Thread 1] Processed 45100 zonotopes (Work Done: 0.0%; Expected Zonos: Inf)
[Thread 1] Processed 45200 zonotopes (Work Done: 0.0%; Expected Zonos: Inf)
[Thread 1] Processed 45300 zonotopes (Work Done: 0.0%; Expected Zonos: Inf)
[Thread 1] Processed 45400 zonotopes (Work Done: 0.0%; Expected Zonos: Inf)
[Thread 1] Processed 45500 zonotopes (Work Done: 0.0%; Expected Zonos: Inf)
[Thread 1] Processed 45600 zonotopes (Work Done: 0.0%; Expected Zonos: Inf)
[Thread 1] Processed 45700 zonotopes (Work Done: 0.0%; Expected Zonos: Inf)
[Thread 1] Processed 45800 zonotopes (Work Done: 0.0%; Expected Zonos: Inf)
[Thread 1] Processed 45900 zonotopes (Work Done: 0.0%; Expected Zonos: Inf)
[Thread 1] Processed 46000 zonotopes (Work Done: 0.0%; Expected Zonos: Inf)
[Thread 1] Processed 46100 zonotopes (Work Done: 0.0%; Expected Zonos: Inf)
[Thread 1] Processed 46200 zonotopes (Work Done: 0.0%; Expected Zonos: Inf)
[Thread 1] Processed 46300 zonotopes (Work Done: 0.0%; Expected Zonos: Inf)
[Thread 1] Processed 46400 zonotopes (Work Done: 0.0%; Expected Zonos: Inf)
[Thread 1] Processed 46500 zonotopes (Work Done: 0.0%; Expected Zonos: Inf)
[Thread 1] Processed 46600 zonotopes (Work Done: 0.0%; Expected Zonos: Inf)
[Thread 1] Processed 46700 zonotopes (Work Done: 0.0%; Expected Zonos: Inf)
[Thread 1] Processed 46800 zonotopes (Work Done: 0.0%; Expected Zonos: Inf)
[Thread 1] Processed 46900 zonotopes (Work Done: 0.0%; Expected Zonos: Inf)
[Thread 1] Processed 47000 zonotopes (Work Done: 0.0%; Expected Zonos: Inf)
[Thread 1] Processed 47100 zonotopes (Work Done: 0.0%; Expected Zonos: Inf)
[Thread 1] Processed 47200 zonotopes (Work Done: 0.0%; Expected Zonos: Inf)
[Thread 1] Processed 47300 zonotopes (Work Done: 0.0%; Expected Zonos: Inf)
[Thread 1] Processed 47400 zonotopes (Work Done: 0.0%; Expected Zonos: Inf)
[Thread 1] Processed 47500 zonotopes (Work Done: 0.0%; Expected Zonos: Inf)
[Thread 1] Processed 47600 zonotopes (Work Done: 0.0%; Expected Zonos: Inf)
[Thread 1] Processed 47700 zonotopes (Work Done: 0.0%; Expected Zonos: Inf)
[Thread 1] Processed 47800 zonotopes (Work Done: 0.0%; Expected Zonos: Inf)
[Thread 1] Processed 47900 zonotopes (Work Done: 0.0%; Expected Zonos: Inf)
[Thread 1] Processed 48000 zonotopes (Work Done: 0.0%; Expected Zonos: Inf)
[Thread 1] Processed 48100 zonotopes (Work Done: 0.0%; Expected Zonos: Inf)
[Thread 1] Processed 48200 zonotopes (Work Done: 0.0%; Expected Zonos: Inf)
[Thread 1] Processed 48300 zonotopes (Work Done: 0.0%; Expected Zonos: Inf)
[Thread 1] Processed 48400 zonotopes (Work Done: 0.0%; Expected Zonos: Inf)
[Thread 1] Processed 48500 zonotopes (Work Done: 0.0%; Expected Zonos: Inf)
[Thread 1] Processed 48600 zonotopes (Work Done: 0.0%; Expected Zonos: Inf)
[Thread 1] Processed 48700 zonotopes (Work Done: 0.0%; Expected Zonos: Inf)
[Thread 1] Processed 48800 zonotopes (Work Done: 0.0%; Expected Zonos: Inf)
[Thread 1] Processed 48900 zonotopes (Work Done: 0.0%; Expected Zonos: Inf)
[Thread 1] Processed 49000 zonotopes (Work Done: 0.0%; Expected Zonos: Inf)
[Thread 1] Processed 49100 zonotopes (Work Done: 0.0%; Expected Zonos: Inf)
[Thread 1] Processed 49200 zonotopes (Work Done: 0.0%; Expected Zonos: Inf)
[Thread 1] Processed 49300 zonotopes (Work Done: 0.0%; Expected Zonos: Inf)
[Thread 1] Processed 49400 zonotopes (Work Done: 0.0%; Expected Zonos: Inf)
[Thread 1] Processed 49500 zonotopes (Work Done: 0.0%; Expected Zonos: Inf)
[Thread 1] Processed 49600 zonotopes (Work Done: 0.0%; Expected Zonos: Inf)
[Thread 1] Processed 49700 zonotopes (Work Done: 0.0%; Expected Zonos: Inf)
[Thread 1] Processed 49800 zonotopes (Work Done: 0.0%; Expected Zonos: Inf)
[Thread 1] Processed 49900 zonotopes (Work Done: 0.0%; Expected Zonos: Inf)
[Thread 1] Processed 50000 zonotopes (Work Done: 0.0%; Expected Zonos: Inf)
[Thread 1] Processed 50100 zonotopes (Work Done: 0.0%; Expected Zonos: Inf)
[Thread 1] Processed 50200 zonotopes (Work Done: 0.0%; Expected Zonos: Inf)
[Thread 1] Processed 50300 zonotopes (Work Done: 0.0%; Expected Zonos: Inf)
[Thread 1] Processed 50400 zonotopes (Work Done: 0.0%; Expected Zonos: Inf)
[Thread 1] Processed 50500 zonotopes (Work Done: 0.0%; Expected Zonos: Inf)
[Thread 1] Processed 50600 zonotopes (Work Done: 0.0%; Expected Zonos: Inf)
[Thread 1] Processed 50700 zonotopes (Work Done: 0.0%; Expected Zonos: Inf)
[Thread 1] Processed 50800 zonotopes (Work Done: 0.0%; Expected Zonos: Inf)
[Thread 1] Processed 50900 zonotopes (Work Done: 0.0%; Expected Zonos: Inf)
[Thread 1] Processed 51000 zonotopes (Work Done: 0.0%; Expected Zonos: Inf)
[Thread 1] Processed 51100 zonotopes (Work Done: 0.0%; Expected Zonos: Inf)
[Thread 1] Processed 51200 zonotopes (Work Done: 0.0%; Expected Zonos: Inf)
[Thread 1] Processed 51300 zonotopes (Work Done: 0.0%; Expected Zonos: Inf)
[Thread 1] Processed 51400 zonotopes (Work Done: 0.0%; Expected Zonos: Inf)
[Thread 1] Processed 51500 zonotopes (Work Done: 0.0%; Expected Zonos: Inf)
[Thread 1] Processed 51600 zonotopes (Work Done: 0.0%; Expected Zonos: Inf)


TIMEOUT REACHED
UNKNOWN
[Thread 1] Total splits: 51606
Processed 51606 zonotopes (Work Done: 0.0%); Generated 103212 (0.002328436498159129s/loop)
[Thread 1] Finished in 120.16s
 ────────────────────────────────────────────────────────────────────────────────
                                        Time                    Allocations      
                               ───────────────────────   ────────────────────────
       Tot / % measured:             120s / 100.0%           82.3GiB / 100.0%    

 Section               ncalls     time    %tot     avg     alloc    %tot      avg
 ────────────────────────────────────────────────────────────────────────────────
 Verify                     1     120s  100.0%    120s   82.3GiB  100.0%  82.3GiB
   Zonotope Loop            1     120s  100.0%    120s   82.3GiB  100.0%  82.3GiB
     Zonotope Propa...  51.6k    80.1s   66.7%  1.55ms   33.2GiB   40.4%   675KiB
       DiffZonotope...   206k    48.6s   40.5%   236μs   7.87GiB    9.6%  40.0KiB
         Zonotope_D...   413k    23.1s   19.2%  56.0μs   4.38GiB    5.3%  11.1KiB
       DiffZonotope...   155k    31.2s   26.0%   202μs   25.3GiB   30.8%   172KiB
         Zonotope_R...   310k    18.3s   15.3%  59.2μs   15.3GiB   18.5%  51.7KiB
           Allocation    310k    4.66s    3.9%  15.0μs   5.49GiB    6.7%  18.6KiB
           Column M...   310k    4.65s    3.9%  15.0μs   5.54GiB    6.7%  18.7KiB
           Influenc...   310k    3.79s    3.2%  12.2μs   3.12GiB    3.8%  10.6KiB
             Multiply    310k    2.90s    2.4%  9.38μs   1.83GiB    2.2%  6.20KiB
             Alloca...   310k    558ms    0.5%  1.80μs   1.29GiB    1.6%  4.35KiB
             Set Ma...   310k    162ms    0.1%   524ns     0.00B    0.0%    0.00B
           Vectors       310k    2.04s    1.7%  6.58μs   0.96GiB    1.2%  3.26KiB
           Set Matrix    310k    738ms    0.6%  2.38μs    151MiB    0.2%     512B
           Bounds        310k   64.8ms    0.1%   209ns     0.00B    0.0%    0.00B
     Property Check     51.6k    7.42s    6.2%   144μs   3.15GiB    3.8%  64.1KiB
     Compute Split      51.6k    4.22s    3.5%  81.8μs   6.25GiB    7.6%   127KiB
 Initialize                 1    342μs    0.0%   342μs    821KiB    0.0%   821KiB
 ────────────────────────────────────────────────────────────────────────────────
[VERYDIFF_TIMER] 120.198256539

[VERYDIFF_EXPERIMENT] NETWORK: /home/i57/steuber/NeuroDiff/repos/VeryDiffExperiments/src/../benchmarks/mnist-prune/specs/mnist_54_local_15.vnnlib
[VERYDIFF_EXPERIMENT] TIME: 120.887169843
