
[VERYDIFF_EXPERIMENT] Running on /home/i57/steuber/NeuroDiff/repos/VeryDiffExperiments/src/../benchmarks/mnist-prune/specs/mnist_65_local_15.vnnlib /home/i57/steuber/NeuroDiff/repos/VeryDiffExperiments/src/../benchmarks/mnist-prune/nets/mnist_relu_4_1024.onnx
Found input X
op: matmul, weight: (1024, 784), bias: nothing
op: bias, weight: nothing, bias: (1024,)
op: relu, weight: nothing, bias: nothing
op: matmul, weight: (1024, 1024), bias: nothing
op: bias, weight: nothing, bias: (1024,)
op: relu, weight: nothing, bias: nothing
op: matmul, weight: (1024, 1024), bias: nothing
op: bias, weight: nothing, bias: (1024,)
op: relu, weight: nothing, bias: nothing
op: matmul, weight: (10, 1024), bias: nothing
op: bias, weight: nothing, bias: (10,)
op: relu, weight: nothing, bias: nothing
op: matmul, weight: (10, 10), bias: nothing
op: bias, weight: nothing, bias: (10,)
Found input X
op: gemm, weight: (1024, 784), bias: (1024,)
op: relu, weight: nothing, bias: nothing
op: gemm, weight: (1024, 1024), bias: (1024,)
op: relu, weight: nothing, bias: nothing
op: gemm, weight: (1024, 1024), bias: (1024,)
op: relu, weight: nothing, bias: nothing
op: gemm, weight: (10, 1024), bias: (10,)
op: relu, weight: nothing, bias: nothing
op: gemm, weight: (10, 10), bias: (10,)
Distance: 915.6394868631054
Distance: 1298.7052820973968
Distance: 1296.587532894263
Distance: 6.054483317080667
Distance: 0.04942679278974538
Running with 1 threads
[Thread 1] Time to first task: 0.0s
Instable Generators: 451
Instable Generators: 920
Instable Generators: 1024
Instable Generators: 10
Zono Bounds:
[-116.89566020262835, -119.16860827091047, -131.81277429549513, -130.8336715193695, -125.97923056492506, -133.30516086318352, -119.13380359867075, -124.40526846384405, -126.96188019290135, -132.40239778495496]
[116.7928351478836, 118.93060266963222, 131.16117769902152, 130.67213574926188, 125.89341551992185, 133.19561512718775, 119.12416608818135, 123.76350880582247, 127.0368533388059, 132.25510447629884]
[Thread 1] Processed 100 zonotopes (Work Done: 0.0%; Expected Zonos: Inf)


TIMEOUT REACHED
UNKNOWN
[Thread 1] Total splits: 134
Processed 134 zonotopes (Work Done: 0.0%); Generated 268 (0.8960001042238807s/loop)
[Thread 1] Finished in 120.06s
 ────────────────────────────────────────────────────────────────────────────────
                                        Time                    Allocations      
                               ───────────────────────   ────────────────────────
       Tot / % measured:             120s / 100.0%           38.8GiB / 100.0%    

 Section               ncalls     time    %tot     avg     alloc    %tot      avg
 ────────────────────────────────────────────────────────────────────────────────
 Verify                     1     120s  100.0%    120s   38.8GiB   99.9%  38.8GiB
   Zonotope Loop            1     120s  100.0%    120s   38.8GiB   99.9%  38.8GiB
     Zonotope Propa...    134     119s   98.7%   885ms   38.5GiB   99.2%   294MiB
       DiffZonotope...    670    62.3s   51.9%  93.1ms   8.14GiB   21.0%  12.4MiB
         Zonotope_D...  1.34k    22.8s   19.0%  17.0ms   3.30GiB    8.5%  2.52MiB
       DiffZonotope...    536    56.2s   46.8%   105ms   30.3GiB   78.2%  57.9MiB
         Zonotope_R...  1.07k    20.2s   16.8%  18.8ms   18.8GiB   48.4%  17.9MiB
           Column M...  1.07k    9.59s    8.0%  8.95ms   7.67GiB   19.8%  7.33MiB
           Allocation   1.07k    4.59s    3.8%  4.28ms   7.67GiB   19.8%  7.33MiB
           Influenc...  1.07k    4.52s    3.8%  4.22ms   3.38GiB    8.7%  3.23MiB
             Multiply   1.07k    4.15s    3.5%  3.87ms   3.20GiB    8.3%  3.06MiB
             Alloca...  1.07k    358ms    0.3%   334μs    182MiB    0.5%   174KiB
             Set Ma...  1.07k   12.2ms    0.0%  11.4μs     0.00B    0.0%    0.00B
           Set Matrix   1.07k    1.29s    1.1%  1.20ms   14.6MiB    0.0%  13.9KiB
           Vectors      1.07k    168ms    0.1%   157μs   35.6MiB    0.1%  34.0KiB
           Bounds       1.07k    684μs    0.0%   638ns     0.00B    0.0%    0.00B
     Property Check       134    1.43s    1.2%  10.7ms   71.7MiB    0.2%   548KiB
     Compute Split        134   57.3ms    0.0%   428μs    126MiB    0.3%   966KiB
 Initialize                 1   16.7ms    0.0%  16.7ms   22.3MiB    0.1%  22.3MiB
 ────────────────────────────────────────────────────────────────────────────────
[VERYDIFF_TIMER] 120.158046392

[VERYDIFF_EXPERIMENT] NETWORK: /home/i57/steuber/NeuroDiff/repos/VeryDiffExperiments/src/../benchmarks/mnist-prune/specs/mnist_65_local_15.vnnlib
[VERYDIFF_EXPERIMENT] TIME: 120.479307627
