
[VERYDIFF_EXPERIMENT] Running on /home/i57/steuber/NeuroDiff/repos/VeryDiffExperiments/src/../benchmarks/mnist-prune/specs/mnist_17_global_4.vnnlib /home/i57/steuber/NeuroDiff/repos/VeryDiffExperiments/src/../benchmarks/mnist-prune/nets/mnist_relu_2_512.onnx
Total difference: 2831.6943
Average difference: 0.0042
Initial output delta:
[0.489636 -4.390744 -0.975808 -1.652812 -0.620021 4.303917 3.270750 -10.285589 1.306611 -1.202658 ]
[17.665388 12.946113 11.633680 13.147261 17.596422 19.380107 22.414850 2.148070 15.481742 13.048192 ]

adv found:
adv is: [0.007843 0.007843 0.007843 0.007843 0.007843 0.007843 0.007843 0.007843 0.007843 0.007843 0.007843 0.007843 0.007843 0.007843 0.007843 0.007843 0.007843 0.007843 0.007843 0.007843 0.007843 0.007843 0.007843 0.007843 0.007843 0.007843 0.007843 0.007843 0.007843 0.007843 0.007843 0.007843 0.007843 0.007843 0.007843 0.007843 0.007843 0.007843 0.007843 0.007843 0.007843 0.007843 0.007843 0.007843 0.007843 0.007843 0.007843 0.007843 0.007843 0.007843 0.007843 0.007843 0.007843 0.007843 0.007843 0.007843 0.007843 0.007843 0.007843 0.007843 0.007843 0.007843 0.007843 0.007843 0.007843 0.007843 0.007843 0.007843 0.007843 0.007843 0.007843 0.007843 0.007843 0.007843 0.007843 0.007843 0.007843 0.007843 0.007843 0.007843 0.007843 0.007843 0.007843 0.007843 0.007843 0.007843 0.007843 0.007843 0.007843 0.007843 0.007843 0.007843 0.007843 0.007843 0.007843 0.007843 0.007843 0.007843 0.007843 0.007843 0.007843 0.007843 0.007843 0.007843 0.007843 0.007843 0.007843 0.007843 0.007843 0.007843 0.007843 0.007843 0.007843 0.007843 0.007843 0.007843 0.007843 0.007843 0.007843 0.007843 0.007843 0.007843 0.007843 0.007843 0.007843 0.007843 0.007843 0.007843 0.007843 0.007843 0.007843 0.007843 0.007843 0.007843 0.007843 0.007843 0.007843 0.007843 0.007843 0.007843 0.007843 0.007843 0.007843 0.007843 0.007843 0.007843 0.007843 0.007843 0.007843 0.007843 0.007843 0.007843 0.007843 0.007843 0.007843 0.007843 0.007843 0.007843 0.007843 0.007843 0.007843 0.007843 0.007843 0.007843 0.007843 0.007843 0.007843 0.007843 0.007843 0.007843 0.007843 0.007843 0.007843 0.007843 0.007843 0.007843 0.007843 0.007843 0.007843 0.007843 0.007843 0.007843 0.007843 0.007843 0.007843 0.007843 0.007843 0.007843 0.007843 0.007843 0.007843 0.007843 0.007843 0.007843 0.007843 0.007843 0.007843 0.007843 0.007843 0.007843 0.298039 0.976470 0.990196 0.990196 0.990196 0.960784 0.654901 0.654901 0.533333 0.105882 0.321568 0.243137 0.007843 0.007843 0.007843 0.007843 0.007843 0.007843 0.007843 0.007843 0.007843 0.007843 0.007843 0.007843 0.007843 0.007843 0.007843 0.007843 0.415686 0.990196 0.990196 0.990196 0.990196 0.990196 0.990196 0.990196 0.990196 0.984313 0.990196 0.986274 0.780392 0.450980 0.278431 0.160784 0.007843 0.007843 0.007843 0.007843 0.007843 0.007843 0.007843 0.007843 0.007843 0.007843 0.007843 0.007843 0.019607 0.396078 0.529411 0.419607 0.411764 0.447058 0.752941 0.760784 0.760784 0.921568 0.990196 0.990196 0.990196 0.990196 0.990196 0.964705 0.505882 0.007843 0.007843 0.007843 0.007843 0.007843 0.007843 0.007843 0.007843 0.007843 0.007843 0.007843 0.007843 0.007843 0.007843 0.007843 0.007843 0.007843 0.007843 0.007843 0.007843 0.184313 0.454901 0.454901 0.803921 0.990196 0.990196 0.990196 0.941176 0.058823 0.007843 0.007843 0.007843 0.007843 0.007843 0.007843 0.007843 0.007843 0.007843 0.007843 0.007843 0.007843 0.007843 0.007843 0.007843 0.007843 0.007843 0.007843 0.007843 0.007843 0.007843 0.007843 0.039215 0.145098 0.607843 0.990196 0.990196 0.509803 0.007843 0.007843 0.007843 0.007843 0.007843 0.007843 0.007843 0.007843 0.007843 0.007843 0.007843 0.007843 0.007843 0.007843 0.007843 0.007843 0.007843 0.007843 0.007843 0.007843 0.007843 0.007843 0.007843 0.007843 0.141176 0.990196 0.952941 0.141176 0.007843 0.007843 0.007843 0.007843 0.007843 0.007843 0.007843 0.007843 0.007843 0.007843 0.007843 0.007843 0.007843 0.007843 0.007843 0.007843 0.007843 0.007843 0.007843 0.007843 0.007843 0.007843 0.007843 0.007843 0.450980 0.990196 0.990196 0.462745 0.007843 0.007843 0.007843 0.007843 0.007843 0.007843 0.007843 0.007843 0.007843 0.007843 0.007843 0.007843 0.007843 0.007843 0.007843 0.007843 0.007843 0.007843 0.007843 0.007843 0.007843 0.007843 0.007843 0.133333 0.952941 0.990196 0.949019 0.066666 0.007843 0.007843 0.007843 0.007843 0.007843 0.007843 0.007843 0.007843 0.007843 0.007843 0.007843 0.007843 0.007843 0.007843 0.007843 0.007843 0.007843 0.007843 0.007843 0.007843 0.007843 0.007843 0.007843 0.435294 0.990196 0.990196 0.552941 0.007843 0.007843 0.007843 0.007843 0.007843 0.007843 0.007843 0.007843 0.007843 0.007843 0.007843 0.007843 0.007843 0.007843 0.007843 0.007843 0.007843 0.007843 0.007843 0.007843 0.007843 0.007843 0.007843 0.145098 0.952941 0.990196 0.956862 0.156862 0.007843 0.007843 0.007843 0.007843 0.007843 0.007843 0.007843 0.007843 0.007843 0.007843 0.007843 0.007843 0.007843 0.007843 0.007843 0.007843 0.007843 0.007843 0.007843 0.007843 0.007843 0.007843 0.078431 0.690196 0.990196 0.990196 0.443137 0.007843 0.007843 0.007843 0.007843 0.007843 0.007843 0.007843 0.007843 0.007843 0.007843 0.007843 0.007843 0.007843 0.007843 0.007843 0.007843 0.007843 0.007843 0.007843 0.007843 0.007843 0.007843 0.007843 0.549019 0.990196 0.990196 0.862745 0.011764 0.007843 0.007843 0.007843 0.007843 0.007843 0.007843 0.007843 0.007843 0.007843 0.007843 0.007843 0.007843 0.007843 0.007843 0.007843 0.007843 0.007843 0.007843 0.007843 0.007843 0.007843 0.007843 0.352941 0.988235 0.990196 0.952941 0.176470 0.007843 0.007843 0.007843 0.007843 0.007843 0.007843 0.007843 0.007843 0.007843 0.007843 0.007843 0.007843 0.007843 0.007843 0.007843 0.007843 0.007843 0.007843 0.007843 0.007843 0.007843 0.007843 0.247058 0.945098 0.990196 0.990196 0.325490 0.007843 0.007843 0.007843 0.007843 0.007843 0.007843 0.007843 0.007843 0.007843 0.007843 0.007843 0.007843 0.007843 0.007843 0.007843 0.007843 0.007843 0.007843 0.007843 0.007843 0.007843 0.007843 0.070588 0.952941 0.990196 0.990196 0.576470 0.019607 0.007843 0.007843 0.007843 0.007843 0.007843 0.007843 0.007843 0.007843 0.007843 0.007843 0.007843 0.007843 0.007843 0.007843 0.007843 0.007843 0.007843 0.007843 0.007843 0.007843 0.007843 0.011764 0.435294 0.990196 0.990196 0.796078 0.019607 0.007843 0.007843 0.007843 0.007843 0.007843 0.007843 0.007843 0.007843 0.007843 0.007843 0.007843 0.007843 0.007843 0.007843 0.007843 0.007843 0.007843 0.007843 0.007843 0.007843 0.007843 0.007843 0.227450 0.990196 0.990196 0.990196 0.329411 0.007843 0.007843 0.007843 0.007843 0.007843 0.007843 0.007843 0.007843 0.007843 0.007843 0.007843 0.007843 0.007843 0.007843 0.007843 0.007843 0.007843 0.007843 0.007843 0.007843 0.007843 0.007843 0.062745 0.937254 0.990196 0.992156 0.760784 0.015686 0.007843 0.007843 0.007843 0.007843 0.007843 0.007843 0.007843 0.007843 0.007843 0.007843 0.007843 0.007843 0.007843 0.007843 0.007843 0.007843 0.007843 0.007843 0.007843 0.007843 0.007843 0.007843 0.329411 0.990196 0.990196 0.768627 0.113725 0.007843 0.007843 0.007843 0.007843 0.007843 0.007843 0.007843 0.007843 0.007843 0.007843 0.007843 0.007843 0.007843 0.007843 0.007843 0.007843 0.007843 0.007843 0.007843 0.007843 0.007843 0.007843 0.007843 0.160784 0.909803 0.764705 0.117647 0.007843 0.007843 0.007843 0.007843 0.007843 0.007843 0.007843 0.007843 0.007843 0.007843 0.007843 0.007843 0.007843 0.007843 0.007843 0.007843 0.007843 0.007843 0.007843 0.007843 0.007843 0.007843 0.007843 0.007843 0.007843 0.007843 0.007843 0.007843 0.007843 0.007843 0.007843 0.007843 0.007843 0.007843 0.007843 0.007843 0.007843 0.007843 0.007843 0.007843 0.007843 0.007843 ]
it's output delta is: [9.841960 5.344123 5.501684 5.919681 8.645759 11.492820 13.066024 -3.156102 8.677856 6.001609 ]
time: 32.316143 


numSplits: 36
setenv(`timeout -k 5 120 ../NeuroDiff/DiffNN-Code/delta_network_test 417 /home/i57/steuber/NeuroDiff/repos/VeryDiffExperiments/src/../benchmarks/mnist-prune/nets/mnist_relu_2_512.nnet /home/i57/steuber/NeuroDiff/repos/VeryDiffExperiments/src/../benchmarks/mnist-prune/nets_pruned/mnist_relu_2_512_pruned5.nnet 1.0 -p 4`,["OMP_NUM_THREADS=1"])
[VERYDIFF_TIMER] 32.607052342

[VERYDIFF_EXPERIMENT] Running on /home/i57/steuber/NeuroDiff/repos/VeryDiffExperiments/src/../benchmarks/mnist-prune/specs/mnist_17_global_4.vnnlib /home/i57/steuber/NeuroDiff/repos/VeryDiffExperiments/src/../benchmarks/mnist-prune/nets/mnist_relu_3_100.onnx
Total difference: 379.5704
Average difference: 0.0042
Initial output delta:
[-0.110499 -0.367206 -0.241451 -0.639420 -0.000000 -0.000000 -0.000000 -0.983934 -0.000000 -0.420751 ]
[0.366895 0.194260 0.217857 0.031519 0.000000 0.938501 0.000000 -0.157307 0.000000 0.200227 ]

No adv!
time: 0.126309 


numSplits: 0
setenv(`timeout -k 5 120 ../NeuroDiff/DiffNN-Code/delta_network_test 417 /home/i57/steuber/NeuroDiff/repos/VeryDiffExperiments/src/../benchmarks/mnist-prune/nets/mnist_relu_3_100.nnet /home/i57/steuber/NeuroDiff/repos/VeryDiffExperiments/src/../benchmarks/mnist-prune/nets_pruned/mnist_relu_3_100_pruned5.nnet 1.0 -p 4`,["OMP_NUM_THREADS=1"])
[VERYDIFF_TIMER] 0.181639699

[VERYDIFF_EXPERIMENT] Running on /home/i57/steuber/NeuroDiff/repos/VeryDiffExperiments/src/../benchmarks/mnist-prune/specs/mnist_17_global_4.vnnlib /home/i57/steuber/NeuroDiff/repos/VeryDiffExperiments/src/../benchmarks/mnist-prune/nets/mnist_relu_4_1024.onnx
Total difference: 6995.1558
Average difference: 0.0024
Initial output delta:
[-76.483079 -78.082490 -86.525094 -87.948586 -80.412690 -80.766686 -71.733902 -87.070633 -82.266358 -90.894524 ]
[75.727279 77.381629 84.916091 81.402336 81.283638 92.079078 83.102714 75.073829 82.566856 82.385101 ]
setenv(`timeout -k 5 120 ../NeuroDiff/DiffNN-Code/delta_network_test 417 /home/i57/steuber/NeuroDiff/repos/VeryDiffExperiments/src/../benchmarks/mnist-prune/nets/mnist_relu_4_1024.nnet /home/i57/steuber/NeuroDiff/repos/VeryDiffExperiments/src/../benchmarks/mnist-prune/nets_pruned/mnist_relu_4_1024_pruned5.nnet 1.0 -p 4`,["OMP_NUM_THREADS=1"])TIMEOUT
ProcessFailedException(Base.Process[Process(setenv(`timeout -k 5 120 ../NeuroDiff/DiffNN-Code/delta_network_test 417 /home/i57/steuber/NeuroDiff/repos/VeryDiffExperiments/src/../benchmarks/mnist-prune/nets/mnist_relu_4_1024.nnet /home/i57/steuber/NeuroDiff/repos/VeryDiffExperiments/src/../benchmarks/mnist-prune/nets_pruned/mnist_relu_4_1024_pruned5.nnet 1.0 -p 4`,["OMP_NUM_THREADS=1"]), ProcessExited(124))])
nothing

[VERYDIFF_TIMER] 120.015028142

[VERYDIFF_EXPERIMENT] NETWORK: /home/i57/steuber/NeuroDiff/repos/VeryDiffExperiments/src/../benchmarks/mnist-prune/specs/mnist_17_global_4.vnnlib
[VERYDIFF_EXPERIMENT] TIME: 153.650550671
