
[VERYDIFF_EXPERIMENT] Running on /home/i57/steuber/NeuroDiff/repos/VeryDiffExperiments/src/../benchmarks/mnist-prune/specs/mnist_64_local_24.vnnlib /home/i57/steuber/NeuroDiff/repos/VeryDiffExperiments/src/../benchmarks/mnist-prune/nets/mnist_relu_4_1024.onnx
Found input X
op: matmul, weight: (1024, 784), bias: nothing
op: bias, weight: nothing, bias: (1024,)
op: relu, weight: nothing, bias: nothing
op: matmul, weight: (1024, 1024), bias: nothing
op: bias, weight: nothing, bias: (1024,)
op: relu, weight: nothing, bias: nothing
op: matmul, weight: (1024, 1024), bias: nothing
op: bias, weight: nothing, bias: (1024,)
op: relu, weight: nothing, bias: nothing
op: matmul, weight: (10, 1024), bias: nothing
op: bias, weight: nothing, bias: (10,)
op: relu, weight: nothing, bias: nothing
op: matmul, weight: (10, 10), bias: nothing
op: bias, weight: nothing, bias: (10,)
Found input X
op: gemm, weight: (1024, 784), bias: (1024,)
op: relu, weight: nothing, bias: nothing
op: gemm, weight: (1024, 1024), bias: (1024,)
op: relu, weight: nothing, bias: nothing
op: gemm, weight: (1024, 1024), bias: (1024,)
op: relu, weight: nothing, bias: nothing
op: gemm, weight: (10, 1024), bias: (10,)
op: relu, weight: nothing, bias: nothing
op: gemm, weight: (10, 10), bias: (10,)
Distance: 915.6394868631054
Distance: 1298.7052820973968
Distance: 1296.587532894263
Distance: 6.054483317080667
Distance: 0.04942679278974538
Running with 1 threads
[Thread 1] Time to first task: 0.0s
Instable Generators: 453
Instable Generators: 881
Instable Generators: 1024
Instable Generators: 10
Zono Bounds:
[-172.48621609880135, -176.00278426179773, -194.5279248922409, -192.7495098302396, -185.4898633555961, -196.11117123192835, -174.881093761929, -182.90930990860443, -187.52591384643776, -195.34444545154875]
[172.44276081532078, 175.45766217066807, 193.79008395359676, 192.53878829249632, 185.38639304081502, 195.8046062453079, 174.87969345301136, 182.35852338260872, 187.6238372034563, 195.1219269156654]
[Thread 1] Processed 100 zonotopes (Work Done: 0.0%; Expected Zonos: Inf)


TIMEOUT REACHED
UNKNOWN
[Thread 1] Total splits: 134
Processed 134 zonotopes (Work Done: 0.0%); Generated 268 (0.9007039334925373s/loop)
[Thread 1] Finished in 120.69s
 ────────────────────────────────────────────────────────────────────────────────
                                        Time                    Allocations      
                               ───────────────────────   ────────────────────────
       Tot / % measured:             121s / 100.0%           40.5GiB / 100.0%    

 Section               ncalls     time    %tot     avg     alloc    %tot      avg
 ────────────────────────────────────────────────────────────────────────────────
 Verify                     1     121s  100.0%    121s   40.4GiB   99.9%  40.4GiB
   Zonotope Loop            1     121s  100.0%    121s   40.4GiB   99.9%  40.4GiB
     Zonotope Propa...    134     119s   98.7%   889ms   40.1GiB   99.1%   306MiB
       DiffZonotope...    670    62.6s   51.9%  93.4ms   8.53GiB   21.1%  13.0MiB
         Zonotope_D...  1.34k    21.7s   18.0%  16.2ms   3.48GiB    8.6%  2.66MiB
       DiffZonotope...    536    56.6s   46.9%   106ms   31.5GiB   78.0%  60.3MiB
         Zonotope_R...  1.07k    16.6s   13.7%  15.5ms   19.7GiB   48.6%  18.8MiB
           Allocation   1.07k    8.53s    7.1%  7.95ms   7.92GiB   19.6%  7.57MiB
           Column M...  1.07k    4.71s    3.9%  4.39ms   7.92GiB   19.6%  7.57MiB
           Influenc...  1.07k    1.97s    1.6%  1.84ms   3.77GiB    9.3%  3.60MiB
             Multiply   1.07k    1.91s    1.6%  1.78ms   3.48GiB    8.6%  3.32MiB
             Alloca...  1.07k   44.0ms    0.0%  41.1μs    299MiB    0.7%   285KiB
             Set Ma...  1.07k   18.8ms    0.0%  17.6μs     0.00B    0.0%    0.00B
           Set Matrix   1.07k    1.34s    1.1%  1.25ms   14.8MiB    0.0%  14.1KiB
           Vectors      1.07k   28.4ms    0.0%  26.5μs   35.6MiB    0.1%  34.0KiB
           Bounds       1.07k    722μs    0.0%   674ns     0.00B    0.0%    0.00B
     Property Check       134    1.43s    1.2%  10.6ms   72.0MiB    0.2%   550KiB
     Compute Split        134   77.6ms    0.1%   579μs    177MiB    0.4%  1.32MiB
 Initialize                 1   14.2ms    0.0%  14.2ms   22.4MiB    0.1%  22.4MiB
 ────────────────────────────────────────────────────────────────────────────────
[VERYDIFF_TIMER] 120.788852431

[VERYDIFF_EXPERIMENT] NETWORK: /home/i57/steuber/NeuroDiff/repos/VeryDiffExperiments/src/../benchmarks/mnist-prune/specs/mnist_64_local_24.vnnlib
[VERYDIFF_EXPERIMENT] TIME: 121.106097261
