
[VERYDIFF_EXPERIMENT] Running on /home/i57/steuber/NeuroDiff/repos/VeryDiffExperiments/src/../benchmarks/mnist-prune/specs/mnist_78_global_3.vnnlib /home/i57/steuber/NeuroDiff/repos/VeryDiffExperiments/src/../benchmarks/mnist-prune/nets/mnist_relu_2_512.onnx
Parsing /home/i57/steuber/NeuroDiff/repos/VeryDiffExperiments/src/../benchmarks/mnist-prune/nets/mnist_relu_2_512.onnx...
Found input X
op: matmul, weight: (512, 784), bias: nothing
op: bias, weight: nothing, bias: (512,)
op: relu, weight: nothing, bias: nothing
op: matmul, weight: (512, 512), bias: nothing
op: bias, weight: nothing, bias: (512,)
op: relu, weight: nothing, bias: nothing
op: matmul, weight: (10, 512), bias: nothing
op: bias, weight: nothing, bias: (10,)
Parsing /home/i57/steuber/NeuroDiff/repos/VeryDiffExperiments/src/../benchmarks/mnist-prune/nets_pruned/mnist_relu_2_512_pruned5.onnx...
Found input X
op: matmul, weight: (512, 784), bias: nothing
op: bias, weight: nothing, bias: (512,)
op: relu, weight: nothing, bias: nothing
op: matmul, weight: (512, 512), bias: nothing
op: bias, weight: nothing, bias: (512,)
op: relu, weight: nothing, bias: nothing
op: matmul, weight: (10, 512), bias: nothing
op: bias, weight: nothing, bias: (10,)
Distance: 1085.5985166831802
Distance: 1719.8468985003963
Distance: 31.228482716001736
Running with 1 threads
[Thread 1] Time to first task: 0.01s
Instable Generators: 89
Instable Generators: 182
Zono Bounds:
[-9.68390548120153, -6.0847188874818405, -9.039881511943648, -7.830239824301449, -4.682081935843129, -8.556800239722866, -9.511726994609697, -4.224899041748923, -1.798303833911166, -1.778306504296911]
[1.530539026972571, 4.783404170036763, 0.09554036797821652, 1.9332969324105918, 5.199876232258207, -0.13466832623960734, 1.0454189567103693, 5.059556393261817, 5.80452349289631, 6.974290966953276]
[Thread 1] Total splits: 0
Processed 1 zonotopes (Work Done: 100.0%); Generated 0 (0.62015014s/loop)
[Thread 1] Finished in 0.62s
 ────────────────────────────────────────────────────────────────────────────────
                                        Time                    Allocations      
                               ───────────────────────   ────────────────────────
       Tot / % measured:            622ms / 100.0%            218MiB / 100.0%    

 Section               ncalls     time    %tot     avg     alloc    %tot      avg
 ────────────────────────────────────────────────────────────────────────────────
 Verify                     1    620ms   99.6%   620ms    208MiB   95.5%   208MiB
   Zonotope Loop            1    620ms   99.6%   620ms    208MiB   95.5%   208MiB
     Property Check         1    396ms   63.7%   396ms   76.1MiB   34.9%  76.1MiB
     Zonotope Propa...      1    215ms   34.5%   215ms    112MiB   51.4%   112MiB
       DiffZonotope...      2    112ms   18.1%  56.2ms   91.7MiB   42.0%  45.8MiB
         Zonotope_R...      4    104ms   16.8%  26.1ms   80.6MiB   37.0%  20.2MiB
           Allocation       4   64.4ms   10.3%  16.1ms   15.2MiB    7.0%  3.79MiB
           Influenc...      4   32.6ms    5.2%  8.16ms   50.1MiB   23.0%  12.5MiB
             Multiply       4   27.3ms    4.4%  6.83ms   26.9MiB   12.3%  6.72MiB
             Set Ma...      4   2.92ms    0.5%   731μs     0.00B    0.0%    0.00B
             Alloca...      4   2.37ms    0.4%   591μs   23.2MiB   10.7%  5.81MiB
           Column M...      4   5.46ms    0.9%  1.36ms   15.2MiB    7.0%  3.80MiB
           Set Matrix       4   1.88ms    0.3%   471μs   16.8KiB    0.0%  4.21KiB
           Vectors          4   91.0μs    0.0%  22.7μs    100KiB    0.0%  25.0KiB
           Bounds           4   2.44μs    0.0%   609ns     0.00B    0.0%    0.00B
       DiffZonotope...      3    102ms   16.4%  34.1ms   20.5MiB    9.4%  6.84MiB
         Zonotope_D...      6   48.6ms    7.8%  8.10ms   13.2MiB    6.0%  2.20MiB
 Initialize                 1   2.20ms    0.4%  2.20ms   9.84MiB    4.5%  9.84MiB
 ────────────────────────────────────────────────────────────────────────────────
[VERYDIFF_TIMER] 0.661476355

[VERYDIFF_EXPERIMENT] Running on /home/i57/steuber/NeuroDiff/repos/VeryDiffExperiments/src/../benchmarks/mnist-prune/specs/mnist_78_global_3.vnnlib /home/i57/steuber/NeuroDiff/repos/VeryDiffExperiments/src/../benchmarks/mnist-prune/nets/mnist_relu_3_100.onnx
Parsing /home/i57/steuber/NeuroDiff/repos/VeryDiffExperiments/src/../benchmarks/mnist-prune/nets/mnist_relu_3_100.onnx...
Found input X
op: matmul, weight: (100, 784), bias: nothing
op: bias, weight: nothing, bias: (100,)
op: relu, weight: nothing, bias: nothing
op: matmul, weight: (100, 100), bias: nothing
op: bias, weight: nothing, bias: (100,)
op: relu, weight: nothing, bias: nothing
op: matmul, weight: (10, 100), bias: nothing
op: bias, weight: nothing, bias: (10,)
op: relu, weight: nothing, bias: nothing
op: matmul, weight: (10, 10), bias: nothing
op: bias, weight: nothing, bias: (10,)
Parsing /home/i57/steuber/NeuroDiff/repos/VeryDiffExperiments/src/../benchmarks/mnist-prune/nets_pruned/mnist_relu_3_100_pruned5.onnx...
Found input X
op: matmul, weight: (100, 784), bias: nothing
op: bias, weight: nothing, bias: (100,)
op: relu, weight: nothing, bias: nothing
op: matmul, weight: (100, 100), bias: nothing
op: bias, weight: nothing, bias: (100,)
op: relu, weight: nothing, bias: nothing
op: matmul, weight: (10, 100), bias: nothing
op: bias, weight: nothing, bias: (10,)
op: relu, weight: nothing, bias: nothing
op: matmul, weight: (10, 10), bias: nothing
op: bias, weight: nothing, bias: (10,)
Distance: 296.6600370998244
Distance: 77.24290861755458
Distance: 5.7170369567975285
Distance: 0.0
Running with 1 threads
[Thread 1] Time to first task: 0.0s
Instable Generators: 28
Instable Generators: 41
Instable Generators: 3
Zono Bounds:
[0.0, -0.46081254402470606, 0.0, -0.3243028136073034, -0.342496208366807, 0.0, 0.0, -0.15303039242874014, -0.4318437902730671, -0.3075107808114521]
[0.0, 0.46081254402470606, 0.0, 0.3200998057856279, 0.481751936271448, 0.0, 0.0, 0.5636549719043172, 0.43184379027306696, 0.3386024806502854]
[Thread 1] Processed 100 zonotopes (Work Done: 0.0%; Expected Zonos: Inf)
[Thread 1] Processed 200 zonotopes (Work Done: 0.0%; Expected Zonos: Inf)
[Thread 1] Processed 300 zonotopes (Work Done: 0.0%; Expected Zonos: Inf)


TIMEOUT REACHED
UNKNOWN
[Thread 1] Total splits: 375
Processed 375 zonotopes (Work Done: 0.0%); Generated 750 (0.3201692822s/loop)
[Thread 1] Finished in 120.06s
 ────────────────────────────────────────────────────────────────────────────────
                                        Time                    Allocations      
                               ───────────────────────   ────────────────────────
       Tot / % measured:             120s / 100.0%           59.0GiB / 100.0%    

 Section               ncalls     time    %tot     avg     alloc    %tot      avg
 ────────────────────────────────────────────────────────────────────────────────
 Verify                     1     120s  100.0%    120s   59.0GiB  100.0%  59.0GiB
   Zonotope Loop            1     120s  100.0%    120s   59.0GiB  100.0%  59.0GiB
     Property Check       375    79.5s   66.2%   212ms   19.6GiB   33.2%  53.5MiB
     Zonotope Propa...    375    36.3s   30.2%  96.7ms   26.5GiB   44.9%  72.3MiB
       DiffZonotope...  1.12k    30.2s   25.2%  26.9ms   25.0GiB   42.3%  22.7MiB
         Zonotope_R...  2.25k    29.8s   24.8%  13.3ms   24.4GiB   41.3%  11.1MiB
           Influenc...  2.25k    26.9s   22.4%  12.0ms   22.4GiB   38.0%  10.2MiB
             Alloca...  2.25k    16.0s   13.4%  7.13ms   11.0GiB   18.7%  5.03MiB
             Multiply   2.25k    9.28s    7.7%  4.12ms   11.4GiB   19.3%  5.17MiB
             Set Ma...  2.25k    1.57s    1.3%   699μs     0.00B    0.0%    0.00B
           Column M...  2.25k    1.72s    1.4%   763μs   0.98GiB    1.7%   456KiB
           Vectors      2.25k    1.04s    0.9%   464μs   7.15MiB    0.0%  3.26KiB
           Set Matrix   2.25k    115ms    0.1%  51.1μs   1.91MiB    0.0%     889B
           Allocation   2.25k   52.0ms    0.0%  23.1μs   0.98GiB    1.7%   456KiB
           Bounds       2.25k   1.51ms    0.0%   672ns     0.00B    0.0%    0.00B
       DiffZonotope...  1.50k    6.01s    5.0%  4.01ms   1.51GiB    2.6%  1.03MiB
         Zonotope_D...  3.00k    2.89s    2.4%   964μs   0.99GiB    1.7%   346KiB
     Compute Split        375    2.71s    2.3%  7.22ms   5.60GiB    9.5%  15.3MiB
 Initialize                 1    579μs    0.0%   579μs   5.41MiB    0.0%  5.41MiB
 ────────────────────────────────────────────────────────────────────────────────
[VERYDIFF_TIMER] 120.089081658

[VERYDIFF_EXPERIMENT] NETWORK: /home/i57/steuber/NeuroDiff/repos/VeryDiffExperiments/src/../benchmarks/mnist-prune/specs/mnist_78_global_3.vnnlib
[VERYDIFF_EXPERIMENT] TIME: 121.369334919
