
[VERYDIFF_EXPERIMENT] Running on /home/i57/steuber/NeuroDiff/repos/VeryDiffExperiments/src/../benchmarks/mnist-prune/specs/mnist_46_local_18.vnnlib /home/i57/steuber/NeuroDiff/repos/VeryDiffExperiments/src/../benchmarks/mnist-prune/nets/mnist_relu_2_512.onnx
Loading /home/i57/steuber/NeuroDiff/repos/VeryDiffExperiments/src/../benchmarks/mnist-prune/nets/mnist_relu_2_512.onnx and /home/i57/steuber/NeuroDiff/repos/VeryDiffExperiments/src/../benchmarks/mnist-prune/nets_pruned/mnist_relu_2_512_0.79-old.onnx
INPUT SHAPE: 784
Refined: 3 | Refine Limit: 2 | Wrong: 0 | Right: 2 | Total: 2 | Total Zonos Considered: 5 | Expected 128 (1.5625%)Refined: 7 | Refine Limit: 5 | Wrong: 0 | Right: 3 | Total: 3 | Total Zonos Considered: 10 | Expected 190 (1.5789473684210527%)Refined: 12 | Refine Limit: 7 | Wrong: 0 | Right: 4 | Total: 4 | Total Zonos Considered: 16 | Expected 253 (1.5810276679841897%)Refined: 17 | Refine Limit: 7 | Wrong: 0 | Right: 4 | Total: 4 | Total Zonos Considered: 21 | Expected 253 (1.5810276679841897%)Refined: 23 | Refine Limit: 21 | Wrong: 0 | Right: 6 | Total: 6 | Total Zonos Considered: 29 | Expected 380 (1.5789473684210527%)Refined: 28 | Refine Limit: 24 | Wrong: 0 | Right: 9 | Total: 9 | Total Zonos Considered: 37 | Expected 571 (1.5761821366024518%)Refined: 29 | Refine Limit: 21 | Wrong: 0 | Right: 17 | Total: 17 | Total Zonos Considered: 46 | Expected 1079 (1.5755329008341055%)Refined: 32 | Refine Limit: 18 | Wrong: 0 | Right: 23 | Total: 23 | Total Zonos Considered: 55 | Expected 1459 (1.5764222069910898%)Refined: 37 | Refine Limit: 25 | Wrong: 0 | Right: 26 | Total: 26 | Total Zonos Considered: 63 | Expected 1650 (1.575757575757576%)Refined: 41 | Refine Limit: 24 | Wrong: 0 | Right: 31 | Total: 31 | Total Zonos Considered: 72 | Expected 1967 (1.5760040671072701%)Refined: 43 | Refine Limit: 26 | Wrong: 0 | Right: 37 | Total: 37 | Total Zonos Considered: 80 | Expected 2348 (1.5758091993185688%)Refined: 49 | Refine Limit: 31 | Wrong: 0 | Right: 41 | Total: 41 | Total Zonos Considered: 90 | Expected 2602 (1.5757109915449656%)Refined: 53 | Refine Limit: 32 | Wrong: 0 | Right: 51 | Total: 51 | Total Zonos Considered: 104 | Expected 3237 (1.5755329008341055%)Refined: 56 | Refine Limit: 28 | Wrong: 0 | Right: 63 | Total: 63 | Total Zonos Considered: 119 | Expected 3998 (1.5757878939469734%)Refined: 59 | Refine Limit: 28 | Wrong: 0 | Right: 68 | Total: 68 | Total Zonos Considered: 127 | Expected 4316 (1.5755329008341055%)Refined: 64 | Refine Limit: 33 | Wrong: 0 | Right: 73 | Total: 73 | Total Zonos Considered: 137 | Expected 4633 (1.5756529246708395%)Refined: 69 | Refine Limit: 38 | Wrong: 0 | Right: 78 | Total: 78 | Total Zonos Considered: 147 | Expected 4950 (1.575757575757576%)Refined: 69 | Refine Limit: 22 | Wrong: 0 | Right: 96 | Total: 96 | Total Zonos Considered: 165 | Expected 6093 (1.5755785327424916%)Refined: 73 | Refine Limit: 24 | Wrong: 0 | Right: 101 | Total: 101 | Total Zonos Considered: 174 | Expected 6410 (1.5756630265210607%)Refined: 76 | Refine Limit: 21 | Wrong: 0 | Right: 109 | Total: 109 | Total Zonos Considered: 185 | Expected 6918 (1.5755998843596415%)Refined: 81 | Refine Limit: 23 | Wrong: 0 | Right: 112 | Total: 112 | Total Zonos Considered: 193 | Expected 7108 (1.5756893640967922%)Refined: 85 | Refine Limit: 30 | Wrong: 0 | Right: 117 | Total: 117 | Total Zonos Considered: 202 | Expected 7426 (1.5755453810934554%)Refined: 88 | Refine Limit: 26 | Wrong: 0 | Right: 129 | Total: 129 | Total Zonos Considered: 217 | Expected 8188 (1.575476306790425%)Refined: 90 | Refine Limit: 24 | Wrong: 0 | Right: 137 | Total: 137 | Total Zonos Considered: 227 | Expected 8695 (1.575618171362852%)Refined: 92 | Refine Limit: 22 | Wrong: 0 | Right: 144 | Total: 144 | Total Zonos Considered: 236 | Expected 9140 (1.5754923413566742%)Refined: 96 | Refine Limit: 21 | Wrong: 0 | Right: 150 | Total: 150 | Total Zonos Considered: 246 | Expected 9520 (1.5756302521008403%)Refined: 102 | Refine Limit: 24 | Wrong: 0 | Right: 151 | Total: 151 | Total Zonos Considered: 253 | Expected 9584 (1.575542570951586%)Refined: 105 | Refine Limit: 28 | Wrong: 0 | Right: 156 | Total: 156 | Total Zonos Considered: 261 | Expected 9901 (1.5755984244015757%)Refined: 108 | Refine Limit: 27 | Wrong: 0 | Right: 162 | Total: 162 | Total Zonos Considered: 270 | Expected 10282 (1.575568955456137%)Refined: 113 | Refine Limit: 25 | Wrong: 0 | Right: 165 | Total: 165 | Total Zonos Considered: 278 | Expected 10473 (1.5754798052134058%)Refined: 117 | Refine Limit: 31 | Wrong: 0 | Right: 170 | Total: 170 | Total Zonos Considered: 287 | Expected 10790 (1.5755329008341055%)Refined: 120 | Refine Limit: 32 | Wrong: 0 | Right: 178 | Total: 178 | Total Zonos Considered: 298 | Expected 11298 (1.575500088511241%)Refined: 122 | Refine Limit: 28 | Wrong: 0 | Right: 188 | Total: 188 | Total Zonos Considered: 310 | Expected 11932 (1.5755950385517934%)UNKNOWN
TIMEOUT
Refined: 126 | Refine Limit: 30 | Wrong: 0 | Right: 192 | Total: 192 | Total Zonos Considered: 318 | Expected 12186 (1.5755785327424916%)

time: 121.063072834

[VERYDIFF_TIMER] 121.091647403

[VERYDIFF_EXPERIMENT] NETWORK: /home/i57/steuber/NeuroDiff/repos/VeryDiffExperiments/src/../benchmarks/mnist-prune/specs/mnist_46_local_18.vnnlib
[VERYDIFF_EXPERIMENT] TIME: 121.380791135
