
[VERYDIFF_EXPERIMENT] Running on /home/i57/steuber/NeuroDiff/repos/VeryDiffExperiments/src/../benchmarks/mnist-prune/specs/mnist_75_local_21.vnnlib /home/i57/steuber/NeuroDiff/repos/VeryDiffExperiments/src/../benchmarks/mnist-prune/nets/mnist_relu_3_100.onnx
Found input X
op: matmul, weight: (100, 784), bias: nothing
op: bias, weight: nothing, bias: (100,)
op: relu, weight: nothing, bias: nothing
op: matmul, weight: (100, 100), bias: nothing
op: bias, weight: nothing, bias: (100,)
op: relu, weight: nothing, bias: nothing
op: matmul, weight: (10, 100), bias: nothing
op: bias, weight: nothing, bias: (10,)
op: relu, weight: nothing, bias: nothing
op: matmul, weight: (10, 10), bias: nothing
op: bias, weight: nothing, bias: (10,)
Found input X
op: gemm, weight: (100, 784), bias: (100,)
op: relu, weight: nothing, bias: nothing
op: gemm, weight: (100, 100), bias: (100,)
op: relu, weight: nothing, bias: nothing
op: gemm, weight: (10, 100), bias: (10,)
op: relu, weight: nothing, bias: nothing
op: gemm, weight: (10, 10), bias: (10,)
Distance: 1958.4889029213523
Distance: 144.28197153992141
Distance: 22.063573056613677
Distance: 0.8412832540489035
Running with 1 threads
[Thread 1] Time to first task: 0.0s
Instable Generators: 43
Instable Generators: 49
Instable Generators: 7
Zono Bounds:
[-0.03120928293584655, -8.092154097882839, -8.592193218006102, -8.229599711988275, -9.574006901312199, -8.142190330901037, -0.011439595078977606, -9.771033386127126, -8.345879787766998, -8.977778083973629]
[-0.009382032706118657, 8.639030904847138, 7.789833949036015, 7.417764917074183, 9.599666563134125, 8.117647309367243, 0.0027203840493071904, 8.25907185392261, 8.42275974427931, 8.842620240740029]

Found counterexample: ([0.0, 0.0, 0.0, 0.0, 0.0, 0.0, 0.0, 0.0, 0.0, 0.0, 0.0, 0.0, 0.0, 0.0, 0.0, 0.0, 0.0, 0.0, 0.0, 0.0, 0.0, 0.0, 0.0, 0.0, 0.0, 0.0, 0.0, 0.0, 0.0, 0.0, 0.0, 0.0, 0.0, 0.0, 0.0, 1.0, 0.0, 0.0, 0.0, 0.0, 0.0, 0.0, 0.0, 0.0, 0.0, 0.0, 0.0, 0.0, 0.0, 0.0, 0.0, 0.0, 0.0, 0.0, 0.0, 0.0, 0.0, 0.0, 0.0, 0.0, 0.0, 0.0, 0.0, 0.0, 0.0, 0.0, 0.0, 0.0, 0.0, 0.0, 0.0, 0.0, 0.0, 0.0, 0.0, 0.0, 0.0, 0.0, 0.0, 0.0, 0.0, 0.0, 0.0, 0.0, 0.0, 0.0, 0.0, 0.0, 1.0, 0.0, 0.0, 0.0, 0.0, 0.0, 0.0, 0.0, 0.0, 0.0, 0.0, 0.0, 0.0, 0.0, 0.0, 0.0, 1.0, 0.0, 0.0, 0.0, 0.0, 0.0, 0.0, 0.0, 0.0, 0.0, 0.0, 0.0, 0.0, 0.0, 0.0, 0.0, 0.0, 0.0, 0.0, 0.0, 0.0, 0.0, 0.0, 0.0, 0.0, 0.0, 0.0, 0.0, 0.0, 0.0, 0.0, 0.0, 0.0, 0.0, 0.0, 0.0, 0.0, 0.0, 0.0, 0.0, 0.0, 0.0, 0.0, 0.0, 0.0, 0.0, 0.0, 0.0, 0.0, 0.0, 0.0, 0.0, 0.0, 0.0, 0.0, 0.0, 0.0, 0.0, 0.0, 0.0, 0.0, 0.0, 0.0, 0.0, 0.0, 1.0, 0.0, 0.0, 0.0, 0.0, 0.0, 0.0, 0.0, 0.0, 0.0, 0.0, 0.0, 0.0, 0.0, 0.0, 0.0, 0.0, 0.0, 1.0, 0.0, 0.0, 0.0, 0.0, 0.0, 0.0, 0.0, 0.0, 0.0, 0.0, 0.0, 0.0, 0.0, 1.0, 0.0, 0.0, 0.0, 0.0, 0.0, 0.0, 0.0, 0.0, 0.0, 0.0, 0.0, 0.14901961, 0.88627452, 0.8392157, 0.07450981, 0.0, 0.0, 0.0, 0.0, 0.0, 0.0, 0.0, 0.0, 0.0, 0.0, 0.0, 0.05490196, 0.09803922, 0.09803922, 0.07450981, 0.0, 0.0, 0.0, 0.04313726, 0.09803922, 0.05098039, 0.09803922, 0.09803922, 0.1882353, 0.87450981, 0.99215686, 0.96078432, 0.1254902, 0.0, 0.0, 0.0, 0.0, 0.0, 0.0, 0.0, 0.0, 0.0, 0.0, 0.0, 0.56862748, 0.99215686, 0.99215686, 0.90196079, 0.25490198, 0.52941179, 0.6156863, 0.78039217, 0.99215686, 0.81960785, 0.99215686, 0.99215686, 0.99215686, 0.99215686, 0.99215686, 0.59215689, 0.0, 0.0, 0.0, 0.0, 1.0, 0.0, 0.0, 0.0, 0.0, 0.0, 0.0, 0.0, 0.4627451, 0.83137256, 0.86666667, 0.80392158, 0.85882354, 0.90196079, 0.99215686, 0.99215686, 0.99215686, 0.99607843, 0.99215686, 0.99215686, 0.99215686, 0.99215686, 0.70980394, 0.0627451, 0.0, 0.0, 0.0, 0.0, 0.0, 0.0, 0.0, 0.0, 0.0, 0.0, 0.0, 0.0, 0.0, 0.04313726, 0.09411765, 0.0, 0.08235294, 0.14901961, 0.28235295, 0.28235295, 0.28235295, 0.28235295, 0.28235295, 0.72156864, 0.99215686, 0.93725491, 0.18039216, 0.0, 0.0, 0.0, 0.0, 0.0, 0.0, 0.0, 0.0, 0.0, 0.0, 0.0, 0.0, 1.0, 0.0, 0.0, 0.0, 0.0, 0.0, 0.0, 0.0, 0.0, 0.0, 0.0, 0.02745098, 0.72549021, 0.99215686, 0.39607844, 0.0, 0.0, 0.0, 0.0, 0.0, 0.0, 0.0, 0.0, 0.0, 0.0, 0.0, 0.0, 0.0, 0.0, 0.0, 0.0, 0.0, 0.0, 0.0, 0.0, 0.0, 0.0, 0.0, 0.0, 0.48627451, 0.99215686, 0.99215686, 0.28235295, 0.0, 0.0, 0.0, 0.0, 0.0, 0.0, 0.0, 0.0, 0.0, 0.0, 0.0, 0.0, 0.0, 0.0, 0.0, 0.0, 0.0, 0.0, 0.0, 0.0, 0.0, 0.0, 0.0, 0.0, 0.56862748, 0.99215686, 0.92156863, 0.17647059, 0.0, 0.0, 0.0, 0.0, 0.0, 0.0, 0.0, 0.0, 0.0, 0.0, 0.0, 0.0, 0.0, 0.0, 0.0, 0.0, 0.0, 0.0, 0.0, 0.0, 0.37254903, 0.43137255, 0.43137255, 0.43137255, 0.75294119, 0.99215686, 0.97647059, 0.56078434, 0.43137255, 0.43137255, 0.65490198, 0.24705882, 0.0, 0.0, 0.0, 0.0, 0.0, 0.0, 0.0, 0.0, 0.0, 0.0, 0.0, 0.0, 0.0, 0.0, 0.0, 0.32156864, 0.98823529, 0.99215686, 0.99215686, 0.99607843, 0.99215686, 0.99215686, 0.99215686, 0.99215686, 0.99215686, 0.99215686, 0.99215686, 0.34117648, 0.0, 0.0, 0.0, 0.0, 0.0, 0.0, 0.0, 0.0, 0.0, 0.0, 0.0, 0.0, 0.0, 0.0, 1.0, 0.0, 0.41176471, 0.90588236, 0.94901961, 0.95686275, 0.99607843, 0.99607843, 0.96470588, 0.72156864, 0.58431375, 0.31764707, 0.0, 0.0, 0.0, 1.0, 0.0, 0.0, 0.0, 0.0, 0.0, 0.0, 0.0, 0.0, 0.0, 0.0, 0.0, 0.0, 0.0, 0.0, 0.0, 0.0, 0.0, 0.05098039, 0.99215686, 0.98039216, 0.29803923, 0.0, 0.0, 0.0, 0.0, 0.0, 0.0, 0.0, 0.0, 0.0, 0.0, 0.0, 0.0, 0.0, 0.0, 0.0, 0.0, 0.0, 0.0, 0.0, 0.0, 0.0, 0.0, 0.0, 0.0, 0.05098039, 0.99215686, 0.8509804, 0.0, 0.0, 0.0, 0.0, 0.0, 0.0, 0.0, 0.0, 0.0, 0.0, 0.0, 0.0, 0.0, 0.0, 0.0, 0.0, 0.0, 0.0, 1.0, 0.0, 0.0, 0.0, 0.0, 0.0, 0.0, 0.36862746, 0.99215686, 0.8509804, 0.0, 0.0, 0.0, 0.0, 0.0, 0.0, 0.0, 0.0, 0.0, 0.0, 0.0, 0.0, 0.0, 0.0, 0.0, 0.0, 0.0, 0.0, 0.0, 0.0, 0.0, 0.0, 0.0, 0.0, 0.0, 0.52156866, 0.99215686, 0.8509804, 0.0, 0.0, 0.0, 0.0, 0.0, 0.0, 0.0, 0.0, 0.0, 0.0, 0.0, 0.0, 0.0, 0.0, 0.0, 0.0, 0.0, 0.0, 0.0, 0.0, 0.0, 0.0, 0.0, 0.0, 0.0, 0.88627452, 0.99215686, 0.71372551, 0.0, 0.0, 0.0, 0.0, 0.0, 0.0, 0.0, 0.0, 0.0, 0.0, 0.0, 0.0, 0.0, 0.0, 0.0, 0.0, 0.0, 0.0, 0.0, 0.0, 0.0, 0.0, 0.0, 0.0, 0.0, 0.99607843, 0.99215686, 0.3764706, 0.0, 1.0, 0.0, 0.0, 0.0, 0.0, 0.0, 0.0, 1.0, 0.0, 0.0, 0.0, 0.0, 0.0, 0.0, 0.0, 0.0, 0.0, 0.0, 0.0, 0.0, 1.0, 0.0, 0.0, 0.0, 0.99607843, 0.99215686, 0.3764706, 0.0, 0.0, 0.0, 0.0, 0.0, 0.0, 0.0, 0.0, 0.0, 0.0, 0.0, 0.0, 0.0, 0.0, 0.0, 0.0, 0.0, 0.0, 0.0, 0.0, 0.0, 0.0, 0.0, 0.0, 0.0, 0.99607843, 0.99215686, 0.3764706, 0.0, 0.0, 0.0, 0.0, 0.0, 0.0, 0.0, 0.0, 0.0, 0.0, 0.0, 0.0, 0.0, 0.0, 0.0, 0.0, 0.0, 0.0, 0.0, 0.0, 0.0, 0.0, 0.0, 0.0, 0.0, 0.31764707, 0.94901961, 0.2, 0.0, 0.0, 0.0, 0.0, 0.0, 0.0, 0.0, 0.0, 0.0, 0.0, 0.0, 0.0, 0.0, 0.0, 0.0, 0.0, 0.0, 0.0, 0.0, 0.0, 0.0, 0.0, 0.0, 0.0, 0.0, 0.0, 0.0, 0.0, 0.0, 0.0, 0.0, 0.0, 0.0, 0.0, 0.0, 0.0, 0.0, 1.0, 0.0, 0.0], ([0.0, 4.328784128908537, 3.065587491633845, 2.6192215549607907, 0.0, 0.0, 0.0, 10.327835262677732, 0.0, 0.0], [0.017886172425440695, 4.053682356212438, 3.36694969199331, 3.250037566923163, -0.001403607613456915, 0.026346287534523324, 0.0032685586229451967, 11.469810340830868, 0.001690985640643879, -0.006166289590139758], 1.141975078153136))
[Thread 1] Total splits: 0
Processed 1 zonotopes (Work Done: 0.0%); Generated 0 (0.002449829s/loop)
[Thread 1] Finished in 0.0s
 ────────────────────────────────────────────────────────────────────────────────
                                        Time                    Allocations      
                               ───────────────────────   ────────────────────────
       Tot / % measured:           2.79ms /  99.8%           3.91MiB / 100.0%    

 Section               ncalls     time    %tot     avg     alloc    %tot      avg
 ────────────────────────────────────────────────────────────────────────────────
 Verify                     1   2.47ms   88.8%  2.47ms   3.07MiB   78.5%  3.07MiB
   Zonotope Loop            1   2.45ms   88.0%  2.45ms   3.06MiB   78.4%  3.06MiB
     Zonotope Propa...      1   1.88ms   67.4%  1.88ms   1.70MiB   43.6%  1.70MiB
       DiffZonotope...      4   1.19ms   42.8%   298μs    365KiB    9.1%  91.3KiB
         Zonotope_D...      8    536μs   19.2%  67.0μs    179KiB    4.5%  22.4KiB
       DiffZonotope...      3    675μs   24.2%   225μs   1.34MiB   34.4%   458KiB
         Zonotope_R...      6    337μs   12.1%  56.1μs    904KiB   22.6%   151KiB
           Influenc...      6    121μs    4.3%  20.2μs    278KiB    7.0%  46.4KiB
             Multiply       6   85.2μs    3.1%  14.2μs    178KiB    4.4%  29.6KiB
             Alloca...      6   21.6μs    0.8%  3.59μs   98.4KiB    2.5%  16.4KiB
             Set Ma...      6   8.83μs    0.3%  1.47μs     0.00B    0.0%    0.00B
           Column M...      6   85.8μs    3.1%  14.3μs    298KiB    7.5%  49.6KiB
           Allocation       6   63.1μs    2.3%  10.5μs    297KiB    7.4%  49.6KiB
           Set Matrix       6   35.5μs    1.3%  5.92μs   6.66KiB    0.2%  1.11KiB
           Vectors          6   19.9μs    0.7%  3.31μs   19.5KiB    0.5%  3.26KiB
           Bounds           6   1.82μs    0.1%   303ns     0.00B    0.0%    0.00B
     Property Check         1    167μs    6.0%   167μs   54.2KiB    1.4%  54.2KiB
 Initialize                 1    311μs   11.2%   311μs    858KiB   21.5%   858KiB
 ────────────────────────────────────────────────────────────────────────────────
[VERYDIFF_TIMER] 0.03131671

[VERYDIFF_EXPERIMENT] NETWORK: /home/i57/steuber/NeuroDiff/repos/VeryDiffExperiments/src/../benchmarks/mnist-prune/specs/mnist_75_local_21.vnnlib
[VERYDIFF_EXPERIMENT] TIME: 0.337374817
