[runlim] version:		2.0.0rc12
[runlim] host:			i57pool5
[runlim] time limit:		311040000 seconds
[runlim] real time limit:	120 seconds
[runlim] space limit:		15563 MB
[runlim] argv[0]:		/home/i57/steuber/.local/bin/Marabou
[runlim] argv[1]:		./mnist-prune/nets/product_mnist_relu_3_100_mnist_relu_3_100_pruned5_eps.onnx
[runlim] argv[2]:		./mnist-prune/specs/product_mnist_67_local_24_eps_1.0.vnnlib
[runlim] start:			Fri Oct  4 01:48:35 2024
[runlim] child:			647553
Network: ./mnist-prune/nets/product_mnist_relu_3_100_mnist_relu_3_100_pruned5_eps.onnx
Property: ./mnist-prune/specs/product_mnist_67_local_24_eps_1.0.vnnlib

Engine::processInputQuery: Input query (before preprocessing): 450 equations, 1654 variables
Engine::processInputQuery: Input query (after preprocessing): 830 equations, 1912 variables

Input bounds:
	x0: [ -0.0000,  -0.0000] [FIXED]
	x1: [ -0.0000,  -0.0000] [FIXED]
	x2: [ -0.0000,  -0.0000] [FIXED]
	x3: [ -0.0000,  -0.0000] [FIXED]
	x4: [ -0.0000,  -0.0000] [FIXED]
	x5: [ -0.0000,  -0.0000] [FIXED]
	x6: [ -0.0000,  -0.0000] [FIXED]
	x7: [ -0.0000,  -0.0000] [FIXED]
	x8: [ -0.0000,  -0.0000] [FIXED]
	x9: [ -0.0000,  -0.0000] [FIXED]
	x10: [ -0.0000,  -0.0000] [FIXED]
	x11: [ -0.0000,  -0.0000] [FIXED]
	x12: [ -0.0000,  -0.0000] [FIXED]
	x13: [ -0.0000,  -0.0000] [FIXED]
	x14: [ -0.0000,   1.0000] 
	x15: [ -0.0000,  -0.0000] [FIXED]
	x16: [ -0.0000,  -0.0000] [FIXED]
	x17: [ -0.0000,  -0.0000] [FIXED]
	x18: [ -0.0000,  -0.0000] [FIXED]
	x19: [ -0.0000,  -0.0000] [FIXED]
	x20: [ -0.0000,  -0.0000] [FIXED]
	x21: [ -0.0000,  -0.0000] [FIXED]
	x22: [ -0.0000,  -0.0000] [FIXED]
	x23: [ -0.0000,  -0.0000] [FIXED]
	x24: [ -0.0000,  -0.0000] [FIXED]
	x25: [ -0.0000,  -0.0000] [FIXED]
	x26: [ -0.0000,  -0.0000] [FIXED]
	x27: [ -0.0000,  -0.0000] [FIXED]
	x28: [ -0.0000,  -0.0000] [FIXED]
	x29: [ -0.0000,  -0.0000] [FIXED]
	x30: [ -0.0000,  -0.0000] [FIXED]
	x31: [ -0.0000,  -0.0000] [FIXED]
	x32: [ -0.0000,  -0.0000] [FIXED]
	x33: [ -0.0000,  -0.0000] [FIXED]
	x34: [ -0.0000,  -0.0000] [FIXED]
	x35: [ -0.0000,  -0.0000] [FIXED]
	x36: [ -0.0000,  -0.0000] [FIXED]
	x37: [ -0.0000,  -0.0000] [FIXED]
	x38: [ -0.0000,  -0.0000] [FIXED]
	x39: [ -0.0000,  -0.0000] [FIXED]
	x40: [ -0.0000,  -0.0000] [FIXED]
	x41: [ -0.0000,  -0.0000] [FIXED]
	x42: [ -0.0000,  -0.0000] [FIXED]
	x43: [ -0.0000,  -0.0000] [FIXED]
	x44: [ -0.0000,  -0.0000] [FIXED]
	x45: [ -0.0000,  -0.0000] [FIXED]
	x46: [ -0.0000,  -0.0000] [FIXED]
	x47: [ -0.0000,  -0.0000] [FIXED]
	x48: [ -0.0000,  -0.0000] [FIXED]
	x49: [ -0.0000,  -0.0000] [FIXED]
	x50: [ -0.0000,  -0.0000] [FIXED]
	x51: [ -0.0000,  -0.0000] [FIXED]
	x52: [ -0.0000,  -0.0000] [FIXED]
	x53: [ -0.0000,  -0.0000] [FIXED]
	x54: [ -0.0000,  -0.0000] [FIXED]
	x55: [ -0.0000,  -0.0000] [FIXED]
	x56: [ -0.0000,  -0.0000] [FIXED]
	x57: [ -0.0000,  -0.0000] [FIXED]
	x58: [ -0.0000,   1.0000] 
	x59: [ -0.0000,  -0.0000] [FIXED]
	x60: [ -0.0000,  -0.0000] [FIXED]
	x61: [ -0.0000,  -0.0000] [FIXED]
	x62: [ -0.0000,  -0.0000] [FIXED]
	x63: [ -0.0000,  -0.0000] [FIXED]
	x64: [ -0.0000,  -0.0000] [FIXED]
	x65: [ -0.0000,  -0.0000] [FIXED]
	x66: [ -0.0000,  -0.0000] [FIXED]
	x67: [ -0.0000,  -0.0000] [FIXED]
	x68: [ -0.0000,  -0.0000] [FIXED]
	x69: [ -0.0000,  -0.0000] [FIXED]
	x70: [ -0.0000,  -0.0000] [FIXED]
	x71: [ -0.0000,  -0.0000] [FIXED]
	x72: [ -0.0000,  -0.0000] [FIXED]
	x73: [ -0.0000,  -0.0000] [FIXED]
	x74: [ -0.0000,  -0.0000] [FIXED]
	x75: [ -0.0000,  -0.0000] [FIXED]
	x76: [ -0.0000,  -0.0000] [FIXED]
	x77: [ -0.0000,  -0.0000] [FIXED]
	x78: [ -0.0000,  -0.0000] [FIXED]
	x79: [ -0.0000,  -0.0000] [FIXED]
	x80: [ -0.0000,  -0.0000] [FIXED]
	x81: [ -0.0000,  -0.0000] [FIXED]
	x82: [ -0.0000,  -0.0000] [FIXED]
	x83: [ -0.0000,  -0.0000] [FIXED]
	x84: [ -0.0000,  -0.0000] [FIXED]
	x85: [ -0.0000,  -0.0000] [FIXED]
	x86: [ -0.0000,  -0.0000] [FIXED]
	x87: [ -0.0000,  -0.0000] [FIXED]
	x88: [ -0.0000,  -0.0000] [FIXED]
	x89: [ -0.0000,  -0.0000] [FIXED]
	x90: [ -0.0000,  -0.0000] [FIXED]
	x91: [ -0.0000,  -0.0000] [FIXED]
	x92: [ -0.0000,  -0.0000] [FIXED]
	x93: [ -0.0000,  -0.0000] [FIXED]
	x94: [ -0.0000,  -0.0000] [FIXED]
	x95: [ -0.0000,  -0.0000] [FIXED]
	x96: [ -0.0000,  -0.0000] [FIXED]
	x97: [ -0.0000,  -0.0000] [FIXED]
	x98: [ -0.0000,  -0.0000] [FIXED]
	x99: [ -0.0000,  -0.0000] [FIXED]
	x100: [ -0.0000,  -0.0000] [FIXED]
	x101: [ -0.0000,  -0.0000] [FIXED]
	x102: [ -0.0000,  -0.0000] [FIXED]
	x103: [ -0.0000,  -0.0000] [FIXED]
	x104: [ -0.0000,  -0.0000] [FIXED]
	x105: [ -0.0000,  -0.0000] [FIXED]
	x106: [ -0.0000,  -0.0000] [FIXED]
	x107: [ -0.0000,  -0.0000] [FIXED]
	x108: [ -0.0000,  -0.0000] [FIXED]
	x109: [ -0.0000,  -0.0000] [FIXED]
	x110: [ -0.0000,  -0.0000] [FIXED]
	x111: [ -0.0000,  -0.0000] [FIXED]
	x112: [ -0.0000,  -0.0000] [FIXED]
	x113: [ -0.0000,  -0.0000] [FIXED]
	x114: [ -0.0000,  -0.0000] [FIXED]
	x115: [ -0.0000,  -0.0000] [FIXED]
	x116: [ -0.0000,  -0.0000] [FIXED]
	x117: [ -0.0000,  -0.0000] [FIXED]
	x118: [ -0.0000,  -0.0000] [FIXED]
	x119: [ -0.0000,  -0.0000] [FIXED]
	x120: [ -0.0000,  -0.0000] [FIXED]
	x121: [ -0.0000,  -0.0000] [FIXED]
	x122: [ -0.0000,  -0.0000] [FIXED]
	x123: [ -0.0000,  -0.0000] [FIXED]
	x124: [ -0.0000,  -0.0000] [FIXED]
	x125: [ -0.0000,  -0.0000] [FIXED]
	x126: [ -0.0000,  -0.0000] [FIXED]
	x127: [ -0.0000,  -0.0000] [FIXED]
	x128: [ -0.0000,  -0.0000] [FIXED]
	x129: [ -0.0000,  -0.0000] [FIXED]
	x130: [ -0.0000,  -0.0000] [FIXED]
	x131: [ -0.0000,  -0.0000] [FIXED]
	x132: [ -0.0000,  -0.0000] [FIXED]
	x133: [ -0.0000,  -0.0000] [FIXED]
	x134: [ -0.0000,  -0.0000] [FIXED]
	x135: [ -0.0000,  -0.0000] [FIXED]
	x136: [ -0.0000,   1.0000] 
	x137: [ -0.0000,  -0.0000] [FIXED]
	x138: [ -0.0000,  -0.0000] [FIXED]
	x139: [ -0.0000,  -0.0000] [FIXED]
	x140: [ -0.0000,  -0.0000] [FIXED]
	x141: [ -0.0000,  -0.0000] [FIXED]
	x142: [ -0.0000,  -0.0000] [FIXED]
	x143: [ -0.0000,  -0.0000] [FIXED]
	x144: [ -0.0000,  -0.0000] [FIXED]
	x145: [ -0.0000,  -0.0000] [FIXED]
	x146: [ -0.0000,  -0.0000] [FIXED]
	x147: [ -0.0000,  -0.0000] [FIXED]
	x148: [ -0.0000,  -0.0000] [FIXED]
	x149: [ -0.0000,  -0.0000] [FIXED]
	x150: [ -0.0000,  -0.0000] [FIXED]
	x151: [ -0.0000,  -0.0000] [FIXED]
	x152: [ -0.0000,  -0.0000] [FIXED]
	x153: [ -0.0000,  -0.0000] [FIXED]
	x154: [ -0.0000,  -0.0000] [FIXED]
	x155: [ -0.0000,  -0.0000] [FIXED]
	x156: [ -0.0000,   1.0000] 
	x157: [ -0.0000,  -0.0000] [FIXED]
	x158: [ -0.0000,  -0.0000] [FIXED]
	x159: [ -0.0000,  -0.0000] [FIXED]
	x160: [  0.0510,   0.0510] [FIXED]
	x161: [  0.7176,   0.7176] [FIXED]
	x162: [  1.0000,   1.0000] [FIXED]
	x163: [  0.1804,   0.1804] [FIXED]
	x164: [ -0.0000,  -0.0000] [FIXED]
	x165: [ -0.0000,  -0.0000] [FIXED]
	x166: [ -0.0000,  -0.0000] [FIXED]
	x167: [ -0.0000,   1.0000] 
	x168: [ -0.0000,  -0.0000] [FIXED]
	x169: [ -0.0000,  -0.0000] [FIXED]
	x170: [ -0.0000,  -0.0000] [FIXED]
	x171: [ -0.0000,  -0.0000] [FIXED]
	x172: [ -0.0000,  -0.0000] [FIXED]
	x173: [ -0.0000,   1.0000] 
	x174: [ -0.0000,  -0.0000] [FIXED]
	x175: [ -0.0000,  -0.0000] [FIXED]
	x176: [ -0.0000,  -0.0000] [FIXED]
	x177: [ -0.0000,  -0.0000] [FIXED]
	x178: [ -0.0000,  -0.0000] [FIXED]
	x179: [ -0.0000,  -0.0000] [FIXED]
	x180: [ -0.0000,  -0.0000] [FIXED]
	x181: [ -0.0000,  -0.0000] [FIXED]
	x182: [ -0.0000,  -0.0000] [FIXED]
	x183: [ -0.0000,  -0.0000] [FIXED]
	x184: [ -0.0000,  -0.0000] [FIXED]
	x185: [ -0.0000,  -0.0000] [FIXED]
	x186: [ -0.0000,  -0.0000] [FIXED]
	x187: [  0.3490,   0.3490] [FIXED]
	x188: [  0.5333,   0.5333] [FIXED]
	x189: [  0.9922,   0.9922] [FIXED]
	x190: [  0.9098,   0.9098] [FIXED]
	x191: [  0.1137,   0.1137] [FIXED]
	x192: [ -0.0000,  -0.0000] [FIXED]
	x193: [ -0.0000,  -0.0000] [FIXED]
	x194: [ -0.0000,  -0.0000] [FIXED]
	x195: [ -0.0000,  -0.0000] [FIXED]
	x196: [ -0.0000,  -0.0000] [FIXED]
	x197: [ -0.0000,  -0.0000] [FIXED]
	x198: [ -0.0000,  -0.0000] [FIXED]
	x199: [ -0.0000,  -0.0000] [FIXED]
	x200: [ -0.0000,  -0.0000] [FIXED]
	x201: [ -0.0000,   1.0000] 
	x202: [ -0.0000,  -0.0000] [FIXED]
	x203: [ -0.0000,  -0.0000] [FIXED]
	x204: [ -0.0000,  -0.0000] [FIXED]
	x205: [ -0.0000,  -0.0000] [FIXED]
	x206: [ -0.0000,  -0.0000] [FIXED]
	x207: [ -0.0000,  -0.0000] [FIXED]
	x208: [ -0.0000,  -0.0000] [FIXED]
	x209: [ -0.0000,  -0.0000] [FIXED]
	x210: [ -0.0000,  -0.0000] [FIXED]
	x211: [ -0.0000,  -0.0000] [FIXED]
	x212: [ -0.0000,  -0.0000] [FIXED]
	x213: [ -0.0000,  -0.0000] [FIXED]
	x214: [  0.3961,   0.3961] [FIXED]
	x215: [  0.9333,   0.9333] [FIXED]
	x216: [  0.9922,   0.9922] [FIXED]
	x217: [  0.9725,   0.9725] [FIXED]
	x218: [  0.1804,   0.1804] [FIXED]
	x219: [ -0.0000,  -0.0000] [FIXED]
	x220: [ -0.0000,  -0.0000] [FIXED]
	x221: [ -0.0000,  -0.0000] [FIXED]
	x222: [ -0.0000,  -0.0000] [FIXED]
	x223: [ -0.0000,  -0.0000] [FIXED]
	x224: [ -0.0000,  -0.0000] [FIXED]
	x225: [ -0.0000,  -0.0000] [FIXED]
	x226: [ -0.0000,  -0.0000] [FIXED]
	x227: [ -0.0000,  -0.0000] [FIXED]
	x228: [ -0.0000,  -0.0000] [FIXED]
	x229: [ -0.0000,  -0.0000] [FIXED]
	x230: [ -0.0000,  -0.0000] [FIXED]
	x231: [ -0.0000,  -0.0000] [FIXED]
	x232: [  0.0353,   0.0353] [FIXED]
	x233: [  0.3294,   0.3294] [FIXED]
	x234: [ -0.0000,   1.0000] 
	x235: [ -0.0000,  -0.0000] [FIXED]
	x236: [ -0.0000,  -0.0000] [FIXED]
	x237: [ -0.0000,  -0.0000] [FIXED]
	x238: [ -0.0000,  -0.0000] [FIXED]
	x239: [ -0.0000,  -0.0000] [FIXED]
	x240: [ -0.0000,  -0.0000] [FIXED]
	x241: [  0.0431,   0.0431] [FIXED]
	x242: [  0.8039,   0.8039] [FIXED]
	x243: [  0.9922,   0.9922] [FIXED]
	x244: [  0.9059,   0.9059] [FIXED]
	x245: [  0.3098,   0.3098] [FIXED]
	x246: [ -0.0000,  -0.0000] [FIXED]
	x247: [ -0.0000,  -0.0000] [FIXED]
	x248: [ -0.0000,  -0.0000] [FIXED]
	x249: [ -0.0000,  -0.0000] [FIXED]
	x250: [ -0.0000,  -0.0000] [FIXED]
	x251: [ -0.0000,  -0.0000] [FIXED]
	x252: [ -0.0000,  -0.0000] [FIXED]
	x253: [ -0.0000,  -0.0000] [FIXED]
	x254: [ -0.0000,  -0.0000] [FIXED]
	x255: [ -0.0000,  -0.0000] [FIXED]
	x256: [ -0.0000,  -0.0000] [FIXED]
	x257: [ -0.0000,  -0.0000] [FIXED]
	x258: [ -0.0000,  -0.0000] [FIXED]
	x259: [  0.2118,   0.2118] [FIXED]
	x260: [  0.7255,   0.7255] [FIXED]
	x261: [  0.9647,   0.9647] [FIXED]
	x262: [  0.3059,   0.3059] [FIXED]
	x263: [ -0.0000,  -0.0000] [FIXED]
	x264: [ -0.0000,  -0.0000] [FIXED]
	x265: [ -0.0000,   1.0000] 
	x266: [ -0.0000,  -0.0000] [FIXED]
	x267: [ -0.0000,  -0.0000] [FIXED]
	x268: [ -0.0000,  -0.0000] [FIXED]
	x269: [  0.3333,   0.3333] [FIXED]
	x270: [  0.3373,   0.3373] [FIXED]
	x271: [  0.9020,   0.9020] [FIXED]
	x272: [  0.7294,   0.7294] [FIXED]
	x273: [ -0.0000,   1.0000] 
	x274: [ -0.0000,  -0.0000] [FIXED]
	x275: [ -0.0000,  -0.0000] [FIXED]
	x276: [ -0.0000,  -0.0000] [FIXED]
	x277: [ -0.0000,  -0.0000] [FIXED]
	x278: [ -0.0000,  -0.0000] [FIXED]
	x279: [ -0.0000,  -0.0000] [FIXED]
	x280: [ -0.0000,  -0.0000] [FIXED]
	x281: [ -0.0000,  -0.0000] [FIXED]
	x282: [ -0.0000,  -0.0000] [FIXED]
	x283: [ -0.0000,  -0.0000] [FIXED]
	x284: [ -0.0000,  -0.0000] [FIXED]
	x285: [ -0.0000,  -0.0000] [FIXED]
	x286: [  0.1020,   0.1020] [FIXED]
	x287: [  0.9137,   0.9137] [FIXED]
	x288: [  0.6392,   0.6392] [FIXED]
	x289: [  0.2157,   0.2157] [FIXED]
	x290: [ -0.0000,  -0.0000] [FIXED]
	x291: [ -0.0000,  -0.0000] [FIXED]
	x292: [ -0.0000,  -0.0000] [FIXED]
	x293: [ -0.0000,  -0.0000] [FIXED]
	x294: [ -0.0000,  -0.0000] [FIXED]
	x295: [ -0.0000,  -0.0000] [FIXED]
	x296: [ -0.0000,  -0.0000] [FIXED]
	x297: [  0.2471,   0.2471] [FIXED]
	x298: [  0.6118,   0.6118] [FIXED]
	x299: [  0.9059,   0.9059] [FIXED]
	x300: [  0.2235,   0.2235] [FIXED]
	x301: [ -0.0000,  -0.0000] [FIXED]
	x302: [ -0.0000,  -0.0000] [FIXED]
	x303: [ -0.0000,  -0.0000] [FIXED]
	x304: [ -0.0000,  -0.0000] [FIXED]
	x305: [ -0.0000,  -0.0000] [FIXED]
	x306: [ -0.0000,  -0.0000] [FIXED]
	x307: [ -0.0000,  -0.0000] [FIXED]
	x308: [ -0.0000,  -0.0000] [FIXED]
	x309: [ -0.0000,  -0.0000] [FIXED]
	x310: [ -0.0000,  -0.0000] [FIXED]
	x311: [ -0.0000,  -0.0000] [FIXED]
	x312: [  0.0118,   0.0118] [FIXED]
	x313: [  0.5294,   0.5294] [FIXED]
	x314: [  0.5569,   0.5569] [FIXED]
	x315: [  0.8157,   0.8157] [FIXED]
	x316: [  0.0902,   0.0902] [FIXED]
	x317: [ -0.0000,  -0.0000] [FIXED]
	x318: [ -0.0000,  -0.0000] [FIXED]
	x319: [ -0.0000,  -0.0000] [FIXED]
	x320: [ -0.0000,  -0.0000] [FIXED]
	x321: [ -0.0000,  -0.0000] [FIXED]
	x322: [ -0.0000,  -0.0000] [FIXED]
	x323: [ -0.0000,  -0.0000] [FIXED]
	x324: [ -0.0000,  -0.0000] [FIXED]
	x325: [  0.8392,   0.8392] [FIXED]
	x326: [  0.9922,   0.9922] [FIXED]
	x327: [  0.5529,   0.5529] [FIXED]
	x328: [ -0.0000,  -0.0000] [FIXED]
	x329: [ -0.0000,  -0.0000] [FIXED]
	x330: [ -0.0000,  -0.0000] [FIXED]
	x331: [ -0.0000,  -0.0000] [FIXED]
	x332: [ -0.0000,  -0.0000] [FIXED]
	x333: [ -0.0000,  -0.0000] [FIXED]
	x334: [ -0.0000,  -0.0000] [FIXED]
	x335: [ -0.0000,  -0.0000] [FIXED]
	x336: [ -0.0000,  -0.0000] [FIXED]
	x337: [ -0.0000,  -0.0000] [FIXED]
	x338: [ -0.0000,  -0.0000] [FIXED]
	x339: [ -0.0000,  -0.0000] [FIXED]
	x340: [  0.1843,   0.1843] [FIXED]
	x341: [  0.9922,   0.9922] [FIXED]
	x342: [  0.9922,   0.9922] [FIXED]
	x343: [  0.2627,   0.2627] [FIXED]
	x344: [ -0.0000,  -0.0000] [FIXED]
	x345: [ -0.0000,  -0.0000] [FIXED]
	x346: [ -0.0000,  -0.0000] [FIXED]
	x347: [ -0.0000,  -0.0000] [FIXED]
	x348: [ -0.0000,  -0.0000] [FIXED]
	x349: [ -0.0000,  -0.0000] [FIXED]
	x350: [ -0.0000,  -0.0000] [FIXED]
	x351: [ -0.0000,  -0.0000] [FIXED]
	x352: [  0.2314,   0.2314] [FIXED]
	x353: [  0.8745,   0.8745] [FIXED]
	x354: [  0.9922,   0.9922] [FIXED]
	x355: [  0.5059,   0.5059] [FIXED]
	x356: [ -0.0000,  -0.0000] [FIXED]
	x357: [ -0.0000,  -0.0000] [FIXED]
	x358: [ -0.0000,  -0.0000] [FIXED]
	x359: [ -0.0000,  -0.0000] [FIXED]
	x360: [ -0.0000,  -0.0000] [FIXED]
	x361: [ -0.0000,  -0.0000] [FIXED]
	x362: [ -0.0000,  -0.0000] [FIXED]
	x363: [ -0.0000,  -0.0000] [FIXED]
	x364: [ -0.0000,  -0.0000] [FIXED]
	x365: [ -0.0000,  -0.0000] [FIXED]
	x366: [ -0.0000,  -0.0000] [FIXED]
	x367: [ -0.0000,  -0.0000] [FIXED]
	x368: [  0.1843,   0.1843] [FIXED]
	x369: [  0.9922,   0.9922] [FIXED]
	x370: [  0.9922,   0.9922] [FIXED]
	x371: [  0.2627,   0.2627] [FIXED]
	x372: [ -0.0000,  -0.0000] [FIXED]
	x373: [ -0.0000,  -0.0000] [FIXED]
	x374: [ -0.0000,  -0.0000] [FIXED]
	x375: [ -0.0000,  -0.0000] [FIXED]
	x376: [ -0.0000,  -0.0000] [FIXED]
	x377: [ -0.0000,  -0.0000] [FIXED]
	x378: [ -0.0000,  -0.0000] [FIXED]
	x379: [ -0.0000,  -0.0000] [FIXED]
	x380: [  0.2000,   0.2000] [FIXED]
	x381: [  0.7373,   0.7373] [FIXED]
	x382: [  0.9922,   0.9922] [FIXED]
	x383: [  0.3333,   0.3333] [FIXED]
	x384: [ -0.0000,  -0.0000] [FIXED]
	x385: [ -0.0000,  -0.0000] [FIXED]
	x386: [ -0.0000,  -0.0000] [FIXED]
	x387: [ -0.0000,  -0.0000] [FIXED]
	x388: [ -0.0000,  -0.0000] [FIXED]
	x389: [ -0.0000,  -0.0000] [FIXED]
	x390: [ -0.0000,  -0.0000] [FIXED]
	x391: [ -0.0000,  -0.0000] [FIXED]
	x392: [ -0.0000,  -0.0000] [FIXED]
	x393: [ -0.0000,  -0.0000] [FIXED]
	x394: [ -0.0000,  -0.0000] [FIXED]
	x395: [ -0.0000,  -0.0000] [FIXED]
	x396: [  0.2706,   0.2706] [FIXED]
	x397: [  0.9922,   0.9922] [FIXED]
	x398: [  0.9922,   0.9922] [FIXED]
	x399: [  0.5765,   0.5765] [FIXED]
	x400: [  0.0196,   0.0196] [FIXED]
	x401: [ -0.0000,   1.0000] 
	x402: [ -0.0000,  -0.0000] [FIXED]
	x403: [ -0.0000,  -0.0000] [FIXED]
	x404: [ -0.0000,  -0.0000] [FIXED]
	x405: [ -0.0000,  -0.0000] [FIXED]
	x406: [ -0.0000,  -0.0000] [FIXED]
	x407: [  0.1843,   0.1843] [FIXED]
	x408: [  0.1490,   0.1490] [FIXED]
	x409: [  0.9373,   0.9373] [FIXED]
	x410: [  0.8039,   0.8039] [FIXED]
	x411: [  0.0392,   0.0392] [FIXED]
	x412: [ -0.0000,  -0.0000] [FIXED]
	x413: [ -0.0000,  -0.0000] [FIXED]
	x414: [ -0.0000,  -0.0000] [FIXED]
	x415: [ -0.0000,  -0.0000] [FIXED]
	x416: [ -0.0000,  -0.0000] [FIXED]
	x417: [ -0.0000,  -0.0000] [FIXED]
	x418: [ -0.0000,   1.0000] 
	x419: [ -0.0000,  -0.0000] [FIXED]
	x420: [ -0.0000,   1.0000] 
	x421: [ -0.0000,  -0.0000] [FIXED]
	x422: [ -0.0000,  -0.0000] [FIXED]
	x423: [ -0.0000,  -0.0000] [FIXED]
	x424: [  0.2667,   0.2667] [FIXED]
	x425: [  0.9922,   0.9922] [FIXED]
	x426: [  0.9922,   0.9922] [FIXED]
	x427: [  0.9922,   0.9922] [FIXED]
	x428: [  0.7686,   0.7686] [FIXED]
	x429: [  0.3882,   0.3882] [FIXED]
	x430: [  0.0471,   0.0471] [FIXED]
	x431: [ -0.0000,  -0.0000] [FIXED]
	x432: [ -0.0000,  -0.0000] [FIXED]
	x433: [  0.2392,   0.2392] [FIXED]
	x434: [  0.2314,   0.2314] [FIXED]
	x435: [  0.7333,   0.7333] [FIXED]
	x436: [  0.8431,   0.8431] [FIXED]
	x437: [  0.9843,   0.9843] [FIXED]
	x438: [  0.6863,   0.6863] [FIXED]
	x439: [ -0.0000,  -0.0000] [FIXED]
	x440: [ -0.0000,  -0.0000] [FIXED]
	x441: [ -0.0000,  -0.0000] [FIXED]
	x442: [ -0.0000,  -0.0000] [FIXED]
	x443: [ -0.0000,  -0.0000] [FIXED]
	x444: [ -0.0000,  -0.0000] [FIXED]
	x445: [ -0.0000,  -0.0000] [FIXED]
	x446: [ -0.0000,  -0.0000] [FIXED]
	x447: [ -0.0000,  -0.0000] [FIXED]
	x448: [ -0.0000,  -0.0000] [FIXED]
	x449: [ -0.0000,  -0.0000] [FIXED]
	x450: [ -0.0000,  -0.0000] [FIXED]
	x451: [ -0.0000,  -0.0000] [FIXED]
	x452: [  0.0039,   0.0039] [FIXED]
	x453: [  0.4863,   0.4863] [FIXED]
	x454: [  0.9882,   0.9882] [FIXED]
	x455: [  0.9922,   0.9922] [FIXED]
	x456: [ -0.0000,   1.0000] 
	x457: [  0.9922,   0.9922] [FIXED]
	x458: [  0.9804,   0.9804] [FIXED]
	x459: [  0.9765,   0.9765] [FIXED]
	x460: [  0.9765,   0.9765] [FIXED]
	x461: [  0.9882,   0.9882] [FIXED]
	x462: [  0.9882,   0.9882] [FIXED]
	x463: [  0.9922,   0.9922] [FIXED]
	x464: [  0.9922,   0.9922] [FIXED]
	x465: [  0.9922,   0.9922] [FIXED]
	x466: [  0.6196,   0.6196] [FIXED]
	x467: [ -0.0000,  -0.0000] [FIXED]
	x468: [ -0.0000,   1.0000] 
	x469: [ -0.0000,  -0.0000] [FIXED]
	x470: [ -0.0000,  -0.0000] [FIXED]
	x471: [ -0.0000,  -0.0000] [FIXED]
	x472: [ -0.0000,  -0.0000] [FIXED]
	x473: [ -0.0000,  -0.0000] [FIXED]
	x474: [ -0.0000,  -0.0000] [FIXED]
	x475: [ -0.0000,  -0.0000] [FIXED]
	x476: [ -0.0000,  -0.0000] [FIXED]
	x477: [ -0.0000,  -0.0000] [FIXED]
	x478: [ -0.0000,  -0.0000] [FIXED]
	x479: [ -0.0000,  -0.0000] [FIXED]
	x480: [ -0.0000,  -0.0000] [FIXED]
	x481: [ -0.0000,  -0.0000] [FIXED]
	x482: [ -0.0000,   1.0000] 
	x483: [  0.7608,   0.7608] [FIXED]
	x484: [  0.9922,   0.9922] [FIXED]
	x485: [  0.9922,   0.9922] [FIXED]
	x486: [  0.9922,   0.9922] [FIXED]
	x487: [  0.9922,   0.9922] [FIXED]
	x488: [  0.9922,   0.9922] [FIXED]
	x489: [  0.9216,   0.9216] [FIXED]
	x490: [  0.7804,   0.7804] [FIXED]
	x491: [  0.9922,   0.9922] [FIXED]
	x492: [  0.9922,   0.9922] [FIXED]
	x493: [  0.6667,   0.6667] [FIXED]
	x494: [  0.1843,   0.1843] [FIXED]
	x495: [ -0.0000,  -0.0000] [FIXED]
	x496: [ -0.0000,  -0.0000] [FIXED]
	x497: [ -0.0000,  -0.0000] [FIXED]
	x498: [ -0.0000,  -0.0000] [FIXED]
	x499: [ -0.0000,  -0.0000] [FIXED]
	x500: [ -0.0000,  -0.0000] [FIXED]
	x501: [ -0.0000,  -0.0000] [FIXED]
	x502: [ -0.0000,  -0.0000] [FIXED]
	x503: [ -0.0000,  -0.0000] [FIXED]
	x504: [ -0.0000,  -0.0000] [FIXED]
	x505: [ -0.0000,  -0.0000] [FIXED]
	x506: [ -0.0000,  -0.0000] [FIXED]
	x507: [ -0.0000,  -0.0000] [FIXED]
	x508: [ -0.0000,  -0.0000] [FIXED]
	x509: [ -0.0000,  -0.0000] [FIXED]
	x510: [ -0.0000,  -0.0000] [FIXED]
	x511: [  0.0196,   0.0196] [FIXED]
	x512: [  0.1020,   0.1020] [FIXED]
	x513: [  0.5804,   0.5804] [FIXED]
	x514: [  0.4902,   0.4902] [FIXED]
	x515: [  0.0588,   0.0588] [FIXED]
	x516: [  0.0588,   0.0588] [FIXED]
	x517: [ -0.0000,   1.0000] 
	x518: [  0.0235,   0.0235] [FIXED]
	x519: [  0.2118,   0.2118] [FIXED]
	x520: [  0.9922,   0.9922] [FIXED]
	x521: [  0.7216,   0.7216] [FIXED]
	x522: [  0.1529,   0.1529] [FIXED]
	x523: [ -0.0000,  -0.0000] [FIXED]
	x524: [ -0.0000,  -0.0000] [FIXED]
	x525: [ -0.0000,  -0.0000] [FIXED]
	x526: [ -0.0000,  -0.0000] [FIXED]
	x527: [ -0.0000,   1.0000] 
	x528: [ -0.0000,  -0.0000] [FIXED]
	x529: [ -0.0000,  -0.0000] [FIXED]
	x530: [ -0.0000,  -0.0000] [FIXED]
	x531: [ -0.0000,  -0.0000] [FIXED]
	x532: [ -0.0000,  -0.0000] [FIXED]
	x533: [ -0.0000,  -0.0000] [FIXED]
	x534: [ -0.0000,  -0.0000] [FIXED]
	x535: [ -0.0000,  -0.0000] [FIXED]
	x536: [ -0.0000,  -0.0000] [FIXED]
	x537: [ -0.0000,  -0.0000] [FIXED]
	x538: [ -0.0000,  -0.0000] [FIXED]
	x539: [ -0.0000,  -0.0000] [FIXED]
	x540: [ -0.0000,  -0.0000] [FIXED]
	x541: [ -0.0000,  -0.0000] [FIXED]
	x542: [ -0.0000,  -0.0000] [FIXED]
	x543: [ -0.0000,  -0.0000] [FIXED]
	x544: [ -0.0000,  -0.0000] [FIXED]
	x545: [ -0.0000,  -0.0000] [FIXED]
	x546: [ -0.0000,  -0.0000] [FIXED]
	x547: [  0.0471,   0.0471] [FIXED]
	x548: [  0.6941,   0.6941] [FIXED]
	x549: [  0.9922,   0.9922] [FIXED]
	x550: [  0.2824,   0.2824] [FIXED]
	x551: [ -0.0000,  -0.0000] [FIXED]
	x552: [ -0.0000,  -0.0000] [FIXED]
	x553: [ -0.0000,  -0.0000] [FIXED]
	x554: [ -0.0000,  -0.0000] [FIXED]
	x555: [ -0.0000,  -0.0000] [FIXED]
	x556: [ -0.0000,  -0.0000] [FIXED]
	x557: [ -0.0000,  -0.0000] [FIXED]
	x558: [ -0.0000,  -0.0000] [FIXED]
	x559: [ -0.0000,  -0.0000] [FIXED]
	x560: [ -0.0000,  -0.0000] [FIXED]
	x561: [ -0.0000,  -0.0000] [FIXED]
	x562: [ -0.0000,  -0.0000] [FIXED]
	x563: [ -0.0000,  -0.0000] [FIXED]
	x564: [ -0.0000,  -0.0000] [FIXED]
	x565: [ -0.0000,  -0.0000] [FIXED]
	x566: [ -0.0000,  -0.0000] [FIXED]
	x567: [ -0.0000,  -0.0000] [FIXED]
	x568: [ -0.0000,  -0.0000] [FIXED]
	x569: [ -0.0000,   1.0000] 
	x570: [ -0.0000,  -0.0000] [FIXED]
	x571: [ -0.0000,  -0.0000] [FIXED]
	x572: [ -0.0000,  -0.0000] [FIXED]
	x573: [ -0.0000,  -0.0000] [FIXED]
	x574: [ -0.0000,  -0.0000] [FIXED]
	x575: [  0.5451,   0.5451] [FIXED]
	x576: [  0.9294,   0.9294] [FIXED]
	x577: [  0.9922,   0.9922] [FIXED]
	x578: [  0.2824,   0.2824] [FIXED]
	x579: [ -0.0000,  -0.0000] [FIXED]
	x580: [ -0.0000,  -0.0000] [FIXED]
	x581: [ -0.0000,  -0.0000] [FIXED]
	x582: [ -0.0000,  -0.0000] [FIXED]
	x583: [ -0.0000,  -0.0000] [FIXED]
	x584: [ -0.0000,  -0.0000] [FIXED]
	x585: [ -0.0000,  -0.0000] [FIXED]
	x586: [ -0.0000,  -0.0000] [FIXED]
	x587: [ -0.0000,  -0.0000] [FIXED]
	x588: [ -0.0000,  -0.0000] [FIXED]
	x589: [ -0.0000,  -0.0000] [FIXED]
	x590: [ -0.0000,  -0.0000] [FIXED]
	x591: [ -0.0000,  -0.0000] [FIXED]
	x592: [ -0.0000,  -0.0000] [FIXED]
	x593: [ -0.0000,  -0.0000] [FIXED]
	x594: [ -0.0000,  -0.0000] [FIXED]
	x595: [ -0.0000,  -0.0000] [FIXED]
	x596: [ -0.0000,  -0.0000] [FIXED]
	x597: [ -0.0000,  -0.0000] [FIXED]
	x598: [ -0.0000,  -0.0000] [FIXED]
	x599: [ -0.0000,  -0.0000] [FIXED]
	x600: [ -0.0000,  -0.0000] [FIXED]
	x601: [ -0.0000,  -0.0000] [FIXED]
	x602: [ -0.0000,  -0.0000] [FIXED]
	x603: [  0.7608,   0.7608] [FIXED]
	x604: [  0.9922,   0.9922] [FIXED]
	x605: [  0.9098,   0.9098] [FIXED]
	x606: [  0.0941,   0.0941] [FIXED]
	x607: [ -0.0000,  -0.0000] [FIXED]
	x608: [ -0.0000,  -0.0000] [FIXED]
	x609: [ -0.0000,  -0.0000] [FIXED]
	x610: [ -0.0000,  -0.0000] [FIXED]
	x611: [ -0.0000,  -0.0000] [FIXED]
	x612: [ -0.0000,  -0.0000] [FIXED]
	x613: [ -0.0000,  -0.0000] [FIXED]
	x614: [ -0.0000,  -0.0000] [FIXED]
	x615: [ -0.0000,  -0.0000] [FIXED]
	x616: [ -0.0000,  -0.0000] [FIXED]
	x617: [ -0.0000,  -0.0000] [FIXED]
	x618: [ -0.0000,   1.0000] 
	x619: [ -0.0000,   1.0000] 
	x620: [ -0.0000,  -0.0000] [FIXED]
	x621: [ -0.0000,  -0.0000] [FIXED]
	x622: [ -0.0000,  -0.0000] [FIXED]
	x623: [ -0.0000,  -0.0000] [FIXED]
	x624: [ -0.0000,  -0.0000] [FIXED]
	x625: [ -0.0000,  -0.0000] [FIXED]
	x626: [ -0.0000,  -0.0000] [FIXED]
	x627: [ -0.0000,  -0.0000] [FIXED]
	x628: [ -0.0000,  -0.0000] [FIXED]
	x629: [ -0.0000,  -0.0000] [FIXED]
	x630: [ -0.0000,  -0.0000] [FIXED]
	x631: [  0.7961,   0.7961] [FIXED]
	x632: [  0.7294,   0.7294] [FIXED]
	x633: [  0.5216,   0.5216] [FIXED]
	x634: [ -0.0000,  -0.0000] [FIXED]
	x635: [ -0.0000,  -0.0000] [FIXED]
	x636: [ -0.0000,  -0.0000] [FIXED]
	x637: [ -0.0000,  -0.0000] [FIXED]
	x638: [ -0.0000,  -0.0000] [FIXED]
	x639: [ -0.0000,  -0.0000] [FIXED]
	x640: [ -0.0000,  -0.0000] [FIXED]
	x641: [ -0.0000,  -0.0000] [FIXED]
	x642: [ -0.0000,  -0.0000] [FIXED]
	x643: [ -0.0000,  -0.0000] [FIXED]
	x644: [ -0.0000,  -0.0000] [FIXED]
	x645: [ -0.0000,  -0.0000] [FIXED]
	x646: [ -0.0000,  -0.0000] [FIXED]
	x647: [ -0.0000,  -0.0000] [FIXED]
	x648: [ -0.0000,  -0.0000] [FIXED]
	x649: [ -0.0000,  -0.0000] [FIXED]
	x650: [ -0.0000,  -0.0000] [FIXED]
	x651: [ -0.0000,  -0.0000] [FIXED]
	x652: [ -0.0000,  -0.0000] [FIXED]
	x653: [ -0.0000,  -0.0000] [FIXED]
	x654: [ -0.0000,  -0.0000] [FIXED]
	x655: [ -0.0000,  -0.0000] [FIXED]
	x656: [ -0.0000,  -0.0000] [FIXED]
	x657: [ -0.0000,  -0.0000] [FIXED]
	x658: [ -0.0000,  -0.0000] [FIXED]
	x659: [  0.9765,   0.9765] [FIXED]
	x660: [  0.6549,   0.6549] [FIXED]
	x661: [  0.3608,   0.3608] [FIXED]
	x662: [ -0.0000,  -0.0000] [FIXED]
	x663: [ -0.0000,   1.0000] 
	x664: [ -0.0000,  -0.0000] [FIXED]
	x665: [ -0.0000,  -0.0000] [FIXED]
	x666: [ -0.0000,  -0.0000] [FIXED]
	x667: [ -0.0000,  -0.0000] [FIXED]
	x668: [ -0.0000,  -0.0000] [FIXED]
	x669: [ -0.0000,  -0.0000] [FIXED]
	x670: [ -0.0000,  -0.0000] [FIXED]
	x671: [ -0.0000,  -0.0000] [FIXED]
	x672: [ -0.0000,  -0.0000] [FIXED]
	x673: [ -0.0000,  -0.0000] [FIXED]
	x674: [ -0.0000,  -0.0000] [FIXED]
	x675: [ -0.0000,  -0.0000] [FIXED]
	x676: [ -0.0000,  -0.0000] [FIXED]
	x677: [ -0.0000,  -0.0000] [FIXED]
	x678: [ -0.0000,  -0.0000] [FIXED]
	x679: [ -0.0000,  -0.0000] [FIXED]
	[runlim] sample:		10.22 time, 10.01 real, 148 MB, 0.94 load
x680: [ -0.0000,  -0.0000] [FIXED]
	x681: [ -0.0000,  -0.0000] [FIXED]
	x682: [ -0.0000,  -0.0000] [FIXED]
	x683: [ -0.0000,  -0.0000] [FIXED]
	x684: [ -0.0000,  -0.0000] [FIXED]
	x685: [ -0.0000,  -0.0000] [FIXED]
	x686: [ -0.0000,  -0.0000] [FIXED]
	x687: [  0.5098,   0.5098] [FIXED]
	x688: [  0.0471,   0.0471] [FIXED]
	x689: [ -0.0000,  -0.0000] [FIXED]
	x690: [ -0.0000,  -0.0000] [FIXED]
	x691: [ -0.0000,  -0.0000] [FIXED]
	x692: [ -0.0000,  -0.0000] [FIXED]
	x693: [ -0.0000,  -0.0000] [FIXED]
	x694: [ -0.0000,  -0.0000] [FIXED]
	x695: [ -0.0000,  -0.0000] [FIXED]
	x696: [ -0.0000,  -0.0000] [FIXED]
	x697: [ -0.0000,  -0.0000] [FIXED]
	x698: [ -0.0000,  -0.0000] [FIXED]
	x699: [ -0.0000,  -0.0000] [FIXED]
	x700: [ -0.0000,  -0.0000] [FIXED]
	x701: [ -0.0000,  -0.0000] [FIXED]
	x702: [ -0.0000,  -0.0000] [FIXED]
	x703: [ -0.0000,  -0.0000] [FIXED]
	x704: [ -0.0000,  -0.0000] [FIXED]
	x705: [ -0.0000,  -0.0000] [FIXED]
	x706: [ -0.0000,  -0.0000] [FIXED]
	x707: [ -0.0000,  -0.0000] [FIXED]
	x708: [ -0.0000,  -0.0000] [FIXED]
	x709: [ -0.0000,  -0.0000] [FIXED]
	x710: [ -0.0000,  -0.0000] [FIXED]
	x711: [ -0.0000,  -0.0000] [FIXED]
	x712: [ -0.0000,  -0.0000] [FIXED]
	x713: [ -0.0000,  -0.0000] [FIXED]
	x714: [ -0.0000,  -0.0000] [FIXED]
	x715: [ -0.0000,  -0.0000] [FIXED]
	x716: [ -0.0000,  -0.0000] [FIXED]
	x717: [ -0.0000,   1.0000] 
	x718: [ -0.0000,  -0.0000] [FIXED]
	x719: [ -0.0000,  -0.0000] [FIXED]
	x720: [ -0.0000,  -0.0000] [FIXED]
	x721: [ -0.0000,  -0.0000] [FIXED]
	x722: [ -0.0000,  -0.0000] [FIXED]
	x723: [ -0.0000,  -0.0000] [FIXED]
	x724: [ -0.0000,  -0.0000] [FIXED]
	x725: [ -0.0000,  -0.0000] [FIXED]
	x726: [ -0.0000,  -0.0000] [FIXED]
	x727: [ -0.0000,  -0.0000] [FIXED]
	x728: [ -0.0000,  -0.0000] [FIXED]
	x729: [ -0.0000,  -0.0000] [FIXED]
	x730: [ -0.0000,  -0.0000] [FIXED]
	x731: [ -0.0000,  -0.0000] [FIXED]
	x732: [ -0.0000,  -0.0000] [FIXED]
	x733: [ -0.0000,  -0.0000] [FIXED]
	x734: [ -0.0000,  -0.0000] [FIXED]
	x735: [ -0.0000,  -0.0000] [FIXED]
	x736: [ -0.0000,  -0.0000] [FIXED]
	x737: [ -0.0000,  -0.0000] [FIXED]
	x738: [ -0.0000,  -0.0000] [FIXED]
	x739: [ -0.0000,  -0.0000] [FIXED]
	x740: [ -0.0000,  -0.0000] [FIXED]
	x741: [ -0.0000,  -0.0000] [FIXED]
	x742: [ -0.0000,  -0.0000] [FIXED]
	x743: [ -0.0000,  -0.0000] [FIXED]
	x744: [ -0.0000,  -0.0000] [FIXED]
	x745: [ -0.0000,  -0.0000] [FIXED]
	x746: [ -0.0000,  -0.0000] [FIXED]
	x747: [ -0.0000,   1.0000] 
	x748: [ -0.0000,  -0.0000] [FIXED]
	x749: [ -0.0000,  -0.0000] [FIXED]
	x750: [ -0.0000,  -0.0000] [FIXED]
	x751: [ -0.0000,  -0.0000] [FIXED]
	x752: [ -0.0000,  -0.0000] [FIXED]
	x753: [ -0.0000,  -0.0000] [FIXED]
	x754: [ -0.0000,  -0.0000] [FIXED]
	x755: [ -0.0000,  -0.0000] [FIXED]
	x756: [ -0.0000,  -0.0000] [FIXED]
	x757: [ -0.0000,  -0.0000] [FIXED]
	x758: [ -0.0000,  -0.0000] [FIXED]
	x759: [ -0.0000,  -0.0000] [FIXED]
	x760: [ -0.0000,  -0.0000] [FIXED]
	x761: [ -0.0000,  -0.0000] [FIXED]
	x762: [ -0.0000,  -0.0000] [FIXED]
	x763: [ -0.0000,  -0.0000] [FIXED]
	x764: [ -0.0000,  -0.0000] [FIXED]
	x765: [ -0.0000,  -0.0000] [FIXED]
	x766: [ -0.0000,  -0.0000] [FIXED]
	x767: [ -0.0000,  -0.0000] [FIXED]
	x768: [ -0.0000,  -0.0000] [FIXED]
	x769: [ -0.0000,  -0.0000] [FIXED]
	x770: [ -0.0000,  -0.0000] [FIXED]
	x771: [ -0.0000,  -0.0000] [FIXED]
	x772: [ -0.0000,  -0.0000] [FIXED]
	x773: [ -0.0000,  -0.0000] [FIXED]
	x774: [ -0.0000,  -0.0000] [FIXED]
	x775: [ -0.0000,  -0.0000] [FIXED]
	x776: [ -0.0000,  -0.0000] [FIXED]
	x777: [ -0.0000,  -0.0000] [FIXED]
	x778: [ -0.0000,  -0.0000] [FIXED]
	x779: [ -0.0000,  -0.0000] [FIXED]
	x780: [ -0.0000,  -0.0000] [FIXED]
	x781: [ -0.0000,  -0.0000] [FIXED]
	x782: [ -0.0000,  -0.0000] [FIXED]
	x783: [ -0.0000,  -0.0000] [FIXED]

Branching heuristics set to PseudoImpact

Engine::solve: Initial statistics

01:48:42 Statistics update:
	--- Time Statistics ---
	Total time elapsed: 6903 milli (00:00:06)
		Main loop: 0 milli (00:00:00)
		Preprocessing time: 283 milli (00:00:00)
		Unknown: 6620 milli (00:00:06)
	Breakdown for main loop:
		[0.00%] Simplex steps: 0 milli
		[0.00%] Explicit-basis bound tightening: 0 milli
		[0.00%] Constraint-matrix bound tightening: 0 milli
		[0.00%] Degradation checking: 0 milli
		[0.00%] Precision restoration: 0 milli
		[0.00%] Statistics handling: 0 milli
		[0.00%] Constraint-fixing steps: 0 milli
		[0.00%] Valid case splits: 0 milli. Average per split: 0.00 milli
		[0.00%] Applying stored bound-tightening: 0 milli
		[0.00%] SMT core: 0 milli
		[0.00%] Symbolic Bound Tightening: 25 milli
		[0.00%] SoI-based local search: 0 milli
		[0.00%] SoI-based local search: 0 milli
		[0.00%] Unaccounted for: 0 milli
	--- Preprocessor Statistics ---
	Number of preprocessor bound-tightening loop iterations: 5
	Number of eliminated variables: 922
	Number of constraints removed due to variable elimination: 122
	Number of equations removed due to variable elimination: 0
	--- Engine Statistics ---
	Number of main loop iterations: 1
		0 iterations were simplex steps. Total time: 0 milli. Average: 0.00 milli.
		0 iterations were constraint-fixing steps. Total time: 0 milli. Average: 0.00 milli
	Number of active piecewise-linear constraints: 221 / 299
		Constraints disabled by valid splits: 78. By SMT-originated splits: 0
	Last reported degradation: 0.0000000000. Max degradation so far: 0.0000000000. Restorations so far: 0
	Number of simplex pivots we attempted to skip because of instability: 0.
	Unstable pivots performed anyway: 0
	--- Tableau Statistics ---
	Total number of pivots performed: 0
		Real pivots: 0. Degenerate: 0 (0.00%)
		Degenerate pivots by request (e.g., to fix a PL constraint): 0 (0.00%)
		Average time per pivot: 0.00 milli
	Total number of fake pivots performed: 0
	Total number of rows added: 0. Number of merged columns: 0
	Current tableau dimensions: M = 830, N = 2742
	--- SMT Core Statistics ---
	Total depth is 0. Total visited states: 1. Number of splits: 0. Number of pops: 0
	Max stack depth: 0
	--- Bound Tightening Statistics ---
	Number of tightened bounds: 0.
		Number of rows examined by row tightener: 0. Consequent tightenings: 0
		Number of explicit basis matrices examined by row tightener: 0. Consequent tightenings: 0
		Number of bound tightening rounds on the entire constraint matrix: 0. Consequent tightenings: 0
		Number of bound notifications sent to PL constraints: 1808. Tightenings proposed: 0
	--- Basis Factorization statistics ---
	Number of basis refactorizations: 2
	--- Projected Steepest Edge Statistics ---
	Number of iterations: 0.
	Number of resets to reference space: 1. Avg. iterations per reset: 0
	--- SBT ---
	Number of tightened bounds: 704
	--- SoI-based local search ---
	Number of proposed phase pattern update: 0. Number of accepted update: 0 [0.00%]
	Total time (% of local search time) updating SoI phase pattern : 0 milli [0.00%]
	Total time obtaining current assignment: 0 milli [0.00%]
	Total time getting SoI phase pattern : 0 milli [0.00%]
	--- Context dependent statistics ---
	Number of pushes / pops: 0 / 0
		[0.00%] Pre-Push hook: 0 milli
		[0.00%] Push : 0 milli
		[0.00%] Post-Pop hook: 0 milli
		[0.00%] Pop : 0 milli
		[0.00%] Total context-switching time: 0 milli
	--- Proof Certificate ---
	Number of certified leaves: 0
	Number of leaves to delegate: 0

---

01:48:52 Statistics update:
	--- Time Statistics ---
	Total time elapsed: 16776 milli (00:00:16)
		Main loop: 9811 milli (00:00:09)
		Preprocessing time: 283 milli (00:00:00)
		Unknown: 6681 milli (00:00:06)
	Breakdown for main loop:
		[41.20%] Simplex steps: 4042 milli
		[25.79%] Explicit-basis bound tightening: 2530 milli
		[0.00%] Constraint-matrix bound tightening: 0 milli
		[0.54%] Degradation checking: 52 milli
		[0.00%] Precision restoration: 0 milli
		[0.21%] Statistics handling: 20 milli
		[0.00%] Constraint-fixing steps: 0 milli
		[0.05%] Valid case splits: 4 milli. Average per split: 0.00 milli
		[0.05%] Applying stored bound-tightening: 4 milli
		[2.93%] SMT core: 287 milli
		[22.97%] Symbolic Bound Tightening: 2254 milli
		[33.57%] SoI-based local search: 3293 milli
		[0.00%] SoI-based local search: 0 milli
		[6.26%] Unaccounted for: 614 milli
	--- Preprocessor Statistics ---[runlim] sample:		20.22 time, 20.01 real, 148 MB, 0.95 load
[runlim] sample:		30.22 time, 30.01 real, 157 MB, 0.96 load

	Number of preprocessor bound-tightening loop iterations: 5
	Number of eliminated variables: 922
	Number of constraints removed due to variable elimination: 122
	Number of equations removed due to variable elimination: 0
	--- Engine Statistics ---
	Number of main loop iterations: 10000
		9788 iterations were simplex steps. Total time: 4042 milli. Average: 0.41 milli.
		0 iterations were constraint-fixing steps. Total time: 0 milli. Average: 0.00 milli
	Number of active piecewise-linear constraints: 203 / 299
		Constraints disabled by valid splits: 84. By SMT-originated splits: 12
	Last reported degradation: 0.0000000000. Max degradation so far: 0.0000000043. Restorations so far: 0
	Number of simplex pivots we attempted to skip because of instability: 12.
	Unstable pivots performed anyway: 2
	--- Tableau Statistics ---
	Total number of pivots performed: 7518
		Real pivots: 7501. Degenerate: 17 (0.23%)
		Degenerate pivots by request (e.g., to fix a PL constraint): 0 (0.00%)
		Average time per pivot: 0.10 milli
	Total number of fake pivots performed: 298
	Total number of rows added: 0. Number of merged columns: 0
	Current tableau dimensions: M = 830, N = 2742
	--- SMT Core Statistics ---
	Total depth is 12. Total visited states: 139. Number of splits: 74. Number of pops: 64
	Max stack depth: 18
	--- Bound Tightening Statistics ---
	Number of tightened bounds: 15198.
		Number of rows examined by row tightener: 7518. Consequent tightenings: 182
		Number of explicit basis matrices examined by row tightener: 37. Consequent tightenings: 814
		Number of bound tightening rounds on the entire constraint matrix: 0. Consequent tightenings: 0
		Number of bound notifications sent to PL constraints: 27790. Tightenings proposed: 0
	--- Basis Factorization statistics ---
	Number of basis refactorizations: 66
	--- Projected Steepest Edge Statistics ---
	Number of iterations: 7826.
	Number of resets to reference space: 66. Avg. iterations per reset: 118
	--- SBT ---
	Number of tightened bounds: 15902
	--- SoI-based local search ---
	Number of proposed phase pattern update: 985. Number of accepted update: 919 [93.30%]
	Total time (% of local search time) updating SoI phase pattern : 47600 milli [1.45%]
	Total time obtaining current assignment: 338715 milli [10.28%]
	Total time getting SoI phase pattern : 89603 milli [0.91%]
	--- Context dependent statistics ---
	Number of pushes / pops: 138 / 126
		[0.12%] Pre-Push hook: 11 milli
		[0.00%] Push : 0 milli
		[0.12%] Post-Pop hook: 11 milli
		[0.13%] Pop : 12 milli
		[0.36%] Total context-switching time: 35 milli
	--- Proof Certificate ---
	Number of certified leaves: 0
	Number of leaves to delegate: 0

01:48:59 Statistics update:
	--- Time Statistics ---
	Total time elapsed: 23816 milli (00:00:23)
		Main loop: 16834 milli (00:00:16)
		Preprocessing time: 283 milli (00:00:00)
		Unknown: 6699 milli (00:00:06)
	Breakdown for main loop:
		[50.76%] Simplex steps: 8544 milli
		[17.50%] Explicit-basis bound tightening: 2945 milli
		[0.00%] Constraint-matrix bound tightening: 0 milli
		[0.63%] Degradation checking: 105 milli
		[0.00%] Precision restoration: 0 milli
		[0.24%] Statistics handling: 40 milli
		[0.00%] Constraint-fixing steps: 0 milli
		[0.04%] Valid case splits: 6 milli. Average per split: 0.00 milli
		[0.05%] Applying stored bound-tightening: 9 milli
		[2.68%] SMT core: 451 milli
		[21.42%] Symbolic Bound Tightening: 3606 milli
		[46.34%] SoI-based local search: 7801 milli
		[0.00%] SoI-based local search: 0 milli
		[6.67%] Unaccounted for: 1123 milli
	--- Preprocessor Statistics ---
	Number of preprocessor bound-tightening loop iterations: 5
	Number of eliminated variables: 922
	Number of constraints removed due to variable elimination: 122
	Number of equations removed due to variable elimination: 0
	--- Engine Statistics ---
	Number of main loop iterations: 20000
		19649 iterations were simplex steps. Total time: 8544 milli. Average: 0.43 milli.
		0 iterations were constraint-fixing steps. Total time: 0 milli. Average: 0.00 milli
	Number of active piecewise-linear constraints: 185 / 299
		Constraints disabled by valid splits: 83. By SMT-originated splits: 31
	Last reported degradation: 0.0000000000. Max degradation so far: 0.0000000043. Restorations so far: 0
	Number of simplex pivots we attempted to skip because of instability: 31.
	Unstable pivots performed anyway: 3
	--- Tableau Statistics ---
	Total number of pivots performed: 15574
		Real pivots: 15553. Degenerate: 21 (0.13%)
		Degenerate pivots by request (e.g., to fix a PL constraint): 0 (0.00%)
		Average time per pivot: 0.11 milli
	Total number of fake pivots performed: 502
	Total number of rows added: 0. Number of merged columns: 0
	Current tableau dimensions: M = 830, N = 2742
	--- SMT Core Statistics ---
	Total depth is 31. Total visited states: 225. Number of splits: 125. Number of pops: 99
	Max stack depth: 36
	--- Bound Tightening Statistics ---
	Number of tightened bounds: 25751.
		Number of rows examined by row tightener: 15574. Consequent tightenings: 197
		Number of explicit basis matrices examined by row tightener: 43. Consequent tightenings: 839
		Number of bound tightening rounds on the entire constraint matrix: 0. Consequent tightenings: 0
		Number of bound notifications sent to PL constraints: 41227. Tightenings proposed: 0
	--- Basis Factorization statistics ---
	Number of basis refactorizations: 138
	--- Projected Steepest Edge Statistics ---
	Number of iterations: 16104.
	Number of resets to reference space: 107. Avg. iterations per reset: 150
	--- SBT ---
	Number of tightened bounds: 26455
	--- SoI-based local search ---
	Number of proposed phase pattern update: 1771. Number of accepted update: 1654 [93.39%]
	Total time (% of local search time) updating SoI phase pattern : 81142 milli [1.04%]
	Total time obtaining current assignment: 627477 milli [8.04%]
	Total time getting SoI phase pattern : 160771 milli [0.95%]
	--- Context dependent statistics ---
	Number of pushes / pops: 224 / 193
		[0.12%] Pre-Push hook: 19 milli
		[0.00%] Push : 0 milli
		[0.11%] Post-Pop hook: 18 milli
		[0.11%] Pop : 18 milli
		[0.34%] Total context-switching time: 57 milli
	--- Proof Certificate ---
	Number of certified leaves: 0
	Number of leaves to delegate: 0

01:49:10 Statistics update:
	--- Time Statistics ---
	Total time elapsed: 34782 milli (00:00:34)
		Main loop: 27875 milli (00:00:27)
		Preprocessing time: 283 milli (00:00:00)
		Unknown: 6623 milli (00:00:06)
	Breakdown for main loop:
		[46.90%] Simplex steps: 13072 milli
		[19.63%] Explicit-basis bound tightening: 5472 milli
		[0.00%] Constraint-matrix bound tightening: 0 milli
		[0.58%] Degradation checking: 160 milli
		[0.00%] Precision restoration: 0 milli
		[0.22%] Statistics handling: 62 milli
		[0.00%] Constraint-fixing steps: 0 milli
		[0.04%] Valid case splits: 11 milli. Average per split: 0.00 milli
		[0.05%] Applying stored bound-tightening: 13 milli
		[3.00%] SMT core: 835 milli
		[22.65%] Symbolic Bound Tightening: 6313 milli
		[42.49%] SoI-based local search: 11843 milli
		[0.00%] SoI-based local search: 0 milli
		[6.94%] Unaccounted for: 1933 milli
	--- Preprocessor Statistics ---
	Number of preprocessor bound-tightening loop iterations: 5
	Number of eliminated variables: 922
	Number of constraints removed due to variable elimination: 122
	Number of equations removed due to variable elimination: 0
	--- Engine Statistics ---
	Number of main loop iterations: 30000
		29426 iterations were simplex steps. Total time: 13072 milli. Average: 0.44 milli.
		0 iterations were constraint-fixing steps. Total time: 0 milli. Average: 0.00 milli
	Number of active piecewise-linear constraints: 205 / 299
		Constraints disabled by valid splits: 80. By SMT-originated splits: 14
	Last reported degradation: 0.0000000000. Max degradation so far: 0.0000000861. Restorations so far: 0
	Number of simplex pivots we attempted to skip because of instability: 77.
	Unstable pivots performed anyway: 4
	--- Tableau Statistics ---
	Total number of pivots performed: 23219
		Real pivots: 23183. Degenerate: 36 (0.16%)
		Degenerate pivots by request (e.g., to fix a PL constraint): 0 (0.00%)
		Average time per p[runlim] sample:		40.21 time, 40.01 real, 157 MB, 0.97 load
ivot: 0.11 milli
	Total number of fake pivots performed: 807
	Total number of rows added: 0. Number of merged columns: 0
	Current tableau dimensions: M = 830, N = 2742
	--- SMT Core Statistics ---
	Total depth is 14. Total visited states: 376. Number of splits: 192. Number of pops: 183
	Max stack depth: 36
	--- Bound Tightening Statistics ---
	Number of tightened bounds: 44924.
		Number of rows examined by row tightener: 23219. Consequent tightenings: 280
		Number of explicit basis matrices examined by row tightener: 81. Consequent tightenings: 1292
		Number of bound tightening rounds on the entire constraint matrix: 0. Consequent tightenings: 0
		Number of bound notifications sent to PL constraints: 67736. Tightenings proposed: 0
	--- Basis Factorization statistics ---
	Number of basis refactorizations: 205
	--- Projected Steepest Edge Statistics ---
	Number of iterations: 24099.
	Number of resets to reference space: 192. Avg. iterations per reset: 125
	--- SBT ---
	Number of tightened bounds: 45628
	--- SoI-based local search ---
	Number of proposed phase pattern update: 2630. Number of accepted update: 2447 [93.04%]
	Total time (% of local search time) updating SoI phase pattern : 125670 milli [1.06%]
	Total time obtaining current assignment: 962351 milli [8.13%]
	Total time getting SoI phase pattern : 237735 milli [0.85%]
	--- Context dependent statistics ---
	Number of pushes / pops: 375 / 361
		[0.12%] Pre-Push hook: 32 milli
		[0.00%] Push : 0 milli
		[0.13%] Post-Pop hook: 36 milli
		[0.14%] Pop : 38 milli
		[0.39%] Total context-switching time: 107 milli
	--- Proof Certificate ---
	Number of certified leaves: 0
	Number of leaves to delegate: 0

01:49:17 Statistics update:
	--- Time Statistics ---
	Total time elapsed: 41887 milli (00:00:41)
		Main loop: 34801 milli (00:00:34)
		Preprocessing time: 283 milli (00:00:00)
		Unknown: 6803 milli (00:00:06)
	Breakdown for main loop:
		[53.11%] Simplex steps: 18482 milli
		[16.55%] Explicit-basis bound tightening: 5758 milli
		[0.00%] Constraint-matrix bound tightening: 0 milli
		[0.62%] Degradation checking: 215 milli
		[0.00%] Precision restoration: 0 milli
		[0.24%] Statistics handling: 82 milli
		[0.00%] Constraint-fixing steps: 0 milli
		[0.04%] Valid case splits: 13 milli. Average per split: 0.00 milli
		[0.05%] Applying stored bound-tightening: 18 milli
		[2.62%] SMT core: 911 milli
		[20.43%] Symbolic Bound Tightening: 7111 milli
		[49.32%] SoI-based local search: 17165 milli
		[0.00%] SoI-based local search: 0 milli
		[6.35%] Unaccounted for: 2208 milli
	--- Preprocessor Statistics ---
	Number of preprocessor bound-tightening loop iterations: 5
	Number of eliminated variables: 922
	Number of constraints removed due to variable elimination: 122
	Number of equations removed due to variable elimination: 0
	--- Engine Statistics ---
	Number of main loop iterations: 40000
		39318 iterations were simplex steps. Total time: 18482 milli. Average: 0.47 milli.
		0 iterations were constraint-fixing steps. Total time: 0 milli. Average: 0.00 milli
	Number of active piecewise-linear constraints: 172 / 299
		Constraints disabled by valid splits: 83. By SMT-originated splits: 44
	Last reported degradation: 0.0000000000. Max degradation so far: 0.0000000861. Restorations so far: 0
	Number of simplex pivots we attempted to skip because of instability: 168.
	Unstable pivots performed anyway: 9
	--- Tableau Statistics ---
	Total number of pivots performed: 31862
		Real pivots: 31822. Degenerate: 40 (0.13%)
		Degenerate pivots by request (e.g., to fix a PL constraint): 0 (0.00%)
		Average time per pivot: 0.13 milli
	Total number of fake pivots performed: 903
	Total number of rows added: 0. Number of merged columns: 0
	Current tableau dimensions: M = 830, N = 2742
	--- SMT Core Statistics ---
	Total depth is 44. Total visited states: 437. Number of splits: 238. Number of pops: 198
	Max stack depth: 44
	--- Bound Tightening Statistics ---
	Number of tightened bounds: 50598.
		Number of rows examined by row tightener: 31862. Consequent tightenings: 284
		Number of explicit basis matrices examined by row tightener: 85. Consequent tightenings: 1306
		Number of bound tightening rounds on the entire constraint matrix: 0. Consequent tightenings: 0
		Number of bound notifications sent to PL constraints: 74500. Tightenings proposed: 0
	--- Basis Factorization statistics ---
	Number of basis refactorizations: 287
	--- Projected Steepest Edge Statistics ---
	Number of iterations: 32924.
	Number of resets to reference space: 218. Avg. iterations per reset: 151
	--- SBT ---
	Number of tightened bounds: 51302
	--- SoI-based local search ---
	Number of proposed phase pattern update: 3163. Number of accepted update: 2934 [92.76%]
	Total time (% of local search time) updating SoI phase pattern : 154522 milli [0.90%]
	Total time obtaining current assignment: 1178853 milli [6.87%]
	Total time getting SoI phase pattern : 287369 milli [0.83%]
	--- Context dependent statistics ---
	Number of pushes / pops: 436 / 392
		[0.11%] Pre-Push hook: 38 milli
		[0.00%] Push : 0 milli
		[0.11%] Post-Pop hook: 39 milli
		[0.12%] Pop : 41 milli
		[0.34%] Total context-switching time: 119 milli
	--- Proof Certificate ---
	Number of certified leaves: 0
	Number of leaves to delegate: 0

01:49:24 Statistics update:
	--- Time Statistics ---
	Total time elapsed: 49211 milli (00:00:49)
		Main loop: 42233 milli (00:00:42)
		Preprocessing time: 283 milli (00:00:00)
		Unknown: 6694 milli (00:00:06)
	Breakdown for main loop:
		[57.75%] Simplex steps: 24390 milli
		[13.98%] Explicit-basis bound tightening: 5902 milli
		[0.00%] Constraint-matrix bound tightening: 0 milli
		[0.64%] Degradation checking: 270 milli
		[0.00%] Precision restoration: 0 milli
		[0.25%] Statistics handling: 104 milli
		[0.00%] Constraint-fixing steps: 0 milli
		[0.03%] Valid case splits: 14 milli. Average per split: 0.00 milli
		[0.06%] Applying stored bound-tightening: 23 milli
		[2.20%] SMT core: 928 milli
		[18.50%] Symbolic Bound Tightening: 7813 milli
		[54.21%] SoI-based local search: 22896 milli
		[0.00%] SoI-based local search: 0 milli
		[6.60%] Unaccounted for: 2785 milli
	--- Preprocessor Statistics ---
	Number of preprocessor bound-tightening loop iterations: 5
	Number of eliminated variables: 922
	Number of constraints removed due to variable elimination: 122
	Number of equations removed due to variable elimination: 0
	--- Engine Statistics ---
	Number of main loop iterations: 50000
		49214 iterations were simplex steps. Total time: 24390 milli. Average: 0.50 milli.
		0 iterations were constraint-fixing steps. Total time: 0 milli. Average: 0.00 milli
	Number of active piecewise-linear constraints: 111 / 299
		Constraints disabled by valid splits: 92. By SMT-originated splits: 96
	Last reported degradation: 0.0000000000. Max degradation so far: 0.0000000861. Restorations so far: 0
	Number of simplex pivots we attempted to skip because of instability: 188.
	Unstable pivots performed anyway: 14
	--- Tableau Statistics ---
	Total number of pivots performed: 40502
		Real pivots: 40460. Degenerate: 42 (0.10%)
		Degenerate pivots by request (e.g., to fix a PL constraint): 0 (0.00%)
		Average time per pivot: 0.14 milli
	Total number of fake pivots performed: 975
	Total number of rows added: 0. Number of merged columns: 0
	Current tableau dimensions: M = 830, N = 2742
	--- SMT Core Statistics ---
	Total depth is 96. Total visited states: 489. Number of splits: 290. Number of pops: 198
	Max stack depth: 96
	--- Bound Tightening Statistics ---
	Number of tightened bounds: 54484.
		Number of rows examined by row tightener: 40502. Consequent tightenings: 284
		Number of explicit basis matrices examined by row tightener: 87. Consequent tightenings: 1309
		Number of bound tightening rounds on the entire constraint matrix: 0. Consequent tightenings: 0
		Number of bound notifications sent to PL constraints: 79237. Tightenings proposed: 0
	--- Basis Factorization statistics ---
	Number of basis refactorizations: 370
	--- Projected Steepest Edge Statistics ---
	Number of iterations: 41651.
	Number of resets to reference space: 227. Avg. iterations per reset: 183
	--- SBT ---
	N[runlim] sample:		50.21 time, 50.01 real, 182 MB, 0.97 load
[runlim] sample:		60.21 time, 60.01 real, 214 MB, 1.05 load
[runlim] sample:		70.21 time, 70.01 real, 214 MB, 1.04 load
[runlim] sample:		80.20 time, 80.01 real, 214 MB, 1.04 load
umber of tightened bounds: 55188
	--- SoI-based local search ---
	Number of proposed phase pattern update: 3706. Number of accepted update: 3425 [92.42%]
	Total time (% of local search time) updating SoI phase pattern : 185845 milli [0.81%]
	Total time obtaining current assignment: 1414557 milli [6.18%]
	Total time getting SoI phase pattern : 324407 milli [0.77%]
	--- Context dependent statistics ---
	Number of pushes / pops: 488 / 392
		[0.11%] Pre-Push hook: 47 milli
		[0.00%] Push : 0 milli
		[0.09%] Post-Pop hook: 39 milli
		[0.10%] Pop : 41 milli
		[0.30%] Total context-switching time: 127 milli
	--- Proof Certificate ---
	Number of certified leaves: 0
	Number of leaves to delegate: 0

01:49:32 Statistics update:
	--- Time Statistics ---
	Total time elapsed: 57345 milli (00:00:57)
		Main loop: 50408 milli (00:00:50)
		Preprocessing time: 283 milli (00:00:00)
		Unknown: 6654 milli (00:00:06)
	Breakdown for main loop:
		[59.84%] Simplex steps: 30161 milli
		[13.21%] Explicit-basis bound tightening: 6657 milli
		[0.00%] Constraint-matrix bound tightening: 0 milli
		[0.65%] Degradation checking: 326 milli
		[0.00%] Precision restoration: 0 milli
		[0.25%] Statistics handling: 125 milli
		[0.00%] Constraint-fixing steps: 0 milli
		[0.03%] Valid case splits: 15 milli. Average per split: 0.00 milli
		[0.06%] Applying stored bound-tightening: 28 milli
		[1.99%] SMT core: 1002 milli
		[17.42%] Symbolic Bound Tightening: 8779 milli
		[55.83%] SoI-based local search: 28143 milli
		[0.00%] SoI-based local search: 0 milli
		[6.57%] Unaccounted for: 3309 milli
	--- Preprocessor Statistics ---
	Number of preprocessor bound-tightening loop iterations: 5
	Number of eliminated variables: 922
	Number of constraints removed due to variable elimination: 122
	Number of equations removed due to variable elimination: 0
	--- Engine Statistics ---
	Number of main loop iterations: 60000
		59094 iterations were simplex steps. Total time: 30161 milli. Average: 0.51 milli.
		0 iterations were constraint-fixing steps. Total time: 0 milli. Average: 0.00 milli
	Number of active piecewise-linear constraints: 60 / 299
		Constraints disabled by valid splits: 97. By SMT-originated splits: 142
	Last reported degradation: 0.0000000000. Max degradation so far: 0.0000000861. Restorations so far: 0
	Number of simplex pivots we attempted to skip because of instability: 229.
	Unstable pivots performed anyway: 17
	--- Tableau Statistics ---
	Total number of pivots performed: 48675
		Real pivots: 48630. Degenerate: 45 (0.09%)
		Degenerate pivots by request (e.g., to fix a PL constraint): 0 (0.00%)
		Average time per pivot: 0.15 milli
	Total number of fake pivots performed: 1129
	Total number of rows added: 0. Number of merged columns: 0
	Current tableau dimensions: M = 830, N = 2742
	--- SMT Core Statistics ---
	Total depth is 142. Total visited states: 559. Number of splits: 347. Number of pops: 211
	Max stack depth: 149
	--- Bound Tightening Statistics ---
	Number of tightened bounds: 61383.
		Number of rows examined by row tightener: 48675. Consequent tightenings: 442
		Number of explicit basis matrices examined by row tightener: 97. Consequent tightenings: 1386
		Number of bound tightening rounds on the entire constraint matrix: 0. Consequent tightenings: 0
		Number of bound notifications sent to PL constraints: 89996. Tightenings proposed: 0
	--- Basis Factorization statistics ---
	Number of basis refactorizations: 447
	--- Projected Steepest Edge Statistics ---
	Number of iterations: 50016.
	Number of resets to reference space: 247. Avg. iterations per reset: 202
	--- SBT ---
	Number of tightened bounds: 62087
	--- SoI-based local search ---
	Number of proposed phase pattern update: 4430. Number of accepted update: 4092 [92.37%]
	Total time (% of local search time) updating SoI phase pattern : 218158 milli [0.78%]
	Total time obtaining current assignment: 1715333 milli [6.09%]
	Total time getting SoI phase pattern : 351402 milli [0.70%]
	--- Context dependent statistics ---
	Number of pushes / pops: 558 / 416
		[0.11%] Pre-Push hook: 57 milli
		[0.00%] Push : 0 milli
		[0.08%] Post-Pop hook: 41 milli
		[0.09%] Pop : 42 milli
		[0.28%] Total context-switching time: 141 milli
	--- Proof Certificate ---
	Number of certified leaves: 0
	Number of leaves to delegate: 0

01:49:43 Statistics update:
	--- Time Statistics ---
	Total time elapsed: 67723 milli (00:01:07)
		Main loop: 60641 milli (00:01:00)
		Preprocessing time: 283 milli (00:00:00)
		Unknown: 6799 milli (00:00:06)
	Breakdown for main loop:
		[58.18%] Simplex steps: 35281 milli
		[14.77%] Explicit-basis bound tightening: 8956 milli
		[0.00%] Constraint-matrix bound tightening: 0 milli
		[0.63%] Degradation checking: 383 milli
		[0.00%] Precision restoration: 0 milli
		[0.24%] Statistics handling: 145 milli
		[0.00%] Constraint-fixing steps: 0 milli
		[0.03%] Valid case splits: 18 milli. Average per split: 0.00 milli
		[0.06%] Applying stored bound-tightening: 34 milli
		[2.07%] SMT core: 1256 milli
		[17.50%] Symbolic Bound Tightening: 10613 milli
		[54.15%] SoI-based local search: 32835 milli
		[0.00%] SoI-based local search: 0 milli
		[6.51%] Unaccounted for: 3950 milli
	--- Preprocessor Statistics ---
	Number of preprocessor bound-tightening loop iterations: 5
	Number of eliminated variables: 922
	Number of constraints removed due to variable elimination: 122
	Number of equations removed due to variable elimination: 0
	--- Engine Statistics ---
	Number of main loop iterations: 70000
		68933 iterations were simplex steps. Total time: 35281 milli. Average: 0.51 milli.
		0 iterations were constraint-fixing steps. Total time: 0 milli. Average: 0.00 milli
	Number of active piecewise-linear constraints: 50 / 299
		Constraints disabled by valid splits: 98. By SMT-originated splits: 151
	Last reported degradation: 0.0000000000. Max degradation so far: 0.0000000861. Restorations so far: 0
	Number of simplex pivots we attempted to skip because of instability: 281.
	Unstable pivots performed anyway: 18
	--- Tableau Statistics ---
	Total number of pivots performed: 55763
		Real pivots: 55713. Degenerate: 50 (0.09%)
		Degenerate pivots by request (e.g., to fix a PL constraint): 0 (0.00%)
		Average time per pivot: 0.15 milli
	Total number of fake pivots performed: 1396
	Total number of rows added: 0. Number of merged columns: 0
	Current tableau dimensions: M = 830, N = 2742
	--- SMT Core Statistics ---
	Total depth is 151. Total visited states: 681. Number of splits: 413. Number of pops: 267
	Max stack depth: 157
	--- Bound Tightening Statistics ---
	Number of tightened bounds: 73017.
		Number of rows examined by row tightener: 55763. Consequent tightenings: 1321
		Number of explicit basis matrices examined by row tightener: 129. Consequent tightenings: 2230
		Number of bound tightening rounds on the entire constraint matrix: 0. Consequent tightenings: 0
		Number of bound notifications sent to PL constraints: 108750. Tightenings proposed: 0
	--- Basis Factorization statistics ---
	Number of basis refactorizations: 506
	--- Projected Steepest Edge Statistics ---
	Number of iterations: 57422.
	Number of resets to reference space: 306. Avg. iterations per reset: 187
	--- SBT ---
	Number of tightened bounds: 73721
	--- SoI-based local search ---
	Number of proposed phase pattern update: 5664. Number of accepted update: 5258 [92.83%]
	Total time (% of local search time) updating SoI phase pattern : 254684 milli [0.78%]
	Total time obtaining current assignment: 2201311 milli [6.70%]
	Total time getting SoI phase pattern : 380174 milli [0.63%]
	--- Context dependent statistics ---
	Number of pushes / pops: 680 / 529
		[0.11%] Pre-Push hook: 66 milli
		[0.00%] Push : 0 milli
		[0.08%] Post-Pop hook: 50 milli
		[0.09%] Pop : 53 milli
		[0.28%] Total context-switching time: 170 milli
	--- Proof Certificate ---
	Number of certified leaves: 0
	Number of leaves to delegate: 0

01:49:55 Statistics update:
	--- Time Statistics ---
	Total time elapsed: 79975 milli (00:01:19)
		Main loop: 73015 milli (00:01:13)
		Preprocessing time: 283 milli (00:00:00)
		Unknown: 6676 milli (00:00:06)
	Breakdown for main loop:
		[56.10%] Simplex steps: 40962 m[runlim] sample:		90.20 time, 90.01 real, 214 MB, 1.03 load
[runlim] sample:		100.21 time, 100.01 real, 214 MB, 1.02 load
illi
		[16.97%] Explicit-basis bound tightening: 12387 milli
		[0.00%] Constraint-matrix bound tightening: 0 milli
		[0.60%] Degradation checking: 441 milli
		[0.00%] Precision restoration: 0 milli
		[0.23%] Statistics handling: 167 milli
		[0.00%] Constraint-fixing steps: 0 milli
		[0.03%] Valid case splits: 22 milli. Average per split: 0.00 milli
		[0.05%] Applying stored bound-tightening: 39 milli
		[2.15%] SMT core: 1570 milli
		[17.29%] Symbolic Bound Tightening: 12624 milli
		[49.26%] SoI-based local search: 35966 milli
		[0.00%] SoI-based local search: 0 milli
		[6.57%] Unaccounted for: 4799 milli
	--- Preprocessor Statistics ---
	Number of preprocessor bound-tightening loop iterations: 5
	Number of eliminated variables: 922
	Number of constraints removed due to variable elimination: 122
	Number of equations removed due to variable elimination: 0
	--- Engine Statistics ---
	Number of main loop iterations: 80000
		78775 iterations were simplex steps. Total time: 40962 milli. Average: 0.52 milli.
		0 iterations were constraint-fixing steps. Total time: 0 milli. Average: 0.00 milli
	Number of active piecewise-linear constraints: 54 / 299
		Constraints disabled by valid splits: 98. By SMT-originated splits: 147
	Last reported degradation: 0.0000000000. Max degradation so far: 0.0000000861. Restorations so far: 0
	Number of simplex pivots we attempted to skip because of instability: 339.
	Unstable pivots performed anyway: 19
	--- Tableau Statistics ---
	Total number of pivots performed: 63658
		Real pivots: 63597. Degenerate: 61 (0.10%)
		Degenerate pivots by request (e.g., to fix a PL constraint): 0 (0.00%)
		Average time per pivot: 0.16 milli
	Total number of fake pivots performed: 1793
	Total number of rows added: 0. Number of merged columns: 0
	Current tableau dimensions: M = 830, N = 2742
	--- SMT Core Statistics ---
	Total depth is 147. Total visited states: 816. Number of splits: 478. Number of pops: 337
	Max stack depth: 157
	--- Bound Tightening Statistics ---
	Number of tightened bounds: 90405.
		Number of rows examined by row tightener: 63658. Consequent tightenings: 2270
		Number of explicit basis matrices examined by row tightener: 179. Consequent tightenings: 4619
		Number of bound tightening rounds on the entire constraint matrix: 0. Consequent tightenings: 0
		Number of bound notifications sent to PL constraints: 139591. Tightenings proposed: 0
	--- Basis Factorization statistics ---
	Number of basis refactorizations: 578
	--- Projected Steepest Edge Statistics ---
	Number of iterations: 65771.
	Number of resets to reference space: 377. Avg. iterations per reset: 174
	--- SBT ---
	Number of tightened bounds: 91109
	--- SoI-based local search ---
	Number of proposed phase pattern update: 6361. Number of accepted update: 5889 [92.58%]
	Total time (% of local search time) updating SoI phase pattern : 290904 milli [0.81%]
	Total time obtaining current assignment: 2495829 milli [6.94%]
	Total time getting SoI phase pattern : 397245 milli [0.54%]
	--- Context dependent statistics ---
	Number of pushes / pops: 815 / 668
		[0.11%] Pre-Push hook: 77 milli
		[0.00%] Push : 0 milli
		[0.08%] Post-Pop hook: 60 milli
		[0.09%] Pop : 63 milli
		[0.28%] Total context-switching time: 201 milli
	--- Proof Certificate ---
	Number of certified leaves: 0
	Number of leaves to delegate: 0

01:50:07 Statistics update:
	--- Time Statistics ---
	Total time elapsed: 91674 milli (00:01:31)
		Main loop: 84731 milli (00:01:24)
		Preprocessing time: 283 milli (00:00:00)
		Unknown: 6659 milli (00:00:06)
	Breakdown for main loop:
		[54.74%] Simplex steps: 46383 milli
		[17.89%] Explicit-basis bound tightening: 15157 milli
		[0.00%] Constraint-matrix bound tightening: 0 milli
		[0.59%] Degradation checking: 499 milli
		[0.00%] Precision restoration: 0 milli
		[0.22%] Statistics handling: 189 milli
		[0.00%] Constraint-fixing steps: 0 milli
		[0.03%] Valid case splits: 25 milli. Average per split: 0.00 milli
		[0.05%] Applying stored bound-tightening: 44 milli
		[2.26%] SMT core: 1915 milli
		[17.58%] Symbolic Bound Tightening: 14897 milli
		[46.24%] SoI-based local search: 39179 milli
		[0.00%] SoI-based local search: 0 milli
		[6.63%] Unaccounted for: 5618 milli
	--- Preprocessor Statistics ---
	Number of preprocessor bound-tightening loop iterations: 5
	Number of eliminated variables: 922
	Number of constraints removed due to variable elimination: 122
	Number of equations removed due to variable elimination: 0
	--- Engine Statistics ---
	Number of main loop iterations: 90000
		88609 iterations were simplex steps. Total time: 46383 milli. Average: 0.52 milli.
		0 iterations were constraint-fixing steps. Total time: 0 milli. Average: 0.00 milli
	Number of active piecewise-linear constraints: 61 / 299
		Constraints disabled by valid splits: 96. By SMT-originated splits: 142
	Last reported degradation: 0.0000000000. Max degradation so far: 0.0000003482. Restorations so far: 0
	Number of simplex pivots we attempted to skip because of instability: 414.
	Unstable pivots performed anyway: 23
	--- Tableau Statistics ---
	Total number of pivots performed: 71040
		Real pivots: 70968. Degenerate: 72 (0.10%)
		Degenerate pivots by request (e.g., to fix a PL constraint): 0 (0.00%)
		Average time per pivot: 0.16 milli
	Total number of fake pivots performed: 2298
	Total number of rows added: 0. Number of merged columns: 0
	Current tableau dimensions: M = 830, N = 2742
	--- SMT Core Statistics ---
	Total depth is 142. Total visited states: 962. Number of splits: 548. Number of pops: 413
	Max stack depth: 157
	--- Bound Tightening Statistics ---
	Number of tightened bounds: 106642.
		Number of rows examined by row tightener: 71040. Consequent tightenings: 3123
		Number of explicit basis matrices examined by row tightener: 220. Consequent tightenings: 5518
		Number of bound tightening rounds on the entire constraint matrix: 0. Consequent tightenings: 0
		Number of bound notifications sent to PL constraints: 168170. Tightenings proposed: 0
	--- Basis Factorization statistics ---
	Number of basis refactorizations: 647
	--- Projected Steepest Edge Statistics ---
	Number of iterations: 73729.
	Number of resets to reference space: 455. Avg. iterations per reset: 162
	--- SBT ---
	Number of tightened bounds: 107346
	--- SoI-based local search ---
	Number of proposed phase pattern update: 7309. Number of accepted update: 6768 [92.60%]
	Total time (% of local search time) updating SoI phase pattern : 329507 milli [0.84%]
	Total time obtaining current assignment: 2877055 milli [7.34%]
	Total time getting SoI phase pattern : 420912 milli [0.50%]
	--- Context dependent statistics ---
	Number of pushes / pops: 961 / 819
		[0.10%] Pre-Push hook: 88 milli
		[0.00%] Push : 0 milli
		[0.09%] Post-Pop hook: 72 milli
		[0.09%] Pop : 75 milli
		[0.28%] Total context-switching time: 236 milli
	--- Proof Certificate ---
	Number of certified leaves: 0
	Number of leaves to delegate: 0

01:50:19 Statistics update:
	--- Time Statistics ---
	Total time elapsed: 104332 milli (00:01:44)
		Main loop: 97416 milli (00:01:37)
		Preprocessing time: 283 milli (00:00:00)
		Unknown: 6632 milli (00:00:06)
	Breakdown for main loop:
		[53.29%] Simplex steps: 51909 milli
		[19.20%] Explicit-basis bound tightening: 18706 milli
		[0.00%] Constraint-matrix bound tightening: 0 milli
		[0.57%] Degradation checking: 557 milli
		[0.00%] Precision restoration: 0 milli
		[0.22%] Statistics handling: 211 milli
		[0.00%] Constraint-fixing steps: 0 milli
		[0.03%] Valid case splits: 29 milli. Average per split: 0.00 milli
		[0.05%] Applying stored bound-tightening: 50 milli
		[2.30%] SMT core: 2244 milli
		[17.55%] Symbolic Bound Tightening: 17092 milli
		[42.85%] SoI-based local search: 41742 milli
		[0.00%] SoI-based local search: 0 milli
		[6.79%] Unaccounted for: 6614 milli
	--- Preprocessor Statistics ---
	Number of preprocessor bound-tightening loop iterations: 5
	Number of eliminated variables: 922
	Number of constraints removed due to variable elimination: 122
	Number of equations removed due to variable elimination: 0
	--- Engine Statistics ---
	Number of main loop iterations: 100000
		98446 iterations were si[runlim] sample:		110.20 time, 110.01 real, 214 MB, 1.02 load
[runlim] sample:		120.20 time, 120.01 real, 214 MB, 1.02 load
mplex steps. Total time: 51909 milli. Average: 0.53 milli.
		0 iterations were constraint-fixing steps. Total time: 0 milli. Average: 0.00 milli
	Number of active piecewise-linear constraints: 67 / 299
		Constraints disabled by valid splits: 96. By SMT-originated splits: 136
	Last reported degradation: 0.0000000000. Max degradation so far: 0.0000003482. Restorations so far: 0
	Number of simplex pivots we attempted to skip because of instability: 543.
	Unstable pivots performed anyway: 31
	--- Tableau Statistics ---
	Total number of pivots performed: 78749
		Real pivots: 78667. Degenerate: 82 (0.10%)
		Degenerate pivots by request (e.g., to fix a PL constraint): 0 (0.00%)
		Average time per pivot: 0.16 milli
	Total number of fake pivots performed: 3003
	Total number of rows added: 0. Number of merged columns: 0
	Current tableau dimensions: M = 830, N = 2742
	--- SMT Core Statistics ---
	Total depth is 136. Total visited states: 1104. Number of splits: 616. Number of pops: 487
	Max stack depth: 157
	--- Bound Tightening Statistics ---
	Number of tightened bounds: 121999.
		Number of rows examined by row tightener: 78749. Consequent tightenings: 4006
		Number of explicit basis matrices examined by row tightener: 275. Consequent tightenings: 7879
		Number of bound tightening rounds on the entire constraint matrix: 0. Consequent tightenings: 0
		Number of bound notifications sent to PL constraints: 200194. Tightenings proposed: 0
	--- Basis Factorization statistics ---
	Number of basis refactorizations: 725
	--- Projected Steepest Edge Statistics ---
	Number of iterations: 82264.
	Number of resets to reference space: 533. Avg. iterations per reset: 154
	--- SBT ---
	Number of tightened bounds: 122703
	--- SoI-based local search ---
	Number of proposed phase pattern update: 7935. Number of accepted update: 7326 [92.33%]
	Total time (% of local search time) updating SoI phase pattern : 369881 milli [0.89%]
	Total time obtaining current assignment: 3143987 milli [7.53%]
	Total time getting SoI phase pattern : 439298 milli [0.45%]
	--- Context dependent statistics ---
	Number of pushes / pops: 1103 / 967
		[0.10%] Pre-Push hook: 99 milli
		[0.00%] Push : 0 milli
		[0.08%] Post-Pop hook: 80 milli
		[0.09%] Pop : 84 milli
		[0.27%] Total context-switching time: 264 milli
	--- Proof Certificate ---
	Number of certified leaves: 0
	Number of leaves to delegate: 0

01:50:29 Statistics update:
	--- Time Statistics ---
	Total time elapsed: 114186 milli (00:01:54)
		Main loop: 107251 milli (00:01:47)
		Preprocessing time: 283 milli (00:00:00)
		Unknown: 6651 milli (00:00:06)
	Breakdown for main loop:
		[53.11%] Simplex steps: 56959 milli
		[19.10%] Explicit-basis bound tightening: 20482 milli
		[0.00%] Constraint-matrix bound tightening: 0 milli
		[0.57%] Degradation checking: 615 milli
		[0.00%] Precision restoration: 0 milli
		[0.22%] Statistics handling: 232 milli
		[0.00%] Constraint-fixing steps: 0 milli
		[0.03%] Valid case splits: 32 milli. Average per split: 0.00 milli
		[0.05%] Applying stored bound-tightening: 55 milli
		[2.36%] SMT core: 2534 milli
		[17.73%] Symbolic Bound Tightening: 19011 milli
		[42.99%] SoI-based local search: 46102 milli
		[0.00%] SoI-based local search: 0 milli
		[6.83%] Unaccounted for: 7326 milli
	--- Preprocessor Statistics ---
	Number of preprocessor bound-tightening loop iterations: 5
	Number of eliminated variables: 922
	Number of constraints removed due to variable elimination: 122
	Number of equations removed due to variable elimination: 0
	--- Engine Statistics ---
	Number of main loop iterations: 110000
		108272 iterations were simplex steps. Total time: 56959 milli. Average: 0.53 milli.
		0 iterations were constraint-fixing steps. Total time: 0 milli. Average: 0.00 milli
	Number of active piecewise-linear constraints: 56 / 299
		Constraints disabled by valid splits: 100. By SMT-originated splits: 143
	Last reported degradation: 0.0000000000. Max degradation so far: 0.0000003482. Restorations so far: 0
	Number of simplex pivots we attempted to skip because of instability: 560.
	Unstable pivots performed anyway: 31
	--- Tableau Statistics ---
	Total number of pivots performed: 85453
		Real pivots: 85361. Degenerate: 92 (0.11%)
		Degenerate pivots by request (e.g., to fix a PL constraint): 0 (0.00%)
		Average time per pivot: 0.16 milli
	Total number of fake pivots performed: 3554
	Total number of rows added: 0. Number of merged columns: 0
	Current tableau dimensions: M = 830, N = 2742
	--- SMT Core Statistics ---
	Total depth is 143. Total visited states: 1239. Number of splits: 687. Number of pops: 551
	Max stack depth: 157
	--- Bound Tightening Statistics ---
	Number of tightened bounds: 133287.
		Number of rows examined by row tightener: 85453. Consequent tightenings: 4560
		Number of explicit basis matrices examined by row tightener: 299. Consequent tightenings: 8632
		Number of bound tightening rounds on the entire constraint matrix: 0. Consequent tightenings: 0
		Number of bound notifications sent to PL constraints: 221929. Tightenings proposed: 0
	--- Basis Factorization statistics ---
	Number of basis refactorizations: 780
	--- Projected Steepest Edge Statistics ---
	Number of iterations: 89536.
	Number of resets to reference space: 599. Avg. iterations per reset: 149
	--- SBT ---
	Number of tightened bounds: 133991
	--- SoI-based local search ---
	Number of proposed phase pattern update: 9178. Number of accepted update: 8498 [92.59%]
	Total time (% of local search time) updating SoI phase pattern : 410888 milli [0.89%]
	Total time obtaining current assignment: 3644117 milli [7.90%]
	Total time getting SoI phase pattern : 469850 milli [0.44%]
	--- Context dependent statistics ---
	Number of pushes / pops: 1238 / 1095
		[0.10%] Pre-Push hook: 110 milli
		[0.00%] Push : 0 milli
		[0.08%] Post-Pop hook: 90 milli
		[0.09%] Pop : 94 milli
		[0.28%] Total context-switching time: 295 milli
	--- Proof Certificate ---
	Number of certified leaves: 0
	Number of leaves to delegate: 0


Engine: quitting due to external request...

Final statistics:

01:50:35 Statistics update:
	--- Time Statistics ---
	Total time elapsed: 119989 milli (00:01:59)
		Main loop: 113072 milli (00:01:53)
		Preprocessing time: 283 milli (00:00:00)
		Unknown: 6634 milli (00:00:06)
	Breakdown for main loop:
		[52.73%] Simplex steps: 59617 milli
		[19.39%] Explicit-basis bound tightening: 21929 milli
		[0.00%] Constraint-matrix bound tightening: 0 milli
		[0.57%] Degradation checking: 646 milli
		[0.00%] Precision restoration: 0 milli
		[0.22%] Statistics handling: 243 milli
		[0.00%] Constraint-fixing steps: 0 milli
		[0.03%] Valid case splits: 33 milli. Average per split: 0.00 milli
		[0.05%] Applying stored bound-tightening: 58 milli
		[2.39%] SMT core: 2703 milli
		[17.67%] Symbolic Bound Tightening: 19975 milli
		[42.36%] SoI-based local search: 47896 milli
		[0.00%] SoI-based local search: 0 milli
		[6.95%] Unaccounted for: 7862 milli
	--- Preprocessor Statistics ---
	Number of preprocessor bound-tightening loop iterations: 5
	Number of eliminated variables: 922
	Number of constraints removed due to variable elimination: 122
	Number of equations removed due to variable elimination: 0
	--- Engine Statistics ---
	Number of main loop iterations: 115218
		113413 iterations were simplex steps. Total time: 59617 milli. Average: 0.53 milli.
		0 iterations were constraint-fixing steps. Total time: 0 milli. Average: 0.00 milli
	Number of active piecewise-linear constraints: 64 / 299
		Constraints disabled by valid splits: 97. By SMT-originated splits: 138
	Last reported degradation: 0.0000000000. Max degradation so far: 0.0000003482. Restorations so far: 0
	Number of simplex pivots we attempted to skip because of instability: 576.
	Unstable pivots performed anyway: 32
	--- Tableau Statistics ---
	Total number of pivots performed: 89026
		Real pivots: 88930. Degenerate: 96 (0.11%)
		Degenerate pivots by request (e.g., to fix a PL constraint): 0 (0.00%)
		Average time per pivot: 0.16 milli
	Total number of fake pivots performed: 3871
	Total number of rows added: 0. Number of merged columns: 0
	Current tableau dimensions: M = 830, N = 2742
	--- SMT Core Statistics ---
	Total depth is 138. Total visited states: 1312. Number of splits: 722. Number of pops: 589
	Max stack depth: 157
	--- Bound Tightening Statistics ---
	Number of tightened bounds: 139042.
		Number of rows examined by row tightener: 89026. Consequent tightenings: 5245
		Number of explicit basis matrices examined by row tightener: 321. Consequent tightenings: 10109
		Number of bound tightening rounds on the entire constraint matrix: 0. Consequent tightenings: 0
		Number of bound notifications sent to PL constraints: 234231. Tightenings proposed: 0
	--- Basis Factorization statistics ---
	Number of basis refactorizations: 810
	--- Projected Steepest Edge Statistics ---
	Number of iterations: 93441.
	Number of resets to reference space: 637. Avg. iterations per reset: 146
	--- SBT ---
	Number of tightened bounds: 139746
	--- SoI-based local search ---
	Number of proposed phase pattern update: 9804. Number of accepted update: 9087 [92.69%]
	Total time (% of local search time) updating SoI phase pattern : 431483 milli [0.90%]
	Total time obtaining current assignment: 3891968 milli [8.13%]
	Total time getting SoI phase pattern : 487461 milli [0.43%]
	--- Context dependent statistics ---
	Number of pushes / pops: 1311 / 1173
		[0.10%] Pre-Push hook: 116 milli
		[0.00%] Push : 0 milli
		[0.08%] Post-Pop hook: 94 milli
		[0.09%] Pop : 99 milli
		[0.27%] Total context-switching time: 309 milli
	--- Proof Certificate ---
	Number of certified leaves: 0
	Number of leaves to delegate: 0
Unexpected exit code! (this should not happen)[runlim] end:			Fri Oct  4 01:50:36 2024
[runlim] status:		out of time
[runlim] result:		2
[runlim] children:		1
[runlim] processes:		2
[runlim] real:			121.11 seconds
[runlim] time:			120.20 seconds
[runlim] space:			214 MB
[runlim] load:			1.05 maximum
[runlim] samples:		1200

real	2m1,112s
user	2m1,241s
sys	0m3,379s
