
[VERYDIFF_EXPERIMENT] Running on /home/i57/steuber/NeuroDiff/repos/VeryDiffExperiments/src/../benchmarks/mnist-prune/specs/mnist_84_global_6.vnnlib /home/i57/steuber/NeuroDiff/repos/VeryDiffExperiments/src/../benchmarks/mnist-prune/nets/mnist_relu_4_1024.onnx
Found input X
op: matmul, weight: (1024, 784), bias: nothing
op: bias, weight: nothing, bias: (1024,)
op: relu, weight: nothing, bias: nothing
op: matmul, weight: (1024, 1024), bias: nothing
op: bias, weight: nothing, bias: (1024,)
op: relu, weight: nothing, bias: nothing
op: matmul, weight: (1024, 1024), bias: nothing
op: bias, weight: nothing, bias: (1024,)
op: relu, weight: nothing, bias: nothing
op: matmul, weight: (10, 1024), bias: nothing
op: bias, weight: nothing, bias: (10,)
op: relu, weight: nothing, bias: nothing
op: matmul, weight: (10, 10), bias: nothing
op: bias, weight: nothing, bias: (10,)
Found input X
op: gemm, weight: (1024, 784), bias: (1024,)
op: relu, weight: nothing, bias: nothing
op: gemm, weight: (1024, 1024), bias: (1024,)
op: relu, weight: nothing, bias: nothing
op: gemm, weight: (1024, 1024), bias: (1024,)
op: relu, weight: nothing, bias: nothing
op: gemm, weight: (10, 1024), bias: (10,)
op: relu, weight: nothing, bias: nothing
op: gemm, weight: (10, 10), bias: (10,)
Distance: 915.6394868631054
Distance: 1298.7052820973968
Distance: 1296.587532894263
Distance: 6.054483317080667
Distance: 0.04942679278974538
Running with 1 threads
[Thread 1] Time to first task: 0.01s
Instable Generators: 461
Instable Generators: 954
Instable Generators: 1024
Instable Generators: 10
Zono Bounds:
[-171.62339189628997, -175.62382410456357, -193.62292975098978, -192.05734812646298, -184.4241713303019, -195.29861577322808, -174.94299681588816, -182.83521292836144, -187.02552169155933, -194.64621690178325]
[171.55409953043667, 174.7643950517652, 192.8135840398694, 191.73972148747092, 184.3339118330641, 194.99624807783894, 174.92213723047755, 181.54038838688132, 187.13816395695972, 194.44373361100781]


TIMEOUT REACHED
UNKNOWN
[Thread 1] Total splits: 45
Processed 45 zonotopes (Work Done: 0.0%); Generated 90 (2.7243718967555557s/loop)
[Thread 1] Finished in 122.6s
 ────────────────────────────────────────────────────────────────────────────────
                                        Time                    Allocations      
                               ───────────────────────   ────────────────────────
       Tot / % measured:             123s / 100.0%           36.1GiB / 100.0%    

 Section               ncalls     time    %tot     avg     alloc    %tot      avg
 ────────────────────────────────────────────────────────────────────────────────
 Verify                     1     123s  100.0%    123s   36.1GiB   99.9%  36.1GiB
   Zonotope Loop            1     123s  100.0%    123s   36.1GiB   99.9%  36.1GiB
     Zonotope Propa...     45     120s   97.8%   2.67s   33.2GiB   92.1%   756MiB
       DiffZonotope...    180    67.7s   55.2%   376ms   27.5GiB   76.2%   156MiB
         Zonotope_R...    360    60.8s   49.6%   169ms   22.2GiB   61.4%  63.1MiB
           Influenc...    360    35.6s   29.0%  98.8ms   13.0GiB   35.9%  36.9MiB
             Multiply     360    20.0s   16.3%  55.4ms   7.77GiB   21.5%  22.1MiB
             Alloca...    360    14.8s   12.1%  41.1ms   5.20GiB   14.4%  14.8MiB
             Set Ma...    360    828ms    0.7%  2.30ms     0.00B    0.0%    0.00B
           Column M...    360    12.6s   10.3%  34.9ms   4.60GiB   12.7%  13.1MiB
           Allocation     360    11.8s    9.6%  32.7ms   4.60GiB   12.7%  13.1MiB
           Set Matrix     360    866ms    0.7%  2.41ms   5.46MiB    0.0%  15.5KiB
           Vectors        360   9.01ms    0.0%  25.0μs   11.9MiB    0.0%  34.0KiB
           Bounds         360    276μs    0.0%   766ns     0.00B    0.0%    0.00B
       DiffZonotope...    225    52.3s   42.6%   232ms   5.74GiB   15.9%  26.1MiB
         Zonotope_D...    450    16.7s   13.6%  37.1ms   2.95GiB    8.2%  6.71MiB
     Compute Split         45    1.97s    1.6%  43.8ms   1.94GiB    5.4%  44.1MiB
     Property Check        45    514ms    0.4%  11.4ms   26.4MiB    0.1%   600KiB
 Initialize                 1   15.2ms    0.0%  15.2ms   27.0MiB    0.1%  27.0MiB
 ────────────────────────────────────────────────────────────────────────────────
[VERYDIFF_TIMER] 122.691770527

[VERYDIFF_EXPERIMENT] NETWORK: /home/i57/steuber/NeuroDiff/repos/VeryDiffExperiments/src/../benchmarks/mnist-prune/specs/mnist_84_global_6.vnnlib
[VERYDIFF_EXPERIMENT] TIME: 123.044286473
