
[VERYDIFF_EXPERIMENT] Running on /home/i57/steuber/NeuroDiff/repos/VeryDiffExperiments/src/../benchmarks/mnist-prune/specs/mnist_47_global_3.vnnlib /home/i57/steuber/NeuroDiff/repos/VeryDiffExperiments/src/../benchmarks/mnist-prune/nets/mnist_relu_2_512.onnx
/home/i57/steuber/NeuroDiff/repos/VeryDiffExperiments/src/../benchmarks/mnist-prune/nets/mnist_relu_2_512.onnx
/home/i57/steuber/NeuroDiff/repos/VeryDiffExperiments/src/../benchmarks/mnist-prune/nets_pruned/mnist_relu_2_512_pruned5.onnx
[[0.         0.01176471]
 [0.         0.01176471]
 [0.         0.01176471]
 ...
 [0.         0.01176471]
 [0.         0.01176471]
 [0.         0.01176471]]
top
120
False
512
512
512
512
### Vars ###
### Constraints ###
A_pi_3_0 = 0 --> (A_x_2_0 + 0.0001) <= A_top_3_0
A_pi_3_1 = 0 --> (A_x_2_1 + 0.0001) <= A_top_3_0
A_pi_3_2 = 0 --> (A_x_2_2 + 0.0001) <= A_top_3_0
A_pi_3_3 = 0 --> (A_x_2_3 + 0.0001) <= A_top_3_0
A_pi_3_4 = 0 --> (A_x_2_4 + 0.0001) <= A_top_3_0
A_pi_3_5 = 0 --> (A_x_2_5 + 0.0001) <= A_top_3_0
A_pi_3_6 = 0 --> (A_x_2_6 + 0.0001) <= A_top_3_0
A_pi_3_7 = 0 --> (A_x_2_7 + 0.0001) <= A_top_3_0
A_pi_3_8 = 0 --> (A_x_2_8 + 0.0001) <= A_top_3_0
A_pi_3_9 = 0 --> (A_x_2_9 + 0.0001) <= A_top_3_0
Set parameter TimeLimit to value 120
Set parameter Threads to value 1
Gurobi Optimizer version 10.0.0 build v10.0.0rc2 (linux64)

CPU model: Intel(R) Core(TM) i5-6500 CPU @ 3.20GHz, instruction set [SSE2|AVX|AVX2]
Thread count: 4 physical cores, 4 logical processors, using up to 1 threads

Optimize a model with 14522 rows, 7012 columns and 1321876 nonzeros
Model fingerprint: 0x71fcb99e
Variable types: 4934 continuous, 2078 integer (2078 binary)
Coefficient statistics:
  Matrix range     [1e-07, 2e+06]
  Objective range  [1e+00, 1e+00]
  Bounds range     [4e-03, 1e+00]
  RHS range        [1e-04, 2e+06]
Warning: Model contains large matrix coefficient range
         Consider reformulating model or setting NumericFocus parameter
         to avoid numerical issues.
Presolve removed 8713 rows and 2603 columns
Presolve time: 2.57s
Presolved: 5809 rows, 4409 columns, 613305 nonzeros
Variable types: 3333 continuous, 1076 integer (1076 binary)

Root relaxation: objective 3.823378e+02, 1971 iterations, 0.41 seconds (0.74 work units)

    Nodes    |    Current Node    |     Objective Bounds      |     Work
 Expl Unexpl |  Obj  Depth IntInf | Incumbent    BestBd   Gap | It/Node Time

     0     0  382.33781    0  227          -  382.33781      -     -    4s
     0     0  382.29822    0  251          -  382.29822      -     -    7s
     0     0  382.15759    0  242          -  382.15759      -     -    7s
     0     0  382.09999    0  248          -  382.09999      -     -    9s
     0     0  382.05313    0  247          -  382.05313      -     -    9s
     0     0  382.02989    0  250          -  382.02989      -     -   13s
     0     0  382.01781    0  251          -  382.01781      -     -   13s
     0     0  382.00829    0  250          -  382.00829      -     -   14s
     0     0  382.00402    0  251          -  382.00402      -     -   14s
     0     0  382.00385    0  251          -  382.00385      -     -   14s
     0     0  382.00379    0  251          -  382.00379      -     -   14s
     0     0  381.98885    0  250          -  381.98885      -     -   18s
     0     0  381.97897    0  248          -  381.97897      -     -   18s
     0     0  381.97182    0  250          -  381.97182      -     -   19s
     0     0  381.97059    0  250          -  381.97059      -     -   19s
     0     0  381.97041    0  251          -  381.97041      -     -   19s
     0     0  381.97033    0  250          -  381.97033      -     -   19s
     0     0  381.96283    0  250          -  381.96283      -     -   21s
     0     0  381.95613    0  249          -  381.95613      -     -   22s
     0     0  381.95396    0  248          -  381.95396      -     -   23s
     0     0  381.95322    0  248          -  381.95322      -     -   23s
     0     0  381.95276    0  250          -  381.95276      -     -   23s
     0     0  381.95268    0  250          -  381.95268      -     -   24s
     0     0  381.94889    0  251          -  381.94889      -     -   26s
     0     0  381.94589    0  251          -  381.94589      -     -   27s
     0     0  381.94517    0  248          -  381.94517      -     -   28s
     0     0  381.94497    0  249          -  381.94497      -     -   28s
     0     0  381.94492    0  250          -  381.94492      -     -   29s
     0     0  381.94277    0  249          -  381.94277      -     -   31s
     0     0  381.93956    0  251          -  381.93956      -     -   32s
     0     0  381.93884    0  252          -  381.93884      -     -   33s
     0     0  381.93829    0  252          -  381.93829      -     -   33s
     0     0  381.93809    0  251          -  381.93809      -     -   34s
     0     0  381.93802    0  250          -  381.93802      -     -   34s
     0     0  381.93651    0  249          -  381.93651      -     -   37s
     0     0  381.93431    0  250          -  381.93431      -     -   38s
     0     0  381.93379    0  250          -  381.93379      -     -   39s
     0     0  381.93355    0  250          -  381.93355      -     -   39s
     0     0  381.93340    0  250          -  381.93340      -     -   40s
     0     0  381.93199    0  250          -  381.93199      -     -   43s
     0     0  381.93116    0  250          -  381.93116      -     -   44s
     0     0  381.93081    0  253          -  381.93081      -     -   45s
     0     0  381.93061    0  252          -  381.93061      -     -   46s
     0     0  381.93055    0  252          -  381.93055      -     -   47s
     0     0  381.92956    0  251          -  381.92956      -     -   50s
     0     0  381.92956    0  251          -  381.92956      -     -   55s
     0     2  381.92952    0  251          -  381.92952      -     -   85s
     2     4  370.84490    1  449          -  370.84490      -  4218   94s
     3     5  368.70897    2  396          -  370.84490      -  3324   96s
     5     5  363.82151    3  352          -  368.70814      -  3464  103s
     6     4 infeasible    3               -  363.82078      -  3277  105s
     9     5  359.37131    5  372          -  362.35385      -  3110  112s
    11     3 infeasible    6               -  356.66980      -  2955  115s

Cutting planes:
  Gomory: 6
  Implied bound: 6
  MIR: 238
  Flow cover: 8
  RLT: 511

Explored 15 nodes (53531 simplex iterations) in 120.00 seconds (196.66 work units)
Thread count was 1 (of 4 available processors)

Solution count 0

Time limit reached
Best objective -, best bound 3.488926328851e+02, gap -


TIMEOUT
time: 150.82873888

[VERYDIFF_TIMER] 150.858280667

[VERYDIFF_EXPERIMENT] Running on /home/i57/steuber/NeuroDiff/repos/VeryDiffExperiments/src/../benchmarks/mnist-prune/specs/mnist_47_global_3.vnnlib /home/i57/steuber/NeuroDiff/repos/VeryDiffExperiments/src/../benchmarks/mnist-prune/nets/mnist_relu_3_100.onnx
/home/i57/steuber/NeuroDiff/repos/VeryDiffExperiments/src/../benchmarks/mnist-prune/nets/mnist_relu_3_100.onnx
/home/i57/steuber/NeuroDiff/repos/VeryDiffExperiments/src/../benchmarks/mnist-prune/nets_pruned/mnist_relu_3_100_pruned5.onnx
[[0.         0.01176471]
 [0.         0.01176471]
 [0.         0.01176471]
 ...
 [0.         0.01176471]
 [0.         0.01176471]
 [0.         0.01176471]]
top
120
False
100
100
10
100
100
10
### Vars ###
### Constraints ###
A_pi_4_0 = 0 --> (A_x_3_0 + 0.0001) <= A_top_4_0
A_pi_4_1 = 0 --> (A_x_3_1 + 0.0001) <= A_top_4_0
A_pi_4_2 = 0 --> (A_x_3_2 + 0.0001) <= A_top_4_0
A_pi_4_3 = 0 --> (A_x_3_3 + 0.0001) <= A_top_4_0
A_pi_4_4 = 0 --> (A_x_3_4 + 0.0001) <= A_top_4_0
A_pi_4_5 = 0 --> (A_x_3_5 + 0.0001) <= A_top_4_0
A_pi_4_6 = 0 --> (A_x_3_6 + 0.0001) <= A_top_4_0
A_pi_4_7 = 0 --> (A_x_3_7 + 0.0001) <= A_top_4_0
A_pi_4_8 = 0 --> (A_x_3_8 + 0.0001) <= A_top_4_0
A_pi_4_9 = 0 --> (A_x_3_9 + 0.0001) <= A_top_4_0
Set parameter TimeLimit to value 120
Set parameter Threads to value 1
Gurobi Optimizer version 10.0.0 build v10.0.0rc2 (linux64)

CPU model: Intel(R) Core(TM) i5-6500 CPU @ 3.20GHz, instruction set [SSE2|AVX|AVX2]
Thread count: 4 physical cores, 4 logical processors, using up to 1 threads

Optimize a model with 3126 rows, 2128 columns and 179801 nonzeros
Model fingerprint: 0xdc0b8e26
Variable types: 1678 continuous, 450 integer (450 binary)
Coefficient statistics:
  Matrix range     [1e-06, 2e+06]
  Objective range  [1e+00, 1e+00]
  Bounds range     [4e-03, 1e+00]
  RHS range        [1e-04, 2e+06]
Warning: Model contains large matrix coefficient range
         Consider reformulating model or setting NumericFocus parameter
         to avoid numerical issues.
Presolve removed 1824 rows and 599 columns
Presolve time: 0.54s
Presolved: 1302 rows, 1529 columns, 88806 nonzeros
Variable types: 1305 continuous, 224 integer (224 binary)

Root relaxation: objective 1.795295e+01, 389 iterations, 0.02 seconds (0.03 work units)

    Nodes    |    Current Node    |     Objective Bounds      |     Work
 Expl Unexpl |  Obj  Depth IntInf | Incumbent    BestBd   Gap | It/Node Time

     0     0   17.95295    0   53          -   17.95295      -     -    0s
     0     0   17.28093    0   55          -   17.28093      -     -    1s
     0     0   15.42380    0   54          -   15.42380      -     -    1s
     0     0   15.40907    0   54          -   15.40907      -     -    1s
     0     0   15.28238    0   72          -   15.28238      -     -    1s
     0     0   14.48135    0   51          -   14.48135      -     -    1s
     0     0   14.47410    0   53          -   14.47410      -     -    1s
     0     0   14.47326    0   53          -   14.47326      -     -    1s
     0     0   14.22409    0   66          -   14.22409      -     -    2s
     0     0   14.16570    0   61          -   14.16570      -     -    2s
     0     0   14.05883    0   59          -   14.05883      -     -    2s
     0     0   14.05852    0   60          -   14.05852      -     -    2s
     0     0   13.91420    0   60          -   13.91420      -     -    2s
     0     0   13.91018    0   63          -   13.91018      -     -    2s
     0     0   13.90941    0   71          -   13.90941      -     -    2s
     0     0   13.90773    0   69          -   13.90773      -     -    2s
     0     0   13.90773    0   69          -   13.90773      -     -    3s
H    0     0                      -0.0000000   13.90773      -     -    5s
     0     2   13.83159    0   66   -0.00000   13.83159      -     -    5s
H   26     9                       0.0000009   10.15670      -   107    6s
   511   336    9.79454   24   69    0.00000    9.79454      -  21.5   10s
   524   345    8.87122   47   53    0.00000    9.79454      -  21.0   15s
   637   374    9.32232   51   11    0.00000    9.52166      -  29.9   20s
   967   339 infeasible   35         0.00000    9.35379      -  39.6   25s

Cutting planes:
  Gomory: 33
  Cover: 9
  Implied bound: 5
  MIR: 56
  Flow cover: 27
  RLT: 32
  Relax-and-lift: 3

Explored 1103 nodes (53809 simplex iterations) in 27.79 seconds (32.05 work units)
Thread count was 1 (of 4 available processors)

Solution count 2: 9.03963e-07 -0 
No other solutions better than 9.03963e-07

Optimal solution found (tolerance 1.00e-04)
Best objective 9.039632029584e-07, best bound 9.039632029584e-07, gap 0.0000%


100
100
10
100
100
10
UNKNOWN
time: 33.513756029

[VERYDIFF_TIMER] 33.568850317

[VERYDIFF_EXPERIMENT] Running on /home/i57/steuber/NeuroDiff/repos/VeryDiffExperiments/src/../benchmarks/mnist-prune/specs/mnist_47_global_3.vnnlib /home/i57/steuber/NeuroDiff/repos/VeryDiffExperiments/src/../benchmarks/mnist-prune/nets/mnist_relu_4_1024.onnx
/home/i57/steuber/NeuroDiff/repos/VeryDiffExperiments/src/../benchmarks/mnist-prune/nets/mnist_relu_4_1024.onnx
/home/i57/steuber/NeuroDiff/repos/VeryDiffExperiments/src/../benchmarks/mnist-prune/nets_pruned/mnist_relu_4_1024_pruned5.onnx
[[0.         0.01176471]
 [0.         0.01176471]
 [0.         0.01176471]
 ...
 [0.         0.01176471]
 [0.         0.01176471]
 [0.         0.01176471]]
top
120
False
1024
1024
1024
10
1024
1024
1024
10
### Vars ###
### Constraints ###
A_pi_5_0 = 0 --> (A_x_4_0 + 0.0001) <= A_top_5_0
A_pi_5_1 = 0 --> (A_x_4_1 + 0.0001) <= A_top_5_0
A_pi_5_2 = 0 --> (A_x_4_2 + 0.0001) <= A_top_5_0
A_pi_5_3 = 0 --> (A_x_4_3 + 0.0001) <= A_top_5_0
A_pi_5_4 = 0 --> (A_x_4_4 + 0.0001) <= A_top_5_0
A_pi_5_5 = 0 --> (A_x_4_5 + 0.0001) <= A_top_5_0
A_pi_5_6 = 0 --> (A_x_4_6 + 0.0001) <= A_top_5_0
A_pi_5_7 = 0 --> (A_x_4_7 + 0.0001) <= A_top_5_0
A_pi_5_8 = 0 --> (A_x_4_8 + 0.0001) <= A_top_5_0
A_pi_5_9 = 0 --> (A_x_4_9 + 0.0001) <= A_top_5_0
Set parameter TimeLimit to value 120
Set parameter Threads to value 1
Gurobi Optimizer version 10.0.0 build v10.0.0rc2 (linux64)

CPU model: Intel(R) Core(TM) i5-6500 CPU @ 3.20GHz, instruction set [SSE2|AVX|AVX2]
Thread count: 4 physical cores, 4 logical processors, using up to 1 threads

Optimize a model with 43334 rows, 19360 columns and 5656845 nonzeros
Model fingerprint: 0x03731c09
Variable types: 13166 continuous, 6194 integer (6194 binary)
Coefficient statistics:
  Matrix range     [2e-08, 2e+06]
  Objective range  [1e+00, 1e+00]
  Bounds range     [4e-03, 1e+00]
  RHS range        [1e-07, 2e+06]
Warning: Model contains large matrix coefficient range
         Consider reformulating model or setting NumericFocus parameter
         to avoid numerical issues.
Presolve removed 18509 rows and 3812 columns (presolve time = 5s) ...
Presolve removed 18559 rows and 3812 columns (presolve time = 10s) ...
Presolve removed 19206 rows and 3812 columns (presolve time = 15s) ...
Presolve removed 19206 rows and 3812 columns
Presolve time: 18.08s
Presolved: 24128 rows, 15548 columns, 4517101 nonzeros
Variable types: 10867 continuous, 4681 integer (4681 binary)

Root simplex log...

Iteration    Objective       Primal Inf.    Dual Inf.      Time
       0    1.1857618e+04   3.777318e+03   0.000000e+00     34s
    2296    1.2808050e+03   4.923784e+02   0.000000e+00     35s
    4176    1.2806840e+03   6.661368e+03   0.000000e+00     40s
    5296    1.2806772e+03   5.647784e+03   0.000000e+00     45s
    6226    1.2806726e+03   3.353186e+03   0.000000e+00     50s
    7096    1.2806671e+03   3.669851e+04   0.000000e+00     55s
    7996    1.2806613e+03   5.854918e+03   0.000000e+00     60s
    8916    1.2806565e+03   7.900398e+04   0.000000e+00     66s
    9716    1.2806530e+03   2.893132e+04   0.000000e+00     70s
   10676    1.2806505e+03   7.111492e+04   0.000000e+00     75s
   11506    1.2806459e+03   1.137926e+05   0.000000e+00     80s
   12376    1.2806418e+03   1.972170e+04   0.000000e+00     85s
   13336    1.2806343e+03   6.680808e+03   0.000000e+00     91s
   14736    1.2806264e+03   8.354051e+03   0.000000e+00     95s
   16356    1.2806184e+03   1.464436e+02   0.000000e+00    100s
   17317    1.2806250e+03   0.000000e+00   0.000000e+00    103s

Root relaxation: objective 1.280625e+03, 17317 iterations, 72.81 seconds (188.30 work units)

    Nodes    |    Current Node    |     Objective Bounds      |     Work
 Expl Unexpl |  Obj  Depth IntInf | Incumbent    BestBd   Gap | It/Node Time

     0     0 1280.62498    0 1280          - 1280.62498      -     -  120s

Explored 1 nodes (22782 simplex iterations) in 120.09 seconds (243.34 work units)
Thread count was 1 (of 4 available processors)

Solution count 0

Time limit reached
Best objective -, best bound 1.280624980986e+03, gap -


TIMEOUT
time: 262.608182494

[VERYDIFF_TIMER] 262.632621694

[VERYDIFF_EXPERIMENT] NETWORK: /home/i57/steuber/NeuroDiff/repos/VeryDiffExperiments/src/../benchmarks/mnist-prune/specs/mnist_47_global_3.vnnlib
[VERYDIFF_EXPERIMENT] TIME: 448.116135518
