[VERYDIFF_EXPERIMENT] Sigma: 0.1
Parsing new_benchmarks/lhc/nets/4_20-1.onnx...
Found input X
WARNING: Operation Softmax is not supported
WE ARE IGNORING THIS OPERATION -- IF YOU DO NOT KNOW WHAT YOU ARE DOING THIS MAY BE UNSOUND!
op: gemm, weight: (20, 16), bias: (20,)
op: relu, weight: nothing, bias: nothing
op: gemm, weight: (20, 20), bias: (20,)
op: relu, weight: nothing, bias: nothing
op: gemm, weight: (20, 20), bias: (20,)
op: relu, weight: nothing, bias: nothing
op: gemm, weight: (20, 20), bias: (20,)
op: relu, weight: nothing, bias: nothing
op: gemm, weight: (5, 20), bias: (5,)
Parsing new_benchmarks/lhc/nets_pruned/4_20-1-0.1.onnx...
Found input X
WARNING: Operation Softmax is not supported
WE ARE IGNORING THIS OPERATION -- IF YOU DO NOT KNOW WHAT YOU ARE DOING THIS MAY BE UNSOUND!
op: gemm, weight: (20, 16), bias: (20,)
op: relu, weight: nothing, bias: nothing
op: gemm, weight: (20, 20), bias: (20,)
op: relu, weight: nothing, bias: nothing
op: gemm, weight: (20, 20), bias: (20,)
op: relu, weight: nothing, bias: nothing
op: gemm, weight: (20, 20), bias: (20,)
op: relu, weight: nothing, bias: nothing
op: gemm, weight: (5, 20), bias: (5,)
Distance: 15.020209498878103
Distance: 29.65857770416187
Distance: 23.686798373353668
Distance: 25.927283467026427
Distance: 5.395627950318158
Running with 1 threads
[Thread 1] Time to first task: 0.0s
Zono Bounds:
[0.0, 0.0, 0.0, 0.0, 0.0, 0.0, 0.0, 0.0, 0.0, 0.0, 0.0, 0.0, 0.0, 0.0, 0.0, 0.0]
[0.0, 0.0, 0.0, 0.0, 0.0, 0.0, 0.0, 0.0, 0.0, 0.0, 0.0, 0.0, 0.0, 0.0, 0.0, 0.0]
[TOP-1] did not find required confidence yet.
[TOP-1] required confidence (0.9999999935969275≥0.99) is feasible for index 2
Found cex
N1: 0.9963617050564914 (vs. 0.003274416373698144)
N2: 0.5825774994793822
N1 Probability: 0.9963617050564914 >= 0.99

Found counterexample: ([-0.1, -0.1, -0.1, 0.1, -0.1, 0.1, 0.1, -0.1, -0.1, 0.1, -0.1, 0.1, -0.1, 0.1, -0.05000000000000002, -0.1], (2, 3))
[Thread 1] Total splits: 26
Processed 27 zonotopes (Work Done: 0.0%); Generated 52 (0.008850060222222221s/loop)
[Thread 1] Finished in 0.24s
 ────────────────────────────────────────────────────────────────────────────────
                                        Time                    Allocations      
                               ───────────────────────   ────────────────────────
       Tot / % measured:            239ms / 100.0%           60.0MiB / 100.0%    

 Section               ncalls     time    %tot     avg     alloc    %tot      avg
 ────────────────────────────────────────────────────────────────────────────────
 Verify                     1    239ms  100.0%   239ms   60.0MiB  100.0%  60.0MiB
   Zonotope Loop            1    239ms  100.0%   239ms   60.0MiB  100.0%  60.0MiB
     Property Check        27    233ms   97.5%  8.63ms   50.8MiB   84.7%  1.88MiB
     Zonotope Propa...     27   4.76ms    2.0%   176μs   8.10MiB   13.5%   307KiB
       DiffZonotope...    108   3.73ms    1.6%  34.6μs   6.77MiB   11.3%  64.2KiB
         Zonotope_R...    216   3.41ms    1.4%  15.8μs   6.53MiB   10.9%  30.9KiB
           Influenc...    216   1.57ms    0.7%  7.28μs   3.18MiB    5.3%  15.1KiB
             Multiply     216   1.01ms    0.4%  4.69μs   2.00MiB    3.3%  9.47KiB
             Alloca...    216    373μs    0.2%  1.73μs   1.18MiB    2.0%  5.59KiB
             Set Ma...    216   82.1μs    0.0%   380ns     0.00B    0.0%    0.00B
           Column M...    216    618μs    0.3%  2.86μs   1.50MiB    2.5%  7.11KiB
           Allocation     216    446μs    0.2%  2.07μs   1.47MiB    2.4%  6.97KiB
           Set Matrix     216    322μs    0.1%  1.49μs    119KiB    0.2%     566B
           Vectors        216    261μs    0.1%  1.21μs    256KiB    0.4%  1.19KiB
           Bounds         216   40.4μs    0.0%   187ns     0.00B    0.0%    0.00B
       DiffZonotope...    135    803μs    0.3%  5.95μs   1.31MiB    2.2%  10.0KiB
         Zonotope_D...    270    762μs    0.3%  2.82μs   1.30MiB    2.2%  4.94KiB
     Compute Split         26    832μs    0.3%  32.0μs    797KiB    1.3%  30.7KiB
 Initialize                 1   39.8μs    0.0%  39.8μs   22.4KiB    0.0%  22.4KiB
 ────────────────────────────────────────────────────────────────────────────────[VERYDIFF_TIMER] 0.240595163
[VERYDIFF_EXPERIMENT] Sigma: 0.5
Parsing new_benchmarks/lhc/nets/4_20-1.onnx...
Found input X
WARNING: Operation Softmax is not supported
WE ARE IGNORING THIS OPERATION -- IF YOU DO NOT KNOW WHAT YOU ARE DOING THIS MAY BE UNSOUND!
op: gemm, weight: (20, 16), bias: (20,)
op: relu, weight: nothing, bias: nothing
op: gemm, weight: (20, 20), bias: (20,)
op: relu, weight: nothing, bias: nothing
op: gemm, weight: (20, 20), bias: (20,)
op: relu, weight: nothing, bias: nothing
op: gemm, weight: (20, 20), bias: (20,)
op: relu, weight: nothing, bias: nothing
op: gemm, weight: (5, 20), bias: (5,)
Parsing new_benchmarks/lhc/nets_pruned/4_20-1-0.1.onnx...
Found input X
WARNING: Operation Softmax is not supported
WE ARE IGNORING THIS OPERATION -- IF YOU DO NOT KNOW WHAT YOU ARE DOING THIS MAY BE UNSOUND!
op: gemm, weight: (20, 16), bias: (20,)
op: relu, weight: nothing, bias: nothing
op: gemm, weight: (20, 20), bias: (20,)
op: relu, weight: nothing, bias: nothing
op: gemm, weight: (20, 20), bias: (20,)
op: relu, weight: nothing, bias: nothing
op: gemm, weight: (20, 20), bias: (20,)
op: relu, weight: nothing, bias: nothing
op: gemm, weight: (5, 20), bias: (5,)
Distance: 15.020209498878103
Distance: 29.65857770416187
Distance: 23.686798373353668
Distance: 25.927283467026427
Distance: 5.395627950318158
Running with 1 threads
[Thread 1] Time to first task: 0.0s
Zono Bounds:
[0.0, 0.0, 0.0, 0.0, 0.0, 0.0, 0.0, 0.0, 0.0, 0.0, 0.0, 0.0, 0.0, 0.0, 0.0, 0.0]
[0.0, 0.0, 0.0, 0.0, 0.0, 0.0, 0.0, 0.0, 0.0, 0.0, 0.0, 0.0, 0.0, 0.0, 0.0, 0.0]
[TOP-1] did not find required confidence yet.
[TOP-1] did not find required confidence yet.
[TOP-1] required confidence (0.9999995211375766≥0.99) is feasible for index 3
Found cex
N1: 0.9999343552971187 (vs. 6.564310278414903e-5)
N2: 0.9964399970640966
N1 Probability: 0.9999343552971187 >= 0.99

Found counterexample: ([-0.5, 0.5, -0.5, -0.5, -0.5, -0.5, -0.5, -0.5, 0.5, 0.5, -0.5, 0.5, -0.5, -0.5, 0.5, -0.5], (4, 1))
[Thread 1] Total splits: 2
Processed 3 zonotopes (Work Done: 0.0%); Generated 4 (0.008830647333333334s/loop)
[Thread 1] Finished in 0.03s
 ────────────────────────────────────────────────────────────────────────────────
                                        Time                    Allocations      
                               ───────────────────────   ────────────────────────
       Tot / % measured:           26.6ms / 100.0%           7.12MiB / 100.0%    

 Section               ncalls     time    %tot     avg     alloc    %tot      avg
 ────────────────────────────────────────────────────────────────────────────────
 Verify                     1   26.5ms   99.9%  26.5ms   7.10MiB   99.7%  7.10MiB
   Zonotope Loop            1   26.5ms   99.8%  26.5ms   7.09MiB   99.6%  7.09MiB
     Property Check         3   25.7ms   97.0%  8.58ms   5.66MiB   79.5%  1.89MiB
     Zonotope Propa...      3    604μs    2.3%   201μs   1.30MiB   18.3%   444KiB
       DiffZonotope...     12    480μs    1.8%  40.0μs   1.10MiB   15.4%  93.6KiB
         Zonotope_R...     24    444μs    1.7%  18.5μs   1.07MiB   15.0%  45.6KiB
           Influenc...     24    207μs    0.8%  8.62μs    559KiB    7.7%  23.3KiB
             Multiply      24    140μs    0.5%  5.82μs    364KiB    5.0%  15.1KiB
             Alloca...     24   44.5μs    0.2%  1.85μs    194KiB    2.7%  8.06KiB
             Set Ma...     24   11.0μs    0.0%   459ns     0.00B    0.0%    0.00B
           Column M...     24   84.6μs    0.3%  3.53μs    244KiB    3.3%  10.2KiB
           Allocation      24   58.4μs    0.2%  2.43μs    241KiB    3.3%  10.0KiB
           Set Matrix      24   42.4μs    0.2%  1.76μs   17.1KiB    0.2%     728B
           Vectors         24   28.3μs    0.1%  1.18μs   28.5KiB    0.4%  1.19KiB
           Bounds          24   4.55μs    0.0%   189ns     0.00B    0.0%    0.00B
       DiffZonotope...     15    102μs    0.4%  6.82μs    206KiB    2.8%  13.8KiB
         Zonotope_D...     30   97.4μs    0.4%  3.25μs    205KiB    2.8%  6.83KiB
     Compute Split          2   73.4μs    0.3%  36.7μs   77.2KiB    1.1%  38.6KiB
 Initialize                 1   37.4μs    0.1%  37.4μs   22.4KiB    0.3%  22.4KiB
 ────────────────────────────────────────────────────────────────────────────────[VERYDIFF_TIMER] 0.028253128
[VERYDIFF_EXPERIMENT] Sigma: 1.0
Parsing new_benchmarks/lhc/nets/4_20-1.onnx...
Found input X
WARNING: Operation Softmax is not supported
WE ARE IGNORING THIS OPERATION -- IF YOU DO NOT KNOW WHAT YOU ARE DOING THIS MAY BE UNSOUND!
op: gemm, weight: (20, 16), bias: (20,)
op: relu, weight: nothing, bias: nothing
op: gemm, weight: (20, 20), bias: (20,)
op: relu, weight: nothing, bias: nothing
op: gemm, weight: (20, 20), bias: (20,)
op: relu, weight: nothing, bias: nothing
op: gemm, weight: (20, 20), bias: (20,)
op: relu, weight: nothing, bias: nothing
op: gemm, weight: (5, 20), bias: (5,)
Parsing new_benchmarks/lhc/nets_pruned/4_20-1-0.1.onnx...
Found input X
WARNING: Operation Softmax is not supported
WE ARE IGNORING THIS OPERATION -- IF YOU DO NOT KNOW WHAT YOU ARE DOING THIS MAY BE UNSOUND!
op: gemm, weight: (20, 16), bias: (20,)
op: relu, weight: nothing, bias: nothing
op: gemm, weight: (20, 20), bias: (20,)
op: relu, weight: nothing, bias: nothing
op: gemm, weight: (20, 20), bias: (20,)
op: relu, weight: nothing, bias: nothing
op: gemm, weight: (20, 20), bias: (20,)
op: relu, weight: nothing, bias: nothing
op: gemm, weight: (5, 20), bias: (5,)
Distance: 15.020209498878103
Distance: 29.65857770416187
Distance: 23.686798373353668
Distance: 25.927283467026427
Distance: 5.395627950318158
Running with 1 threads
[Thread 1] Time to first task: 0.0s
Zono Bounds:
[0.0, 0.0, 0.0, 0.0, 0.0, 0.0, 0.0, 0.0, 0.0, 0.0, 0.0, 0.0, 0.0, 0.0, 0.0, 0.0]
[0.0, 0.0, 0.0, 0.0, 0.0, 0.0, 0.0, 0.0, 0.0, 0.0, 0.0, 0.0, 0.0, 0.0, 0.0, 0.0]
[TOP-1] did not find required confidence yet.
[TOP-1] did not find required confidence yet.
[TOP-1] required confidence (0.9999945484030041≥0.99) is feasible for index 3
Found cex
N1: 0.9996731426734848 (vs. 0.00032685732187139066)
N2: 0.9996764524809273
N1 Probability: 0.9996731426734848 >= 0.99

Found counterexample: ([-1.0, -1.0, 1.0, 0.0, -1.0, -1.0, 1.0, -1.0, -1.0, 1.0, -1.0, 1.0, -1.0, 1.0, 0.0, -1.0], (4, 3))
[Thread 1] Total splits: 5
Processed 6 zonotopes (Work Done: 0.0%); Generated 10 (0.009936123333333333s/loop)
[Thread 1] Finished in 0.06s
 ────────────────────────────────────────────────────────────────────────────────
                                        Time                    Allocations      
                               ───────────────────────   ────────────────────────
       Tot / % measured:           59.7ms / 100.0%           15.9MiB / 100.0%    

 Section               ncalls     time    %tot     avg     alloc    %tot      avg
 ────────────────────────────────────────────────────────────────────────────────
 Verify                     1   59.6ms   99.9%  59.6ms   15.9MiB   99.9%  15.9MiB
   Zonotope Loop            1   59.6ms   99.9%  59.6ms   15.9MiB   99.8%  15.9MiB
     Property Check         6   58.1ms   97.4%  9.69ms   13.0MiB   81.8%  2.17MiB
     Zonotope Propa...      6   1.19ms    2.0%   198μs   2.59MiB   16.3%   443KiB
       DiffZonotope...     24    944μs    1.6%  39.3μs   2.19MiB   13.7%  93.3KiB
         Zonotope_R...     48    869μs    1.5%  18.1μs   2.13MiB   13.4%  45.5KiB
           Influenc...     48    410μs    0.7%  8.55μs   1.09MiB    6.9%  23.3KiB
             Multiply      48    275μs    0.5%  5.74μs    727KiB    4.5%  15.1KiB
             Alloca...     48   88.8μs    0.1%  1.85μs    387KiB    2.4%  8.06KiB
             Set Ma...     48   22.7μs    0.0%   473ns     0.00B    0.0%    0.00B
           Column M...     48    163μs    0.3%  3.39μs    488KiB    3.0%  10.2KiB
           Allocation      48    108μs    0.2%  2.26μs    482KiB    3.0%  10.0KiB
           Set Matrix      48   86.1μs    0.1%  1.79μs   34.1KiB    0.2%     728B
           Vectors         48   56.2μs    0.1%  1.17μs   57.0KiB    0.3%  1.19KiB
           Bounds          48   8.98μs    0.0%   187ns     0.00B    0.0%    0.00B
       DiffZonotope...     30    198μs    0.3%  6.60μs    412KiB    2.5%  13.7KiB
         Zonotope_D...     60    189μs    0.3%  3.15μs    410KiB    2.5%  6.83KiB
     Compute Split          5    176μs    0.3%  35.3μs    193KiB    1.2%  38.6KiB
 Initialize                 1   36.6μs    0.1%  36.6μs   22.4KiB    0.1%  22.4KiB
 ────────────────────────────────────────────────────────────────────────────────[VERYDIFF_TIMER] 0.06115705
[VERYDIFF_EXPERIMENT] Sigma: 2.0
Parsing new_benchmarks/lhc/nets/4_20-1.onnx...
Found input X
WARNING: Operation Softmax is not supported
WE ARE IGNORING THIS OPERATION -- IF YOU DO NOT KNOW WHAT YOU ARE DOING THIS MAY BE UNSOUND!
op: gemm, weight: (20, 16), bias: (20,)
op: relu, weight: nothing, bias: nothing
op: gemm, weight: (20, 20), bias: (20,)
op: relu, weight: nothing, bias: nothing
op: gemm, weight: (20, 20), bias: (20,)
op: relu, weight: nothing, bias: nothing
op: gemm, weight: (20, 20), bias: (20,)
op: relu, weight: nothing, bias: nothing
op: gemm, weight: (5, 20), bias: (5,)
Parsing new_benchmarks/lhc/nets_pruned/4_20-1-0.1.onnx...
Found input X
WARNING: Operation Softmax is not supported
WE ARE IGNORING THIS OPERATION -- IF YOU DO NOT KNOW WHAT YOU ARE DOING THIS MAY BE UNSOUND!
op: gemm, weight: (20, 16), bias: (20,)
op: relu, weight: nothing, bias: nothing
op: gemm, weight: (20, 20), bias: (20,)
op: relu, weight: nothing, bias: nothing
op: gemm, weight: (20, 20), bias: (20,)
op: relu, weight: nothing, bias: nothing
op: gemm, weight: (20, 20), bias: (20,)
op: relu, weight: nothing, bias: nothing
op: gemm, weight: (5, 20), bias: (5,)
Distance: 15.020209498878103
Distance: 29.65857770416187
Distance: 23.686798373353668
Distance: 25.927283467026427
Distance: 5.395627950318158
Running with 1 threads
[Thread 1] Time to first task: 0.0s
Zono Bounds:
[0.0, 0.0, 0.0, 0.0, 0.0, 0.0, 0.0, 0.0, 0.0, 0.0, 0.0, 0.0, 0.0, 0.0, 0.0, 0.0]
[0.0, 0.0, 0.0, 0.0, 0.0, 0.0, 0.0, 0.0, 0.0, 0.0, 0.0, 0.0, 0.0, 0.0, 0.0, 0.0]
[TOP-1] did not find required confidence yet.
Found cex
N1: 1.0 (vs. 6.127994366487245e-30)
N2: 0.9999999999931972
N1 Probability: 1.0 >= 0.99

Found counterexample: ([-2.0, -2.0, -2.0, -2.0, 2.0, -2.0, 2.0, -2.0, -2.0, -2.0, -2.0, 2.0, 2.0, -2.0, 2.0, -2.0], (4, 1))
[Thread 1] Total splits: 0
Processed 1 zonotopes (Work Done: 0.0%); Generated 0 (0.001919638s/loop)
[Thread 1] Finished in 0.0s
 ────────────────────────────────────────────────────────────────────────────────
                                        Time                    Allocations      
                               ───────────────────────   ────────────────────────
       Tot / % measured:           1.98ms /  99.8%            890KiB /  99.8%    

 Section               ncalls     time    %tot     avg     alloc    %tot      avg
 ────────────────────────────────────────────────────────────────────────────────
 Verify                     1   1.94ms   98.2%  1.94ms    866KiB   97.5%   866KiB
   Zonotope Loop            1   1.92ms   97.4%  1.92ms    862KiB   97.1%   862KiB
     Property Check         1   1.66ms   84.2%  1.66ms    373KiB   42.0%   373KiB
     Zonotope Propa...      1    211μs   10.7%   211μs    451KiB   50.8%   451KiB
       DiffZonotope...      4    165μs    8.4%  41.4μs    379KiB   42.7%  94.9KiB
         Zonotope_R...      8    153μs    7.8%  19.2μs    369KiB   41.6%  46.2KiB
           Influenc...      8   69.3μs    3.5%  8.67μs    188KiB   21.2%  23.5KiB
             Multiply       8   46.3μs    2.4%  5.79μs    121KiB   13.6%  15.1KiB
             Alloca...      8   14.4μs    0.7%  1.80μs   64.5KiB    7.3%  8.06KiB
             Set Ma...      8   3.78μs    0.2%   472ns     0.00B    0.0%    0.00B
           Column M...      8   26.8μs    1.4%  3.34μs   81.4KiB    9.2%  10.2KiB
           Allocation       8   23.5μs    1.2%  2.94μs   80.4KiB    9.1%  10.0KiB
           Set Matrix       8   14.3μs    0.7%  1.78μs   5.69KiB    0.6%     728B
           Vectors          8   10.3μs    0.5%  1.29μs   9.50KiB    1.1%  1.19KiB
           Bounds           8   1.42μs    0.1%   177ns     0.00B    0.0%    0.00B
       DiffZonotope...      5   37.7μs    1.9%  7.53μs   69.3KiB    7.8%  13.9KiB
         Zonotope_D...     10   35.6μs    1.8%  3.56μs   68.2KiB    7.7%  6.83KiB
 Initialize                 1   36.3μs    1.8%  36.3μs   22.4KiB    2.5%  22.4KiB
 ────────────────────────────────────────────────────────────────────────────────[VERYDIFF_TIMER] 0.003440497
[VERYDIFF_EXPERIMENT] Sigma: 3.0
Parsing new_benchmarks/lhc/nets/4_20-1.onnx...
Found input X
WARNING: Operation Softmax is not supported
WE ARE IGNORING THIS OPERATION -- IF YOU DO NOT KNOW WHAT YOU ARE DOING THIS MAY BE UNSOUND!
op: gemm, weight: (20, 16), bias: (20,)
op: relu, weight: nothing, bias: nothing
op: gemm, weight: (20, 20), bias: (20,)
op: relu, weight: nothing, bias: nothing
op: gemm, weight: (20, 20), bias: (20,)
op: relu, weight: nothing, bias: nothing
op: gemm, weight: (20, 20), bias: (20,)
op: relu, weight: nothing, bias: nothing
op: gemm, weight: (5, 20), bias: (5,)
Parsing new_benchmarks/lhc/nets_pruned/4_20-1-0.1.onnx...
Found input X
WARNING: Operation Softmax is not supported
WE ARE IGNORING THIS OPERATION -- IF YOU DO NOT KNOW WHAT YOU ARE DOING THIS MAY BE UNSOUND!
op: gemm, weight: (20, 16), bias: (20,)
op: relu, weight: nothing, bias: nothing
op: gemm, weight: (20, 20), bias: (20,)
op: relu, weight: nothing, bias: nothing
op: gemm, weight: (20, 20), bias: (20,)
op: relu, weight: nothing, bias: nothing
op: gemm, weight: (20, 20), bias: (20,)
op: relu, weight: nothing, bias: nothing
op: gemm, weight: (5, 20), bias: (5,)
Distance: 15.020209498878103
Distance: 29.65857770416187
Distance: 23.686798373353668
Distance: 25.927283467026427
Distance: 5.395627950318158
Running with 1 threads
[Thread 1] Time to first task: 0.0s
Zono Bounds:
[0.0, 0.0, 0.0, 0.0, 0.0, 0.0, 0.0, 0.0, 0.0, 0.0, 0.0, 0.0, 0.0, 0.0, 0.0, 0.0]
[0.0, 0.0, 0.0, 0.0, 0.0, 0.0, 0.0, 0.0, 0.0, 0.0, 0.0, 0.0, 0.0, 0.0, 0.0, 0.0]
[TOP-1] required confidence (0.9996232025112445≥0.99) is feasible for index 1
Found cex
N1: 1.0 (vs. 1.0189588842486958e-56)
N2: 1.0
N1 Probability: 1.0 >= 0.99

Found counterexample: ([-3.0, -3.0, 3.0, -3.0, 3.0, -3.0, 3.0, -3.0, -3.0, 3.0, -3.0, 3.0, -3.0, 3.0, 0.0, -3.0], (2, 4))
[Thread 1] Total splits: 1
Processed 2 zonotopes (Work Done: 0.0%); Generated 2 (0.0098626545s/loop)
[Thread 1] Finished in 0.02s
 ────────────────────────────────────────────────────────────────────────────────
                                        Time                    Allocations      
                               ───────────────────────   ────────────────────────
       Tot / % measured:           19.8ms / 100.0%           5.29MiB / 100.0%    

 Section               ncalls     time    %tot     avg     alloc    %tot      avg
 ────────────────────────────────────────────────────────────────────────────────
 Verify                     1   19.7ms   99.8%  19.7ms   5.26MiB   99.6%  5.26MiB
   Zonotope Loop            1   19.7ms   99.7%  19.7ms   5.26MiB   99.5%  5.26MiB
     Property Check         2   19.2ms   97.3%  9.62ms   4.30MiB   81.4%  2.15MiB
     Zonotope Propa...      2    386μs    2.0%   193μs    892KiB   16.5%   446KiB
       DiffZonotope...      8    305μs    1.5%  38.1μs    752KiB   13.9%  93.9KiB
         Zonotope_R...     16    281μs    1.4%  17.6μs    732KiB   13.5%  45.8KiB
           Influenc...     16    131μs    0.7%  8.18μs    374KiB    6.9%  23.3KiB
             Multiply      16   87.2μs    0.4%  5.45μs    242KiB    4.5%  15.1KiB
             Alloca...     16   27.8μs    0.1%  1.74μs    129KiB    2.4%  8.06KiB
             Set Ma...     16   7.72μs    0.0%   482ns     0.00B    0.0%    0.00B
           Column M...     16   52.5μs    0.3%  3.28μs    163KiB    3.0%  10.2KiB
           Allocation      16   36.8μs    0.2%  2.30μs    161KiB    3.0%  10.0KiB
           Set Matrix      16   27.3μs    0.1%  1.70μs   11.4KiB    0.2%     728B
           Vectors         16   18.3μs    0.1%  1.14μs   19.0KiB    0.4%  1.19KiB
           Bounds          16   3.05μs    0.0%   190ns     0.00B    0.0%    0.00B
       DiffZonotope...     10   67.2μs    0.3%  6.72μs    138KiB    2.5%  13.8KiB
         Zonotope_D...     20   64.0μs    0.3%  3.20μs    136KiB    2.5%  6.83KiB
     Compute Split          1   35.9μs    0.2%  35.9μs   38.6KiB    0.7%  38.6KiB
 Initialize                 1   34.1μs    0.2%  34.1μs   22.4KiB    0.4%  22.4KiB
 ────────────────────────────────────────────────────────────────────────────────[VERYDIFF_TIMER] 0.021127933
