
[VERYDIFF_EXPERIMENT] Running on /home/i57/steuber/NeuroDiff/repos/VeryDiffExperiments/src/../benchmarks/mnist-prune/specs/mnist_24_global_5.vnnlib /home/i57/steuber/NeuroDiff/repos/VeryDiffExperiments/src/../benchmarks/mnist-prune/nets/mnist_relu_3_100.onnx
Found input X
op: matmul, weight: (100, 784), bias: nothing
op: bias, weight: nothing, bias: (100,)
op: relu, weight: nothing, bias: nothing
op: matmul, weight: (100, 100), bias: nothing
op: bias, weight: nothing, bias: (100,)
op: relu, weight: nothing, bias: nothing
op: matmul, weight: (10, 100), bias: nothing
op: bias, weight: nothing, bias: (10,)
op: relu, weight: nothing, bias: nothing
op: matmul, weight: (10, 10), bias: nothing
op: bias, weight: nothing, bias: (10,)
Found input X
op: gemm, weight: (100, 784), bias: (100,)
op: relu, weight: nothing, bias: nothing
op: gemm, weight: (100, 100), bias: (100,)
op: relu, weight: nothing, bias: nothing
op: gemm, weight: (10, 100), bias: (10,)
op: relu, weight: nothing, bias: nothing
op: gemm, weight: (10, 10), bias: (10,)
Distance: 368.62397500800625
Distance: 47.56803950402309
Distance: 2.8977568827249343
Distance: 0.01885471428334995
Running with 1 threads
[Thread 1] Time to first task: 0.0s
Instable Generators: 52
Instable Generators: 81
Instable Generators: 9
Zono Bounds:
[-1.8358715698570298, -1.9829259364598644, -2.1709698768189805, -1.9800276625565454, -2.1364139037004546, -2.2696316133843086, -2.2133696114982473, -2.245747631923593, -1.9709420886901825, -2.1272703764972496]
[1.8205986593203136, 1.7990414330819362, 2.0857894914212656, 1.9788839329690102, 2.3256221909244448, 2.206650978380359, 2.1647152289551026, 2.2278747022283962, 1.9703311620230515, 2.119985543604768]
[Thread 1] Processed 100 zonotopes (Work Done: 0.0%; Expected Zonos: Inf)
[Thread 1] Processed 200 zonotopes (Work Done: 0.0%; Expected Zonos: Inf)
[Thread 1] Processed 300 zonotopes (Work Done: 0.0%; Expected Zonos: Inf)
[Thread 1] Processed 400 zonotopes (Work Done: 0.0%; Expected Zonos: Inf)
[Thread 1] Processed 500 zonotopes (Work Done: 0.0%; Expected Zonos: Inf)


TIMEOUT REACHED
UNKNOWN
[Thread 1] Total splits: 555
Processed 555 zonotopes (Work Done: 0.0%); Generated 1110 (0.21671068644324326s/loop)
[Thread 1] Finished in 120.27s
 ────────────────────────────────────────────────────────────────────────────────
                                        Time                    Allocations      
                               ───────────────────────   ────────────────────────
       Tot / % measured:             120s / 100.0%           61.6GiB / 100.0%    

 Section               ncalls     time    %tot     avg     alloc    %tot      avg
 ────────────────────────────────────────────────────────────────────────────────
 Verify                     1     120s  100.0%    120s   61.6GiB  100.0%  61.6GiB
   Zonotope Loop            1     120s  100.0%    120s   61.6GiB  100.0%  61.6GiB
     Zonotope Propa...    555     112s   93.4%   202ms   42.0GiB   68.1%  77.4MiB
       DiffZonotope...  2.22k    77.6s   64.5%  34.9ms   2.31GiB    3.7%  1.06MiB
         Zonotope_D...  4.44k    72.5s   60.3%  16.3ms   1.50GiB    2.4%   353KiB
       DiffZonotope...  1.67k    34.8s   28.9%  20.9ms   39.7GiB   64.4%  24.4MiB
         Zonotope_R...  3.33k    34.2s   28.4%  10.3ms   38.7GiB   62.8%  11.9MiB
           Influenc...  3.33k    33.2s   27.6%  10.0ms   35.6GiB   57.8%  11.0MiB
             Alloca...  3.33k    18.3s   15.2%  5.49ms   17.3GiB   28.1%  5.33MiB
             Multiply   3.33k    12.4s   10.3%  3.71ms   18.3GiB   29.7%  5.62MiB
             Set Ma...  3.33k    2.52s    2.1%   758μs     0.00B    0.0%    0.00B
           Column M...  3.33k    459ms    0.4%   138μs   1.52GiB    2.5%   480KiB
           Allocation   3.33k    357ms    0.3%   107μs   1.52GiB    2.5%   480KiB
           Set Matrix   3.33k    193ms    0.2%  57.9μs   4.71MiB    0.0%  1.45KiB
           Vectors      3.33k   17.1ms    0.0%  5.15μs   10.6MiB    0.0%  3.26KiB
           Bounds       3.33k   2.47ms    0.0%   743ns     0.00B    0.0%    0.00B
     Compute Split        555    4.19s    3.5%  7.55ms   8.73GiB   14.2%  16.1MiB
     Property Check       555    115ms    0.1%   206μs    119MiB    0.2%   220KiB
 Initialize                 1    528μs    0.0%   528μs   5.41MiB    0.0%  5.41MiB
 ────────────────────────────────────────────────────────────────────────────────
[VERYDIFF_TIMER] 120.303786642

[VERYDIFF_EXPERIMENT] NETWORK: /home/i57/steuber/NeuroDiff/repos/VeryDiffExperiments/src/../benchmarks/mnist-prune/specs/mnist_24_global_5.vnnlib
[VERYDIFF_EXPERIMENT] TIME: 120.768269072
