Network: ./acas-prune/nets/product_ACASXU_run2a_5_2_batch_2000_ACASXU_run2a_5_2_batch_2000_pruned5_eps.onnx
Property: ./acas-prune/specs/product_prop_2_eps_0.05.vnnlib

Engine::processInputQuery: Input query (before preprocessing): 615 equations, 1220 variables
Engine::processInputQuery: Input query (after preprocessing): 1181 equations, 1700 variables

Input bounds:
	x0: [  0.6000,   0.6799] 
	x1: [ -0.5000,   0.5000] 
	x2: [ -0.5000,   0.5000] 
	x3: [  0.4500,   0.5000] 
	x4: [ -0.5000,  -0.4500] 

Branching heuristics set to LargestInterval

Engine::solve: Initial statistics

05:06:01 Statistics update:
	--- Time Statistics ---
	Total time elapsed: 235 milli (00:00:00)
		Main loop: 0 milli (00:00:00)
		Preprocessing time: 168 milli (00:00:00)
		Unknown: 66 milli (00:00:00)
	Breakdown for main loop:
		[0.00%] Simplex steps: 0 milli
		[0.00%] Explicit-basis bound tightening: 0 milli
		[0.00%] Constraint-matrix bound tightening: 0 milli
		[0.00%] Degradation checking: 0 milli
		[0.00%] Precision restoration: 0 milli
		[0.00%] Statistics handling: 0 milli
		[0.00%] Constraint-fixing steps: 0 milli
		[0.00%] Valid case splits: 0 milli. Average per split: 0.00 milli
		[0.00%] Applying stored bound-tightening: 0 milli
		[0.00%] SMT core: 0 milli
		[0.00%] Symbolic Bound Tightening: 17 milli
		[0.00%] SoI-based local search: 0 milli
		[0.00%] SoI-based local search: 0 milli
		[0.00%] Unaccounted for: 0 milli
	--- Preprocessor Statistics ---
	Number of preprocessor bound-tightening loop iterations: 8
	Number of eliminated variables: 120
	Number of constraints removed due to variable elimination: 86
	Number of equations removed due to variable elimination: 0
	--- Engine Statistics ---
	Number of main loop iterations: 1
		0 iterations were simplex steps. Total time: 0 milli. Average: 0.00 milli.
		0 iterations were constraint-fixing steps. Total time: 0 milli. Average: 0.00 milli
	Number of active piecewise-linear constraints: 502 / 515
		Constraints disabled by valid splits: 13. By SMT-originated splits: 0
	Last reported degradation: 0.0000000000. Max degradation so far: 0.0000000000. Restorations so far: 0
	Number of simplex pivots we attempted to skip because of instability: 0.
	Unstable pivots performed anyway: 0
	--- Tableau Statistics ---
	Total number of pivots performed: 0
		Real pivots: 0. Degenerate: 0 (0.00%)
		Degenerate pivots by request (e.g., to fix a PL constraint): 0 (0.00%)
		Average time per pivot: 0.00 milli
	Total number of fake pivots performed: 0
	Total number of rows added: 0. Number of merged columns: 0
	Current tableau dimensions: M = 1181, N = 2881
	--- SMT Core Statistics ---
	Total depth is 0. Total visited states: 1. Number of splits: 0. Number of pops: 0
	Max stack depth: 0
	--- Bound Tightening Statistics ---
	Number of tightened bounds: 0.
		Number of rows examined by row tightener: 0. Consequent tightenings: 0
		Number of explicit basis matrices examined by row tightener: 0. Consequent tightenings: 0
		Number of bound tightening rounds on the entire constraint matrix: 0. Consequent tightenings: 0
		Number of bound notifications sent to PL constraints: 3094. Tightenings proposed: 0
	--- Basis Factorization statistics ---
	Number of basis refactorizations: 2
	--- Projected Steepest Edge Statistics ---
	Number of iterations: 0.
	Number of resets to reference space: 1. Avg. iterations per reset: 0
	--- SBT ---
	Number of tightened bounds: 1454
	--- SoI-based local search ---
	Number of proposed phase pattern update: 0. Number of accepted update: 0 [0.00%]
	Total time (% of local search time) updating SoI phase pattern : 0 milli [0.00%]
	Total time obtaining current assignment: 0 milli [0.00%]
	Total time getting SoI phase pattern : 0 milli [0.00%]
	--- Context dependent statistics ---
	Number of pushes / pops: 0 / 0
		[0.00%] Pre-Push hook: 0 milli
		[0.00%] Push : 0 milli
		[0.00%] Post-Pop hook: 0 milli
		[0.00%] Pop : 0 milli
		[0.00%] Total context-switching time: 0 milli
	--- Proof Certificate ---
	Number of certified leaves: 0
	Number of leaves to delegate: 0

---

05:06:13 Statistics update:
	--- Time Statistics ---
	Total time elapsed: 11897 milli (00:00:11)
		Main loop: 11634 milli (00:00:11)
		Preprocessing time: 168 milli (00:00:00)
		Unknown: 94 milli (00:00:00)
	Breakdown for main loop:
		[42.46%] Simplex steps: 4939 milli
		[36.56%] Explicit-basis bound tightening: 4253 milli
		[0.00%] Constraint-matrix bound tightening: 0 milli
		[0.38%] Degradation checking: 43 milli
		[0.00%] Precision restoration: 0 milli
		[0.27%] Statistics handling: 30 milli
		[0.00%] Constraint-fixing steps: 0 milli
		[0.08%] Valid case splits: 8 milli. Average per split: 0.00 milli
		[0.02%] Applying stored bound-tightening: 2 milli
		[2.04%] SMT core: 237 milli
		[11.94%] Symbolic Bound Tightening: 1388 milli
		[23.79%] SoI-based local search: 2767 milli
		[0.00%] SoI-based local search: 0 milli
		[6.27%] Unaccounted for: 728 milli
	--- Preprocessor Statistics ---
	Number of preprocessor bound-tightening loop iterations: 8
	Number of eliminated variables: 120
	Number of constraints removed due to variable elimination: 86
	Number of equations removed due to variable elimination: 0
	--- Engine Statistics ---
	Number of main loop iterations: 10000
		9867 iterations were simplex steps. Total time: 4939 milli. Average: 0.50 milli.
		0 iterations were constraint-fixing steps. Total time: 0 milli. Average: 0.00 milli
	Number of active piecewise-linear constraints: 116 / 515
		Constraints disabled by valid splits: 398. By SMT-originated splits: 1
	Last reported degradation: 0.0000000000. Max degradation so far: 0.0000000137. Restorations so far: 0
	Number of simplex pivots we attempted to skip because of instability: 20.
	Unstable pivots performed anyway: 1
	--- Tableau Statistics ---
	Total number of pivots performed: 8743
		Real pivots: 8735. Degenerate: 8 (0.09%)
		Degenerate pivots by request (e.g., to fix a PL constraint): 0 (0.00%)
		Average time per pivot: 0.15 milli
	Total number of fake pivots performed: 553
	Total number of rows added: 0. Number of merged columns: 0
	Current tableau dimensions: M = 1181, N = 2881
	--- SMT Core Statistics ---
	Total depth is 10. Total visited states: 93. Number of splits: 47. Number of pops: 45
	Max stack depth: 14
	--- Bound Tightening Statistics ---
	Number of tightened bounds: 101615.
		Number of rows examined by row tightener: 8743. Consequent tightenings: 111
		Number of explicit basis matrices examined by row tightener: 42. Consequent tightenings: 3059
		Number of bound tightening rounds on the entire constraint matrix: 0. Consequent tightenings: 0
		Number of bound notifications sent to PL constraints: 170902. Tightenings proposed: 0
	--- Basis Factorization statistics ---
	Number of basis refactorizations: 81
	--- Projected Steepest Edge Statistics ---
	Number of iterations: 9315.
	Number of resets to reference space: 48. Avg. iterations per reset: 194
	--- SBT ---
	Number of tightened bounds: 70050
	--- SoI-based local search ---
	Number of proposed phase pattern update: 227. Number of accepted update: 216 [95.15%]
	Total time (% of local search time) updating SoI phase pattern : 16276 milli [0.59%]
	Total time obtaining current assignment: 98335 milli [3.55%]
	Total time getting SoI phase pattern : 12281 milli [0.11%]
	--- Context dependent statistics ---
	Number of pushes / pops: 92 / 82
		[0.04%] Pre-Push hook: 5 milli
		[0.00%] Push : 0 milli
		[0.04%] Post-Pop hook: 5 milli
		[0.03%] Pop : 3 milli
		[0.12%] Total context-switching time: 13 milli
	--- Proof Certificate ---
	Number of certified leaves: 0
	Number of leaves to delegate: 0

05:06:23 Statistics update:
	--- Time Statistics ---
	Total time elapsed: 21882 milli (00:00:21)
		Main loop: 21644 milli (00:00:21)
		Preprocessing time: 168 milli (00:00:00)
		Unknown: 69 milli (00:00:00)
	Breakdown for main loop:
		[45.75%] Simplex steps: 9901 milli
		[28.04%] Explicit-basis bound tightening: 6070 milli
		[0.00%] Constraint-matrix bound tightening: 0 milli
		[0.41%] Degradation checking: 88 milli
		[0.00%] Precision restoration: 0 milli
		[0.28%] Statistics handling: 61 milli
		[0.00%] Constraint-fixing steps: 0 milli
		[0.07%] Valid case splits: 15 milli. Average per split: 0.00 milli
		[0.02%] Applying stored bound-tightening: 4 milli
		[2.72%] SMT core: 589 milli
		[13.77%] Symbolic Bound Tightening: 2980 milli
		[29.80%] SoI-based local search: 6450 milli
		[0.00%] SoI-based local search: 0 milli
		[8.93%] Unaccounted for: 1932 milli
	--- Preprocessor Statistics ---
	Number of preprocessor bound-tightening loop iterations: 8
	Number of eliminated variables: 120
	Number of constraints removed due to variable elimination: 86
	Number of equations removed due to variable elimination: 0
	--- Engine Statistics ---
	Number of main loop iterations: 20000
		19690 iterations were simplex steps. Total time: 9901 milli. Average: 0.50 milli.
		0 iterations were constraint-fixing steps. Total time: 0 milli. Average: 0.00 milli
	Number of active piecewise-linear constraints: 77 / 515
		Constraints disabled by valid splits: 437. By SMT-originated splits: 1
	Last reported degradation: 0.0000000000. Max degradation so far: 0.0000000979. Restorations so far: 0
	Number of simplex pivots we attempted to skip because of instability: 26.
	Unstable pivots performed anyway: 1
	--- Tableau Statistics ---
	Total number of pivots performed: 16973
		Real pivots: 16957. Degenerate: 16 (0.09%)
		Degenerate pivots by request (e.g., to fix a PL constraint): 0 (0.00%)
		Average time per pivot: 0.15 milli
	Total number of fake pivots performed: 1164
	Total number of rows added: 0. Number of merged columns: 0
	Current tableau dimensions: M = 1181, N = 2881
	--- SMT Core Statistics ---
	Total depth is 12. Total visited states: 218. Number of splits: 105. Number of pops: 112
	Max stack depth: 14
	--- Bound Tightening Statistics ---
	Number of tightened bounds: 237669.
		Number of rows examined by row tightener: 16973. Consequent tightenings: 166
		Number of explicit basis matrices examined by row tightener: 62. Consequent tightenings: 4025
		Number of bound tightening rounds on the entire constraint matrix: 0. Consequent tightenings: 0
		Number of bound notifications sent to PL constraints: 362676. Tightenings proposed: 0
	--- Basis Factorization statistics ---
	Number of basis refactorizations: 153
	--- Projected Steepest Edge Statistics ---
	Number of iterations: 18162.
	Number of resets to reference space: 116. Avg. iterations per reset: 156
	--- SBT ---
	Number of tightened bounds: 151034
	--- SoI-based local search ---
	Number of proposed phase pattern update: 658. Number of accepted update: 591 [89.82%]
	Total time (% of local search time) updating SoI phase pattern : 34884 milli [0.54%]
	Total time obtaining current assignment: 292319 milli [4.53%]
	Total time getting SoI phase pattern : 32153 milli [0.15%]
	--- Context dependent statistics ---
	Number of pushes / pops: 217 / 205
		[0.06%] Pre-Push hook: 12 milli
		[0.00%] Push : 0 milli
		[0.06%] Post-Pop hook: 13 milli
		[0.04%] Pop : 8 milli
		[0.16%] Total context-switching time: 33 milli
	--- Proof Certificate ---
	Number of certified leaves: 0
	Number of leaves to delegate: 0

05:06:37 Statistics update:
	--- Time Statistics ---
	Total time elapsed: 35649 milli (00:00:35)
		Main loop: 35408 milli (00:00:35)
		Preprocessing time: 168 milli (00:00:00)
		Unknown: 72 milli (00:00:00)
	Breakdown for main loop:
		[43.65%] Simplex steps: 15455 milli
		[33.39%] Explicit-basis bound tightening: 11822 milli
		[0.00%] Constraint-matrix bound tightening: 0 milli
		[0.38%] Degradation checking: 134 milli
		[0.00%] Precision restoration: 0 milli
		[0.26%] Statistics handling: 92 milli
		[0.00%] Constraint-fixing steps: 0 milli
		[0.06%] Valid case splits: 21 milli. Average per split: 0.00 milli
		[0.02%] Applying stored bound-tightening: 6 milli
		[2.43%] SMT core: 859 milli
		[11.31%] Symbolic Bound Tightening: 4005 milli
		[24.49%] SoI-based local search: 8670 milli
		[0.00%] SoI-based local search: 0 milli
		[8.50%] Unaccounted for: 3010 milli
	--- Preprocessor Statistics ---
	Number of preprocessor bound-tightening loop iterations: 8
	Number of eliminated variables: 120
	Number of constraints removed due to variable elimination: 86
	Number of equations removed due to variable elimination: 0
	--- Engine Statistics ---
	Number of main loop iterations: 30000
		29584 iterations were simplex steps. Total time: 15455 milli. Average: 0.52 milli.
		0 iterations were constraint-fixing steps. Total time: 0 milli. Average: 0.00 milli
	Number of active piecewise-linear constraints: 85 / 515
		Constraints disabled by valid splits: 429. By SMT-originated splits: 1
	Last reported degradation: 0.0000000000. Max degradation so far: 0.0000000979. Restorations so far: 0
	Number of simplex pivots we attempted to skip because of instability: 29.
	Unstable pivots performed anyway: 1
	--- Tableau Statistics ---
	Total number of pivots performed: 25908
		Real pivots: 25883. Degenerate: 25 (0.10%)
		Degenerate pivots by request (e.g., to fix a PL constraint): 0 (0.00%)
		Average time per pivot: 0.16 milli
	Total number of fake pivots performed: 1657
	Total number of rows added: 0. Number of merged columns: 0
	Current tableau dimensions: M = 1181, N = 2881
	--- SMT Core Statistics ---
	Total depth is 10. Total visited states: 302. Number of splits: 137. Number of pops: 164
	Max stack depth: 14
	--- Bound Tightening Statistics ---
	Number of tightened bounds: 310492.
		Number of rows examined by row tightener: 25908. Consequent tightenings: 289
		Number of explicit basis matrices examined by row tightener: 119. Consequent tightenings: 6307
		Number of bound tightening rounds on the entire constraint matrix: 0. Consequent tightenings: 0
		Number of bound notifications sent to PL constraints: 461202. Tightenings proposed: 0
	--- Basis Factorization statistics ---
	Number of basis refactorizations: 234
	--- Projected Steepest Edge Statistics ---
	Number of iterations: 27593.
	Number of resets to reference space: 169. Avg. iterations per reset: 163
	--- SBT ---
	Number of tightened bounds: 194581
	--- SoI-based local search ---
	Number of proposed phase pattern update: 850. Number of accepted update: 763 [89.76%]
	Total time (% of local search time) updating SoI phase pattern : 45838 milli [0.53%]
	Total time obtaining current assignment: 384090 milli [4.43%]
	Total time getting SoI phase pattern : 42270 milli [0.12%]
	--- Context dependent statistics ---
	Number of pushes / pops: 301 / 291
		[0.05%] Pre-Push hook: 16 milli
		[0.00%] Push : 0 milli
		[0.05%] Post-Pop hook: 19 milli
		[0.03%] Pop : 12 milli
		[0.14%] Total context-switching time: 48 milli
	--- Proof Certificate ---
	Number of certified leaves: 0
	Number of leaves to delegate: 0

05:06:49 Statistics update:
	--- Time Statistics ---
	Total time elapsed: 48053 milli (00:00:48)
		Main loop: 47604 milli (00:00:47)
		Preprocessing time: 168 milli (00:00:00)
		Unknown: 280 milli (00:00:00)
	Breakdown for main loop:
		[43.40%] Simplex steps: 20661 milli
		[34.95%] Explicit-basis bound tightening: 16637 milli
		[0.00%] Constraint-matrix bound tightening: 0 milli
		[0.38%] Degradation checking: 180 milli
		[0.00%] Precision restoration: 0 milli
		[0.26%] Statistics handling: 123 milli
		[0.00%] Constraint-fixing steps: 0 milli
		[0.05%] Valid case splits: 25 milli. Average per split: 0.00 milli
		[0.02%] Applying stored bound-tightening: 8 milli
		[2.51%] SMT core: 1194 milli
		[10.84%] Symbolic Bound Tightening: 5157 milli
		[23.46%] SoI-based local search: 11170 milli
		[0.00%] SoI-based local search: 0 milli
		[7.59%] Unaccounted for: 3614 milli
	--- Preprocessor Statistics ---
	Number of preprocessor bound-tightening loop iterations: 8
	Number of eliminated variables: 120
	Number of constraints removed due to variable elimination: 86
	Number of equations removed due to variable elimination: 0
	--- Engine Statistics ---
	Number of main loop iterations: 40000
		39452 iterations were simplex steps. Total time: 20661 milli. Average: 0.52 milli.
		0 iterations were constraint-fixing steps. Total time: 0 milli. Average: 0.00 milli
	Number of active piecewise-linear constraints: 84 / 515
		Constraints disabled by valid splits: 430. By SMT-originated splits: 1
	Last reported degradation: 0.0000000005. Max degradation so far: 0.0000000979. Restorations so far: 0
	Number of simplex pivots we attempted to skip because of instability: 35.
	Unstable pivots performed anyway: 1
	--- Tableau Statistics ---
	Total number of pivots performed: 34231
		Real pivots: 34200. Degenerate: 31 (0.09%)
		Degenerate pivots by request (e.g., to fix a PL constraint): 0 (0.00%)
		Average time per pivot: 0.16 milli
	Total number of fake pivots performed: 2403
	Total number of rows added: 0. Number of merged columns: 0
	Current tableau dimensions: M = 1181, N = 2881
	--- SMT Core Statistics ---
	Total depth is 10. Total visited states: 407. Number of splits: 177. Number of pops: 229
	Max stack depth: 14
	--- Bound Tightening Statistics ---
	Number of tightened bounds: 394775.
		Number of rows examined by row tightener: 34231. Consequent tightenings: 441
		Number of explicit basis matrices examined by row tightener: 163. Consequent tightenings: 9004
		Number of bound tightening rounds on the entire constraint matrix: 0. Consequent tightenings: 0
		Number of bound notifications sent to PL constraints: 578000. Tightenings proposed: 0
	--- Basis Factorization statistics ---
	Number of basis refactorizations: 309
	--- Projected Steepest Edge Statistics ---
	Number of iterations: 36668.
	Number of resets to reference space: 235. Avg. iterations per reset: 156
	--- SBT ---
	Number of tightened bounds: 239656
	--- SoI-based local search ---
	Number of proposed phase pattern update: 1194. Number of accepted update: 1075 [90.03%]
	Total time (% of local search time) updating SoI phase pattern : 60395 milli [0.54%]
	Total time obtaining current assignment: 540480 milli [4.84%]
	Total time getting SoI phase pattern : 55536 milli [0.12%]
	--- Context dependent statistics ---
	Number of pushes / pops: 406 / 396
		[0.05%] Pre-Push hook: 22 milli
		[0.00%] Push : 0 milli
		[0.06%] Post-Pop hook: 26 milli
		[0.03%] Pop : 15 milli
		[0.14%] Total context-switching time: 64 milli
	--- Proof Certificate ---
	Number of certified leaves: 0
	Number of leaves to delegate: 0

05:07:01 Statistics update:
	--- Time Statistics ---
	Total time elapsed: 60213 milli (00:01:00)
		Main loop: 59941 milli (00:00:59)
		Preprocessing time: 168 milli (00:00:00)
		Unknown: 103 milli (00:00:00)
	Breakdown for main loop:
		[42.98%] Simplex steps: 25761 milli
		[35.03%] Explicit-basis bound tightening: 20998 milli
		[0.00%] Constraint-matrix bound tightening: 0 milli
		[0.38%] Degradation checking: 226 milli
		[0.00%] Precision restoration: 0 milli
		[0.26%] Statistics handling: 154 milli
		[0.00%] Constraint-fixing steps: 0 milli
		[0.05%] Valid case splits: 30 milli. Average per split: 0.00 milli
		[0.02%] Applying stored bound-tightening: 10 milli
		[2.57%] SMT core: 1541 milli
		[10.68%] Symbolic Bound Tightening: 6398 milli
		[23.42%] SoI-based local search: 14036 milli
		[0.00%] SoI-based local search: 0 milli
		[8.04%] Unaccounted for: 4818 milli
	--- Preprocessor Statistics ---
	Number of preprocessor bound-tightening loop iterations: 8
	Number of eliminated variables: 120
	Number of constraints removed due to variable elimination: 86
	Number of equations removed due to variable elimination: 0
	--- Engine Statistics ---
	Number of main loop iterations: 50000
		49325 iterations were simplex steps. Total time: 25761 milli. Average: 0.52 milli.
		0 iterations were constraint-fixing steps. Total time: 0 milli. Average: 0.00 milli
	Number of active piecewise-linear constraints: 56 / 515
		Constraints disabled by valid splits: 458. By SMT-originated splits: 1
	Last reported degradation: 0.0000000000. Max degradation so far: 0.0000002063. Restorations so far: 0
	Number of simplex pivots we attempted to skip because of instability: 43.
	Unstable pivots performed anyway: 1
	--- Tableau Statistics ---
	Total number of pivots performed: 42457
		Real pivots: 42411. Degenerate: 46 (0.11%)
		Degenerate pivots by request (e.g., to fix a PL constraint): 0 (0.00%)
		Average time per pivot: 0.16 milli
	Total number of fake pivots performed: 3128
	Total number of rows added: 0. Number of merged columns: 0
	Current tableau dimensions: M = 1181, N = 2881
	--- SMT Core Statistics ---
	Total depth is 12. Total visited states: 511. Number of splits: 218. Number of pops: 292
	Max stack depth: 14
	--- Bound Tightening Statistics ---
	Number of tightened bounds: 480427.
		Number of rows examined by row tightener: 42457. Consequent tightenings: 543
		Number of explicit basis matrices examined by row tightener: 206. Consequent tightenings: 13144
		Number of bound tightening rounds on the entire constraint matrix: 0. Consequent tightenings: 0
		Number of bound notifications sent to PL constraints: 695628. Tightenings proposed: 0
	--- Basis Factorization statistics ---
	Number of basis refactorizations: 381
	--- Projected Steepest Edge Statistics ---
	Number of iterations: 45627.
	Number of resets to reference space: 303. Avg. iterations per reset: 150
	--- SBT ---
	Number of tightened bounds: 289855
	--- SoI-based local search ---
	Number of proposed phase pattern update: 1600. Number of accepted update: 1454 [90.88%]
	Total time (% of local search time) updating SoI phase pattern : 74034 milli [0.53%]
	Total time obtaining current assignment: 722417 milli [5.15%]
	Total time getting SoI phase pattern : 69535 milli [0.12%]
	--- Context dependent statistics ---
	Number of pushes / pops: 515 / 503
		[0.05%] Pre-Push hook: 28 milli
		[0.00%] Push : 0 milli
		[0.06%] Post-Pop hook: 34 milli
		[0.03%] Pop : 19 milli
		[0.14%] Total context-switching time: 82 milli
	--- Proof Certificate ---
	Number of certified leaves: 0
	Number of leaves to delegate: 0

05:07:14 Statistics update:
	--- Time Statistics ---
	Total time elapsed: 72518 milli (00:01:12)
		Main loop: 72270 milli (00:01:12)
		Preprocessing time: 168 milli (00:00:00)
		Unknown: 78 milli (00:00:00)
	Breakdown for main loop:
		[42.78%] Simplex steps: 30918 milli
		[34.62%] Explicit-basis bound tightening: 25019 milli
		[0.00%] Constraint-matrix bound tightening: 0 milli
		[0.38%] Degradation checking: 273 milli
		[0.00%] Precision restoration: 0 milli
		[0.26%] Statistics handling: 187 milli
		[0.00%] Constraint-fixing steps: 0 milli
		[0.05%] Valid case splits: 37 milli. Average per split: 0.00 milli
		[0.02%] Applying stored bound-tightening: 12 milli
		[2.63%] SMT core: 1898 milli
		[11.06%] Symbolic Bound Tightening: 7991 milli
		[24.00%] SoI-based local search: 17345 milli
		[0.00%] SoI-based local search: 0 milli
		[8.21%] Unaccounted for: 5932 milli
	--- Preprocessor Statistics ---
	Number of preprocessor bound-tightening loop iterations: 8
	Number of eliminated variables: 120
	Number of constraints removed due to variable elimination: 86
	Number of equations removed due to variable elimination: 0
	--- Engine Statistics ---
	Number of main loop iterations: 60000
		59191 iterations were simplex steps. Total time: 30918 milli. Average: 0.52 milli.
		0 iterations were constraint-fixing steps. Total time: 0 milli. Average: 0.00 milli
	Number of active piecewise-linear constraints: 71 / 515
		Constraints disabled by valid splits: 443. By SMT-originated splits: 1
	Last reported degradation: 0.0000000000. Max degradation so far: 0.0000107095. Restorations so far: 0
	Number of simplex pivots we attempted to skip because of instability: 44.
	Unstable pivots performed anyway: 1
	--- Tableau Statistics ---
	Total number of pivots performed: 50698
		Real pivots: 50651. Degenerate: 47 (0.09%)
		Degenerate pivots by request (e.g., to fix a PL constraint): 0 (0.00%)
		Average time per pivot: 0.16 milli
	Total number of fake pivots performed: 3730
	Total number of rows added: 0. Number of merged columns: 0
	Current tableau dimensions: M = 1181, N = 2881
	--- SMT Core Statistics ---
	Total depth is 11. Total visited states: 617. Number of splits: 263. Number of pops: 353
	Max stack depth: 16
	--- Bound Tightening Statistics ---
	Number of tightened bounds: 584316.
		Number of rows examined by row tightener: 50698. Consequent tightenings: 614
		Number of explicit basis matrices examined by row tightener: 247. Consequent tightenings: 17984
		Number of bound tightening rounds on the entire constraint matrix: 0. Consequent tightenings: 0
		Number of bound notifications sent to PL constraints: 853555. Tightenings proposed: 0
	--- Basis Factorization statistics ---
	Number of basis refactorizations: 454
	--- Projected Steepest Edge Statistics ---
	Number of iterations: 54471.
	Number of resets to reference space: 372. Avg. iterations per reset: 146
	--- SBT ---
	Number of tightened bounds: 368412
	--- SoI-based local search ---
	Number of proposed phase pattern update: 2055. Number of accepted update: 1872 [91.09%]
	Total time (% of local search time) updating SoI phase pattern : 88806 milli [0.51%]
	Total time obtaining current assignment: 929776 milli [5.36%]
	Total time getting SoI phase pattern : 85492 milli [0.12%]
	--- Context dependent statistics ---
	Number of pushes / pops: 629 / 618
		[0.05%] Pre-Push hook: 34 milli
		[0.00%] Push : 0 milli
		[0.06%] Post-Pop hook: 42 milli
		[0.03%] Pop : 25 milli
		[0.14%] Total context-switching time: 101 milli
	--- Proof Certificate ---
	Number of certified leaves: 0
	Number of leaves to delegate: 0

05:07:26 Statistics update:
	--- Time Statistics ---
	Total time elapsed: 85190 milli (00:01:25)
		Main loop: 84940 milli (00:01:24)
		Preprocessing time: 168 milli (00:00:00)
		Unknown: 81 milli (00:00:00)
	Breakdown for main loop:
		[42.69%] Simplex steps: 36264 milli
		[35.03%] Explicit-basis bound tightening: 29752 milli
		[0.00%] Constraint-matrix bound tightening: 0 milli
		[0.38%] Degradation checking: 319 milli
		[0.00%] Precision restoration: 0 milli
		[0.26%] Statistics handling: 218 milli
		[0.00%] Constraint-fixing steps: 0 milli
		[0.05%] Valid case splits: 44 milli. Average per split: 0.00 milli
		[0.02%] Applying stored bound-tightening: 14 milli
		[2.60%] SMT core: 2206 milli
		[11.07%] Symbolic Bound Tightening: 9404 milli
		[23.51%] SoI-based local search: 19965 milli
		[0.00%] SoI-based local search: 0 milli
		[7.91%] Unaccounted for: 6715 milli
	--- Preprocessor Statistics ---
	Number of preprocessor bound-tightening loop iterations: 8
	Number of eliminated variables: 120
	Number of constraints removed due to variable elimination: 86
	Number of equations removed due to variable elimination: 0
	--- Engine Statistics ---
	Number of main loop iterations: 70000
		69068 iterations were simplex steps. Total time: 36264 milli. Average: 0.53 milli.
		0 iterations were constraint-fixing steps. Total time: 0 milli. Average: 0.00 milli
	Number of active piecewise-linear constraints: 69 / 515
		Constraints disabled by valid splits: 445. By SMT-originated splits: 1
	Last reported degradation: 0.0000000000. Max degradation so far: 0.0000107095. Restorations so far: 0
	Number of simplex pivots we attempted to skip because of instability: 48.
	Unstable pivots performed anyway: 1
	--- Tableau Statistics ---
	Total number of pivots performed: 59260
		Real pivots: 59207. Degenerate: 53 (0.09%)
		Degenerate pivots by request (e.g., to fix a PL constraint): 0 (0.00%)
		Average time per pivot: 0.16 milli
	Total number of fake pivots performed: 4384
	Total number of rows added: 0. Number of merged columns: 0
	Current tableau dimensions: M = 1181, N = 2881
	--- SMT Core Statistics ---
	Total depth is 11. Total visited states: 716. Number of splits: 303. Number of pops: 412
	Max stack depth: 16
	--- Bound Tightening Statistics ---
	Number of tightened bounds: 671102.
		Number of rows examined by row tightener: 59260. Consequent tightenings: 835
		Number of explicit basis matrices examined by row tightener: 292. Consequent tightenings: 24350
		Number of bound tightening rounds on the entire constraint matrix: 0. Consequent tightenings: 0
		Number of bound notifications sent to PL constraints: 987513. Tightenings proposed: 0
	--- Basis Factorization statistics ---
	Number of basis refactorizations: 531
	--- Projected Steepest Edge Statistics ---
	Number of iterations: 63691.
	Number of resets to reference space: 431. Avg. iterations per reset: 147
	--- SBT ---
	Number of tightened bounds: 432092
	--- SoI-based local search ---
	Number of proposed phase pattern update: 2327. Number of accepted update: 2119 [91.06%]
	Total time (% of local search time) updating SoI phase pattern : 103125 milli [0.52%]
	Total time obtaining current assignment: 1058723 milli [5.30%]
	Total time getting SoI phase pattern : 96531 milli [0.11%]
	--- Context dependent statistics ---
	Number of pushes / pops: 728 / 717
		[0.05%] Pre-Push hook: 40 milli
		[0.00%] Push : 0 milli
		[0.06%] Post-Pop hook: 49 milli
		[0.03%] Pop : 29 milli
		[0.14%] Total context-switching time: 118 milli
	--- Proof Certificate ---
	Number of certified leaves: 0
	Number of leaves to delegate: 0

05:07:40 Statistics update:
	--- Time Statistics ---
	Total time elapsed: 98373 milli (00:01:38)
		Main loop: 98122 milli (00:01:38)
		Preprocessing time: 168 milli (00:00:00)
		Unknown: 83 milli (00:00:00)
	Breakdown for main loop:
		[42.24%] Simplex steps: 41445 milli
		[34.74%] Explicit-basis bound tightening: 34088 milli
		[0.00%] Constraint-matrix bound tightening: 0 milli
		[0.37%] Degradation checking: 365 milli
		[0.00%] Precision restoration: 0 milli
		[0.25%] Statistics handling: 249 milli
		[0.00%] Constraint-fixing steps: 0 milli
		[0.05%] Valid case splits: 53 milli. Average per split: 0.00 milli
		[0.02%] Applying stored bound-tightening: 16 milli
		[2.65%] SMT core: 2602 milli
		[11.31%] Symbolic Bound Tightening: 11102 milli
		[23.32%] SoI-based local search: 22881 milli
		[0.00%] SoI-based local search: 0 milli
		[8.36%] Unaccounted for: 8198 milli
	--- Preprocessor Statistics ---
	Number of preprocessor bound-tightening loop iterations: 8
	Number of eliminated variables: 120
	Number of constraints removed due to variable elimination: 86
	Number of equations removed due to variable elimination: 0
	--- Engine Statistics ---
	Number of main loop iterations: 80000
		78909 iterations were simplex steps. Total time: 41445 milli. Average: 0.53 milli.
		0 iterations were constraint-fixing steps. Total time: 0 milli. Average: 0.00 milli
	Number of active piecewise-linear constraints: 54 / 515
		Constraints disabled by valid splits: 460. By SMT-originated splits: 1
	Last reported degradation: 0.0000000000. Max degradation so far: 0.0000107095. Restorations so far: 0
	Number of simplex pivots we attempted to skip because of instability: 48.
	Unstable pivots performed anyway: 1
	--- Tableau Statistics ---
	Total number of pivots performed: 67538
		Real pivots: 67480. Degenerate: 58 (0.09%)
		Degenerate pivots by request (e.g., to fix a PL constraint): 0 (0.00%)
		Average time per pivot: 0.16 milli
	Total number of fake pivots performed: 5112
	Total number of rows added: 0. Number of merged columns: 0
	Current tableau dimensions: M = 1181, N = 2881
	--- SMT Core Statistics ---
	Total depth is 12. Total visited states: 837. Number of splits: 350. Number of pops: 486
	Max stack depth: 16
	--- Bound Tightening Statistics ---
	Number of tightened bounds: 777290.
		Number of rows examined by row tightener: 67538. Consequent tightenings: 926
		Number of explicit basis matrices examined by row tightener: 340. Consequent tightenings: 29505
		Number of bound tightening rounds on the entire constraint matrix: 0. Consequent tightenings: 0
		Number of bound notifications sent to PL constraints: 1136036. Tightenings proposed: 0
	--- Basis Factorization statistics ---
	Number of basis refactorizations: 604
	--- Projected Steepest Edge Statistics ---
	Number of iterations: 72697.
	Number of resets to reference space: 507. Avg. iterations per reset: 143
	--- SBT ---
	Number of tightened bounds: 508656
	--- SoI-based local search ---
	Number of proposed phase pattern update: 2688. Number of accepted update: 2441 [90.81%]
	Total time (% of local search time) updating SoI phase pattern : 119416 milli [0.52%]
	Total time obtaining current assignment: 1225793 milli [5.36%]
	Total time getting SoI phase pattern : 111455 milli [0.11%]
	--- Context dependent statistics ---
	Number of pushes / pops: 851 / 839
		[0.05%] Pre-Push hook: 47 milli
		[0.00%] Push : 0 milli
		[0.06%] Post-Pop hook: 57 milli
		[0.04%] Pop : 34 milli
		[0.14%] Total context-switching time: 139 milli
	--- Proof Certificate ---
	Number of certified leaves: 0
	Number of leaves to delegate: 0

05:07:50 Statistics update:
	--- Time Statistics ---
	Total time elapsed: 108472 milli (00:01:48)
		Main loop: 108033 milli (00:01:48)
		Preprocessing time: 168 milli (00:00:00)
		Unknown: 269 milli (00:00:00)
	Breakdown for main loop:
		[42.90%] Simplex steps: 46342 milli
		[34.27%] Explicit-basis bound tightening: 37019 milli
		[0.00%] Constraint-matrix bound tightening: 0 milli
		[0.38%] Degradation checking: 411 milli
		[0.00%] Precision restoration: 0 milli
		[0.26%] Statistics handling: 280 milli
		[0.00%] Constraint-fixing steps: 0 milli
		[0.05%] Valid case splits: 57 milli. Average per split: 0.00 milli
		[0.02%] Applying stored bound-tightening: 19 milli
		[2.61%] SMT core: 2816 milli
		[11.14%] Symbolic Bound Tightening: 12035 milli
		[24.53%] SoI-based local search: 26499 milli
		[0.00%] SoI-based local search: 0 milli
		[8.38%] Unaccounted for: 9050 milli
	--- Preprocessor Statistics ---
	Number of preprocessor bound-tightening loop iterations: 8
	Number of eliminated variables: 120
	Number of constraints removed due to variable elimination: 86
	Number of equations removed due to variable elimination: 0
	--- Engine Statistics ---
	Number of main loop iterations: 90000
		88776 iterations were simplex steps. Total time: 46342 milli. Average: 0.52 milli.
		0 iterations were constraint-fixing steps. Total time: 0 milli. Average: 0.00 milli
	Number of active piecewise-linear constraints: 42 / 515
		Constraints disabled by valid splits: 471. By SMT-originated splits: 2
	Last reported degradation: 0.0000000000. Max degradation so far: 0.0000107095. Restorations so far: 0
	Number of simplex pivots we attempted to skip because of instability: 49.
	Unstable pivots performed anyway: 1
	--- Tableau Statistics ---
	Total number of pivots performed: 74664
		Real pivots: 74595. Degenerate: 69 (0.09%)
		Degenerate pivots by request (e.g., to fix a PL constraint): 0 (0.00%)
		Average time per pivot: 0.16 milli
	Total number of fake pivots performed: 5856
	Total number of rows added: 0. Number of merged columns: 0
	Current tableau dimensions: M = 1181, N = 2881
	--- SMT Core Statistics ---
	Total depth is 20. Total visited states: 921. Number of splits: 395. Number of pops: 525
	Max stack depth: 22
	--- Bound Tightening Statistics ---
	Number of tightened bounds: 857163.
		Number of rows examined by row tightener: 74664. Consequent tightenings: 1018
		Number of explicit basis matrices examined by row tightener: 367. Consequent tightenings: 33713
		Number of bound tightening rounds on the entire constraint matrix: 0. Consequent tightenings: 0
		Number of bound notifications sent to PL constraints: 1253121. Tightenings proposed: 0
	--- Basis Factorization statistics ---
	Number of basis refactorizations: 664
	--- Projected Steepest Edge Statistics ---
	Number of iterations: 80568.
	Number of resets to reference space: 548. Avg. iterations per reset: 147
	--- SBT ---
	Number of tightened bounds: 557442
	--- SoI-based local search ---
	Number of proposed phase pattern update: 3654. Number of accepted update: 3367 [92.15%]
	Total time (% of local search time) updating SoI phase pattern : 136315 milli [0.51%]
	Total time obtaining current assignment: 1642388 milli [6.20%]
	Total time getting SoI phase pattern : 132929 milli [0.12%]
	--- Context dependent statistics ---
	Number of pushes / pops: 936 / 916
		[0.05%] Pre-Push hook: 51 milli
		[0.00%] Push : 0 milli
		[0.06%] Post-Pop hook: 62 milli
		[0.04%] Pop : 38 milli
		[0.14%] Total context-switching time: 152 milli
	--- Proof Certificate ---
	Number of certified leaves: 0
	Number of leaves to delegate: 0

05:08:01 Statistics update:
	--- Time Statistics ---
	Total time elapsed: 119505 milli (00:01:59)
		Main loop: 119097 milli (00:01:59)
		Preprocessing time: 168 milli (00:00:00)
		Unknown: 238 milli (00:00:00)
	Breakdown for main loop:
		[43.12%] Simplex steps: 51354 milli
		[34.47%] Explicit-basis bound tightening: 41054 milli
		[0.00%] Constraint-matrix bound tightening: 0 milli
		[0.38%] Degradation checking: 458 milli
		[0.00%] Precision restoration: 0 milli
		[0.26%] Statistics handling: 310 milli
		[0.00%] Constraint-fixing steps: 0 milli
		[0.05%] Valid case splits: 60 milli. Average per split: 0.00 milli
		[0.02%] Applying stored bound-tightening: 21 milli
		[2.52%] SMT core: 2995 milli
		[10.75%] Symbolic Bound Tightening: 12798 milli
		[25.20%] SoI-based local search: 30014 milli
		[0.00%] SoI-based local search: 0 milli
		[8.43%] Unaccounted for: 10044 milli
	--- Preprocessor Statistics ---
	Number of preprocessor bound-tightening loop iterations: 8
	Number of eliminated variables: 120
	Number of constraints removed due to variable elimination: 86
	Number of equations removed due to variable elimination: 0
	--- Engine Statistics ---
	Number of main loop iterations: 100000
		98677 iterations were simplex steps. Total time: 51354 milli. Average: 0.52 milli.
		0 iterations were constraint-fixing steps. Total time: 0 milli. Average: 0.00 milli
	Number of active piecewise-linear constraints: 40 / 515
		Constraints disabled by valid splits: 473. By SMT-originated splits: 2
	Last reported degradation: 0.0000000000. Max degradation so far: 0.0000107095. Restorations so far: 0
	Number of simplex pivots we attempted to skip because of instability: 49.
	Unstable pivots performed anyway: 1
	--- Tableau Statistics ---
	Total number of pivots performed: 81783
		Real pivots: 81703. Degenerate: 80 (0.10%)
		Degenerate pivots by request (e.g., to fix a PL constraint): 0 (0.00%)
		Average time per pivot: 0.16 milli
	Total number of fake pivots performed: 6606
	Total number of rows added: 0. Number of merged columns: 0
	Current tableau dimensions: M = 1181, N = 2881
	--- SMT Core Statistics ---
	Total depth is 21. Total visited states: 988. Number of splits: 429. Number of pops: 558
	Max stack depth: 25
	--- Bound Tightening Statistics ---
	Number of tightened bounds: 923531.
		Number of rows examined by row tightener: 81783. Consequent tightenings: 1172
		Number of explicit basis matrices examined by row tightener: 403. Consequent tightenings: 45724
		Number of bound tightening rounds on the entire constraint matrix: 0. Consequent tightenings: 0
		Number of bound notifications sent to PL constraints: 1359244. Tightenings proposed: 0
	--- Basis Factorization statistics ---
	Number of basis refactorizations: 723
	--- Projected Steepest Edge Statistics ---
	Number of iterations: 88437.
	Number of resets to reference space: 583. Avg. iterations per reset: 151
	--- SBT ---
	Number of tightened bounds: 600579
	--- SoI-based local search ---
	Number of proposed phase pattern update: 4653. Number of accepted update: 4333 [93.12%]
	Total time (% of local search time) updating SoI phase pattern : 148253 milli [0.49%]
	Total time obtaining current assignment: 2070128 milli [6.90%]
	Total time getting SoI phase pattern : 150465 milli [0.13%]
	--- Context dependent statistics ---
	Number of pushes / pops: 1003 / 982
		[0.05%] Pre-Push hook: 55 milli
		[0.00%] Push : 0 milli
		[0.06%] Post-Pop hook: 66 milli
		[0.04%] Pop : 42 milli
		[0.14%] Total context-switching time: 164 milli
	--- Proof Certificate ---
	Number of certified leaves: 0
	Number of leaves to delegate: 0


Engine: quitting due to timeout...

Final statistics:

05:08:01 Statistics update:
	--- Time Statistics ---
	Total time elapsed: 120043 milli (00:02:00)
		Main loop: 119789 milli (00:01:59)
		Preprocessing time: 168 milli (00:00:00)
		Unknown: 85 milli (00:00:00)
	Breakdown for main loop:
		[43.19%] Simplex steps: 51738 milli
		[34.27%] Explicit-basis bound tightening: 41054 milli
		[0.00%] Constraint-matrix bound tightening: 0 milli
		[0.39%] Degradation checking: 462 milli
		[0.00%] Precision restoration: 0 milli
		[0.26%] Statistics handling: 313 milli
		[0.00%] Constraint-fixing steps: 0 milli
		[0.05%] Valid case splits: 60 milli. Average per split: 0.00 milli
		[0.02%] Applying stored bound-tightening: 21 milli
		[2.51%] SMT core: 3011 milli
		[10.71%] Symbolic Bound Tightening: 12829 milli
		[25.43%] SoI-based local search: 30458 milli
		[0.00%] SoI-based local search: 0 milli
		[8.60%] Unaccounted for: 10296 milli
	--- Preprocessor Statistics ---
	Number of preprocessor bound-tightening loop iterations: 8
	Number of eliminated variables: 120
	Number of constraints removed due to variable elimination: 86
	Number of equations removed due to variable elimination: 0
	--- Engine Statistics ---
	Number of main loop iterations: 100986
		99658 iterations were simplex steps. Total time: 51738 milli. Average: 0.52 milli.
		0 iterations were constraint-fixing steps. Total time: 0 milli. Average: 0.00 milli
	Number of active piecewise-linear constraints: 46 / 515
		Constraints disabled by valid splits: 467. By SMT-originated splits: 2
	Last reported degradation: 0.0000000000. Max degradation so far: 0.0000107095. Restorations so far: 0
	Number of simplex pivots we attempted to skip because of instability: 49.
	Unstable pivots performed anyway: 1
	--- Tableau Statistics ---
	Total number of pivots performed: 82312
		Real pivots: 82227. Degenerate: 85 (0.10%)
		Degenerate pivots by request (e.g., to fix a PL constraint): 0 (0.00%)
		Average time per pivot: 0.16 milli
	Total number of fake pivots performed: 6741
	Total number of rows added: 0. Number of merged columns: 0
	Current tableau dimensions: M = 1181, N = 2881
	--- SMT Core Statistics ---
	Total depth is 20. Total visited states: 993. Number of splits: 431. Number of pops: 561
	Max stack depth: 25
	--- Bound Tightening Statistics ---
	Number of tightened bounds: 927052.
		Number of rows examined by row tightener: 82312. Consequent tightenings: 1172
		Number of explicit basis matrices examined by row tightener: 403. Consequent tightenings: 45724
		Number of bound tightening rounds on the entire constraint matrix: 0. Consequent tightenings: 0
		Number of bound notifications sent to PL constraints: 1363721. Tightenings proposed: 0
	--- Basis Factorization statistics ---
	Number of basis refactorizations: 727
	--- Projected Steepest Edge Statistics ---
	Number of iterations: 89101.
	Number of resets to reference space: 586. Avg. iterations per reset: 152
	--- SBT ---
	Number of tightened bounds: 601771
	--- SoI-based local search ---
	Number of proposed phase pattern update: 4810. Number of accepted update: 4487 [93.28%]
	Total time (% of local search time) updating SoI phase pattern : 149068 milli [0.49%]
	Total time obtaining current assignment: 2135168 milli [7.01%]
	Total time getting SoI phase pattern : 153167 milli [0.13%]
	--- Context dependent statistics ---
	Number of pushes / pops: 1008 / 988
		[0.05%] Pre-Push hook: 55 milli
		[0.00%] Push : 0 milli
		[0.06%] Post-Pop hook: 66 milli
		[0.04%] Pop : 42 milli
		[0.14%] Total context-switching time: 165 milli
	--- Proof Certificate ---
	Number of certified leaves: 0
	Number of leaves to delegate: 0
Timeout

real	2m0,113s
user	2m0,149s
sys	0m0,176s
