
[VERYDIFF_EXPERIMENT] Running on /home/i57/steuber/NeuroDiff/repos/VeryDiffExperiments/src/../benchmarks/mnist-prune/specs/mnist_41_local_24.vnnlib /home/i57/steuber/NeuroDiff/repos/VeryDiffExperiments/src/../benchmarks/mnist-prune/nets/mnist_relu_4_1024.onnx
Found input X
op: matmul, weight: (1024, 784), bias: nothing
op: bias, weight: nothing, bias: (1024,)
op: relu, weight: nothing, bias: nothing
op: matmul, weight: (1024, 1024), bias: nothing
op: bias, weight: nothing, bias: (1024,)
op: relu, weight: nothing, bias: nothing
op: matmul, weight: (1024, 1024), bias: nothing
op: bias, weight: nothing, bias: (1024,)
op: relu, weight: nothing, bias: nothing
op: matmul, weight: (10, 1024), bias: nothing
op: bias, weight: nothing, bias: (10,)
op: relu, weight: nothing, bias: nothing
op: matmul, weight: (10, 10), bias: nothing
op: bias, weight: nothing, bias: (10,)
Found input X
op: gemm, weight: (1024, 784), bias: (1024,)
op: relu, weight: nothing, bias: nothing
op: gemm, weight: (1024, 1024), bias: (1024,)
op: relu, weight: nothing, bias: nothing
op: gemm, weight: (1024, 1024), bias: (1024,)
op: relu, weight: nothing, bias: nothing
op: gemm, weight: (10, 1024), bias: (10,)
op: relu, weight: nothing, bias: nothing
op: gemm, weight: (10, 10), bias: (10,)
Distance: 915.6394868631054
Distance: 1298.7052820973968
Distance: 1296.587532894263
Distance: 6.054483317080667
Distance: 0.04942679278974538
Running with 1 threads
[Thread 1] Time to first task: 0.0s
Instable Generators: 590
Instable Generators: 983
Instable Generators: 1024
Instable Generators: 10
Zono Bounds:
[-209.3063587480479, -213.78060832264532, -235.81258051527936, -234.11364188924523, -225.02510443896855, -238.15879102282128, -212.75982401436482, -222.5775999832789, -227.9604594217952, -237.66840872974078]
[209.20626729305997, 213.2200087470893, 235.03750227908915, 233.6556570213117, 224.8864863997729, 237.86233987996013, 212.4694848918786, 221.5773219667887, 228.10667907451264, 237.38756083985314]


TIMEOUT REACHED
UNKNOWN
[Thread 1] Total splits: 88
Processed 88 zonotopes (Work Done: 0.0%); Generated 176 (1.3752511591477272s/loop)
[Thread 1] Finished in 121.02s
 ────────────────────────────────────────────────────────────────────────────────
                                        Time                    Allocations      
                               ───────────────────────   ────────────────────────
       Tot / % measured:             121s / 100.0%           32.1GiB / 100.0%    

 Section               ncalls     time    %tot     avg     alloc    %tot      avg
 ────────────────────────────────────────────────────────────────────────────────
 Verify                     1     121s  100.0%    121s   32.1GiB   99.9%  32.1GiB
   Zonotope Loop            1     121s  100.0%    121s   32.1GiB   99.9%  32.1GiB
     Zonotope Propa...     88     120s   99.2%   1.36s   31.8GiB   99.1%   370MiB
       DiffZonotope...    440    77.1s   63.7%   175ms   7.04GiB   21.9%  16.4MiB
         Zonotope_D...    880    23.8s   19.6%  27.0ms   2.86GiB    8.9%  3.33MiB
       DiffZonotope...    352    42.9s   35.4%   122ms   24.8GiB   77.2%  72.1MiB
         Zonotope_R...    704    29.2s   24.2%  41.5ms   15.5GiB   48.4%  22.6MiB
           Allocation     704    17.2s   14.2%  24.5ms   6.16GiB   19.2%  8.96MiB
           Column M...    704    8.94s    7.4%  12.7ms   6.16GiB   19.2%  8.96MiB
           Influenc...    704    1.95s    1.6%  2.76ms   3.18GiB    9.9%  4.63MiB
             Multiply     704    1.91s    1.6%  2.71ms   2.96GiB    9.2%  4.31MiB
             Alloca...    704   23.6ms    0.0%  33.5μs    228MiB    0.7%   332KiB
             Set Ma...    704   15.0ms    0.0%  21.3μs     0.00B    0.0%    0.00B
           Set Matrix     704    1.09s    0.9%  1.55ms   10.9MiB    0.0%  15.8KiB
           Vectors        704   18.0ms    0.0%  25.6μs   23.4MiB    0.1%  34.0KiB
           Bounds         704    438μs    0.0%   623ns     0.00B    0.0%    0.00B
     Property Check        88    935ms    0.8%  10.6ms   48.1MiB    0.1%   560KiB
     Compute Split         88   61.5ms    0.1%   699μs    130MiB    0.4%  1.47MiB
 Initialize                 1   14.8ms    0.0%  14.8ms   22.4MiB    0.1%  22.4MiB
 ────────────────────────────────────────────────────────────────────────────────
[VERYDIFF_TIMER] 121.11591621

[VERYDIFF_EXPERIMENT] NETWORK: /home/i57/steuber/NeuroDiff/repos/VeryDiffExperiments/src/../benchmarks/mnist-prune/specs/mnist_41_local_24.vnnlib
[VERYDIFF_EXPERIMENT] TIME: 121.375053108
