[VERYDIFF_EXPERIMENT] Sigma: 0.5
Parsing new_benchmarks/rice-1-retrained/nets/2_80.onnx...
Found input onnx::Gemm_0
op: gemm, weight: (80, 7), bias: (80,)
op: relu, weight: nothing, bias: nothing
op: gemm, weight: (80, 80), bias: (80,)
op: relu, weight: nothing, bias: nothing
op: gemm, weight: (2, 80), bias: (2,)
Parsing new_benchmarks/rice-1-retrained/nets_pruned/2_80-0.5.onnx...
Found input onnx::Gemm_0
op: gemm, weight: (80, 7), bias: (80,)
op: relu, weight: nothing, bias: nothing
op: gemm, weight: (80, 80), bias: (80,)
op: relu, weight: nothing, bias: nothing
op: gemm, weight: (2, 80), bias: (2,)
Distance: 55.662090616009664
Distance: 330.32117879329684
Distance: 9.691211663060361
Running with 1 threads
[Thread 1] Time to first task: 0.0s
Zono Bounds:
[0.0, 0.0, 0.0, 0.0, 0.0, 0.0, 0.0]
[0.0, 0.0, 0.0, 0.0, 0.0, 0.0, 0.0]
[TOP-1] did not find required confidence yet.
[TOP-1] required confidence (0.9999999507720388≥0.999999) is feasible for index 2
[Thread 1] Processed 100 zonotopes (Work Done: 34.375%; Expected Zonos: 290.90909090909093)
[Thread 1] Total splits: 97
Processed 195 zonotopes (Work Done: 100.0%); Generated 194 (0.0028104813794871796s/loop)
[Thread 1] Finished in 0.55s
 ────────────────────────────────────────────────────────────────────────────────
                                        Time                    Allocations      
                               ───────────────────────   ────────────────────────
       Tot / % measured:            548ms / 100.0%            299MiB / 100.0%    

 Section               ncalls     time    %tot     avg     alloc    %tot      avg
 ────────────────────────────────────────────────────────────────────────────────
 Verify                     1    548ms  100.0%   548ms    299MiB  100.0%   299MiB
   Zonotope Loop            1    548ms  100.0%   548ms    299MiB  100.0%   299MiB
     Property Check       195    474ms   86.5%  2.43ms    171MiB   57.3%   900KiB
     Zonotope Propa...    195   70.6ms   12.9%   362μs    125MiB   41.8%   657KiB
       DiffZonotope...    390   54.7ms   10.0%   140μs    107MiB   35.9%   282KiB
         Zonotope_R...    780   53.1ms    9.7%  68.0μs    105MiB   35.0%   137KiB
           Influenc...    780   33.5ms    6.1%  43.0μs   19.3MiB    6.5%  25.3KiB
             Multiply     780   32.2ms    5.9%  41.2μs   15.6MiB    5.2%  20.5KiB
             Alloca...    780    697μs    0.1%   893ns   3.66MiB    1.2%  4.81KiB
             Set Ma...    780    264μs    0.0%   339ns     0.00B    0.0%    0.00B
           Column M...    780   7.64ms    1.4%  9.79μs   40.6MiB   13.6%  53.4KiB
           Set Matrix     780   5.11ms    0.9%  6.55μs   1.20MiB    0.4%  1.58KiB
           Allocation     780   3.75ms    0.7%  4.80μs   40.6MiB   13.6%  53.3KiB
           Vectors        780   2.17ms    0.4%  2.78μs   2.82MiB    0.9%  3.70KiB
           Bounds         780    157μs    0.0%   201ns     0.00B    0.0%    0.00B
       DiffZonotope...    585   15.0ms    2.7%  25.6μs   17.7MiB    5.9%  31.0KiB
         Zonotope_D...  1.17k   14.8ms    2.7%  12.6μs   17.7MiB    5.9%  15.5KiB
     Compute Split         97   1.99ms    0.4%  20.5μs   1.98MiB    0.7%  20.9KiB
 Initialize                 1   70.4μs    0.0%  70.4μs   61.7KiB    0.0%  61.7KiB
 ────────────────────────────────────────────────────────────────────────────────[VERYDIFF_TIMER] 0.550698768
[VERYDIFF_EXPERIMENT] Sigma: 1.0
Parsing new_benchmarks/rice-1-retrained/nets/2_80.onnx...
Found input onnx::Gemm_0
op: gemm, weight: (80, 7), bias: (80,)
op: relu, weight: nothing, bias: nothing
op: gemm, weight: (80, 80), bias: (80,)
op: relu, weight: nothing, bias: nothing
op: gemm, weight: (2, 80), bias: (2,)
Parsing new_benchmarks/rice-1-retrained/nets_pruned/2_80-0.5.onnx...
Found input onnx::Gemm_0
op: gemm, weight: (80, 7), bias: (80,)
op: relu, weight: nothing, bias: nothing
op: gemm, weight: (80, 80), bias: (80,)
op: relu, weight: nothing, bias: nothing
op: gemm, weight: (2, 80), bias: (2,)
Distance: 55.662090616009664
Distance: 330.32117879329684
Distance: 9.691211663060361
Running with 1 threads
[Thread 1] Time to first task: 0.0s
Zono Bounds:
[0.0, 0.0, 0.0, 0.0, 0.0, 0.0, 0.0]
[0.0, 0.0, 0.0, 0.0, 0.0, 0.0, 0.0]
[TOP-1] required confidence (0.9999998820329984≥0.999999) is feasible for index 1
[Thread 1] Processed 100 zonotopes (Work Done: 0.0%; Expected Zonos: Inf)
[Thread 1] Processed 200 zonotopes (Work Done: 0.0%; Expected Zonos: Inf)
[Thread 1] Processed 300 zonotopes (Work Done: 0.0%; Expected Zonos: Inf)
[Thread 1] Processed 400 zonotopes (Work Done: 0.0%; Expected Zonos: Inf)
[Thread 1] Processed 500 zonotopes (Work Done: 0.0%; Expected Zonos: Inf)
[Thread 1] Processed 600 zonotopes (Work Done: 0.0%; Expected Zonos: Inf)
[Thread 1] Processed 700 zonotopes (Work Done: 0.39062%; Expected Zonos: 179200.0)
[Thread 1] Processed 800 zonotopes (Work Done: 1.17188%; Expected Zonos: 68266.66666666667)
[Thread 1] Processed 900 zonotopes (Work Done: 1.5625%; Expected Zonos: 57600.0)
[Thread 1] Processed 1000 zonotopes (Work Done: 1.85547%; Expected Zonos: 53894.73684210526)
[Thread 1] Processed 1100 zonotopes (Work Done: 2.44141%; Expected Zonos: 45056.0)
[Thread 1] Processed 1200 zonotopes (Work Done: 3.02734%; Expected Zonos: 39638.709677419356)
[Thread 1] Processed 1300 zonotopes (Work Done: 3.22266%; Expected Zonos: 40339.393939393936)
[Thread 1] Processed 1400 zonotopes (Work Done: 4.10156%; Expected Zonos: 34133.333333333336)
[Thread 1] Processed 1500 zonotopes (Work Done: 5.76172%; Expected Zonos: 26033.898305084746)
[Thread 1] Processed 1600 zonotopes (Work Done: 7.42188%; Expected Zonos: 21557.894736842107)
[Thread 1] Processed 1700 zonotopes (Work Done: 9.0332%; Expected Zonos: 18819.45945945946)
[Thread 1] Processed 1800 zonotopes (Work Done: 10.49805%; Expected Zonos: 17146.04651162791)
[Thread 1] Processed 1900 zonotopes (Work Done: 11.52344%; Expected Zonos: 16488.13559322034)
[Thread 1] Processed 2000 zonotopes (Work Done: 11.91406%; Expected Zonos: 16786.885245901638)
[Thread 1] Processed 2100 zonotopes (Work Done: 12.5%; Expected Zonos: 16800.0)
[Thread 1] Processed 2200 zonotopes (Work Done: 13.64746%; Expected Zonos: 16120.214669051878)
[Thread 1] Processed 2300 zonotopes (Work Done: 15.25879%; Expected Zonos: 15073.28)
[Thread 1] Processed 2400 zonotopes (Work Done: 17.30957%; Expected Zonos: 13865.162200282088)
[Thread 1] Processed 2500 zonotopes (Work Done: 18.33496%; Expected Zonos: 13635.153129161119)
[Thread 1] Processed 2600 zonotopes (Work Done: 19.11621%; Expected Zonos: 13601.021711366539)
[Thread 1] Processed 2700 zonotopes (Work Done: 20.26367%; Expected Zonos: 13324.33734939759)
[Thread 1] Processed 2800 zonotopes (Work Done: 21.28906%; Expected Zonos: 13152.29357798165)
[Thread 1] Processed 2900 zonotopes (Work Done: 22.46094%; Expected Zonos: 12911.304347826086)
[Thread 1] Processed 3000 zonotopes (Work Done: 23.46191%; Expected Zonos: 12786.680541103018)
[Thread 1] Processed 3100 zonotopes (Work Done: 24.10889%; Expected Zonos: 12858.32911392405)
[Thread 1] Processed 3200 zonotopes (Work Done: 25.15869%; Expected Zonos: 12719.262493934983)
[Thread 1] Processed 3300 zonotopes (Work Done: 26.08643%; Expected Zonos: 12650.257370145064)
[Thread 1] Processed 3400 zonotopes (Work Done: 26.9043%; Expected Zonos: 12637.386569872959)
[Thread 1] Processed 3500 zonotopes (Work Done: 27.58789%; Expected Zonos: 12686.725663716814)
[Thread 1] Processed 3600 zonotopes (Work Done: 28.479%; Expected Zonos: 12640.891555936563)
[Thread 1] Processed 3700 zonotopes (Work Done: 29.56543%; Expected Zonos: 12514.616019818332)
[Thread 1] Processed 3800 zonotopes (Work Done: 30.34058%; Expected Zonos: 12524.481995574331)
[Thread 1] Processed 3900 zonotopes (Work Done: 30.97534%; Expected Zonos: 12590.660098522167)
[Thread 1] Processed 4000 zonotopes (Work Done: 31.79321%; Expected Zonos: 12581.301593396045)
[Thread 1] Processed 4100 zonotopes (Work Done: 32.67212%; Expected Zonos: 12548.925835979824)
[Thread 1] Processed 4200 zonotopes (Work Done: 33.44116%; Expected Zonos: 12559.372148202227)
[Thread 1] Processed 4300 zonotopes (Work Done: 34.45435%; Expected Zonos: 12480.283436669619)
[Thread 1] Processed 4400 zonotopes (Work Done: 35.38513%; Expected Zonos: 12434.60112117292)
[Thread 1] Processed 4500 zonotopes (Work Done: 36.55701%; Expected Zonos: 12309.54169797145)
[Thread 1] Processed 4600 zonotopes (Work Done: 37.64954%; Expected Zonos: 12217.946016049282)
[Thread 1] Processed 4700 zonotopes (Work Done: 38.64441%; Expected Zonos: 12162.173260680724)
[Thread 1] Processed 4800 zonotopes (Work Done: 39.78882%; Expected Zonos: 12063.690750115049)
[Thread 1] Processed 4900 zonotopes (Work Done: 41.13159%; Expected Zonos: 11912.984122273334)
[Thread 1] Processed 5000 zonotopes (Work Done: 41.73279%; Expected Zonos: 11980.987202925045)
[Thread 1] Processed 5100 zonotopes (Work Done: 42.85583%; Expected Zonos: 11900.363170262764)
[Thread 1] Processed 5200 zonotopes (Work Done: 43.60046%; Expected Zonos: 11926.478616924476)
[Thread 1] Processed 5300 zonotopes (Work Done: 44.38171%; Expected Zonos: 11941.855188062986)
[Thread 1] Processed 5400 zonotopes (Work Done: 45.19958%; Expected Zonos: 11947.012355681589)
[Thread 1] Processed 5500 zonotopes (Work Done: 46.05865%; Expected Zonos: 11941.295345370218)
[Thread 1] Processed 5600 zonotopes (Work Done: 46.84601%; Expected Zonos: 11954.060128334582)
[Thread 1] Processed 5700 zonotopes (Work Done: 47.67914%; Expected Zonos: 11954.914071750889)
[Thread 1] Processed 5800 zonotopes (Work Done: 48.40546%; Expected Zonos: 11982.120228225578)
[Thread 1] Processed 5900 zonotopes (Work Done: 48.93951%; Expected Zonos: 12055.69793907648)
[Thread 1] Processed 6000 zonotopes (Work Done: 49.71466%; Expected Zonos: 12068.874497406465)
[Thread 1] Processed 6100 zonotopes (Work Done: 50.3067%; Expected Zonos: 12125.621037944737)
[Thread 1] Processed 6200 zonotopes (Work Done: 51.06659%; Expected Zonos: 12141.010547703709)
[Thread 1] Processed 6300 zonotopes (Work Done: 51.93024%; Expected Zonos: 12131.660447212998)
[Thread 1] Processed 6400 zonotopes (Work Done: 52.61688%; Expected Zonos: 12163.396456224806)
[Thread 1] Processed 6500 zonotopes (Work Done: 53.27606%; Expected Zonos: 12200.601460690248)
[Thread 1] Processed 6600 zonotopes (Work Done: 53.83453%; Expected Zonos: 12259.788554746181)
[Thread 1] Processed 6700 zonotopes (Work Done: 54.51813%; Expected Zonos: 12289.490329984046)
[Thread 1] Processed 6800 zonotopes (Work Done: 55.22766%; Expected Zonos: 12312.67060838813)
[Thread 1] Processed 6900 zonotopes (Work Done: 56.13098%; Expected Zonos: 12292.676561735443)
[Thread 1] Processed 7000 zonotopes (Work Done: 56.93054%; Expected Zonos: 12295.684803001875)
[Thread 1] Processed 7100 zonotopes (Work Done: 57.63245%; Expected Zonos: 12319.449298384961)
[Thread 1] Processed 7200 zonotopes (Work Done: 58.51746%; Expected Zonos: 12304.020860495437)
[Thread 1] Processed 7300 zonotopes (Work Done: 59.25446%; Expected Zonos: 12319.748667370535)
[Thread 1] Processed 7400 zonotopes (Work Done: 60.01434%; Expected Zonos: 12330.38570084666)
[Thread 1] Processed 7500 zonotopes (Work Done: 60.73456%; Expected Zonos: 12348.817928296861)
[Thread 1] Processed 7600 zonotopes (Work Done: 61.71875%; Expected Zonos: 12313.924050632912)
[Thread 1] Processed 7700 zonotopes (Work Done: 62.65717%; Expected Zonos: 12289.097240825075)
[Thread 1] Processed 7800 zonotopes (Work Done: 63.5788%; Expected Zonos: 12268.241054071568)
[Thread 1] Processed 7900 zonotopes (Work Done: 64.31732%; Expected Zonos: 12282.849754454224)
[Thread 1] Processed 8000 zonotopes (Work Done: 65.12604%; Expected Zonos: 12283.873386284295)
[Thread 1] Processed 8100 zonotopes (Work Done: 66.05377%; Expected Zonos: 12262.736491949456)
[Thread 1] Processed 8200 zonotopes (Work Done: 66.86554%; Expected Zonos: 12263.417083133658)
[Thread 1] Processed 8300 zonotopes (Work Done: 67.45758%; Expected Zonos: 12304.028591463277)
[Thread 1] Processed 8400 zonotopes (Work Done: 68.24493%; Expected Zonos: 12308.60592509782)
[Thread 1] Processed 8500 zonotopes (Work Done: 68.86139%; Expected Zonos: 12343.637129118748)
[Thread 1] Processed 8600 zonotopes (Work Done: 69.73419%; Expected Zonos: 12332.544145642327)
[Thread 1] Processed 8700 zonotopes (Work Done: 70.51544%; Expected Zonos: 12337.723151494169)
[Thread 1] Processed 8800 zonotopes (Work Done: 71.23566%; Expected Zonos: 12353.364035557459)
[Thread 1] Processed 8900 zonotopes (Work Done: 72.11609%; Expected Zonos: 12341.21281367695)
[Thread 1] Processed 9000 zonotopes (Work Done: 72.91565%; Expected Zonos: 12343.029339136985)
[Thread 1] Processed 9100 zonotopes (Work Done: 73.76862%; Expected Zonos: 12335.86927293412)
[Thread 1] Processed 9200 zonotopes (Work Done: 74.57733%; Expected Zonos: 12336.188235294117)
[Thread 1] Processed 9300 zonotopes (Work Done: 75.45471%; Expected Zonos: 12325.274014155713)
[Thread 1] Processed 9400 zonotopes (Work Done: 76.37024%; Expected Zonos: 12308.45954045954)
[Thread 1] Processed 9500 zonotopes (Work Done: 77.16675%; Expected Zonos: 12311.00213556909)
[Thread 1] Processed 9600 zonotopes (Work Done: 78.06091%; Expected Zonos: 12298.088275538528)
[Thread 1] Processed 9700 zonotopes (Work Done: 78.92914%; Expected Zonos: 12289.504514083554)
[Thread 1] Processed 9800 zonotopes (Work Done: 79.66309%; Expected Zonos: 12301.808152007356)
[Thread 1] Processed 9900 zonotopes (Work Done: 80.52979%; Expected Zonos: 12293.587994542973)
[Thread 1] Processed 10000 zonotopes (Work Done: 81.41785%; Expected Zonos: 12282.31942726489)
[Thread 1] Processed 10100 zonotopes (Work Done: 82.35779%; Expected Zonos: 12263.563938192463)
[Thread 1] Processed 10200 zonotopes (Work Done: 83.1543%; Expected Zonos: 12266.35349383441)
[Thread 1] Processed 10300 zonotopes (Work Done: 83.92944%; Expected Zonos: 12272.21292996873)
[Thread 1] Processed 10400 zonotopes (Work Done: 84.78394%; Expected Zonos: 12266.474695846231)
[Thread 1] Processed 10500 zonotopes (Work Done: 85.61096%; Expected Zonos: 12264.78451502513)
[Thread 1] Processed 10600 zonotopes (Work Done: 86.48071%; Expected Zonos: 12257.06824758275)
[Thread 1] Processed 10700 zonotopes (Work Done: 87.31995%; Expected Zonos: 12253.786740292873)
[Thread 1] Processed 10800 zonotopes (Work Done: 88.15918%; Expected Zonos: 12250.567709775685)
[Thread 1] Processed 10900 zonotopes (Work Done: 89.05334%; Expected Zonos: 12239.854699976011)
[Thread 1] Processed 11000 zonotopes (Work Done: 90.0589%; Expected Zonos: 12214.228833804917)
[Thread 1] Processed 11100 zonotopes (Work Done: 90.90729%; Expected Zonos: 12210.242207563322)
[Thread 1] Processed 11200 zonotopes (Work Done: 91.73737%; Expected Zonos: 12208.765655927213)
[Thread 1] Processed 11300 zonotopes (Work Done: 92.64221%; Expected Zonos: 12197.463517475377)
[Thread 1] Processed 11400 zonotopes (Work Done: 93.43262%; Expected Zonos: 12201.306506401881)
[Thread 1] Processed 11500 zonotopes (Work Done: 94.37256%; Expected Zonos: 12185.745699133358)
[Thread 1] Processed 11600 zonotopes (Work Done: 95.24536%; Expected Zonos: 12179.070810637617)
[Thread 1] Processed 11700 zonotopes (Work Done: 96.27991%; Expected Zonos: 12152.068211353768)
[Thread 1] Processed 11800 zonotopes (Work Done: 97.43042%; Expected Zonos: 12111.2071665727)
[Thread 1] Processed 11900 zonotopes (Work Done: 98.30017%; Expected Zonos: 12105.777529415416)
[Thread 1] Processed 12000 zonotopes (Work Done: 99.27673%; Expected Zonos: 12087.42430297255)
[Thread 1] Total splits: 6042
Processed 12085 zonotopes (Work Done: 100.0%); Generated 12084 (0.002735077057509309s/loop)
[Thread 1] Finished in 33.05s
 ────────────────────────────────────────────────────────────────────────────────
                                        Time                    Allocations      
                               ───────────────────────   ────────────────────────
       Tot / % measured:            33.1s / 100.0%           15.8GiB / 100.0%    

 Section               ncalls     time    %tot     avg     alloc    %tot      avg
 ────────────────────────────────────────────────────────────────────────────────
 Verify                     1    33.1s  100.0%   33.1s   15.8GiB  100.0%  15.8GiB
   Zonotope Loop            1    33.1s  100.0%   33.1s   15.8GiB  100.0%  15.8GiB
     Property Check     12.1k    29.6s   89.6%  2.45ms   9.12GiB   57.5%   791KiB
     Zonotope Propa...  12.1k    3.24s    9.8%   268μs   6.59GiB   41.6%   572KiB
       DiffZonotope...  24.2k    2.18s    6.6%  90.3μs   5.64GiB   35.6%   245KiB
         Zonotope_R...  48.3k    2.08s    6.3%  43.1μs   5.48GiB   34.5%   119KiB
           Column M...  48.3k    651ms    2.0%  13.5μs   2.14GiB   13.5%  46.5KiB
           Influenc...  48.3k    558ms    1.7%  11.5μs   0.96GiB    6.0%  20.8KiB
             Multiply   48.3k    443ms    1.3%  9.17μs    782MiB    4.8%  16.6KiB
             Alloca...  48.3k   72.9ms    0.2%  1.51μs    199MiB    1.2%  4.21KiB
             Set Ma...  48.3k   15.5ms    0.0%   320ns     0.00B    0.0%    0.00B
           Allocation   48.3k    421ms    1.3%  8.71μs   2.14GiB   13.5%  46.4KiB
           Set Matrix   48.3k    268ms    0.8%  5.55μs   66.3MiB    0.4%  1.41KiB
           Vectors      48.3k    134ms    0.4%  2.77μs    175MiB    1.1%  3.70KiB
           Bounds       48.3k   9.50ms    0.0%   196ns     0.00B    0.0%    0.00B
       DiffZonotope...  36.3k    999ms    3.0%  27.6μs   0.95GiB    6.0%  27.5KiB
         Zonotope_D...  72.5k    986ms    3.0%  13.6μs   0.95GiB    6.0%  13.7KiB
     Compute Split      6.04k    125ms    0.4%  20.7μs    113MiB    0.7%  19.2KiB
 Initialize                 1   54.3μs    0.0%  54.3μs   61.7KiB    0.0%  61.7KiB
 ────────────────────────────────────────────────────────────────────────────────[VERYDIFF_TIMER] 33.056196188
[VERYDIFF_EXPERIMENT] Sigma: 2.0
Parsing new_benchmarks/rice-1-retrained/nets/2_80.onnx...
Found input onnx::Gemm_0
op: gemm, weight: (80, 7), bias: (80,)
op: relu, weight: nothing, bias: nothing
op: gemm, weight: (80, 80), bias: (80,)
op: relu, weight: nothing, bias: nothing
op: gemm, weight: (2, 80), bias: (2,)
Parsing new_benchmarks/rice-1-retrained/nets_pruned/2_80-0.5.onnx...
Found input onnx::Gemm_0
op: gemm, weight: (80, 7), bias: (80,)
op: relu, weight: nothing, bias: nothing
op: gemm, weight: (80, 80), bias: (80,)
op: relu, weight: nothing, bias: nothing
op: gemm, weight: (2, 80), bias: (2,)
Distance: 55.662090616009664
Distance: 330.32117879329684
Distance: 9.691211663060361
Running with 1 threads
[Thread 1] Time to first task: 0.0s
Zono Bounds:
[0.0, 0.0, 0.0, 0.0, 0.0, 0.0, 0.0]
[0.0, 0.0, 0.0, 0.0, 0.0, 0.0, 0.0]
[TOP-1] required confidence (0.999999999999977≥0.999999) is feasible for index 1
[Thread 1] Processed 100 zonotopes (Work Done: 0.0%; Expected Zonos: Inf)
[Thread 1] Processed 200 zonotopes (Work Done: 0.0%; Expected Zonos: Inf)
[Thread 1] Processed 300 zonotopes (Work Done: 0.0%; Expected Zonos: Inf)
[Thread 1] Processed 400 zonotopes (Work Done: 0.0%; Expected Zonos: Inf)
[Thread 1] Processed 500 zonotopes (Work Done: 0.0%; Expected Zonos: Inf)
[Thread 1] Processed 600 zonotopes (Work Done: 0.0%; Expected Zonos: Inf)
[Thread 1] Processed 700 zonotopes (Work Done: 0.0%; Expected Zonos: Inf)
[Thread 1] Processed 800 zonotopes (Work Done: 0.0%; Expected Zonos: Inf)
[Thread 1] Processed 900 zonotopes (Work Done: 0.0%; Expected Zonos: Inf)
[Thread 1] Processed 1000 zonotopes (Work Done: 0.0%; Expected Zonos: Inf)
[Thread 1] Processed 1100 zonotopes (Work Done: 0.0%; Expected Zonos: Inf)
[Thread 1] Processed 1200 zonotopes (Work Done: 0.0%; Expected Zonos: Inf)
[Thread 1] Processed 1300 zonotopes (Work Done: 0.0%; Expected Zonos: Inf)
[Thread 1] Processed 1400 zonotopes (Work Done: 0.0%; Expected Zonos: Inf)
[Thread 1] Processed 1500 zonotopes (Work Done: 0.0%; Expected Zonos: Inf)
[Thread 1] Processed 1600 zonotopes (Work Done: 0.0%; Expected Zonos: Inf)
[Thread 1] Processed 1700 zonotopes (Work Done: 0.0%; Expected Zonos: Inf)
[Thread 1] Processed 1800 zonotopes (Work Done: 0.0%; Expected Zonos: Inf)
[Thread 1] Processed 1900 zonotopes (Work Done: 0.0%; Expected Zonos: Inf)
[Thread 1] Processed 2000 zonotopes (Work Done: 0.0%; Expected Zonos: Inf)
[Thread 1] Processed 2100 zonotopes (Work Done: 0.0%; Expected Zonos: Inf)
[Thread 1] Processed 2200 zonotopes (Work Done: 0.0%; Expected Zonos: Inf)
[Thread 1] Processed 2300 zonotopes (Work Done: 0.19531%; Expected Zonos: 1.1776e6)
[Thread 1] Processed 2400 zonotopes (Work Done: 0.19531%; Expected Zonos: 1.2288e6)
[Thread 1] Processed 2500 zonotopes (Work Done: 0.19531%; Expected Zonos: 1.28e6)
[Thread 1] Processed 2600 zonotopes (Work Done: 0.19531%; Expected Zonos: 1.3312e6)
[Thread 1] Processed 2700 zonotopes (Work Done: 0.19531%; Expected Zonos: 1.3824e6)
[Thread 1] Processed 2800 zonotopes (Work Done: 0.39062%; Expected Zonos: 716800.0)
[Thread 1] Processed 2900 zonotopes (Work Done: 0.39062%; Expected Zonos: 742400.0)
[Thread 1] Processed 3000 zonotopes (Work Done: 0.39062%; Expected Zonos: 768000.0)
[Thread 1] Processed 3100 zonotopes (Work Done: 0.58594%; Expected Zonos: 529066.6666666666)
[Thread 1] Processed 3200 zonotopes (Work Done: 0.58594%; Expected Zonos: 546133.3333333334)
[Thread 1] Processed 3300 zonotopes (Work Done: 0.58594%; Expected Zonos: 563200.0)
[Thread 1] Processed 3400 zonotopes (Work Done: 0.58594%; Expected Zonos: 580266.6666666666)
[Thread 1] Processed 3500 zonotopes (Work Done: 0.58594%; Expected Zonos: 597333.3333333334)
[Thread 1] Processed 3600 zonotopes (Work Done: 0.58594%; Expected Zonos: 614400.0)
[Thread 1] Processed 3700 zonotopes (Work Done: 0.78125%; Expected Zonos: 473600.0)
[Thread 1] Processed 3800 zonotopes (Work Done: 0.78125%; Expected Zonos: 486400.0)
[Thread 1] Processed 3900 zonotopes (Work Done: 0.87891%; Expected Zonos: 443733.3333333333)
[Thread 1] Processed 4000 zonotopes (Work Done: 0.92773%; Expected Zonos: 431157.8947368421)
[Thread 1] Processed 4100 zonotopes (Work Done: 0.92773%; Expected Zonos: 441936.84210526315)
[Thread 1] Processed 4200 zonotopes (Work Done: 1.12305%; Expected Zonos: 373982.60869565216)
[Thread 1] Processed 4300 zonotopes (Work Done: 1.41602%; Expected Zonos: 303668.9655172414)
[Thread 1] Processed 4400 zonotopes (Work Done: 1.46484%; Expected Zonos: 300373.3333333333)
[Thread 1] Processed 4500 zonotopes (Work Done: 1.51367%; Expected Zonos: 297290.32258064515)
[Thread 1] Processed 4600 zonotopes (Work Done: 1.75781%; Expected Zonos: 261688.88888888888)
[Thread 1] Processed 4700 zonotopes (Work Done: 1.75781%; Expected Zonos: 267377.77777777775)
[Thread 1] Processed 4800 zonotopes (Work Done: 1.9043%; Expected Zonos: 252061.53846153847)
[Thread 1] Processed 4900 zonotopes (Work Done: 1.9043%; Expected Zonos: 257312.8205128205)
[Thread 1] Processed 5000 zonotopes (Work Done: 1.9043%; Expected Zonos: 262564.10256410256)
[Thread 1] Processed 5100 zonotopes (Work Done: 2.05078%; Expected Zonos: 248685.7142857143)
[Thread 1] Processed 5200 zonotopes (Work Done: 2.05078%; Expected Zonos: 253561.90476190476)
[Thread 1] Processed 5300 zonotopes (Work Done: 2.05078%; Expected Zonos: 258438.09523809524)
[Thread 1] Processed 5400 zonotopes (Work Done: 2.09961%; Expected Zonos: 257190.6976744186)
[Thread 1] Processed 5500 zonotopes (Work Done: 2.14844%; Expected Zonos: 256000.0)
[Thread 1] Processed 5600 zonotopes (Work Done: 2.29492%; Expected Zonos: 244017.02127659574)
[Thread 1] Processed 5700 zonotopes (Work Done: 2.34375%; Expected Zonos: 243200.0)
[Thread 1] Processed 5800 zonotopes (Work Done: 2.49023%; Expected Zonos: 232909.80392156861)
[Thread 1] Processed 5900 zonotopes (Work Done: 2.58789%; Expected Zonos: 227984.90566037735)
[Thread 1] Processed 6000 zonotopes (Work Done: 2.58789%; Expected Zonos: 231849.05660377358)
[Thread 1] Processed 6100 zonotopes (Work Done: 2.58789%; Expected Zonos: 235713.20754716982)
[Thread 1] Processed 6200 zonotopes (Work Done: 2.58789%; Expected Zonos: 239577.35849056602)
[Thread 1] Processed 6300 zonotopes (Work Done: 2.83203%; Expected Zonos: 222455.1724137931)
[Thread 1] Processed 6400 zonotopes (Work Done: 2.92969%; Expected Zonos: 218453.33333333334)
[Thread 1] Processed 6500 zonotopes (Work Done: 2.92969%; Expected Zonos: 221866.66666666666)
[Thread 1] Processed 6600 zonotopes (Work Done: 2.92969%; Expected Zonos: 225280.0)
[Thread 1] Processed 6700 zonotopes (Work Done: 3.02734%; Expected Zonos: 221316.12903225806)
[Thread 1] Processed 6800 zonotopes (Work Done: 3.02734%; Expected Zonos: 224619.35483870967)
[Thread 1] Processed 6900 zonotopes (Work Done: 3.02734%; Expected Zonos: 227922.5806451613)
[Thread 1] Processed 7000 zonotopes (Work Done: 3.32031%; Expected Zonos: 210823.5294117647)
[Thread 1] Processed 7100 zonotopes (Work Done: 3.51562%; Expected Zonos: 201955.55555555556)
[Thread 1] Processed 7200 zonotopes (Work Done: 3.51562%; Expected Zonos: 204800.0)
[Thread 1] Processed 7300 zonotopes (Work Done: 3.51562%; Expected Zonos: 207644.44444444444)
[Thread 1] Processed 7400 zonotopes (Work Done: 3.51562%; Expected Zonos: 210488.88888888888)
[Thread 1] Processed 7500 zonotopes (Work Done: 3.51562%; Expected Zonos: 213333.33333333334)
[Thread 1] Processed 7600 zonotopes (Work Done: 3.51562%; Expected Zonos: 216177.77777777778)
[Thread 1] Processed 7700 zonotopes (Work Done: 3.51562%; Expected Zonos: 219022.22222222222)
[Thread 1] Processed 7800 zonotopes (Work Done: 3.51562%; Expected Zonos: 221866.66666666666)
[Thread 1] Processed 7900 zonotopes (Work Done: 3.51562%; Expected Zonos: 224711.11111111112)
[Thread 1] Processed 8000 zonotopes (Work Done: 3.51562%; Expected Zonos: 227555.55555555556)
[Thread 1] Processed 8100 zonotopes (Work Done: 3.61328%; Expected Zonos: 224172.97297297296)
[Thread 1] Processed 8200 zonotopes (Work Done: 3.66211%; Expected Zonos: 223914.66666666666)
[Thread 1] Processed 8300 zonotopes (Work Done: 3.66211%; Expected Zonos: 226645.33333333334)
[Thread 1] Processed 8400 zonotopes (Work Done: 3.71094%; Expected Zonos: 226357.8947368421)
[Thread 1] Processed 8500 zonotopes (Work Done: 3.71094%; Expected Zonos: 229052.63157894736)
[Thread 1] Processed 8600 zonotopes (Work Done: 3.75977%; Expected Zonos: 228737.66233766233)
[Thread 1] Processed 8700 zonotopes (Work Done: 3.75977%; Expected Zonos: 231397.4025974026)
[Thread 1] Processed 8800 zonotopes (Work Done: 3.90625%; Expected Zonos: 225280.0)
[Thread 1] Processed 8900 zonotopes (Work Done: 3.90625%; Expected Zonos: 227840.0)
[Thread 1] Processed 9000 zonotopes (Work Done: 3.95508%; Expected Zonos: 227555.55555555556)
[Thread 1] Processed 9100 zonotopes (Work Done: 3.95508%; Expected Zonos: 230083.95061728396)
[Thread 1] Processed 9200 zonotopes (Work Done: 3.95508%; Expected Zonos: 232612.34567901236)
[Thread 1] Processed 9300 zonotopes (Work Done: 4.00391%; Expected Zonos: 232273.17073170733)
[Thread 1] Processed 9400 zonotopes (Work Done: 4.00391%; Expected Zonos: 234770.73170731709)
[Thread 1] Processed 9500 zonotopes (Work Done: 4.00391%; Expected Zonos: 237268.29268292684)
[Thread 1] Processed 9600 zonotopes (Work Done: 4.10156%; Expected Zonos: 234057.14285714287)
[Thread 1] Processed 9700 zonotopes (Work Done: 4.10156%; Expected Zonos: 236495.2380952381)
[Thread 1] Processed 9800 zonotopes (Work Done: 4.10156%; Expected Zonos: 238933.33333333334)
[Thread 1] Processed 9900 zonotopes (Work Done: 4.1748%; Expected Zonos: 237136.84210526315)
[Thread 1] Processed 10000 zonotopes (Work Done: 4.27246%; Expected Zonos: 234057.14285714287)
[Thread 1] Processed 10100 zonotopes (Work Done: 4.37012%; Expected Zonos: 231115.08379888267)
[Thread 1] Processed 10200 zonotopes (Work Done: 4.39453%; Expected Zonos: 232106.66666666666)
[Thread 1] Processed 10300 zonotopes (Work Done: 4.58984%; Expected Zonos: 224408.51063829788)
[Thread 1] Processed 10400 zonotopes (Work Done: 4.63867%; Expected Zonos: 224202.1052631579)
[Thread 1] Processed 10500 zonotopes (Work Done: 4.66309%; Expected Zonos: 225172.77486910994)
[Thread 1] Processed 10600 zonotopes (Work Done: 4.71191%; Expected Zonos: 224961.6580310881)
[Thread 1] Processed 10700 zonotopes (Work Done: 4.83398%; Expected Zonos: 221349.49494949495)
[Thread 1] Processed 10800 zonotopes (Work Done: 4.90723%; Expected Zonos: 220083.58208955225)
[Thread 1] Processed 10900 zonotopes (Work Done: 4.95605%; Expected Zonos: 219933.00492610838)
[Thread 1] Processed 11000 zonotopes (Work Done: 5.10254%; Expected Zonos: 215578.94736842104)
[Thread 1] Processed 11100 zonotopes (Work Done: 5.22461%; Expected Zonos: 212456.07476635513)
[Thread 1] Processed 11200 zonotopes (Work Done: 5.37109%; Expected Zonos: 208523.63636363635)
[Thread 1] Processed 11300 zonotopes (Work Done: 5.41992%; Expected Zonos: 208490.0900900901)
[Thread 1] Processed 11400 zonotopes (Work Done: 5.54199%; Expected Zonos: 205702.2026431718)
[Thread 1] Processed 11500 zonotopes (Work Done: 5.61523%; Expected Zonos: 204800.0)
[Thread 1] Processed 11600 zonotopes (Work Done: 5.63965%; Expected Zonos: 205686.5800865801)
[Thread 1] Processed 11700 zonotopes (Work Done: 5.71289%; Expected Zonos: 204800.0)
[Thread 1] Processed 11800 zonotopes (Work Done: 5.71289%; Expected Zonos: 206550.42735042734)
[Thread 1] Processed 11900 zonotopes (Work Done: 5.81055%; Expected Zonos: 204800.0)
[Thread 1] Processed 12000 zonotopes (Work Done: 5.83496%; Expected Zonos: 205656.90376569037)
[Thread 1] Processed 12100 zonotopes (Work Done: 5.83496%; Expected Zonos: 207370.71129707113)
[Thread 1] Processed 12200 zonotopes (Work Done: 5.88379%; Expected Zonos: 207349.377593361)
[Thread 1] Processed 12300 zonotopes (Work Done: 5.88379%; Expected Zonos: 209048.96265560167)
[Thread 1] Processed 12400 zonotopes (Work Done: 6.03027%; Expected Zonos: 205629.14979757086)
[Thread 1] Processed 12500 zonotopes (Work Done: 6.03027%; Expected Zonos: 207287.44939271256)
[Thread 1] Processed 12600 zonotopes (Work Done: 6.0791%; Expected Zonos: 207267.46987951806)
[Thread 1] Processed 12700 zonotopes (Work Done: 6.17676%; Expected Zonos: 205609.4861660079)
[Thread 1] Processed 12800 zonotopes (Work Done: 6.27441%; Expected Zonos: 204003.11284046693)
[Thread 1] Processed 12900 zonotopes (Work Done: 6.54297%; Expected Zonos: 197158.20895522388)
[Thread 1] Processed 13000 zonotopes (Work Done: 6.54297%; Expected Zonos: 198686.5671641791)
[Thread 1] Processed 13100 zonotopes (Work Done: 6.56738%; Expected Zonos: 199470.63197026023)
[Thread 1] Processed 13200 zonotopes (Work Done: 6.61621%; Expected Zonos: 199509.963099631)
[Thread 1] Processed 13300 zonotopes (Work Done: 6.73828%; Expected Zonos: 197379.71014492755)
[Thread 1] Processed 13400 zonotopes (Work Done: 6.7749%; Expected Zonos: 197788.82882882882)
[Thread 1] Processed 13500 zonotopes (Work Done: 6.79932%; Expected Zonos: 198549.37163375225)
[Thread 1] Processed 13600 zonotopes (Work Done: 6.81152%; Expected Zonos: 199661.64874551972)
[Thread 1] Processed 13700 zonotopes (Work Done: 6.83594%; Expected Zonos: 200411.42857142858)
[Thread 1] Processed 13800 zonotopes (Work Done: 6.87256%; Expected Zonos: 200798.57904085258)
[Thread 1] Processed 13900 zonotopes (Work Done: 6.97021%; Expected Zonos: 199419.9649737303)
[Thread 1] Processed 14000 zonotopes (Work Done: 7.06787%; Expected Zonos: 198079.44732297063)
[Thread 1] Processed 14100 zonotopes (Work Done: 7.09229%; Expected Zonos: 198807.57314974183)
[Thread 1] Processed 14200 zonotopes (Work Done: 7.1167%; Expected Zonos: 199530.70325900515)
[Thread 1] Processed 14300 zonotopes (Work Done: 7.21436%; Expected Zonos: 198215.90524534686)
[Thread 1] Processed 14400 zonotopes (Work Done: 7.21436%; Expected Zonos: 199602.03045685278)
[Thread 1] Processed 14500 zonotopes (Work Done: 7.2998%; Expected Zonos: 198635.4515050167)
[Thread 1] Processed 14600 zonotopes (Work Done: 7.32422%; Expected Zonos: 199338.66666666666)
[Thread 1] Processed 14700 zonotopes (Work Done: 7.32422%; Expected Zonos: 200704.0)
[Thread 1] Processed 14800 zonotopes (Work Done: 7.51953%; Expected Zonos: 196820.77922077922)
[Thread 1] Processed 14900 zonotopes (Work Done: 7.58057%; Expected Zonos: 196555.23349436393)
[Thread 1] Processed 15000 zonotopes (Work Done: 7.65381%; Expected Zonos: 195980.86124401915)
[Thread 1] Processed 15100 zonotopes (Work Done: 7.67822%; Expected Zonos: 196660.09538950716)
[Thread 1] Processed 15200 zonotopes (Work Done: 7.70264%; Expected Zonos: 197335.02377179082)
[Thread 1] Processed 15300 zonotopes (Work Done: 7.76367%; Expected Zonos: 197071.69811320756)
[Thread 1] Processed 15400 zonotopes (Work Done: 7.76367%; Expected Zonos: 198359.74842767295)
[Thread 1] Processed 15500 zonotopes (Work Done: 7.8125%; Expected Zonos: 198400.0)
[Thread 1] Processed 15600 zonotopes (Work Done: 7.88574%; Expected Zonos: 197825.38699690404)
[Thread 1] Processed 15700 zonotopes (Work Done: 8.02002%; Expected Zonos: 195760.12176560122)
[Thread 1] Processed 15800 zonotopes (Work Done: 8.08105%; Expected Zonos: 195519.0332326284)
[Thread 1] Processed 15900 zonotopes (Work Done: 8.14209%; Expected Zonos: 195281.5592203898)
[Thread 1] Processed 16000 zonotopes (Work Done: 8.3374%; Expected Zonos: 191906.29575402636)
[Thread 1] Processed 16100 zonotopes (Work Done: 8.44727%; Expected Zonos: 190594.2196531792)
[Thread 1] Processed 16200 zonotopes (Work Done: 8.49609%; Expected Zonos: 190675.8620689655)
[Thread 1] Processed 16300 zonotopes (Work Done: 8.54492%; Expected Zonos: 190756.57142857142)
[Thread 1] Processed 16400 zonotopes (Work Done: 8.56934%; Expected Zonos: 191380.05698005698)
[Thread 1] Processed 16500 zonotopes (Work Done: 8.59375%; Expected Zonos: 192000.0)
[Thread 1] Processed 16600 zonotopes (Work Done: 8.63037%; Expected Zonos: 192343.98868458276)
[Thread 1] Processed 16700 zonotopes (Work Done: 8.8623%; Expected Zonos: 188438.56749311296)
[Thread 1] Processed 16800 zonotopes (Work Done: 8.89893%; Expected Zonos: 188786.83127572018)
[Thread 1] Processed 16900 zonotopes (Work Done: 8.95996%; Expected Zonos: 188616.89373297003)
[Thread 1] Processed 17000 zonotopes (Work Done: 9.14307%; Expected Zonos: 185933.24432576768)
[Thread 1] Processed 17100 zonotopes (Work Done: 9.2041%; Expected Zonos: 185786.73740053052)
[Thread 1] Processed 17200 zonotopes (Work Done: 9.24072%; Expected Zonos: 186132.6287978864)
[Thread 1] Processed 17300 zonotopes (Work Done: 9.32617%; Expected Zonos: 185499.47643979057)
[Thread 1] Processed 17400 zonotopes (Work Done: 9.43604%; Expected Zonos: 184399.4825355757)
[Thread 1] Processed 17500 zonotopes (Work Done: 9.46045%; Expected Zonos: 184980.64516129033)
[Thread 1] Processed 17600 zonotopes (Work Done: 9.63135%; Expected Zonos: 182736.62864385298)
[Thread 1] Processed 17700 zonotopes (Work Done: 9.77783%; Expected Zonos: 181021.72284644196)
[Thread 1] Processed 17800 zonotopes (Work Done: 9.96094%; Expected Zonos: 178698.03921568627)
[Thread 1] Processed 17900 zonotopes (Work Done: 10.00977%; Expected Zonos: 178825.36585365853)
[Thread 1] Processed 18000 zonotopes (Work Done: 10.03418%; Expected Zonos: 179386.8613138686)
[Thread 1] Processed 18100 zonotopes (Work Done: 10.08301%; Expected Zonos: 179509.92736077483)
[Thread 1] Processed 18200 zonotopes (Work Done: 10.18066%; Expected Zonos: 178770.26378896882)
[Thread 1] Processed 18300 zonotopes (Work Done: 10.22949%; Expected Zonos: 178894.5107398568)
[Thread 1] Processed 18400 zonotopes (Work Done: 10.30273%; Expected Zonos: 178593.36492890996)
[Thread 1] Processed 18500 zonotopes (Work Done: 10.32715%; Expected Zonos: 179139.47990543736)
[Thread 1] Processed 18600 zonotopes (Work Done: 10.4248%; Expected Zonos: 178420.60889929743)
[Thread 1] Processed 18700 zonotopes (Work Done: 10.47363%; Expected Zonos: 178543.58974358975)
[Thread 1] Processed 18800 zonotopes (Work Done: 10.52856%; Expected Zonos: 178561.85507246378)
[Thread 1] Processed 18900 zonotopes (Work Done: 10.52856%; Expected Zonos: 179511.65217391305)
[Thread 1] Processed 19000 zonotopes (Work Done: 10.62622%; Expected Zonos: 178802.98678920162)
[Thread 1] Processed 19100 zonotopes (Work Done: 10.64148%; Expected Zonos: 179486.32061944364)
[Thread 1] Processed 19200 zonotopes (Work Done: 10.69641%; Expected Zonos: 179499.45791726105)
[Thread 1] Processed 19300 zonotopes (Work Done: 10.72083%; Expected Zonos: 180023.4557358383)
[Thread 1] Processed 19400 zonotopes (Work Done: 10.74524%; Expected Zonos: 180545.07242260722)
[Thread 1] Processed 19500 zonotopes (Work Done: 10.74524%; Expected Zonos: 181475.71712581653)
[Thread 1] Processed 19600 zonotopes (Work Done: 10.76965%; Expected Zonos: 181992.8591669028)
[Thread 1] Processed 19700 zonotopes (Work Done: 10.9375%; Expected Zonos: 180114.2857142857)
[Thread 1] Processed 19800 zonotopes (Work Done: 10.94971%; Expected Zonos: 180826.75585284282)
[Thread 1] Processed 19900 zonotopes (Work Done: 10.98633%; Expected Zonos: 181134.22222222222)
[Thread 1] Processed 20000 zonotopes (Work Done: 11.00159%; Expected Zonos: 181791.95561719834)
[Thread 1] Processed 20100 zonotopes (Work Done: 11.026%; Expected Zonos: 182296.3742042624)
[Thread 1] Processed 20200 zonotopes (Work Done: 11.14197%; Expected Zonos: 181296.52150095865)
[Thread 1] Processed 20300 zonotopes (Work Done: 11.14197%; Expected Zonos: 182194.02903314162)
[Thread 1] Processed 20400 zonotopes (Work Done: 11.1908%; Expected Zonos: 182292.66430324517)
[Thread 1] Processed 20500 zonotopes (Work Done: 11.203%; Expected Zonos: 182986.6521383819)
[Thread 1] Processed 20600 zonotopes (Work Done: 11.21521%; Expected Zonos: 183679.12925170068)
[Thread 1] Processed 20700 zonotopes (Work Done: 11.28845%; Expected Zonos: 183373.23600973235)
[Thread 1] Processed 20800 zonotopes (Work Done: 11.31287%; Expected Zonos: 183861.45130833559)
[Thread 1] Processed 20900 zonotopes (Work Done: 11.36169%; Expected Zonos: 183951.43701316143)
[Thread 1] Processed 21000 zonotopes (Work Done: 11.47766%; Expected Zonos: 182964.10529114597)
[Thread 1] Processed 21100 zonotopes (Work Done: 11.5387%; Expected Zonos: 182862.94631049986)
[Thread 1] Processed 21200 zonotopes (Work Done: 11.56921%; Expected Zonos: 183244.94856238458)
[Thread 1] Processed 21300 zonotopes (Work Done: 11.64856%; Expected Zonos: 182855.22661776264)
[Thread 1] Processed 21400 zonotopes (Work Done: 11.69434%; Expected Zonos: 182994.57202505218)
[Thread 1] Processed 21500 zonotopes (Work Done: 11.7218%; Expected Zonos: 183418.90132777923)
[Thread 1] Processed 21600 zonotopes (Work Done: 11.82251%; Expected Zonos: 182702.32318017553)
[Thread 1] Processed 21700 zonotopes (Work Done: 11.92627%; Expected Zonos: 181951.2794268168)
[Thread 1] Processed 21800 zonotopes (Work Done: 11.99341%; Expected Zonos: 181766.51399491093)
[Thread 1] Processed 21900 zonotopes (Work Done: 12.03918%; Expected Zonos: 181906.00760456274)
[Thread 1] Processed 22000 zonotopes (Work Done: 12.0636%; Expected Zonos: 182366.81001770808)
[Thread 1] Processed 22100 zonotopes (Work Done: 12.17346%; Expected Zonos: 181542.44171471547)
[Thread 1] Processed 22200 zonotopes (Work Done: 12.29248%; Expected Zonos: 180598.2125124131)
[Thread 1] Processed 22300 zonotopes (Work Done: 12.37793%; Expected Zonos: 180159.36883629192)
[Thread 1] Processed 22400 zonotopes (Work Done: 12.42065%; Expected Zonos: 180344.7665847666)
[Thread 1] Processed 22500 zonotopes (Work Done: 12.44202%; Expected Zonos: 180838.85209713024)
[Thread 1] Processed 22600 zonotopes (Work Done: 12.51526%; Expected Zonos: 180579.56595952206)
[Thread 1] Processed 22700 zonotopes (Work Done: 12.55798%; Expected Zonos: 180761.50668286756)
[Thread 1] Processed 22800 zonotopes (Work Done: 12.5885%; Expected Zonos: 181117.67272727273)
[Thread 1] Processed 22900 zonotopes (Work Done: 12.60071%; Expected Zonos: 181735.81981109228)
[Thread 1] Processed 23000 zonotopes (Work Done: 12.67395%; Expected Zonos: 181474.5966771009)
[Thread 1] Processed 23100 zonotopes (Work Done: 12.69531%; Expected Zonos: 181956.92307692306)
[Thread 1] Processed 23200 zonotopes (Work Done: 12.72278%; Expected Zonos: 182350.10793955385)
[Thread 1] Processed 23300 zonotopes (Work Done: 12.77466%; Expected Zonos: 182392.35547061634)
[Thread 1] Processed 23400 zonotopes (Work Done: 12.78687%; Expected Zonos: 183000.2863961814)
[Thread 1] Processed 23500 zonotopes (Work Done: 12.81281%; Expected Zonos: 183410.26557103728)
[Thread 1] Processed 23600 zonotopes (Work Done: 12.883%; Expected Zonos: 183187.2083382684)
[Thread 1] Processed 23700 zonotopes (Work Done: 12.89368%; Expected Zonos: 183811.02958579882)
[Thread 1] Processed 23800 zonotopes (Work Done: 12.94403%; Expected Zonos: 183868.5370741483)
[Thread 1] Processed 23900 zonotopes (Work Done: 12.96844%; Expected Zonos: 184293.49335215907)
[Thread 1] Processed 24000 zonotopes (Work Done: 12.9837%; Expected Zonos: 184847.10306734047)
[Thread 1] Processed 24100 zonotopes (Work Done: 13.02643%; Expected Zonos: 185008.50415836944)
[Thread 1] Processed 24200 zonotopes (Work Done: 13.09357%; Expected Zonos: 184823.58699452278)
[Thread 1] Processed 24300 zonotopes (Work Done: 13.19122%; Expected Zonos: 184213.3950260266)
[Thread 1] Processed 24400 zonotopes (Work Done: 13.27667%; Expected Zonos: 183780.99069072522)
[Thread 1] Processed 24500 zonotopes (Work Done: 13.37738%; Expected Zonos: 183144.97547621763)
[Thread 1] Processed 24600 zonotopes (Work Done: 13.53912%; Expected Zonos: 181695.6609940268)
[Thread 1] Processed 24700 zonotopes (Work Done: 13.61847%; Expected Zonos: 181371.33893557423)
[Thread 1] Processed 24800 zonotopes (Work Done: 13.65814%; Expected Zonos: 181576.67299743046)
[Thread 1] Processed 24900 zonotopes (Work Done: 13.69476%; Expected Zonos: 181821.32590529247)
[Thread 1] Processed 25000 zonotopes (Work Done: 13.77716%; Expected Zonos: 181459.74083508694)
[Thread 1] Processed 25100 zonotopes (Work Done: 13.80463%; Expected Zonos: 181823.10158063445)
[Thread 1] Processed 25200 zonotopes (Work Done: 13.82599%; Expected Zonos: 182265.44531508663)
[Thread 1] Processed 25300 zonotopes (Work Done: 13.86261%; Expected Zonos: 182505.31645569621)
[Thread 1] Processed 25400 zonotopes (Work Done: 13.90839%; Expected Zonos: 182623.63137685135)
[Thread 1] Processed 25500 zonotopes (Work Done: 13.99384%; Expected Zonos: 182223.0945371279)
[Thread 1] Processed 25600 zonotopes (Work Done: 14.00909%; Expected Zonos: 182738.43807864067)
[Thread 1] Processed 25700 zonotopes (Work Done: 14.1037%; Expected Zonos: 182221.7029103105)
[Thread 1] Processed 25800 zonotopes (Work Done: 14.19067%; Expected Zonos: 181809.5483870968)
[Thread 1] Processed 25900 zonotopes (Work Done: 14.26392%; Expected Zonos: 181577.0646127514)
[Thread 1] Processed 26000 zonotopes (Work Done: 14.32495%; Expected Zonos: 181501.49126544525)
[Thread 1] Processed 26100 zonotopes (Work Done: 14.34326%; Expected Zonos: 181966.97872340426)
[Thread 1] Processed 26200 zonotopes (Work Done: 14.37988%; Expected Zonos: 182198.98132427843)
[Thread 1] Processed 26300 zonotopes (Work Done: 14.39209%; Expected Zonos: 182739.2705682782)
[Thread 1] Processed 26400 zonotopes (Work Done: 14.46991%; Expected Zonos: 182447.57987978487)
[Thread 1] Processed 26500 zonotopes (Work Done: 14.50653%; Expected Zonos: 182676.34374671296)
[Thread 1] Processed 26600 zonotopes (Work Done: 14.55536%; Expected Zonos: 182750.5608554356)
[Thread 1] Processed 26700 zonotopes (Work Done: 14.5752%; Expected Zonos: 183187.93969849247)
[Thread 1] Processed 26800 zonotopes (Work Done: 14.6759%; Expected Zonos: 182612.26866292369)
[Thread 1] Processed 26900 zonotopes (Work Done: 14.71252%; Expected Zonos: 182837.41962248497)
[Thread 1] Processed 27000 zonotopes (Work Done: 14.73846%; Expected Zonos: 183194.11947406564)
[Thread 1] Processed 27100 zonotopes (Work Done: 14.75677%; Expected Zonos: 183644.4628270086)
[Thread 1] Processed 27200 zonotopes (Work Done: 14.81476%; Expected Zonos: 183600.7003810897)
[Thread 1] Processed 27300 zonotopes (Work Done: 14.85748%; Expected Zonos: 183745.79439252336)
[Thread 1] Processed 27400 zonotopes (Work Done: 14.90021%; Expected Zonos: 183890.05632360472)
[Thread 1] Processed 27500 zonotopes (Work Done: 14.96735%; Expected Zonos: 183733.30614741563)
[Thread 1] Processed 27600 zonotopes (Work Done: 15.02228%; Expected Zonos: 183727.13052310818)
[Thread 1] Processed 27700 zonotopes (Work Done: 15.0589%; Expected Zonos: 183944.39152903028)
[Thread 1] Processed 27800 zonotopes (Work Done: 15.09552%; Expected Zonos: 184160.59840291116)
[Thread 1] Processed 27900 zonotopes (Work Done: 15.16571%; Expected Zonos: 183967.6426199819)
[Thread 1] Processed 28000 zonotopes (Work Done: 15.22522%; Expected Zonos: 183905.3918620966)
[Thread 1] Processed 28100 zonotopes (Work Done: 15.25269%; Expected Zonos: 184229.8519407763)
[Thread 1] Processed 28200 zonotopes (Work Done: 15.31372%; Expected Zonos: 184148.5850936628)
[Thread 1] Processed 28300 zonotopes (Work Done: 15.39764%; Expected Zonos: 183794.3514022396)
[Thread 1] Processed 28400 zonotopes (Work Done: 15.52582%; Expected Zonos: 182921.1203931204)
[Thread 1] Processed 28500 zonotopes (Work Done: 15.57617%; Expected Zonos: 182971.7868338558)
[Thread 1] Processed 28600 zonotopes (Work Done: 15.63416%; Expected Zonos: 182932.81280499708)
[Thread 1] Processed 28700 zonotopes (Work Done: 15.6723%; Expected Zonos: 183125.61581150812)
[Thread 1] Processed 28800 zonotopes (Work Done: 15.79285%; Expected Zonos: 182361.04347826086)
[Thread 1] Processed 28900 zonotopes (Work Done: 15.85693%; Expected Zonos: 182254.65742879137)
[Thread 1] Processed 29000 zonotopes (Work Done: 15.89355%; Expected Zonos: 182463.90168970815)
[Thread 1] Processed 29100 zonotopes (Work Done: 15.95764%; Expected Zonos: 182357.77395295468)
[Thread 1] Processed 29200 zonotopes (Work Done: 16.04462%; Expected Zonos: 181992.50594388967)
[Thread 1] Processed 29300 zonotopes (Work Done: 16.1499%; Expected Zonos: 181425.24565381708)
[Thread 1] Processed 29400 zonotopes (Work Done: 16.19873%; Expected Zonos: 181495.70459683496)
[Thread 1] Processed 29500 zonotopes (Work Done: 16.21704%; Expected Zonos: 181907.41437711706)
[Thread 1] Processed 29600 zonotopes (Work Done: 16.27502%; Expected Zonos: 181873.7671104444)
[Thread 1] Processed 29700 zonotopes (Work Done: 16.40167%; Expected Zonos: 181079.09572983533)
[Thread 1] Processed 29800 zonotopes (Work Done: 16.42609%; Expected Zonos: 181418.7459359034)
[Thread 1] Processed 29900 zonotopes (Work Done: 16.48407%; Expected Zonos: 181387.24428399518)
[Thread 1] Processed 30000 zonotopes (Work Done: 16.50848%; Expected Zonos: 181724.7435067936)
[Thread 1] Processed 30100 zonotopes (Work Done: 16.58936%; Expected Zonos: 181441.64827078735)
[Thread 1] Processed 30200 zonotopes (Work Done: 16.66412%; Expected Zonos: 181227.65314531638)
[Thread 1] Processed 30300 zonotopes (Work Done: 16.70074%; Expected Zonos: 181429.0360895386)
[Thread 1] Processed 30400 zonotopes (Work Done: 16.78925%; Expected Zonos: 181068.29046623647)
[Thread 1] Processed 30500 zonotopes (Work Done: 16.8457%; Expected Zonos: 181055.07246376813)
[Thread 1] Processed 30600 zonotopes (Work Done: 16.86554%; Expected Zonos: 181435.04930788022)
[Thread 1] Processed 30700 zonotopes (Work Done: 16.92505%; Expected Zonos: 181387.95528308692)
[Thread 1] Processed 30800 zonotopes (Work Done: 16.95404%; Expected Zonos: 181667.60867608676)
[Thread 1] Processed 30900 zonotopes (Work Done: 17.07611%; Expected Zonos: 180954.55276561523)
[Thread 1] Processed 31000 zonotopes (Work Done: 17.09137%; Expected Zonos: 181378.0912418534)
[Thread 1] Processed 31100 zonotopes (Work Done: 17.11578%; Expected Zonos: 181703.62842114648)
[Thread 1] Processed 31200 zonotopes (Work Done: 17.2226%; Expected Zonos: 181157.36688225393)
[Thread 1] Processed 31300 zonotopes (Work Done: 17.29279%; Expected Zonos: 181000.33530397952)
[Thread 1] Processed 31400 zonotopes (Work Done: 17.39349%; Expected Zonos: 180527.27432230898)
[Thread 1] Processed 31500 zonotopes (Work Done: 17.42249%; Expected Zonos: 180800.8407777194)
[Thread 1] Processed 31600 zonotopes (Work Done: 17.48199%; Expected Zonos: 180757.40595269267)
[Thread 1] Processed 31700 zonotopes (Work Done: 17.55219%; Expected Zonos: 180604.29453186126)
[Thread 1] Processed 31800 zonotopes (Work Done: 17.61475%; Expected Zonos: 180530.56133056132)
[Thread 1] Processed 31900 zonotopes (Work Done: 17.66205%; Expected Zonos: 180613.252699784)
[Thread 1] Processed 32000 zonotopes (Work Done: 17.73682%; Expected Zonos: 180415.69167240194)
[Thread 1] Processed 32100 zonotopes (Work Done: 17.81158%; Expected Zonos: 180219.78925726033)
[Thread 1] Processed 32200 zonotopes (Work Done: 17.87109%; Expected Zonos: 180179.2349726776)
[Thread 1] Processed 32300 zonotopes (Work Done: 17.89551%; Expected Zonos: 180492.22373806275)
[Thread 1] Processed 32400 zonotopes (Work Done: 18.00842%; Expected Zonos: 179915.81087951193)
[Thread 1] Processed 32500 zonotopes (Work Done: 18.11829%; Expected Zonos: 179376.78962438944)
[Thread 1] Processed 32600 zonotopes (Work Done: 18.13965%; Expected Zonos: 179716.82368775236)
[Thread 1] Processed 32700 zonotopes (Work Done: 18.17932%; Expected Zonos: 179874.70203122377)
[Thread 1] Processed 32800 zonotopes (Work Done: 18.21136%; Expected Zonos: 180107.314620863)
[Thread 1] Processed 32900 zonotopes (Work Done: 18.25562%; Expected Zonos: 180218.52223336676)
[Thread 1] Processed 33000 zonotopes (Work Done: 18.31818%; Expected Zonos: 180148.93794252395)
Found cex
N1 Probability: 0.999999141679926 >= 0.999999

Found counterexample: ([-1.5, 1.75, 1.5, 0.5, -1.75, -0.25, -1.5], (2, 1))
[Thread 1] Total splits: 31834
Processed 33083 zonotopes (Work Done: 18.4%); Generated 63668 (0.00292487861055527s/loop)
[Thread 1] Finished in 96.76s
 ────────────────────────────────────────────────────────────────────────────────
                                        Time                    Allocations      
                               ───────────────────────   ────────────────────────
       Tot / % measured:            96.8s / 100.0%           44.6GiB / 100.0%    

 Section               ncalls     time    %tot     avg     alloc    %tot      avg
 ────────────────────────────────────────────────────────────────────────────────
 Verify                     1    96.8s  100.0%   96.8s   44.6GiB  100.0%  44.6GiB
   Zonotope Loop            1    96.8s  100.0%   96.8s   44.6GiB  100.0%  44.6GiB
     Property Check     33.1k    86.9s   89.9%  2.63ms   25.5GiB   57.3%   809KiB
     Zonotope Propa...  33.1k    9.00s    9.3%   272μs   18.4GiB   41.2%   582KiB
       DiffZonotope...  66.2k    6.18s    6.4%  93.3μs   15.7GiB   35.3%   250KiB
         Zonotope_R...   132k    5.86s    6.1%  44.3μs   15.3GiB   34.3%   121KiB
           Column M...   132k    1.90s    2.0%  14.4μs   5.98GiB   13.4%  47.4KiB
           Influenc...   132k    1.38s    1.4%  10.5μs   2.70GiB    6.1%  21.4KiB
             Multiply    132k    1.11s    1.1%  8.37μs   2.16GiB    4.8%  17.1KiB
             Alloca...   132k    162ms    0.2%  1.22μs    553MiB    1.2%  4.28KiB
             Set Ma...   132k   43.0ms    0.0%   325ns     0.00B    0.0%    0.00B
           Allocation    132k    1.22s    1.3%  9.24μs   5.97GiB   13.4%  47.3KiB
           Set Matrix    132k    752ms    0.8%  5.69μs    186MiB    0.4%  1.44KiB
           Vectors       132k    424ms    0.4%  3.20μs    479MiB    1.0%  3.70KiB
           Bounds        132k   27.4ms    0.0%   207ns     0.00B    0.0%    0.00B
       DiffZonotope...  99.2k    2.66s    2.7%  26.8μs   2.62GiB    5.9%  27.6KiB
         Zonotope_D...   198k    2.63s    2.7%  13.2μs   2.61GiB    5.9%  13.8KiB
     Compute Split      31.8k    648ms    0.7%  20.4μs    585MiB    1.3%  18.8KiB
 Initialize                 1   56.0μs    0.0%  56.0μs   61.7KiB    0.0%  61.7KiB
 ────────────────────────────────────────────────────────────────────────────────[VERYDIFF_TIMER] 96.770966256
[VERYDIFF_EXPERIMENT] Sigma: 3.0
Parsing new_benchmarks/rice-1-retrained/nets/2_80.onnx...
Found input onnx::Gemm_0
op: gemm, weight: (80, 7), bias: (80,)
op: relu, weight: nothing, bias: nothing
op: gemm, weight: (80, 80), bias: (80,)
op: relu, weight: nothing, bias: nothing
op: gemm, weight: (2, 80), bias: (2,)
Parsing new_benchmarks/rice-1-retrained/nets_pruned/2_80-0.5.onnx...
Found input onnx::Gemm_0
op: gemm, weight: (80, 7), bias: (80,)
op: relu, weight: nothing, bias: nothing
op: gemm, weight: (80, 80), bias: (80,)
op: relu, weight: nothing, bias: nothing
op: gemm, weight: (2, 80), bias: (2,)
Distance: 55.662090616009664
Distance: 330.32117879329684
Distance: 9.691211663060361
Running with 1 threads
[Thread 1] Time to first task: 0.0s
Zono Bounds:
[0.0, 0.0, 0.0, 0.0, 0.0, 0.0, 0.0]
[0.0, 0.0, 0.0, 0.0, 0.0, 0.0, 0.0]
[TOP-1] required confidence (1.0≥0.999999) is feasible for index 1
[Thread 1] Processed 100 zonotopes (Work Done: 0.0%; Expected Zonos: Inf)
[Thread 1] Processed 200 zonotopes (Work Done: 0.0%; Expected Zonos: Inf)
[Thread 1] Processed 300 zonotopes (Work Done: 0.0%; Expected Zonos: Inf)
Found cex
N1 Probability: 0.9999991180991249 >= 0.999999

Found counterexample: ([-1.5, 1.5, 1.5, 1.5, -2.25, 0.75, -1.5], (2, 1))
[Thread 1] Total splits: 397
Processed 398 zonotopes (Work Done: 0.0%); Generated 794 (0.0035212886306532666s/loop)
[Thread 1] Finished in 1.4s
 ────────────────────────────────────────────────────────────────────────────────
                                        Time                    Allocations      
                               ───────────────────────   ────────────────────────
       Tot / % measured:            1.40s / 100.0%            677MiB / 100.0%    

 Section               ncalls     time    %tot     avg     alloc    %tot      avg
 ────────────────────────────────────────────────────────────────────────────────
 Verify                     1    1.40s  100.0%   1.40s    676MiB  100.0%   676MiB
   Zonotope Loop            1    1.40s  100.0%   1.40s    676MiB  100.0%   676MiB
     Property Check       398    1.24s   88.2%  3.10ms    379MiB   56.0%   976KiB
     Zonotope Propa...    398    155ms   11.1%   391μs    288MiB   42.5%   740KiB
       DiffZonotope...    796    120ms    8.6%   151μs    248MiB   36.6%   319KiB
         Zonotope_R...  1.59k    117ms    8.3%  73.4μs    242MiB   35.8%   156KiB
           Column M...  1.59k   73.3ms    5.2%  46.0μs   93.4MiB   13.8%  60.1KiB
           Influenc...  1.59k   18.9ms    1.3%  11.9μs   46.9MiB    6.9%  30.2KiB
             Multiply   1.59k   15.9ms    1.1%  10.0μs   38.5MiB    5.7%  24.7KiB
             Alloca...  1.59k   1.53ms    0.1%   962ns   8.42MiB    1.2%  5.42KiB
             Set Ma...  1.59k    593μs    0.0%   372ns     0.00B    0.0%    0.00B
           Set Matrix   1.59k   12.1ms    0.9%  7.63μs   2.78MiB    0.4%  1.79KiB
           Allocation   1.59k   6.32ms    0.5%  3.97μs   93.3MiB   13.8%  60.0KiB
           Vectors      1.59k   4.40ms    0.3%  2.76μs   5.76MiB    0.9%  3.70KiB
           Bounds       1.59k    335μs    0.0%   210ns     0.00B    0.0%    0.00B
       DiffZonotope...  1.19k   33.2ms    2.4%  27.8μs   39.7MiB    5.9%  34.1KiB
         Zonotope_D...  2.39k   32.8ms    2.3%  13.7μs   39.6MiB    5.9%  17.0KiB
     Compute Split        397   8.45ms    0.6%  21.3μs   8.68MiB    1.3%  22.4KiB
 Initialize                 1   57.3μs    0.0%  57.3μs   61.7KiB    0.0%  61.7KiB
 ────────────────────────────────────────────────────────────────────────────────[VERYDIFF_TIMER] 1.412695757
