
[VERYDIFF_EXPERIMENT] Running on /home/i57/steuber/NeuroDiff/repos/VeryDiffExperiments/src/../benchmarks/mnist-prune/specs/mnist_94_local_15.vnnlib /home/i57/steuber/NeuroDiff/repos/VeryDiffExperiments/src/../benchmarks/mnist-prune/nets/mnist_relu_2_512.onnx
Loading /home/i57/steuber/NeuroDiff/repos/VeryDiffExperiments/src/../benchmarks/mnist-prune/nets/mnist_relu_2_512.onnx and /home/i57/steuber/NeuroDiff/repos/VeryDiffExperiments/src/../benchmarks/mnist-prune/nets_pruned/mnist_relu_2_512_pruned5.onnx
INPUT SHAPE: 784

[NEQUIV] 173.35116729727434

[-113.43450993    1.29366414  -66.12739965  -86.93357861  -44.78532153
  -65.85679477  -63.11836694  -63.38248904  -50.07214168  -48.36907713]
[-106.21505976    1.39755733  -61.62407262  -81.60380796  -41.88224562
  -61.5830218   -59.34946959  -58.63263239  -50.49081063  -47.2251931 ]
NETWORKS NOT EQUIVALENT
Refined: 0 | Refine Limit: -1 | Wrong: 0 | Right: 1 | Total: 1 | Total Zonos Considered: 1 | Expected 2 (50.0%)

time: 2.16678702

[VERYDIFF_TIMER] 2.19048379

[VERYDIFF_EXPERIMENT] Running on /home/i57/steuber/NeuroDiff/repos/VeryDiffExperiments/src/../benchmarks/mnist-prune/specs/mnist_94_local_15.vnnlib /home/i57/steuber/NeuroDiff/repos/VeryDiffExperiments/src/../benchmarks/mnist-prune/nets/mnist_relu_3_100.onnx
Loading /home/i57/steuber/NeuroDiff/repos/VeryDiffExperiments/src/../benchmarks/mnist-prune/nets/mnist_relu_3_100.onnx and /home/i57/steuber/NeuroDiff/repos/VeryDiffExperiments/src/../benchmarks/mnist-prune/nets_pruned/mnist_relu_3_100_pruned5.onnx
INPUT SHAPE: 784
Refined: 57 | Refine Limit: 25 | Wrong: 0 | Right: 69 | Total: 69 | Total Zonos Considered: 126 | Expected 17663 (0.3906471154390534%)Refined: 130 | Refine Limit: 31 | Wrong: 0 | Right: 188 | Total: 188 | Total Zonos Considered: 318 | Expected 48127 (0.39063311654580585%)Refined: 205 | Refine Limit: 34 | Wrong: 0 | Right: 314 | Total: 314 | Total Zonos Considered: 519 | Expected 80383 (0.39062985954741675%)Refined: 293 | Refine Limit: 46 | Wrong: 0 | Right: 453 | Total: 453 | Total Zonos Considered: 746 | Expected 115967 (0.39062836841515264%)Refined: 378 | Refine Limit: 48 | Wrong: 0 | Right: 610 | Total: 610 | Total Zonos Considered: 988 | Expected 156159 (0.39062750145684844%)Refined: 458 | Refine Limit: 36 | Wrong: 0 | Right: 765 | Total: 765 | Total Zonos Considered: 1223 | Expected 195839 (0.39062699462313427%)Refined: 520 | Refine Limit: 24 | Wrong: 0 | Right: 894 | Total: 894 | Total Zonos Considered: 1414 | Expected 228863 (0.39062670680712913%)Refined: 602 | Refine Limit: 33 | Wrong: 0 | Right: 1027 | Total: 1027 | Total Zonos Considered: 1629 | Expected 262911 (0.39062648576894843%)Refined: 698 | Refine Limit: 37 | Wrong: 0 | Right: 1185 | Total: 1185 | Total Zonos Considered: 1883 | Expected 303359 (0.39062628766576896%)Refined: 773 | Refine Limit: 35 | Wrong: 0 | Right: 1327 | Total: 1327 | Total Zonos Considered: 2100 | Expected 339710 (0.3906272997556739%)Refined: 865 | Refine Limit: 47 | Wrong: 0 | Right: 1458 | Total: 1458 | Total Zonos Considered: 2323 | Expected 373246 (0.39062709312356997%)Refined: 950 | Refine Limit: 43 | Wrong: 0 | Right: 1609 | Total: 1609 | Total Zonos Considered: 2559 | Expected 411902 (0.39062689668901823%)Refined: 1040 | Refine Limit: 39 | Wrong: 0 | Right: 1760 | Total: 1760 | Total Zonos Considered: 2800 | Expected 450558 (0.39062673396099945%)Refined: 1119 | Refine Limit: 37 | Wrong: 0 | Right: 1904 | Total: 1904 | Total Zonos Considered: 3023 | Expected 487422 (0.3906266028205539%)Refined: 1199 | Refine Limit: 37 | Wrong: 0 | Right: 2042 | Total: 2042 | Total Zonos Considered: 3241 | Expected 522750 (0.3906264945002391%)Refined: 1294 | Refine Limit: 44 | Wrong: 0 | Right: 2207 | Total: 2207 | Total Zonos Considered: 3501 | Expected 564990 (0.3906263827678366%)Refined: 1390 | Refine Limit: 44 | Wrong: 0 | Right: 2391 | Total: 2391 | Total Zonos Considered: 3781 | Expected 612094 (0.39062627635624597%)Refined: 1476 | Refine Limit: 47 | Wrong: 0 | Right: 2521 | Total: 2521 | Total Zonos Considered: 3997 | Expected 645373 (0.3906268158103918%)Refined: 1555 | Refine Limit: 46 | Wrong: 0 | Right: 2663 | Total: 2663 | Total Zonos Considered: 4218 | Expected 681725 (0.3906267189849279%)Refined: 1635 | Refine Limit: 46 | Wrong: 0 | Right: 2796 | Total: 2796 | Total Zonos Considered: 4431 | Expected 715773 (0.3906266372159889%)Refined: 1716 | Refine Limit: 31 | Wrong: 0 | Right: 2949 | Total: 2949 | Total Zonos Considered: 4665 | Expected 754941 (0.39062655227362136%)Refined: 1797 | Refine Limit: 35 | Wrong: 0 | Right: 3095 | Total: 3095 | Total Zonos Considered: 4892 | Expected 792317 (0.3906264790481588%)Refined: 1890 | Refine Limit: 42 | Wrong: 0 | Right: 3244 | Total: 3244 | Total Zonos Considered: 5134 | Expected 830461 (0.3906264111138272%)Refined: 1971 | Refine Limit: 47 | Wrong: 0 | Right: 3374 | Total: 3374 | Total Zonos Considered: 5345 | Expected 863741 (0.3906263567435146%)Refined: 2053 | Refine Limit: 46 | Wrong: 0 | Right: 3519 | Total: 3519 | Total Zonos Considered: 5572 | Expected 900861 (0.3906263008388641%)Refined: 2138 | Refine Limit: 36 | Wrong: 0 | Right: 3681 | Total: 3681 | Total Zonos Considered: 5819 | Expected 942332 (0.3906266581204926%)UNKNOWN
TIMEOUT
Refined: 2169 | Refine Limit: 34 | Wrong: 0 | Right: 3742 | Total: 3742 | Total Zonos Considered: 5911 | Expected 957948 (0.3906266310906229%)

time: 120.304768604

[VERYDIFF_TIMER] 120.328604364

[VERYDIFF_EXPERIMENT] Running on /home/i57/steuber/NeuroDiff/repos/VeryDiffExperiments/src/../benchmarks/mnist-prune/specs/mnist_94_local_15.vnnlib /home/i57/steuber/NeuroDiff/repos/VeryDiffExperiments/src/../benchmarks/mnist-prune/nets/mnist_relu_4_1024.onnx
Loading /home/i57/steuber/NeuroDiff/repos/VeryDiffExperiments/src/../benchmarks/mnist-prune/nets/mnist_relu_4_1024.onnx and /home/i57/steuber/NeuroDiff/repos/VeryDiffExperiments/src/../benchmarks/mnist-prune/nets_pruned/mnist_relu_4_1024_pruned5.onnx
INPUT SHAPE: 784

[NEQUIV] 397.52113242280114

[ 0.         30.60028717  0.          0.          9.5052391   0.
  0.          3.31417367  0.          0.        ]
[ 0.         24.10216358  0.          0.          6.38889055  0.
  0.          1.69584609  0.          0.        ]
NETWORKS NOT EQUIVALENT
Refined: 0 | Refine Limit: -1 | Wrong: 0 | Right: 1 | Total: 1 | Total Zonos Considered: 1 | Expected 2 (50.0%)

time: 25.024091054

[VERYDIFF_TIMER] 25.055410344

[VERYDIFF_EXPERIMENT] NETWORK: /home/i57/steuber/NeuroDiff/repos/VeryDiffExperiments/src/../benchmarks/mnist-prune/specs/mnist_94_local_15.vnnlib
[VERYDIFF_EXPERIMENT] TIME: 148.420152773
