
[VERYDIFF_EXPERIMENT] Running on /home/i57/steuber/NeuroDiff/repos/VeryDiffExperiments/src/../benchmarks/mnist-prune/specs/mnist_94_global_5.vnnlib /home/i57/steuber/NeuroDiff/repos/VeryDiffExperiments/src/../benchmarks/mnist-prune/nets/mnist_relu_3_100.onnx
Loading /home/i57/steuber/NeuroDiff/repos/VeryDiffExperiments/src/../benchmarks/mnist-prune/nets/mnist_relu_3_100.onnx and /home/i57/steuber/NeuroDiff/repos/VeryDiffExperiments/src/../benchmarks/mnist-prune/nets_pruned/mnist_relu_3_100_0.77-old.onnx
INPUT SHAPE: 784
Skipping 0 row
Skipping 0 row
Skipping 0 row
Skipping 0 row
Skipping 0 row
Skipping 0 row
Skipping 0 row
Skipping 0 row
Skipping 0 row
Skipping 0 row
Skipping 0 row
Skipping 0 row
Skipping 0 row
Skipping 0 row
Skipping 0 row
Skipping 0 row
Skipping 0 row
Skipping 0 row
Skipping 0 row
Skipping 0 row
Skipping 0 row
Skipping 0 row
Skipping 0 row
Skipping 0 row
Skipping 0 row
Skipping 0 row
Skipping 0 row
Skipping 0 row
Skipping 0 row
Skipping 0 row
Skipping 0 row
Skipping 0 row
Skipping 0 row
Skipping 0 row
Skipping 0 row
Skipping 0 row
Skipping 0 row
Skipping 0 row
Skipping 0 row
Skipping 0 row
Skipping 0 row
Skipping 0 row
Skipping 0 row
Skipping 0 row
Skipping 0 row
Skipping 0 row
Skipping 0 row
Skipping 0 row
Skipping 0 row
Skipping 0 row
Skipping 0 row
Skipping 0 row
Skipping 0 row
Skipping 0 row
Skipping 0 row
Skipping 0 row
Skipping 0 row
Skipping 0 row
Skipping 0 row
Skipping 0 row
Skipping 0 row
Skipping 0 row
Skipping 0 row
Skipping 0 row
Skipping 0 row
Skipping 0 row
Skipping 0 row
Skipping 0 row
Skipping 0 row
Skipping 0 row
Skipping 0 row
Skipping 0 row
Skipping 0 row
Skipping 0 row
Skipping 0 row
Skipping 0 row
Skipping 0 row
Skipping 0 row
Skipping 0 row
Skipping 0 row
Skipping 0 row
Skipping 0 row
Skipping 0 row
Skipping 0 row
Skipping 0 row
Skipping 0 row
Skipping 0 row
Skipping 0 row
Skipping 0 row
Skipping 0 row
Skipping 0 row
Skipping 0 row
Skipping 0 row
Skipping 0 row
Skipping 0 row
Skipping 0 row
Skipping 0 row
Skipping 0 row
Skipping 0 row
Skipping 0 row
Skipping 0 row
Skipping 0 row
Skipping 0 row
Skipping 0 row
Skipping 0 row
Skipping 0 row
Skipping 0 row
Skipping 0 row
Skipping 0 row
Skipping 0 row
Skipping 0 row
Skipping 0 row
Skipping 0 row
Skipping 0 row
Skipping 0 row
Skipping 0 row
Skipping 0 row
Skipping 0 row
Skipping 0 row
Skipping 0 row
Skipping 0 row
Skipping 0 row
Skipping 0 row
Skipping 0 row
Skipping 0 row
Skipping 0 row
Skipping 0 row
Skipping 0 row
Skipping 0 row
Skipping 0 row
Skipping 0 row
Skipping 0 row
Skipping 0 row
Skipping 0 row
Skipping 0 row
Skipping 0 row
Skipping 0 row
Skipping 0 row
Skipping 0 row
Skipping 0 row
Skipping 0 row
Skipping 0 row
Skipping 0 row
Skipping 0 row
UNKNOWN
TIMEOUT
Refined: 22 | Refine Limit: 19 | Wrong: 0 | Right: 4 | Total: 4 | Total Zonos Considered: 26 | Expected 7893339 (5.06756392953603e-05%)

time: 121.651915871

[VERYDIFF_TIMER] 121.677545355

[VERYDIFF_EXPERIMENT] NETWORK: /home/i57/steuber/NeuroDiff/repos/VeryDiffExperiments/src/../benchmarks/mnist-prune/specs/mnist_94_global_5.vnnlib
[VERYDIFF_EXPERIMENT] TIME: 121.965281886
