
[VERYDIFF_EXPERIMENT] Running on /home/i57/steuber/NeuroDiff/repos/VeryDiffExperiments/src/../benchmarks/mnist-prune/specs/mnist_88_local_24.vnnlib /home/i57/steuber/NeuroDiff/repos/VeryDiffExperiments/src/../benchmarks/mnist-prune/nets/mnist_relu_4_1024.onnx
Found input X
op: matmul, weight: (1024, 784), bias: nothing
op: bias, weight: nothing, bias: (1024,)
op: relu, weight: nothing, bias: nothing
op: matmul, weight: (1024, 1024), bias: nothing
op: bias, weight: nothing, bias: (1024,)
op: relu, weight: nothing, bias: nothing
op: matmul, weight: (1024, 1024), bias: nothing
op: bias, weight: nothing, bias: (1024,)
op: relu, weight: nothing, bias: nothing
op: matmul, weight: (10, 1024), bias: nothing
op: bias, weight: nothing, bias: (10,)
op: relu, weight: nothing, bias: nothing
op: matmul, weight: (10, 10), bias: nothing
op: bias, weight: nothing, bias: (10,)
Found input X
op: gemm, weight: (1024, 784), bias: (1024,)
op: relu, weight: nothing, bias: nothing
op: gemm, weight: (1024, 1024), bias: (1024,)
op: relu, weight: nothing, bias: nothing
op: gemm, weight: (1024, 1024), bias: (1024,)
op: relu, weight: nothing, bias: nothing
op: gemm, weight: (10, 1024), bias: (10,)
op: relu, weight: nothing, bias: nothing
op: gemm, weight: (10, 10), bias: (10,)
Distance: 915.6394868631054
Distance: 1298.7052820973968
Distance: 1296.587532894263
Distance: 6.054483317080667
Distance: 0.04942679278974538
Running with 1 threads
[Thread 1] Time to first task: 0.0s
Instable Generators: 462
Instable Generators: 908
Instable Generators: 1024
Instable Generators: 10
Zono Bounds:
[-177.65725284810043, -180.837877896234, -199.8861869038904, -197.72094102240055, -190.5219428429353, -201.50046695937178, -180.4030722325884, -188.2480318196507, -192.79790356292318, -200.66924286013648]
[177.55557343632154, 180.02204375072088, 198.85744183598865, 197.28766820671046, 190.42779314232695, 201.410543807726, 180.36842164483815, 187.1669445784168, 192.8670573513395, 200.39876973031016]
[Thread 1] Processed 100 zonotopes (Work Done: 0.0%; Expected Zonos: Inf)


TIMEOUT REACHED
UNKNOWN
[Thread 1] Total splits: 133
Processed 133 zonotopes (Work Done: 0.0%); Generated 266 (0.9071786825187971s/loop)
[Thread 1] Finished in 120.65s
 ────────────────────────────────────────────────────────────────────────────────
                                        Time                    Allocations      
                               ───────────────────────   ────────────────────────
       Tot / % measured:             121s / 100.0%           41.4GiB / 100.0%    

 Section               ncalls     time    %tot     avg     alloc    %tot      avg
 ────────────────────────────────────────────────────────────────────────────────
 Verify                     1     121s  100.0%    121s   41.4GiB   99.9%  41.4GiB
   Zonotope Loop            1     121s  100.0%    121s   41.4GiB   99.9%  41.4GiB
     Zonotope Propa...    133     120s   99.5%   903ms   41.0GiB   99.1%   316MiB
       DiffZonotope...    665    63.9s   53.0%  96.1ms   8.78GiB   21.2%  13.5MiB
         Zonotope_D...  1.33k    22.1s   18.3%  16.6ms   3.58GiB    8.6%  2.75MiB
       DiffZonotope...    532    56.2s   46.6%   106ms   32.2GiB   77.9%  62.0MiB
         Zonotope_R...  1.06k    16.6s   13.7%  15.6ms   20.1GiB   48.6%  19.4MiB
           Allocation   1.06k    9.06s    7.5%  8.51ms   8.08GiB   19.5%  7.78MiB
           Column M...  1.06k    4.08s    3.4%  3.83ms   8.08GiB   19.5%  7.78MiB
           Influenc...  1.06k    2.03s    1.7%  1.90ms   3.90GiB    9.4%  3.76MiB
             Multiply   1.06k    1.96s    1.6%  1.84ms   3.61GiB    8.7%  3.47MiB
             Alloca...  1.06k   44.3ms    0.0%  41.6μs    304MiB    0.7%   293KiB
             Set Ma...  1.06k   19.2ms    0.0%  18.0μs     0.00B    0.0%    0.00B
           Set Matrix   1.06k    1.37s    1.1%  1.29ms   15.0MiB    0.0%  14.4KiB
           Vectors      1.06k   26.0ms    0.0%  24.5μs   35.3MiB    0.1%  34.0KiB
           Bounds       1.06k    684μs    0.0%   643ns     0.00B    0.0%    0.00B
     Property Check       133    487ms    0.4%  3.66ms   66.1MiB    0.2%   509KiB
     Compute Split        133   67.7ms    0.1%   509μs    179MiB    0.4%  1.35MiB
 Initialize                 1   14.0ms    0.0%  14.0ms   22.4MiB    0.1%  22.4MiB
 ────────────────────────────────────────────────────────────────────────────────
[VERYDIFF_TIMER] 120.746189297

[VERYDIFF_EXPERIMENT] NETWORK: /home/i57/steuber/NeuroDiff/repos/VeryDiffExperiments/src/../benchmarks/mnist-prune/specs/mnist_88_local_24.vnnlib
[VERYDIFF_EXPERIMENT] TIME: 121.070148627
