
[VERYDIFF_EXPERIMENT] Running on /home/i57/steuber/NeuroDiff/repos/VeryDiffExperiments/src/../benchmarks/mnist-prune/specs/mnist_43_global_5.vnnlib /home/i57/steuber/NeuroDiff/repos/VeryDiffExperiments/src/../benchmarks/mnist-prune/nets/mnist_relu_2_512.onnx
Loading /home/i57/steuber/NeuroDiff/repos/VeryDiffExperiments/src/../benchmarks/mnist-prune/nets/mnist_relu_2_512.onnx and /home/i57/steuber/NeuroDiff/repos/VeryDiffExperiments/src/../benchmarks/mnist-prune/nets_pruned/mnist_relu_2_512_0.79-old.onnx
INPUT SHAPE: 784

[NEQUIV] 252.99178926658664

[-77.16612893 -35.39616954 -11.14382468 -50.06779689 -43.17395238
 -65.43136538 -68.52873809 -57.72978985 -73.45424771 -85.79429442]
[-76.28059517 -35.29415977 -11.18668243 -49.61945784 -43.27297623
 -65.54729124 -67.37688748 -57.95644397 -72.27805284 -85.36757979]
NETWORKS NOT EQUIVALENT
Refined: 0 | Refine Limit: -1 | Wrong: 0 | Right: 1 | Total: 1 | Total Zonos Considered: 1 | Expected 2 (50.0%)

time: 3.585814047

[VERYDIFF_TIMER] 3.608820632

[VERYDIFF_EXPERIMENT] NETWORK: /home/i57/steuber/NeuroDiff/repos/VeryDiffExperiments/src/../benchmarks/mnist-prune/specs/mnist_43_global_5.vnnlib
[VERYDIFF_EXPERIMENT] TIME: 3.895847756
