
[VERYDIFF_EXPERIMENT] Running on /home/i57/steuber/NeuroDiff/repos/VeryDiffExperiments/src/../benchmarks/mnist-retrained-new-label/specs/mnist_94_local_15.vnnlib /home/i57/steuber/NeuroDiff/repos/VeryDiffExperiments/src/../benchmarks/mnist-retrained-new-label/nets/2x512_5_label-old.onnx
Parsing /home/i57/steuber/NeuroDiff/repos/VeryDiffExperiments/src/../benchmarks/mnist-retrained-new-label/nets/2x512_5_label-old.onnx...
Found input input
op: matmul, weight: (512, 784), bias: nothing
op: bias, weight: nothing, bias: (512,)
op: relu, weight: nothing, bias: nothing
op: matmul, weight: (512, 512), bias: nothing
op: bias, weight: nothing, bias: (512,)
op: relu, weight: nothing, bias: nothing
op: matmul, weight: (10, 512), bias: nothing
op: bias, weight: nothing, bias: (10,)
Parsing /home/i57/steuber/NeuroDiff/repos/VeryDiffExperiments/src/../benchmarks/mnist-retrained-new-label/nets_pruned/2x512_5_label-old_retrained.onnx...
Found input input
op: matmul, weight: (512, 784), bias: nothing
op: bias, weight: nothing, bias: (512,)
op: relu, weight: nothing, bias: nothing
op: matmul, weight: (512, 512), bias: nothing
op: bias, weight: nothing, bias: (512,)
op: relu, weight: nothing, bias: nothing
op: matmul, weight: (10, 512), bias: nothing
op: bias, weight: nothing, bias: (10,)
Distance: 15026.274398723514
Distance: 13537.024648849354
Distance: 270.59723824094544
Running with 1 threads
[Thread 1] Time to first task: 0.0s
Instable Generators: 56
Instable Generators: 131
Zono Bounds:
[-5.230583796438125, -17.67828078670915, -0.8562614138822742, -0.6639944100632853, -28.19016432885843, 2.7259709720443617, 0.9844411693078037, -2.7980967503530505, -9.637530722686495, -6.924227667837174]
[24.19500706613004, 16.048966349609824, 31.88196811028874, 38.72272665858176, 10.142199088208363, 19.165876450293638, 14.031317113556499, 10.116192441513423, 3.1502852220963646, 6.999099004071692]
[Thread 1] Total splits: 0
Processed 1 zonotopes (Work Done: 100.0%); Generated 0 (0.069111083s/loop)
[Thread 1] Finished in 0.07s
 ────────────────────────────────────────────────────────────────────────────────
                                        Time                    Allocations      
                               ───────────────────────   ────────────────────────
       Tot / % measured:           71.1ms / 100.0%           45.6MiB / 100.0%    

 Section               ncalls     time    %tot     avg     alloc    %tot      avg
 ────────────────────────────────────────────────────────────────────────────────
 Verify                     1   69.1ms   97.3%  69.1ms   40.3MiB   88.5%  40.3MiB
   Zonotope Loop            1   69.1ms   97.2%  69.1ms   40.3MiB   88.5%  40.3MiB
     Property Check         1   46.1ms   64.8%  46.1ms   26.4MiB   57.9%  26.4MiB
     Zonotope Propa...      1   22.9ms   32.2%  22.9ms   13.2MiB   28.9%  13.2MiB
       DiffZonotope...      3   13.1ms   18.5%  4.38ms   2.11MiB    4.6%   720KiB
         Zonotope_D...      6   5.32ms    7.5%   886μs   1.01MiB    2.2%   172KiB
       DiffZonotope...      2   9.72ms   13.7%  4.86ms   11.0MiB   24.2%  5.52MiB
         Zonotope_R...      4   7.66ms   10.8%  1.91ms   6.55MiB   14.4%  1.64MiB
           Column M...      4   6.94ms    9.8%  1.73ms   2.98MiB    6.5%   763KiB
           Influenc...      4    278μs    0.4%  69.4μs    483KiB    1.0%   121KiB
             Multiply       4    248μs    0.3%  61.9μs    391KiB    0.8%  97.7KiB
             Alloca...      4   18.2μs    0.0%  4.55μs   89.8KiB    0.2%  22.5KiB
             Set Ma...      4   5.88μs    0.0%  1.47μs     0.00B    0.0%    0.00B
           Set Matrix       4    182μs    0.3%  45.5μs   15.5KiB    0.0%  3.87KiB
           Allocation       4    180μs    0.3%  44.9μs   2.98MiB    6.5%   763KiB
           Vectors          4   66.2μs    0.1%  16.6μs    100KiB    0.2%  25.0KiB
           Bounds           4   2.11μs    0.0%   528ns     0.00B    0.0%    0.00B
 Initialize                 1   1.94ms    2.7%  1.94ms   5.23MiB   11.5%  5.23MiB
 ────────────────────────────────────────────────────────────────────────────────
[VERYDIFF_TIMER] 0.117136169

[VERYDIFF_EXPERIMENT] Running on /home/i57/steuber/NeuroDiff/repos/VeryDiffExperiments/src/../benchmarks/mnist-retrained-new-label/specs/mnist_94_local_15.vnnlib /home/i57/steuber/NeuroDiff/repos/VeryDiffExperiments/src/../benchmarks/mnist-retrained-new-label/nets/3x100_5_label-old.onnx
Parsing /home/i57/steuber/NeuroDiff/repos/VeryDiffExperiments/src/../benchmarks/mnist-retrained-new-label/nets/3x100_5_label-old.onnx...
Found input input
op: matmul, weight: (100, 784), bias: nothing
op: bias, weight: nothing, bias: (100,)
op: relu, weight: nothing, bias: nothing
op: matmul, weight: (100, 100), bias: nothing
op: bias, weight: nothing, bias: (100,)
op: relu, weight: nothing, bias: nothing
op: matmul, weight: (10, 100), bias: nothing
op: bias, weight: nothing, bias: (10,)
op: relu, weight: nothing, bias: nothing
op: matmul, weight: (10, 10), bias: nothing
Parsing /home/i57/steuber/NeuroDiff/repos/VeryDiffExperiments/src/../benchmarks/mnist-retrained-new-label/nets_pruned/3x100_5_label-old_retrained.onnx...
Found input input
op: matmul, weight: (100, 784), bias: nothing
op: bias, weight: nothing, bias: (100,)
op: relu, weight: nothing, bias: nothing
op: matmul, weight: (100, 100), bias: nothing
op: bias, weight: nothing, bias: (100,)
op: relu, weight: nothing, bias: nothing
op: matmul, weight: (10, 100), bias: nothing
op: bias, weight: nothing, bias: (10,)
op: relu, weight: nothing, bias: nothing
op: matmul, weight: (10, 10), bias: nothing
Distance: 4829.373923484372
Distance: 794.6132591721762
Distance: 102.97695766249672
Distance: 0.0
Running with 1 threads
[Thread 1] Time to first task: 0.0s
Instable Generators: 30
Instable Generators: 35
Instable Generators: 3
Zono Bounds:
[0.0, -5.994952483862455, -23.16003015990586, -24.28666168640051, -5.6309311591717215, 0.0, 0.0, -0.8369188381756738, -7.375408570831338, -5.888085810128501]
[0.0, 17.670216641205414, 23.16003015990586, 24.28666168640051, 4.2162292067473714, 0.0, 0.0, 0.7799054018373903, 2.450044439365138, 3.8537680657718276]
Found cex
N1 Scale: 3683.3991468967715 >= 1.0

Found counterexample: ([0.0, 0.0, 0.0, 0.0, 0.0, 0.0, 0.0, 0.0, 0.0, 0.0, 0.0, 0.0, 0.0, 0.0, 0.0, 0.0, 0.0, 0.0, 0.0, 0.0, 0.0, 0.0, 0.0, 0.0, 0.0, 0.0, 0.0, 0.0, 0.0, 0.0, 0.0, 0.0, 0.0, 0.0, 0.0, 0.0, 0.0, 0.0, 0.0, 0.0, 0.0, 0.0, 0.0, 0.0, 0.0, 0.0, 0.0, 0.0, 0.0, 0.0, 0.0, 0.0, 0.0, 0.0, 0.0, 0.0, 0.0, 0.0, 0.0, 0.0, 0.0, 0.0, 0.0, 0.0, 0.0, 0.0, 0.0, 0.0, 0.0, 0.0, 0.0, 0.0, 0.0, 0.0, 0.0, 0.0, 0.0, 0.0, 0.0, 0.0, 0.0, 0.0, 0.0, 0.0, 0.0, 0.0, 0.0, 0.0, 0.0, 0.0, 0.0, 0.0, 0.0, 0.0, 0.0, 0.0, 0.0, 0.0, 0.0, 0.0, 0.0, 0.0, 0.0, 0.0, 0.0, 0.0, 1.0, 0.0, 0.0, 0.0, 0.0, 0.0, 0.0, 0.0, 0.0, 0.0, 0.0, 0.0, 0.0, 0.0, 0.0, 0.0, 0.0, 0.36078432, 0.99215686, 0.99215686, 0.99215686, 0.0, 0.0, 0.0, 1.0, 0.0, 0.0, 0.0, 0.0, 0.0, 0.0, 0.0, 0.0, 0.0, 0.0, 0.0, 0.0, 0.0, 0.0, 0.0, 0.0, 0.0, 0.0, 0.0, 0.0, 0.74509805, 0.98431373, 0.98431373, 0.98431373, 0.0, 0.0, 0.0, 0.0, 0.0, 0.0, 1.0, 0.0, 0.0, 0.0, 0.0, 0.0, 0.0, 0.0, 0.0, 0.0, 0.0, 0.0, 0.0, 0.0, 0.0, 0.0, 0.0, 0.0, 0.74509805, 0.98431373, 0.98431373, 0.98431373, 0.0, 0.0, 0.0, 0.0, 0.0, 0.0, 0.0, 0.0, 0.0, 0.0, 0.0, 0.0, 0.0, 0.0, 0.0, 0.0, 0.0, 0.0, 1.0, 0.0, 0.0, 0.0, 0.0, 0.0, 0.74509805, 0.98431373, 0.98431373, 0.98431373, 0.0, 0.0, 0.0, 0.0, 0.0, 0.0, 0.0, 0.0, 0.0, 0.0, 0.0, 0.0, 0.0, 0.0, 0.0, 0.0, 0.0, 0.0, 0.0, 0.0, 0.0, 0.0, 0.0, 0.0, 0.74509805, 0.98431373, 0.98431373, 0.98431373, 0.0, 0.0, 0.0, 0.0, 0.0, 0.0, 0.0, 0.0, 0.0, 0.0, 0.0, 0.0, 0.0, 0.0, 0.0, 0.0, 0.0, 0.0, 0.0, 0.0, 0.0, 0.0, 0.0, 0.0, 0.74901962, 0.99215686, 0.99215686, 0.99215686, 0.7647059, 0.09411765, 0.0, 0.0, 0.0, 0.0, 0.0, 0.0, 0.0, 0.0, 0.0, 0.0, 0.0, 0.0, 0.0, 0.0, 0.0, 0.0, 0.0, 0.0, 0.0, 0.0, 0.0, 0.0, 0.74509805, 0.98431373, 0.98431373, 0.98431373, 0.99215686, 0.24313726, 0.0, 0.0, 0.0, 0.0, 0.0, 0.0, 0.0, 0.0, 0.0, 0.0, 0.0, 0.0, 0.0, 0.0, 0.0, 0.0, 0.0, 0.0, 0.0, 0.0, 0.0, 0.0, 0.74509805, 0.98431373, 0.98431373, 0.98431373, 0.99215686, 0.5529412, 0.0, 0.0, 0.0, 0.0, 0.0, 0.0, 0.0, 0.0, 0.0, 0.0, 0.0, 0.0, 0.0, 0.0, 0.0, 0.0, 0.0, 0.0, 0.0, 0.0, 0.0, 0.0, 0.2, 0.98431373, 0.98431373, 0.98431373, 0.99215686, 0.86274511, 0.0, 0.0, 0.0, 0.0, 0.0, 0.0, 0.0, 0.0, 0.0, 0.0, 0.0, 0.0, 0.0, 0.0, 0.0, 0.0, 0.0, 0.0, 0.0, 0.0, 0.0, 1.0, 0.1254902, 0.98431373, 0.98431373, 0.98431373, 0.99215686, 0.86274511, 0.0, 0.0, 0.0, 0.0, 0.0, 0.0, 0.0, 0.0, 0.0, 0.0, 0.0, 0.0, 0.0, 0.0, 0.0, 0.0, 0.0, 0.0, 0.0, 0.0, 0.0, 0.0, 0.04705882, 0.68235296, 0.99215686, 0.99215686, 1.0, 0.86666667, 0.0, 0.0, 0.0, 0.0, 0.0, 0.0, 0.0, 0.0, 0.0, 0.0, 0.0, 0.0, 0.0, 0.0, 0.0, 0.0, 0.0, 0.0, 0.0, 0.0, 0.0, 0.0, 0.1254902, 0.98431373, 0.98431373, 0.98431373, 0.99215686, 0.86274511, 0.0, 0.0, 0.0, 0.0, 0.0, 0.0, 0.0, 0.0, 0.0, 0.0, 0.0, 0.0, 0.0, 0.0, 0.0, 0.0, 0.0, 0.0, 0.0, 0.0, 0.0, 0.0, 0.1254902, 0.98431373, 0.98431373, 0.98431373, 0.99215686, 0.86274511, 0.0, 0.0, 0.0, 0.0, 0.0, 0.0, 0.0, 1.0, 0.0, 0.0, 0.0, 0.0, 0.0, 0.0, 0.0, 0.0, 0.0, 0.0, 0.0, 0.0, 0.0, 0.0, 0.1254902, 0.98431373, 0.98431373, 0.98431373, 0.99215686, 0.86274511, 0.0, 0.0, 0.0, 0.0, 0.0, 0.0, 0.0, 0.0, 0.0, 0.0, 0.0, 0.0, 0.0, 0.0, 0.0, 0.0, 0.0, 0.0, 0.0, 0.0, 0.0, 0.0, 0.1254902, 0.98431373, 0.98431373, 0.98431373, 0.99215686, 0.86274511, 0.0, 0.0, 0.0, 0.0, 0.0, 0.0, 0.0, 0.0, 0.0, 0.0, 0.0, 0.0, 0.0, 0.0, 0.0, 0.0, 0.0, 0.0, 0.0, 0.0, 0.0, 0.0, 0.07843138, 0.80784315, 0.99215686, 0.99215686, 1.0, 0.99215686, 1.0, 0.0, 0.0, 0.0, 0.0, 0.0, 0.0, 0.0, 0.0, 0.0, 0.0, 0.0, 0.0, 0.0, 0.0, 0.0, 0.0, 0.0, 0.0, 0.0, 0.0, 0.0, 0.0, 0.1254902, 0.89803922, 0.98431373, 0.99215686, 0.98431373, 0.49411765, 0.0, 0.0, 0.0, 0.0, 0.0, 0.0, 0.0, 0.0, 0.0, 0.0, 0.0, 0.0, 0.0, 0.0, 0.0, 0.0, 0.0, 0.0, 0.0, 0.0, 0.0, 0.0, 0.0, 0.86666667, 0.98431373, 0.99215686, 0.98431373, 0.73725492, 0.37254903, 0.0, 0.0, 0.0, 0.0, 0.0, 0.0, 0.0, 0.0, 0.0, 0.0, 0.0, 0.0, 0.0, 0.0, 0.0, 0.0, 0.0, 0.0, 0.0, 0.0, 0.0, 0.0, 0.70980394, 0.82745099, 0.99215686, 0.98431373, 0.98431373, 0.73725492, 0.0, 0.0, 0.0, 0.0, 0.0, 0.0, 0.0, 0.0, 0.0, 0.0, 0.0, 0.0, 0.0, 0.0, 0.0, 0.0, 0.0, 0.0, 0.0, 0.0, 0.0, 0.0, 0.09411765, 0.13725491, 0.60000002, 0.98431373, 0.98431373, 0.34901962, 0.0, 0.0, 0.0, 0.0, 0.0, 0.0, 1.0, 0.0, 0.0, 0.0, 0.0, 0.0, 0.0, 0.0, 0.0, 0.0, 0.0, 0.0, 0.0, 0.0, 0.0, 0.0, 0.0, 0.0, 0.0, 0.0, 0.0, 0.0, 0.0, 0.0, 0.0, 0.0, 0.0, 0.0, 0.0, 0.0, 0.0, 0.0, 0.0, 0.0, 0.0, 0.0, 0.0, 0.0, 0.0, 0.0, 0.0, 1.0, 0.0, 0.0, 0.0, 1.0, 0.0, 0.0, 0.0, 0.0, 0.0, 0.0, 0.0, 0.0, 0.0, 0.0, 0.0, 0.0, 0.0, 0.0, 0.0, 0.0, 0.0, 0.0, 0.0, 0.0, 0.0, 0.0, 0.0, 0.0, 0.0, 0.0, 1.0, 0.0, 0.0, 0.0, 0.0, 0.0, 0.0, 0.0, 0.0, 0.0, 0.0, 0.0, 0.0, 0.0, 0.0, 0.0, 0.0, 0.0, 0.0, 0.0, 0.0, 0.0, 0.0, 0.0, 0.0, 0.0, 0.0, 0.0, 0.0, 1.0, 0.0, 0.0, 0.0, 0.0, 0.0, 0.0, 0.0, 0.0, 0.0, 0.0, 0.0, 0.0, 0.0], (2, 9))
[Thread 1] Total splits: 0
Processed 1 zonotopes (Work Done: 0.0%); Generated 0 (0.006855656s/loop)
[Thread 1] Finished in 0.01s
 ────────────────────────────────────────────────────────────────────────────────
                                        Time                    Allocations      
                               ───────────────────────   ────────────────────────
       Tot / % measured:           7.21ms /  99.9%           4.72MiB / 100.0%    

 Section               ncalls     time    %tot     avg     alloc    %tot      avg
 ────────────────────────────────────────────────────────────────────────────────
 Verify                     1   6.88ms   95.5%  6.88ms   3.92MiB   83.0%  3.92MiB
   Zonotope Loop            1   6.86ms   95.1%  6.86ms   3.91MiB   82.9%  3.91MiB
     Property Check         1   4.79ms   66.5%  4.79ms   1.60MiB   33.9%  1.60MiB
     Zonotope Propa...      1   1.65ms   22.9%  1.65ms   1.09MiB   23.1%  1.09MiB
       DiffZonotope...      4   1.11ms   15.5%   279μs    239KiB    4.9%  59.7KiB
         Zonotope_D...      8    498μs    6.9%  62.3μs    118KiB    2.4%  14.8KiB
       DiffZonotope...      3    528μs    7.3%   176μs    877KiB   18.2%   292KiB
         Zonotope_R...      6    230μs    3.2%  38.3μs    517KiB   10.7%  86.2KiB
           Influenc...      6   76.0μs    1.1%  12.7μs    123KiB    2.5%  20.5KiB
             Multiply       6   51.7μs    0.7%  8.62μs   77.4KiB    1.6%  12.9KiB
             Alloca...      6   13.5μs    0.2%  2.24μs   43.5KiB    0.9%  7.25KiB
             Set Ma...      6   5.22μs    0.1%   870ns     0.00B    0.0%    0.00B
           Column M...      6   63.4μs    0.9%  10.6μs    183KiB    3.8%  30.5KiB
           Allocation       6   35.7μs    0.5%  5.95μs    182KiB    3.8%  30.4KiB
           Set Matrix       6   23.4μs    0.3%  3.89μs   4.50KiB    0.1%     768B
           Vectors          6   20.1μs    0.3%  3.36μs   19.5KiB    0.4%  3.26KiB
           Bounds           6   2.14μs    0.0%   357ns     0.00B    0.0%    0.00B
 Initialize                 1    328μs    4.5%   328μs    821KiB   17.0%   821KiB
 ────────────────────────────────────────────────────────────────────────────────
[VERYDIFF_TIMER] 0.038340214

[VERYDIFF_EXPERIMENT] NETWORK: /home/i57/steuber/NeuroDiff/repos/VeryDiffExperiments/src/../benchmarks/mnist-retrained-new-label/specs/mnist_94_local_15.vnnlib
[VERYDIFF_EXPERIMENT] TIME: 0.769111129
