
[VERYDIFF_EXPERIMENT] Running on /home/i57/steuber/NeuroDiff/repos/VeryDiffExperiments/src/../benchmarks/mnist-prune/specs/mnist_13_local_15.vnnlib /home/i57/steuber/NeuroDiff/repos/VeryDiffExperiments/src/../benchmarks/mnist-prune/nets/mnist_relu_2_512.onnx
Parsing /home/i57/steuber/NeuroDiff/repos/VeryDiffExperiments/src/../benchmarks/mnist-prune/nets/mnist_relu_2_512.onnx...
Found input X
op: matmul, weight: (512, 784), bias: nothing
op: bias, weight: nothing, bias: (512,)
op: relu, weight: nothing, bias: nothing
op: matmul, weight: (512, 512), bias: nothing
op: bias, weight: nothing, bias: (512,)
op: relu, weight: nothing, bias: nothing
op: matmul, weight: (10, 512), bias: nothing
op: bias, weight: nothing, bias: (10,)
Parsing /home/i57/steuber/NeuroDiff/repos/VeryDiffExperiments/src/../benchmarks/mnist-prune/nets_pruned/mnist_relu_2_512_0.79-old.onnx...
Found input X
op: gemm, weight: (512, 784), bias: (512,)
op: relu, weight: nothing, bias: nothing
op: gemm, weight: (512, 512), bias: (512,)
op: relu, weight: nothing, bias: nothing
op: gemm, weight: (10, 512), bias: (10,)
Distance: 973.3044369037136
Distance: 481.63499746812613
Distance: 8.744412635378467
Running with 1 threads
[Thread 1] Time to first task: 0.0s
Instable Generators: 94
Instable Generators: 161
Zono Bounds:
[-3.5293807577429392, -5.654938686494399, -3.997921796231015, -4.501825787485206, -5.376232929399936, -4.419810039666399, -3.9441554267437975, -4.5946038449865405, -4.146014681442214, -4.054037615856707]
[6.110083606221532, 6.610834048275429, 4.982590694519001, 5.638194767733577, 6.389203885662625, 5.08617748761617, 5.872158269527398, 5.824683894488317, 6.017287576679713, 4.826869127959732]
[Thread 1] Total splits: 0
Processed 1 zonotopes (Work Done: 100.0%); Generated 0 (0.103832187s/loop)
[Thread 1] Finished in 0.1s
 ────────────────────────────────────────────────────────────────────────────────
                                        Time                    Allocations      
                               ───────────────────────   ────────────────────────
       Tot / % measured:            106ms / 100.0%           64.0MiB / 100.0%    

 Section               ncalls     time    %tot     avg     alloc    %tot      avg
 ────────────────────────────────────────────────────────────────────────────────
 Verify                     1    104ms   98.1%   104ms   58.8MiB   91.8%  58.8MiB
   Zonotope Loop            1    104ms   98.1%   104ms   58.8MiB   91.8%  58.8MiB
     Property Check         1   78.0ms   73.7%  78.0ms   44.4MiB   69.4%  44.4MiB
     Zonotope Propa...      1   25.6ms   24.2%  25.6ms   13.6MiB   21.2%  13.6MiB
       DiffZonotope...      3   15.7ms   14.8%  5.23ms   2.37MiB    3.7%   809KiB
         Zonotope_D...      6   6.00ms    5.7%  1.00ms   1.06MiB    1.7%   181KiB
       DiffZonotope...      2   9.92ms    9.4%  4.96ms   11.2MiB   17.5%  5.60MiB
         Zonotope_R...      4   8.58ms    8.1%  2.15ms   6.60MiB   10.3%  1.65MiB
           Allocation       4   6.56ms    6.2%  1.64ms   3.00MiB    4.7%   768KiB
           Column M...      4   1.43ms    1.3%   356μs   3.00MiB    4.7%   768KiB
           Influenc...      4    273μs    0.3%  68.3μs    492KiB    0.8%   123KiB
             Multiply       4    243μs    0.2%  60.6μs    399KiB    0.6%   100KiB
             Alloca...      4   18.0μs    0.0%  4.51μs   90.5KiB    0.1%  22.6KiB
             Set Ma...      4   6.25μs    0.0%  1.56μs     0.00B    0.0%    0.00B
           Set Matrix       4    240μs    0.2%  59.9μs   15.6KiB    0.0%  3.90KiB
           Vectors          4   70.6μs    0.1%  17.7μs    100KiB    0.2%  25.0KiB
           Bounds           4   2.32μs    0.0%   580ns     0.00B    0.0%    0.00B
 Initialize                 1   1.96ms    1.9%  1.96ms   5.23MiB    8.2%  5.23MiB
 ────────────────────────────────────────────────────────────────────────────────
[VERYDIFF_TIMER] 0.136378349

[VERYDIFF_EXPERIMENT] NETWORK: /home/i57/steuber/NeuroDiff/repos/VeryDiffExperiments/src/../benchmarks/mnist-prune/specs/mnist_13_local_15.vnnlib
[VERYDIFF_EXPERIMENT] TIME: 0.43848522
