
[VERYDIFF_EXPERIMENT] Running on /home/i57/steuber/NeuroDiff/repos/VeryDiffExperiments/src/../benchmarks/mnist-prune/specs/mnist_33_global_4.vnnlib /home/i57/steuber/NeuroDiff/repos/VeryDiffExperiments/src/../benchmarks/mnist-prune/nets/mnist_relu_2_512.onnx
Parsing /home/i57/steuber/NeuroDiff/repos/VeryDiffExperiments/src/../benchmarks/mnist-prune/nets/mnist_relu_2_512.onnx...
Found input X
op: matmul, weight: (512, 784), bias: nothing
op: bias, weight: nothing, bias: (512,)
op: relu, weight: nothing, bias: nothing
op: matmul, weight: (512, 512), bias: nothing
op: bias, weight: nothing, bias: (512,)
op: relu, weight: nothing, bias: nothing
op: matmul, weight: (10, 512), bias: nothing
op: bias, weight: nothing, bias: (10,)
Parsing /home/i57/steuber/NeuroDiff/repos/VeryDiffExperiments/src/../benchmarks/mnist-prune/nets_pruned/mnist_relu_2_512_pruned5.onnx...
Found input X
op: matmul, weight: (512, 784), bias: nothing
op: bias, weight: nothing, bias: (512,)
op: relu, weight: nothing, bias: nothing
op: matmul, weight: (512, 512), bias: nothing
op: bias, weight: nothing, bias: (512,)
op: relu, weight: nothing, bias: nothing
op: matmul, weight: (10, 512), bias: nothing
op: bias, weight: nothing, bias: (10,)
Distance: 1085.5985166831802
Distance: 1719.8468985003963
Distance: 31.228482716001736
Running with 1 threads
[Thread 1] Time to first task: 0.01s
Instable Generators: 99
Instable Generators: 142
Zono Bounds:
[-8.924899790634154, -8.722973594606149, -11.623321591002401, -9.122443581000436, -2.7170927573092314, -6.288817412032512, -6.714873039369267, -7.695738405658929, -8.605635142953915, -7.9164559620874595]
[1.6891480294134875, 1.8316589119530615, -2.4133330635932397, 0.3728987713172307, 7.284835122569106, 2.2160618398258487, 3.07902158604882, 1.6187693567314185, -1.3174672783000747, 0.5528700044564228]
[Thread 1] Total splits: 0
Processed 1 zonotopes (Work Done: 100.0%); Generated 0 (0.604432366s/loop)
[Thread 1] Finished in 0.6s
 ────────────────────────────────────────────────────────────────────────────────
                                        Time                    Allocations      
                               ───────────────────────   ────────────────────────
       Tot / % measured:            607ms / 100.0%            215MiB / 100.0%    

 Section               ncalls     time    %tot     avg     alloc    %tot      avg
 ────────────────────────────────────────────────────────────────────────────────
 Verify                     1    604ms   99.6%   604ms    205MiB   95.4%   205MiB
   Zonotope Loop            1    604ms   99.6%   604ms    205MiB   95.4%   205MiB
     Property Check         1    386ms   63.6%   386ms   74.5MiB   34.7%  74.5MiB
     Zonotope Propa...      1    209ms   34.5%   209ms    111MiB   51.5%   111MiB
       DiffZonotope...      2    106ms   17.4%  52.8ms   90.0MiB   41.9%  45.0MiB
         Zonotope_R...      4   98.5ms   16.2%  24.6ms   79.3MiB   36.9%  19.8MiB
           Allocation       4   61.2ms   10.1%  15.3ms   15.0MiB    7.0%  3.75MiB
           Influenc...      4   29.9ms    4.9%  7.48ms   49.2MiB   22.9%  12.3MiB
             Multiply       4   24.6ms    4.1%  6.15ms   26.2MiB   12.2%  6.55MiB
             Set Ma...      4   2.96ms    0.5%   740μs     0.00B    0.0%    0.00B
             Alloca...      4   2.33ms    0.4%   583μs   23.0MiB   10.7%  5.75MiB
           Column M...      4   5.43ms    0.9%  1.36ms   15.0MiB    7.0%  3.75MiB
           Set Matrix       4   1.90ms    0.3%   475μs   15.2KiB    0.0%  3.81KiB
           Vectors          4   85.0μs    0.0%  21.3μs    100KiB    0.0%  25.0KiB
           Bounds           4   2.71μs    0.0%   676ns     0.00B    0.0%    0.00B
       DiffZonotope...      3    104ms   17.1%  34.5ms   20.7MiB    9.6%  6.90MiB
         Zonotope_D...      6   48.7ms    8.0%  8.11ms   13.2MiB    6.2%  2.21MiB
 Initialize                 1   2.21ms    0.4%  2.21ms   9.84MiB    4.6%  9.84MiB
 ────────────────────────────────────────────────────────────────────────────────
[VERYDIFF_TIMER] 0.636726962

[VERYDIFF_EXPERIMENT] Running on /home/i57/steuber/NeuroDiff/repos/VeryDiffExperiments/src/../benchmarks/mnist-prune/specs/mnist_33_global_4.vnnlib /home/i57/steuber/NeuroDiff/repos/VeryDiffExperiments/src/../benchmarks/mnist-prune/nets/mnist_relu_3_100.onnx
Parsing /home/i57/steuber/NeuroDiff/repos/VeryDiffExperiments/src/../benchmarks/mnist-prune/nets/mnist_relu_3_100.onnx...
Found input X
op: matmul, weight: (100, 784), bias: nothing
op: bias, weight: nothing, bias: (100,)
op: relu, weight: nothing, bias: nothing
op: matmul, weight: (100, 100), bias: nothing
op: bias, weight: nothing, bias: (100,)
op: relu, weight: nothing, bias: nothing
op: matmul, weight: (10, 100), bias: nothing
op: bias, weight: nothing, bias: (10,)
op: relu, weight: nothing, bias: nothing
op: matmul, weight: (10, 10), bias: nothing
op: bias, weight: nothing, bias: (10,)
Parsing /home/i57/steuber/NeuroDiff/repos/VeryDiffExperiments/src/../benchmarks/mnist-prune/nets_pruned/mnist_relu_3_100_pruned5.onnx...
Found input X
op: matmul, weight: (100, 784), bias: nothing
op: bias, weight: nothing, bias: (100,)
op: relu, weight: nothing, bias: nothing
op: matmul, weight: (100, 100), bias: nothing
op: bias, weight: nothing, bias: (100,)
op: relu, weight: nothing, bias: nothing
op: matmul, weight: (10, 100), bias: nothing
op: bias, weight: nothing, bias: (10,)
op: relu, weight: nothing, bias: nothing
op: matmul, weight: (10, 10), bias: nothing
op: bias, weight: nothing, bias: (10,)
Distance: 296.6600370998244
Distance: 77.24290861755458
Distance: 5.7170369567975285
Distance: 0.0
Running with 1 threads
[Thread 1] Time to first task: 0.0s
Instable Generators: 20
Instable Generators: 34
Instable Generators: 3
Zono Bounds:
[-0.32385028781888586, 0.0, -0.307321508451227, 0.0, -0.28832899056884775, -0.3291451347018308, -0.3724844207949494, -0.4507645335528091, -0.3402435986118222, 0.0]
[0.3055277903377333, 0.0, 0.2701331738923552, 0.0, 0.5200981957549706, 0.3291451347018308, 0.2694594774688022, 0.4507645335528091, 0.3402435986118222, 0.0]
[Thread 1] Processed 100 zonotopes (Work Done: 0.0%; Expected Zonos: Inf)
[Thread 1] Processed 200 zonotopes (Work Done: 0.0%; Expected Zonos: Inf)
[Thread 1] Processed 300 zonotopes (Work Done: 0.0%; Expected Zonos: Inf)


TIMEOUT REACHED
UNKNOWN
[Thread 1] Total splits: 359
Processed 359 zonotopes (Work Done: 0.0%); Generated 718 (0.33457670551810587s/loop)
[Thread 1] Finished in 120.11s
 ────────────────────────────────────────────────────────────────────────────────
                                        Time                    Allocations      
                               ───────────────────────   ────────────────────────
       Tot / % measured:             120s / 100.0%           57.2GiB / 100.0%    

 Section               ncalls     time    %tot     avg     alloc    %tot      avg
 ────────────────────────────────────────────────────────────────────────────────
 Verify                     1     120s  100.0%    120s   57.1GiB  100.0%  57.1GiB
   Zonotope Loop            1     120s  100.0%    120s   57.1GiB  100.0%  57.1GiB
     Property Check       359    74.6s   62.1%   208ms   19.9GiB   34.8%  56.7MiB
     Zonotope Propa...    359    24.5s   20.4%  68.3ms   25.0GiB   43.7%  71.2MiB
       DiffZonotope...  1.08k    14.4s   12.0%  13.4ms   23.5GiB   41.2%  22.4MiB
         Zonotope_R...  2.15k    14.1s   11.7%  6.55ms   23.0GiB   40.2%  10.9MiB
           Influenc...  2.15k    13.7s   11.4%  6.34ms   21.1GiB   37.0%  10.0MiB
             Multiply   2.15k    6.59s    5.5%  3.06ms   10.7GiB   18.7%  5.08MiB
             Alloca...  2.15k    5.59s    4.7%  2.60ms   10.4GiB   18.3%  4.96MiB
             Set Ma...  2.15k    1.47s    1.2%   683μs     0.00B    0.0%    0.00B
           Column M...  2.15k    273ms    0.2%   127μs    948MiB    1.6%   451KiB
           Set Matrix   2.15k    108ms    0.1%  50.0μs   1.59MiB    0.0%     776B
           Allocation   2.15k   47.9ms    0.0%  22.2μs    948MiB    1.6%   451KiB
           Vectors      2.15k   10.5ms    0.0%  4.87μs   6.85MiB    0.0%  3.26KiB
           Bounds       2.15k   1.48ms    0.0%   688ns     0.00B    0.0%    0.00B
       DiffZonotope...  1.44k    10.1s    8.4%  7.01ms   1.43GiB    2.5%  1.02MiB
         Zonotope_D...  2.87k    7.13s    5.9%  2.48ms   0.94GiB    1.7%   344KiB
     Compute Split        359    2.70s    2.2%  7.51ms   5.31GiB    9.3%  15.1MiB
 Initialize                 1    564μs    0.0%   564μs   5.41MiB    0.0%  5.41MiB
 ────────────────────────────────────────────────────────────────────────────────
[VERYDIFF_TIMER] 120.138650329

[VERYDIFF_EXPERIMENT] NETWORK: /home/i57/steuber/NeuroDiff/repos/VeryDiffExperiments/src/../benchmarks/mnist-prune/specs/mnist_33_global_4.vnnlib
[VERYDIFF_EXPERIMENT] TIME: 121.427456471
