
[VERYDIFF_EXPERIMENT] Running on /home/i57/steuber/NeuroDiff/repos/VeryDiffExperiments/src/../benchmarks/mnist-prune/specs/mnist_88_local_18.vnnlib /home/i57/steuber/NeuroDiff/repos/VeryDiffExperiments/src/../benchmarks/mnist-prune/nets/mnist_relu_4_1024.onnx
Found input X
op: matmul, weight: (1024, 784), bias: nothing
op: bias, weight: nothing, bias: (1024,)
op: relu, weight: nothing, bias: nothing
op: matmul, weight: (1024, 1024), bias: nothing
op: bias, weight: nothing, bias: (1024,)
op: relu, weight: nothing, bias: nothing
op: matmul, weight: (1024, 1024), bias: nothing
op: bias, weight: nothing, bias: (1024,)
op: relu, weight: nothing, bias: nothing
op: matmul, weight: (10, 1024), bias: nothing
op: bias, weight: nothing, bias: (10,)
op: relu, weight: nothing, bias: nothing
op: matmul, weight: (10, 10), bias: nothing
op: bias, weight: nothing, bias: (10,)
Found input X
op: gemm, weight: (1024, 784), bias: (1024,)
op: relu, weight: nothing, bias: nothing
op: gemm, weight: (1024, 1024), bias: (1024,)
op: relu, weight: nothing, bias: nothing
op: gemm, weight: (1024, 1024), bias: (1024,)
op: relu, weight: nothing, bias: nothing
op: gemm, weight: (10, 1024), bias: (10,)
op: relu, weight: nothing, bias: nothing
op: gemm, weight: (10, 10), bias: (10,)
Distance: 915.6394868631054
Distance: 1298.7052820973968
Distance: 1296.587532894263
Distance: 6.054483317080667
Distance: 0.04942679278974538
Running with 1 threads
[Thread 1] Time to first task: 0.0s
Instable Generators: 362
Instable Generators: 662
Instable Generators: 1022
Instable Generators: 10
Zono Bounds:
[-92.37319177396051, -93.62919918896728, -103.669717824618, -102.89454933786851, -99.08560864022493, -104.6626129753972, -93.45862477905638, -97.79555923649431, -100.18883485653399, -104.22654250240315]
[92.3073541004751, 92.85871851148187, 102.75063428821895, 102.60699917697096, 99.0495350851896, 104.65384777179176, 93.4293620635082, 97.4201335224079, 100.07862698590074, 103.78742861128639]
[Thread 1] Processed 100 zonotopes (Work Done: 0.0%; Expected Zonos: Inf)


TIMEOUT REACHED
UNKNOWN
[Thread 1] Total splits: 159
Processed 159 zonotopes (Work Done: 0.0%); Generated 318 (0.7580079519056604s/loop)
[Thread 1] Finished in 120.52s
 ────────────────────────────────────────────────────────────────────────────────
                                        Time                    Allocations      
                               ───────────────────────   ────────────────────────
       Tot / % measured:             121s / 100.0%           36.2GiB / 100.0%    

 Section               ncalls     time    %tot     avg     alloc    %tot      avg
 ────────────────────────────────────────────────────────────────────────────────
 Verify                     1     121s  100.0%    121s   36.2GiB   99.9%  36.2GiB
   Zonotope Loop            1     121s  100.0%    121s   36.2GiB   99.9%  36.2GiB
     Zonotope Propa...    159     120s   99.4%   754ms   35.9GiB   99.0%   231MiB
       DiffZonotope...    636    63.9s   53.0%   101ms   28.5GiB   78.6%  45.9MiB
         Zonotope_R...  1.27k    40.6s   33.7%  31.9ms   17.5GiB   48.2%  14.1MiB
           Allocation   1.27k    33.3s   27.6%  26.2ms   7.30GiB   20.1%  5.87MiB
           Column M...  1.27k    4.31s    3.6%  3.39ms   7.30GiB   20.1%  5.87MiB
           Influenc...  1.27k    1.82s    1.5%  1.43ms   2.81GiB    7.8%  2.26MiB
             Multiply   1.27k    1.77s    1.5%  1.39ms   2.61GiB    7.2%  2.10MiB
             Alloca...  1.27k   36.7ms    0.0%  28.9μs    210MiB    0.6%   169KiB
             Set Ma...  1.27k   14.6ms    0.0%  11.5μs     0.00B    0.0%    0.00B
           Set Matrix   1.27k    1.13s    0.9%   892μs   14.6MiB    0.0%  11.7KiB
           Vectors      1.27k   39.0ms    0.0%  30.7μs   42.2MiB    0.1%  34.0KiB
           Bounds       1.27k    862μs    0.0%   677ns     0.00B    0.0%    0.00B
       DiffZonotope...    795    55.9s   46.4%  70.3ms   7.39GiB   20.4%  9.52MiB
         Zonotope_D...  1.59k    18.9s   15.7%  11.9ms   3.01GiB    8.3%  1.94MiB
     Property Check       159    585ms    0.5%  3.68ms   67.7MiB    0.2%   436KiB
     Compute Split        159   55.6ms    0.0%   349μs    144MiB    0.4%   925KiB
 Initialize                 1   13.9ms    0.0%  13.9ms   22.4MiB    0.1%  22.4MiB
 ────────────────────────────────────────────────────────────────────────────────
[VERYDIFF_TIMER] 120.619645713

[VERYDIFF_EXPERIMENT] NETWORK: /home/i57/steuber/NeuroDiff/repos/VeryDiffExperiments/src/../benchmarks/mnist-prune/specs/mnist_88_local_18.vnnlib
[VERYDIFF_EXPERIMENT] TIME: 120.87093055
