
[VERYDIFF_EXPERIMENT] Running on /home/i57/steuber/NeuroDiff/repos/VeryDiffExperiments/src/../benchmarks/mnist-prune/specs/mnist_70_global_4.vnnlib /home/i57/steuber/NeuroDiff/repos/VeryDiffExperiments/src/../benchmarks/mnist-prune/nets/mnist_relu_2_512.onnx
Found input X
op: matmul, weight: (512, 784), bias: nothing
op: bias, weight: nothing, bias: (512,)
op: relu, weight: nothing, bias: nothing
op: matmul, weight: (512, 512), bias: nothing
op: bias, weight: nothing, bias: (512,)
op: relu, weight: nothing, bias: nothing
op: matmul, weight: (10, 512), bias: nothing
op: bias, weight: nothing, bias: (10,)
Found input X
op: gemm, weight: (512, 784), bias: (512,)
op: relu, weight: nothing, bias: nothing
op: gemm, weight: (512, 512), bias: (512,)
op: relu, weight: nothing, bias: nothing
op: gemm, weight: (10, 512), bias: (10,)
Distance: 973.3044369037136
Distance: 481.63499746812613
Distance: 8.744412635378467
Running with 1 threads
[Thread 1] Time to first task: 0.01s
Instable Generators: 130
Instable Generators: 148
Zono Bounds:
[-6.179910764016677, -5.879826890940787, -4.99961475675023, -6.504700652532653, -6.285569493791221, -6.0854343109675195, -6.493329678545226, -5.258988745106102, -5.266233405747071, -5.177656933774104]
[8.25322772381944, 9.495772357332017, 6.805626600951337, 7.695346095257635, 9.521459209259692, 7.09319248808089, 8.951115903234815, 6.253668652928434, 7.402706850669743, 7.86546101468139]
[Thread 1] Processed 100 zonotopes (Work Done: 0.0%; Expected Zonos: Inf)
[Thread 1] Processed 200 zonotopes (Work Done: 0.0%; Expected Zonos: Inf)
[Thread 1] Processed 300 zonotopes (Work Done: 0.0%; Expected Zonos: Inf)


TIMEOUT REACHED
UNKNOWN
[Thread 1] Total splits: 322
Processed 322 zonotopes (Work Done: 0.0%); Generated 644 (0.3738828987142857s/loop)
[Thread 1] Finished in 120.39s
 ────────────────────────────────────────────────────────────────────────────────
                                        Time                    Allocations      
                               ───────────────────────   ────────────────────────
       Tot / % measured:             120s / 100.0%           47.8GiB / 100.0%    

 Section               ncalls     time    %tot     avg     alloc    %tot      avg
 ────────────────────────────────────────────────────────────────────────────────
 Verify                     1     120s  100.0%    120s   47.8GiB  100.0%  47.8GiB
   Zonotope Loop            1     120s  100.0%    120s   47.8GiB  100.0%  47.8GiB
     Zonotope Propa...    322    88.5s   73.5%   275ms   35.9GiB   75.0%   114MiB
       DiffZonotope...    644    53.6s   44.5%  83.2ms   29.2GiB   61.1%  46.4MiB
         Zonotope_R...  1.29k    51.4s   42.7%  39.9ms   25.7GiB   53.7%  20.4MiB
           Allocation   1.29k    26.0s   21.6%  20.2ms   4.84GiB   10.1%  3.85MiB
           Influenc...  1.29k    16.5s   13.7%  12.8ms   15.9GiB   33.4%  12.7MiB
             Multiply   1.29k    8.42s    7.0%  6.54ms   8.53GiB   17.9%  6.78MiB
             Alloca...  1.29k    7.04s    5.9%  5.47ms   7.41GiB   15.5%  5.89MiB
             Set Ma...  1.29k    1.00s    0.8%   777μs     0.00B    0.0%    0.00B
           Column M...  1.29k    8.36s    6.9%  6.49ms   4.84GiB   10.1%  3.85MiB
           Set Matrix   1.29k    596ms    0.5%   463μs   5.09MiB    0.0%  4.04KiB
           Vectors      1.29k   24.4ms    0.0%  19.0μs   31.4MiB    0.1%  25.0KiB
           Bounds       1.29k    998μs    0.0%   775ns     0.00B    0.0%    0.00B
       DiffZonotope...    966    34.9s   29.0%  36.1ms   6.67GiB   14.0%  7.07MiB
         Zonotope_D...  1.93k    16.1s   13.4%  8.34ms   4.23GiB    8.8%  2.24MiB
     Compute Split        322    3.00s    2.5%  9.32ms   5.58GiB   11.7%  17.7MiB
     Property Check       322    994ms    0.8%  3.09ms   74.8MiB    0.2%   238KiB
 Initialize                 1   2.16ms    0.0%  2.16ms   9.84MiB    0.0%  9.84MiB
 ────────────────────────────────────────────────────────────────────────────────
[VERYDIFF_TIMER] 120.435272168

[VERYDIFF_EXPERIMENT] NETWORK: /home/i57/steuber/NeuroDiff/repos/VeryDiffExperiments/src/../benchmarks/mnist-prune/specs/mnist_70_global_4.vnnlib
[VERYDIFF_EXPERIMENT] TIME: 120.842095105
