
[VERYDIFF_EXPERIMENT] Running on /home/i57/steuber/NeuroDiff/repos/VeryDiffExperiments/src/../benchmarks/mnist-prune/specs/mnist_19_global_5.vnnlib /home/i57/steuber/NeuroDiff/repos/VeryDiffExperiments/src/../benchmarks/mnist-prune/nets/mnist_relu_4_1024.onnx
Found input X
op: matmul, weight: (1024, 784), bias: nothing
op: bias, weight: nothing, bias: (1024,)
op: relu, weight: nothing, bias: nothing
op: matmul, weight: (1024, 1024), bias: nothing
op: bias, weight: nothing, bias: (1024,)
op: relu, weight: nothing, bias: nothing
op: matmul, weight: (1024, 1024), bias: nothing
op: bias, weight: nothing, bias: (1024,)
op: relu, weight: nothing, bias: nothing
op: matmul, weight: (10, 1024), bias: nothing
op: bias, weight: nothing, bias: (10,)
op: relu, weight: nothing, bias: nothing
op: matmul, weight: (10, 10), bias: nothing
op: bias, weight: nothing, bias: (10,)
Found input X
op: gemm, weight: (1024, 784), bias: (1024,)
op: relu, weight: nothing, bias: nothing
op: gemm, weight: (1024, 1024), bias: (1024,)
op: relu, weight: nothing, bias: nothing
op: gemm, weight: (1024, 1024), bias: (1024,)
op: relu, weight: nothing, bias: nothing
op: gemm, weight: (10, 1024), bias: (10,)
op: relu, weight: nothing, bias: nothing
op: gemm, weight: (10, 10), bias: (10,)
Distance: 915.6394868631054
Distance: 1298.7052820973968
Distance: 1296.587532894263
Distance: 6.054483317080667
Distance: 0.04942679278974538
Running with 1 threads
[Thread 1] Time to first task: 0.01s
Instable Generators: 494
Instable Generators: 928
Instable Generators: 1024
Instable Generators: 10
Zono Bounds:
[-138.54540357172854, -140.83377389185114, -155.92954055056367, -154.63211021299867, -148.9514836816669, -157.43235164937386, -140.9091351456967, -147.09453068293945, -150.1947555807903, -156.6555896160002]
[138.15969592734152, 140.65916638696655, 155.10586671692437, 154.2527020730547, 148.8459118942136, 157.3364335726589, 140.8966695286264, 146.36493220424617, 150.27069168783805, 156.41839494243965]


TIMEOUT REACHED
UNKNOWN
[Thread 1] Total splits: 45
Processed 45 zonotopes (Work Done: 0.0%); Generated 90 (2.700262079622222s/loop)
[Thread 1] Finished in 121.51s
 ────────────────────────────────────────────────────────────────────────────────
                                        Time                    Allocations      
                               ───────────────────────   ────────────────────────
       Tot / % measured:             122s / 100.0%           36.3GiB / 100.0%    

 Section               ncalls     time    %tot     avg     alloc    %tot      avg
 ────────────────────────────────────────────────────────────────────────────────
 Verify                     1     122s  100.0%    122s   36.3GiB   99.9%  36.3GiB
   Zonotope Loop            1     122s  100.0%    122s   36.3GiB   99.9%  36.3GiB
     Zonotope Propa...     45     119s   98.2%   2.65s   33.5GiB   92.1%   762MiB
       DiffZonotope...    180    67.0s   55.1%   372ms   27.7GiB   76.1%   157MiB
         Zonotope_R...    360    60.3s   49.6%   168ms   22.3GiB   61.4%  63.4MiB
           Influenc...    360    34.9s   28.7%  96.9ms   13.0GiB   35.9%  37.1MiB
             Multiply     360    19.8s   16.3%  54.9ms   7.81GiB   21.5%  22.2MiB
             Alloca...    360    14.3s   11.7%  39.6ms   5.22GiB   14.4%  14.9MiB
             Set Ma...    360    832ms    0.7%  2.31ms     0.00B    0.0%    0.00B
           Column M...    360    12.9s   10.6%  35.7ms   4.62GiB   12.7%  13.2MiB
           Allocation     360    11.7s    9.6%  32.5ms   4.62GiB   12.7%  13.2MiB
           Set Matrix     360    868ms    0.7%  2.41ms   5.47MiB    0.0%  15.6KiB
           Vectors        360   9.02ms    0.0%  25.1μs   11.9MiB    0.0%  34.0KiB
           Bounds         360    252μs    0.0%   701ns     0.00B    0.0%    0.00B
       DiffZonotope...    225    52.3s   43.1%   233ms   5.80GiB   16.0%  26.4MiB
         Zonotope_D...    450    16.8s   13.8%  37.3ms   2.97GiB    8.2%  6.77MiB
     Compute Split         45    1.91s    1.6%  42.4ms   1.94GiB    5.3%  44.1MiB
     Property Check        45    169ms    0.1%  3.76ms   31.5MiB    0.1%   717KiB
 Initialize                 1   14.8ms    0.0%  14.8ms   27.0MiB    0.1%  27.0MiB
 ────────────────────────────────────────────────────────────────────────────────
[VERYDIFF_TIMER] 121.602272857

[VERYDIFF_EXPERIMENT] NETWORK: /home/i57/steuber/NeuroDiff/repos/VeryDiffExperiments/src/../benchmarks/mnist-prune/specs/mnist_19_global_5.vnnlib
[VERYDIFF_EXPERIMENT] TIME: 121.945262326
