
[VERYDIFF_EXPERIMENT] Running on /home/i57/steuber/NeuroDiff/repos/VeryDiffExperiments/src/../benchmarks/mnist-prune/specs/mnist_79_global_3.vnnlib /home/i57/steuber/NeuroDiff/repos/VeryDiffExperiments/src/../benchmarks/mnist-prune/nets/mnist_relu_4_1024.onnx
Found input X
op: matmul, weight: (1024, 784), bias: nothing
op: bias, weight: nothing, bias: (1024,)
op: relu, weight: nothing, bias: nothing
op: matmul, weight: (1024, 1024), bias: nothing
op: bias, weight: nothing, bias: (1024,)
op: relu, weight: nothing, bias: nothing
op: matmul, weight: (1024, 1024), bias: nothing
op: bias, weight: nothing, bias: (1024,)
op: relu, weight: nothing, bias: nothing
op: matmul, weight: (10, 1024), bias: nothing
op: bias, weight: nothing, bias: (10,)
op: relu, weight: nothing, bias: nothing
op: matmul, weight: (10, 10), bias: nothing
op: bias, weight: nothing, bias: (10,)
Found input X
op: gemm, weight: (1024, 784), bias: (1024,)
op: relu, weight: nothing, bias: nothing
op: gemm, weight: (1024, 1024), bias: (1024,)
op: relu, weight: nothing, bias: nothing
op: gemm, weight: (1024, 1024), bias: (1024,)
op: relu, weight: nothing, bias: nothing
op: gemm, weight: (10, 1024), bias: (10,)
op: relu, weight: nothing, bias: nothing
op: gemm, weight: (10, 10), bias: (10,)
Distance: 915.6394868631054
Distance: 1298.7052820973968
Distance: 1296.587532894263
Distance: 6.054483317080667
Distance: 0.04942679278974538
Running with 1 threads
[Thread 1] Time to first task: 0.0s
Instable Generators: 189
Instable Generators: 245
Instable Generators: 406
Instable Generators: 4
Zono Bounds:
[-0.0014590768226133755, -10.340890334177768, -10.844068948444498, -11.792785228972825, -10.111345552717804, 0.0009206770695916414, -0.002034509167748429, -10.450059647083833, -11.123782870059431, -11.081783725997118]
[0.005047681212093308, 10.158146828313836, 10.9324644992634, 11.433480933052412, 10.099118939090268, 0.013187413984517189, 0.00115198228419119, 10.363322766274198, 10.624200010319653, 10.88101335672838]


TIMEOUT REACHED
UNKNOWN
[Thread 1] Total splits: 86
Processed 86 zonotopes (Work Done: 0.0%); Generated 172 (1.3997074729302326s/loop)
[Thread 1] Finished in 120.37s
 ────────────────────────────────────────────────────────────────────────────────
                                        Time                    Allocations      
                               ───────────────────────   ────────────────────────
       Tot / % measured:             120s / 100.0%           37.2GiB / 100.0%    

 Section               ncalls     time    %tot     avg     alloc    %tot      avg
 ────────────────────────────────────────────────────────────────────────────────
 Verify                     1     120s  100.0%    120s   37.1GiB   99.9%  37.1GiB
   Zonotope Loop            1     120s  100.0%    120s   37.1GiB   99.9%  37.1GiB
     Zonotope Propa...     86     117s   97.4%   1.36s   33.4GiB   89.8%   397MiB
       DiffZonotope...    430    69.9s   58.1%   163ms   6.75GiB   18.2%  16.1MiB
         Zonotope_D...    860    42.5s   35.3%  49.5ms   3.95GiB   10.6%  4.70MiB
       DiffZonotope...    344    47.3s   39.3%   138ms   26.6GiB   71.6%  79.2MiB
         Zonotope_R...    688    43.7s   36.3%  63.5ms   22.1GiB   59.4%  32.8MiB
           Influenc...    688    40.5s   33.6%  58.8ms   12.0GiB   32.3%  17.9MiB
             Alloca...    688    26.0s   21.6%  37.8ms   5.45GiB   14.7%  8.11MiB
             Multiply     688    13.6s   11.3%  19.8ms   6.57GiB   17.7%  9.78MiB
             Set Ma...    688    838ms    0.7%  1.22ms     0.00B    0.0%    0.00B
           Column M...    688    2.05s    1.7%  2.98ms   5.01GiB   13.5%  7.46MiB
           Set Matrix     688    839ms    0.7%  1.22ms   4.04MiB    0.0%  6.02KiB
           Allocation     688    334ms    0.3%   485μs   5.01GiB   13.5%  7.46MiB
           Vectors        688   20.4ms    0.0%  29.7μs   22.8MiB    0.1%  34.0KiB
           Bounds         688    538μs    0.0%   782ns     0.00B    0.0%    0.00B
     Compute Split         86    1.87s    1.6%  21.8ms   2.06GiB    5.5%  24.5MiB
     Property Check        86    974ms    0.8%  11.3ms   46.1MiB    0.1%   549KiB
 Initialize                 1   14.6ms    0.0%  14.6ms   27.0MiB    0.1%  27.0MiB
 ────────────────────────────────────────────────────────────────────────────────
[VERYDIFF_TIMER] 120.468769334

[VERYDIFF_EXPERIMENT] NETWORK: /home/i57/steuber/NeuroDiff/repos/VeryDiffExperiments/src/../benchmarks/mnist-prune/specs/mnist_79_global_3.vnnlib
[VERYDIFF_EXPERIMENT] TIME: 120.81824244
