
[VERYDIFF_EXPERIMENT] Running on /home/i57/steuber/NeuroDiff/repos/VeryDiffExperiments/src/../benchmarks/mnist-prune/specs/mnist_82_global_6.vnnlib /home/i57/steuber/NeuroDiff/repos/VeryDiffExperiments/src/../benchmarks/mnist-prune/nets/mnist_relu_4_1024.onnx
Found input X
op: matmul, weight: (1024, 784), bias: nothing
op: bias, weight: nothing, bias: (1024,)
op: relu, weight: nothing, bias: nothing
op: matmul, weight: (1024, 1024), bias: nothing
op: bias, weight: nothing, bias: (1024,)
op: relu, weight: nothing, bias: nothing
op: matmul, weight: (1024, 1024), bias: nothing
op: bias, weight: nothing, bias: (1024,)
op: relu, weight: nothing, bias: nothing
op: matmul, weight: (10, 1024), bias: nothing
op: bias, weight: nothing, bias: (10,)
op: relu, weight: nothing, bias: nothing
op: matmul, weight: (10, 10), bias: nothing
op: bias, weight: nothing, bias: (10,)
Found input X
op: gemm, weight: (1024, 784), bias: (1024,)
op: relu, weight: nothing, bias: nothing
op: gemm, weight: (1024, 1024), bias: (1024,)
op: relu, weight: nothing, bias: nothing
op: gemm, weight: (1024, 1024), bias: (1024,)
op: relu, weight: nothing, bias: nothing
op: gemm, weight: (10, 1024), bias: (10,)
op: relu, weight: nothing, bias: nothing
op: gemm, weight: (10, 10), bias: (10,)
Distance: 915.6394868631054
Distance: 1298.7052820973968
Distance: 1296.587532894263
Distance: 6.054483317080667
Distance: 0.04942679278974538
Running with 1 threads
[Thread 1] Time to first task: 0.01s
Instable Generators: 362
Instable Generators: 689
Instable Generators: 1024
Instable Generators: 10
Zono Bounds:
[-110.97871643280416, -112.53812598725898, -124.26684240453673, -123.7611729439951, -118.46728095811241, -124.58967951176653, -112.15904757167544, -117.06024608016617, -120.08447169219843, -124.81441709940587]
[110.4978391428283, 112.19230020540977, 124.16175841877913, 123.61940255655271, 118.25911683198007, 124.55935175164787, 111.79977704035622, 116.94082973259742, 119.85745475320604, 124.49276451989466]


TIMEOUT REACHED
UNKNOWN
[Thread 1] Total splits: 50
Processed 50 zonotopes (Work Done: 0.0%); Generated 100 (2.44690840142s/loop)
[Thread 1] Finished in 122.35s
 ────────────────────────────────────────────────────────────────────────────────
                                        Time                    Allocations      
                               ───────────────────────   ────────────────────────
       Tot / % measured:             122s / 100.0%           34.7GiB / 100.0%    

 Section               ncalls     time    %tot     avg     alloc    %tot      avg
 ────────────────────────────────────────────────────────────────────────────────
 Verify                     1     122s  100.0%    122s   34.6GiB   99.9%  34.6GiB
   Zonotope Loop            1     122s  100.0%    122s   34.6GiB   99.9%  34.6GiB
     Zonotope Propa...     50     120s   98.1%   2.40s   31.7GiB   91.5%   649MiB
       DiffZonotope...    250    63.1s   51.6%   252ms   5.47GiB   15.8%  22.4MiB
         Zonotope_D...    500    39.9s   32.6%  79.8ms   2.91GiB    8.4%  5.96MiB
       DiffZonotope...    200    56.9s   46.5%   285ms   26.2GiB   75.7%   134MiB
         Zonotope_R...    400    46.8s   38.2%   117ms   21.3GiB   61.4%  54.5MiB
           Influenc...    400    37.3s   30.5%  93.4ms   12.3GiB   35.6%  31.6MiB
             Multiply     400    23.9s   19.6%  59.8ms   7.28GiB   21.0%  18.6MiB
             Alloca...    400    12.6s   10.3%  31.5ms   5.07GiB   14.6%  13.0MiB
             Set Ma...    400    796ms    0.7%  1.99ms     0.00B    0.0%    0.00B
           Column M...    400    5.20s    4.3%  13.0ms   4.46GiB   12.9%  11.4MiB
           Allocation     400    3.39s    2.8%  8.46ms   4.46GiB   12.9%  11.4MiB
           Set Matrix     400    806ms    0.7%  2.02ms   5.22MiB    0.0%  13.4KiB
           Vectors        400   11.1ms    0.0%  27.6μs   13.3MiB    0.0%  34.0KiB
           Bounds         400    289μs    0.0%   723ns     0.00B    0.0%    0.00B
     Compute Split         50    1.92s    1.6%  38.5ms   1.93GiB    5.6%  39.6MiB
     Property Check        50    187ms    0.2%  3.74ms   32.1MiB    0.1%   658KiB
 Initialize                 1   14.9ms    0.0%  14.9ms   27.0MiB    0.1%  27.0MiB
 ────────────────────────────────────────────────────────────────────────────────
[VERYDIFF_TIMER] 122.440086379

[VERYDIFF_EXPERIMENT] NETWORK: /home/i57/steuber/NeuroDiff/repos/VeryDiffExperiments/src/../benchmarks/mnist-prune/specs/mnist_82_global_6.vnnlib
[VERYDIFF_EXPERIMENT] TIME: 122.784895636
