
[VERYDIFF_EXPERIMENT] Running on /home/i57/steuber/NeuroDiff/repos/VeryDiffExperiments/src/../benchmarks/mnist-prune/specs/mnist_0_global_5.vnnlib /home/i57/steuber/NeuroDiff/repos/VeryDiffExperiments/src/../benchmarks/mnist-prune/nets/mnist_relu_2_512.onnx
/home/i57/steuber/NeuroDiff/repos/VeryDiffExperiments/src/../benchmarks/mnist-prune/nets/mnist_relu_2_512.onnx
/home/i57/steuber/NeuroDiff/repos/VeryDiffExperiments/src/../benchmarks/mnist-prune/nets_pruned/mnist_relu_2_512_pruned5.onnx
[[0.         0.01960784]
 [0.         0.01960784]
 [0.         0.01960784]
 ...
 [0.         0.01960784]
 [0.         0.01960784]
 [0.         0.01960784]]
top
120
False
512
512
512
512
### Vars ###
### Constraints ###
A_pi_3_0 = 0 --> (A_x_2_0 + 0.0001) <= A_top_3_0
A_pi_3_1 = 0 --> (A_x_2_1 + 0.0001) <= A_top_3_0
A_pi_3_2 = 0 --> (A_x_2_2 + 0.0001) <= A_top_3_0
A_pi_3_3 = 0 --> (A_x_2_3 + 0.0001) <= A_top_3_0
A_pi_3_4 = 0 --> (A_x_2_4 + 0.0001) <= A_top_3_0
A_pi_3_5 = 0 --> (A_x_2_5 + 0.0001) <= A_top_3_0
A_pi_3_6 = 0 --> (A_x_2_6 + 0.0001) <= A_top_3_0
A_pi_3_7 = 0 --> (A_x_2_7 + 0.0001) <= A_top_3_0
A_pi_3_8 = 0 --> (A_x_2_8 + 0.0001) <= A_top_3_0
A_pi_3_9 = 0 --> (A_x_2_9 + 0.0001) <= A_top_3_0
Set parameter TimeLimit to value 120
Set parameter Threads to value 1
Gurobi Optimizer version 10.0.0 build v10.0.0rc2 (linux64)

CPU model: Intel(R) Core(TM) i5-6500 CPU @ 3.20GHz, instruction set [SSE2|AVX|AVX2]
Thread count: 4 physical cores, 4 logical processors, using up to 1 threads

Optimize a model with 14522 rows, 7012 columns and 1321876 nonzeros
Model fingerprint: 0x86ffd644
Variable types: 4934 continuous, 2078 integer (2078 binary)
Coefficient statistics:
  Matrix range     [1e-07, 2e+06]
  Objective range  [1e+00, 1e+00]
  Bounds range     [2e-02, 1e+00]
  RHS range        [1e-04, 2e+06]
Warning: Model contains large matrix coefficient range
         Consider reformulating model or setting NumericFocus parameter
         to avoid numerical issues.
Presolve removed 7430 rows and 1912 columns
Presolve time: 2.56s
Presolved: 7092 rows, 5100 columns, 717027 nonzeros
Variable types: 3728 continuous, 1372 integer (1372 binary)

Root relaxation: objective 6.059991e+02, 3007 iterations, 0.82 seconds (1.96 work units)

    Nodes    |    Current Node    |     Objective Bounds      |     Work
 Expl Unexpl |  Obj  Depth IntInf | Incumbent    BestBd   Gap | It/Node Time

     0     0  605.99906    0  412          -  605.99906      -     -    5s
     0     0  605.47607    0  441          -  605.47607      -     -   10s
     0     0  604.99143    0  442          -  604.99143      -     -   10s
     0     0  603.68674    0  439          -  603.68674      -     -   12s
     0     0  603.27677    0  432          -  603.27677      -     -   13s
     0     0  602.25730    0  429          -  602.25730      -     -   13s
     0     0  602.02421    0  421          -  602.02421      -     -   13s
     0     0  597.06562    0  557          -  597.06562      -     -   15s
     0     0  595.25041    0  545          -  595.25041      -     -   16s
     0     0  595.00627    0  544          -  595.00627      -     -   16s
     0     0  594.81279    0  541          -  594.81279      -     -   16s
     0     0  594.68115    0  533          -  594.68115      -     -   16s
     0     0  594.46293    0  521          -  594.46293      -     -   17s
     0     0  594.41229    0  519          -  594.41229      -     -   17s
     0     0  594.41227    0  519          -  594.41227      -     -   17s
     0     0  594.02364    0  537          -  594.02364      -     -   23s
     0     0  592.82780    0  553          -  592.82780      -     -   23s
     0     0  591.03515    0  543          -  591.03515      -     -   24s
     0     0  589.90294    0  541          -  589.90294      -     -   24s
     0     0  589.85426    0  547          -  589.85426      -     -   25s
     0     0  589.55030    0  553          -  589.55030      -     -   25s
     0     0  589.53597    0  557          -  589.53597      -     -   26s
     0     0  589.53302    0  559          -  589.53302      -     -   26s
     0     0  589.42566    0  577          -  589.42566      -     -   33s
     0     0  589.33424    0  580          -  589.33424      -     -   34s
     0     0  588.99977    0  566          -  588.99977      -     -   35s
     0     0  588.94227    0  574          -  588.94227      -     -   35s
     0     0  588.91491    0  585          -  588.91491      -     -   36s
     0     0  588.76247    0  587          -  588.76247      -     -   37s
     0     0  588.76097    0  588          -  588.76097      -     -   37s
     0     0  588.71556    0  579          -  588.71556      -     -   41s
     0     0  588.17989    0  576          -  588.17989      -     -   42s
     0     0  588.05659    0  565          -  588.05659      -     -   44s
     0     0  588.00795    0  575          -  588.00795      -     -   44s
     0     0  587.99469    0  576          -  587.99469      -     -   45s
     0     0  587.49195    0  583          -  587.49195      -     -   47s
     0     0  587.47301    0  585          -  587.47301      -     -   47s
     0     0  587.45816    0  585          -  587.45816      -     -   48s
     0     0  587.45021    0  587          -  587.45021      -     -   49s
     0     0  587.40068    0  586          -  587.40068      -     -   53s
     0     0  587.30288    0  593          -  587.30288      -     -   54s
     0     0  587.28329    0  595          -  587.28329      -     -   55s
     0     0  587.23024    0  598          -  587.23024      -     -   56s
     0     0  587.22579    0  598          -  587.22579      -     -   57s
     0     0  587.20178    0  603          -  587.20178      -     -   61s
     0     0  587.19296    0  601          -  587.19296      -     -   62s
     0     0  587.18045    0  600          -  587.18045      -     -   66s
     0     0  587.18045    0  598          -  587.18045      -     -   72s
     0     2  587.18008    0  598          -  587.18008      -     -  119s

Cutting planes:
  Gomory: 209
  Implied bound: 12
  MIR: 137
  StrongCG: 1
  Flow cover: 60
  RLT: 714
  Relax-and-lift: 2

Explored 1 nodes (21991 simplex iterations) in 120.00 seconds (185.65 work units)
Thread count was 1 (of 4 available processors)

Solution count 0

Time limit reached
Best objective -, best bound 5.871800805308e+02, gap -


TIMEOUT
time: 153.116600304

[VERYDIFF_TIMER] 153.147392527

[VERYDIFF_EXPERIMENT] Running on /home/i57/steuber/NeuroDiff/repos/VeryDiffExperiments/src/../benchmarks/mnist-prune/specs/mnist_0_global_5.vnnlib /home/i57/steuber/NeuroDiff/repos/VeryDiffExperiments/src/../benchmarks/mnist-prune/nets/mnist_relu_3_100.onnx
/home/i57/steuber/NeuroDiff/repos/VeryDiffExperiments/src/../benchmarks/mnist-prune/nets/mnist_relu_3_100.onnx
/home/i57/steuber/NeuroDiff/repos/VeryDiffExperiments/src/../benchmarks/mnist-prune/nets_pruned/mnist_relu_3_100_pruned5.onnx
[[0.         0.01960784]
 [0.         0.01960784]
 [0.         0.01960784]
 ...
 [0.         0.01960784]
 [0.         0.01960784]
 [0.         0.01960784]]
top
120
False
100
100
10
100
100
10
### Vars ###
### Constraints ###
A_pi_4_0 = 0 --> (A_x_3_0 + 0.0001) <= A_top_4_0
A_pi_4_1 = 0 --> (A_x_3_1 + 0.0001) <= A_top_4_0
A_pi_4_2 = 0 --> (A_x_3_2 + 0.0001) <= A_top_4_0
A_pi_4_3 = 0 --> (A_x_3_3 + 0.0001) <= A_top_4_0
A_pi_4_4 = 0 --> (A_x_3_4 + 0.0001) <= A_top_4_0
A_pi_4_5 = 0 --> (A_x_3_5 + 0.0001) <= A_top_4_0
A_pi_4_6 = 0 --> (A_x_3_6 + 0.0001) <= A_top_4_0
A_pi_4_7 = 0 --> (A_x_3_7 + 0.0001) <= A_top_4_0
A_pi_4_8 = 0 --> (A_x_3_8 + 0.0001) <= A_top_4_0
A_pi_4_9 = 0 --> (A_x_3_9 + 0.0001) <= A_top_4_0
Set parameter TimeLimit to value 120
Set parameter Threads to value 1
Gurobi Optimizer version 10.0.0 build v10.0.0rc2 (linux64)

CPU model: Intel(R) Core(TM) i5-6500 CPU @ 3.20GHz, instruction set [SSE2|AVX|AVX2]
Thread count: 4 physical cores, 4 logical processors, using up to 1 threads

Optimize a model with 3126 rows, 2128 columns and 179801 nonzeros
Model fingerprint: 0x37a6b67f
Variable types: 1678 continuous, 450 integer (450 binary)
Coefficient statistics:
  Matrix range     [1e-06, 2e+06]
  Objective range  [1e+00, 1e+00]
  Bounds range     [2e-02, 1e+00]
  RHS range        [1e-04, 2e+06]
Warning: Model contains large matrix coefficient range
         Consider reformulating model or setting NumericFocus parameter
         to avoid numerical issues.
Presolve removed 1524 rows and 372 columns
Presolve time: 0.46s
Presolved: 1602 rows, 1756 columns, 111906 nonzeros
Variable types: 1442 continuous, 314 integer (314 binary)

Root relaxation: objective 3.158807e+01, 455 iterations, 0.02 seconds (0.04 work units)

    Nodes    |    Current Node    |     Objective Bounds      |     Work
 Expl Unexpl |  Obj  Depth IntInf | Incumbent    BestBd   Gap | It/Node Time

     0     0   31.58807    0   78          -   31.58807      -     -    0s
     0     0   30.37375    0   87          -   30.37375      -     -    0s
     0     0   30.11234    0  124          -   30.11234      -     -    0s
     0     0   30.09861    0  126          -   30.09861      -     -    0s
     0     0   30.09860    0  126          -   30.09860      -     -    0s
     0     0   30.01187    0  126          -   30.01187      -     -    1s
     0     0   29.91619    0  128          -   29.91619      -     -    1s
     0     0   29.88638    0  126          -   29.88638      -     -    1s
     0     0   29.88388    0  126          -   29.88388      -     -    1s
     0     0   29.79260    0  127          -   29.79260      -     -    2s
     0     0   29.63903    0  126          -   29.63903      -     -    2s
     0     0   29.62270    0  130          -   29.62270      -     -    2s
     0     0   29.62187    0  131          -   29.62187      -     -    2s
     0     0   29.57243    0  132          -   29.57243      -     -    3s
     0     0   29.53810    0  132          -   29.53810      -     -    3s
     0     0   29.51518    0  133          -   29.51518      -     -    3s
     0     0   29.50506    0  132          -   29.50506      -     -    3s
     0     0   29.50288    0  133          -   29.50288      -     -    3s
     0     0   29.50252    0  133          -   29.50252      -     -    3s
     0     0   29.48490    0  133          -   29.48490      -     -    3s
     0     0   29.47284    0  134          -   29.47284      -     -    3s
     0     0   29.46958    0  134          -   29.46958      -     -    3s
     0     0   29.46883    0  134          -   29.46883      -     -    3s
     0     0   29.45910    0  134          -   29.45910      -     -    4s
     0     0   29.44994    0  134          -   29.44994      -     -    4s
     0     0   29.44876    0  134          -   29.44876      -     -    4s
     0     0   29.44106    0  133          -   29.44106      -     -    4s
     0     0   29.43732    0  133          -   29.43732      -     -    5s
     0     0   29.43579    0  132          -   29.43579      -     -    5s
     0     0   29.43532    0  132          -   29.43532      -     -    5s
     0     0   29.42972    0  133          -   29.42972      -     -    5s
     0     0   29.42972    0  132          -   29.42972      -     -    6s
H    0     0                      -0.0000000   29.42972      -     -    8s
     0     2   29.42710    0  132   -0.00000   29.42710      -     -    8s
    40    18    8.58955    9   74   -0.00000   22.15388      -   196   10s
H   54    18                       0.0000001   22.15311      -   168   10s
   440   215   15.48746   11   93    0.00000   16.16048      -  81.7   15s
   514   265   15.37178   15   71    0.00000   16.05898      -  73.4   20s
   787   307   15.13466   29   42    0.00000   16.05898      -  64.1   25s
  1402   601   12.12357   54   21    0.00000   16.05898      -  49.3   30s
  2271  1229   12.46212  119   27    0.00000   15.78327      -  36.9   35s
  3191  1791   14.11460   59   12    0.00000   15.57283      -  32.1   40s
  4105  2425   13.27890   82   20    0.00000   15.43019      -  30.0   46s
  4706  2823   14.34316   43   28    0.00000   15.35193      -  29.1   50s
  5463  3315   13.28534   54   12    0.00000   15.29725      -  27.8   55s
  6292  3810 infeasible   82         0.00000   15.25568      -  27.3   60s
  7546  4676   15.09430   31   42    0.00000   15.20160      -  25.6   65s
  8486  5322 infeasible   84         0.00000   15.16668      -  25.1   70s
  9076  5750   12.12670   88   53    0.00000   15.15756      -  25.0   75s
  9711  6216   13.00510   87   60    0.00000   15.14212      -  24.7   80s
 10202  6503   13.64098   38   32    0.00000   15.11884      -  24.3  101s
 10717  6832   12.51640   84   16    0.00000   15.10759      -  24.5  105s
 11593  7471   14.27879   44   41    0.00000   15.09249      -  24.4  110s
 12508  8113   13.96108   49   34    0.00000   15.07784      -  24.0  115s

Cutting planes:
  Gomory: 19
  Implied bound: 7
  MIR: 11
  Flow cover: 25
  RLT: 57
  Relax-and-lift: 4

Explored 13317 nodes (328289 simplex iterations) in 120.00 seconds (161.42 work units)
Thread count was 1 (of 4 available processors)

Solution count 2: 9.94859e-08 -0 

Time limit reached
Best objective 9.948589685393e-08, best bound 1.506465109848e+01, gap -


TIMEOUT
time: 124.148978091

[VERYDIFF_TIMER] 124.180595384

[VERYDIFF_EXPERIMENT] Running on /home/i57/steuber/NeuroDiff/repos/VeryDiffExperiments/src/../benchmarks/mnist-prune/specs/mnist_0_global_5.vnnlib /home/i57/steuber/NeuroDiff/repos/VeryDiffExperiments/src/../benchmarks/mnist-prune/nets/mnist_relu_4_1024.onnx
/home/i57/steuber/NeuroDiff/repos/VeryDiffExperiments/src/../benchmarks/mnist-prune/nets/mnist_relu_4_1024.onnx
/home/i57/steuber/NeuroDiff/repos/VeryDiffExperiments/src/../benchmarks/mnist-prune/nets_pruned/mnist_relu_4_1024_pruned5.onnx
[[0.         0.01960784]
 [0.         0.01960784]
 [0.         0.01960784]
 ...
 [0.         0.01960784]
 [0.         0.01960784]
 [0.         0.01960784]]
top
120
False
1024
1024
1024
10
1024
1024
1024
10
### Vars ###
### Constraints ###
A_pi_5_0 = 0 --> (A_x_4_0 + 0.0001) <= A_top_5_0
A_pi_5_1 = 0 --> (A_x_4_1 + 0.0001) <= A_top_5_0
A_pi_5_2 = 0 --> (A_x_4_2 + 0.0001) <= A_top_5_0
A_pi_5_3 = 0 --> (A_x_4_3 + 0.0001) <= A_top_5_0
A_pi_5_4 = 0 --> (A_x_4_4 + 0.0001) <= A_top_5_0
A_pi_5_5 = 0 --> (A_x_4_5 + 0.0001) <= A_top_5_0
A_pi_5_6 = 0 --> (A_x_4_6 + 0.0001) <= A_top_5_0
A_pi_5_7 = 0 --> (A_x_4_7 + 0.0001) <= A_top_5_0
A_pi_5_8 = 0 --> (A_x_4_8 + 0.0001) <= A_top_5_0
A_pi_5_9 = 0 --> (A_x_4_9 + 0.0001) <= A_top_5_0
Set parameter TimeLimit to value 120
Set parameter Threads to value 1
Gurobi Optimizer version 10.0.0 build v10.0.0rc2 (linux64)

CPU model: Intel(R) Core(TM) i5-6500 CPU @ 3.20GHz, instruction set [SSE2|AVX|AVX2]
Thread count: 4 physical cores, 4 logical processors, using up to 1 threads

Optimize a model with 43334 rows, 19360 columns and 5656845 nonzeros
Model fingerprint: 0xb3c2de2a
Variable types: 13166 continuous, 6194 integer (6194 binary)
Coefficient statistics:
  Matrix range     [2e-08, 2e+06]
  Objective range  [1e+00, 1e+00]
  Bounds range     [2e-02, 1e+00]
  RHS range        [1e-07, 2e+06]
Warning: Model contains large matrix coefficient range
         Consider reformulating model or setting NumericFocus parameter
         to avoid numerical issues.
Presolve removed 17439 rows and 3354 columns (presolve time = 5s) ...
Presolve removed 17489 rows and 3354 columns (presolve time = 10s) ...
Presolve removed 18340 rows and 3354 columns (presolve time = 15s) ...
Presolve removed 18340 rows and 3354 columns
Presolve time: 19.84s
Presolved: 24994 rows, 16006 columns, 4607806 nonzeros
Variable types: 11121 continuous, 4885 integer (4885 binary)

Root simplex log...

Iteration    Objective       Primal Inf.    Dual Inf.      Time
       0    1.6164982e+04   4.944619e+03   0.000000e+00     36s
    4974    1.9639247e+03   3.214015e+03   0.000000e+00     40s
    7624    1.9636916e+03   8.001480e+03   0.000000e+00     46s
    9344    1.9636765e+03   2.933354e+03   0.000000e+00     51s
   10604    1.9636500e+03   3.331350e+03   0.000000e+00     55s
   11944    1.9636386e+03   6.800963e+02   0.000000e+00     60s
   13444    1.9636296e+03   4.000847e+02   0.000000e+00     65s
   14564    1.9636345e+03   0.000000e+00   0.000000e+00     70s

Root relaxation: objective 1.963635e+03, 14564 iterations, 36.60 seconds (90.50 work units)
Total elapsed time = 100.59s

    Nodes    |    Current Node    |     Objective Bounds      |     Work
 Expl Unexpl |  Obj  Depth IntInf | Incumbent    BestBd   Gap | It/Node Time

     0     0 1963.63455    0 1339          - 1963.63455      -     -  105s

Explored 1 nodes (24930 simplex iterations) in 120.04 seconds (195.90 work units)
Thread count was 1 (of 4 available processors)

Solution count 0

Time limit reached
Best objective -, best bound 1.963634549837e+03, gap -


TIMEOUT
time: 263.270334638

[VERYDIFF_TIMER] 263.302180144

[VERYDIFF_EXPERIMENT] NETWORK: /home/i57/steuber/NeuroDiff/repos/VeryDiffExperiments/src/../benchmarks/mnist-prune/specs/mnist_0_global_5.vnnlib
[VERYDIFF_EXPERIMENT] TIME: 541.673138482
