
[VERYDIFF_EXPERIMENT] Running on /home/i57/steuber/NeuroDiff/repos/VeryDiffExperiments/src/../benchmarks/mnist-prune/specs/mnist_38_global_4.vnnlib /home/i57/steuber/NeuroDiff/repos/VeryDiffExperiments/src/../benchmarks/mnist-prune/nets/mnist_relu_2_512.onnx
/home/i57/steuber/NeuroDiff/repos/VeryDiffExperiments/src/../benchmarks/mnist-prune/nets/mnist_relu_2_512.onnx
/home/i57/steuber/NeuroDiff/repos/VeryDiffExperiments/src/../benchmarks/mnist-prune/nets_pruned/mnist_relu_2_512_pruned5.onnx
[[0.         0.01568628]
 [0.         0.01568628]
 [0.         0.01568628]
 ...
 [0.         0.01568628]
 [0.         0.01568628]
 [0.         0.01568628]]
1.0
120
False
512
512
512
512
Set parameter TimeLimit to value 120
Set parameter Threads to value 1
Set parameter BestObjStop to value 1
Set parameter BestBdStop to value 1
Gurobi Optimizer version 10.0.0 build v10.0.0rc2 (linux64)

CPU model: Intel(R) Core(TM) i5-6500 CPU @ 3.20GHz, instruction set [SSE2|AVX|AVX2]
Thread count: 4 physical cores, 4 logical processors, using up to 1 threads

Optimize a model with 14479 rows, 7010 columns and 1321743 nonzeros
Model fingerprint: 0xb316d6f7
Variable types: 4932 continuous, 2078 integer (2078 binary)
Coefficient statistics:
  Matrix range     [1e-07, 2e+06]
  Objective range  [1e+00, 1e+00]
  Bounds range     [1e-02, 1e+00]
  RHS range        [1e-04, 2e+06]
Warning: Model contains large matrix coefficient range
         Consider reformulating model or setting NumericFocus parameter
         to avoid numerical issues.
Presolve removed 7840 rows and 2160 columns
Presolve time: 2.21s
Presolved: 6639 rows, 4850 columns, 645421 nonzeros
Variable types: 3564 continuous, 1286 integer (1286 binary)

Root simplex log...

Iteration    Objective       Primal Inf.    Dual Inf.      Time
    3740    4.8854982e+02   7.846215e+05   0.000000e+00      5s
    4807    4.8787785e+02   0.000000e+00   0.000000e+00      6s

Root relaxation: objective 4.878778e+02, 4807 iterations, 3.18 seconds (6.91 work units)

    Nodes    |    Current Node    |     Objective Bounds      |     Work
 Expl Unexpl |  Obj  Depth IntInf | Incumbent    BestBd   Gap | It/Node Time

     0     0  487.87785    0  642          -  487.87785      -     -    6s
     0     0  487.62505    0  937          -  487.62505      -     -   12s
     0     0  480.09570    0  767          -  480.09570      -     -   13s
     0     0  479.83600    0  784          -  479.83600      -     -   16s
     0     0  479.81854    0  794          -  479.81854      -     -   17s
     0     0  479.70544    0  746          -  479.70544      -     -   18s
     0     0  479.69284    0  743          -  479.69284      -     -   18s
     0     0  479.68161    0  758          -  479.68161      -     -   19s
     0     0  479.67828    0  757          -  479.67828      -     -   20s
     0     0  479.67715    0  760          -  479.67715      -     -   21s
     0     0  479.65309    0  767          -  479.65309      -     -   27s
     0     0  479.63749    0  798          -  479.63749      -     -   29s
     0     0  479.63052    0  801          -  479.63052      -     -   30s
     0     0  479.56436    0  803          -  479.56436      -     -   32s
     0     0  479.56038    0  801          -  479.56038      -     -   33s
     0     0  479.55831    0  813          -  479.55831      -     -   34s
     0     0  479.55126    0  832          -  479.55126      -     -   43s
     0     0  479.54190    0  830          -  479.54190      -     -   45s
     0     0  479.53497    0  823          -  479.53497      -     -   46s
     0     0  479.53270    0  929          -  479.53270      -     -   49s
     0     0  479.52864    0  937          -  479.52864      -     -   54s
     0     0  479.52708    0  918          -  479.52708      -     -   57s
     0     0  479.52481    0  931          -  479.52481      -     -   62s
     0     0  479.52481    0  884          -  479.52481      -     -   73s
     0     2  475.41563    0  884          -  475.41563      -     -  105s
     1     3  postponed    1               -  475.41563      -  9133  120s

Cutting planes:
  Gomory: 1
  Cover: 3
  Implied bound: 2
  MIR: 208
  Flow cover: 14
  RLT: 738

Explored 2 nodes (33244 simplex iterations) in 120.01 seconds (178.52 work units)
Thread count was 1 (of 4 available processors)

Solution count 0

Time limit reached
Best objective -, best bound 4.754156343242e+02, gap -


TIMEOUT
time: 150.982904947

[VERYDIFF_TIMER] 151.036386426

[VERYDIFF_EXPERIMENT] Running on /home/i57/steuber/NeuroDiff/repos/VeryDiffExperiments/src/../benchmarks/mnist-prune/specs/mnist_38_global_4.vnnlib /home/i57/steuber/NeuroDiff/repos/VeryDiffExperiments/src/../benchmarks/mnist-prune/nets/mnist_relu_3_100.onnx
/home/i57/steuber/NeuroDiff/repos/VeryDiffExperiments/src/../benchmarks/mnist-prune/nets/mnist_relu_3_100.onnx
/home/i57/steuber/NeuroDiff/repos/VeryDiffExperiments/src/../benchmarks/mnist-prune/nets_pruned/mnist_relu_3_100_pruned5.onnx
[[0.         0.01568628]
 [0.         0.01568628]
 [0.         0.01568628]
 ...
 [0.         0.01568628]
 [0.         0.01568628]
 [0.         0.01568628]]
1.0
120
False
100
100
10
100
100
10
Set parameter TimeLimit to value 120
Set parameter Threads to value 1
Set parameter BestObjStop to value 1
Set parameter BestBdStop to value 1
Gurobi Optimizer version 10.0.0 build v10.0.0rc2 (linux64)

CPU model: Intel(R) Core(TM) i5-6500 CPU @ 3.20GHz, instruction set [SSE2|AVX|AVX2]
Thread count: 4 physical cores, 4 logical processors, using up to 1 threads

Optimize a model with 3083 rows, 2126 columns and 179668 nonzeros
Model fingerprint: 0x7942c2bc
Variable types: 1676 continuous, 450 integer (450 binary)
Coefficient statistics:
  Matrix range     [1e-06, 2e+06]
  Objective range  [1e+00, 1e+00]
  Bounds range     [1e-02, 1e+00]
  RHS range        [1e-03, 2e+06]
Warning: Model contains large matrix coefficient range
         Consider reformulating model or setting NumericFocus parameter
         to avoid numerical issues.
Presolve removed 1562 rows and 420 columns
Presolve time: 0.42s
Presolved: 1521 rows, 1706 columns, 107851 nonzeros
Variable types: 1414 continuous, 292 integer (292 binary)

Root relaxation: objective 2.924894e+01, 1022 iterations, 0.08 seconds (0.18 work units)

    Nodes    |    Current Node    |     Objective Bounds      |     Work
 Expl Unexpl |  Obj  Depth IntInf | Incumbent    BestBd   Gap | It/Node Time

     0     0   29.24894    0  133          -   29.24894      -     -    0s
     0     0   29.19442    0  102          -   29.19442      -     -    1s
     0     0   29.19093    0   99          -   29.19093      -     -    1s
     0     0   29.18531    0  116          -   29.18531      -     -    1s
     0     0   29.18473    0  121          -   29.18473      -     -    1s
     0     0   28.77098    0  105          -   28.77098      -     -    2s
     0     0   28.75509    0  108          -   28.75509      -     -    2s
     0     0   28.75448    0  109          -   28.75448      -     -    2s
     0     0   28.75435    0  109          -   28.75435      -     -    2s
     0     0   28.75344    0  107          -   28.75344      -     -    3s
     0     0   28.75245    0  107          -   28.75245      -     -    3s
     0     0   28.75223    0  107          -   28.75223      -     -    3s
     0     0   28.75183    0  104          -   28.75183      -     -    3s
     0     0   28.75183    0   81          -   28.75183      -     -    4s
     0     2   27.86094    0   81          -   27.86094      -     -    8s
   222   159   27.86091    1   79          -   27.86091      -  38.4   10s
   514   353   11.75792   38  110          -   27.83620      -  45.5   15s
   526   361    9.91025   73   77          -   27.50140      -  44.5   20s
   531   366   26.24945   15   77          -   27.06848      -  15.7   25s
   629   393    3.36338   71   32          -   25.46983      -  24.0   30s
*  994   436             149       1.9515077   23.58578  1109%  31.8   34s

Cutting planes:
  Gomory: 37
  Implied bound: 2
  MIR: 19
  Flow cover: 15
  RLT: 70
  Relax-and-lift: 1

Explored 995 nodes (60651 simplex iterations) in 34.96 seconds (50.43 work units)
Thread count was 1 (of 4 available processors)

Solution count 1: 1.95151 

Optimization achieved user objective limit
Best objective 1.951507733422e+00, best bound 2.358578009229e+01, gap 1108.5927%


100
100
10
100
100
10
NETWORKS NOT EQUIVALENT
100
100
10
x_3_0 : 0.0
x_3_1 : 3.1070253360504707
x_3_2 : 7.536235164827952
x_3_3 : 2.6330994553136278
x_3_4 : 0.0
x_3_5 : 1.430954468315896
x_3_6 : 0.0
x_3_7 : 0.0
x_3_8 : 1.0671884793565276
x_3_9 : 0.0
100
100
10
x_3_0 : 0.0
x_3_1 : 2.977717957809342
x_3_2 : 5.584727442942296
x_3_3 : 1.615327966071969
x_3_4 : 0.0
x_3_5 : 1.606846788762785
x_3_6 : 0.0
x_3_7 : 0.0
x_3_8 : 1.5875697781048945
x_3_9 : 0.0
100
100
10
100
100
10
Distance:  1.9515077218856556
Input:  [0.0, 0.01568628, 0.0, 0.0, 0.0, 0.01568628, 0.01568628, 0.01568628, 0.0, 0.01568628, 0.01568628, 0.01568628, 0.0, 0.0, 0.0, 0.0, 0.01568628, 0.01568628, 0.01568628, 0.01568628, 0.0, 0.01568628, 0.0, 0.01568628, 0.01568628, 0.0, 0.01568628, 0.01568628, 0.0, 0.0, 0.01568628, 0.0, 0.01568628, 0.0, 0.0, 0.01568628, 0.0, 0.0, 0.01568628, 0.0, 0.01568628, 0.01568628, 0.01568628, 0.0, 0.01568628, 0.0, 0.01568628, 0.0, 0.0, 0.01568628, 0.01568628, 0.0, 0.01568628, 0.0, 0.0020041806556176114, 0.01568628, 0.0, 0.0, 0.0, 0.01568628, 0.01568628, 0.0, 0.01568628, 0.0, 0.01568628, 0.0, 0.0, 0.0, 0.0, 0.0, 0.01568628, 0.0, 0.0, 0.0, 0.01568628, 0.0, 0.0, 0.0, 0.0, 0.01568628, 0.0, 0.01568628, 0.01568628, 0.01568628, 0.01568628, 0.01568628, 0.0, 0.01568628, 0.0, 0.01568628, 0.01568628, 0.01568628, 0.0, 0.01568628, 0.01568628, 0.0, 0.0, 0.01568628, 0.0, 0.01568628, 0.0, 0.0, 0.01568628, 0.01568628, 0.01568628, 0.0, 0.01568628, 0.0, 0.0, 0.0, 0.01568628, 0.01568628, 0.0, 0.01568628, 0.01568628, 0.0, 0.0, 0.0, 0.0, 0.0, 0.0, 0.0, 0.0, 0.0, 0.01568628, 0.18039216, 0.6592823058744123, 0.98039216, 0.21568628, 0.0, 0.0, 0.01568628, 0.0, 0.007095722950284662, 0.01568628, 0.01568628, 0.01568628, 0.0, 0.01568628, 0.01568628, 0.01568628, 0.01568628, 0.0, 0.0, 0.0, 0.01568628, 0.0, 0.01568628, 0.01568628, 0.01568628, 0.0, 0.1254902, 0.73333335, 0.94509804, 0.98039216, 0.98039216, 0.7019608, 0.0, 0.0, 0.0, 0.01568628, 0.01568628, 0.0, 0.01568628, 0.01568628, 0.0, 0.0, 0.0, 0.0, 0.0, 0.0, 0.0, 0.01568628, 0.0, 0.01568628, 0.0, 0.01568628, 0.0, 0.29019609, 0.93333334, 1.0, 0.90588236, 0.89803922, 0.98039216, 0.69803923, 0.0, 0.01568628, 0.01568628, 0.01568628, 0.0, 0.01568628, 0.0, 0.01568628, 0.0, 0.01568628, 0.0, 0.01568628, 0.01568628, 0.01568628, 0.0, 0.01568628, 0.01568628, 0.01568628, 0.01568628, 0.07450981, 0.70588237, 0.98039216, 0.96862745, 0.40392157, 0.12156863, 0.41568628, 0.98039216, 0.69803923, 0.01568628, 0.01568628, 0.01568628, 0.0, 0.0, 0.01568628, 0.0, 0.01568628, 0.01568628, 0.0, 0.0, 0.01568628, 0.0, 0.01568628, 0.0, 0.0, 0.01568628, 0.01568628, 0.09411765, 0.81960785, 0.95294118, 0.36862746, 0.08627451, 0.0, 0.0, 0.41568628, 0.98039216, 0.60000002, 0.01568628, 0.01568628, 0.01568628, 0.01568628, 0.01568628, 0.01568628, 0.0, 0.01568628, 0.01568628, 0.01568628, 0.01568628, 0.0, 0.0, 0.01568628, 0.0, 0.01568628, 0.0, 0.01568628, 0.17254902, 0.42352942, 0.09411765, 0.0, 0.0, 0.01568628, 0.01568628, 0.44705883, 1.0, 0.14509805, 0.01568628, 0.01568628, 0.01568628, 0.01568628, 0.01568628, 0.01568628, 0.01568628, 0.01568628, 0.0, 0.0, 0.0, 0.01568628, 0.01568628, 0.01568628, 0.01568628, 0.01568628, 0.01568628, 0.0, 0.01568628, 0.01568628, 0.0, 0.0, 0.01568628, 0.01568628, 0.01568628, 0.44705883, 0.93333334, 0.01568628, 0.01568628, 0.01568628, 0.01568628, 0.0, 0.01568628, 0.01568628, 0.0, 0.0, 0.01568628, 0.000234563777026215, 0.01568628, 0.01568628, 0.0, 0.01568628, 0.01568628, 0.01568628, 0.0, 0.01568628, 0.0, 0.01568628, 0.0, 0.01568628, 0.0, 0.01568628, 0.14117648, 0.85490197, 0.60000002, 0.01568628, 0.01568628, 0.01568628, 0.0, 0.007466289001774925, 0.01568628, 0.0, 0.01568628, 0.01568628, 0.0, 0.0, 0.0, 0.0, 0.0, 0.0, 0.01568628, 0.014554386013188165, 0.01568628, 0.0, 0.01568628, 0.01568628, 0.0, 0.01568628, 0.0, 0.01568628, 0.50980395, 0.80000001, 0.04705882, 0.01568628, 0.01568628, 0.01568628, 0.0, 0.01568628, 0.01568628, 0.01568628, 0.0, 0.0, 0.0, 0.01568628, 0.0, 0.0, 0.01568628, 0.01568628, 0.007056865837467356, 0.0, 0.01568628, 0.0, 0.0, 0.0, 0.0, 0.01568628, 0.01568628, 0.0627451, 0.89019608, 0.58039218, 0.01568628, 0.01568628, 0.01568628, 0.0, 0.01568628, 0.0, 0.0, 0.01568628, 0.01568628, 0.0, 0.01568628, 0.01568628, 0.0, 0.01568628, 0.0, 0.0, 0.0, 0.01568628, 0.0, 0.0, 0.0, 0.0, 0.0, 0.0, 0.0, 0.58823532, 0.94117647, 0.26666668, 0.01568628, 0.01568628, 0.0, 0.01568628, 0.0, 0.0, 0.0, 0.0, 0.0, 0.0, 0.0, 0.01568628, 0.01568628, 0.01568628, 0.01568628, 0.01568628, 0.0, 0.0, 0.01568628, 0.0, 0.0, 0.0, 0.0, 0.01568628, 0.07843138, 0.77254903, 0.53333336, 0.0, 0.01568628, 0.0, 0.0, 0.0, 0.0, 0.01568628, 0.01568628, 0.0, 0.01568628, 0.0, 0.0, 0.01568628, 0.0, 0.01568628, 0.01568628, 0.01568628, 0.01568628, 0.0, 0.0, 0.01568628, 0.0, 0.01568628, 0.0, 0.01568628, 0.65882355, 0.87058824, 0.10588235, 0.0, 0.0, 0.01568628, 0.0, 0.0, 0.0, 0.0, 0.02745098, 0.4721122476713027, 0.78823531, 0.16862746, 0.0, 0.0, 0.01568628, 0.0, 0.0, 0.01568628, 0.0, 0.0, 0.0, 0.0, 0.0, 0.01568628, 0.01568628, 0.29411766, 0.98431373, 0.48627451, 0.01568628, 0.0, 0.0, 0.01568628, 0.0, 0.0, 0.04313726, 0.3137255, 0.83137256, 0.96470588, 0.58039218, 0.03137255, 0.01568628, 0.01568628, 0.01568628, 0.0, 0.0, 0.01568628, 0.01568628, 0.0, 0.0, 0.0, 0.01568628, 0.01568628, 0.01176471, 0.82745099, 0.90980393, 0.12941177, 0.01568628, 0.01568628, 0.01568628, 0.0, 0.0627451, 0.54901963, 0.91764706, 0.98039216, 0.90980393, 0.26274511, 0.004578781435077272, 0.0, 0.0, 0.0, 0.01568628, 0.0, 0.0, 0.01568628, 0.01568628, 0.0, 0.01568628, 0.01568628, 0.01568628, 0.01568628, 0.522949611372829, 1.0, 0.27450982, 0.01568628, 0.01568628, 0.0, 0.19215687, 0.72941178, 0.98039216, 0.98039216, 0.78823531, 0.44313726, 0.01568628, 0.01568628, 0.01568628, 0.0, 0.0, 0.0, 0.01568628, 0.01568628, 0.01568628, 0.01568628, 0.0, 0.0, 0.0, 0.0, 0.01568628, 0.06666667, 0.92156863, 0.72941178, 0.01568628, 0.10980392, 0.38039216, 0.70588237, 0.99215686, 0.95294118, 0.71764708, 0.36078432, 0.0, 0.01568628, 0.0, 0.0, 0.01568628, 0.0, 0.01568628, 0.0, 0.01568628, 0.0, 0.01568628, 0.01568628, 0.01568628, 0.01568628, 0.01568628, 0.0, 0.01568628, 0.51764709, 0.98039216, 0.40392157, 0.48627451, 0.89411765, 1.0, 1.0, 0.74117649, 0.21568628, 0.0, 0.01568628, 0.01568628, 0.01568628, 0.01568628, 0.0, 0.0, 0.01568628, 0.01568628, 0.01568628, 0.01568628, 0.0, 0.01568628, 0.0, 0.0, 0.011015995033864894, 0.0, 0.01568628, 0.03137255, 0.88235295, 1.0, 1.0, 1.0, 0.98039216, 0.76862746, 0.25882354, 0.01568628, 0.01568628, 0.01568628, 0.0, 0.0, 0.01568628, 0.0, 0.0, 0.0, 0.01568628, 0.0, 0.01568628, 0.0, 0.0, 0.0, 0.01568628, 0.01568628, 0.01568628, 0.0, 0.01568628, 0.23137255, 1.0, 0.98039216, 0.75294119, 0.42745098, 0.29803923, 0.05882353, 0.01568628, 0.01568628, 0.01568628, 0.01568628, 0.01568628, 0.01568628, 0.01568628, 0.0, 0.01568628, 0.0, 0.0, 0.0, 0.0, 0.01568628, 0.0, 0.01568628, 0.01568628, 0.01568628, 0.01568628, 0.0, 0.0, 0.01568628, 0.01568628, 0.0, 0.01568628, 0.01568628, 0.01568628, 0.01568628, 0.0, 0.01568628, 0.0, 0.01568628, 0.0, 0.01568628, 0.01568628, 0.0, 0.0, 0.0, 0.01568628, 0.01568628, 0.0, 0.0, 0.0, 0.01568628, 0.0, 0.0, 0.01568628, 0.01568628, 0.01568628, 0.0, 0.01568628, 0.01568628, 0.01568628, 0.01568628, 0.0, 0.01568628, 0.0, 0.01568628, 0.01568628, 0.013836585778221689, 0.0, 0.0, 0.01568628, 0.0, 0.0, 0.0, 0.01568628, 0.0, 0.01568628, 0.01568628, 0.0, 0.0, 0.0, 0.01568628, 0.01568628, 0.01568628, 0.0, 0.0, 0.01568628, 0.01568628, 0.01568628, 0.01568628, 0.01568628, 0.0, 0.01568628, 0.0, 0.01568628, 0.0, 0.0, 0.01568628, 0.01568628, 0.0, 0.0, 0.0, 0.0, 0.0, 0.01568628, 0.0, 0.0, 0.0, 0.0, 0.01568628, 0.01568628, 0.0, 0.01568628, 0.0, 0.01568628, 0.01568628, 0.0, 0.01568628, 0.01568628, 0.0, 0.0, 0.0, 0.0, 0.0, 0.01568628, 0.0, 0.0, 0.01568628, 0.01568628, 0.01568628, 0.0, 0.0, 0.0, 0.0]
time: 44.160505348

[VERYDIFF_TIMER] 44.192280158

[VERYDIFF_EXPERIMENT] Running on /home/i57/steuber/NeuroDiff/repos/VeryDiffExperiments/src/../benchmarks/mnist-prune/specs/mnist_38_global_4.vnnlib /home/i57/steuber/NeuroDiff/repos/VeryDiffExperiments/src/../benchmarks/mnist-prune/nets/mnist_relu_4_1024.onnx
/home/i57/steuber/NeuroDiff/repos/VeryDiffExperiments/src/../benchmarks/mnist-prune/nets/mnist_relu_4_1024.onnx
/home/i57/steuber/NeuroDiff/repos/VeryDiffExperiments/src/../benchmarks/mnist-prune/nets_pruned/mnist_relu_4_1024_pruned5.onnx
[[0.         0.01568628]
 [0.         0.01568628]
 [0.         0.01568628]
 ...
 [0.         0.01568628]
 [0.         0.01568628]
 [0.         0.01568628]]
1.0
120
False
1024
1024
1024
10
1024
1024
1024
10
Set parameter TimeLimit to value 120
Set parameter Threads to value 1
Set parameter BestObjStop to value 1
Set parameter BestBdStop to value 1
Gurobi Optimizer version 10.0.0 build v10.0.0rc2 (linux64)

CPU model: Intel(R) Core(TM) i5-6500 CPU @ 3.20GHz, instruction set [SSE2|AVX|AVX2]
Thread count: 4 physical cores, 4 logical processors, using up to 1 threads

Optimize a model with 43291 rows, 19358 columns and 5656712 nonzeros
Model fingerprint: 0xda41419b
Variable types: 13164 continuous, 6194 integer (6194 binary)
Coefficient statistics:
  Matrix range     [2e-08, 2e+06]
  Objective range  [1e+00, 1e+00]
  Bounds range     [1e-02, 1e+00]
  RHS range        [1e-07, 2e+06]
Warning: Model contains large matrix coefficient range
         Consider reformulating model or setting NumericFocus parameter
         to avoid numerical issues.
Presolve removed 18484 rows and 3823 columns (presolve time = 5s) ...
Presolve removed 18494 rows and 3823 columns (presolve time = 10s) ...
Presolve removed 19153 rows and 3823 columns (presolve time = 15s) ...
Presolve removed 19153 rows and 3823 columns
Presolve time: 16.25s
Presolved: 24138 rows, 15535 columns, 4452218 nonzeros
Variable types: 10842 continuous, 4693 integer (4693 binary)

Root simplex log...

Iteration    Objective       Primal Inf.    Dual Inf.      Time
       0    8.0038270e+06   1.886308e+06   0.000000e+00     30s
     462    9.9999900e+05   2.539917e+03   0.000000e+00     30s
    3142    9.9999900e+05   1.354333e+04   0.000000e+00     35s
    4542    9.9999900e+05   1.638969e+03   0.000000e+00     40s
    5892    9.9999900e+05   2.894525e+04   0.000000e+00     45s
    7192    9.9999900e+05   3.300182e+02   0.000000e+00     51s
    8372    9.9999900e+05   1.691353e+03   0.000000e+00     56s
    9612    9.9999900e+05   3.727805e+02   0.000000e+00     61s
   10722    9.9999900e+05   0.000000e+00   0.000000e+00     63s

Root relaxation: objective 9.999990e+05, 10722 iterations, 36.86 seconds (85.04 work units)
Total elapsed time = 86.55s
Total elapsed time = 98.80s
Total elapsed time = 100.12s

    Nodes    |    Current Node    |     Objective Bounds      |     Work
 Expl Unexpl |  Obj  Depth IntInf | Incumbent    BestBd   Gap | It/Node Time

     0     0 999999.000    0    4          - 999999.000      -     -  100s
     0     0 999999.000    0    8          - 999999.000      -     -  101s
     0     0 999999.000    0   28          - 999999.000      -     -  110s
     0     0 999999.000    0   32          - 999999.000      -     -  111s
     0     0 16243.2944    0   36          - 16243.2944      -     -  111s

Explored 1 nodes (21735 simplex iterations) in 120.04 seconds (232.92 work units)
Thread count was 1 (of 4 available processors)

Solution count 0

Time limit reached
Best objective -, best bound 1.617264050282e+04, gap -


TIMEOUT
time: 264.413238723

[VERYDIFF_TIMER] 264.438326621

[VERYDIFF_EXPERIMENT] NETWORK: /home/i57/steuber/NeuroDiff/repos/VeryDiffExperiments/src/../benchmarks/mnist-prune/specs/mnist_38_global_4.vnnlib
[VERYDIFF_EXPERIMENT] TIME: 460.573354368
