Parsing new_benchmarks/rice-1-retrained/nets/2_20.onnx...
Found input onnx::Gemm_0
op: gemm, weight: (20, 7), bias: (20,)
op: relu, weight: nothing, bias: nothing
op: gemm, weight: (20, 20), bias: (20,)
op: relu, weight: nothing, bias: nothing
op: gemm, weight: (2, 20), bias: (2,)
Parsing new_benchmarks/rice-1-retrained/nets_pruned/2_20-0.3.onnx...
Found input onnx::Gemm_0
op: gemm, weight: (20, 7), bias: (20,)
op: relu, weight: nothing, bias: nothing
op: gemm, weight: (20, 20), bias: (20,)
op: relu, weight: nothing, bias: nothing
op: gemm, weight: (2, 20), bias: (2,)
Distance: 11.734010548214428
Distance: 33.85611552581986
Distance: 2.5286202560703313
Running with 1 threads
[Thread 1] Time to first task: 0.0s
Zono Bounds:
[0.0, 0.0, 0.0, 0.0, 0.0, 0.0, 0.0]
[0.0, 0.0, 0.0, 0.0, 0.0, 0.0, 0.0]
[TOP-1] required confidence (1.0≥0.999) is feasible for index 1
[Thread 1] Processed 100 zonotopes (Work Done: 0.0%; Expected Zonos: Inf)
[Thread 1] Processed 200 zonotopes (Work Done: 0.0%; Expected Zonos: Inf)
[Thread 1] Processed 300 zonotopes (Work Done: 0.0%; Expected Zonos: Inf)
[Thread 1] Processed 400 zonotopes (Work Done: 0.0%; Expected Zonos: Inf)
[Thread 1] Processed 500 zonotopes (Work Done: 0.78125%; Expected Zonos: 64000.0)
[Thread 1] Processed 600 zonotopes (Work Done: 1.5625%; Expected Zonos: 38400.0)
[Thread 1] Processed 700 zonotopes (Work Done: 1.5625%; Expected Zonos: 44800.0)
[Thread 1] Processed 800 zonotopes (Work Done: 2.34375%; Expected Zonos: 34133.333333333336)
[Thread 1] Processed 900 zonotopes (Work Done: 2.34375%; Expected Zonos: 38400.0)
[Thread 1] Processed 1000 zonotopes (Work Done: 2.34375%; Expected Zonos: 42666.666666666664)
[Thread 1] Processed 1100 zonotopes (Work Done: 2.34375%; Expected Zonos: 46933.333333333336)
[Thread 1] Processed 1200 zonotopes (Work Done: 3.125%; Expected Zonos: 38400.0)
[Thread 1] Processed 1300 zonotopes (Work Done: 3.125%; Expected Zonos: 41600.0)
[Thread 1] Processed 1400 zonotopes (Work Done: 3.125%; Expected Zonos: 44800.0)
[Thread 1] Processed 1500 zonotopes (Work Done: 3.125%; Expected Zonos: 48000.0)
[Thread 1] Processed 1600 zonotopes (Work Done: 3.125%; Expected Zonos: 51200.0)
[Thread 1] Processed 1700 zonotopes (Work Done: 3.125%; Expected Zonos: 54400.0)
[Thread 1] Processed 1800 zonotopes (Work Done: 3.125%; Expected Zonos: 57600.0)
[Thread 1] Processed 1900 zonotopes (Work Done: 3.125%; Expected Zonos: 60800.0)
[Thread 1] Processed 2000 zonotopes (Work Done: 3.125%; Expected Zonos: 64000.0)
[Thread 1] Processed 2100 zonotopes (Work Done: 3.125%; Expected Zonos: 67200.0)
[Thread 1] Processed 2200 zonotopes (Work Done: 3.125%; Expected Zonos: 70400.0)
[Thread 1] Processed 2300 zonotopes (Work Done: 4.10156%; Expected Zonos: 56076.19047619047)
[Thread 1] Processed 2400 zonotopes (Work Done: 4.10156%; Expected Zonos: 58514.28571428572)
[Thread 1] Processed 2500 zonotopes (Work Done: 4.49219%; Expected Zonos: 55652.17391304348)
[Thread 1] Processed 2600 zonotopes (Work Done: 4.49219%; Expected Zonos: 57878.260869565216)
[Thread 1] Processed 2700 zonotopes (Work Done: 4.49219%; Expected Zonos: 60104.34782608696)
[Thread 1] Processed 2800 zonotopes (Work Done: 4.88281%; Expected Zonos: 57344.0)
[Thread 1] Processed 2900 zonotopes (Work Done: 5.07812%; Expected Zonos: 57107.692307692305)
[Thread 1] Processed 3000 zonotopes (Work Done: 5.27344%; Expected Zonos: 56888.88888888889)
[Thread 1] Processed 3100 zonotopes (Work Done: 5.46875%; Expected Zonos: 56685.71428571428)
[Thread 1] Processed 3200 zonotopes (Work Done: 5.46875%; Expected Zonos: 58514.28571428572)
[Thread 1] Processed 3300 zonotopes (Work Done: 5.85938%; Expected Zonos: 56320.0)
[Thread 1] Processed 3400 zonotopes (Work Done: 5.85938%; Expected Zonos: 58026.666666666664)
[Thread 1] Processed 3500 zonotopes (Work Done: 5.85938%; Expected Zonos: 59733.333333333336)
[Thread 1] Processed 3600 zonotopes (Work Done: 5.85938%; Expected Zonos: 61440.0)
[Thread 1] Processed 3700 zonotopes (Work Done: 6.05469%; Expected Zonos: 61109.67741935484)
[Thread 1] Processed 3800 zonotopes (Work Done: 6.05469%; Expected Zonos: 62761.290322580644)
[Thread 1] Processed 3900 zonotopes (Work Done: 6.05469%; Expected Zonos: 64412.903225806454)
[Thread 1] Processed 4000 zonotopes (Work Done: 6.25%; Expected Zonos: 64000.0)
[Thread 1] Processed 4100 zonotopes (Work Done: 6.25%; Expected Zonos: 65600.0)
[Thread 1] Processed 4200 zonotopes (Work Done: 6.25%; Expected Zonos: 67200.0)
[Thread 1] Processed 4300 zonotopes (Work Done: 6.25%; Expected Zonos: 68800.0)
[Thread 1] Processed 4400 zonotopes (Work Done: 6.25%; Expected Zonos: 70400.0)
[Thread 1] Processed 4500 zonotopes (Work Done: 6.25%; Expected Zonos: 72000.0)
[Thread 1] Processed 4600 zonotopes (Work Done: 6.25%; Expected Zonos: 73600.0)
[Thread 1] Processed 4700 zonotopes (Work Done: 6.64062%; Expected Zonos: 70776.4705882353)
[Thread 1] Processed 4800 zonotopes (Work Done: 7.12891%; Expected Zonos: 67331.50684931508)
[Thread 1] Processed 4900 zonotopes (Work Done: 7.12891%; Expected Zonos: 68734.24657534246)
[Thread 1] Processed 5000 zonotopes (Work Done: 7.22656%; Expected Zonos: 69189.18918918919)
[Thread 1] Processed 5100 zonotopes (Work Done: 7.22656%; Expected Zonos: 70572.97297297297)
[Thread 1] Processed 5200 zonotopes (Work Done: 7.32422%; Expected Zonos: 70997.33333333333)
[Thread 1] Processed 5300 zonotopes (Work Done: 7.76367%; Expected Zonos: 68266.66666666667)
[Thread 1] Processed 5400 zonotopes (Work Done: 7.95898%; Expected Zonos: 67847.85276073619)
[Thread 1] Processed 5500 zonotopes (Work Done: 8.05664%; Expected Zonos: 68266.66666666667)
[Thread 1] Processed 5600 zonotopes (Work Done: 8.05664%; Expected Zonos: 69507.87878787878)
[Thread 1] Processed 5700 zonotopes (Work Done: 8.30078%; Expected Zonos: 68668.23529411765)
[Thread 1] Processed 5800 zonotopes (Work Done: 8.30078%; Expected Zonos: 69872.94117647059)
[Thread 1] Processed 5900 zonotopes (Work Done: 9.17969%; Expected Zonos: 64272.34042553192)
[Thread 1] Processed 6000 zonotopes (Work Done: 9.27734%; Expected Zonos: 64673.68421052631)
[Thread 1] Processed 6100 zonotopes (Work Done: 9.64355%; Expected Zonos: 63254.6835443038)
[Thread 1] Processed 6200 zonotopes (Work Done: 9.74121%; Expected Zonos: 63647.117794486214)
[Thread 1] Processed 6300 zonotopes (Work Done: 9.74121%; Expected Zonos: 64673.68421052631)
[Thread 1] Processed 6400 zonotopes (Work Done: 9.83887%; Expected Zonos: 65048.13895781638)
[Thread 1] Processed 6500 zonotopes (Work Done: 9.93652%; Expected Zonos: 65415.233415233415)
[Thread 1] Processed 6600 zonotopes (Work Done: 9.93652%; Expected Zonos: 66421.62162162163)
[Thread 1] Processed 6700 zonotopes (Work Done: 9.98535%; Expected Zonos: 67098.28850855745)
[Thread 1] Processed 6800 zonotopes (Work Done: 10.13184%; Expected Zonos: 67115.18072289157)
[Thread 1] Processed 6900 zonotopes (Work Done: 10.18066%; Expected Zonos: 67775.53956834532)
[Thread 1] Processed 7000 zonotopes (Work Done: 10.18066%; Expected Zonos: 68757.793764988)
[Thread 1] Processed 7100 zonotopes (Work Done: 10.30273%; Expected Zonos: 68913.74407582938)
[Thread 1] Processed 7200 zonotopes (Work Done: 10.35156%; Expected Zonos: 69554.71698113208)
Found cex
N1: 0.9995257700824496 (vs. 0.0004742299175505068)
N2: 0.0004742299175505068
N1 Probability: 0.9995257700824496 >= 0.999

Found counterexample: ([-1.2999999999999998, 2.7, -1.15, 1.6, -3.2375000000000007, 3.5, -2.1500000000000004], (2, 1))
[Thread 1] Total splits: 7180
Processed 7232 zonotopes (Work Done: 10.4%); Generated 14360 (0.002112216845409292s/loop)
[Thread 1] Finished in 15.28s
 ────────────────────────────────────────────────────────────────────────────────
                                        Time                    Allocations      
                               ───────────────────────   ────────────────────────
       Tot / % measured:            15.3s / 100.0%           3.33GiB / 100.0%    

 Section               ncalls     time    %tot     avg     alloc    %tot      avg
 ────────────────────────────────────────────────────────────────────────────────
 Verify                     1    15.3s  100.0%   15.3s   3.33GiB  100.0%  3.33GiB
   Zonotope Loop            1    15.3s  100.0%   15.3s   3.33GiB  100.0%  3.33GiB
     Property Check     7.23k    14.4s   94.2%  1.99ms   2.65GiB   79.6%   384KiB
     Zonotope Propa...  7.23k    724ms    4.7%   100μs    610MiB   17.9%  86.3KiB
       DiffZonotope...  14.5k    583ms    3.8%  40.3μs    514MiB   15.1%  36.4KiB
         Zonotope_R...  28.9k    546ms    3.6%  18.9μs    481MiB   14.1%  17.0KiB
           Influenc...  28.9k    177ms    1.2%  6.12μs    157MiB    4.6%  5.57KiB
             Multiply   28.9k    142ms    0.9%  4.90μs    108MiB    3.2%  3.84KiB
             Alloca...  28.9k   13.6ms    0.1%   471ns   49.0MiB    1.4%  1.73KiB
             Set Ma...  28.9k   7.07ms    0.0%   244ns     0.00B    0.0%    0.00B
           Column M...  28.9k   96.6ms    0.6%  3.34μs    138MiB    4.1%  4.89KiB
           Set Matrix   28.9k   84.6ms    0.6%  2.92μs   17.2MiB    0.5%     624B
           Allocation   28.9k   62.1ms    0.4%  2.15μs    134MiB    3.9%  4.75KiB
           Vectors      28.9k   51.8ms    0.3%  1.79μs   33.5MiB    1.0%  1.19KiB
           Bounds       28.9k   4.74ms    0.0%   164ns     0.00B    0.0%    0.00B
       DiffZonotope...  21.7k    113ms    0.7%  5.21μs   93.8MiB    2.8%  4.43KiB
         Zonotope_D...  43.4k    106ms    0.7%  2.45μs   92.4MiB    2.7%  2.18KiB
     Compute Split      7.18k    135ms    0.9%  18.8μs   68.5MiB    2.0%  9.77KiB
 Initialize                 1   34.4μs    0.0%  34.4μs   9.70KiB    0.0%  9.70KiB
 ────────────────────────────────────────────────────────────────────────────────[VERYDIFF_TIMER] 15.277102109
