
[VERYDIFF_EXPERIMENT] Running on /home/i57/steuber/NeuroDiff/repos/VeryDiffExperiments/src/../benchmarks/mnist-prune/specs/mnist_66_global_4.vnnlib /home/i57/steuber/NeuroDiff/repos/VeryDiffExperiments/src/../benchmarks/mnist-prune/nets/mnist_relu_3_100.onnx
Found input X
op: matmul, weight: (100, 784), bias: nothing
op: bias, weight: nothing, bias: (100,)
op: relu, weight: nothing, bias: nothing
op: matmul, weight: (100, 100), bias: nothing
op: bias, weight: nothing, bias: (100,)
op: relu, weight: nothing, bias: nothing
op: matmul, weight: (10, 100), bias: nothing
op: bias, weight: nothing, bias: (10,)
op: relu, weight: nothing, bias: nothing
op: matmul, weight: (10, 10), bias: nothing
op: bias, weight: nothing, bias: (10,)
Found input X
op: gemm, weight: (100, 784), bias: (100,)
op: relu, weight: nothing, bias: nothing
op: gemm, weight: (100, 100), bias: (100,)
op: relu, weight: nothing, bias: nothing
op: gemm, weight: (10, 100), bias: (10,)
op: relu, weight: nothing, bias: nothing
op: gemm, weight: (10, 10), bias: (10,)
Distance: 1623.4465197373434
Distance: 201.62056963066925
Distance: 13.962962507051998
Distance: 0.183768135302671
Running with 1 threads
[Thread 1] Time to first task: 0.0s
Instable Generators: 31
Instable Generators: 44
Instable Generators: 8
Zono Bounds:
[-3.3617053587955654, -3.57890817694375, -4.8525624264006355, -4.120470632668968, -3.7536959025257204, -3.9484790709472724, -3.5918066043263384, -4.59710609484099, -3.302942799973727, -0.2279572064673424]
[3.1110911870841447, 3.5684216789412333, 4.221076270017876, 4.102551838814128, 3.429670400461452, 3.878962663124104, 4.02924090269083, 3.442807670078236, 3.2293581287955186, 0.2326853735445954]
[Thread 1] Processed 100 zonotopes (Work Done: 0.0%; Expected Zonos: Inf)
[Thread 1] Processed 200 zonotopes (Work Done: 0.0%; Expected Zonos: Inf)
[Thread 1] Processed 300 zonotopes (Work Done: 0.0%; Expected Zonos: Inf)
[Thread 1] Processed 400 zonotopes (Work Done: 0.0%; Expected Zonos: Inf)
[Thread 1] Processed 500 zonotopes (Work Done: 0.0%; Expected Zonos: Inf)


TIMEOUT REACHED
UNKNOWN
[Thread 1] Total splits: 570
Processed 570 zonotopes (Work Done: 0.0%); Generated 1140 (0.21105619635614034s/loop)
[Thread 1] Finished in 120.3s
 ────────────────────────────────────────────────────────────────────────────────
                                        Time                    Allocations      
                               ───────────────────────   ────────────────────────
       Tot / % measured:             120s / 100.0%           60.7GiB / 100.0%    

 Section               ncalls     time    %tot     avg     alloc    %tot      avg
 ────────────────────────────────────────────────────────────────────────────────
 Verify                     1     120s  100.0%    120s   60.7GiB  100.0%  60.7GiB
   Zonotope Loop            1     120s  100.0%    120s   60.7GiB  100.0%  60.7GiB
     Zonotope Propa...    570    82.2s   68.3%   144ms   40.9GiB   67.3%  73.4MiB
       DiffZonotope...  1.71k    72.2s   60.0%  42.2ms   38.6GiB   63.5%  23.1MiB
         Zonotope_R...  3.42k    71.4s   59.4%  20.9ms   37.6GiB   62.0%  11.3MiB
           Influenc...  3.42k    65.4s   54.4%  19.1ms   34.6GiB   57.0%  10.4MiB
             Multiply   3.42k    32.5s   27.0%  9.50ms   17.6GiB   29.0%  5.27MiB
             Alloca...  3.42k    30.5s   25.3%  8.91ms   17.0GiB   28.0%  5.09MiB
             Set Ma...  3.42k    2.47s    2.1%   723μs     0.00B    0.0%    0.00B
           Column M...  3.42k    5.70s    4.7%  1.67ms   1.50GiB    2.5%   460KiB
           Set Matrix   3.42k    190ms    0.2%  55.5μs   3.31MiB    0.0%  0.99KiB
           Allocation   3.42k   85.8ms    0.1%  25.1μs   1.50GiB    2.5%   460KiB
           Vectors      3.42k   18.1ms    0.0%  5.30μs   10.9MiB    0.0%  3.26KiB
           Bounds       3.42k   2.55ms    0.0%   745ns     0.00B    0.0%    0.00B
       DiffZonotope...  2.28k    10.0s    8.3%  4.39ms   2.31GiB    3.8%  1.04MiB
         Zonotope_D...  4.56k    4.84s    4.0%  1.06ms   1.51GiB    2.5%   348KiB
     Compute Split        570    31.0s   25.8%  54.4ms   8.62GiB   14.2%  15.5MiB
     Property Check       570    113ms    0.1%   199μs    118MiB    0.2%   212KiB
 Initialize                 1    526μs    0.0%   526μs   5.41MiB    0.0%  5.41MiB
 ────────────────────────────────────────────────────────────────────────────────
[VERYDIFF_TIMER] 120.336223444

[VERYDIFF_EXPERIMENT] NETWORK: /home/i57/steuber/NeuroDiff/repos/VeryDiffExperiments/src/../benchmarks/mnist-prune/specs/mnist_66_global_4.vnnlib
[VERYDIFF_EXPERIMENT] TIME: 120.809277672
