
[VERYDIFF_EXPERIMENT] Running on /home/i57/steuber/NeuroDiff/repos/VeryDiffExperiments/src/../benchmarks/mnist-prune/specs/mnist_66_local_15.vnnlib /home/i57/steuber/NeuroDiff/repos/VeryDiffExperiments/src/../benchmarks/mnist-prune/nets/mnist_relu_4_1024.onnx
Found input X
op: matmul, weight: (1024, 784), bias: nothing
op: bias, weight: nothing, bias: (1024,)
op: relu, weight: nothing, bias: nothing
op: matmul, weight: (1024, 1024), bias: nothing
op: bias, weight: nothing, bias: (1024,)
op: relu, weight: nothing, bias: nothing
op: matmul, weight: (1024, 1024), bias: nothing
op: bias, weight: nothing, bias: (1024,)
op: relu, weight: nothing, bias: nothing
op: matmul, weight: (10, 1024), bias: nothing
op: bias, weight: nothing, bias: (10,)
op: relu, weight: nothing, bias: nothing
op: matmul, weight: (10, 10), bias: nothing
op: bias, weight: nothing, bias: (10,)
Found input X
op: gemm, weight: (1024, 784), bias: (1024,)
op: relu, weight: nothing, bias: nothing
op: gemm, weight: (1024, 1024), bias: (1024,)
op: relu, weight: nothing, bias: nothing
op: gemm, weight: (1024, 1024), bias: (1024,)
op: relu, weight: nothing, bias: nothing
op: gemm, weight: (10, 1024), bias: (10,)
op: relu, weight: nothing, bias: nothing
op: gemm, weight: (10, 10), bias: (10,)
Distance: 915.6394868631054
Distance: 1298.7052820973968
Distance: 1296.587532894263
Distance: 6.054483317080667
Distance: 0.04942679278974538
Running with 1 threads
[Thread 1] Time to first task: 0.0s
Instable Generators: 351
Instable Generators: 704
Instable Generators: 1024
Instable Generators: 10
Zono Bounds:
[-84.75590711621807, -86.81463108850721, -95.7448775602384, -94.56034852359358, -90.89591552552945, -95.91712642342897, -86.21847369815022, -90.31970344610893, -91.997947567114, -96.11343221381027]
[84.71757991495546, 86.1388827496259, 94.77038111147195, 94.41718353014721, 90.86142998309926, 95.89528879270993, 86.20498742484845, 89.34121785233536, 92.02789825340038, 96.048201813349]
[Thread 1] Processed 100 zonotopes (Work Done: 0.0%; Expected Zonos: Inf)


TIMEOUT REACHED
UNKNOWN
[Thread 1] Total splits: 164
Processed 164 zonotopes (Work Done: 0.0%); Generated 328 (0.7349075877987805s/loop)
[Thread 1] Finished in 120.52s
 ────────────────────────────────────────────────────────────────────────────────
                                        Time                    Allocations      
                               ───────────────────────   ────────────────────────
       Tot / % measured:             121s / 100.0%           36.1GiB / 100.0%    

 Section               ncalls     time    %tot     avg     alloc    %tot      avg
 ────────────────────────────────────────────────────────────────────────────────
 Verify                     1     121s  100.0%    121s   36.1GiB   99.9%  36.1GiB
   Zonotope Loop            1     121s  100.0%    121s   36.1GiB   99.9%  36.1GiB
     Zonotope Propa...    164     119s   98.5%   724ms   35.8GiB   99.0%   223MiB
       DiffZonotope...    656    64.2s   53.3%  97.9ms   28.6GiB   79.2%  44.7MiB
         Zonotope_R...  1.31k    43.2s   35.9%  32.9ms   17.5GiB   48.5%  13.7MiB
           Column M...  1.31k    35.6s   29.5%  27.1ms   7.34GiB   20.3%  5.73MiB
           Allocation   1.31k    4.99s    4.1%  3.80ms   7.34GiB   20.3%  5.73MiB
           Influenc...  1.31k    1.50s    1.2%  1.14ms   2.76GiB    7.6%  2.16MiB
             Multiply   1.31k    1.44s    1.2%  1.10ms   2.59GiB    7.2%  2.02MiB
             Alloca...  1.31k   44.7ms    0.0%  34.1μs    178MiB    0.5%   139KiB
             Set Ma...  1.31k   12.2ms    0.0%  9.33μs     0.00B    0.0%    0.00B
           Set Matrix   1.31k    1.11s    0.9%   844μs   15.1MiB    0.0%  11.8KiB
           Vectors      1.31k   51.1ms    0.0%  38.9μs   43.5MiB    0.1%  34.0KiB
           Bounds       1.31k    906μs    0.0%   690ns     0.00B    0.0%    0.00B
       DiffZonotope...    820    54.5s   45.2%  66.4ms   7.16GiB   19.8%  8.94MiB
         Zonotope_D...  1.64k    18.3s   15.2%  11.2ms   2.92GiB    8.1%  1.82MiB
     Property Check       164    1.74s    1.4%  10.6ms   86.0MiB    0.2%   537KiB
     Compute Split        164   64.3ms    0.1%   392μs    131MiB    0.4%   821KiB
 Initialize                 1   15.0ms    0.0%  15.0ms   22.3MiB    0.1%  22.3MiB
 ────────────────────────────────────────────────────────────────────────────────
[VERYDIFF_TIMER] 120.623616585

[VERYDIFF_EXPERIMENT] NETWORK: /home/i57/steuber/NeuroDiff/repos/VeryDiffExperiments/src/../benchmarks/mnist-prune/specs/mnist_66_local_15.vnnlib
[VERYDIFF_EXPERIMENT] TIME: 120.873812286
