
[VERYDIFF_EXPERIMENT] Running on /home/i57/steuber/NeuroDiff/repos/VeryDiffExperiments/src/../benchmarks/mnist-prune/specs/mnist_90_global_5.vnnlib /home/i57/steuber/NeuroDiff/repos/VeryDiffExperiments/src/../benchmarks/mnist-prune/nets/mnist_relu_2_512.onnx
Parsing /home/i57/steuber/NeuroDiff/repos/VeryDiffExperiments/src/../benchmarks/mnist-prune/nets/mnist_relu_2_512.onnx...
Found input X
op: matmul, weight: (512, 784), bias: nothing
op: bias, weight: nothing, bias: (512,)
op: relu, weight: nothing, bias: nothing
op: matmul, weight: (512, 512), bias: nothing
op: bias, weight: nothing, bias: (512,)
op: relu, weight: nothing, bias: nothing
op: matmul, weight: (10, 512), bias: nothing
op: bias, weight: nothing, bias: (10,)
Parsing /home/i57/steuber/NeuroDiff/repos/VeryDiffExperiments/src/../benchmarks/mnist-prune/nets_pruned/mnist_relu_2_512_0.79-old.onnx...
Found input X
op: gemm, weight: (512, 784), bias: (512,)
op: relu, weight: nothing, bias: nothing
op: gemm, weight: (512, 512), bias: (512,)
op: relu, weight: nothing, bias: nothing
op: gemm, weight: (10, 512), bias: (10,)
Distance: 973.3044369037136
Distance: 481.63499746812613
Distance: 8.744412635378467
Running with 1 threads
[Thread 1] Time to first task: 0.01s
Instable Generators: 150
Instable Generators: 272
Zono Bounds:
[-12.427944726129985, -11.417668391636772, -11.17664434772526, -10.519703032497075, -11.783395906749197, -10.091458850190891, -11.658278626851853, -11.993373879406619, -9.458506677424456, -9.330115864305759]
[14.420361377001717, 14.308809191023448, 12.353699358445533, 13.256954459760346, 14.957534478790096, 12.545192897327228, 14.954072552606622, 13.754399483873943, 11.64219530018984, 11.25657359835021]
[Thread 1] Total splits: 0
Processed 1 zonotopes (Work Done: 100.0%); Generated 0 (1.726523057s/loop)
[Thread 1] Finished in 1.73s
 ────────────────────────────────────────────────────────────────────────────────
                                        Time                    Allocations      
                               ───────────────────────   ────────────────────────
       Tot / % measured:            1.73s / 100.0%            265MiB / 100.0%    

 Section               ncalls     time    %tot     avg     alloc    %tot      avg
 ────────────────────────────────────────────────────────────────────────────────
 Verify                     1    1.73s   99.9%   1.73s    256MiB   96.3%   256MiB
   Zonotope Loop            1    1.73s   99.9%   1.73s    256MiB   96.3%   256MiB
     Property Check         1    1.25s   72.0%   1.25s    110MiB   41.5%   110MiB
     Zonotope Propa...      1    471ms   27.3%   471ms    125MiB   47.3%   125MiB
       DiffZonotope...      2    364ms   21.1%   182ms    104MiB   39.1%  51.9MiB
         Zonotope_R...      4    115ms    6.6%  28.6ms   90.5MiB   34.1%  22.6MiB
           Influenc...      4    106ms    6.1%  26.4ms   56.9MiB   21.4%  14.2MiB
             Multiply       4    100ms    5.8%  25.0ms   31.3MiB   11.8%  7.83MiB
             Set Ma...      4   3.20ms    0.2%   800μs     0.00B    0.0%    0.00B
             Alloca...      4   2.44ms    0.1%   609μs   25.6MiB    9.6%  6.40MiB
           Column M...      4   5.93ms    0.3%  1.48ms   16.7MiB    6.3%  4.18MiB
           Set Matrix       4   2.14ms    0.1%   536μs   23.8KiB    0.0%  5.94KiB
           Allocation       4    793μs    0.0%   198μs   16.7MiB    6.3%  4.18MiB
           Vectors          4   77.1μs    0.0%  19.3μs    100KiB    0.0%  25.0KiB
           Bounds           4   2.64μs    0.0%   660ns     0.00B    0.0%    0.00B
       DiffZonotope...      3    107ms    6.2%  35.7ms   21.7MiB    8.2%  7.22MiB
         Zonotope_D...      6   50.1ms    2.9%  8.35ms   13.6MiB    5.1%  2.27MiB
 Initialize                 1   2.19ms    0.1%  2.19ms   9.84MiB    3.7%  9.84MiB
 ────────────────────────────────────────────────────────────────────────────────
[VERYDIFF_TIMER] 1.75949816

[VERYDIFF_EXPERIMENT] NETWORK: /home/i57/steuber/NeuroDiff/repos/VeryDiffExperiments/src/../benchmarks/mnist-prune/specs/mnist_90_global_5.vnnlib
[VERYDIFF_EXPERIMENT] TIME: 2.060715383
