
[VERYDIFF_EXPERIMENT] Running on /home/i57/steuber/NeuroDiff/repos/VeryDiffExperiments/src/../benchmarks/mnist-prune/specs/mnist_46_local_18.vnnlib /home/i57/steuber/NeuroDiff/repos/VeryDiffExperiments/src/../benchmarks/mnist-prune/nets/mnist_relu_4_1024.onnx
Found input X
op: matmul, weight: (1024, 784), bias: nothing
op: bias, weight: nothing, bias: (1024,)
op: relu, weight: nothing, bias: nothing
op: matmul, weight: (1024, 1024), bias: nothing
op: bias, weight: nothing, bias: (1024,)
op: relu, weight: nothing, bias: nothing
op: matmul, weight: (1024, 1024), bias: nothing
op: bias, weight: nothing, bias: (1024,)
op: relu, weight: nothing, bias: nothing
op: matmul, weight: (10, 1024), bias: nothing
op: bias, weight: nothing, bias: (10,)
op: relu, weight: nothing, bias: nothing
op: matmul, weight: (10, 10), bias: nothing
op: bias, weight: nothing, bias: (10,)
Found input X
op: gemm, weight: (1024, 784), bias: (1024,)
op: relu, weight: nothing, bias: nothing
op: gemm, weight: (1024, 1024), bias: (1024,)
op: relu, weight: nothing, bias: nothing
op: gemm, weight: (1024, 1024), bias: (1024,)
op: relu, weight: nothing, bias: nothing
op: gemm, weight: (10, 1024), bias: (10,)
op: relu, weight: nothing, bias: nothing
op: gemm, weight: (10, 10), bias: (10,)
Distance: 915.6394868631054
Distance: 1298.7052820973968
Distance: 1296.587532894263
Distance: 6.054483317080667
Distance: 0.04942679278974538
Running with 1 threads
[Thread 1] Time to first task: 0.0s
Instable Generators: 439
Instable Generators: 786
Instable Generators: 1024
Instable Generators: 10
Zono Bounds:
[-115.95308870952378, -118.4904432472345, -130.95005096366992, -130.3123316826735, -125.0694579307525, -132.62017399768916, -118.08579729682405, -123.16748576267645, -126.41075166246752, -131.53385540204013]
[115.88240285552301, 118.31656843920662, 130.7351101830509, 129.41125646712734, 125.00502853828577, 132.21906062375092, 118.06697734883333, 122.8495225436642, 126.49083863399368, 130.99623753736623]
[Thread 1] Processed 100 zonotopes (Work Done: 0.0%; Expected Zonos: Inf)


TIMEOUT REACHED
UNKNOWN
[Thread 1] Total splits: 143
Processed 143 zonotopes (Work Done: 0.0%); Generated 286 (0.8425696780909091s/loop)
[Thread 1] Finished in 120.49s
 ────────────────────────────────────────────────────────────────────────────────
                                        Time                    Allocations      
                               ───────────────────────   ────────────────────────
       Tot / % measured:             121s / 100.0%           39.1GiB / 100.0%    

 Section               ncalls     time    %tot     avg     alloc    %tot      avg
 ────────────────────────────────────────────────────────────────────────────────
 Verify                     1     120s  100.0%    120s   39.1GiB   99.9%  39.1GiB
   Zonotope Loop            1     120s  100.0%    120s   39.1GiB   99.9%  39.1GiB
     Zonotope Propa...    143     120s   99.5%   838ms   38.7GiB   99.1%   277MiB
       DiffZonotope...    715    60.2s   49.9%  84.2ms   8.15GiB   20.8%  11.7MiB
         Zonotope_D...  1.43k    20.8s   17.2%  14.5ms   3.32GiB    8.5%  2.37MiB
       DiffZonotope...    572    59.7s   49.5%   104ms   30.6GiB   78.3%  54.8MiB
         Zonotope_R...  1.14k    17.0s   14.1%  14.9ms   18.9GiB   48.4%  16.9MiB
           Allocation   1.14k    8.67s    7.2%  7.58ms   7.76GiB   19.8%  6.94MiB
           Column M...  1.14k    3.98s    3.3%  3.48ms   7.76GiB   19.8%  6.94MiB
           Influenc...  1.14k    2.78s    2.3%  2.43ms   3.36GiB    8.6%  3.01MiB
             Multiply   1.14k    2.70s    2.2%  2.36ms   3.14GiB    8.0%  2.81MiB
             Alloca...  1.14k   66.5ms    0.1%  58.1μs    221MiB    0.6%   198KiB
             Set Ma...  1.14k   14.3ms    0.0%  12.5μs     0.00B    0.0%    0.00B
           Set Matrix   1.14k    1.27s    1.1%  1.11ms   14.9MiB    0.0%  13.3KiB
           Vectors      1.14k    286ms    0.2%   250μs   38.0MiB    0.1%  34.0KiB
           Bounds       1.14k    719μs    0.0%   629ns     0.00B    0.0%    0.00B
     Property Check       143    523ms    0.4%  3.65ms   66.8MiB    0.2%   478KiB
     Compute Split        143   52.5ms    0.0%   367μs    146MiB    0.4%  1.02MiB
 Initialize                 1   14.7ms    0.0%  14.7ms   22.4MiB    0.1%  22.4MiB
 ────────────────────────────────────────────────────────────────────────────────
[VERYDIFF_TIMER] 120.582534445

[VERYDIFF_EXPERIMENT] NETWORK: /home/i57/steuber/NeuroDiff/repos/VeryDiffExperiments/src/../benchmarks/mnist-prune/specs/mnist_46_local_18.vnnlib
[VERYDIFF_EXPERIMENT] TIME: 120.900966722
