
[VERYDIFF_EXPERIMENT] Running on /home/i57/steuber/NeuroDiff/repos/VeryDiffExperiments/src/../benchmarks/mnist-prune/specs/mnist_92_global_4.vnnlib /home/i57/steuber/NeuroDiff/repos/VeryDiffExperiments/src/../benchmarks/mnist-prune/nets/mnist_relu_3_100.onnx
Parsing /home/i57/steuber/NeuroDiff/repos/VeryDiffExperiments/src/../benchmarks/mnist-prune/nets/mnist_relu_3_100.onnx...
Found input X
op: matmul, weight: (100, 784), bias: nothing
op: bias, weight: nothing, bias: (100,)
op: relu, weight: nothing, bias: nothing
op: matmul, weight: (100, 100), bias: nothing
op: bias, weight: nothing, bias: (100,)
op: relu, weight: nothing, bias: nothing
op: matmul, weight: (10, 100), bias: nothing
op: bias, weight: nothing, bias: (10,)
op: relu, weight: nothing, bias: nothing
op: matmul, weight: (10, 10), bias: nothing
op: bias, weight: nothing, bias: (10,)
Parsing /home/i57/steuber/NeuroDiff/repos/VeryDiffExperiments/src/../benchmarks/mnist-prune/nets_pruned/mnist_relu_3_100_0.77-old.onnx...
Found input X
op: gemm, weight: (100, 784), bias: (100,)
op: relu, weight: nothing, bias: nothing
op: gemm, weight: (100, 100), bias: (100,)
op: relu, weight: nothing, bias: nothing
op: gemm, weight: (10, 100), bias: (10,)
op: relu, weight: nothing, bias: nothing
op: gemm, weight: (10, 10), bias: (10,)
Distance: 1958.4889029213523
Distance: 144.28197153992141
Distance: 22.063573056613677
Distance: 0.8412832540489035
Running with 1 threads
[Thread 1] Time to first task: 0.0s
Zono Bounds:
[0.0, 0.0, 0.0, 0.0, 0.0, 0.0, 0.0, 0.0, 0.0, 0.0, 0.0, 0.0, 0.0, 0.0, 0.0, 0.0, 0.0, 0.0, 0.0, 0.0, 0.0, 0.0, 0.0, 0.0, 0.0, 0.0, 0.0, 0.0, 0.0, 0.0, 0.0, 0.0, 0.0, 0.0, 0.0, 0.0, 0.0, 0.0, 0.0, 0.0, 0.0, 0.0, 0.0, 0.0, 0.0, 0.0, 0.0, 0.0, 0.0, 0.0, 0.0, 0.0, 0.0, 0.0, 0.0, 0.0, 0.0, 0.0, 0.0, 0.0, 0.0, 0.0, 0.0, 0.0, 0.0, 0.0, 0.0, 0.0, 0.0, 0.0, 0.0, 0.0, 0.0, 0.0, 0.0, 0.0, 0.0, 0.0, 0.0, 0.0, 0.0, 0.0, 0.0, 0.0, 0.0, 0.0, 0.0, 0.0, 0.0, 0.0, 0.0, 0.0, 0.0, 0.0, 0.0, 0.0, 0.0, 0.0, 0.0, 0.0, 0.0, 0.0, 0.0, 0.0, 0.0, 0.0, 0.0, 0.0, 0.0, 0.0, 0.0, 0.0, 0.0, 0.0, 0.0, 0.0, 0.0, 0.0, 0.0, 0.0, 0.0, 0.0, 0.0, 0.0, 0.0, 0.0, 0.0, 0.0, 0.0, 0.0, 0.0, 0.0, 0.0, 0.0, 0.0, 0.0, 0.0, 0.0, 0.0, 0.0, 0.0, 0.0, 0.0, 0.0, 0.0, 0.0, 0.0, 0.0, 0.0, 0.0, 0.0, 0.0, 0.0, 0.0, 0.0, 0.0, 0.0, 0.0, 0.0, 0.0, 0.0, 0.0, 0.0, 0.0, 0.0, 0.0, 0.0, 0.0, 0.0, 0.0, 0.0, 0.0, 0.0, 0.0, 0.0, 0.0, 0.0, 0.0, 0.0, 0.0, 0.0, 0.0, 0.0, 0.0, 0.0, 0.0, 0.0, 0.0, 0.0, 0.0, 0.0, 0.0, 0.0, 0.0, 0.0, 0.0, 0.0, 0.0, 0.0, 0.0, 0.0, 0.0, 0.0, 0.0, 0.0, 0.0, 0.0, 0.0, 0.0, 0.0, 0.0, 0.0, 0.0, 0.0, 0.0, 0.0, 0.0, 0.0, 0.0, 0.0, 0.0, 0.0, 0.0, 0.0, 0.0, 0.0, 0.0, 0.0, 0.0, 0.0, 0.0, 0.0, 0.0, 0.0, 0.0, 0.0, 0.0, 0.0, 0.0, 0.0, 0.0, 0.0, 0.0, 0.0, 0.0, 0.0, 0.0, 0.0, 0.0, 0.0, 0.0, 0.0, 0.0, 0.0, 0.0, 0.0, 0.0, 0.0, 0.0, 0.0, 0.0, 0.0, 0.0, 0.0, 0.0, 0.0, 0.0, 0.0, 0.0, 0.0, 0.0, 0.0, 0.0, 0.0, 0.0, 0.0, 0.0, 0.0, 0.0, 0.0, 0.0, 0.0, 0.0, 0.0, 0.0, 0.0, 0.0, 0.0, 0.0, 0.0, 0.0, 0.0, 0.0, 0.0, 0.0, 0.0, 0.0, 0.0, 0.0, 0.0, 0.0, 0.0, 0.0, 0.0, 0.0, 0.0, 0.0, 0.0, 0.0, 0.0, 0.0, 0.0, 0.0, 0.0, 0.0, 0.0, 0.0, 0.0, 0.0, 0.0, 0.0, 0.0, 0.0, 0.0, 0.0, 0.0, 0.0, 0.0, 0.0, 0.0, 0.0, 0.0, 0.0, 0.0, 0.0, 0.0, 0.0, 0.0, 0.0, 0.0, 0.0, 0.0, 0.0, 0.0, 0.0, 0.0, 0.0, 0.0, 0.0, 0.0, 0.0, 0.0, 0.0, 0.0, 0.0, 0.0, 0.0, 0.0, 0.0, 0.0, 0.0, 0.0, 0.0, 0.0, 0.0, 0.0, 0.0, 0.0, 0.0, 0.0, 0.0, 0.0, 0.0, 0.0, 0.0, 0.0, 0.0, 0.0, 0.0, 0.0, 0.0, 0.0, 0.0, 0.0, 0.0, 0.0, 0.0, 0.0, 0.0, 0.0, 0.0, 0.0, 0.0, 0.0, 0.0, 0.0, 0.0, 0.0, 0.0, 0.0, 0.0, 0.0, 0.0, 0.0, 0.0, 0.0, 0.0, 0.0, 0.0, 0.0, 0.0, 0.0, 0.0, 0.0, 0.0, 0.0, 0.0, 0.0, 0.0, 0.0, 0.0, 0.0, 0.0, 0.0, 0.0, 0.0, 0.0, 0.0, 0.0, 0.0, 0.0, 0.0, 0.0, 0.0, 0.0, 0.0, 0.0, 0.0, 0.0, 0.0, 0.0, 0.0, 0.0, 0.0, 0.0, 0.0, 0.0, 0.0, 0.0, 0.0, 0.0, 0.0, 0.0, 0.0, 0.0, 0.0, 0.0, 0.0, 0.0, 0.0, 0.0, 0.0, 0.0, 0.0, 0.0, 0.0, 0.0, 0.0, 0.0, 0.0, 0.0, 0.0, 0.0, 0.0, 0.0, 0.0, 0.0, 0.0, 0.0, 0.0, 0.0, 0.0, 0.0, 0.0, 0.0, 0.0, 0.0, 0.0, 0.0, 0.0, 0.0, 0.0, 0.0, 0.0, 0.0, 0.0, 0.0, 0.0, 0.0, 0.0, 0.0, 0.0, 0.0, 0.0, 0.0, 0.0, 0.0, 0.0, 0.0, 0.0, 0.0, 0.0, 0.0, 0.0, 0.0, 0.0, 0.0, 0.0, 0.0, 0.0, 0.0, 0.0, 0.0, 0.0, 0.0, 0.0, 0.0, 0.0, 0.0, 0.0, 0.0, 0.0, 0.0, 0.0, 0.0, 0.0, 0.0, 0.0, 0.0, 0.0, 0.0, 0.0, 0.0, 0.0, 0.0, 0.0, 0.0, 0.0, 0.0, 0.0, 0.0, 0.0, 0.0, 0.0, 0.0, 0.0, 0.0, 0.0, 0.0, 0.0, 0.0, 0.0, 0.0, 0.0, 0.0, 0.0, 0.0, 0.0, 0.0, 0.0, 0.0, 0.0, 0.0, 0.0, 0.0, 0.0, 0.0, 0.0, 0.0, 0.0, 0.0, 0.0, 0.0, 0.0, 0.0, 0.0, 0.0, 0.0, 0.0, 0.0, 0.0, 0.0, 0.0, 0.0, 0.0, 0.0, 0.0, 0.0, 0.0, 0.0, 0.0, 0.0, 0.0, 0.0, 0.0, 0.0, 0.0, 0.0, 0.0, 0.0, 0.0, 0.0, 0.0, 0.0, 0.0, 0.0, 0.0, 0.0, 0.0, 0.0, 0.0, 0.0, 0.0, 0.0, 0.0, 0.0, 0.0, 0.0, 0.0, 0.0, 0.0, 0.0, 0.0, 0.0, 0.0, 0.0, 0.0, 0.0, 0.0, 0.0, 0.0, 0.0, 0.0, 0.0, 0.0, 0.0, 0.0, 0.0, 0.0, 0.0, 0.0, 0.0, 0.0, 0.0, 0.0, 0.0, 0.0, 0.0, 0.0, 0.0, 0.0, 0.0, 0.0, 0.0, 0.0, 0.0, 0.0, 0.0, 0.0, 0.0, 0.0, 0.0, 0.0, 0.0, 0.0, 0.0, 0.0, 0.0, 0.0, 0.0, 0.0, 0.0, 0.0, 0.0, 0.0, 0.0, 0.0, 0.0, 0.0, 0.0, 0.0, 0.0, 0.0, 0.0, 0.0, 0.0, 0.0, 0.0, 0.0, 0.0, 0.0, 0.0, 0.0, 0.0, 0.0, 0.0, 0.0, 0.0, 0.0, 0.0, 0.0, 0.0, 0.0, 0.0, 0.0, 0.0, 0.0, 0.0, 0.0, 0.0, 0.0, 0.0, 0.0, 0.0, 0.0, 0.0, 0.0, 0.0, 0.0, 0.0, 0.0, 0.0, 0.0, 0.0, 0.0, 0.0, 0.0, 0.0, 0.0, 0.0, 0.0, 0.0, 0.0, 0.0, 0.0, 0.0, 0.0, 0.0, 0.0, 0.0, 0.0, 0.0, 0.0, 0.0, 0.0, 0.0, 0.0, 0.0, 0.0, 0.0, 0.0, 0.0, 0.0, 0.0, 0.0, 0.0, 0.0, 0.0, 0.0, 0.0, 0.0, 0.0, 0.0, 0.0, 0.0, 0.0, 0.0, 0.0, 0.0, 0.0, 0.0, 0.0, 0.0, 0.0]
[0.0, 0.0, 0.0, 0.0, 0.0, 0.0, 0.0, 0.0, 0.0, 0.0, 0.0, 0.0, 0.0, 0.0, 0.0, 0.0, 0.0, 0.0, 0.0, 0.0, 0.0, 0.0, 0.0, 0.0, 0.0, 0.0, 0.0, 0.0, 0.0, 0.0, 0.0, 0.0, 0.0, 0.0, 0.0, 0.0, 0.0, 0.0, 0.0, 0.0, 0.0, 0.0, 0.0, 0.0, 0.0, 0.0, 0.0, 0.0, 0.0, 0.0, 0.0, 0.0, 0.0, 0.0, 0.0, 0.0, 0.0, 0.0, 0.0, 0.0, 0.0, 0.0, 0.0, 0.0, 0.0, 0.0, 0.0, 0.0, 0.0, 0.0, 0.0, 0.0, 0.0, 0.0, 0.0, 0.0, 0.0, 0.0, 0.0, 0.0, 0.0, 0.0, 0.0, 0.0, 0.0, 0.0, 0.0, 0.0, 0.0, 0.0, 0.0, 0.0, 0.0, 0.0, 0.0, 0.0, 0.0, 0.0, 0.0, 0.0, 0.0, 0.0, 0.0, 0.0, 0.0, 0.0, 0.0, 0.0, 0.0, 0.0, 0.0, 0.0, 0.0, 0.0, 0.0, 0.0, 0.0, 0.0, 0.0, 0.0, 0.0, 0.0, 0.0, 0.0, 0.0, 0.0, 0.0, 0.0, 0.0, 0.0, 0.0, 0.0, 0.0, 0.0, 0.0, 0.0, 0.0, 0.0, 0.0, 0.0, 0.0, 0.0, 0.0, 0.0, 0.0, 0.0, 0.0, 0.0, 0.0, 0.0, 0.0, 0.0, 0.0, 0.0, 0.0, 0.0, 0.0, 0.0, 0.0, 0.0, 0.0, 0.0, 0.0, 0.0, 0.0, 0.0, 0.0, 0.0, 0.0, 0.0, 0.0, 0.0, 0.0, 0.0, 0.0, 0.0, 0.0, 0.0, 0.0, 0.0, 0.0, 0.0, 0.0, 0.0, 0.0, 0.0, 0.0, 0.0, 0.0, 0.0, 0.0, 0.0, 0.0, 0.0, 0.0, 0.0, 0.0, 0.0, 0.0, 0.0, 0.0, 0.0, 0.0, 0.0, 0.0, 0.0, 0.0, 0.0, 0.0, 0.0, 0.0, 0.0, 0.0, 0.0, 0.0, 0.0, 0.0, 0.0, 0.0, 0.0, 0.0, 0.0, 0.0, 0.0, 0.0, 0.0, 0.0, 0.0, 0.0, 0.0, 0.0, 0.0, 0.0, 0.0, 0.0, 0.0, 0.0, 0.0, 0.0, 0.0, 0.0, 0.0, 0.0, 0.0, 0.0, 0.0, 0.0, 0.0, 0.0, 0.0, 0.0, 0.0, 0.0, 0.0, 0.0, 0.0, 0.0, 0.0, 0.0, 0.0, 0.0, 0.0, 0.0, 0.0, 0.0, 0.0, 0.0, 0.0, 0.0, 0.0, 0.0, 0.0, 0.0, 0.0, 0.0, 0.0, 0.0, 0.0, 0.0, 0.0, 0.0, 0.0, 0.0, 0.0, 0.0, 0.0, 0.0, 0.0, 0.0, 0.0, 0.0, 0.0, 0.0, 0.0, 0.0, 0.0, 0.0, 0.0, 0.0, 0.0, 0.0, 0.0, 0.0, 0.0, 0.0, 0.0, 0.0, 0.0, 0.0, 0.0, 0.0, 0.0, 0.0, 0.0, 0.0, 0.0, 0.0, 0.0, 0.0, 0.0, 0.0, 0.0, 0.0, 0.0, 0.0, 0.0, 0.0, 0.0, 0.0, 0.0, 0.0, 0.0, 0.0, 0.0, 0.0, 0.0, 0.0, 0.0, 0.0, 0.0, 0.0, 0.0, 0.0, 0.0, 0.0, 0.0, 0.0, 0.0, 0.0, 0.0, 0.0, 0.0, 0.0, 0.0, 0.0, 0.0, 0.0, 0.0, 0.0, 0.0, 0.0, 0.0, 0.0, 0.0, 0.0, 0.0, 0.0, 0.0, 0.0, 0.0, 0.0, 0.0, 0.0, 0.0, 0.0, 0.0, 0.0, 0.0, 0.0, 0.0, 0.0, 0.0, 0.0, 0.0, 0.0, 0.0, 0.0, 0.0, 0.0, 0.0, 0.0, 0.0, 0.0, 0.0, 0.0, 0.0, 0.0, 0.0, 0.0, 0.0, 0.0, 0.0, 0.0, 0.0, 0.0, 0.0, 0.0, 0.0, 0.0, 0.0, 0.0, 0.0, 0.0, 0.0, 0.0, 0.0, 0.0, 0.0, 0.0, 0.0, 0.0, 0.0, 0.0, 0.0, 0.0, 0.0, 0.0, 0.0, 0.0, 0.0, 0.0, 0.0, 0.0, 0.0, 0.0, 0.0, 0.0, 0.0, 0.0, 0.0, 0.0, 0.0, 0.0, 0.0, 0.0, 0.0, 0.0, 0.0, 0.0, 0.0, 0.0, 0.0, 0.0, 0.0, 0.0, 0.0, 0.0, 0.0, 0.0, 0.0, 0.0, 0.0, 0.0, 0.0, 0.0, 0.0, 0.0, 0.0, 0.0, 0.0, 0.0, 0.0, 0.0, 0.0, 0.0, 0.0, 0.0, 0.0, 0.0, 0.0, 0.0, 0.0, 0.0, 0.0, 0.0, 0.0, 0.0, 0.0, 0.0, 0.0, 0.0, 0.0, 0.0, 0.0, 0.0, 0.0, 0.0, 0.0, 0.0, 0.0, 0.0, 0.0, 0.0, 0.0, 0.0, 0.0, 0.0, 0.0, 0.0, 0.0, 0.0, 0.0, 0.0, 0.0, 0.0, 0.0, 0.0, 0.0, 0.0, 0.0, 0.0, 0.0, 0.0, 0.0, 0.0, 0.0, 0.0, 0.0, 0.0, 0.0, 0.0, 0.0, 0.0, 0.0, 0.0, 0.0, 0.0, 0.0, 0.0, 0.0, 0.0, 0.0, 0.0, 0.0, 0.0, 0.0, 0.0, 0.0, 0.0, 0.0, 0.0, 0.0, 0.0, 0.0, 0.0, 0.0, 0.0, 0.0, 0.0, 0.0, 0.0, 0.0, 0.0, 0.0, 0.0, 0.0, 0.0, 0.0, 0.0, 0.0, 0.0, 0.0, 0.0, 0.0, 0.0, 0.0, 0.0, 0.0, 0.0, 0.0, 0.0, 0.0, 0.0, 0.0, 0.0, 0.0, 0.0, 0.0, 0.0, 0.0, 0.0, 0.0, 0.0, 0.0, 0.0, 0.0, 0.0, 0.0, 0.0, 0.0, 0.0, 0.0, 0.0, 0.0, 0.0, 0.0, 0.0, 0.0, 0.0, 0.0, 0.0, 0.0, 0.0, 0.0, 0.0, 0.0, 0.0, 0.0, 0.0, 0.0, 0.0, 0.0, 0.0, 0.0, 0.0, 0.0, 0.0, 0.0, 0.0, 0.0, 0.0, 0.0, 0.0, 0.0, 0.0, 0.0, 0.0, 0.0, 0.0, 0.0, 0.0, 0.0, 0.0, 0.0, 0.0, 0.0, 0.0, 0.0, 0.0, 0.0, 0.0, 0.0, 0.0, 0.0, 0.0, 0.0, 0.0, 0.0, 0.0, 0.0, 0.0, 0.0, 0.0, 0.0, 0.0, 0.0, 0.0, 0.0, 0.0, 0.0, 0.0, 0.0, 0.0, 0.0, 0.0, 0.0, 0.0, 0.0, 0.0, 0.0, 0.0, 0.0, 0.0, 0.0, 0.0, 0.0, 0.0, 0.0, 0.0, 0.0, 0.0, 0.0, 0.0, 0.0, 0.0, 0.0, 0.0, 0.0, 0.0, 0.0, 0.0, 0.0, 0.0, 0.0, 0.0, 0.0, 0.0, 0.0, 0.0, 0.0, 0.0, 0.0, 0.0, 0.0, 0.0, 0.0, 0.0, 0.0, 0.0, 0.0, 0.0, 0.0, 0.0, 0.0, 0.0, 0.0, 0.0, 0.0, 0.0, 0.0, 0.0, 0.0, 0.0, 0.0, 0.0, 0.0, 0.0, 0.0, 0.0, 0.0, 0.0, 0.0, 0.0, 0.0, 0.0, 0.0, 0.0, 0.0, 0.0, 0.0, 0.0, 0.0, 0.0, 0.0, 0.0, 0.0, 0.0, 0.0, 0.0, 0.0, 0.0, 0.0, 0.0, 0.0, 0.0, 0.0, 0.0, 0.0, 0.0, 0.0, 0.0, 0.0, 0.0, 0.0, 0.0, 0.0, 0.0, 0.0, 0.0, 0.0, 0.0, 0.0, 0.0, 0.0]
Found cex
N1 Scale: 1.1141703034566792 >= 1.0

Found counterexample: ([0.0, 0.01568628, 0.01568628, 0.0, 0.0, 0.01568628, 0.0, 0.01568628, 0.0, 0.01568628, 0.01568628, 0.0, 0.0, 0.0, 0.01568628, 0.0, 0.0, 0.01568628, 0.01568628, 0.01568628, 0.01568628, 0.0, 0.0, 0.0, 0.01568628, 0.0, 0.01568628, 0.0, 0.01568628, 0.0, 0.0, 0.01568628, 0.01568628, 0.0, 0.0, 0.0, 0.01568628, 0.0, 0.0, 0.01568628, 0.0, 0.0, 0.01568628, 0.0, 0.01568628, 0.01568628, 0.01568628, 0.01568628, 0.0, 0.0, 0.01568628, 0.01568628, 0.01568628, 0.0, 0.01568628, 0.0, 0.01568628, 0.0, 0.0, 0.01568628, 0.01568628, 0.01568628, 0.01568628, 0.0, 0.0, 0.01568628, 0.01568628, 0.0, 0.01568628, 0.01568628, 0.0, 0.0, 0.01568628, 0.0, 0.01568628, 0.01568628, 0.01568628, 0.01568628, 0.01568628, 0.0, 0.0, 0.0, 0.0, 0.0, 0.0, 0.0, 0.01568628, 0.01568628, 0.01568628, 0.01568628, 0.01568628, 0.0, 0.0, 0.01568628, 0.0, 0.01568628, 0.0, 0.0, 0.0, 0.01568628, 0.01568628, 0.0, 0.01568628, 0.01568628, 0.01568628, 0.01568628, 0.0, 0.0, 0.0, 0.01568628, 0.0, 0.01568628, 0.0, 0.01568628, 0.0, 0.01568628, 0.0, 0.01568628, 0.011167884126659233, 0.01568628, 0.0, 0.01568628, 0.01568628, 0.01568628, 0.0, 0.01568628, 0.01568628, 0.01568628, 0.01568628, 0.01568628, 0.01568628, 0.01568628, 0.01568628, 0.01568628, 0.01568628, 0.01568628, 0.01568628, 0.01568628, 0.0, 0.0, 0.01568628, 0.01568628, 0.01568628, 0.0, 0.01568628, 0.0, 0.0, 0.01568628, 0.0, 0.01568628, 0.0, 0.01568628, 0.01568628, 0.01568628, 0.01568628, 0.01568628, 0.01568628, 0.0, 0.01568628, 0.01568628, 0.01568628, 0.01568628, 0.0, 0.01568628, 0.0, 0.0, 0.0, 0.0, 0.0, 0.01568628, 0.0, 0.0, 0.01568628, 0.01568628, 0.01568628, 0.01568628, 0.0, 0.01568628, 0.0, 0.01568628, 0.01568628, 0.01568628, 0.007843139999999998, 0.43921569, 0.93725491, 0.86274511, 0.94901961, 0.24705882, 0.01568628, 0.13725491, 0.4901960799999999, 0.02352941, 0.0, 0.0, 0.0, 0.01568628, 0.0, 0.01568628, 0.0, 0.01568628, 0.01568628, 0.01568628, 0.01568628, 0.0, 0.01568628, 0.0, 0.0, 0.0, 0.0, 0.0, 0.56862748, 0.73333335, 0.35686275, 0.01568628, 0.60392159, 0.08235294, 0.05098039, 0.84313726, 0.9098039300000001, 0.09803922, 0.01568628, 0.01568628, 0.01568628, 0.01568628, 0.01568628, 0.0, 0.01568628, 0.01568628, 0.01568628, 0.01568628, 0.0, 0.01568628, 0.0, 0.01568628, 0.01568628, 0.0, 0.03921569, 0.66274512, 0.56862748, 0.20392157, 0.0, 0.0, 0.22352941, 0.003921569999999999, 0.76078433, 0.87843138, 0.15686275, 0.01568628, 0.01568628, 0.0, 0.01568628, 0.0, 0.01568628, 0.0, 0.0, 0.0, 0.0, 0.01568628, 0.0, 0.01568628, 0.01568628, 0.0, 0.0, 0.01568628, 0.32156864, 0.76862746, 0.08235294, 0.0, 0.0, 0.0, 0.0, 0.24313726, 0.78039217, 0.27843139, 0.0, 0.0, 0.01568628, 0.01568628, 0.0, 0.0, 0.01568628, 0.01568628, 0.01568628, 0.0, 0.0, 0.01568628, 0.01568628, 0.01568628, 0.01568628, 0.01568628, 0.01568628, 0.0, 0.47450981, 0.52549022, 0.0, 0.0, 0.0, 0.01568628, 0.15294118, 0.9686274500000001, 0.88627452, 0.16470589, 0.0, 0.01568628, 0.01568628, 0.0, 0.01568628, 0.0, 0.0, 0.01568628, 0.0, 0.01568628, 0.01568628, 0.01568628, 0.01568628, 0.01568628, 0.01568628, 0.0, 0.01568628, 0.56078434, 0.8039215799999999, 0.03921569, 0.0, 0.0, 0.01568628, 0.0, 0.60000002, 0.97254902, 0.3137255, 0.0, 0.01568628, 0.0, 0.01568628, 0.01568628, 0.01568628, 0.0, 0.01568628, 0.0, 0.01568628, 0.01568628, 0.01568628, 0.0, 0.0, 0.01568628, 0.01568628, 0.01568628, 0.36078431999999994, 0.9098039300000001, 0.05490196, 0.01568628, 0.0, 0.0, 0.05490196, 0.58039218, 0.97647059, 0.56078434, 0.0, 0.01568628, 0.0, 0.01568628, 0.0, 0.01568628, 0.01568628, 0.0, 0.01568628, 0.01568628, 0.01568628, 0.01568628, 0.0, 0.0, 0.0, 0.01568628, 0.01568628, 0.03137255, 0.8980392200000001, 0.39215687000000005, 0.01568628, 0.01568628, 0.0, 0.25098041, 0.74509805, 0.86274511, 0.41568628, 0.01568628, 0.0, 0.0, 0.01568628, 0.01568628, 0.01568628, 0.0, 0.01568628, 0.0, 0.01568628, 0.01568628, 0.01568628, 0.01568628, 0.01568628, 0.01568628, 0.0, 0.01568628, 0.01568628, 0.20784314, 0.9137255, 0.09411765, 0.1254902, 0.21960784, 0.57647061, 0.98431373, 0.99215686, 0.26274511, 0.01568628, 0.0, 0.0, 0.0, 0.01568628, 0.0, 0.01568628, 0.0, 0.01568628, 0.0, 0.0, 0.01568628, 0.0, 0.01568628, 0.0, 0.01568628, 0.01568628, 0.01568628, 0.01568628, 0.17647059, 0.99215686, 0.79215688, 0.9999999999999999, 0.8509804, 0.82352942, 0.98039216, 0.80784315, 0.01568628, 0.0, 0.0, 0.01568628, 0.01568628, 0.01568628, 0.01568628, 0.01568628, 0.01568628, 0.0, 0.01568628, 0.01568628, 0.01568628, 0.0, 0.01568628, 0.01568628, 0.01568628, 0.01568628, 0.0, 0.01568628, 0.0, 0.43137255, 0.75294119, 0.49803922000000006, 0.07843138, 0.54509807, 0.98039216, 0.5725490499999999, 0.0, 0.01568628, 0.0, 0.01568628, 0.01568628, 0.0, 0.01568628, 0.0, 0.01568628, 0.01568628, 0.01568628, 0.0, 0.0, 0.01568628, 0.0, 0.0, 0.01568628, 0.01568628, 0.01568628, 0.01568628, 0.01568628, 0.0, 0.01568628, 0.01568628, 0.4470588300000001, 1.0, 0.76078433, 0.03529412, 0.01568628, 0.01568628, 0.01568628, 0.01568628, 0.01568628, 0.01568628, 0.01568628, 0.0, 0.01568628, 0.01568628, 0.01568628, 0.0, 0.0, 0.01568628, 0.01568628, 0.01568628, 0.01568628, 0.01568628, 0.01568628, 0.01568628, 0.01568628, 0.01568628, 0.01568628, 0.12941177000000004, 0.99607843, 0.9137255, 0.11372549, 0.0, 0.01568628, 0.01568628, 0.01568628, 0.01568628, 0.0, 0.01568628, 0.01568628, 0.01568628, 0.01568628, 0.01568628, 0.01568628, 0.0, 0.0, 0.01568628, 0.0, 0.0, 0.0, 0.01568628, 0.01568628, 0.01568628, 0.01568628, 0.01568628, 0.02745098, 0.8745098099999999, 0.8392157000000001, 0.10980392, 0.0, 0.0, 0.01568628, 0.01568628, 0.01568628, 0.01568628, 0.01568628, 0.01568628, 0.0, 0.01568628, 0.01568628, 0.0, 0.0, 0.0, 0.0, 0.0, 0.0, 0.0, 0.0, 0.01568628, 0.0, 0.0, 0.01568628, 0.01568628, 0.45490196, 0.97254902, 0.01568628, 0.01568628, 0.01568628, 0.01568628, 0.01568628, 0.01568628, 0.01568628, 0.01568628, 0.01568628, 0.01568628, 0.0, 0.01568628, 0.0, 0.0, 0.01568628, 0.01568628, 0.01568628, 0.01568628, 0.01568628, 0.01568628, 0.01568628, 0.0, 0.01568628, 0.01568628, 0.01568628, 0.26666668, 0.97254902, 0.50196081, 0.01568628, 0.01568628, 0.01568628, 0.01568628, 0.01568628, 0.01568628, 0.01568628, 0.01568628, 0.01568628, 0.01568628, 0.01568628, 0.0, 0.0, 0.0, 0.0, 0.01568628, 0.01568628, 0.01568628, 0.01568628, 0.01568628, 0.0, 0.0, 0.01568628, 0.0, 0.38431373, 0.89803922, 0.627451, 0.03137255, 0.01568628, 0.0, 0.01568628, 0.01568628, 0.01568628, 0.01568628, 0.01568628, 0.01568628, 0.01568628, 0.01568628, 0.0, 0.0, 0.0, 0.01568628, 0.01568628, 0.0, 0.0, 0.0, 0.0, 0.01568628, 0.01568628, 0.0, 0.0, 0.0, 0.81176472, 0.85490197, 0.05098039, 0.01568628, 0.01568628, 0.0, 0.01568628, 0.01568628, 0.01568628, 0.01568628, 0.01568628, 0.01568628, 0.01568628, 0.0, 0.01568628, 0.0, 0.01568628, 0.01568628, 0.0, 0.01568628, 0.0, 0.0, 0.0, 0.01568628, 0.0, 0.0, 0.0, 0.0, 0.81176472, 0.47450981, 0.0, 0.0, 0.0, 0.01568628, 0.01568628, 0.01568628, 0.01568628, 0.01568628, 0.013785337484695768, 0.01568628, 0.01568628, 0.01568628, 0.0, 0.01568628, 0.0, 0.0, 0.0, 0.01568628, 0.01568628, 0.0, 0.01568628, 0.0, 0.0, 0.01568628, 0.0, 0.07843138, 0.33725491, 0.0, 0.0, 0.0, 0.0, 0.0, 0.0, 0.0, 0.0, 0.01568628, 0.0, 0.0, 0.0, 0.0, 0.01568628, 0.01568628, 0.0, 0.01568628, 0.0, 0.0, 0.01568628, 0.0, 0.0, 0.01568628, 0.0, 0.0, 0.0, 0.0, 0.01568628, 0.0, 0.0, 0.0, 0.0, 0.0, 0.0, 0.0, 0.0, 0.0, 0.0, 0.01568628, 0.0, 0.01568628, 0.01568628, 0.0, 0.0, 0.0, 0.01568628, 0.01568628, 0.01568628, 0.0, 0.01568628, 0.0, 0.0, 0.01568628, 0.0, 0.0, 0.01568628, 0.0, 0.0, 0.01568628, 0.01568628, 0.01568628, 0.0, 0.0, 0.01568628, 0.01568628, 0.01568628, 0.01568628, 0.01568628, 0.0, 0.01568628, 0.01568628, 0.01568628, 0.0, 0.0], (10, 5))
[Thread 1] Total splits: 0
Processed 1 zonotopes (Work Done: 0.0%); Generated 0 (0.156674814s/loop)
[Thread 1] Finished in 0.16s
 ────────────────────────────────────────────────────────────────────────────────
                                        Time                    Allocations      
                               ───────────────────────   ────────────────────────
       Tot / % measured:            157ms / 100.0%            141MiB / 100.0%    

 Section               ncalls     time    %tot     avg     alloc    %tot      avg
 ────────────────────────────────────────────────────────────────────────────────
 Verify                     1    157ms   99.6%   157ms    136MiB   96.2%   136MiB
   Zonotope Loop            1    157ms   99.6%   157ms    136MiB   96.2%   136MiB
     Property Check         1    107ms   68.1%   107ms   42.8MiB   30.3%  42.8MiB
     Zonotope Propa...      1   44.5ms   28.3%  44.5ms   72.1MiB   51.0%  72.1MiB
       DiffZonotope...      3   28.9ms   18.4%  9.64ms   69.4MiB   49.0%  23.1MiB
         Zonotope_R...      6   28.8ms   18.3%  4.80ms   69.3MiB   49.0%  11.6MiB
           Influenc...      6   27.6ms   17.5%  4.59ms   63.8MiB   45.1%  10.6MiB
             Multiply       6   21.4ms   13.6%  3.56ms   32.6MiB   23.0%  5.43MiB
             Set Ma...      6   4.37ms    2.8%   728μs     0.00B    0.0%    0.00B
             Alloca...      6   1.81ms    1.2%   302μs   31.2MiB   22.1%  5.20MiB
           Column M...      6    746μs    0.5%   124μs   2.75MiB    1.9%   470KiB
           Set Matrix       6    316μs    0.2%  52.6μs   7.17KiB    0.0%  1.20KiB
           Allocation       6    137μs    0.1%  22.9μs   2.75MiB    1.9%   470KiB
           Vectors          6   28.1μs    0.0%  4.68μs   19.5KiB    0.0%  3.26KiB
           Bounds           6   2.79μs    0.0%   464ns     0.00B    0.0%    0.00B
       DiffZonotope...      4   15.5ms    9.9%  3.88ms   2.74MiB    1.9%   701KiB
         Zonotope_D...      8   15.5ms    9.9%  1.94ms   2.74MiB    1.9%   350KiB
 Initialize                 1    570μs    0.4%   570μs   5.41MiB    3.8%  5.41MiB
 ────────────────────────────────────────────────────────────────────────────────
[VERYDIFF_TIMER] 0.192950918

[VERYDIFF_EXPERIMENT] NETWORK: /home/i57/steuber/NeuroDiff/repos/VeryDiffExperiments/src/../benchmarks/mnist-prune/specs/mnist_92_global_4.vnnlib
[VERYDIFF_EXPERIMENT] TIME: 0.62618742
