
[VERYDIFF_EXPERIMENT] Running on /home/i57/steuber/NeuroDiff/repos/VeryDiffExperiments/src/../benchmarks/mnist-prune/specs/mnist_96_local_15.vnnlib /home/i57/steuber/NeuroDiff/repos/VeryDiffExperiments/src/../benchmarks/mnist-prune/nets/mnist_relu_2_512.onnx
Parsing /home/i57/steuber/NeuroDiff/repos/VeryDiffExperiments/src/../benchmarks/mnist-prune/nets/mnist_relu_2_512.onnx...
Found input X
op: matmul, weight: (512, 784), bias: nothing
op: bias, weight: nothing, bias: (512,)
op: relu, weight: nothing, bias: nothing
op: matmul, weight: (512, 512), bias: nothing
op: bias, weight: nothing, bias: (512,)
op: relu, weight: nothing, bias: nothing
op: matmul, weight: (10, 512), bias: nothing
op: bias, weight: nothing, bias: (10,)
Parsing /home/i57/steuber/NeuroDiff/repos/VeryDiffExperiments/src/../benchmarks/mnist-prune/nets_pruned/mnist_relu_2_512_0.79-old.onnx...
Found input X
op: gemm, weight: (512, 784), bias: (512,)
op: relu, weight: nothing, bias: nothing
op: gemm, weight: (512, 512), bias: (512,)
op: relu, weight: nothing, bias: nothing
op: gemm, weight: (10, 512), bias: (10,)
Distance: 973.3044369037136
Distance: 481.63499746812613
Distance: 8.744412635378467
Running with 1 threads
[Thread 1] Time to first task: 0.0s
Instable Generators: 195
Instable Generators: 450
Zono Bounds:
[-16.798130507608555, -17.467166643767964, -15.146697103097543, -16.707491603969824, -16.419027351334343, -15.750169044820957, -16.046620577554368, -16.49944016984346, -13.683567086883047, -14.045841742614726]
[21.755262445552844, 21.15035477706611, 18.429085411680823, 18.03656097672638, 20.568379327847502, 16.758355652315927, 20.1570826343203, 18.76987611818423, 16.70405118222135, 16.430096618217828]


TIMEOUT REACHED
UNKNOWN
[Thread 1] Total splits: 23
Processed 23 zonotopes (Work Done: 0.0%); Generated 46 (5.274891857173913s/loop)
[Thread 1] Finished in 121.32s
 ────────────────────────────────────────────────────────────────────────────────
                                        Time                    Allocations      
                               ───────────────────────   ────────────────────────
       Tot / % measured:             121s / 100.0%           2.60GiB / 100.0%    

 Section               ncalls     time    %tot     avg     alloc    %tot      avg
 ────────────────────────────────────────────────────────────────────────────────
 Verify                     1     121s  100.0%    121s   2.60GiB   99.8%  2.60GiB
   Zonotope Loop            1     121s  100.0%    121s   2.60GiB   99.8%  2.60GiB
     Property Check        23     121s   99.5%   5.25s   1.94GiB   74.7%  86.6MiB
     Zonotope Propa...     23    633ms    0.5%  27.5ms    642MiB   24.1%  27.9MiB
       DiffZonotope...     69    483ms    0.4%  7.00ms   95.0MiB    3.6%  1.38MiB
         Zonotope_D...    138    175ms    0.1%  1.27ms   40.6MiB    1.5%   301KiB
       DiffZonotope...     46    149ms    0.1%  3.24ms    547MiB   20.5%  11.9MiB
         Zonotope_R...     92   98.1ms    0.1%  1.07ms    328MiB   12.3%  3.56MiB
           Column M...     92   49.9ms    0.0%   542μs    144MiB    5.4%  1.56MiB
           Influenc...     92   15.2ms    0.0%   165μs   37.7MiB    1.4%   419KiB
             Multiply      92   14.4ms    0.0%   157μs   33.5MiB    1.3%   372KiB
             Alloca...     92    537μs    0.0%  5.84μs   4.21MiB    0.2%  46.9KiB
             Set Ma...     92    173μs    0.0%  1.88μs     0.00B    0.0%    0.00B
           Set Matrix      92   14.7ms    0.0%   159μs    723KiB    0.0%  7.86KiB
           Allocation      92   13.4ms    0.0%   146μs    144MiB    5.4%  1.56MiB
           Vectors         92   4.65ms    0.0%  50.5μs   2.24MiB    0.1%  25.0KiB
           Bounds          92   50.5μs    0.0%   549ns     0.00B    0.0%    0.00B
     Compute Split         23   2.94ms    0.0%   128μs   7.83MiB    0.3%   349KiB
 Initialize                 1   1.90ms    0.0%  1.90ms   5.23MiB    0.2%  5.23MiB
 ────────────────────────────────────────────────────────────────────────────────
[VERYDIFF_TIMER] 121.360710752

[VERYDIFF_EXPERIMENT] NETWORK: /home/i57/steuber/NeuroDiff/repos/VeryDiffExperiments/src/../benchmarks/mnist-prune/specs/mnist_96_local_15.vnnlib
[VERYDIFF_EXPERIMENT] TIME: 121.662497865
