
[VERYDIFF_EXPERIMENT] Running on /home/i57/steuber/NeuroDiff/repos/VeryDiffExperiments/src/../benchmarks/mnist-prune/specs/mnist_72_local_21.vnnlib /home/i57/steuber/NeuroDiff/repos/VeryDiffExperiments/src/../benchmarks/mnist-prune/nets/mnist_relu_2_512.onnx
Parsing /home/i57/steuber/NeuroDiff/repos/VeryDiffExperiments/src/../benchmarks/mnist-prune/nets/mnist_relu_2_512.onnx...
Found input X
op: matmul, weight: (512, 784), bias: nothing
op: bias, weight: nothing, bias: (512,)
op: relu, weight: nothing, bias: nothing
op: matmul, weight: (512, 512), bias: nothing
op: bias, weight: nothing, bias: (512,)
op: relu, weight: nothing, bias: nothing
op: matmul, weight: (10, 512), bias: nothing
op: bias, weight: nothing, bias: (10,)
Parsing /home/i57/steuber/NeuroDiff/repos/VeryDiffExperiments/src/../benchmarks/mnist-prune/nets_pruned/mnist_relu_2_512_0.79-old.onnx...
Found input X
op: gemm, weight: (512, 784), bias: (512,)
op: relu, weight: nothing, bias: nothing
op: gemm, weight: (512, 512), bias: (512,)
op: relu, weight: nothing, bias: nothing
op: gemm, weight: (10, 512), bias: (10,)
Distance: 973.3044369037136
Distance: 481.63499746812613
Distance: 8.744412635378467
Running with 1 threads
[Thread 1] Time to first task: 0.0s
Instable Generators: 162
Instable Generators: 211
Zono Bounds:
[-12.327973022632495, -13.307440097429922, -10.341872848852038, -11.427379669370506, -13.949388738738325, -12.104338824571238, -11.762317958558612, -12.965231596492837, -11.67285021848586, -10.925149170279228]
[16.96477035593353, 15.457466071905717, 13.581022264673663, 13.85484844638308, 15.912171451194677, 11.99660977178838, 13.143781165041435, 13.308403936003552, 12.48479421473247, 13.436729912592726]
[Thread 1] Total splits: 0
Processed 1 zonotopes (Work Done: 100.0%); Generated 0 (0.133214911s/loop)
[Thread 1] Finished in 0.13s
 ────────────────────────────────────────────────────────────────────────────────
                                        Time                    Allocations      
                               ───────────────────────   ────────────────────────
       Tot / % measured:            135ms / 100.0%           77.9MiB / 100.0%    

 Section               ncalls     time    %tot     avg     alloc    %tot      avg
 ────────────────────────────────────────────────────────────────────────────────
 Verify                     1    133ms   98.6%   133ms   72.6MiB   93.2%  72.6MiB
   Zonotope Loop            1    133ms   98.5%   133ms   72.6MiB   93.2%  72.6MiB
     Property Check         1    100ms   73.8%   100ms   50.9MiB   65.3%  50.9MiB
     Zonotope Propa...      1   33.3ms   24.6%  33.3ms   20.9MiB   26.8%  20.9MiB
       DiffZonotope...      3   29.2ms   21.6%  9.73ms   3.84MiB    4.9%  1.28MiB
         Zonotope_D...      6   8.07ms    6.0%  1.34ms   1.68MiB    2.2%   287KiB
       DiffZonotope...      2   4.09ms    3.0%  2.04ms   17.0MiB   21.9%  8.51MiB
         Zonotope_R...      4   2.26ms    1.7%   564μs   10.2MiB   13.1%  2.55MiB
           Column M...      4   1.18ms    0.9%   294μs   4.53MiB    5.8%  1.13MiB
           Influenc...      4    453μs    0.3%   113μs   1.03MiB    1.3%   264KiB
             Multiply       4    424μs    0.3%   106μs    864KiB    1.1%   216KiB
             Alloca...      4   13.7μs    0.0%  3.43μs    191KiB    0.2%  47.7KiB
             Set Ma...      4   9.68μs    0.0%  2.42μs     0.00B    0.0%    0.00B
           Set Matrix       4    331μs    0.2%  82.7μs   21.8KiB    0.0%  5.46KiB
           Allocation       4    209μs    0.2%  52.1μs   4.53MiB    5.8%  1.13MiB
           Vectors          4   73.5μs    0.1%  18.4μs    100KiB    0.1%  25.0KiB
           Bounds           4   1.79μs    0.0%   448ns     0.00B    0.0%    0.00B
 Initialize                 1   1.93ms    1.4%  1.93ms   5.26MiB    6.8%  5.26MiB
 ────────────────────────────────────────────────────────────────────────────────
[VERYDIFF_TIMER] 0.166621597

[VERYDIFF_EXPERIMENT] NETWORK: /home/i57/steuber/NeuroDiff/repos/VeryDiffExperiments/src/../benchmarks/mnist-prune/specs/mnist_72_local_21.vnnlib
[VERYDIFF_EXPERIMENT] TIME: 0.470756801
