
[VERYDIFF_EXPERIMENT] Running on /home/i57/steuber/NeuroDiff/repos/VeryDiffExperiments/src/../benchmarks/mnist-prune/specs/mnist_82_global_5.vnnlib /home/i57/steuber/NeuroDiff/repos/VeryDiffExperiments/src/../benchmarks/mnist-prune/nets/mnist_relu_2_512.onnx
Parsing /home/i57/steuber/NeuroDiff/repos/VeryDiffExperiments/src/../benchmarks/mnist-prune/nets/mnist_relu_2_512.onnx...
Found input X
op: matmul, weight: (512, 784), bias: nothing
op: bias, weight: nothing, bias: (512,)
op: relu, weight: nothing, bias: nothing
op: matmul, weight: (512, 512), bias: nothing
op: bias, weight: nothing, bias: (512,)
op: relu, weight: nothing, bias: nothing
op: matmul, weight: (10, 512), bias: nothing
op: bias, weight: nothing, bias: (10,)
Parsing /home/i57/steuber/NeuroDiff/repos/VeryDiffExperiments/src/../benchmarks/mnist-prune/nets_pruned/mnist_relu_2_512_0.79-old.onnx...
Found input X
op: gemm, weight: (512, 784), bias: (512,)
op: relu, weight: nothing, bias: nothing
op: gemm, weight: (512, 512), bias: (512,)
op: relu, weight: nothing, bias: nothing
op: gemm, weight: (10, 512), bias: (10,)
Distance: 973.3044369037136
Distance: 481.63499746812613
Distance: 8.744412635378467
Running with 1 threads
[Thread 1] Time to first task: 0.01s
Instable Generators: 108
Instable Generators: 155
Zono Bounds:
[-7.198405389395161, -6.704983000095428, -5.054650923704119, -6.444613872135117, -6.730409284924743, -6.512115940177996, -7.121060525351803, -6.018897801571338, -5.5748756926388365, -5.228715748388075]
[8.660300824160442, 8.482943818716224, 6.390315758017006, 7.796864545859557, 9.1231868332816, 7.948109941922287, 8.391542742308173, 7.875483771296093, 7.082414853959432, 7.320530114392512]
[Thread 1] Total splits: 0
Processed 1 zonotopes (Work Done: 100.0%); Generated 0 (1.324275098s/loop)
[Thread 1] Finished in 1.32s
 ────────────────────────────────────────────────────────────────────────────────
                                        Time                    Allocations      
                               ───────────────────────   ────────────────────────
       Tot / % measured:            1.33s / 100.0%            221MiB / 100.0%    

 Section               ncalls     time    %tot     avg     alloc    %tot      avg
 ────────────────────────────────────────────────────────────────────────────────
 Verify                     1    1.32s   99.8%   1.32s    211MiB   95.5%   211MiB
   Zonotope Loop            1    1.32s   99.8%   1.32s    211MiB   95.5%   211MiB
     Property Check         1    1.11s   83.4%   1.11s   78.7MiB   35.7%  78.7MiB
     Zonotope Propa...      1    209ms   15.7%   209ms    112MiB   50.8%   112MiB
       DiffZonotope...      2    105ms    7.9%  52.7ms   91.3MiB   41.4%  45.7MiB
         Zonotope_R...      4   98.7ms    7.4%  24.7ms   80.4MiB   36.4%  20.1MiB
           Allocation       4   61.0ms    4.6%  15.2ms   15.2MiB    6.9%  3.79MiB
           Influenc...      4   30.5ms    2.3%  7.63ms   49.9MiB   22.6%  12.5MiB
             Multiply       4   25.1ms    1.9%  6.28ms   26.7MiB   12.1%  6.67MiB
             Set Ma...      4   3.05ms    0.2%   763μs     0.00B    0.0%    0.00B
             Alloca...      4   2.35ms    0.2%   589μs   23.2MiB   10.5%  5.81MiB
           Column M...      4   5.30ms    0.4%  1.32ms   15.2MiB    6.9%  3.80MiB
           Set Matrix       4   1.78ms    0.1%   446μs   16.1KiB    0.0%  4.03KiB
           Vectors          4   80.6μs    0.0%  20.2μs    100KiB    0.0%  25.0KiB
           Bounds           4   2.71μs    0.0%   678ns     0.00B    0.0%    0.00B
       DiffZonotope...      3    103ms    7.8%  34.4ms   20.8MiB    9.4%  6.95MiB
         Zonotope_D...      6   48.6ms    3.7%  8.11ms   13.3MiB    6.0%  2.22MiB
 Initialize                 1   2.19ms    0.2%  2.19ms   9.84MiB    4.5%  9.84MiB
 ────────────────────────────────────────────────────────────────────────────────
[VERYDIFF_TIMER] 1.357225565

[VERYDIFF_EXPERIMENT] NETWORK: /home/i57/steuber/NeuroDiff/repos/VeryDiffExperiments/src/../benchmarks/mnist-prune/specs/mnist_82_global_5.vnnlib
[VERYDIFF_EXPERIMENT] TIME: 1.658847671
