
[VERYDIFF_EXPERIMENT] Running on /home/i57/steuber/NeuroDiff/repos/VeryDiffExperiments/src/../benchmarks/mnist-prune/specs/mnist_18_local_24.vnnlib /home/i57/steuber/NeuroDiff/repos/VeryDiffExperiments/src/../benchmarks/mnist-prune/nets/mnist_relu_3_100.onnx
Loading /home/i57/steuber/NeuroDiff/repos/VeryDiffExperiments/src/../benchmarks/mnist-prune/nets/mnist_relu_3_100.onnx and /home/i57/steuber/NeuroDiff/repos/VeryDiffExperiments/src/../benchmarks/mnist-prune/nets_pruned/mnist_relu_3_100_0.49-old.onnx
INPUT SHAPE: 784
Refined: 87 | Refine Limit: 24 | Wrong: 0 | Right: 126 | Total: 126 | Total Zonos Considered: 213 | Expected 30142 (0.41802136553646074%)Refined: 181 | Refine Limit: 26 | Wrong: 0 | Right: 291 | Total: 291 | Total Zonos Considered: 472 | Expected 69231 (0.4203319322268926%)Refined: 288 | Refine Limit: 39 | Wrong: 0 | Right: 473 | Total: 473 | Total Zonos Considered: 761 | Expected 112530 (0.42033235581622685%)Refined: 403 | Refine Limit: 24 | Wrong: 0 | Right: 704 | Total: 704 | Total Zonos Considered: 1107 | Expected 167486 (0.4203336398266123%)Refined: 537 | Refine Limit: 27 | Wrong: 0 | Right: 948 | Total: 948 | Total Zonos Considered: 1485 | Expected 225536 (0.42033200908059026%)Refined: 642 | Refine Limit: 30 | Wrong: 0 | Right: 1146 | Total: 1146 | Total Zonos Considered: 1788 | Expected 272641 (0.4203329653280321%)Refined: 750 | Refine Limit: 41 | Wrong: 0 | Right: 1329 | Total: 1329 | Total Zonos Considered: 2079 | Expected 316178 (0.4203328504829558%)Refined: 872 | Refine Limit: 27 | Wrong: 0 | Right: 1572 | Total: 1572 | Total Zonos Considered: 2444 | Expected 373990 (0.4203320944410278%)Refined: 976 | Refine Limit: 41 | Wrong: 0 | Right: 1754 | Total: 1754 | Total Zonos Considered: 2730 | Expected 417289 (0.42033219183827036%)Refined: 1091 | Refine Limit: 43 | Wrong: 0 | Right: 1969 | Total: 1969 | Total Zonos Considered: 3060 | Expected 468439 (0.42033220974342445%)Refined: 1197 | Refine Limit: 35 | Wrong: 0 | Right: 2186 | Total: 2186 | Total Zonos Considered: 3383 | Expected 520065 (0.42033207387538096%)Refined: 1299 | Refine Limit: 27 | Wrong: 0 | Right: 2391 | Total: 2391 | Total Zonos Considered: 3690 | Expected 568836 (0.42033204649494754%)Refined: 1407 | Refine Limit: 32 | Wrong: 0 | Right: 2590 | Total: 2590 | Total Zonos Considered: 3997 | Expected 616179 (0.4203324034087497%)Refined: 1505 | Refine Limit: 29 | Wrong: 0 | Right: 2773 | Total: 2773 | Total Zonos Considered: 4278 | Expected 659051 (0.4207565120150034%)Refined: 1597 | Refine Limit: 14 | Wrong: 0 | Right: 2956 | Total: 2956 | Total Zonos Considered: 4553 | Expected 701121 (0.4216105351287438%)Refined: 1679 | Refine Limit: 5 | Wrong: 0 | Right: 3102 | Total: 3102 | Total Zonos Considered: 4781 | Expected 286599 (1.0823485078454564%)Refined: 1759 | Refine Limit: 30 | Wrong: 0 | Right: 3225 | Total: 3225 | Total Zonos Considered: 4984 | Expected 297964 (1.0823455182505268%)Refined: 1847 | Refine Limit: 26 | Wrong: 0 | Right: 3395 | Total: 3395 | Total Zonos Considered: 5242 | Expected 313670 (1.0823476902477127%)Refined: 1917 | Refine Limit: 33 | Wrong: 0 | Right: 3518 | Total: 3518 | Total Zonos Considered: 5435 | Expected 325034 (1.0823483081769907%)Refined: 2000 | Refine Limit: 24 | Wrong: 0 | Right: 3670 | Total: 3670 | Total Zonos Considered: 5670 | Expected 339077 (1.082350026690103%)Refined: 2088 | Refine Limit: 37 | Wrong: 0 | Right: 3824 | Total: 3824 | Total Zonos Considered: 5912 | Expected 353305 (1.0823509432360143%)Refined: 2170 | Refine Limit: 32 | Wrong: 0 | Right: 3977 | Total: 3977 | Total Zonos Considered: 6147 | Expected 367441 (1.0823506358844004%)UNKNOWN
TIMEOUT
Refined: 2171 | Refine Limit: 34 | Wrong: 0 | Right: 3978 | Total: 3978 | Total Zonos Considered: 6149 | Expected 367534 (1.0823488439164812%)

time: 120.177530388

[VERYDIFF_TIMER] 120.206822707

[VERYDIFF_EXPERIMENT] NETWORK: /home/i57/steuber/NeuroDiff/repos/VeryDiffExperiments/src/../benchmarks/mnist-prune/specs/mnist_18_local_24.vnnlib
[VERYDIFF_EXPERIMENT] TIME: 120.495451425
