
[VERYDIFF_EXPERIMENT] Running on /home/i57/steuber/NeuroDiff/repos/VeryDiffExperiments/src/../benchmarks/mnist-prune/specs/mnist_38_global_5.vnnlib /home/i57/steuber/NeuroDiff/repos/VeryDiffExperiments/src/../benchmarks/mnist-prune/nets/mnist_relu_3_100.onnx
Found input X
op: matmul, weight: (100, 784), bias: nothing
op: bias, weight: nothing, bias: (100,)
op: relu, weight: nothing, bias: nothing
op: matmul, weight: (100, 100), bias: nothing
op: bias, weight: nothing, bias: (100,)
op: relu, weight: nothing, bias: nothing
op: matmul, weight: (10, 100), bias: nothing
op: bias, weight: nothing, bias: (10,)
op: relu, weight: nothing, bias: nothing
op: matmul, weight: (10, 10), bias: nothing
op: bias, weight: nothing, bias: (10,)
Found input X
op: gemm, weight: (100, 784), bias: (100,)
op: relu, weight: nothing, bias: nothing
op: gemm, weight: (100, 100), bias: (100,)
op: relu, weight: nothing, bias: nothing
op: gemm, weight: (10, 100), bias: (10,)
op: relu, weight: nothing, bias: nothing
op: gemm, weight: (10, 10), bias: (10,)
Distance: 1623.4465197373434
Distance: 201.62056963066925
Distance: 13.962962507051998
Distance: 0.183768135302671
Running with 1 threads
[Thread 1] Time to first task: 0.0s
Instable Generators: 39
Instable Generators: 53
Instable Generators: 7
Zono Bounds:
[-5.63602473860124, -5.025290294201256, -6.079608549344549, -6.082805791482808, -0.001998341352137205, -7.619816869811247, -6.254452444479398, -6.368470683586949, -5.5691276740741795, -0.009287613779499118]
[5.6244580420044095, 4.808316009577886, 6.090045965340693, 6.027126621958645, 0.005246310500619017, 6.928682564256489, 6.126541903168505, 5.317374070776232, 5.383503393127409, 0.004434320977296433]
[Thread 1] Processed 100 zonotopes (Work Done: 0.0%; Expected Zonos: Inf)
[Thread 1] Processed 200 zonotopes (Work Done: 0.0%; Expected Zonos: Inf)
[Thread 1] Processed 300 zonotopes (Work Done: 0.0%; Expected Zonos: Inf)
[Thread 1] Processed 400 zonotopes (Work Done: 0.0%; Expected Zonos: Inf)
[Thread 1] Processed 500 zonotopes (Work Done: 0.0%; Expected Zonos: Inf)


TIMEOUT REACHED
UNKNOWN
[Thread 1] Total splits: 568
Processed 568 zonotopes (Work Done: 0.0%); Generated 1136 (0.2113241040299296s/loop)
[Thread 1] Finished in 120.03s
 ────────────────────────────────────────────────────────────────────────────────
                                        Time                    Allocations      
                               ───────────────────────   ────────────────────────
       Tot / % measured:             120s / 100.0%           61.1GiB / 100.0%    

 Section               ncalls     time    %tot     avg     alloc    %tot      avg
 ────────────────────────────────────────────────────────────────────────────────
 Verify                     1     120s  100.0%    120s   61.1GiB  100.0%  61.1GiB
   Zonotope Loop            1     120s  100.0%    120s   61.1GiB  100.0%  61.1GiB
     Zonotope Propa...    568    72.2s   60.2%   127ms   41.3GiB   67.6%  74.4MiB
       DiffZonotope...  1.70k    62.2s   51.9%  36.5ms   39.0GiB   63.8%  23.4MiB
         Zonotope_R...  3.41k    61.5s   51.3%  18.1ms   38.0GiB   62.2%  11.4MiB
           Influenc...  3.41k    53.8s   44.8%  15.8ms   35.0GiB   57.3%  10.5MiB
             Alloca...  3.41k    26.0s   21.7%  7.64ms   17.1GiB   28.1%  5.15MiB
             Multiply   3.41k    25.2s   21.0%  7.40ms   17.8GiB   29.2%  5.36MiB
             Set Ma...  3.41k    2.49s    2.1%   730μs     0.00B    0.0%    0.00B
           Allocation   3.41k    7.06s    5.9%  2.07ms   1.51GiB    2.5%   466KiB
           Column M...  3.41k    480ms    0.4%   141μs   1.51GiB    2.5%   466KiB
           Set Matrix   3.41k    192ms    0.2%  56.4μs   3.72MiB    0.0%  1.12KiB
           Vectors      3.41k   17.8ms    0.0%  5.21μs   10.8MiB    0.0%  3.26KiB
           Bounds       3.41k   2.44ms    0.0%   715ns     0.00B    0.0%    0.00B
       DiffZonotope...  2.27k    10.0s    8.3%  4.39ms   2.32GiB    3.8%  1.05MiB
         Zonotope_D...  4.54k    4.81s    4.0%  1.06ms   1.51GiB    2.5%   349KiB
     Compute Split        568    31.6s   26.3%  55.6ms   8.67GiB   14.2%  15.6MiB
     Property Check       568    625ms    0.5%  1.10ms   65.8MiB    0.1%   119KiB
 Initialize                 1    567μs    0.0%   567μs   5.41MiB    0.0%  5.41MiB
 ────────────────────────────────────────────────────────────────────────────────
[VERYDIFF_TIMER] 120.062598018

[VERYDIFF_EXPERIMENT] NETWORK: /home/i57/steuber/NeuroDiff/repos/VeryDiffExperiments/src/../benchmarks/mnist-prune/specs/mnist_38_global_5.vnnlib
[VERYDIFF_EXPERIMENT] TIME: 120.467400456
