
[VERYDIFF_EXPERIMENT] Running on /home/i57/steuber/NeuroDiff/repos/VeryDiffExperiments/src/../benchmarks/mnist-retrained-new-label/specs/mnist_3_local_21.vnnlib /home/i57/steuber/NeuroDiff/repos/VeryDiffExperiments/src/../benchmarks/mnist-retrained-new-label/nets/2x512_5_label-old.onnx
Parsing /home/i57/steuber/NeuroDiff/repos/VeryDiffExperiments/src/../benchmarks/mnist-retrained-new-label/nets/2x512_5_label-old.onnx...
Found input input
op: matmul, weight: (512, 784), bias: nothing
op: bias, weight: nothing, bias: (512,)
op: relu, weight: nothing, bias: nothing
op: matmul, weight: (512, 512), bias: nothing
op: bias, weight: nothing, bias: (512,)
op: relu, weight: nothing, bias: nothing
op: matmul, weight: (10, 512), bias: nothing
op: bias, weight: nothing, bias: (10,)
Parsing /home/i57/steuber/NeuroDiff/repos/VeryDiffExperiments/src/../benchmarks/mnist-retrained-new-label/nets_pruned/2x512_5_label-old_retrained.onnx...
Found input input
op: matmul, weight: (512, 784), bias: nothing
op: bias, weight: nothing, bias: (512,)
op: relu, weight: nothing, bias: nothing
op: matmul, weight: (512, 512), bias: nothing
op: bias, weight: nothing, bias: (512,)
op: relu, weight: nothing, bias: nothing
op: matmul, weight: (10, 512), bias: nothing
op: bias, weight: nothing, bias: (10,)
Distance: 15026.274398723514
Distance: 13537.024648849354
Distance: 270.59723824094544
Running with 1 threads
[Thread 1] Time to first task: 0.0s
Instable Generators: 33
Instable Generators: 175
Zono Bounds:
[-17.106539804225612, -15.227795388065688, -16.23273605837666, -11.939331018469996, -18.946331161571717, 1.7768510316756565, -4.846369169110309, -3.352005281008641, 1.9116784221443988, -6.50556065028829]
[17.91959682483479, 11.97564681533155, 16.024281531919137, 23.411969212886884, 12.338446737704981, 16.523655191750464, 6.398370504724701, 8.927661142897536, 12.848574870841809, 7.0175653133668465]
[Thread 1] Total splits: 7
Processed 15 zonotopes (Work Done: 100.0%); Generated 14 (0.05598249973333334s/loop)
[Thread 1] Finished in 0.84s
 ────────────────────────────────────────────────────────────────────────────────
                                        Time                    Allocations      
                               ───────────────────────   ────────────────────────
       Tot / % measured:            842ms / 100.0%            551MiB / 100.0%    

 Section               ncalls     time    %tot     avg     alloc    %tot      avg
 ────────────────────────────────────────────────────────────────────────────────
 Verify                     1    840ms   99.8%   840ms    546MiB   99.0%   546MiB
   Zonotope Loop            1    840ms   99.8%   840ms    546MiB   99.0%   546MiB
     Property Check        15    596ms   70.8%  39.7ms    355MiB   64.4%  23.7MiB
     Zonotope Propa...     15    237ms   28.2%  15.8ms    176MiB   31.9%  11.7MiB
       DiffZonotope...     45    172ms   20.5%  3.83ms   26.1MiB    4.7%   593KiB
         Zonotope_D...     90   71.9ms    8.5%   799μs   13.5MiB    2.4%   153KiB
       DiffZonotope...     30   64.7ms    7.7%  2.16ms    150MiB   27.1%  4.99MiB
         Zonotope_R...     60   28.6ms    3.4%   477μs   89.3MiB   16.2%  1.49MiB
           Column M...     60   19.2ms    2.3%   320μs   40.3MiB    7.3%   688KiB
           Influenc...     60   3.08ms    0.4%  51.3μs   6.93MiB    1.3%   118KiB
             Multiply      60   2.75ms    0.3%  45.8μs   5.26MiB    1.0%  89.9KiB
             Alloca...     60    176μs    0.0%  2.93μs   1.66MiB    0.3%  28.3KiB
             Set Ma...     60   85.1μs    0.0%  1.42μs     0.00B    0.0%    0.00B
           Set Matrix      60   2.33ms    0.3%  38.8μs    220KiB    0.0%  3.66KiB
           Allocation      60   2.31ms    0.3%  38.5μs   40.3MiB    7.3%   688KiB
           Vectors         60   1.57ms    0.2%  26.2μs   1.46MiB    0.3%  25.0KiB
           Bounds          60   27.9μs    0.0%   465ns     0.00B    0.0%    0.00B
     Compute Split          7    827μs    0.1%   118μs   1.94MiB    0.4%   284KiB
 Initialize                 1   1.94ms    0.2%  1.94ms   5.26MiB    1.0%  5.26MiB
 ────────────────────────────────────────────────────────────────────────────────
[VERYDIFF_TIMER] 0.900454367

[VERYDIFF_EXPERIMENT] Running on /home/i57/steuber/NeuroDiff/repos/VeryDiffExperiments/src/../benchmarks/mnist-retrained-new-label/specs/mnist_3_local_21.vnnlib /home/i57/steuber/NeuroDiff/repos/VeryDiffExperiments/src/../benchmarks/mnist-retrained-new-label/nets/3x100_5_label-old.onnx
Parsing /home/i57/steuber/NeuroDiff/repos/VeryDiffExperiments/src/../benchmarks/mnist-retrained-new-label/nets/3x100_5_label-old.onnx...
Found input input
op: matmul, weight: (100, 784), bias: nothing
op: bias, weight: nothing, bias: (100,)
op: relu, weight: nothing, bias: nothing
op: matmul, weight: (100, 100), bias: nothing
op: bias, weight: nothing, bias: (100,)
op: relu, weight: nothing, bias: nothing
op: matmul, weight: (10, 100), bias: nothing
op: bias, weight: nothing, bias: (10,)
op: relu, weight: nothing, bias: nothing
op: matmul, weight: (10, 10), bias: nothing
Parsing /home/i57/steuber/NeuroDiff/repos/VeryDiffExperiments/src/../benchmarks/mnist-retrained-new-label/nets_pruned/3x100_5_label-old_retrained.onnx...
Found input input
op: matmul, weight: (100, 784), bias: nothing
op: bias, weight: nothing, bias: (100,)
op: relu, weight: nothing, bias: nothing
op: matmul, weight: (100, 100), bias: nothing
op: bias, weight: nothing, bias: (100,)
op: relu, weight: nothing, bias: nothing
op: matmul, weight: (10, 100), bias: nothing
op: bias, weight: nothing, bias: (10,)
op: relu, weight: nothing, bias: nothing
op: matmul, weight: (10, 10), bias: nothing
Distance: 4829.373923484372
Distance: 794.6132591721762
Distance: 102.97695766249672
Distance: 0.0
Running with 1 threads
[Thread 1] Time to first task: 0.0s
Instable Generators: 38
Instable Generators: 43
Instable Generators: 1
Zono Bounds:
[-13.626005146431034, 0.0, -22.4206176580715, -1.2139281742699342, -4.1877858857687755, -2.802817982467648, -1.7575074263414803, -5.664651965863277, -1.813043684603247, -7.0733659756619796]
[29.27135957543034, 0.0, 22.4206176580715, 1.3769834284222733, 3.546685464272029, 2.300617327159424, 1.5506416592648735, 3.209219449497315, 1.542618682469373, 3.8123682347411654]
[Thread 1] Processed 100 zonotopes (Work Done: 15.625%; Expected Zonos: 640.0)
[Thread 1] Processed 200 zonotopes (Work Done: 57.42188%; Expected Zonos: 348.29931972789115)
[Thread 1] Processed 300 zonotopes (Work Done: 83.98438%; Expected Zonos: 357.2093023255814)
[Thread 1] Processed 400 zonotopes (Work Done: 97.07031%; Expected Zonos: 412.0724346076459)
[Thread 1] Total splits: 224
Processed 449 zonotopes (Work Done: 100.0%); Generated 448 (0.016275682739420934s/loop)
[Thread 1] Finished in 7.31s
 ────────────────────────────────────────────────────────────────────────────────
                                        Time                    Allocations      
                               ───────────────────────   ────────────────────────
       Tot / % measured:            7.31s / 100.0%           3.84GiB / 100.0%    

 Section               ncalls     time    %tot     avg     alloc    %tot      avg
 ────────────────────────────────────────────────────────────────────────────────
 Verify                     1    7.31s  100.0%   7.31s   3.84GiB  100.0%  3.84GiB
   Zonotope Loop            1    7.31s  100.0%   7.31s   3.84GiB  100.0%  3.84GiB
     Property Check       449    6.45s   88.2%  14.4ms   2.88GiB   74.9%  6.56MiB
     Zonotope Propa...    449    747ms   10.2%  1.66ms    552MiB   14.0%  1.23MiB
       DiffZonotope...  1.80k    478ms    6.5%   266μs    122MiB    3.1%  69.6KiB
         Zonotope_D...  3.59k    201ms    2.8%  56.0μs   62.8MiB    1.6%  17.9KiB
       DiffZonotope...  1.35k    264ms    3.6%   196μs    430MiB   10.9%   327KiB
         Zonotope_R...  2.69k    109ms    1.5%  40.5μs    269MiB    6.8%   102KiB
           Column M...  2.69k   41.0ms    0.6%  15.2μs   91.4MiB    2.3%  34.7KiB
           Influenc...  2.69k   31.2ms    0.4%  11.6μs   75.4MiB    1.9%  28.7KiB
             Multiply   2.69k   20.4ms    0.3%  7.56μs   45.8MiB    1.2%  17.4KiB
             Alloca...  2.69k   6.53ms    0.1%  2.42μs   29.6MiB    0.8%  11.3KiB
             Set Ma...  2.69k   2.57ms    0.0%   954ns     0.00B    0.0%    0.00B
           Allocation   2.69k   16.2ms    0.2%  6.00μs   91.2MiB    2.3%  34.6KiB
           Set Matrix   2.69k   9.64ms    0.1%  3.58μs   1.99MiB    0.1%     774B
           Vectors      2.69k   7.86ms    0.1%  2.92μs   8.56MiB    0.2%  3.26KiB
           Bounds       2.69k    776μs    0.0%   288ns     0.00B    0.0%    0.00B
     Compute Split        224   19.2ms    0.3%  85.7μs   42.4MiB    1.1%   194KiB
 Initialize                 1    343μs    0.0%   343μs    858KiB    0.0%   858KiB
 ────────────────────────────────────────────────────────────────────────────────
[VERYDIFF_TIMER] 7.331981294

[VERYDIFF_EXPERIMENT] NETWORK: /home/i57/steuber/NeuroDiff/repos/VeryDiffExperiments/src/../benchmarks/mnist-retrained-new-label/specs/mnist_3_local_21.vnnlib
[VERYDIFF_EXPERIMENT] TIME: 8.848626171
