
[VERYDIFF_EXPERIMENT] Running on /home/i57/steuber/NeuroDiff/repos/VeryDiffExperiments/src/../benchmarks/mnist-prune/specs/mnist_48_global_4.vnnlib /home/i57/steuber/NeuroDiff/repos/VeryDiffExperiments/src/../benchmarks/mnist-prune/nets/mnist_relu_4_1024.onnx
Parsing /home/i57/steuber/NeuroDiff/repos/VeryDiffExperiments/src/../benchmarks/mnist-prune/nets/mnist_relu_4_1024.onnx...
Found input X
op: matmul, weight: (1024, 784), bias: nothing
op: bias, weight: nothing, bias: (1024,)
op: relu, weight: nothing, bias: nothing
op: matmul, weight: (1024, 1024), bias: nothing
op: bias, weight: nothing, bias: (1024,)
op: relu, weight: nothing, bias: nothing
op: matmul, weight: (1024, 1024), bias: nothing
op: bias, weight: nothing, bias: (1024,)
op: relu, weight: nothing, bias: nothing
op: matmul, weight: (10, 1024), bias: nothing
op: bias, weight: nothing, bias: (10,)
op: relu, weight: nothing, bias: nothing
op: matmul, weight: (10, 10), bias: nothing
op: bias, weight: nothing, bias: (10,)
Parsing /home/i57/steuber/NeuroDiff/repos/VeryDiffExperiments/src/../benchmarks/mnist-prune/nets_pruned/mnist_relu_4_1024_0.79-old.onnx...
Found input X
op: gemm, weight: (1024, 784), bias: (1024,)
op: relu, weight: nothing, bias: nothing
op: gemm, weight: (1024, 1024), bias: (1024,)
op: relu, weight: nothing, bias: nothing
op: gemm, weight: (1024, 1024), bias: (1024,)
op: relu, weight: nothing, bias: nothing
op: gemm, weight: (10, 1024), bias: (10,)
op: relu, weight: nothing, bias: nothing
op: gemm, weight: (10, 10), bias: (10,)
Distance: 915.6394868631054
Distance: 1298.7052820973968
Distance: 1296.587532894263
Distance: 6.054483317080667
Distance: 0.04942679278974538
Running with 1 threads
[Thread 1] Time to first task: 0.0s
Instable Generators: 253
Instable Generators: 432
Instable Generators: 843
Instable Generators: 8
Zono Bounds:
[-43.01113656962172, -43.0341103328407, -1.1650983308104161, -48.84099484210422, -43.94011601327554, -48.86910989876922, -42.29864572782224, -45.243161088238814, -46.89317035611781, -48.90699397635563]
[42.51571752849916, 42.93489198080579, 1.1786501243853758, 48.46166864822702, 45.30173477564698, 48.59624561602353, 42.188785668687, 44.9660939993231, 46.77628628854514, 48.844782789590944]


TIMEOUT REACHED
UNKNOWN
[Thread 1] Total splits: 38
Processed 38 zonotopes (Work Done: 0.0%); Generated 76 (3.217178791736842s/loop)
[Thread 1] Finished in 122.25s
 ────────────────────────────────────────────────────────────────────────────────
                                        Time                    Allocations      
                               ───────────────────────   ────────────────────────
       Tot / % measured:             122s / 100.0%           32.2GiB / 100.0%    

 Section               ncalls     time    %tot     avg     alloc    %tot      avg
 ────────────────────────────────────────────────────────────────────────────────
 Verify                     1     122s  100.0%    122s   32.1GiB   99.9%  32.1GiB
   Zonotope Loop            1     122s  100.0%    122s   32.1GiB   99.9%  32.1GiB
     Zonotope Propa...     38    62.0s   50.7%   1.63s   19.4GiB   60.2%   522MiB
       DiffZonotope...    152    35.2s   28.8%   232ms   15.9GiB   49.4%   107MiB
         Zonotope_R...    304    32.0s   26.2%   105ms   13.0GiB   40.4%  43.8MiB
           Allocation     304    18.3s   15.0%  60.2ms   2.80GiB    8.7%  9.43MiB
           Influenc...    304    8.90s    7.3%  29.3ms   7.39GiB   23.0%  24.9MiB
             Multiply     304    7.81s    6.4%  25.7ms   4.23GiB   13.1%  14.2MiB
             Alloca...    304    598ms    0.5%  1.97ms   3.16GiB    9.8%  10.6MiB
             Set Ma...    304    488ms    0.4%  1.61ms     0.00B    0.0%    0.00B
           Column M...    304    3.79s    3.1%  12.5ms   2.80GiB    8.7%  9.43MiB
           Set Matrix     304    980ms    0.8%  3.22ms   3.01MiB    0.0%  10.1KiB
           Vectors        304   9.20ms    0.0%  30.3μs   10.1MiB    0.0%  34.0KiB
           Bounds         304    237μs    0.0%   780ns     0.00B    0.0%    0.00B
       DiffZonotope...    190    26.8s   21.9%   141ms   3.47GiB   10.8%  18.7MiB
         Zonotope_D...    380    11.4s    9.3%  29.9ms   1.94GiB    6.0%  5.22MiB
     Property Check        38    58.9s   48.1%   1.55s   10.8GiB   33.6%   292MiB
     Compute Split         38    1.24s    1.0%  32.6ms   1.22GiB    3.8%  32.9MiB
 Initialize                 1   15.0ms    0.0%  15.0ms   27.0MiB    0.1%  27.0MiB
 ────────────────────────────────────────────────────────────────────────────────
[VERYDIFF_TIMER] 122.353212977

[VERYDIFF_EXPERIMENT] NETWORK: /home/i57/steuber/NeuroDiff/repos/VeryDiffExperiments/src/../benchmarks/mnist-prune/specs/mnist_48_global_4.vnnlib
[VERYDIFF_EXPERIMENT] TIME: 122.669516521
