
[VERYDIFF_EXPERIMENT] Running on /home/i57/steuber/NeuroDiff/repos/VeryDiffExperiments/src/../benchmarks/mnist-prune/specs/mnist_26_local_15.vnnlib /home/i57/steuber/NeuroDiff/repos/VeryDiffExperiments/src/../benchmarks/mnist-prune/nets/mnist_relu_2_512.onnx
Parsing /home/i57/steuber/NeuroDiff/repos/VeryDiffExperiments/src/../benchmarks/mnist-prune/nets/mnist_relu_2_512.onnx...
Found input X
op: matmul, weight: (512, 784), bias: nothing
op: bias, weight: nothing, bias: (512,)
op: relu, weight: nothing, bias: nothing
op: matmul, weight: (512, 512), bias: nothing
op: bias, weight: nothing, bias: (512,)
op: relu, weight: nothing, bias: nothing
op: matmul, weight: (10, 512), bias: nothing
op: bias, weight: nothing, bias: (10,)
Parsing /home/i57/steuber/NeuroDiff/repos/VeryDiffExperiments/src/../benchmarks/mnist-prune/nets_pruned/mnist_relu_2_512_pruned5.onnx...
Found input X
op: matmul, weight: (512, 784), bias: nothing
op: bias, weight: nothing, bias: (512,)
op: relu, weight: nothing, bias: nothing
op: matmul, weight: (512, 512), bias: nothing
op: bias, weight: nothing, bias: (512,)
op: relu, weight: nothing, bias: nothing
op: matmul, weight: (10, 512), bias: nothing
op: bias, weight: nothing, bias: (10,)
Distance: 1085.5985166831802
Distance: 1719.8468985003963
Distance: 31.228482716001736
Running with 1 threads
[Thread 1] Time to first task: 0.0s
Instable Generators: 144
Instable Generators: 230
Zono Bounds:
[-15.534373494665072, -13.4061016105093, -12.940116864164967, -10.285676238833267, -17.30826412852462, -13.526603594784465, -17.488270731366992, -3.2280325614695213, -13.578473500697747, -14.124684529816967]
[5.186671355149023, 8.43150583249772, 5.564342115892951, 9.135454247839222, 4.463077133228396, 3.611876538092133, 5.402893772220533, 14.324513717475103, 5.0170827202139385, 4.3338256112118]
[Thread 1] Total splits: 0
Processed 1 zonotopes (Work Done: 100.0%); Generated 0 (0.212240652s/loop)
[Thread 1] Finished in 0.21s
 ────────────────────────────────────────────────────────────────────────────────
                                        Time                    Allocations      
                               ───────────────────────   ────────────────────────
       Tot / % measured:            214ms / 100.0%           77.0MiB / 100.0%    

 Section               ncalls     time    %tot     avg     alloc    %tot      avg
 ────────────────────────────────────────────────────────────────────────────────
 Verify                     1    212ms   99.1%   212ms   71.8MiB   93.2%  71.8MiB
   Zonotope Loop            1    212ms   99.1%   212ms   71.8MiB   93.2%  71.8MiB
     Property Check         1    181ms   84.4%   181ms   51.0MiB   66.3%  51.0MiB
     Zonotope Propa...      1   31.2ms   14.6%  31.2ms   20.0MiB   25.9%  20.0MiB
       DiffZonotope...      3   26.7ms   12.4%  8.88ms   3.42MiB    4.4%  1.14MiB
         Zonotope_D...      6   7.52ms    3.5%  1.25ms   1.49MiB    1.9%   253KiB
       DiffZonotope...      2   4.57ms    2.1%  2.29ms   16.5MiB   21.5%  8.27MiB
         Zonotope_R...      4   2.17ms    1.0%   544μs   9.82MiB   12.8%  2.46MiB
           Column M...      4   1.13ms    0.5%   282μs   4.40MiB    5.7%  1.10MiB
           Influenc...      4    448μs    0.2%   112μs    914KiB    1.2%   229KiB
             Multiply       4    401μs    0.2%   100μs    780KiB    1.0%   195KiB
             Alloca...      4   33.3μs    0.0%  8.34μs    132KiB    0.2%  33.1KiB
             Set Ma...      4   7.37μs    0.0%  1.84μs     0.00B    0.0%    0.00B
           Set Matrix       4    318μs    0.1%  79.5μs   21.8KiB    0.0%  5.45KiB
           Allocation       4    196μs    0.1%  48.9μs   4.40MiB    5.7%  1.10MiB
           Vectors          4   73.2μs    0.0%  18.3μs    100KiB    0.1%  25.0KiB
           Bounds           4   2.15μs    0.0%   538ns     0.00B    0.0%    0.00B
 Initialize                 1   1.99ms    0.9%  1.99ms   5.23MiB    6.8%  5.23MiB
 ────────────────────────────────────────────────────────────────────────────────
[VERYDIFF_TIMER] 0.252517228

[VERYDIFF_EXPERIMENT] Running on /home/i57/steuber/NeuroDiff/repos/VeryDiffExperiments/src/../benchmarks/mnist-prune/specs/mnist_26_local_15.vnnlib /home/i57/steuber/NeuroDiff/repos/VeryDiffExperiments/src/../benchmarks/mnist-prune/nets/mnist_relu_3_100.onnx
Parsing /home/i57/steuber/NeuroDiff/repos/VeryDiffExperiments/src/../benchmarks/mnist-prune/nets/mnist_relu_3_100.onnx...
Found input X
op: matmul, weight: (100, 784), bias: nothing
op: bias, weight: nothing, bias: (100,)
op: relu, weight: nothing, bias: nothing
op: matmul, weight: (100, 100), bias: nothing
op: bias, weight: nothing, bias: (100,)
op: relu, weight: nothing, bias: nothing
op: matmul, weight: (10, 100), bias: nothing
op: bias, weight: nothing, bias: (10,)
op: relu, weight: nothing, bias: nothing
op: matmul, weight: (10, 10), bias: nothing
op: bias, weight: nothing, bias: (10,)
Parsing /home/i57/steuber/NeuroDiff/repos/VeryDiffExperiments/src/../benchmarks/mnist-prune/nets_pruned/mnist_relu_3_100_pruned5.onnx...
Found input X
op: matmul, weight: (100, 784), bias: nothing
op: bias, weight: nothing, bias: (100,)
op: relu, weight: nothing, bias: nothing
op: matmul, weight: (100, 100), bias: nothing
op: bias, weight: nothing, bias: (100,)
op: relu, weight: nothing, bias: nothing
op: matmul, weight: (10, 100), bias: nothing
op: bias, weight: nothing, bias: (10,)
op: relu, weight: nothing, bias: nothing
op: matmul, weight: (10, 10), bias: nothing
op: bias, weight: nothing, bias: (10,)
Distance: 296.6600370998244
Distance: 77.24290861755458
Distance: 5.7170369567975285
Distance: 0.0
Running with 1 threads
[Thread 1] Time to first task: 0.0s
Instable Generators: 35
Instable Generators: 35
Instable Generators: 4
Zono Bounds:
[-0.6050538114895353, -0.7798180963748633, -0.469076444996953, -0.32525201071956855, 0.0, -1.2991311122806972, 0.0, -0.11794170008929306, 0.0, -0.6737204252369254]
[0.43001465917967596, 0.7798180963748633, 0.469076444996953, 0.7719509187982637, 0.0, 0.553465042048392, 0.0, 1.322493034287569, 0.0, 0.5456135102892085]
[Thread 1] Total splits: 0
Processed 1 zonotopes (Work Done: 100.0%); Generated 0 (0.079744235s/loop)
[Thread 1] Finished in 0.08s
 ────────────────────────────────────────────────────────────────────────────────
                                        Time                    Allocations      
                               ───────────────────────   ────────────────────────
       Tot / % measured:           80.1ms / 100.0%           14.8MiB / 100.0%    

 Section               ncalls     time    %tot     avg     alloc    %tot      avg
 ────────────────────────────────────────────────────────────────────────────────
 Verify                     1   79.8ms   99.5%  79.8ms   14.0MiB   94.6%  14.0MiB
   Zonotope Loop            1   79.7ms   99.5%  79.7ms   14.0MiB   94.6%  14.0MiB
     Property Check         1   77.9ms   97.3%  77.9ms   11.9MiB   80.5%  11.9MiB
     Zonotope Propa...      1   1.68ms    2.1%  1.68ms   1.30MiB    8.7%  1.30MiB
       DiffZonotope...      4   1.14ms    1.4%   285μs    291KiB    1.9%  72.8KiB
         Zonotope_D...      8    513μs    0.6%  64.1μs    142KiB    0.9%  17.8KiB
       DiffZonotope...      3    526μs    0.7%   175μs   1.01MiB    6.8%   345KiB
         Zonotope_R...      6    265μs    0.3%  44.2μs    654KiB    4.3%   109KiB
           Influenc...      6   97.3μs    0.1%  16.2μs    159KiB    1.0%  26.4KiB
             Multiply       6   71.4μs    0.1%  11.9μs    101KiB    0.7%  16.9KiB
             Alloca...      6   14.1μs    0.0%  2.34μs   55.1KiB    0.4%  9.18KiB
             Set Ma...      6   6.63μs    0.0%  1.10μs     0.00B    0.0%    0.00B
           Column M...      6   83.7μs    0.1%  13.9μs    233KiB    1.5%  38.9KiB
           Set Matrix       6   28.4μs    0.0%  4.73μs   5.44KiB    0.0%     928B
           Allocation       6   26.0μs    0.0%  4.33μs    233KiB    1.5%  38.8KiB
           Vectors          6   19.8μs    0.0%  3.29μs   19.5KiB    0.1%  3.26KiB
           Bounds           6   1.80μs    0.0%   300ns     0.00B    0.0%    0.00B
 Initialize                 1    363μs    0.5%   363μs    821KiB    5.4%   821KiB
 ────────────────────────────────────────────────────────────────────────────────
[VERYDIFF_TIMER] 0.110927865

[VERYDIFF_EXPERIMENT] NETWORK: /home/i57/steuber/NeuroDiff/repos/VeryDiffExperiments/src/../benchmarks/mnist-prune/specs/mnist_26_local_15.vnnlib
[VERYDIFF_EXPERIMENT] TIME: 0.970685936
