
[VERYDIFF_EXPERIMENT] Running on /home/i57/steuber/NeuroDiff/repos/VeryDiffExperiments/src/../benchmarks/mnist-prune/specs/mnist_25_global_4.vnnlib /home/i57/steuber/NeuroDiff/repos/VeryDiffExperiments/src/../benchmarks/mnist-prune/nets/mnist_relu_2_512.onnx
Found input X
op: matmul, weight: (512, 784), bias: nothing
op: bias, weight: nothing, bias: (512,)
op: relu, weight: nothing, bias: nothing
op: matmul, weight: (512, 512), bias: nothing
op: bias, weight: nothing, bias: (512,)
op: relu, weight: nothing, bias: nothing
op: matmul, weight: (10, 512), bias: nothing
op: bias, weight: nothing, bias: (10,)
Found input X
op: matmul, weight: (512, 784), bias: nothing
op: bias, weight: nothing, bias: (512,)
op: relu, weight: nothing, bias: nothing
op: matmul, weight: (512, 512), bias: nothing
op: bias, weight: nothing, bias: (512,)
op: relu, weight: nothing, bias: nothing
op: matmul, weight: (10, 512), bias: nothing
op: bias, weight: nothing, bias: (10,)
Distance: 1085.5985166831802
Distance: 1719.8468985003963
Distance: 31.228482716001736
Running with 1 threads
[Thread 1] Time to first task: 0.02s
Zono Bounds:
[0.0, 0.0, 0.0, 0.0, 0.0, 0.0, 0.0, 0.0, 0.0, 0.0, 0.0, 0.0, 0.0, 0.0, 0.0, 0.0, 0.0, 0.0, 0.0, 0.0, 0.0, 0.0, 0.0, 0.0, 0.0, 0.0, 0.0, 0.0, 0.0, 0.0, 0.0, 0.0, 0.0, 0.0, 0.0, 0.0, 0.0, 0.0, 0.0, 0.0, 0.0, 0.0, 0.0, 0.0, 0.0, 0.0, 0.0, 0.0, 0.0, 0.0, 0.0, 0.0, 0.0, 0.0, 0.0, 0.0, 0.0, 0.0, 0.0, 0.0, 0.0, 0.0, 0.0, 0.0, 0.0, 0.0, 0.0, 0.0, 0.0, 0.0, 0.0, 0.0, 0.0, 0.0, 0.0, 0.0, 0.0, 0.0, 0.0, 0.0, 0.0, 0.0, 0.0, 0.0, 0.0, 0.0, 0.0, 0.0, 0.0, 0.0, 0.0, 0.0, 0.0, 0.0, 0.0, 0.0, 0.0, 0.0, 0.0, 0.0, 0.0, 0.0, 0.0, 0.0, 0.0, 0.0, 0.0, 0.0, 0.0, 0.0, 0.0, 0.0, 0.0, 0.0, 0.0, 0.0, 0.0, 0.0, 0.0, 0.0, 0.0, 0.0, 0.0, 0.0, 0.0, 0.0, 0.0, 0.0, 0.0, 0.0, 0.0, 0.0, 0.0, 0.0, 0.0, 0.0, 0.0, 0.0, 0.0, 0.0, 0.0, 0.0, 0.0, 0.0, 0.0, 0.0, 0.0, 0.0, 0.0, 0.0, 0.0, 0.0, 0.0, 0.0, 0.0, 0.0, 0.0, 0.0, 0.0, 0.0, 0.0, 0.0, 0.0, 0.0, 0.0, 0.0, 0.0, 0.0, 0.0, 0.0, 0.0, 0.0, 0.0, 0.0, 0.0, 0.0, 0.0, 0.0, 0.0, 0.0, 0.0, 0.0, 0.0, 0.0, 0.0, 0.0, 0.0, 0.0, 0.0, 0.0, 0.0, 0.0, 0.0, 0.0, 0.0, 0.0, 0.0, 0.0, 0.0, 0.0, 0.0, 0.0, 0.0, 0.0, 0.0, 0.0, 0.0, 0.0, 0.0, 0.0, 0.0, 0.0, 0.0, 0.0, 0.0, 0.0, 0.0, 0.0, 0.0, 0.0, 0.0, 0.0, 0.0, 0.0, 0.0, 0.0, 0.0, 0.0, 0.0, 0.0, 0.0, 0.0, 0.0, 0.0, 0.0, 0.0, 0.0, 0.0, 0.0, 0.0, 0.0, 0.0, 0.0, 0.0, 0.0, 0.0, 0.0, 0.0, 0.0, 0.0, 0.0, 0.0, 0.0, 0.0, 0.0, 0.0, 0.0, 0.0, 0.0, 0.0, 0.0, 0.0, 0.0, 0.0, 0.0, 0.0, 0.0, 0.0, 0.0, 0.0, 0.0, 0.0, 0.0, 0.0, 0.0, 0.0, 0.0, 0.0, 0.0, 0.0, 0.0, 0.0, 0.0, 0.0, 0.0, 0.0, 0.0, 0.0, 0.0, 0.0, 0.0, 0.0, 0.0, 0.0, 0.0, 0.0, 0.0, 0.0, 0.0, 0.0, 0.0, 0.0, 0.0, 0.0, 0.0, 0.0, 0.0, 0.0, 0.0, 0.0, 0.0, 0.0, 0.0, 0.0, 0.0, 0.0, 0.0, 0.0, 0.0, 0.0, 0.0, 0.0, 0.0, 0.0, 0.0, 0.0, 0.0, 0.0, 0.0, 0.0, 0.0, 0.0, 0.0, 0.0, 0.0, 0.0, 0.0, 0.0, 0.0, 0.0, 0.0, 0.0, 0.0, 0.0, 0.0, 0.0, 0.0, 0.0, 0.0, 0.0, 0.0, 0.0, 0.0, 0.0, 0.0, 0.0, 0.0, 0.0, 0.0, 0.0, 0.0, 0.0, 0.0, 0.0, 0.0, 0.0, 0.0, 0.0, 0.0, 0.0, 0.0, 0.0, 0.0, 0.0, 0.0, 0.0, 0.0, 0.0, 0.0, 0.0, 0.0, 0.0, 0.0, 0.0, 0.0, 0.0, 0.0, 0.0, 0.0, 0.0, 0.0, 0.0, 0.0, 0.0, 0.0, 0.0, 0.0, 0.0, 0.0, 0.0, 0.0, 0.0, 0.0, 0.0, 0.0, 0.0, 0.0, 0.0, 0.0, 0.0, 0.0, 0.0, 0.0, 0.0, 0.0, 0.0, 0.0, 0.0, 0.0, 0.0, 0.0, 0.0, 0.0, 0.0, 0.0, 0.0, 0.0, 0.0, 0.0, 0.0, 0.0, 0.0, 0.0, 0.0, 0.0, 0.0, 0.0, 0.0, 0.0, 0.0, 0.0, 0.0, 0.0, 0.0, 0.0, 0.0, 0.0, 0.0, 0.0, 0.0, 0.0, 0.0, 0.0, 0.0, 0.0, 0.0, 0.0, 0.0, 0.0, 0.0, 0.0, 0.0, 0.0, 0.0, 0.0, 0.0, 0.0, 0.0, 0.0, 0.0, 0.0, 0.0, 0.0, 0.0, 0.0, 0.0, 0.0, 0.0, 0.0, 0.0, 0.0, 0.0, 0.0, 0.0, 0.0, 0.0, 0.0, 0.0, 0.0, 0.0, 0.0, 0.0, 0.0, 0.0, 0.0, 0.0, 0.0, 0.0, 0.0, 0.0, 0.0, 0.0, 0.0, 0.0, 0.0, 0.0, 0.0, 0.0, 0.0, 0.0, 0.0, 0.0, 0.0, 0.0, 0.0, 0.0, 0.0, 0.0, 0.0, 0.0, 0.0, 0.0, 0.0, 0.0, 0.0, 0.0, 0.0, 0.0, 0.0, 0.0, 0.0, 0.0, 0.0, 0.0, 0.0, 0.0, 0.0, 0.0, 0.0, 0.0, 0.0, 0.0, 0.0, 0.0, 0.0, 0.0, 0.0, 0.0, 0.0, 0.0, 0.0, 0.0, 0.0, 0.0, 0.0, 0.0, 0.0, 0.0, 0.0, 0.0, 0.0, 0.0, 0.0, 0.0, 0.0, 0.0, 0.0, 0.0, 0.0, 0.0, 0.0, 0.0, 0.0, 0.0, 0.0, 0.0, 0.0, 0.0, 0.0, 0.0, 0.0, 0.0, 0.0, 0.0, 0.0, 0.0, 0.0, 0.0, 0.0, 0.0, 0.0, 0.0, 0.0, 0.0, 0.0, 0.0, 0.0, 0.0, 0.0, 0.0, 0.0, 0.0, 0.0, 0.0, 0.0, 0.0, 0.0, 0.0, 0.0, 0.0, 0.0, 0.0, 0.0, 0.0, 0.0, 0.0, 0.0, 0.0, 0.0, 0.0, 0.0, 0.0, 0.0, 0.0, 0.0, 0.0, 0.0, 0.0, 0.0, 0.0, 0.0, 0.0, 0.0, 0.0, 0.0, 0.0, 0.0, 0.0, 0.0, 0.0, 0.0, 0.0, 0.0, 0.0, 0.0, 0.0, 0.0, 0.0, 0.0, 0.0, 0.0, 0.0, 0.0, 0.0, 0.0, 0.0, 0.0, 0.0, 0.0, 0.0, 0.0, 0.0, 0.0, 0.0, 0.0, 0.0, 0.0, 0.0, 0.0, 0.0, 0.0, 0.0, 0.0, 0.0, 0.0, 0.0, 0.0, 0.0, 0.0, 0.0, 0.0, 0.0, 0.0, 0.0, 0.0, 0.0, 0.0, 0.0, 0.0, 0.0, 0.0, 0.0, 0.0, 0.0, 0.0, 0.0, 0.0, 0.0, 0.0, 0.0, 0.0, 0.0, 0.0, 0.0, 0.0, 0.0, 0.0, 0.0, 0.0, 0.0, 0.0, 0.0, 0.0, 0.0, 0.0, 0.0, 0.0, 0.0, 0.0, 0.0, 0.0, 0.0, 0.0, 0.0, 0.0, 0.0, 0.0, 0.0, 0.0, 0.0, 0.0, 0.0, 0.0, 0.0, 0.0, 0.0, 0.0, 0.0, 0.0, 0.0, 0.0, 0.0, 0.0, 0.0, 0.0, 0.0, 0.0, 0.0, 0.0, 0.0, 0.0, 0.0, 0.0, 0.0, 0.0, 0.0, 0.0, 0.0, 0.0, 0.0, 0.0, 0.0, 0.0, 0.0, 0.0, 0.0, 0.0, 0.0, 0.0, 0.0, 0.0, 0.0, 0.0, 0.0, 0.0, 0.0, 0.0, 0.0, 0.0, 0.0, 0.0, 0.0, 0.0, 0.0]
[0.0, 0.0, 0.0, 0.0, 0.0, 0.0, 0.0, 0.0, 0.0, 0.0, 0.0, 0.0, 0.0, 0.0, 0.0, 0.0, 0.0, 0.0, 0.0, 0.0, 0.0, 0.0, 0.0, 0.0, 0.0, 0.0, 0.0, 0.0, 0.0, 0.0, 0.0, 0.0, 0.0, 0.0, 0.0, 0.0, 0.0, 0.0, 0.0, 0.0, 0.0, 0.0, 0.0, 0.0, 0.0, 0.0, 0.0, 0.0, 0.0, 0.0, 0.0, 0.0, 0.0, 0.0, 0.0, 0.0, 0.0, 0.0, 0.0, 0.0, 0.0, 0.0, 0.0, 0.0, 0.0, 0.0, 0.0, 0.0, 0.0, 0.0, 0.0, 0.0, 0.0, 0.0, 0.0, 0.0, 0.0, 0.0, 0.0, 0.0, 0.0, 0.0, 0.0, 0.0, 0.0, 0.0, 0.0, 0.0, 0.0, 0.0, 0.0, 0.0, 0.0, 0.0, 0.0, 0.0, 0.0, 0.0, 0.0, 0.0, 0.0, 0.0, 0.0, 0.0, 0.0, 0.0, 0.0, 0.0, 0.0, 0.0, 0.0, 0.0, 0.0, 0.0, 0.0, 0.0, 0.0, 0.0, 0.0, 0.0, 0.0, 0.0, 0.0, 0.0, 0.0, 0.0, 0.0, 0.0, 0.0, 0.0, 0.0, 0.0, 0.0, 0.0, 0.0, 0.0, 0.0, 0.0, 0.0, 0.0, 0.0, 0.0, 0.0, 0.0, 0.0, 0.0, 0.0, 0.0, 0.0, 0.0, 0.0, 0.0, 0.0, 0.0, 0.0, 0.0, 0.0, 0.0, 0.0, 0.0, 0.0, 0.0, 0.0, 0.0, 0.0, 0.0, 0.0, 0.0, 0.0, 0.0, 0.0, 0.0, 0.0, 0.0, 0.0, 0.0, 0.0, 0.0, 0.0, 0.0, 0.0, 0.0, 0.0, 0.0, 0.0, 0.0, 0.0, 0.0, 0.0, 0.0, 0.0, 0.0, 0.0, 0.0, 0.0, 0.0, 0.0, 0.0, 0.0, 0.0, 0.0, 0.0, 0.0, 0.0, 0.0, 0.0, 0.0, 0.0, 0.0, 0.0, 0.0, 0.0, 0.0, 0.0, 0.0, 0.0, 0.0, 0.0, 0.0, 0.0, 0.0, 0.0, 0.0, 0.0, 0.0, 0.0, 0.0, 0.0, 0.0, 0.0, 0.0, 0.0, 0.0, 0.0, 0.0, 0.0, 0.0, 0.0, 0.0, 0.0, 0.0, 0.0, 0.0, 0.0, 0.0, 0.0, 0.0, 0.0, 0.0, 0.0, 0.0, 0.0, 0.0, 0.0, 0.0, 0.0, 0.0, 0.0, 0.0, 0.0, 0.0, 0.0, 0.0, 0.0, 0.0, 0.0, 0.0, 0.0, 0.0, 0.0, 0.0, 0.0, 0.0, 0.0, 0.0, 0.0, 0.0, 0.0, 0.0, 0.0, 0.0, 0.0, 0.0, 0.0, 0.0, 0.0, 0.0, 0.0, 0.0, 0.0, 0.0, 0.0, 0.0, 0.0, 0.0, 0.0, 0.0, 0.0, 0.0, 0.0, 0.0, 0.0, 0.0, 0.0, 0.0, 0.0, 0.0, 0.0, 0.0, 0.0, 0.0, 0.0, 0.0, 0.0, 0.0, 0.0, 0.0, 0.0, 0.0, 0.0, 0.0, 0.0, 0.0, 0.0, 0.0, 0.0, 0.0, 0.0, 0.0, 0.0, 0.0, 0.0, 0.0, 0.0, 0.0, 0.0, 0.0, 0.0, 0.0, 0.0, 0.0, 0.0, 0.0, 0.0, 0.0, 0.0, 0.0, 0.0, 0.0, 0.0, 0.0, 0.0, 0.0, 0.0, 0.0, 0.0, 0.0, 0.0, 0.0, 0.0, 0.0, 0.0, 0.0, 0.0, 0.0, 0.0, 0.0, 0.0, 0.0, 0.0, 0.0, 0.0, 0.0, 0.0, 0.0, 0.0, 0.0, 0.0, 0.0, 0.0, 0.0, 0.0, 0.0, 0.0, 0.0, 0.0, 0.0, 0.0, 0.0, 0.0, 0.0, 0.0, 0.0, 0.0, 0.0, 0.0, 0.0, 0.0, 0.0, 0.0, 0.0, 0.0, 0.0, 0.0, 0.0, 0.0, 0.0, 0.0, 0.0, 0.0, 0.0, 0.0, 0.0, 0.0, 0.0, 0.0, 0.0, 0.0, 0.0, 0.0, 0.0, 0.0, 0.0, 0.0, 0.0, 0.0, 0.0, 0.0, 0.0, 0.0, 0.0, 0.0, 0.0, 0.0, 0.0, 0.0, 0.0, 0.0, 0.0, 0.0, 0.0, 0.0, 0.0, 0.0, 0.0, 0.0, 0.0, 0.0, 0.0, 0.0, 0.0, 0.0, 0.0, 0.0, 0.0, 0.0, 0.0, 0.0, 0.0, 0.0, 0.0, 0.0, 0.0, 0.0, 0.0, 0.0, 0.0, 0.0, 0.0, 0.0, 0.0, 0.0, 0.0, 0.0, 0.0, 0.0, 0.0, 0.0, 0.0, 0.0, 0.0, 0.0, 0.0, 0.0, 0.0, 0.0, 0.0, 0.0, 0.0, 0.0, 0.0, 0.0, 0.0, 0.0, 0.0, 0.0, 0.0, 0.0, 0.0, 0.0, 0.0, 0.0, 0.0, 0.0, 0.0, 0.0, 0.0, 0.0, 0.0, 0.0, 0.0, 0.0, 0.0, 0.0, 0.0, 0.0, 0.0, 0.0, 0.0, 0.0, 0.0, 0.0, 0.0, 0.0, 0.0, 0.0, 0.0, 0.0, 0.0, 0.0, 0.0, 0.0, 0.0, 0.0, 0.0, 0.0, 0.0, 0.0, 0.0, 0.0, 0.0, 0.0, 0.0, 0.0, 0.0, 0.0, 0.0, 0.0, 0.0, 0.0, 0.0, 0.0, 0.0, 0.0, 0.0, 0.0, 0.0, 0.0, 0.0, 0.0, 0.0, 0.0, 0.0, 0.0, 0.0, 0.0, 0.0, 0.0, 0.0, 0.0, 0.0, 0.0, 0.0, 0.0, 0.0, 0.0, 0.0, 0.0, 0.0, 0.0, 0.0, 0.0, 0.0, 0.0, 0.0, 0.0, 0.0, 0.0, 0.0, 0.0, 0.0, 0.0, 0.0, 0.0, 0.0, 0.0, 0.0, 0.0, 0.0, 0.0, 0.0, 0.0, 0.0, 0.0, 0.0, 0.0, 0.0, 0.0, 0.0, 0.0, 0.0, 0.0, 0.0, 0.0, 0.0, 0.0, 0.0, 0.0, 0.0, 0.0, 0.0, 0.0, 0.0, 0.0, 0.0, 0.0, 0.0, 0.0, 0.0, 0.0, 0.0, 0.0, 0.0, 0.0, 0.0, 0.0, 0.0, 0.0, 0.0, 0.0, 0.0, 0.0, 0.0, 0.0, 0.0, 0.0, 0.0, 0.0, 0.0, 0.0, 0.0, 0.0, 0.0, 0.0, 0.0, 0.0, 0.0, 0.0, 0.0, 0.0, 0.0, 0.0, 0.0, 0.0, 0.0, 0.0, 0.0, 0.0, 0.0, 0.0, 0.0, 0.0, 0.0, 0.0, 0.0, 0.0, 0.0, 0.0, 0.0, 0.0, 0.0, 0.0, 0.0, 0.0, 0.0, 0.0, 0.0, 0.0, 0.0, 0.0, 0.0, 0.0, 0.0, 0.0, 0.0, 0.0, 0.0, 0.0, 0.0, 0.0, 0.0, 0.0, 0.0, 0.0, 0.0, 0.0, 0.0, 0.0, 0.0, 0.0, 0.0, 0.0, 0.0, 0.0, 0.0, 0.0, 0.0, 0.0, 0.0, 0.0, 0.0, 0.0, 0.0, 0.0, 0.0, 0.0, 0.0, 0.0, 0.0, 0.0, 0.0, 0.0, 0.0, 0.0, 0.0, 0.0, 0.0, 0.0, 0.0, 0.0, 0.0, 0.0, 0.0, 0.0, 0.0, 0.0, 0.0, 0.0, 0.0, 0.0, 0.0, 0.0, 0.0, 0.0, 0.0, 0.0, 0.0, 0.0, 0.0, 0.0, 0.0, 0.0, 0.0, 0.0, 0.0, 0.0, 0.0, 0.0, 0.0, 0.0, 0.0, 0.0, 0.0, 0.0, 0.0, 0.0, 0.0, 0.0, 0.0, 0.0, 0.0, 0.0, 0.0, 0.0]

Found counterexample: ([0.00784314, 0.00784314, 0.00784314, 0.00784314, 0.00784314, 0.00784314, 0.00784314, 0.00784314, 0.00784314, 0.00784314, 0.00784314, 0.00784314, 0.00784314, 0.00784314, 0.00784314, 0.00784314, 0.00784314, 0.00784314, 0.00784314, 0.00784314, 0.00784314, 0.00784314, 0.00784314, 0.00784314, 0.00784314, 0.00784314, 0.00784314, 0.00784314, 0.00784314, 0.00784314, 0.00784314, 0.00784314, 0.00784314, 0.00784314, 0.00784314, 0.00784314, 0.00784314, 0.00784314, 0.00784314, 0.00784314, 0.00784314, 0.00784314, 0.00784314, 0.00784314, 0.00784314, 0.00784314, 0.00784314, 0.00784314, 0.00784314, 0.00784314, 0.00784314, 0.00784314, 0.00784314, 0.00784314, 0.00784314, 0.00784314, 0.00784314, 0.00784314, 0.00784314, 0.00784314, 0.00784314, 0.00784314, 0.00784314, 0.00784314, 0.00784314, 0.00784314, 0.00784314, 0.00784314, 0.00784314, 0.00784314, 0.00784314, 0.00784314, 0.00784314, 0.00784314, 0.00784314, 0.00784314, 0.00784314, 0.00784314, 0.00784314, 0.00784314, 0.00784314, 0.00784314, 0.00784314, 0.00784314, 0.00784314, 0.00784314, 0.00784314, 0.00784314, 0.00784314, 0.00784314, 0.00784314, 0.00784314, 0.00784314, 0.00784314, 0.00784314, 0.00784314, 0.00784314, 0.00784314, 0.00784314, 0.00784314, 0.00784314, 0.00784314, 0.00784314, 0.00784314, 0.00784314, 0.00784314, 0.00784314, 0.00784314, 0.00784314, 0.00784314, 0.00784314, 0.00784314, 0.00784314, 0.00784314, 0.00784314, 0.00784314, 0.00784314, 0.00784314, 0.00784314, 0.00784314, 0.00784314, 0.00784314, 0.00784314, 0.00784314, 0.00784314, 0.01372549, 0.3137255, 0.7647058950000001, 0.333333345, 0.3137255, 0.3137255, 0.3137255, 0.054901965, 0.00784314, 0.00784314, 0.00784314, 0.00784314, 0.00784314, 0.00784314, 0.00784314, 0.00784314, 0.00784314, 0.00784314, 0.00784314, 0.00784314, 0.00784314, 0.00784314, 0.00784314, 0.00784314, 0.00784314, 0.00784314, 0.00784314, 0.00784314, 0.035294115, 0.988235295, 0.988235295, 0.988235295, 0.988235295, 0.988235295, 0.988235295, 0.596078455, 0.00784314, 0.00784314, 0.00784314, 0.00784314, 0.00784314, 0.00784314, 0.00784314, 0.00784314, 0.00784314, 0.00784314, 0.00784314, 0.00784314, 0.00784314, 0.00784314, 0.00784314, 0.00784314, 0.043137255, 0.24313726000000002, 0.219607845, 0.00784314, 0.035294115, 0.988235295, 0.988235295, 0.988235295, 0.988235295, 0.988235295, 0.988235295, 0.984313725, 0.92941177, 0.223529415, 0.00784314, 0.00784314, 0.00784314, 0.00784314, 0.00784314, 0.00784314, 0.00784314, 0.00784314, 0.00784314, 0.00784314, 0.00784314, 0.00784314, 0.00784314, 0.00784314, 0.552941205, 0.988235295, 0.9450980449999999, 0.32549020500000003, 0.015686275, 0.63137257, 0.988235295, 0.988235295, 0.988235295, 0.988235295, 0.988235295, 0.988235295, 0.988235295, 0.235294125, 0.00784314, 0.00784314, 0.00784314, 0.00784314, 0.00784314, 0.00784314, 0.00784314, 0.00784314, 0.00784314, 0.00784314, 0.00784314, 0.00784314, 0.043137255, 0.552941205, 0.97254902, 0.988235295, 0.988235295, 0.5764706150000001, 0.00784314, 0.28627452499999995, 0.819607855, 0.98627451, 0.988235295, 0.988235295, 0.988235295, 0.988235295, 0.988235295, 0.83137256, 0.00784314, 0.00784314, 0.00784314, 0.00784314, 0.00784314, 0.00784314, 0.00784314, 0.00784314, 0.00784314, 0.00784314, 0.00784314, 0.00784314, 0.5764706150000001, 0.988235295, 0.988235295, 0.988235295, 0.988235295, 0.78039217, 0.133333335, 0.00784314, 0.00784314, 0.627451005, 0.988235295, 0.5568627749999999, 0.7607843249999999, 0.988235295, 0.988235295, 0.956862745, 0.30196079499999995, 0.00784314, 0.00784314, 0.00784314, 0.00784314, 0.00784314, 0.00784314, 0.00784314, 0.00784314, 0.00784314, 0.035294115, 0.53333336, 0.980392155, 0.988235295, 0.988235295, 0.988235295, 0.988235295, 0.988235295, 0.27058825, 0.00784314, 0.00784314, 0.058823534999999996, 0.20392157, 0.019607845, 0.105882355, 0.7882353049999999, 0.988235295, 0.988235295, 0.61176473, 0.00784314, 0.00784314, 0.00784314, 0.00784314, 0.00784314, 0.00784314, 0.00784314, 0.00784314, 0.00784314, 0.3137255, 0.988235295, 0.988235295, 0.988235295, 0.988235295, 0.988235295, 0.988235295, 0.819607855, 0.16078432, 0.00784314, 0.00784314, 0.00784314, 0.00784314, 0.00784314, 0.00784314, 0.141176475, 0.988235295, 0.988235295, 0.768627465, 0.12941177, 0.00784314, 0.00784314, 0.00784314, 0.00784314, 0.00784314, 0.00784314, 0.00784314, 0.00784314, 0.33725491500000004, 0.988235295, 0.988235295, 0.988235295, 0.988235295, 0.988235295, 0.9176470649999999, 0.16078432, 0.00784314, 0.00784314, 0.00784314, 0.00784314, 0.00784314, 0.00784314, 0.00784314, 0.164705885, 0.988235295, 0.988235295, 0.988235295, 0.305882365, 0.00784314, 0.00784314, 0.00784314, 0.00784314, 0.00784314, 0.00784314, 0.00784314, 0.00784314, 0.99019608, 0.988235295, 0.988235295, 0.988235295, 0.988235295, 0.988235295, 0.647058845, 0.00784314, 0.00784314, 0.00784314, 0.00784314, 0.00784314, 0.00784314, 0.00784314, 0.00784314, 0.82745099, 0.988235295, 0.988235295, 0.988235295, 0.305882365, 0.00784314, 0.00784314, 0.00784314, 0.00784314, 0.00784314, 0.00784314, 0.00784314, 0.00784314, 0.99019608, 0.988235295, 0.988235295, 0.988235295, 0.988235295, 0.674509825, 0.070588235, 0.00784314, 0.00784314, 0.00784314, 0.00784314, 0.00784314, 0.00784314, 0.00784314, 0.00784314, 0.82745099, 0.988235295, 0.988235295, 0.988235295, 0.305882365, 0.00784314, 0.00784314, 0.00784314, 0.00784314, 0.00784314, 0.00784314, 0.00784314, 0.00784314, 0.99019608, 0.988235295, 0.988235295, 0.988235295, 0.823529425, 0.015686275, 0.00784314, 0.00784314, 0.00784314, 0.00784314, 0.00784314, 0.00784314, 0.164705885, 0.898039225, 0.964705885, 0.98627451, 0.988235295, 0.988235295, 0.623529435, 0.01372549, 0.00784314, 0.00784314, 0.00784314, 0.00784314, 0.00784314, 0.00784314, 0.00784314, 0.00784314, 0.99019608, 0.988235295, 0.988235295, 0.988235295, 0.819607855, 0.00784314, 0.00784314, 0.00784314, 0.00784314, 0.00784314, 0.3882353, 0.58431375, 0.823529425, 0.988235295, 0.988235295, 0.988235295, 0.988235295, 0.94901961, 0.25490197, 0.00784314, 0.00784314, 0.00784314, 0.00784314, 0.00784314, 0.00784314, 0.00784314, 0.00784314, 0.00784314, 0.992156865, 0.988235295, 0.988235295, 0.988235295, 0.85490197, 0.20784314, 0.20784314, 0.20784314, 0.70588237, 0.8941176550000001, 0.956862745, 0.988235295, 0.988235295, 0.988235295, 0.988235295, 0.988235295, 0.988235295, 0.30196079499999995, 0.00784314, 0.00784314, 0.00784314, 0.00784314, 0.00784314, 0.00784314, 0.00784314, 0.00784314, 0.00784314, 0.00784314, 0.639215705, 0.988235295, 0.988235295, 0.988235295, 0.988235295, 0.988235295, 0.988235295, 0.988235295, 0.988235295, 0.988235295, 0.988235295, 0.988235295, 0.988235295, 0.988235295, 0.988235295, 0.988235295, 0.75686276, 0.11372549500000001, 0.00784314, 0.00784314, 0.00784314, 0.00784314, 0.00784314, 0.00784314, 0.00784314, 0.00784314, 0.00784314, 0.00784314, 0.3137255, 0.988235295, 0.988235295, 0.988235295, 0.988235295, 0.988235295, 0.988235295, 0.988235295, 0.988235295, 0.988235295, 0.988235295, 0.988235295, 0.988235295, 0.988235295, 0.9176470649999999, 0.75686276, 0.09411765, 0.00784314, 0.00784314, 0.00784314, 0.00784314, 0.00784314, 0.00784314, 0.00784314, 0.00784314, 0.00784314, 0.00784314, 0.00784314, 0.172549025, 0.823529425, 0.988235295, 0.988235295, 0.988235295, 0.988235295, 0.988235295, 0.988235295, 0.988235295, 0.988235295, 0.988235295, 0.988235295, 0.988235295, 0.898039225, 0.26274510500000003, 0.00784314, 0.00784314, 0.00784314, 0.00784314, 0.00784314, 0.00784314, 0.00784314, 0.00784314, 0.00784314, 0.00784314, 0.00784314, 0.00784314, 0.00784314, 0.00784314, 0.149019615, 0.8941176550000001, 0.988235295, 0.988235295, 0.988235295, 0.988235295, 0.988235295, 0.988235295, 0.988235295, 0.988235295, 0.97254902, 0.9215686350000001, 0.25490197, 0.00784314, 0.00784314, 0.00784314, 0.00784314, 0.00784314, 0.00784314, 0.00784314, 0.00784314, 0.00784314, 0.00784314, 0.00784314, 0.00784314, 0.00784314, 0.00784314, 0.00784314, 0.00784314, 0.152941185, 0.823529425, 0.988235295, 0.988235295, 0.988235295, 0.988235295, 0.988235295, 0.988235295, 0.741176485, 0.44705882500000005, 0.00784314, 0.00784314, 0.00784314, 0.00784314, 0.00784314, 0.00784314, 0.00784314, 0.00784314, 0.00784314, 0.00784314, 0.00784314, 0.00784314, 0.00784314, 0.00784314, 0.00784314, 0.00784314, 0.00784314, 0.00784314, 0.00784314, 0.168627455, 0.42352941499999996, 0.988235295, 0.988235295, 0.701960805, 0.305882365, 0.305882365, 0.105882355, 0.00784314, 0.00784314, 0.00784314, 0.00784314, 0.00784314, 0.00784314, 0.00784314, 0.00784314, 0.00784314, 0.00784314, 0.00784314, 0.00784314, 0.00784314, 0.00784314, 0.00784314, 0.00784314, 0.00784314, 0.00784314, 0.00784314, 0.00784314, 0.00784314, 0.00784314, 0.00784314, 0.00784314, 0.00784314, 0.00784314, 0.00784314, 0.00784314, 0.00784314, 0.00784314, 0.00784314, 0.00784314, 0.00784314, 0.00784314, 0.00784314, 0.00784314, 0.00784314, 0.00784314, 0.00784314, 0.00784314, 0.00784314, 0.00784314, 0.00784314, 0.00784314, 0.00784314, 0.00784314, 0.00784314, 0.00784314, 0.00784314, 0.00784314, 0.00784314, 0.00784314, 0.00784314, 0.00784314, 0.00784314, 0.00784314, 0.00784314, 0.00784314, 0.00784314, 0.00784314, 0.00784314, 0.00784314, 0.00784314, 0.00784314, 0.00784314, 0.00784314, 0.00784314, 0.00784314, 0.00784314, 0.00784314, 0.00784314, 0.00784314, 0.00784314, 0.00784314, 0.00784314, 0.00784314, 0.00784314, 0.00784314, 0.00784314, 0.00784314, 0.00784314, 0.00784314, 0.00784314, 0.00784314, 0.00784314, 0.00784314, 0.00784314, 0.00784314, 0.00784314, 0.00784314, 0.00784314, 0.00784314, 0.00784314, 0.00784314, 0.00784314, 0.00784314, 0.00784314, 0.00784314, 0.00784314, 0.00784314, 0.00784314, 0.00784314, 0.00784314, 0.00784314, 0.00784314, 0.00784314, 0.00784314, 0.00784314, 0.00784314, 0.00784314, 0.00784314, 0.00784314, 0.00784314, 0.00784314, 0.00784314, 0.00784314, 0.00784314, 0.00784314, 0.00784314, 0.00784314, 0.00784314, 0.00784314, 0.00784314, 0.00784314], ([6.2034678857621905, -141.56120043969665, -60.597160477449485, -95.8460463228809, -58.266956008646716, -106.5002199533389, -60.4666410226841, -88.89022373644151, -86.09785566067526, -46.23492001421297], [9.629591844874371, -136.10024561104166, -53.093385099145266, -91.55713693035756, -61.556180023577376, -100.29968868056235, -56.92360984128269, -83.90309003243951, -79.28132684878352, -41.717240924456505], 3.4261239591121804))
[Thread 1] Total splits: 0
Processed 1 zonotopes (Work Done: 0.0%); Generated 0 (0.204566057s/loop)
[Thread 1] Finished in 0.2s
 ────────────────────────────────────────────────────────────────────────────────
                                        Time                    Allocations      
                               ───────────────────────   ────────────────────────
       Tot / % measured:            207ms / 100.0%            119MiB / 100.0%    

 Section               ncalls     time    %tot     avg     alloc    %tot      avg
 ────────────────────────────────────────────────────────────────────────────────
 Verify                     1    205ms   99.0%   205ms    109MiB   91.7%   109MiB
   Zonotope Loop            1    205ms   99.0%   205ms    109MiB   91.7%   109MiB
     Zonotope Propa...      1    177ms   85.7%   177ms   87.3MiB   73.7%  87.3MiB
       DiffZonotope...      2    121ms   58.5%  60.4ms   74.3MiB   62.7%  37.2MiB
         Zonotope_R...      4    120ms   58.1%  30.0ms   74.2MiB   62.6%  18.6MiB
           Influenc...      4    105ms   50.6%  26.2ms   45.7MiB   38.6%  11.4MiB
             Multiply       4   89.6ms   43.4%  22.4ms   24.0MiB   20.2%  6.00MiB
             Alloca...      4   11.9ms    5.8%  2.98ms   21.7MiB   18.3%  5.44MiB
             Set Ma...      4   3.09ms    1.5%   773μs     0.00B    0.0%    0.00B
           Column M...      4   9.01ms    4.4%  2.25ms   14.2MiB   12.0%  3.55MiB
           Allocation       4   4.28ms    2.1%  1.07ms   14.2MiB   12.0%  3.55MiB
           Set Matrix       4   1.96ms    0.9%   491μs   11.6KiB    0.0%  2.91KiB
           Vectors          4   81.3μs    0.0%  20.3μs    100KiB    0.1%  25.0KiB
           Bounds           4   2.19μs    0.0%   548ns     0.00B    0.0%    0.00B
       DiffZonotope...      3   56.3ms   27.2%  18.8ms   13.0MiB   11.0%  4.33MiB
         Zonotope_D...      6   56.3ms   27.2%  9.38ms   13.0MiB   11.0%  2.16MiB
     Property Check         1   1.63ms    0.8%  1.63ms    314KiB    0.3%   314KiB
 Initialize                 1   2.12ms    1.0%  2.12ms   9.84MiB    8.3%  9.84MiB
 ────────────────────────────────────────────────────────────────────────────────
[VERYDIFF_TIMER] 0.235839678

[VERYDIFF_EXPERIMENT] Running on /home/i57/steuber/NeuroDiff/repos/VeryDiffExperiments/src/../benchmarks/mnist-prune/specs/mnist_25_global_4.vnnlib /home/i57/steuber/NeuroDiff/repos/VeryDiffExperiments/src/../benchmarks/mnist-prune/nets/mnist_relu_3_100.onnx
Found input X
op: matmul, weight: (100, 784), bias: nothing
op: bias, weight: nothing, bias: (100,)
op: relu, weight: nothing, bias: nothing
op: matmul, weight: (100, 100), bias: nothing
op: bias, weight: nothing, bias: (100,)
op: relu, weight: nothing, bias: nothing
op: matmul, weight: (10, 100), bias: nothing
op: bias, weight: nothing, bias: (10,)
op: relu, weight: nothing, bias: nothing
op: matmul, weight: (10, 10), bias: nothing
op: bias, weight: nothing, bias: (10,)
Found input X
op: matmul, weight: (100, 784), bias: nothing
op: bias, weight: nothing, bias: (100,)
op: relu, weight: nothing, bias: nothing
op: matmul, weight: (100, 100), bias: nothing
op: bias, weight: nothing, bias: (100,)
op: relu, weight: nothing, bias: nothing
op: matmul, weight: (10, 100), bias: nothing
op: bias, weight: nothing, bias: (10,)
op: relu, weight: nothing, bias: nothing
op: matmul, weight: (10, 10), bias: nothing
op: bias, weight: nothing, bias: (10,)
Distance: 296.6600370998244
Distance: 77.24290861755458
Distance: 5.7170369567975285
Distance: 0.0
Running with 1 threads
[Thread 1] Time to first task: 0.0s
Zono Bounds:
[0.0, 0.0, 0.0, 0.0, 0.0, 0.0, 0.0, 0.0, 0.0, 0.0, 0.0, 0.0, 0.0, 0.0, 0.0, 0.0, 0.0, 0.0, 0.0, 0.0, 0.0, 0.0, 0.0, 0.0, 0.0, 0.0, 0.0, 0.0, 0.0, 0.0, 0.0, 0.0, 0.0, 0.0, 0.0, 0.0, 0.0, 0.0, 0.0, 0.0, 0.0, 0.0, 0.0, 0.0, 0.0, 0.0, 0.0, 0.0, 0.0, 0.0, 0.0, 0.0, 0.0, 0.0, 0.0, 0.0, 0.0, 0.0, 0.0, 0.0, 0.0, 0.0, 0.0, 0.0, 0.0, 0.0, 0.0, 0.0, 0.0, 0.0, 0.0, 0.0, 0.0, 0.0, 0.0, 0.0, 0.0, 0.0, 0.0, 0.0, 0.0, 0.0, 0.0, 0.0, 0.0, 0.0, 0.0, 0.0, 0.0, 0.0, 0.0, 0.0, 0.0, 0.0, 0.0, 0.0, 0.0, 0.0, 0.0, 0.0, 0.0, 0.0, 0.0, 0.0, 0.0, 0.0, 0.0, 0.0, 0.0, 0.0, 0.0, 0.0, 0.0, 0.0, 0.0, 0.0, 0.0, 0.0, 0.0, 0.0, 0.0, 0.0, 0.0, 0.0, 0.0, 0.0, 0.0, 0.0, 0.0, 0.0, 0.0, 0.0, 0.0, 0.0, 0.0, 0.0, 0.0, 0.0, 0.0, 0.0, 0.0, 0.0, 0.0, 0.0, 0.0, 0.0, 0.0, 0.0, 0.0, 0.0, 0.0, 0.0, 0.0, 0.0, 0.0, 0.0, 0.0, 0.0, 0.0, 0.0, 0.0, 0.0, 0.0, 0.0, 0.0, 0.0, 0.0, 0.0, 0.0, 0.0, 0.0, 0.0, 0.0, 0.0, 0.0, 0.0, 0.0, 0.0, 0.0, 0.0, 0.0, 0.0, 0.0, 0.0, 0.0, 0.0, 0.0, 0.0, 0.0, 0.0, 0.0, 0.0, 0.0, 0.0, 0.0, 0.0, 0.0, 0.0, 0.0, 0.0, 0.0, 0.0, 0.0, 0.0, 0.0, 0.0, 0.0, 0.0, 0.0, 0.0, 0.0, 0.0, 0.0, 0.0, 0.0, 0.0, 0.0, 0.0, 0.0, 0.0, 0.0, 0.0, 0.0, 0.0, 0.0, 0.0, 0.0, 0.0, 0.0, 0.0, 0.0, 0.0, 0.0, 0.0, 0.0, 0.0, 0.0, 0.0, 0.0, 0.0, 0.0, 0.0, 0.0, 0.0, 0.0, 0.0, 0.0, 0.0, 0.0, 0.0, 0.0, 0.0, 0.0, 0.0, 0.0, 0.0, 0.0, 0.0, 0.0, 0.0, 0.0, 0.0, 0.0, 0.0, 0.0, 0.0, 0.0, 0.0, 0.0, 0.0, 0.0, 0.0, 0.0, 0.0, 0.0, 0.0, 0.0, 0.0, 0.0, 0.0, 0.0, 0.0, 0.0, 0.0, 0.0, 0.0, 0.0, 0.0, 0.0, 0.0, 0.0, 0.0, 0.0, 0.0, 0.0, 0.0, 0.0, 0.0, 0.0, 0.0, 0.0, 0.0, 0.0, 0.0, 0.0, 0.0, 0.0, 0.0, 0.0, 0.0, 0.0, 0.0, 0.0, 0.0, 0.0, 0.0, 0.0, 0.0, 0.0, 0.0, 0.0, 0.0, 0.0, 0.0, 0.0, 0.0, 0.0, 0.0, 0.0, 0.0, 0.0, 0.0, 0.0, 0.0, 0.0, 0.0, 0.0, 0.0, 0.0, 0.0, 0.0, 0.0, 0.0, 0.0, 0.0, 0.0, 0.0, 0.0, 0.0, 0.0, 0.0, 0.0, 0.0, 0.0, 0.0, 0.0, 0.0, 0.0, 0.0, 0.0, 0.0, 0.0, 0.0, 0.0, 0.0, 0.0, 0.0, 0.0, 0.0, 0.0, 0.0, 0.0, 0.0, 0.0, 0.0, 0.0, 0.0, 0.0, 0.0, 0.0, 0.0, 0.0, 0.0, 0.0, 0.0, 0.0, 0.0, 0.0, 0.0, 0.0, 0.0, 0.0, 0.0, 0.0, 0.0, 0.0, 0.0, 0.0, 0.0, 0.0, 0.0, 0.0, 0.0, 0.0, 0.0, 0.0, 0.0, 0.0, 0.0, 0.0, 0.0, 0.0, 0.0, 0.0, 0.0, 0.0, 0.0, 0.0, 0.0, 0.0, 0.0, 0.0, 0.0, 0.0, 0.0, 0.0, 0.0, 0.0, 0.0, 0.0, 0.0, 0.0, 0.0, 0.0, 0.0, 0.0, 0.0, 0.0, 0.0, 0.0, 0.0, 0.0, 0.0, 0.0, 0.0, 0.0, 0.0, 0.0, 0.0, 0.0, 0.0, 0.0, 0.0, 0.0, 0.0, 0.0, 0.0, 0.0, 0.0, 0.0, 0.0, 0.0, 0.0, 0.0, 0.0, 0.0, 0.0, 0.0, 0.0, 0.0, 0.0, 0.0, 0.0, 0.0, 0.0, 0.0, 0.0, 0.0, 0.0, 0.0, 0.0, 0.0, 0.0, 0.0, 0.0, 0.0, 0.0, 0.0, 0.0, 0.0, 0.0, 0.0, 0.0, 0.0, 0.0, 0.0, 0.0, 0.0, 0.0, 0.0, 0.0, 0.0, 0.0, 0.0, 0.0, 0.0, 0.0, 0.0, 0.0, 0.0, 0.0, 0.0, 0.0, 0.0, 0.0, 0.0, 0.0, 0.0, 0.0, 0.0, 0.0, 0.0, 0.0, 0.0, 0.0, 0.0, 0.0, 0.0, 0.0, 0.0, 0.0, 0.0, 0.0, 0.0, 0.0, 0.0, 0.0, 0.0, 0.0, 0.0, 0.0, 0.0, 0.0, 0.0, 0.0, 0.0, 0.0, 0.0, 0.0, 0.0, 0.0, 0.0, 0.0, 0.0, 0.0, 0.0, 0.0, 0.0, 0.0, 0.0, 0.0, 0.0, 0.0, 0.0, 0.0, 0.0, 0.0, 0.0, 0.0, 0.0, 0.0, 0.0, 0.0, 0.0, 0.0, 0.0, 0.0, 0.0, 0.0, 0.0, 0.0, 0.0, 0.0, 0.0, 0.0, 0.0, 0.0, 0.0, 0.0, 0.0, 0.0, 0.0, 0.0, 0.0, 0.0, 0.0, 0.0, 0.0, 0.0, 0.0, 0.0, 0.0, 0.0, 0.0, 0.0, 0.0, 0.0, 0.0, 0.0, 0.0, 0.0, 0.0, 0.0, 0.0, 0.0, 0.0, 0.0, 0.0, 0.0, 0.0, 0.0, 0.0, 0.0, 0.0, 0.0, 0.0, 0.0, 0.0, 0.0, 0.0, 0.0, 0.0, 0.0, 0.0, 0.0, 0.0, 0.0, 0.0, 0.0, 0.0, 0.0, 0.0, 0.0, 0.0, 0.0, 0.0, 0.0, 0.0, 0.0, 0.0, 0.0, 0.0, 0.0, 0.0, 0.0, 0.0, 0.0, 0.0, 0.0, 0.0, 0.0, 0.0, 0.0, 0.0, 0.0, 0.0, 0.0, 0.0, 0.0, 0.0, 0.0, 0.0, 0.0, 0.0, 0.0, 0.0, 0.0, 0.0, 0.0, 0.0, 0.0, 0.0, 0.0, 0.0, 0.0, 0.0, 0.0, 0.0, 0.0, 0.0, 0.0, 0.0, 0.0, 0.0, 0.0, 0.0, 0.0, 0.0, 0.0, 0.0, 0.0, 0.0, 0.0, 0.0, 0.0, 0.0, 0.0, 0.0, 0.0, 0.0, 0.0, 0.0, 0.0, 0.0, 0.0, 0.0, 0.0, 0.0, 0.0, 0.0, 0.0, 0.0, 0.0, 0.0, 0.0, 0.0, 0.0, 0.0, 0.0, 0.0, 0.0, 0.0, 0.0, 0.0, 0.0, 0.0, 0.0, 0.0, 0.0, 0.0, 0.0, 0.0, 0.0, 0.0, 0.0, 0.0, 0.0, 0.0, 0.0, 0.0, 0.0, 0.0, 0.0, 0.0, 0.0, 0.0, 0.0, 0.0, 0.0, 0.0, 0.0, 0.0, 0.0, 0.0, 0.0, 0.0, 0.0, 0.0, 0.0, 0.0, 0.0, 0.0, 0.0, 0.0, 0.0, 0.0, 0.0, 0.0, 0.0, 0.0, 0.0, 0.0, 0.0, 0.0]
[0.0, 0.0, 0.0, 0.0, 0.0, 0.0, 0.0, 0.0, 0.0, 0.0, 0.0, 0.0, 0.0, 0.0, 0.0, 0.0, 0.0, 0.0, 0.0, 0.0, 0.0, 0.0, 0.0, 0.0, 0.0, 0.0, 0.0, 0.0, 0.0, 0.0, 0.0, 0.0, 0.0, 0.0, 0.0, 0.0, 0.0, 0.0, 0.0, 0.0, 0.0, 0.0, 0.0, 0.0, 0.0, 0.0, 0.0, 0.0, 0.0, 0.0, 0.0, 0.0, 0.0, 0.0, 0.0, 0.0, 0.0, 0.0, 0.0, 0.0, 0.0, 0.0, 0.0, 0.0, 0.0, 0.0, 0.0, 0.0, 0.0, 0.0, 0.0, 0.0, 0.0, 0.0, 0.0, 0.0, 0.0, 0.0, 0.0, 0.0, 0.0, 0.0, 0.0, 0.0, 0.0, 0.0, 0.0, 0.0, 0.0, 0.0, 0.0, 0.0, 0.0, 0.0, 0.0, 0.0, 0.0, 0.0, 0.0, 0.0, 0.0, 0.0, 0.0, 0.0, 0.0, 0.0, 0.0, 0.0, 0.0, 0.0, 0.0, 0.0, 0.0, 0.0, 0.0, 0.0, 0.0, 0.0, 0.0, 0.0, 0.0, 0.0, 0.0, 0.0, 0.0, 0.0, 0.0, 0.0, 0.0, 0.0, 0.0, 0.0, 0.0, 0.0, 0.0, 0.0, 0.0, 0.0, 0.0, 0.0, 0.0, 0.0, 0.0, 0.0, 0.0, 0.0, 0.0, 0.0, 0.0, 0.0, 0.0, 0.0, 0.0, 0.0, 0.0, 0.0, 0.0, 0.0, 0.0, 0.0, 0.0, 0.0, 0.0, 0.0, 0.0, 0.0, 0.0, 0.0, 0.0, 0.0, 0.0, 0.0, 0.0, 0.0, 0.0, 0.0, 0.0, 0.0, 0.0, 0.0, 0.0, 0.0, 0.0, 0.0, 0.0, 0.0, 0.0, 0.0, 0.0, 0.0, 0.0, 0.0, 0.0, 0.0, 0.0, 0.0, 0.0, 0.0, 0.0, 0.0, 0.0, 0.0, 0.0, 0.0, 0.0, 0.0, 0.0, 0.0, 0.0, 0.0, 0.0, 0.0, 0.0, 0.0, 0.0, 0.0, 0.0, 0.0, 0.0, 0.0, 0.0, 0.0, 0.0, 0.0, 0.0, 0.0, 0.0, 0.0, 0.0, 0.0, 0.0, 0.0, 0.0, 0.0, 0.0, 0.0, 0.0, 0.0, 0.0, 0.0, 0.0, 0.0, 0.0, 0.0, 0.0, 0.0, 0.0, 0.0, 0.0, 0.0, 0.0, 0.0, 0.0, 0.0, 0.0, 0.0, 0.0, 0.0, 0.0, 0.0, 0.0, 0.0, 0.0, 0.0, 0.0, 0.0, 0.0, 0.0, 0.0, 0.0, 0.0, 0.0, 0.0, 0.0, 0.0, 0.0, 0.0, 0.0, 0.0, 0.0, 0.0, 0.0, 0.0, 0.0, 0.0, 0.0, 0.0, 0.0, 0.0, 0.0, 0.0, 0.0, 0.0, 0.0, 0.0, 0.0, 0.0, 0.0, 0.0, 0.0, 0.0, 0.0, 0.0, 0.0, 0.0, 0.0, 0.0, 0.0, 0.0, 0.0, 0.0, 0.0, 0.0, 0.0, 0.0, 0.0, 0.0, 0.0, 0.0, 0.0, 0.0, 0.0, 0.0, 0.0, 0.0, 0.0, 0.0, 0.0, 0.0, 0.0, 0.0, 0.0, 0.0, 0.0, 0.0, 0.0, 0.0, 0.0, 0.0, 0.0, 0.0, 0.0, 0.0, 0.0, 0.0, 0.0, 0.0, 0.0, 0.0, 0.0, 0.0, 0.0, 0.0, 0.0, 0.0, 0.0, 0.0, 0.0, 0.0, 0.0, 0.0, 0.0, 0.0, 0.0, 0.0, 0.0, 0.0, 0.0, 0.0, 0.0, 0.0, 0.0, 0.0, 0.0, 0.0, 0.0, 0.0, 0.0, 0.0, 0.0, 0.0, 0.0, 0.0, 0.0, 0.0, 0.0, 0.0, 0.0, 0.0, 0.0, 0.0, 0.0, 0.0, 0.0, 0.0, 0.0, 0.0, 0.0, 0.0, 0.0, 0.0, 0.0, 0.0, 0.0, 0.0, 0.0, 0.0, 0.0, 0.0, 0.0, 0.0, 0.0, 0.0, 0.0, 0.0, 0.0, 0.0, 0.0, 0.0, 0.0, 0.0, 0.0, 0.0, 0.0, 0.0, 0.0, 0.0, 0.0, 0.0, 0.0, 0.0, 0.0, 0.0, 0.0, 0.0, 0.0, 0.0, 0.0, 0.0, 0.0, 0.0, 0.0, 0.0, 0.0, 0.0, 0.0, 0.0, 0.0, 0.0, 0.0, 0.0, 0.0, 0.0, 0.0, 0.0, 0.0, 0.0, 0.0, 0.0, 0.0, 0.0, 0.0, 0.0, 0.0, 0.0, 0.0, 0.0, 0.0, 0.0, 0.0, 0.0, 0.0, 0.0, 0.0, 0.0, 0.0, 0.0, 0.0, 0.0, 0.0, 0.0, 0.0, 0.0, 0.0, 0.0, 0.0, 0.0, 0.0, 0.0, 0.0, 0.0, 0.0, 0.0, 0.0, 0.0, 0.0, 0.0, 0.0, 0.0, 0.0, 0.0, 0.0, 0.0, 0.0, 0.0, 0.0, 0.0, 0.0, 0.0, 0.0, 0.0, 0.0, 0.0, 0.0, 0.0, 0.0, 0.0, 0.0, 0.0, 0.0, 0.0, 0.0, 0.0, 0.0, 0.0, 0.0, 0.0, 0.0, 0.0, 0.0, 0.0, 0.0, 0.0, 0.0, 0.0, 0.0, 0.0, 0.0, 0.0, 0.0, 0.0, 0.0, 0.0, 0.0, 0.0, 0.0, 0.0, 0.0, 0.0, 0.0, 0.0, 0.0, 0.0, 0.0, 0.0, 0.0, 0.0, 0.0, 0.0, 0.0, 0.0, 0.0, 0.0, 0.0, 0.0, 0.0, 0.0, 0.0, 0.0, 0.0, 0.0, 0.0, 0.0, 0.0, 0.0, 0.0, 0.0, 0.0, 0.0, 0.0, 0.0, 0.0, 0.0, 0.0, 0.0, 0.0, 0.0, 0.0, 0.0, 0.0, 0.0, 0.0, 0.0, 0.0, 0.0, 0.0, 0.0, 0.0, 0.0, 0.0, 0.0, 0.0, 0.0, 0.0, 0.0, 0.0, 0.0, 0.0, 0.0, 0.0, 0.0, 0.0, 0.0, 0.0, 0.0, 0.0, 0.0, 0.0, 0.0, 0.0, 0.0, 0.0, 0.0, 0.0, 0.0, 0.0, 0.0, 0.0, 0.0, 0.0, 0.0, 0.0, 0.0, 0.0, 0.0, 0.0, 0.0, 0.0, 0.0, 0.0, 0.0, 0.0, 0.0, 0.0, 0.0, 0.0, 0.0, 0.0, 0.0, 0.0, 0.0, 0.0, 0.0, 0.0, 0.0, 0.0, 0.0, 0.0, 0.0, 0.0, 0.0, 0.0, 0.0, 0.0, 0.0, 0.0, 0.0, 0.0, 0.0, 0.0, 0.0, 0.0, 0.0, 0.0, 0.0, 0.0, 0.0, 0.0, 0.0, 0.0, 0.0, 0.0, 0.0, 0.0, 0.0, 0.0, 0.0, 0.0, 0.0, 0.0, 0.0, 0.0, 0.0, 0.0, 0.0, 0.0, 0.0, 0.0, 0.0, 0.0, 0.0, 0.0, 0.0, 0.0, 0.0, 0.0, 0.0, 0.0, 0.0, 0.0, 0.0, 0.0, 0.0, 0.0, 0.0, 0.0, 0.0, 0.0, 0.0, 0.0, 0.0, 0.0, 0.0, 0.0, 0.0, 0.0, 0.0, 0.0, 0.0, 0.0, 0.0, 0.0, 0.0, 0.0, 0.0, 0.0, 0.0, 0.0, 0.0, 0.0, 0.0, 0.0, 0.0, 0.0, 0.0, 0.0, 0.0, 0.0, 0.0, 0.0, 0.0, 0.0, 0.0, 0.0, 0.0, 0.0, 0.0, 0.0, 0.0, 0.0, 0.0, 0.0, 0.0, 0.0, 0.0, 0.0, 0.0, 0.0, 0.0, 0.0, 0.0, 0.0, 0.0, 0.0, 0.0, 0.0, 0.0, 0.0, 0.0, 0.0, 0.0, 0.0, 0.0, 0.0]
[Thread 1] Total splits: 0
Processed 1 zonotopes (Work Done: 100.0%); Generated 0 (0.059528726s/loop)
[Thread 1] Finished in 0.06s
 ────────────────────────────────────────────────────────────────────────────────
                                        Time                    Allocations      
                               ───────────────────────   ────────────────────────
       Tot / % measured:           60.1ms / 100.0%           92.9MiB / 100.0%    

 Section               ncalls     time    %tot     avg     alloc    %tot      avg
 ────────────────────────────────────────────────────────────────────────────────
 Verify                     1   59.6ms   99.1%  59.6ms   87.5MiB   94.2%  87.5MiB
   Zonotope Loop            1   59.5ms   99.1%  59.5ms   87.5MiB   94.2%  87.5MiB
     Zonotope Propa...      1   55.5ms   92.3%  55.5ms   66.7MiB   71.7%  66.7MiB
       DiffZonotope...      3   42.4ms   70.5%  14.1ms   64.0MiB   68.9%  21.3MiB
         Zonotope_R...      6   42.2ms   70.3%  7.04ms   64.0MiB   68.8%  10.7MiB
           Influenc...      6   41.1ms   68.4%  6.85ms   58.8MiB   63.2%  9.79MiB
             Multiply       6   23.2ms   38.7%  3.87ms   29.6MiB   31.8%  4.93MiB
             Alloca...      6   13.8ms   23.0%  2.31ms   29.2MiB   31.4%  4.86MiB
             Set Ma...      6   3.97ms    6.6%   662μs     0.00B    0.0%    0.00B
           Column M...      6    713μs    1.2%   119μs   2.59MiB    2.8%   443KiB
           Set Matrix       6    281μs    0.5%  46.8μs   3.47KiB    0.0%     592B
           Allocation       6    113μs    0.2%  18.8μs   2.59MiB    2.8%   443KiB
           Vectors          6   27.5μs    0.0%  4.59μs   19.5KiB    0.0%  3.26KiB
           Bounds           6   2.77μs    0.0%   462ns     0.00B    0.0%    0.00B
       DiffZonotope...      4   13.1ms   21.8%  3.27ms   2.68MiB    2.9%   685KiB
         Zonotope_D...      8   13.1ms   21.8%  1.64ms   2.67MiB    2.9%   342KiB
     Property Check         1   69.2μs    0.1%  69.2μs    192KiB    0.2%   192KiB
 Initialize                 1    534μs    0.9%   534μs   5.41MiB    5.8%  5.41MiB
 ────────────────────────────────────────────────────────────────────────────────
[VERYDIFF_TIMER] 0.084663428

[VERYDIFF_EXPERIMENT] Running on /home/i57/steuber/NeuroDiff/repos/VeryDiffExperiments/src/../benchmarks/mnist-prune/specs/mnist_25_global_4.vnnlib /home/i57/steuber/NeuroDiff/repos/VeryDiffExperiments/src/../benchmarks/mnist-prune/nets/mnist_relu_4_1024.onnx
Found input X
op: matmul, weight: (1024, 784), bias: nothing
op: bias, weight: nothing, bias: (1024,)
op: relu, weight: nothing, bias: nothing
op: matmul, weight: (1024, 1024), bias: nothing
op: bias, weight: nothing, bias: (1024,)
op: relu, weight: nothing, bias: nothing
op: matmul, weight: (1024, 1024), bias: nothing
op: bias, weight: nothing, bias: (1024,)
op: relu, weight: nothing, bias: nothing
op: matmul, weight: (10, 1024), bias: nothing
op: bias, weight: nothing, bias: (10,)
op: relu, weight: nothing, bias: nothing
op: matmul, weight: (10, 10), bias: nothing
op: bias, weight: nothing, bias: (10,)
Found input X
op: matmul, weight: (1024, 784), bias: nothing
op: bias, weight: nothing, bias: (1024,)
op: relu, weight: nothing, bias: nothing
op: matmul, weight: (1024, 1024), bias: nothing
op: bias, weight: nothing, bias: (1024,)
op: relu, weight: nothing, bias: nothing
op: matmul, weight: (1024, 1024), bias: nothing
op: bias, weight: nothing, bias: (1024,)
op: relu, weight: nothing, bias: nothing
op: matmul, weight: (10, 1024), bias: nothing
op: bias, weight: nothing, bias: (10,)
op: relu, weight: nothing, bias: nothing
op: matmul, weight: (10, 10), bias: nothing
op: bias, weight: nothing, bias: (10,)
Distance: 1266.8815759184893
Distance: 2876.6944248261216
Distance: 2831.8843567411013
Distance: 34.033756025192815
Distance: 0.0
Running with 1 threads
[Thread 1] Time to first task: 0.01s
Zono Bounds:
[0.0, 0.0, 0.0, 0.0, 0.0, 0.0, 0.0, 0.0, 0.0, 0.0, 0.0, 0.0, 0.0, 0.0, 0.0, 0.0, 0.0, 0.0, 0.0, 0.0, 0.0, 0.0, 0.0, 0.0, 0.0, 0.0, 0.0, 0.0, 0.0, 0.0, 0.0, 0.0, 0.0, 0.0, 0.0, 0.0, 0.0, 0.0, 0.0, 0.0, 0.0, 0.0, 0.0, 0.0, 0.0, 0.0, 0.0, 0.0, 0.0, 0.0, 0.0, 0.0, 0.0, 0.0, 0.0, 0.0, 0.0, 0.0, 0.0, 0.0, 0.0, 0.0, 0.0, 0.0, 0.0, 0.0, 0.0, 0.0, 0.0, 0.0, 0.0, 0.0, 0.0, 0.0, 0.0, 0.0, 0.0, 0.0, 0.0, 0.0, 0.0, 0.0, 0.0, 0.0, 0.0, 0.0, 0.0, 0.0, 0.0, 0.0, 0.0, 0.0, 0.0, 0.0, 0.0, 0.0, 0.0, 0.0, 0.0, 0.0, 0.0, 0.0, 0.0, 0.0, 0.0, 0.0, 0.0, 0.0, 0.0, 0.0, 0.0, 0.0, 0.0, 0.0, 0.0, 0.0, 0.0, 0.0, 0.0, 0.0, 0.0, 0.0, 0.0, 0.0, 0.0, 0.0, 0.0, 0.0, 0.0, 0.0, 0.0, 0.0, 0.0, 0.0, 0.0, 0.0, 0.0, 0.0, 0.0, 0.0, 0.0, 0.0, 0.0, 0.0, 0.0, 0.0, 0.0, 0.0, 0.0, 0.0, 0.0, 0.0, 0.0, 0.0, 0.0, 0.0, 0.0, 0.0, 0.0, 0.0, 0.0, 0.0, 0.0, 0.0, 0.0, 0.0, 0.0, 0.0, 0.0, 0.0, 0.0, 0.0, 0.0, 0.0, 0.0, 0.0, 0.0, 0.0, 0.0, 0.0, 0.0, 0.0, 0.0, 0.0, 0.0, 0.0, 0.0, 0.0, 0.0, 0.0, 0.0, 0.0, 0.0, 0.0, 0.0, 0.0, 0.0, 0.0, 0.0, 0.0, 0.0, 0.0, 0.0, 0.0, 0.0, 0.0, 0.0, 0.0, 0.0, 0.0, 0.0, 0.0, 0.0, 0.0, 0.0, 0.0, 0.0, 0.0, 0.0, 0.0, 0.0, 0.0, 0.0, 0.0, 0.0, 0.0, 0.0, 0.0, 0.0, 0.0, 0.0, 0.0, 0.0, 0.0, 0.0, 0.0, 0.0, 0.0, 0.0, 0.0, 0.0, 0.0, 0.0, 0.0, 0.0, 0.0, 0.0, 0.0, 0.0, 0.0, 0.0, 0.0, 0.0, 0.0, 0.0, 0.0, 0.0, 0.0, 0.0, 0.0, 0.0, 0.0, 0.0, 0.0, 0.0, 0.0, 0.0, 0.0, 0.0, 0.0, 0.0, 0.0, 0.0, 0.0, 0.0, 0.0, 0.0, 0.0, 0.0, 0.0, 0.0, 0.0, 0.0, 0.0, 0.0, 0.0, 0.0, 0.0, 0.0, 0.0, 0.0, 0.0, 0.0, 0.0, 0.0, 0.0, 0.0, 0.0, 0.0, 0.0, 0.0, 0.0, 0.0, 0.0, 0.0, 0.0, 0.0, 0.0, 0.0, 0.0, 0.0, 0.0, 0.0, 0.0, 0.0, 0.0, 0.0, 0.0, 0.0, 0.0, 0.0, 0.0, 0.0, 0.0, 0.0, 0.0, 0.0, 0.0, 0.0, 0.0, 0.0, 0.0, 0.0, 0.0, 0.0, 0.0, 0.0, 0.0, 0.0, 0.0, 0.0, 0.0, 0.0, 0.0, 0.0, 0.0, 0.0, 0.0, 0.0, 0.0, 0.0, 0.0, 0.0, 0.0, 0.0, 0.0, 0.0, 0.0, 0.0, 0.0, 0.0, 0.0, 0.0, 0.0, 0.0, 0.0, 0.0, 0.0, 0.0, 0.0, 0.0, 0.0, 0.0, 0.0, 0.0, 0.0, 0.0, 0.0, 0.0, 0.0, 0.0, 0.0, 0.0, 0.0, 0.0, 0.0, 0.0, 0.0, 0.0, 0.0, 0.0, 0.0, 0.0, 0.0, 0.0, 0.0, 0.0, 0.0, 0.0, 0.0, 0.0, 0.0, 0.0, 0.0, 0.0, 0.0, 0.0, 0.0, 0.0, 0.0, 0.0, 0.0, 0.0, 0.0, 0.0, 0.0, 0.0, 0.0, 0.0, 0.0, 0.0, 0.0, 0.0, 0.0, 0.0, 0.0, 0.0, 0.0, 0.0, 0.0, 0.0, 0.0, 0.0, 0.0, 0.0, 0.0, 0.0, 0.0, 0.0, 0.0, 0.0, 0.0, 0.0, 0.0, 0.0, 0.0, 0.0, 0.0, 0.0, 0.0, 0.0, 0.0, 0.0, 0.0, 0.0, 0.0, 0.0, 0.0, 0.0, 0.0, 0.0, 0.0, 0.0, 0.0, 0.0, 0.0, 0.0, 0.0, 0.0, 0.0, 0.0, 0.0, 0.0, 0.0, 0.0, 0.0, 0.0, 0.0, 0.0, 0.0, 0.0, 0.0, 0.0, 0.0, 0.0, 0.0, 0.0, 0.0, 0.0, 0.0, 0.0, 0.0, 0.0, 0.0, 0.0, 0.0, 0.0, 0.0, 0.0, 0.0, 0.0, 0.0, 0.0, 0.0, 0.0, 0.0, 0.0, 0.0, 0.0, 0.0, 0.0, 0.0, 0.0, 0.0, 0.0, 0.0, 0.0, 0.0, 0.0, 0.0, 0.0, 0.0, 0.0, 0.0, 0.0, 0.0, 0.0, 0.0, 0.0, 0.0, 0.0, 0.0, 0.0, 0.0, 0.0, 0.0, 0.0, 0.0, 0.0, 0.0, 0.0, 0.0, 0.0, 0.0, 0.0, 0.0, 0.0, 0.0, 0.0, 0.0, 0.0, 0.0, 0.0, 0.0, 0.0, 0.0, 0.0, 0.0, 0.0, 0.0, 0.0, 0.0, 0.0, 0.0, 0.0, 0.0, 0.0, 0.0, 0.0, 0.0, 0.0, 0.0, 0.0, 0.0, 0.0, 0.0, 0.0, 0.0, 0.0, 0.0, 0.0, 0.0, 0.0, 0.0, 0.0, 0.0, 0.0, 0.0, 0.0, 0.0, 0.0, 0.0, 0.0, 0.0, 0.0, 0.0, 0.0, 0.0, 0.0, 0.0, 0.0, 0.0, 0.0, 0.0, 0.0, 0.0, 0.0, 0.0, 0.0, 0.0, 0.0, 0.0, 0.0, 0.0, 0.0, 0.0, 0.0, 0.0, 0.0, 0.0, 0.0, 0.0, 0.0, 0.0, 0.0, 0.0, 0.0, 0.0, 0.0, 0.0, 0.0, 0.0, 0.0, 0.0, 0.0, 0.0, 0.0, 0.0, 0.0, 0.0, 0.0, 0.0, 0.0, 0.0, 0.0, 0.0, 0.0, 0.0, 0.0, 0.0, 0.0, 0.0, 0.0, 0.0, 0.0, 0.0, 0.0, 0.0, 0.0, 0.0, 0.0, 0.0, 0.0, 0.0, 0.0, 0.0, 0.0, 0.0, 0.0, 0.0, 0.0, 0.0, 0.0, 0.0, 0.0, 0.0, 0.0, 0.0, 0.0, 0.0, 0.0, 0.0, 0.0, 0.0, 0.0, 0.0, 0.0, 0.0, 0.0, 0.0, 0.0, 0.0, 0.0, 0.0, 0.0, 0.0, 0.0, 0.0, 0.0, 0.0, 0.0, 0.0, 0.0, 0.0, 0.0, 0.0, 0.0, 0.0, 0.0, 0.0, 0.0, 0.0, 0.0, 0.0, 0.0, 0.0, 0.0, 0.0, 0.0, 0.0, 0.0, 0.0, 0.0, 0.0, 0.0, 0.0, 0.0, 0.0, 0.0, 0.0, 0.0, 0.0, 0.0, 0.0, 0.0, 0.0, 0.0, 0.0, 0.0, 0.0, 0.0, 0.0, 0.0, 0.0, 0.0, 0.0, 0.0, 0.0, 0.0, 0.0, 0.0, 0.0, 0.0, 0.0, 0.0, 0.0, 0.0, 0.0, 0.0, 0.0, 0.0, 0.0, 0.0, 0.0, 0.0, 0.0, 0.0, 0.0, 0.0, 0.0, 0.0, 0.0, 0.0, 0.0, 0.0, 0.0, 0.0, 0.0, 0.0, 0.0, 0.0, 0.0, 0.0, 0.0]
[0.0, 0.0, 0.0, 0.0, 0.0, 0.0, 0.0, 0.0, 0.0, 0.0, 0.0, 0.0, 0.0, 0.0, 0.0, 0.0, 0.0, 0.0, 0.0, 0.0, 0.0, 0.0, 0.0, 0.0, 0.0, 0.0, 0.0, 0.0, 0.0, 0.0, 0.0, 0.0, 0.0, 0.0, 0.0, 0.0, 0.0, 0.0, 0.0, 0.0, 0.0, 0.0, 0.0, 0.0, 0.0, 0.0, 0.0, 0.0, 0.0, 0.0, 0.0, 0.0, 0.0, 0.0, 0.0, 0.0, 0.0, 0.0, 0.0, 0.0, 0.0, 0.0, 0.0, 0.0, 0.0, 0.0, 0.0, 0.0, 0.0, 0.0, 0.0, 0.0, 0.0, 0.0, 0.0, 0.0, 0.0, 0.0, 0.0, 0.0, 0.0, 0.0, 0.0, 0.0, 0.0, 0.0, 0.0, 0.0, 0.0, 0.0, 0.0, 0.0, 0.0, 0.0, 0.0, 0.0, 0.0, 0.0, 0.0, 0.0, 0.0, 0.0, 0.0, 0.0, 0.0, 0.0, 0.0, 0.0, 0.0, 0.0, 0.0, 0.0, 0.0, 0.0, 0.0, 0.0, 0.0, 0.0, 0.0, 0.0, 0.0, 0.0, 0.0, 0.0, 0.0, 0.0, 0.0, 0.0, 0.0, 0.0, 0.0, 0.0, 0.0, 0.0, 0.0, 0.0, 0.0, 0.0, 0.0, 0.0, 0.0, 0.0, 0.0, 0.0, 0.0, 0.0, 0.0, 0.0, 0.0, 0.0, 0.0, 0.0, 0.0, 0.0, 0.0, 0.0, 0.0, 0.0, 0.0, 0.0, 0.0, 0.0, 0.0, 0.0, 0.0, 0.0, 0.0, 0.0, 0.0, 0.0, 0.0, 0.0, 0.0, 0.0, 0.0, 0.0, 0.0, 0.0, 0.0, 0.0, 0.0, 0.0, 0.0, 0.0, 0.0, 0.0, 0.0, 0.0, 0.0, 0.0, 0.0, 0.0, 0.0, 0.0, 0.0, 0.0, 0.0, 0.0, 0.0, 0.0, 0.0, 0.0, 0.0, 0.0, 0.0, 0.0, 0.0, 0.0, 0.0, 0.0, 0.0, 0.0, 0.0, 0.0, 0.0, 0.0, 0.0, 0.0, 0.0, 0.0, 0.0, 0.0, 0.0, 0.0, 0.0, 0.0, 0.0, 0.0, 0.0, 0.0, 0.0, 0.0, 0.0, 0.0, 0.0, 0.0, 0.0, 0.0, 0.0, 0.0, 0.0, 0.0, 0.0, 0.0, 0.0, 0.0, 0.0, 0.0, 0.0, 0.0, 0.0, 0.0, 0.0, 0.0, 0.0, 0.0, 0.0, 0.0, 0.0, 0.0, 0.0, 0.0, 0.0, 0.0, 0.0, 0.0, 0.0, 0.0, 0.0, 0.0, 0.0, 0.0, 0.0, 0.0, 0.0, 0.0, 0.0, 0.0, 0.0, 0.0, 0.0, 0.0, 0.0, 0.0, 0.0, 0.0, 0.0, 0.0, 0.0, 0.0, 0.0, 0.0, 0.0, 0.0, 0.0, 0.0, 0.0, 0.0, 0.0, 0.0, 0.0, 0.0, 0.0, 0.0, 0.0, 0.0, 0.0, 0.0, 0.0, 0.0, 0.0, 0.0, 0.0, 0.0, 0.0, 0.0, 0.0, 0.0, 0.0, 0.0, 0.0, 0.0, 0.0, 0.0, 0.0, 0.0, 0.0, 0.0, 0.0, 0.0, 0.0, 0.0, 0.0, 0.0, 0.0, 0.0, 0.0, 0.0, 0.0, 0.0, 0.0, 0.0, 0.0, 0.0, 0.0, 0.0, 0.0, 0.0, 0.0, 0.0, 0.0, 0.0, 0.0, 0.0, 0.0, 0.0, 0.0, 0.0, 0.0, 0.0, 0.0, 0.0, 0.0, 0.0, 0.0, 0.0, 0.0, 0.0, 0.0, 0.0, 0.0, 0.0, 0.0, 0.0, 0.0, 0.0, 0.0, 0.0, 0.0, 0.0, 0.0, 0.0, 0.0, 0.0, 0.0, 0.0, 0.0, 0.0, 0.0, 0.0, 0.0, 0.0, 0.0, 0.0, 0.0, 0.0, 0.0, 0.0, 0.0, 0.0, 0.0, 0.0, 0.0, 0.0, 0.0, 0.0, 0.0, 0.0, 0.0, 0.0, 0.0, 0.0, 0.0, 0.0, 0.0, 0.0, 0.0, 0.0, 0.0, 0.0, 0.0, 0.0, 0.0, 0.0, 0.0, 0.0, 0.0, 0.0, 0.0, 0.0, 0.0, 0.0, 0.0, 0.0, 0.0, 0.0, 0.0, 0.0, 0.0, 0.0, 0.0, 0.0, 0.0, 0.0, 0.0, 0.0, 0.0, 0.0, 0.0, 0.0, 0.0, 0.0, 0.0, 0.0, 0.0, 0.0, 0.0, 0.0, 0.0, 0.0, 0.0, 0.0, 0.0, 0.0, 0.0, 0.0, 0.0, 0.0, 0.0, 0.0, 0.0, 0.0, 0.0, 0.0, 0.0, 0.0, 0.0, 0.0, 0.0, 0.0, 0.0, 0.0, 0.0, 0.0, 0.0, 0.0, 0.0, 0.0, 0.0, 0.0, 0.0, 0.0, 0.0, 0.0, 0.0, 0.0, 0.0, 0.0, 0.0, 0.0, 0.0, 0.0, 0.0, 0.0, 0.0, 0.0, 0.0, 0.0, 0.0, 0.0, 0.0, 0.0, 0.0, 0.0, 0.0, 0.0, 0.0, 0.0, 0.0, 0.0, 0.0, 0.0, 0.0, 0.0, 0.0, 0.0, 0.0, 0.0, 0.0, 0.0, 0.0, 0.0, 0.0, 0.0, 0.0, 0.0, 0.0, 0.0, 0.0, 0.0, 0.0, 0.0, 0.0, 0.0, 0.0, 0.0, 0.0, 0.0, 0.0, 0.0, 0.0, 0.0, 0.0, 0.0, 0.0, 0.0, 0.0, 0.0, 0.0, 0.0, 0.0, 0.0, 0.0, 0.0, 0.0, 0.0, 0.0, 0.0, 0.0, 0.0, 0.0, 0.0, 0.0, 0.0, 0.0, 0.0, 0.0, 0.0, 0.0, 0.0, 0.0, 0.0, 0.0, 0.0, 0.0, 0.0, 0.0, 0.0, 0.0, 0.0, 0.0, 0.0, 0.0, 0.0, 0.0, 0.0, 0.0, 0.0, 0.0, 0.0, 0.0, 0.0, 0.0, 0.0, 0.0, 0.0, 0.0, 0.0, 0.0, 0.0, 0.0, 0.0, 0.0, 0.0, 0.0, 0.0, 0.0, 0.0, 0.0, 0.0, 0.0, 0.0, 0.0, 0.0, 0.0, 0.0, 0.0, 0.0, 0.0, 0.0, 0.0, 0.0, 0.0, 0.0, 0.0, 0.0, 0.0, 0.0, 0.0, 0.0, 0.0, 0.0, 0.0, 0.0, 0.0, 0.0, 0.0, 0.0, 0.0, 0.0, 0.0, 0.0, 0.0, 0.0, 0.0, 0.0, 0.0, 0.0, 0.0, 0.0, 0.0, 0.0, 0.0, 0.0, 0.0, 0.0, 0.0, 0.0, 0.0, 0.0, 0.0, 0.0, 0.0, 0.0, 0.0, 0.0, 0.0, 0.0, 0.0, 0.0, 0.0, 0.0, 0.0, 0.0, 0.0, 0.0, 0.0, 0.0, 0.0, 0.0, 0.0, 0.0, 0.0, 0.0, 0.0, 0.0, 0.0, 0.0, 0.0, 0.0, 0.0, 0.0, 0.0, 0.0, 0.0, 0.0, 0.0, 0.0, 0.0, 0.0, 0.0, 0.0, 0.0, 0.0, 0.0, 0.0, 0.0, 0.0, 0.0, 0.0, 0.0, 0.0, 0.0, 0.0, 0.0, 0.0, 0.0, 0.0, 0.0, 0.0, 0.0, 0.0, 0.0, 0.0, 0.0, 0.0, 0.0, 0.0, 0.0, 0.0, 0.0, 0.0, 0.0, 0.0, 0.0, 0.0, 0.0, 0.0, 0.0, 0.0, 0.0, 0.0, 0.0, 0.0, 0.0, 0.0, 0.0, 0.0, 0.0, 0.0, 0.0, 0.0, 0.0, 0.0, 0.0, 0.0, 0.0, 0.0, 0.0, 0.0, 0.0, 0.0, 0.0, 0.0, 0.0, 0.0, 0.0, 0.0, 0.0, 0.0, 0.0, 0.0, 0.0, 0.0]

Found counterexample: ([0.00784314, 0.00784314, 0.00784314, 0.00784314, 0.00784314, 0.00784314, 0.00784314, 0.00784314, 0.00784314, 0.00784314, 0.00784314, 0.00784314, 0.00784314, 0.00784314, 0.00784314, 0.00784314, 0.00784314, 0.00784314, 0.00784314, 0.00784314, 0.00784314, 0.00784314, 0.00784314, 0.00784314, 0.00784314, 0.00784314, 0.00784314, 0.00784314, 0.00784314, 0.00784314, 0.00784314, 0.00784314, 0.00784314, 0.00784314, 0.00784314, 0.00784314, 0.00784314, 0.00784314, 0.00784314, 0.00784314, 0.00784314, 0.00784314, 0.00784314, 0.00784314, 0.00784314, 0.00784314, 0.00784314, 0.00784314, 0.00784314, 0.00784314, 0.00784314, 0.00784314, 0.00784314, 0.00784314, 0.00784314, 0.00784314, 0.00784314, 0.00784314, 0.00784314, 0.00784314, 0.00784314, 0.00784314, 0.00784314, 0.00784314, 0.00784314, 0.00784314, 0.00784314, 0.00784314, 0.00784314, 0.00784314, 0.00784314, 0.00784314, 0.00784314, 0.00784314, 0.00784314, 0.00784314, 0.00784314, 0.00784314, 0.00784314, 0.00784314, 0.00784314, 0.00784314, 0.00784314, 0.00784314, 0.00784314, 0.00784314, 0.00784314, 0.00784314, 0.00784314, 0.00784314, 0.00784314, 0.00784314, 0.00784314, 0.00784314, 0.00784314, 0.00784314, 0.00784314, 0.00784314, 0.00784314, 0.00784314, 0.00784314, 0.00784314, 0.00784314, 0.00784314, 0.00784314, 0.00784314, 0.00784314, 0.00784314, 0.00784314, 0.00784314, 0.00784314, 0.00784314, 0.00784314, 0.00784314, 0.00784314, 0.00784314, 0.00784314, 0.00784314, 0.00784314, 0.00784314, 0.00784314, 0.00784314, 0.00784314, 0.00784314, 0.00784314, 0.01372549, 0.3137255, 0.7647058950000001, 0.333333345, 0.3137255, 0.3137255, 0.3137255, 0.054901965, 0.00784314, 0.00784314, 0.00784314, 0.00784314, 0.00784314, 0.00784314, 0.00784314, 0.00784314, 0.00784314, 0.00784314, 0.00784314, 0.00784314, 0.00784314, 0.00784314, 0.00784314, 0.00784314, 0.00784314, 0.00784314, 0.00784314, 0.00784314, 0.035294115, 0.988235295, 0.988235295, 0.988235295, 0.988235295, 0.988235295, 0.988235295, 0.596078455, 0.00784314, 0.00784314, 0.00784314, 0.00784314, 0.00784314, 0.00784314, 0.00784314, 0.00784314, 0.00784314, 0.00784314, 0.00784314, 0.00784314, 0.00784314, 0.00784314, 0.00784314, 0.00784314, 0.043137255, 0.24313726000000002, 0.219607845, 0.00784314, 0.035294115, 0.988235295, 0.988235295, 0.988235295, 0.988235295, 0.988235295, 0.988235295, 0.984313725, 0.92941177, 0.223529415, 0.00784314, 0.00784314, 0.00784314, 0.00784314, 0.00784314, 0.00784314, 0.00784314, 0.00784314, 0.00784314, 0.00784314, 0.00784314, 0.00784314, 0.00784314, 0.00784314, 0.552941205, 0.988235295, 0.9450980449999999, 0.32549020500000003, 0.015686275, 0.63137257, 0.988235295, 0.988235295, 0.988235295, 0.988235295, 0.988235295, 0.988235295, 0.988235295, 0.235294125, 0.00784314, 0.00784314, 0.00784314, 0.00784314, 0.00784314, 0.00784314, 0.00784314, 0.00784314, 0.00784314, 0.00784314, 0.00784314, 0.00784314, 0.043137255, 0.552941205, 0.97254902, 0.988235295, 0.988235295, 0.5764706150000001, 0.00784314, 0.28627452499999995, 0.819607855, 0.98627451, 0.988235295, 0.988235295, 0.988235295, 0.988235295, 0.988235295, 0.83137256, 0.00784314, 0.00784314, 0.00784314, 0.00784314, 0.00784314, 0.00784314, 0.00784314, 0.00784314, 0.00784314, 0.00784314, 0.00784314, 0.00784314, 0.5764706150000001, 0.988235295, 0.988235295, 0.988235295, 0.988235295, 0.78039217, 0.133333335, 0.00784314, 0.00784314, 0.627451005, 0.988235295, 0.5568627749999999, 0.7607843249999999, 0.988235295, 0.988235295, 0.956862745, 0.30196079499999995, 0.00784314, 0.00784314, 0.00784314, 0.00784314, 0.00784314, 0.00784314, 0.00784314, 0.00784314, 0.00784314, 0.035294115, 0.53333336, 0.980392155, 0.988235295, 0.988235295, 0.988235295, 0.988235295, 0.988235295, 0.27058825, 0.00784314, 0.00784314, 0.058823534999999996, 0.20392157, 0.019607845, 0.105882355, 0.7882353049999999, 0.988235295, 0.988235295, 0.61176473, 0.00784314, 0.00784314, 0.00784314, 0.00784314, 0.00784314, 0.00784314, 0.00784314, 0.00784314, 0.00784314, 0.3137255, 0.988235295, 0.988235295, 0.988235295, 0.988235295, 0.988235295, 0.988235295, 0.819607855, 0.16078432, 0.00784314, 0.00784314, 0.00784314, 0.00784314, 0.00784314, 0.00784314, 0.141176475, 0.988235295, 0.988235295, 0.768627465, 0.12941177, 0.00784314, 0.00784314, 0.00784314, 0.00784314, 0.00784314, 0.00784314, 0.00784314, 0.00784314, 0.33725491500000004, 0.988235295, 0.988235295, 0.988235295, 0.988235295, 0.988235295, 0.9176470649999999, 0.16078432, 0.00784314, 0.00784314, 0.00784314, 0.00784314, 0.00784314, 0.00784314, 0.00784314, 0.164705885, 0.988235295, 0.988235295, 0.988235295, 0.305882365, 0.00784314, 0.00784314, 0.00784314, 0.00784314, 0.00784314, 0.00784314, 0.00784314, 0.00784314, 0.99019608, 0.988235295, 0.988235295, 0.988235295, 0.988235295, 0.988235295, 0.647058845, 0.00784314, 0.00784314, 0.00784314, 0.00784314, 0.00784314, 0.00784314, 0.00784314, 0.00784314, 0.82745099, 0.988235295, 0.988235295, 0.988235295, 0.305882365, 0.00784314, 0.00784314, 0.00784314, 0.00784314, 0.00784314, 0.00784314, 0.00784314, 0.00784314, 0.99019608, 0.988235295, 0.988235295, 0.988235295, 0.988235295, 0.674509825, 0.070588235, 0.00784314, 0.00784314, 0.00784314, 0.00784314, 0.00784314, 0.00784314, 0.00784314, 0.00784314, 0.82745099, 0.988235295, 0.988235295, 0.988235295, 0.305882365, 0.00784314, 0.00784314, 0.00784314, 0.00784314, 0.00784314, 0.00784314, 0.00784314, 0.00784314, 0.99019608, 0.988235295, 0.988235295, 0.988235295, 0.823529425, 0.015686275, 0.00784314, 0.00784314, 0.00784314, 0.00784314, 0.00784314, 0.00784314, 0.164705885, 0.898039225, 0.964705885, 0.98627451, 0.988235295, 0.988235295, 0.623529435, 0.01372549, 0.00784314, 0.00784314, 0.00784314, 0.00784314, 0.00784314, 0.00784314, 0.00784314, 0.00784314, 0.99019608, 0.988235295, 0.988235295, 0.988235295, 0.819607855, 0.00784314, 0.00784314, 0.00784314, 0.00784314, 0.00784314, 0.3882353, 0.58431375, 0.823529425, 0.988235295, 0.988235295, 0.988235295, 0.988235295, 0.94901961, 0.25490197, 0.00784314, 0.00784314, 0.00784314, 0.00784314, 0.00784314, 0.00784314, 0.00784314, 0.00784314, 0.00784314, 0.992156865, 0.988235295, 0.988235295, 0.988235295, 0.85490197, 0.20784314, 0.20784314, 0.20784314, 0.70588237, 0.8941176550000001, 0.956862745, 0.988235295, 0.988235295, 0.988235295, 0.988235295, 0.988235295, 0.988235295, 0.30196079499999995, 0.00784314, 0.00784314, 0.00784314, 0.00784314, 0.00784314, 0.00784314, 0.00784314, 0.00784314, 0.00784314, 0.00784314, 0.639215705, 0.988235295, 0.988235295, 0.988235295, 0.988235295, 0.988235295, 0.988235295, 0.988235295, 0.988235295, 0.988235295, 0.988235295, 0.988235295, 0.988235295, 0.988235295, 0.988235295, 0.988235295, 0.75686276, 0.11372549500000001, 0.00784314, 0.00784314, 0.00784314, 0.00784314, 0.00784314, 0.00784314, 0.00784314, 0.00784314, 0.00784314, 0.00784314, 0.3137255, 0.988235295, 0.988235295, 0.988235295, 0.988235295, 0.988235295, 0.988235295, 0.988235295, 0.988235295, 0.988235295, 0.988235295, 0.988235295, 0.988235295, 0.988235295, 0.9176470649999999, 0.75686276, 0.09411765, 0.00784314, 0.00784314, 0.00784314, 0.00784314, 0.00784314, 0.00784314, 0.00784314, 0.00784314, 0.00784314, 0.00784314, 0.00784314, 0.172549025, 0.823529425, 0.988235295, 0.988235295, 0.988235295, 0.988235295, 0.988235295, 0.988235295, 0.988235295, 0.988235295, 0.988235295, 0.988235295, 0.988235295, 0.898039225, 0.26274510500000003, 0.00784314, 0.00784314, 0.00784314, 0.00784314, 0.00784314, 0.00784314, 0.00784314, 0.00784314, 0.00784314, 0.00784314, 0.00784314, 0.00784314, 0.00784314, 0.00784314, 0.149019615, 0.8941176550000001, 0.988235295, 0.988235295, 0.988235295, 0.988235295, 0.988235295, 0.988235295, 0.988235295, 0.988235295, 0.97254902, 0.9215686350000001, 0.25490197, 0.00784314, 0.00784314, 0.00784314, 0.00784314, 0.00784314, 0.00784314, 0.00784314, 0.00784314, 0.00784314, 0.00784314, 0.00784314, 0.00784314, 0.00784314, 0.00784314, 0.00784314, 0.00784314, 0.152941185, 0.823529425, 0.988235295, 0.988235295, 0.988235295, 0.988235295, 0.988235295, 0.988235295, 0.741176485, 0.44705882500000005, 0.00784314, 0.00784314, 0.00784314, 0.00784314, 0.00784314, 0.00784314, 0.00784314, 0.00784314, 0.00784314, 0.00784314, 0.00784314, 0.00784314, 0.00784314, 0.00784314, 0.00784314, 0.00784314, 0.00784314, 0.00784314, 0.00784314, 0.168627455, 0.42352941499999996, 0.988235295, 0.988235295, 0.701960805, 0.305882365, 0.305882365, 0.105882355, 0.00784314, 0.00784314, 0.00784314, 0.00784314, 0.00784314, 0.00784314, 0.00784314, 0.00784314, 0.00784314, 0.00784314, 0.00784314, 0.00784314, 0.00784314, 0.00784314, 0.00784314, 0.00784314, 0.00784314, 0.00784314, 0.00784314, 0.00784314, 0.00784314, 0.00784314, 0.00784314, 0.00784314, 0.00784314, 0.00784314, 0.00784314, 0.00784314, 0.00784314, 0.00784314, 0.00784314, 0.00784314, 0.00784314, 0.00784314, 0.00784314, 0.00784314, 0.00784314, 0.00784314, 0.00784314, 0.00784314, 0.00784314, 0.00784314, 0.00784314, 0.00784314, 0.00784314, 0.00784314, 0.00784314, 0.00784314, 0.00784314, 0.00784314, 0.00784314, 0.00784314, 0.00784314, 0.00784314, 0.00784314, 0.00784314, 0.00784314, 0.00784314, 0.00784314, 0.00784314, 0.00784314, 0.00784314, 0.00784314, 0.00784314, 0.00784314, 0.00784314, 0.00784314, 0.00784314, 0.00784314, 0.00784314, 0.00784314, 0.00784314, 0.00784314, 0.00784314, 0.00784314, 0.00784314, 0.00784314, 0.00784314, 0.00784314, 0.00784314, 0.00784314, 0.00784314, 0.00784314, 0.00784314, 0.00784314, 0.00784314, 0.00784314, 0.00784314, 0.00784314, 0.00784314, 0.00784314, 0.00784314, 0.00784314, 0.00784314, 0.00784314, 0.00784314, 0.00784314, 0.00784314, 0.00784314, 0.00784314, 0.00784314, 0.00784314, 0.00784314, 0.00784314, 0.00784314, 0.00784314, 0.00784314, 0.00784314, 0.00784314, 0.00784314, 0.00784314, 0.00784314, 0.00784314, 0.00784314, 0.00784314, 0.00784314, 0.00784314, 0.00784314, 0.00784314, 0.00784314, 0.00784314, 0.00784314, 0.00784314, 0.00784314], ([32.75979052345048, 0.0, 0.6663232119734547, 0.0, 3.1747100326774036, 0.0, 6.127120004614638, 0.04891628242357304, 0.0, 7.804916448891224], [28.667278024820533, 0.0, 0.9830856306805771, 0.0, 1.089842073546188, 0.0, 5.577264362503336, 0.0, 0.0, 6.7341069118833525], 4.092512498629944))
[Thread 1] Total splits: 0
Processed 1 zonotopes (Work Done: 0.0%); Generated 0 (1.194172442s/loop)
[Thread 1] Finished in 1.19s
 ────────────────────────────────────────────────────────────────────────────────
                                        Time                    Allocations      
                               ───────────────────────   ────────────────────────
       Tot / % measured:            1.22s / 100.0%            419MiB / 100.0%    

 Section               ncalls     time    %tot     avg     alloc    %tot      avg
 ────────────────────────────────────────────────────────────────────────────────
 Verify                     1    1.19s   98.0%   1.19s    392MiB   93.6%   392MiB
   Zonotope Loop            1    1.19s   98.0%   1.19s    392MiB   93.6%   392MiB
     Zonotope Propa...      1    1.17s   96.4%   1.17s    370MiB   88.4%   370MiB
       DiffZonotope...      4    806ms   66.2%   202ms    320MiB   76.4%  80.0MiB
         Zonotope_R...      8    803ms   65.9%   100ms    320MiB   76.3%  40.0MiB
           Column M...      8    280ms   23.0%  35.1ms   69.9MiB   16.7%  8.74MiB
           Allocation       8    257ms   21.1%  32.1ms   69.9MiB   16.7%  8.74MiB
           Influenc...      8    253ms   20.8%  31.7ms    180MiB   42.9%  22.5MiB
             Multiply       8    214ms   17.5%  26.7ms    101MiB   24.2%  12.7MiB
             Alloca...      8   27.9ms    2.3%  3.48ms   78.2MiB   18.7%  9.77MiB
             Set Ma...      8   11.8ms    1.0%  1.48ms     0.00B    0.0%    0.00B
           Set Matrix       8   11.6ms    0.9%  1.45ms   70.4KiB    0.0%  8.80KiB
           Vectors          8    301μs    0.0%  37.6μs    272KiB    0.1%  34.0KiB
           Bounds           8   5.70μs    0.0%   712ns     0.00B    0.0%    0.00B
       DiffZonotope...      5    368ms   30.2%  73.6ms   50.1MiB   12.0%  10.0MiB
         Zonotope_D...     10    368ms   30.2%  36.8ms   50.1MiB   12.0%  5.01MiB
     Property Check         1   7.33ms    0.6%  7.33ms    684KiB    0.2%   684KiB
 Initialize                 1   23.8ms    2.0%  23.8ms   27.0MiB    6.4%  27.0MiB
 ────────────────────────────────────────────────────────────────────────────────
[VERYDIFF_TIMER] 1.303889732

[VERYDIFF_EXPERIMENT] NETWORK: /home/i57/steuber/NeuroDiff/repos/VeryDiffExperiments/src/../benchmarks/mnist-prune/specs/mnist_25_global_4.vnnlib
[VERYDIFF_EXPERIMENT] TIME: 2.494201287
