
[VERYDIFF_EXPERIMENT] Running on /home/i57/steuber/NeuroDiff/repos/VeryDiffExperiments/src/../benchmarks/mnist-prune/specs/mnist_31_global_3.vnnlib /home/i57/steuber/NeuroDiff/repos/VeryDiffExperiments/src/../benchmarks/mnist-prune/nets/mnist_relu_3_100.onnx
Found input X
op: matmul, weight: (100, 784), bias: nothing
op: bias, weight: nothing, bias: (100,)
op: relu, weight: nothing, bias: nothing
op: matmul, weight: (100, 100), bias: nothing
op: bias, weight: nothing, bias: (100,)
op: relu, weight: nothing, bias: nothing
op: matmul, weight: (10, 100), bias: nothing
op: bias, weight: nothing, bias: (10,)
op: relu, weight: nothing, bias: nothing
op: matmul, weight: (10, 10), bias: nothing
op: bias, weight: nothing, bias: (10,)
Found input X
op: gemm, weight: (100, 784), bias: (100,)
op: relu, weight: nothing, bias: nothing
op: gemm, weight: (100, 100), bias: (100,)
op: relu, weight: nothing, bias: nothing
op: gemm, weight: (10, 100), bias: (10,)
op: relu, weight: nothing, bias: nothing
op: gemm, weight: (10, 10), bias: (10,)
Distance: 1623.4465197373434
Distance: 201.62056963066925
Distance: 13.962962507051998
Distance: 0.183768135302671
Running with 1 threads
[Thread 1] Time to first task: 0.0s
Instable Generators: 20
Instable Generators: 26
Instable Generators: 6
Zono Bounds:
[-0.002573015860807224, -1.3374160658325196, -0.0008454552523587163, -1.7025642007140187, -2.0759242473366304, -1.886931417256061, -0.0009285375923630478, -1.8687337205781627, -1.6351474932169774, -1.739757527335616]
[0.00015939999725809594, 1.347448746137101, 0.002939869418243553, 1.3791588005028663, 2.069558773809639, 1.7966192040541191, 9.674252728849729e-5, 1.4679801703332793, 1.6171573301217288, 1.5508647034714902]
[Thread 1] Processed 100 zonotopes (Work Done: 0.0%; Expected Zonos: Inf)
[Thread 1] Processed 200 zonotopes (Work Done: 0.0%; Expected Zonos: Inf)
[Thread 1] Processed 300 zonotopes (Work Done: 0.0%; Expected Zonos: Inf)
[Thread 1] Processed 400 zonotopes (Work Done: 0.0%; Expected Zonos: Inf)
[Thread 1] Processed 500 zonotopes (Work Done: 0.0%; Expected Zonos: Inf)


TIMEOUT REACHED
UNKNOWN
[Thread 1] Total splits: 584
Processed 584 zonotopes (Work Done: 0.0%); Generated 1168 (0.20559077997773972s/loop)
[Thread 1] Finished in 120.07s
 ────────────────────────────────────────────────────────────────────────────────
                                        Time                    Allocations      
                               ───────────────────────   ────────────────────────
       Tot / % measured:             120s / 100.0%           60.5GiB / 100.0%    

 Section               ncalls     time    %tot     avg     alloc    %tot      avg
 ────────────────────────────────────────────────────────────────────────────────
 Verify                     1     120s  100.0%    120s   60.5GiB  100.0%  60.5GiB
   Zonotope Loop            1     120s  100.0%    120s   60.5GiB  100.0%  60.5GiB
     Zonotope Propa...    584    68.1s   56.7%   117ms   40.4GiB   66.8%  70.9MiB
       DiffZonotope...  1.75k    57.9s   48.2%  33.0ms   38.1GiB   63.0%  22.3MiB
         Zonotope_R...  3.50k    51.2s   42.6%  14.6ms   37.2GiB   61.5%  10.9MiB
           Influenc...  3.50k    50.4s   42.0%  14.4ms   34.2GiB   56.5%  10.0MiB
             Multiply   3.50k    33.6s   28.0%  9.60ms   17.3GiB   28.6%  5.05MiB
             Alloca...  3.50k    14.3s   11.9%  4.09ms   16.9GiB   27.9%  4.94MiB
             Set Ma...  3.50k    2.44s    2.0%   696μs     0.00B    0.0%    0.00B
           Column M...  3.50k    466ms    0.4%   133μs   1.50GiB    2.5%   449KiB
           Set Matrix   3.50k    185ms    0.2%  52.8μs   2.50MiB    0.0%     749B
           Allocation   3.50k   77.5ms    0.1%  22.1μs   1.50GiB    2.5%   449KiB
           Vectors      3.50k   17.6ms    0.0%  5.02μs   11.1MiB    0.0%  3.26KiB
           Bounds       3.50k   2.46ms    0.0%   701ns     0.00B    0.0%    0.00B
       DiffZonotope...  2.34k    10.2s    8.5%  4.38ms   2.33GiB    3.8%  1.02MiB
         Zonotope_D...  4.67k    4.97s    4.1%  1.06ms   1.53GiB    2.5%   344KiB
     Compute Split        584    4.57s    3.8%  7.82ms   8.60GiB   14.2%  15.1MiB
     Property Check       584    114ms    0.1%   195μs    118MiB    0.2%   207KiB
 Initialize                 1    533μs    0.0%   533μs   5.41MiB    0.0%  5.41MiB
 ────────────────────────────────────────────────────────────────────────────────
[VERYDIFF_TIMER] 120.097895677

[VERYDIFF_EXPERIMENT] NETWORK: /home/i57/steuber/NeuroDiff/repos/VeryDiffExperiments/src/../benchmarks/mnist-prune/specs/mnist_31_global_3.vnnlib
[VERYDIFF_EXPERIMENT] TIME: 120.498641337
