
[VERYDIFF_EXPERIMENT] Running on /home/i57/steuber/NeuroDiff/repos/VeryDiffExperiments/src/../benchmarks/mnist-prune/specs/mnist_79_global_6.vnnlib /home/i57/steuber/NeuroDiff/repos/VeryDiffExperiments/src/../benchmarks/mnist-prune/nets/mnist_relu_3_100.onnx
Found input X
op: matmul, weight: (100, 784), bias: nothing
op: bias, weight: nothing, bias: (100,)
op: relu, weight: nothing, bias: nothing
op: matmul, weight: (100, 100), bias: nothing
op: bias, weight: nothing, bias: (100,)
op: relu, weight: nothing, bias: nothing
op: matmul, weight: (10, 100), bias: nothing
op: bias, weight: nothing, bias: (10,)
op: relu, weight: nothing, bias: nothing
op: matmul, weight: (10, 10), bias: nothing
op: bias, weight: nothing, bias: (10,)
Found input X
op: gemm, weight: (100, 784), bias: (100,)
op: relu, weight: nothing, bias: nothing
op: gemm, weight: (100, 100), bias: (100,)
op: relu, weight: nothing, bias: nothing
op: gemm, weight: (10, 100), bias: (10,)
op: relu, weight: nothing, bias: nothing
op: gemm, weight: (10, 10), bias: (10,)
Distance: 368.62397500800625
Distance: 47.56803950402309
Distance: 2.8977568827249343
Distance: 0.01885471428334995
Running with 1 threads
[Thread 1] Time to first task: 0.0s
Instable Generators: 31
Instable Generators: 38
Instable Generators: 5
Zono Bounds:
[0.0004290941556276002, -0.8947102742697862, -1.0013068958392464, -1.0465855312471795, -0.00046659613845108057, -1.2082533795322854, 0.00021903574157560888, -1.0196910088693494, -1.0457847322970382, -0.8956155582267775]
[0.0008962648896360155, 0.8945214742642752, 0.9050836895019087, 1.041774623995039, 0.001003117582433352, 1.208839351593434, 0.0007031479054040246, 1.0316641280560541, 0.9949694819792382, 0.9722113556266623]
[Thread 1] Processed 100 zonotopes (Work Done: 0.0%; Expected Zonos: Inf)
[Thread 1] Processed 200 zonotopes (Work Done: 13.08594%; Expected Zonos: 1528.358208955224)
[Thread 1] Processed 300 zonotopes (Work Done: 21.82617%; Expected Zonos: 1374.496644295302)
[Thread 1] Processed 400 zonotopes (Work Done: 55.71289%; Expected Zonos: 717.9666958808064)
[Thread 1] Processed 500 zonotopes (Work Done: 85.15625%; Expected Zonos: 587.1559633027523)
[Thread 1] Total splits: 279
Processed 559 zonotopes (Work Done: 100.0%); Generated 558 (0.20369189300894452s/loop)
[Thread 1] Finished in 113.86s
 ────────────────────────────────────────────────────────────────────────────────
                                        Time                    Allocations      
                               ───────────────────────   ────────────────────────
       Tot / % measured:             114s / 100.0%           54.6GiB / 100.0%    

 Section               ncalls     time    %tot     avg     alloc    %tot      avg
 ────────────────────────────────────────────────────────────────────────────────
 Verify                     1     114s  100.0%    114s   54.6GiB  100.0%  54.6GiB
   Zonotope Loop            1     114s  100.0%    114s   54.6GiB  100.0%  54.6GiB
     Zonotope Propa...    559    57.3s   50.3%   102ms   39.5GiB   72.4%  72.4MiB
       DiffZonotope...  1.68k    47.4s   41.6%  28.2ms   37.3GiB   68.2%  22.8MiB
         Zonotope_R...  3.35k    46.8s   41.1%  13.9ms   36.4GiB   66.7%  11.1MiB
           Influenc...  3.35k    38.8s   34.1%  11.6ms   33.5GiB   61.3%  10.2MiB
             Multiply   3.35k    24.1s   21.2%  7.18ms   17.0GiB   31.1%  5.19MiB
             Alloca...  3.35k    12.3s   10.8%  3.67ms   16.5GiB   30.2%  5.04MiB
             Set Ma...  3.35k    2.41s    2.1%   719μs     0.00B    0.0%    0.00B
           Allocation   3.35k    6.09s    5.3%  1.82ms   1.46GiB    2.7%   457KiB
           Column M...  3.35k    1.65s    1.5%   493μs   1.46GiB    2.7%   457KiB
           Set Matrix   3.35k    183ms    0.2%  54.5μs   2.92MiB    0.0%     913B
           Vectors      3.35k   17.3ms    0.0%  5.14μs   10.7MiB    0.0%  3.26KiB
           Bounds       3.35k   2.44ms    0.0%   728ns     0.00B    0.0%    0.00B
       DiffZonotope...  2.24k    9.88s    8.7%  4.42ms   2.25GiB    4.1%  1.03MiB
         Zonotope_D...  4.47k    4.78s    4.2%  1.07ms   1.48GiB    2.7%   347KiB
     Compute Split        279    12.4s   10.9%  44.6ms   4.17GiB    7.6%  15.3MiB
     Property Check       559    311ms    0.3%   556μs   32.1MiB    0.1%  58.8KiB
 Initialize                 1    539μs    0.0%   539μs   5.41MiB    0.0%  5.41MiB
 ────────────────────────────────────────────────────────────────────────────────
[VERYDIFF_TIMER] 113.892770952

[VERYDIFF_EXPERIMENT] NETWORK: /home/i57/steuber/NeuroDiff/repos/VeryDiffExperiments/src/../benchmarks/mnist-prune/specs/mnist_79_global_6.vnnlib
[VERYDIFF_EXPERIMENT] TIME: 114.255775602
