[VERYDIFF_EXPERIMENT] Sigma: 0.1
Parsing new_benchmarks/lhc/nets/2_20-0.1.onnx...
Found input X
WARNING: Operation Softmax is not supported
WE ARE IGNORING THIS OPERATION -- IF YOU DO NOT KNOW WHAT YOU ARE DOING THIS MAY BE UNSOUND!
op: gemm, weight: (20, 16), bias: (20,)
op: relu, weight: nothing, bias: nothing
op: gemm, weight: (20, 20), bias: (20,)
op: relu, weight: nothing, bias: nothing
op: gemm, weight: (5, 20), bias: (5,)
Parsing new_benchmarks/lhc/nets_pruned/2_20-0.1-0.2.onnx...
Found input X
WARNING: Operation Softmax is not supported
WE ARE IGNORING THIS OPERATION -- IF YOU DO NOT KNOW WHAT YOU ARE DOING THIS MAY BE UNSOUND!
op: gemm, weight: (20, 16), bias: (20,)
op: relu, weight: nothing, bias: nothing
op: gemm, weight: (20, 20), bias: (20,)
op: relu, weight: nothing, bias: nothing
op: gemm, weight: (5, 20), bias: (5,)
Distance: 48.550621923524886
Distance: 91.69159531750483
Distance: 26.152902803194593
Running with 1 threads
[Thread 1] Time to first task: 0.0s
Instable Generators: 9
Instable Generators: 7
Zono Bounds:
[-22.444348631727983, -24.806489471993316, -35.97968856253395, -48.331404986423834, -27.081973434527505]
[-2.0908817312178787, 0.3179400104945955, 11.08887853718284, 16.85657705679893, -3.7486480517615703]
[TOP-1] did not find required confidence yet.
[TOP-1] did not find required confidence yet.
[TOP-1] did not find required confidence yet.
[TOP-1] did not find required confidence yet.
[TOP-1] did not find required confidence yet.
[TOP-1] did not find required confidence yet.
[TOP-1] did not find required confidence yet.
[TOP-1] did not find required confidence yet.
[TOP-1] did not find required confidence yet.
[TOP-1] did not find required confidence yet.
[TOP-1] did not find required confidence yet.
[TOP-1] did not find required confidence yet.
[TOP-1] did not find required confidence yet.
[TOP-1] did not find required confidence yet.
[TOP-1] did not find required confidence yet.
[TOP-1] did not find required confidence yet.
[TOP-1] did not find required confidence yet.
[TOP-1] did not find required confidence yet.
[TOP-1] did not find required confidence yet.
[TOP-1] did not find required confidence yet.
[TOP-1] did not find required confidence yet.
[TOP-1] did not find required confidence yet.
[TOP-1] did not find required confidence yet.
[TOP-1] did not find required confidence yet.
[TOP-1] did not find required confidence yet.
[TOP-1] did not find required confidence yet.
[TOP-1] did not find required confidence yet.
[TOP-1] did not find required confidence yet.
[TOP-1] did not find required confidence yet.
[TOP-1] did not find required confidence yet.
[TOP-1] did not find required confidence yet.
[TOP-1] did not find required confidence yet.
[TOP-1] did not find required confidence yet.
[TOP-1] did not find required confidence yet.
[TOP-1] did not find required confidence yet.
[TOP-1] did not find required confidence yet.
[TOP-1] did not find required confidence yet.
[TOP-1] did not find required confidence yet.
[TOP-1] did not find required confidence yet.
[TOP-1] did not find required confidence yet.
[TOP-1] did not find required confidence yet.
[TOP-1] did not find required confidence yet.
[TOP-1] did not find required confidence yet.
[TOP-1] did not find required confidence yet.
[TOP-1] did not find required confidence yet.
[TOP-1] did not find required confidence yet.
[TOP-1] did not find required confidence yet.
[TOP-1] did not find required confidence yet.
[TOP-1] did not find required confidence yet.
[TOP-1] did not find required confidence yet.
[TOP-1] did not find required confidence yet.
[TOP-1] did not find required confidence yet.
[TOP-1] did not find required confidence yet.
[TOP-1] did not find required confidence yet.
[TOP-1] did not find required confidence yet.
[TOP-1] did not find required confidence yet.
[TOP-1] did not find required confidence yet.
[Thread 1] Total splits: 19
Processed 39 zonotopes (Work Done: 100.0%); Generated 38 (0.0051984948205128206s/loop)
[Thread 1] Finished in 0.2s
 ────────────────────────────────────────────────────────────────────────────────
                                        Time                    Allocations      
                               ───────────────────────   ────────────────────────
       Tot / % measured:            203ms / 100.0%           62.8MiB / 100.0%    

 Section               ncalls     time    %tot     avg     alloc    %tot      avg
 ────────────────────────────────────────────────────────────────────────────────
 Verify                     1    203ms  100.0%   203ms   62.7MiB  100.0%  62.7MiB
   Zonotope Loop            1    203ms  100.0%   203ms   62.7MiB  100.0%  62.7MiB
     Property Check        39    195ms   96.4%  5.01ms   56.2MiB   89.6%  1.44MiB
     Zonotope Propa...     39   6.39ms    3.2%   164μs   5.79MiB    9.2%   152KiB
       DiffZonotope...     78   5.04ms    2.5%  64.6μs   4.62MiB    7.4%  60.7KiB
         Zonotope_R...    156   1.63ms    0.8%  10.5μs   2.80MiB    4.5%  18.4KiB
           Influenc...    156    648μs    0.3%  4.15μs   1.23MiB    2.0%  8.05KiB
             Multiply     156    397μs    0.2%  2.54μs    717KiB    1.1%  4.60KiB
             Alloca...    156    112μs    0.1%   716ns    536KiB    0.8%  3.44KiB
             Set Ma...    156   54.9μs    0.0%   352ns     0.00B    0.0%    0.00B
           Column M...    156    290μs    0.1%  1.86μs    685KiB    1.1%  4.39KiB
           Vectors        156    220μs    0.1%  1.41μs    185KiB    0.3%  1.19KiB
           Set Matrix     156    196μs    0.1%  1.26μs   61.6KiB    0.1%     404B
           Allocation     156    121μs    0.1%   774ns    668KiB    1.0%  4.28KiB
           Bounds         156   33.6μs    0.0%   215ns     0.00B    0.0%    0.00B
       DiffZonotope...    117   1.10ms    0.5%  9.42μs   1.16MiB    1.8%  10.1KiB
         Zonotope_D...    234    412μs    0.2%  1.76μs    702KiB    1.1%  3.00KiB
     Compute Split         19    480μs    0.2%  25.3μs    358KiB    0.6%  18.9KiB
 Initialize                 1   36.5μs    0.0%  36.5μs   13.7KiB    0.0%  13.7KiB
 ────────────────────────────────────────────────────────────────────────────────[VERYDIFF_TIMER] 0.204502323
[VERYDIFF_EXPERIMENT] Sigma: 0.5
Parsing new_benchmarks/lhc/nets/2_20-0.1.onnx...
Found input X
WARNING: Operation Softmax is not supported
WE ARE IGNORING THIS OPERATION -- IF YOU DO NOT KNOW WHAT YOU ARE DOING THIS MAY BE UNSOUND!
op: gemm, weight: (20, 16), bias: (20,)
op: relu, weight: nothing, bias: nothing
op: gemm, weight: (20, 20), bias: (20,)
op: relu, weight: nothing, bias: nothing
op: gemm, weight: (5, 20), bias: (5,)
Parsing new_benchmarks/lhc/nets_pruned/2_20-0.1-0.2.onnx...
Found input X
WARNING: Operation Softmax is not supported
WE ARE IGNORING THIS OPERATION -- IF YOU DO NOT KNOW WHAT YOU ARE DOING THIS MAY BE UNSOUND!
op: gemm, weight: (20, 16), bias: (20,)
op: relu, weight: nothing, bias: nothing
op: gemm, weight: (20, 20), bias: (20,)
op: relu, weight: nothing, bias: nothing
op: gemm, weight: (5, 20), bias: (5,)
Distance: 48.550621923524886
Distance: 91.69159531750483
Distance: 26.152902803194593
Running with 1 threads
[Thread 1] Time to first task: 0.0s
Instable Generators: 16
Instable Generators: 16
Zono Bounds:
[-102.1188668537707, -183.8916782449629, -204.02830105102117, -284.41787879545154, -262.58704869523126]
[78.43727004289286, 137.47765214466378, 185.12036428662475, 251.6505929519166, 201.73087191486857]
[TOP-1] did not find required confidence yet.
[TOP-1] did not find required confidence yet.
[TOP-1] did not find required confidence yet.
[TOP-1] did not find required confidence yet.
[TOP-1] did not find required confidence yet.
[TOP-1] did not find required confidence yet.
[TOP-1] did not find required confidence yet.
[TOP-1] did not find required confidence yet.
[TOP-1] did not find required confidence yet.
[TOP-1] did not find required confidence yet.
[TOP-1] did not find required confidence yet.
[TOP-1] did not find required confidence yet.
[TOP-1] did not find required confidence yet.
[TOP-1] did not find required confidence yet.
[TOP-1] did not find required confidence yet.
[TOP-1] did not find required confidence yet.
[TOP-1] did not find required confidence yet.
[TOP-1] required confidence (0.9999970403283691≥0.99999) is feasible for index 2
Found cex
N1: 0.9999964958323591 (vs. 3.0417434443066345e-6)
N2: 0.9067722950355593
N1 Probability: 0.9999964958323591 >= 0.99999

Found counterexample: ([-0.5, -0.5, 0.0, -0.5, 0.0, -0.5, -0.5, 0.5, 0.5, 0.5, -0.5, 0.5, 0.5, -0.5, 0.5, -0.5], (4, 2))
[Thread 1] Total splits: 15
Processed 16 zonotopes (Work Done: 0.0%); Generated 30 (0.0155995193125s/loop)
[Thread 1] Finished in 0.25s
 ────────────────────────────────────────────────────────────────────────────────
                                        Time                    Allocations      
                               ───────────────────────   ────────────────────────
       Tot / % measured:            250ms / 100.0%           43.7MiB / 100.0%    

 Section               ncalls     time    %tot     avg     alloc    %tot      avg
 ────────────────────────────────────────────────────────────────────────────────
 Verify                     1    250ms  100.0%   250ms   43.7MiB  100.0%  43.7MiB
   Zonotope Loop            1    250ms  100.0%   250ms   43.7MiB  100.0%  43.7MiB
     Property Check        16    246ms   98.6%  15.4ms   39.7MiB   90.7%  2.48MiB
     Zonotope Propa...     16   2.82ms    1.1%   176μs   3.48MiB    8.0%   223KiB
       DiffZonotope...     32   2.22ms    0.9%  69.4μs   2.83MiB    6.5%  90.4KiB
         Zonotope_R...     64    923μs    0.4%  14.4μs   1.92MiB    4.4%  30.8KiB
           Influenc...     64    381μs    0.2%  5.95μs    960KiB    2.1%  15.0KiB
             Multiply      64    262μs    0.1%  4.09μs    606KiB    1.4%  9.48KiB
             Alloca...     64   52.7μs    0.0%   823ns    352KiB    0.8%  5.50KiB
             Set Ma...     64   27.3μs    0.0%   427ns     0.00B    0.0%    0.00B
           Column M...     64    176μs    0.1%  2.76μs    446KiB    1.0%  6.96KiB
           Set Matrix      64    127μs    0.1%  1.98μs   44.0KiB    0.1%     703B
           Vectors         64   98.4μs    0.0%  1.54μs   76.0KiB    0.2%  1.19KiB
           Allocation      64   52.6μs    0.0%   822ns    438KiB    1.0%  6.84KiB
           Bounds          64   15.7μs    0.0%   245ns     0.00B    0.0%    0.00B
       DiffZonotope...     48    485μs    0.2%  10.1μs    668KiB    1.5%  13.9KiB
         Zonotope_D...     96    181μs    0.1%  1.89μs    364KiB    0.8%  3.79KiB
     Compute Split         15    389μs    0.2%  25.9μs    384KiB    0.9%  25.6KiB
 Initialize                 1   30.1μs    0.0%  30.1μs   13.7KiB    0.0%  13.7KiB
 ────────────────────────────────────────────────────────────────────────────────[VERYDIFF_TIMER] 0.251211053
[VERYDIFF_EXPERIMENT] Sigma: 1.0
Parsing new_benchmarks/lhc/nets/2_20-0.1.onnx...
Found input X
WARNING: Operation Softmax is not supported
WE ARE IGNORING THIS OPERATION -- IF YOU DO NOT KNOW WHAT YOU ARE DOING THIS MAY BE UNSOUND!
op: gemm, weight: (20, 16), bias: (20,)
op: relu, weight: nothing, bias: nothing
op: gemm, weight: (20, 20), bias: (20,)
op: relu, weight: nothing, bias: nothing
op: gemm, weight: (5, 20), bias: (5,)
Parsing new_benchmarks/lhc/nets_pruned/2_20-0.1-0.2.onnx...
Found input X
WARNING: Operation Softmax is not supported
WE ARE IGNORING THIS OPERATION -- IF YOU DO NOT KNOW WHAT YOU ARE DOING THIS MAY BE UNSOUND!
op: gemm, weight: (20, 16), bias: (20,)
op: relu, weight: nothing, bias: nothing
op: gemm, weight: (20, 20), bias: (20,)
op: relu, weight: nothing, bias: nothing
op: gemm, weight: (5, 20), bias: (5,)
Distance: 48.550621923524886
Distance: 91.69159531750483
Distance: 26.152902803194593
Running with 1 threads
[Thread 1] Time to first task: 0.0s
Instable Generators: 16
Instable Generators: 16
Zono Bounds:
[-190.10156923537303, -369.6357096194149, -388.9269613468026, -549.87002209226, -537.2772192829241]
[159.73672183619001, 282.99180516701335, 375.5048173885257, 488.0899820665512, 417.03132597162204]
[TOP-1] did not find required confidence yet.
[TOP-1] did not find required confidence yet.
[TOP-1] required confidence (1.0≥0.99999) is feasible for index 3
Found cex
N1: 0.9999999997480014 (vs. 2.5141488491968046e-10)
N2: 0.5654226014840892
N1 Probability: 0.9999999997480014 >= 0.99999

Found counterexample: ([1.0, 1.0, 1.0, 1.0, -1.0, -1.0, 1.0, 1.0, 1.0, -1.0, 1.0, 1.0, 1.0, -1.0, 0.0, -1.0], (3, 5))
[Thread 1] Total splits: 4
Processed 5 zonotopes (Work Done: 0.0%); Generated 8 (0.0124234016s/loop)
[Thread 1] Finished in 0.06s
 ────────────────────────────────────────────────────────────────────────────────
                                        Time                    Allocations      
                               ───────────────────────   ────────────────────────
       Tot / % measured:           62.2ms / 100.0%           12.0MiB / 100.0%    

 Section               ncalls     time    %tot     avg     alloc    %tot      avg
 ────────────────────────────────────────────────────────────────────────────────
 Verify                     1   62.1ms  100.0%  62.1ms   12.0MiB   99.9%  12.0MiB
   Zonotope Loop            1   62.1ms   99.9%  62.1ms   11.9MiB   99.9%  11.9MiB
     Property Check         5   61.0ms   98.1%  12.2ms   10.7MiB   89.3%  2.14MiB
     Zonotope Propa...      5    908μs    1.5%   182μs   1.10MiB    9.2%   224KiB
       DiffZonotope...     10    723μs    1.2%  72.3μs    909KiB    7.4%  90.9KiB
         Zonotope_R...     20    306μs    0.5%  15.3μs    621KiB    5.1%  31.0KiB
           Influenc...     20    134μs    0.2%  6.72μs    302KiB    2.5%  15.1KiB
             Multiply      20   87.9μs    0.1%  4.40μs    190KiB    1.5%  9.48KiB
             Alloca...     20   25.3μs    0.0%  1.26μs    110KiB    0.9%  5.50KiB
             Set Ma...     20   9.00μs    0.0%   450ns     0.00B    0.0%    0.00B
           Column M...     20   52.9μs    0.1%  2.65μs    139KiB    1.1%  6.97KiB
           Set Matrix      20   40.0μs    0.1%  2.00μs   13.8KiB    0.1%     704B
           Vectors         20   28.7μs    0.0%  1.43μs   23.8KiB    0.2%  1.19KiB
           Allocation      20   24.6μs    0.0%  1.23μs    137KiB    1.1%  6.84KiB
           Bounds          20   5.39μs    0.0%   269ns     0.00B    0.0%    0.00B
       DiffZonotope...     15    150μs    0.2%  10.0μs    209KiB    1.7%  14.0KiB
         Zonotope_D...     30   58.3μs    0.1%  1.94μs    114KiB    0.9%  3.79KiB
     Compute Split          4    108μs    0.2%  26.9μs    102KiB    0.8%  25.5KiB
 Initialize                 1   30.3μs    0.0%  30.3μs   13.7KiB    0.1%  13.7KiB
 ────────────────────────────────────────────────────────────────────────────────[VERYDIFF_TIMER] 0.063539844
[VERYDIFF_EXPERIMENT] Sigma: 2.0
Parsing new_benchmarks/lhc/nets/2_20-0.1.onnx...
Found input X
WARNING: Operation Softmax is not supported
WE ARE IGNORING THIS OPERATION -- IF YOU DO NOT KNOW WHAT YOU ARE DOING THIS MAY BE UNSOUND!
op: gemm, weight: (20, 16), bias: (20,)
op: relu, weight: nothing, bias: nothing
op: gemm, weight: (20, 20), bias: (20,)
op: relu, weight: nothing, bias: nothing
op: gemm, weight: (5, 20), bias: (5,)
Parsing new_benchmarks/lhc/nets_pruned/2_20-0.1-0.2.onnx...
Found input X
WARNING: Operation Softmax is not supported
WE ARE IGNORING THIS OPERATION -- IF YOU DO NOT KNOW WHAT YOU ARE DOING THIS MAY BE UNSOUND!
op: gemm, weight: (20, 16), bias: (20,)
op: relu, weight: nothing, bias: nothing
op: gemm, weight: (20, 20), bias: (20,)
op: relu, weight: nothing, bias: nothing
op: gemm, weight: (5, 20), bias: (5,)
Distance: 48.550621923524886
Distance: 91.69159531750483
Distance: 26.152902803194593
Running with 1 threads
[Thread 1] Time to first task: 0.0s
Instable Generators: 16
Instable Generators: 16
Zono Bounds:
[-364.8059159559842, -739.4652437733412, -756.9148388395349, -1079.9729651102, -1080.6625308786913]
[319.82615225890135, 573.0853982829885, 752.5859140489945, 955.6251861857442, 846.3197852847711]
[TOP-1] did not find required confidence yet.
[TOP-1] did not find required confidence yet.
[TOP-1] required confidence (0.9999999999989811≥0.99999) is feasible for index 2
Found cex
N1: 0.9999997624916281 (vs. 2.3750837180458877e-7)
N2: 0.9999999774140254
N1 Probability: 0.9999997624916281 >= 0.99999

Found counterexample: ([-2.0, -2.0, -2.0, -2.0, -2.0, 2.0, -2.0, -2.0, -2.0, 2.0, -2.0, 2.0, -2.0, 2.0, 2.0, -2.0], (1, 4))
[Thread 1] Total splits: 0
Processed 1 zonotopes (Work Done: 0.0%); Generated 0 (0.008940925s/loop)
[Thread 1] Finished in 0.01s
 ────────────────────────────────────────────────────────────────────────────────
                                        Time                    Allocations      
                               ───────────────────────   ────────────────────────
       Tot / % measured:           8.99ms / 100.0%           1.80MiB /  99.9%    

 Section               ncalls     time    %tot     avg     alloc    %tot      avg
 ────────────────────────────────────────────────────────────────────────────────
 Verify                     1   8.96ms   99.7%  8.96ms   1.79MiB   99.3%  1.79MiB
   Zonotope Loop            1   8.94ms   99.5%  8.94ms   1.78MiB   99.1%  1.78MiB
     Property Check         1   8.72ms   97.0%  8.72ms   1.53MiB   85.0%  1.53MiB
     Zonotope Propa...      1    171μs    1.9%   171μs    232KiB   12.6%   232KiB
       DiffZonotope...      2    133μs    1.5%  66.5μs    188KiB   10.2%  94.0KiB
         Zonotope_R...      4   56.1μs    0.6%  14.0μs    129KiB    7.0%  32.4KiB
           Influenc...      4   23.8μs    0.3%  5.95μs   62.1KiB    3.4%  15.5KiB
             Multiply       4   16.3μs    0.2%  4.08μs   37.9KiB    2.1%  9.48KiB
             Alloca...      4   3.15μs    0.0%   786ns   22.0KiB    1.2%  5.50KiB
             Set Ma...      4   1.33μs    0.0%   334ns     0.00B    0.0%    0.00B
           Column M...      4   9.44μs    0.1%  2.36μs   27.9KiB    1.5%  6.97KiB
           Set Matrix       4   7.55μs    0.1%  1.89μs   2.75KiB    0.1%     704B
           Vectors          4   5.81μs    0.1%  1.45μs   4.75KiB    0.3%  1.19KiB
           Allocation       4   3.79μs    0.0%   948ns   27.4KiB    1.5%  6.84KiB
           Bounds           4    909ns    0.0%   227ns     0.00B    0.0%    0.00B
       DiffZonotope...      3   32.0μs    0.4%  10.7μs   42.5KiB    2.3%  14.2KiB
         Zonotope_D...      6   11.7μs    0.1%  1.95μs   22.7KiB    1.2%  3.79KiB
 Initialize                 1   29.6μs    0.3%  29.6μs   13.7KiB    0.7%  13.7KiB
 ────────────────────────────────────────────────────────────────────────────────[VERYDIFF_TIMER] 0.010342952
[VERYDIFF_EXPERIMENT] Sigma: 3.0
Parsing new_benchmarks/lhc/nets/2_20-0.1.onnx...
Found input X
WARNING: Operation Softmax is not supported
WE ARE IGNORING THIS OPERATION -- IF YOU DO NOT KNOW WHAT YOU ARE DOING THIS MAY BE UNSOUND!
op: gemm, weight: (20, 16), bias: (20,)
op: relu, weight: nothing, bias: nothing
op: gemm, weight: (20, 20), bias: (20,)
op: relu, weight: nothing, bias: nothing
op: gemm, weight: (5, 20), bias: (5,)
Parsing new_benchmarks/lhc/nets_pruned/2_20-0.1-0.2.onnx...
Found input X
WARNING: Operation Softmax is not supported
WE ARE IGNORING THIS OPERATION -- IF YOU DO NOT KNOW WHAT YOU ARE DOING THIS MAY BE UNSOUND!
op: gemm, weight: (20, 16), bias: (20,)
op: relu, weight: nothing, bias: nothing
op: gemm, weight: (20, 20), bias: (20,)
op: relu, weight: nothing, bias: nothing
op: gemm, weight: (5, 20), bias: (5,)
Distance: 48.550621923524886
Distance: 91.69159531750483
Distance: 26.152902803194593
Running with 1 threads
[Thread 1] Time to first task: 0.0s
Instable Generators: 16
Instable Generators: 16
Zono Bounds:
[-539.3785650086684, -1108.6218448759316, -1124.576433577668, -1610.9602103101026, -1623.4966117954232]
[480.78087234281554, 862.6416437776585, 1128.7402234347883, 1423.4070080078639, 1275.8565144818845]
[TOP-1] did not find required confidence yet.
[TOP-1] did not find required confidence yet.
[TOP-1] required confidence (0.999999985592329≥0.99999) is feasible for index 2
Found cex
N1: 0.999999999999924 (vs. 7.617020762932327e-14)
N2: 0.9999999934705868
N1 Probability: 0.999999999999924 >= 0.99999

Found counterexample: ([-3.0, -3.0, -3.0, -3.0, -3.0, 3.0, -3.0, -3.0, -3.0, 3.0, -3.0, 3.0, -3.0, 3.0, 3.0, -3.0], (1, 4))
[Thread 1] Total splits: 0
Processed 1 zonotopes (Work Done: 0.0%); Generated 0 (0.008905647s/loop)
[Thread 1] Finished in 0.01s
 ────────────────────────────────────────────────────────────────────────────────
                                        Time                    Allocations      
                               ───────────────────────   ────────────────────────
       Tot / % measured:           8.96ms / 100.0%           1.80MiB /  99.9%    

 Section               ncalls     time    %tot     avg     alloc    %tot      avg
 ────────────────────────────────────────────────────────────────────────────────
 Verify                     1   8.92ms   99.7%  8.92ms   1.79MiB   99.3%  1.79MiB
   Zonotope Loop            1   8.91ms   99.5%  8.91ms   1.78MiB   99.1%  1.78MiB
     Property Check         1   8.61ms   96.2%  8.61ms   1.53MiB   85.0%  1.53MiB
     Zonotope Propa...      1    242μs    2.7%   242μs    232KiB   12.6%   232KiB
       DiffZonotope...      2    155μs    1.7%  77.3μs    188KiB   10.2%  94.0KiB
         Zonotope_R...      4   71.7μs    0.8%  17.9μs    129KiB    7.0%  32.4KiB
           Influenc...      4   24.7μs    0.3%  6.18μs   62.1KiB    3.4%  15.5KiB
             Multiply       4   16.6μs    0.2%  4.14μs   37.9KiB    2.1%  9.48KiB
             Alloca...      4   3.36μs    0.0%   839ns   22.0KiB    1.2%  5.50KiB
             Set Ma...      4   1.61μs    0.0%   402ns     0.00B    0.0%    0.00B
           Allocation       4   16.0μs    0.2%  4.00μs   27.4KiB    1.5%  6.84KiB
           Column M...      4   10.2μs    0.1%  2.54μs   27.9KiB    1.5%  6.97KiB
           Set Matrix       4   8.51μs    0.1%  2.13μs   2.75KiB    0.1%     704B
           Vectors          4   6.22μs    0.1%  1.55μs   4.75KiB    0.3%  1.19KiB
           Bounds           4   1.04μs    0.0%   260ns     0.00B    0.0%    0.00B
       DiffZonotope...      3   34.3μs    0.4%  11.4μs   42.5KiB    2.3%  14.2KiB
         Zonotope_D...      6   11.9μs    0.1%  1.98μs   22.7KiB    1.2%  3.79KiB
 Initialize                 1   30.1μs    0.3%  30.1μs   13.7KiB    0.7%  13.7KiB
 ────────────────────────────────────────────────────────────────────────────────[VERYDIFF_TIMER] 0.010339006
