
[VERYDIFF_EXPERIMENT] Running on /home/i57/steuber/NeuroDiff/repos/VeryDiffExperiments/src/../benchmarks/mnist-prune/specs/mnist_4_local_15.vnnlib /home/i57/steuber/NeuroDiff/repos/VeryDiffExperiments/src/../benchmarks/mnist-prune/nets/mnist_relu_3_100.onnx
Parsing /home/i57/steuber/NeuroDiff/repos/VeryDiffExperiments/src/../benchmarks/mnist-prune/nets/mnist_relu_3_100.onnx...
Found input X
op: matmul, weight: (100, 784), bias: nothing
op: bias, weight: nothing, bias: (100,)
op: relu, weight: nothing, bias: nothing
op: matmul, weight: (100, 100), bias: nothing
op: bias, weight: nothing, bias: (100,)
op: relu, weight: nothing, bias: nothing
op: matmul, weight: (10, 100), bias: nothing
op: bias, weight: nothing, bias: (10,)
op: relu, weight: nothing, bias: nothing
op: matmul, weight: (10, 10), bias: nothing
op: bias, weight: nothing, bias: (10,)
Parsing /home/i57/steuber/NeuroDiff/repos/VeryDiffExperiments/src/../benchmarks/mnist-prune/nets_pruned/mnist_relu_3_100_0.49-old.onnx...
Found input X
op: gemm, weight: (100, 784), bias: (100,)
op: relu, weight: nothing, bias: nothing
op: gemm, weight: (100, 100), bias: (100,)
op: relu, weight: nothing, bias: nothing
op: gemm, weight: (10, 100), bias: (10,)
op: relu, weight: nothing, bias: nothing
op: gemm, weight: (10, 10), bias: (10,)
Distance: 1623.4465197373434
Distance: 201.62056963066925
Distance: 13.962962507051998
Distance: 0.183768135302671
Running with 1 threads
[Thread 1] Time to first task: 0.0s
Instable Generators: 22
Instable Generators: 32
Instable Generators: 6
Zono Bounds:
[-2.6617693817078014, -0.0037488034525963105, -3.034437165359362, -0.007504433955878921, -2.322266130942151, -2.313216764731205, -3.2898411707192814, -2.8626893233884734, -0.009796882730264992, -3.2619429305395333]
[1.9407556643289159, 0.006436488766268446, 3.022039575888598, 0.011192528660776553, 3.011056869232616, 2.2458427798466545, 2.8699389981502765, 3.015904083437723, -0.004399770770534134, 3.2281158649030615]
[Thread 1] Total splits: 0
Processed 1 zonotopes (Work Done: 100.0%); Generated 0 (0.022876341s/loop)
[Thread 1] Finished in 0.02s
 ────────────────────────────────────────────────────────────────────────────────
                                        Time                    Allocations      
                               ───────────────────────   ────────────────────────
       Tot / % measured:           23.2ms / 100.0%           14.1MiB / 100.0%    

 Section               ncalls     time    %tot     avg     alloc    %tot      avg
 ────────────────────────────────────────────────────────────────────────────────
 Verify                     1   22.9ms   98.5%  22.9ms   13.2MiB   94.3%  13.2MiB
   Zonotope Loop            1   22.9ms   98.4%  22.9ms   13.2MiB   94.3%  13.2MiB
     Property Check         1   21.3ms   91.7%  21.3ms   11.4MiB   80.8%  11.4MiB
     Zonotope Propa...      1   1.44ms    6.2%  1.44ms   1.10MiB    7.8%  1.10MiB
       DiffZonotope...      4    994μs    4.3%   249μs    236KiB    1.6%  59.0KiB
         Zonotope_D...      8    442μs    1.9%  55.3μs    121KiB    0.8%  15.1KiB
       DiffZonotope...      3    439μs    1.9%   146μs    884KiB    6.1%   295KiB
         Zonotope_R...      6    208μs    0.9%  34.7μs    555KiB    3.9%  92.5KiB
           Column M...      6   73.1μs    0.3%  12.2μs    196KiB    1.4%  32.6KiB
           Influenc...      6   69.5μs    0.3%  11.6μs    135KiB    0.9%  22.5KiB
             Multiply       6   47.3μs    0.2%  7.88μs   85.4KiB    0.6%  14.2KiB
             Alloca...      6   11.9μs    0.1%  1.98μs   47.2KiB    0.3%  7.88KiB
             Set Ma...      6   5.33μs    0.0%   889ns     0.00B    0.0%    0.00B
           Set Matrix       6   22.9μs    0.1%  3.81μs   4.97KiB    0.0%     848B
           Vectors          6   18.7μs    0.1%  3.12μs   19.5KiB    0.1%  3.26KiB
           Allocation       6   13.4μs    0.1%  2.24μs    195KiB    1.4%  32.6KiB
           Bounds           6   1.86μs    0.0%   309ns     0.00B    0.0%    0.00B
 Initialize                 1    337μs    1.5%   337μs    821KiB    5.7%   821KiB
 ────────────────────────────────────────────────────────────────────────────────
[VERYDIFF_TIMER] 0.04848953

[VERYDIFF_EXPERIMENT] NETWORK: /home/i57/steuber/NeuroDiff/repos/VeryDiffExperiments/src/../benchmarks/mnist-prune/specs/mnist_4_local_15.vnnlib
[VERYDIFF_EXPERIMENT] TIME: 0.353146036
