
[VERYDIFF_EXPERIMENT] Running on /home/i57/steuber/NeuroDiff/repos/VeryDiffExperiments/src/../benchmarks/mnist-prune/specs/mnist_96_local_18.vnnlib /home/i57/steuber/NeuroDiff/repos/VeryDiffExperiments/src/../benchmarks/mnist-prune/nets/mnist_relu_2_512.onnx
Loading /home/i57/steuber/NeuroDiff/repos/VeryDiffExperiments/src/../benchmarks/mnist-prune/nets/mnist_relu_2_512.onnx and /home/i57/steuber/NeuroDiff/repos/VeryDiffExperiments/src/../benchmarks/mnist-prune/nets_pruned/mnist_relu_2_512_0.79-old.onnx
INPUT SHAPE: 784
Refined: 7 | Refine Limit: 6 | Wrong: 0 | Right: 1 | Total: 1 | Total Zonos Considered: 8 | Expected 32768 (0.0030517578125%)Refined: 14 | Refine Limit: 9 | Wrong: 0 | Right: 3 | Total: 3 | Total Zonos Considered: 17 | Expected 95325 (0.003147128245476003%)Refined: 20 | Refine Limit: 15 | Wrong: 0 | Right: 9 | Total: 9 | Total Zonos Considered: 29 | Expected 285937 (0.0031475464875129837%)Refined: 25 | Refine Limit: 16 | Wrong: 0 | Right: 19 | Total: 19 | Total Zonos Considered: 44 | Expected 603621 (0.003147670475347942%)Refined: 28 | Refine Limit: 11 | Wrong: 0 | Right: 30 | Total: 30 | Total Zonos Considered: 58 | Expected 948874 (0.003161642114759178%)Refined: 34 | Refine Limit: 14 | Wrong: 0 | Right: 35 | Total: 35 | Total Zonos Considered: 69 | Expected 1106759 (0.0031623867526715393%)Refined: 37 | Refine Limit: 11 | Wrong: 0 | Right: 45 | Total: 45 | Total Zonos Considered: 82 | Expected 1399807 (0.0032147288876252225%)Refined: 40 | Refine Limit: 11 | Wrong: 0 | Right: 54 | Total: 54 | Total Zonos Considered: 94 | Expected 1593007 (0.003389815612862969%)Refined: 46 | Refine Limit: 12 | Wrong: 0 | Right: 56 | Total: 56 | Total Zonos Considered: 102 | Expected 1605429 (0.003488164222771608%)Refined: 53 | Refine Limit: 19 | Wrong: 0 | Right: 58 | Total: 58 | Total Zonos Considered: 111 | Expected 1662765 (0.0034881657961287377%)Refined: 60 | Refine Limit: 29 | Wrong: 0 | Right: 63 | Total: 63 | Total Zonos Considered: 123 | Expected 1806107 (0.0034881654298444115%)Refined: 66 | Refine Limit: 29 | Wrong: 0 | Right: 72 | Total: 72 | Total Zonos Considered: 138 | Expected 2064123 (0.003488164222771608%)Refined: 68 | Refine Limit: 23 | Wrong: 0 | Right: 88 | Total: 88 | Total Zonos Considered: 156 | Expected 2522817 (0.003488164222771608%)Refined: 77 | Refine Limit: 30 | Wrong: 0 | Right: 93 | Total: 93 | Total Zonos Considered: 170 | Expected 2666158 (0.0034881653675438587%)Refined: 79 | Refine Limit: 24 | Wrong: 0 | Right: 109 | Total: 109 | Total Zonos Considered: 188 | Expected 3124852 (0.0034881651995038484%)Refined: 82 | Refine Limit: 17 | Wrong: 0 | Right: 124 | Total: 124 | Total Zonos Considered: 206 | Expected 3554869 (0.00348817354451036%)Refined: 88 | Refine Limit: 23 | Wrong: 0 | Right: 131 | Total: 131 | Total Zonos Considered: 219 | Expected 3755546 (0.003488174555710408%)Refined: 92 | Refine Limit: 22 | Wrong: 0 | Right: 140 | Total: 140 | Total Zonos Considered: 232 | Expected 4013551 (0.0034881829083522296%)Refined: 96 | Refine Limit: 22 | Wrong: 0 | Right: 148 | Total: 148 | Total Zonos Considered: 244 | Expected 4242897 (0.0034881827204384175%)Refined: 99 | Refine Limit: 18 | Wrong: 0 | Right: 161 | Total: 161 | Total Zonos Considered: 260 | Expected 4615530 (0.003488223454294523%)Refined: 106 | Refine Limit: 24 | Wrong: 0 | Right: 166 | Total: 166 | Total Zonos Considered: 272 | Expected 4758869 (0.00348822377754042%)Refined: 111 | Refine Limit: 26 | Wrong: 0 | Right: 175 | Total: 175 | Total Zonos Considered: 286 | Expected 5016880 (0.0034882237565977262%)Refined: 116 | Refine Limit: 23 | Wrong: 0 | Right: 190 | Total: 190 | Total Zonos Considered: 306 | Expected 5446898 (0.0034882239395707428%)Refined: 122 | Refine Limit: 24 | Wrong: 0 | Right: 199 | Total: 199 | Total Zonos Considered: 321 | Expected 5704908 (0.003488224525268418%)Refined: 128 | Refine Limit: 31 | Wrong: 0 | Right: 205 | Total: 205 | Total Zonos Considered: 333 | Expected 5876916 (0.0034882240957672356%)Refined: 131 | Refine Limit: 25 | Wrong: 0 | Right: 219 | Total: 219 | Total Zonos Considered: 350 | Expected 6278265 (0.003488224851929633%)Refined: 140 | Refine Limit: 32 | Wrong: 0 | Right: 223 | Total: 223 | Total Zonos Considered: 363 | Expected 6392937 (0.0034882245828482274%)Refined: 143 | Refine Limit: 27 | Wrong: 0 | Right: 242 | Total: 242 | Total Zonos Considered: 385 | Expected 6937626 (0.0034882249345813687%)Refined: 147 | Refine Limit: 26 | Wrong: 0 | Right: 251 | Total: 251 | Total Zonos Considered: 398 | Expected 7195636 (0.0034882253632618435%)UNKNOWN
TIMEOUT
Refined: 151 | Refine Limit: 29 | Wrong: 0 | Right: 252 | Total: 252 | Total Zonos Considered: 403 | Expected 7224304 (0.003488225301703804%)

time: 121.00503533

[VERYDIFF_TIMER] 121.034552402

[VERYDIFF_EXPERIMENT] NETWORK: /home/i57/steuber/NeuroDiff/repos/VeryDiffExperiments/src/../benchmarks/mnist-prune/specs/mnist_96_local_18.vnnlib
[VERYDIFF_EXPERIMENT] TIME: 121.323272937
