
[VERYDIFF_EXPERIMENT] Running on /home/i57/steuber/NeuroDiff/repos/VeryDiffExperiments/src/../benchmarks/mnist-prune/specs/mnist_80_local_18.vnnlib /home/i57/steuber/NeuroDiff/repos/VeryDiffExperiments/src/../benchmarks/mnist-prune/nets/mnist_relu_3_100.onnx
Loading /home/i57/steuber/NeuroDiff/repos/VeryDiffExperiments/src/../benchmarks/mnist-prune/nets/mnist_relu_3_100.onnx and /home/i57/steuber/NeuroDiff/repos/VeryDiffExperiments/src/../benchmarks/mnist-prune/nets_pruned/mnist_relu_3_100_0.77-old.onnx
INPUT SHAPE: 784
Refined: 90 | Refine Limit: 7 | Wrong: 0 | Right: 156 | Total: 156 | Total Zonos Considered: 246 | Expected 1363130 (0.011444249631363113%)Refined: 197 | Refine Limit: 17 | Wrong: 0 | Right: 329 | Total: 329 | Total Zonos Considered: 526 | Expected 116879 (0.2814876923998323%)Refined: 307 | Refine Limit: 21 | Wrong: 0 | Right: 518 | Total: 518 | Total Zonos Considered: 825 | Expected 184015 (0.2814987908594408%)Refined: 413 | Refine Limit: 16 | Wrong: 0 | Right: 717 | Total: 717 | Total Zonos Considered: 1130 | Expected 254702 (0.28150544557954%)Refined: 514 | Refine Limit: 22 | Wrong: 0 | Right: 887 | Total: 887 | Total Zonos Considered: 1401 | Expected 314464 (0.2820672636613412%)Refined: 630 | Refine Limit: 28 | Wrong: 0 | Right: 1085 | Total: 1085 | Total Zonos Considered: 1715 | Expected 384644 (0.2820790133214089%)Refined: 736 | Refine Limit: 22 | Wrong: 0 | Right: 1287 | Total: 1287 | Total Zonos Considered: 2023 | Expected 456094 (0.2821786736944577%)Refined: 847 | Refine Limit: 21 | Wrong: 0 | Right: 1497 | Total: 1497 | Total Zonos Considered: 2344 | Expected 530484 (0.2821951274685005%)Refined: 967 | Refine Limit: 31 | Wrong: 0 | Right: 1685 | Total: 1685 | Total Zonos Considered: 2652 | Expected 597105 (0.28219492384086553%)Refined: 1083 | Refine Limit: 23 | Wrong: 0 | Right: 1901 | Total: 1901 | Total Zonos Considered: 2984 | Expected 673647 (0.28219527437960834%)Refined: 1189 | Refine Limit: 24 | Wrong: 0 | Right: 2102 | Total: 2102 | Total Zonos Considered: 3291 | Expected 744845 (0.2822063650826682%)Refined: 1307 | Refine Limit: 18 | Wrong: 0 | Right: 2309 | Total: 2309 | Total Zonos Considered: 3616 | Expected 818189 (0.28220863394643536%)Refined: 1409 | Refine Limit: 11 | Wrong: 0 | Right: 2497 | Total: 2497 | Total Zonos Considered: 3906 | Expected 878471 (0.2842438737306069%)Refined: 1507 | Refine Limit: 25 | Wrong: 0 | Right: 2668 | Total: 2668 | Total Zonos Considered: 4175 | Expected 934330 (0.28555221388588614%)Refined: 1618 | Refine Limit: 23 | Wrong: 0 | Right: 2851 | Total: 2851 | Total Zonos Considered: 4469 | Expected 996978 (0.28596418376333277%)Refined: 1725 | Refine Limit: 29 | Wrong: 0 | Right: 3033 | Total: 3033 | Total Zonos Considered: 4758 | Expected 1060621 (0.2859645434137171%)Refined: 1831 | Refine Limit: 24 | Wrong: 0 | Right: 3238 | Total: 3238 | Total Zonos Considered: 5069 | Expected 1132305 (0.28596535385783867%)Refined: 1926 | Refine Limit: 19 | Wrong: 0 | Right: 3412 | Total: 3412 | Total Zonos Considered: 5338 | Expected 1114577 (0.3061251039632075%)Refined: 2012 | Refine Limit: 23 | Wrong: 0 | Right: 3562 | Total: 3562 | Total Zonos Considered: 5574 | Expected 185751 (1.9176209010987828%)Refined: 2096 | Refine Limit: 19 | Wrong: 0 | Right: 3724 | Total: 3724 | Total Zonos Considered: 5820 | Expected 166025 (2.2430356873964765%)Refined: 2220 | Refine Limit: 17 | Wrong: 0 | Right: 3932 | Total: 3932 | Total Zonos Considered: 6152 | Expected 175297 (2.2430503659503587%)Refined: 2373 | Refine Limit: 45 | Wrong: 0 | Right: 4169 | Total: 4169 | Total Zonos Considered: 6542 | Expected 185863 (2.24304998843234%)UNKNOWN
TIMEOUT
Refined: 2492 | Refine Limit: 42 | Wrong: 0 | Right: 4408 | Total: 4408 | Total Zonos Considered: 6900 | Expected 196519 (2.243040113169719%)

time: 120.16818307

[VERYDIFF_TIMER] 120.192366411

[VERYDIFF_EXPERIMENT] NETWORK: /home/i57/steuber/NeuroDiff/repos/VeryDiffExperiments/src/../benchmarks/mnist-prune/specs/mnist_80_local_18.vnnlib
[VERYDIFF_EXPERIMENT] TIME: 120.481777668
