
[VERYDIFF_EXPERIMENT] Running on /home/i57/steuber/NeuroDiff/repos/VeryDiffExperiments/src/../benchmarks/mnist-prune/specs/mnist_3_local_21.vnnlib /home/i57/steuber/NeuroDiff/repos/VeryDiffExperiments/src/../benchmarks/mnist-prune/nets/mnist_relu_2_512.onnx
Found input X
op: matmul, weight: (512, 784), bias: nothing
op: bias, weight: nothing, bias: (512,)
op: relu, weight: nothing, bias: nothing
op: matmul, weight: (512, 512), bias: nothing
op: bias, weight: nothing, bias: (512,)
op: relu, weight: nothing, bias: nothing
op: matmul, weight: (10, 512), bias: nothing
op: bias, weight: nothing, bias: (10,)
Found input X
op: matmul, weight: (512, 784), bias: nothing
op: bias, weight: nothing, bias: (512,)
op: relu, weight: nothing, bias: nothing
op: matmul, weight: (512, 512), bias: nothing
op: bias, weight: nothing, bias: (512,)
op: relu, weight: nothing, bias: nothing
op: matmul, weight: (10, 512), bias: nothing
op: bias, weight: nothing, bias: (10,)
Distance: 1085.5985166831802
Distance: 1719.8468985003963
Distance: 31.228482716001736
Running with 1 threads
[Thread 1] Time to first task: 0.0s
Instable Generators: 113
Instable Generators: 251
Zono Bounds:
[-5.803065659196049, -8.043392238101424, -8.59515109732327, -8.558367993845488, -11.057027920212315, -11.927352881447366, -10.966183325017084, -10.62808132310211, -10.989773781855703, -11.458858299067835]
[10.287307523628277, 11.709344435701178, 7.648261292895089, 10.010473275701075, 10.533262498816862, 6.157000593495908, 7.047114749041349, 7.175505604160412, 5.978267496392569, 7.314950723357037]

Found counterexample: ([0.0, 0.0, 0.0, 0.0, 0.0, 0.0, 0.0, 0.0, 0.0, 0.0, 0.0, 0.0, 0.0, 0.0, 0.0, 0.0, 0.0, 0.0, 0.0, 0.0, 0.0, 0.0, 0.0, 0.0, 0.0, 0.0, 0.0, 0.0, 0.0, 0.0, 0.0, 0.0, 0.0, 0.0, 0.0, 0.0, 0.0, 0.0, 0.0, 0.0, 0.0, 0.0, 0.0, 0.0, 0.0, 0.0, 0.0, 0.0, 0.0, 0.0, 0.0, 0.0, 0.0, 0.0, 0.0, 0.0, 0.0, 0.0, 0.0, 0.0, 0.0, 0.0, 0.0, 0.0, 0.0, 0.0, 0.0, 0.0, 0.0, 0.0, 0.0, 0.0, 0.0, 0.0, 0.0, 0.0, 0.0, 0.0, 0.0, 0.0, 0.0, 0.0, 0.0, 0.0, 0.0, 0.0, 0.0, 0.0, 0.0, 0.0, 0.0, 0.0, 0.0, 0.0, 0.0, 0.0, 0.0, 0.0, 0.0, 0.0, 0.0, 0.0, 0.0, 0.0, 0.0, 0.0, 0.0, 0.0, 0.0, 0.0, 0.0, 0.0, 0.0, 0.0, 0.0, 0.0, 0.0, 0.0, 0.0, 0.0, 0.0, 0.0, 0.0, 0.0, 0.04313726, 0.58823532, 0.99215686, 0.79215688, 0.12156863, 0.0, 0.0, 0.0, 0.0, 0.0, 0.0, 0.0, 0.0, 0.0, 0.0, 0.0, 0.0, 0.0, 0.0, 0.0, 0.0, 0.0, 0.0, 0.0, 0.0, 0.0, 0.0, 0.0, 0.0, 0.98431373, 0.98431373, 0.99215686, 0.41960785, 0.0, 0.0, 0.0, 0.0, 0.0, 0.0, 0.0, 0.0, 0.0, 0.0, 0.0, 0.0, 0.0, 0.0, 0.0, 0.0, 0.0, 0.0, 1.0, 0.0, 0.0, 0.0, 0.08235294, 0.77254903, 0.98431373, 0.98431373, 0.99215686, 0.41960785, 0.0, 0.0, 0.0, 0.0, 0.0, 0.0, 0.0, 0.0, 0.0, 0.0, 0.0, 0.0, 0.0, 0.0, 0.0, 0.0, 0.0, 0.0, 0.0, 0.0, 1.0, 0.43137255, 0.74509805, 0.98431373, 0.98431373, 0.98431373, 0.99215686, 0.66274512, 0.42745098, 0.24313726, 0.0, 0.0, 0.0, 0.0, 0.0, 0.0, 0.0, 0.0, 0.0, 0.0, 0.0, 0.0, 0.0, 0.0, 0.0, 1.0, 0.0, 0.0, 0.0, 0.99215686, 0.98431373, 0.98431373, 0.98431373, 0.98431373, 0.99215686, 0.98431373, 0.98431373, 0.86274511, 0.2, 0.0, 0.0, 0.0, 0.0, 0.0, 0.0, 0.0, 0.0, 0.0, 0.0, 0.0, 0.0, 0.0, 0.0, 0.0, 0.0, 0.0, 0.71372551, 1.0, 0.99215686, 0.99215686, 0.99215686, 0.99215686, 0.91764706, 0.87058824, 0.99215686, 0.99215686, 0.99215686, 0.0, 0.0, 0.0, 0.0, 0.0, 0.0, 0.0, 0.0, 0.0, 0.0, 0.0, 0.0, 0.0, 0.0, 0.0, 0.0, 0.24705882, 0.86666667, 0.99215686, 0.98431373, 0.98431373, 0.98431373, 0.57647061, 0.3019608, 0.24313726, 0.50196081, 0.98431373, 0.98431373, 0.41176471, 0.0, 0.0, 0.0, 0.0, 0.0, 0.0, 0.0, 0.0, 0.0, 0.0, 0.0, 0.0, 0.0, 0.0, 0.1254902, 0.90588236, 0.98431373, 0.99215686, 0.98431373, 0.86274511, 0.53725493, 0.03921569, 0.0, 0.0, 0.12156863, 0.90196079, 0.98431373, 1.0, 0.44313726, 0.01960784, 0.0, 0.0, 0.0, 0.0, 0.0, 0.0, 0.0, 0.0, 0.0, 0.0, 0.0, 0.0, 0.14509805, 0.0, 0.98431373, 0.99215686, 0.73725492, 0.07843138, 0.0, 0.0, 0.0, 0.0, 0.0, 0.42745098, 0.98431373, 0.99215686, 0.98431373, 0.13725491, 1.0, 0.0, 0.0, 0.0, 0.0, 0.0, 0.0, 0.0, 1.0, 0.0, 0.0, 0.0, 0.14509805, 0.98431373, 0.98431373, 0.78823531, 0.11764706, 0.0, 0.0, 0.0, 0.0, 0.0, 0.0, 0.12156863, 0.78431374, 0.99215686, 0.98431373, 0.13725491, 0.0, 0.0, 0.0, 0.0, 0.0, 0.0, 0.0, 0.0, 0.0, 0.0, 0.0, 0.0, 1.0, 0.99215686, 0.99215686, 0.0, 0.0, 0.0, 0.0, 0.0, 0.0, 0.0, 0.0, 0.1254902, 0.79215688, 1.0, 0.99215686, 0.64313728, 0.0, 0.0, 0.0, 0.0, 0.0, 0.0, 0.0, 0.0, 0.0, 0.0, 0.0, 0.0, 0.54901963, 0.98431373, 0.98431373, 0.0, 0.0, 0.0, 0.0, 0.0, 0.0, 0.0, 0.0, 0.42745098, 0.98431373, 0.99215686, 0.98431373, 0.13725491, 0.0, 0.0, 0.0, 0.0, 0.0, 0.0, 0.0, 0.0, 0.0, 0.0, 0.0, 0.0, 0.8509804, 0.98431373, 0.98431373, 0.0, 0.0, 0.0, 0.0, 0.0, 0.0, 0.08235294, 0.24705882, 0.90588236, 0.98431373, 0.99215686, 0.90196079, 0.11764706, 0.0, 0.0, 0.0, 0.0, 0.0, 0.0, 0.0, 0.0, 0.0, 0.0, 0.0, 0.0, 0.8509804, 0.98431373, 0.98431373, 0.0, 0.0, 0.0, 0.0, 0.0, 0.0, 0.56470591, 0.98431373, 0.98431373, 0.98431373, 0.86666667, 0.23921569, 0.0, 0.0, 0.0, 0.0, 0.0, 0.0, 0.0, 0.0, 0.0, 0.0, 0.0, 0.0, 0.0, 0.8509804, 0.98431373, 0.98431373, 0.0, 0.0, 0.0, 0.0, 0.0, 0.71372551, 0.86666667, 0.98431373, 0.98431373, 0.98431373, 0.70588237, 0.0, 0.0, 0.0, 0.0, 0.0, 0.0, 0.0, 0.0, 0.0, 0.0, 0.0, 0.0, 0.0, 0.0, 0.85490197, 0.99215686, 0.99215686, 0.28627452, 0.28627452, 0.89411765, 0.99215686, 1.0, 1.0, 0.99215686, 0.99215686, 0.99215686, 0.99215686, 0.0, 0.0, 0.0, 0.0, 0.0, 0.0, 0.0, 0.0, 0.0, 0.0, 0.0, 0.0, 0.0, 0.0, 0.0, 0.44313726, 0.98431373, 0.98431373, 0.99215686, 0.98431373, 0.98431373, 0.98431373, 0.98431373, 0.99215686, 0.98431373, 0.98431373, 0.98431373, 0.57647061, 0.0, 0.0, 0.0, 0.0, 0.0, 0.0, 0.0, 0.0, 0.0, 0.0, 0.0, 0.0, 0.0, 0.0, 0.0, 0.12156863, 0.90196079, 0.98431373, 0.99215686, 0.98431373, 0.98431373, 0.98431373, 0.98431373, 0.99215686, 0.90196079, 0.74117649, 0.13725491, 0.03921569, 0.0, 1.0, 1.0, 0.0, 0.0, 0.0, 0.0, 0.0, 0.0, 0.0, 0.0, 0.0, 0.0, 0.0, 0.0, 0.0, 0.24313726, 0.55686277, 0.99215686, 0.98431373, 0.98431373, 0.98431373, 0.98431373, 0.99215686, 0.41960785, 0.0, 0.0, 0.0, 0.0, 0.0, 0.0, 0.0, 0.0, 0.0, 0.0, 0.0, 0.0, 0.0, 0.0, 0.0, 0.0, 0.0, 0.0, 0.0, 0.0, 0.0, 0.28235295, 0.68235296, 0.98431373, 0.67843139, 0.27843139, 0.28235295, 0.11764706, 0.0, 0.0, 0.0, 0.0, 0.0, 0.0, 0.0, 0.0, 0.0, 0.0, 0.0, 0.0, 0.0, 0.0, 0.0, 0.0, 0.0, 0.0, 0.0, 0.0, 0.0, 0.0, 0.0, 0.0, 0.0, 0.0, 0.0, 0.0, 0.0, 0.0, 0.0, 0.0, 0.0, 0.0, 0.0, 0.0, 0.0, 0.0, 0.0, 0.0, 0.0, 0.0, 0.0, 0.0, 0.0, 0.0, 0.0, 0.0, 0.0, 0.0, 0.0, 0.0, 0.0, 0.0, 0.0, 0.0, 0.0, 0.0, 0.0, 0.0, 0.0, 0.0, 0.0, 0.0, 0.0, 0.0, 0.0, 0.0, 0.0, 0.0, 0.0, 1.0, 0.0, 0.0, 0.0, 0.0, 0.0, 0.0, 0.0, 0.0, 0.0, 0.0, 0.0, 0.0, 0.0, 0.0, 0.0, 0.0, 0.0, 0.0, 0.0, 0.0, 0.0, 0.0, 0.0, 0.0, 0.0, 0.0, 0.0, 0.0, 0.0, 0.0, 0.0, 0.0, 0.0, 0.0, 0.0, 0.0, 0.0, 0.0, 0.0, 0.0, 0.0, 0.0, 0.0, 0.0, 0.0, 0.0, 0.0, 0.0, 0.0, 0.0, 0.0], ([9.285559740068877, -67.70538681039365, -28.857944111796026, -39.760899670257245, -47.32304664671661, -53.461111620654215, -32.123591964685, -44.28521003175547, -56.654152613261765, -32.72538827206171], [9.692450867071793, -66.96176498960338, -27.376594771089373, -38.752968991069366, -44.86112925946712, -48.84626554704322, -27.47957069628357, -40.85878335384921, -51.32995361072758, -28.75118685746421], 5.324199002534186))
[Thread 1] Total splits: 0
Processed 1 zonotopes (Work Done: 0.0%); Generated 0 (0.037180461s/loop)
[Thread 1] Finished in 0.04s
 ────────────────────────────────────────────────────────────────────────────────
                                        Time                    Allocations      
                               ───────────────────────   ────────────────────────
       Tot / % measured:           39.1ms / 100.0%           25.4MiB / 100.0%    

 Section               ncalls     time    %tot     avg     alloc    %tot      avg
 ────────────────────────────────────────────────────────────────────────────────
 Verify                     1   37.2ms   95.1%  37.2ms   20.1MiB   79.3%  20.1MiB
   Zonotope Loop            1   37.2ms   95.1%  37.2ms   20.1MiB   79.3%  20.1MiB
     Zonotope Propa...      1   34.4ms   88.0%  34.4ms   18.6MiB   73.4%  18.6MiB
       DiffZonotope...      3   30.0ms   76.6%  10.0ms   2.94MiB   11.6%  0.98MiB
         Zonotope_D...      6   19.3ms   49.4%  3.22ms   1.33MiB    5.2%   227KiB
       DiffZonotope...      2   4.44ms   11.4%  2.22ms   15.7MiB   61.8%  7.85MiB
         Zonotope_R...      4   2.22ms    5.7%   556μs   9.41MiB   37.1%  2.35MiB
           Column M...      4   1.17ms    3.0%   293μs   4.18MiB   16.4%  1.04MiB
           Influenc...      4    444μs    1.1%   111μs    957KiB    3.7%   239KiB
             Multiply       4    403μs    1.0%   101μs    779KiB    3.0%   195KiB
             Alloca...      4   27.1μs    0.1%  6.79μs    176KiB    0.7%  43.9KiB
             Set Ma...      4   7.97μs    0.0%  1.99μs     0.00B    0.0%    0.00B
           Set Matrix       4    338μs    0.9%  84.6μs   21.3KiB    0.1%  5.32KiB
           Allocation       4    189μs    0.5%  47.1μs   4.18MiB   16.4%  1.04MiB
           Vectors          4   70.3μs    0.2%  17.6μs    100KiB    0.4%  25.0KiB
           Bounds           4   1.60μs    0.0%   401ns     0.00B    0.0%    0.00B
     Property Check         1   2.29ms    5.9%  2.29ms    187KiB    0.7%   187KiB
 Initialize                 1   1.90ms    4.9%  1.90ms   5.26MiB   20.7%  5.26MiB
 ────────────────────────────────────────────────────────────────────────────────
[VERYDIFF_TIMER] 0.067783541

[VERYDIFF_EXPERIMENT] Running on /home/i57/steuber/NeuroDiff/repos/VeryDiffExperiments/src/../benchmarks/mnist-prune/specs/mnist_3_local_21.vnnlib /home/i57/steuber/NeuroDiff/repos/VeryDiffExperiments/src/../benchmarks/mnist-prune/nets/mnist_relu_3_100.onnx
Found input X
op: matmul, weight: (100, 784), bias: nothing
op: bias, weight: nothing, bias: (100,)
op: relu, weight: nothing, bias: nothing
op: matmul, weight: (100, 100), bias: nothing
op: bias, weight: nothing, bias: (100,)
op: relu, weight: nothing, bias: nothing
op: matmul, weight: (10, 100), bias: nothing
op: bias, weight: nothing, bias: (10,)
op: relu, weight: nothing, bias: nothing
op: matmul, weight: (10, 10), bias: nothing
op: bias, weight: nothing, bias: (10,)
Found input X
op: matmul, weight: (100, 784), bias: nothing
op: bias, weight: nothing, bias: (100,)
op: relu, weight: nothing, bias: nothing
op: matmul, weight: (100, 100), bias: nothing
op: bias, weight: nothing, bias: (100,)
op: relu, weight: nothing, bias: nothing
op: matmul, weight: (10, 100), bias: nothing
op: bias, weight: nothing, bias: (10,)
op: relu, weight: nothing, bias: nothing
op: matmul, weight: (10, 10), bias: nothing
op: bias, weight: nothing, bias: (10,)
Distance: 296.6600370998244
Distance: 77.24290861755458
Distance: 5.7170369567975285
Distance: 0.0
Running with 1 threads
[Thread 1] Time to first task: 0.0s
Instable Generators: 28
Instable Generators: 39
Instable Generators: 8
Zono Bounds:
[-0.2741456376590725, -0.2666651167713663, -0.2012807024976303, -0.22675280626258815, -0.2233840222350078, -0.2012346719716916, -0.2297071807836535, -0.30304354092934205, 0.0, -0.22350174761715028]
[0.31189603543716204, 0.18399169182996195, 0.2012807024976303, 0.22675280626258815, 0.2233840222350078, 0.2012346719716916, 0.2297071807836535, 0.2956137824844497, 0.0, 0.21895502489523475]
[Thread 1] Total splits: 0
Processed 1 zonotopes (Work Done: 100.0%); Generated 0 (0.001763561s/loop)
[Thread 1] Finished in 0.0s
 ────────────────────────────────────────────────────────────────────────────────
                                        Time                    Allocations      
                               ───────────────────────   ────────────────────────
       Tot / % measured:           2.10ms /  99.8%           3.06MiB / 100.0%    

 Section               ncalls     time    %tot     avg     alloc    %tot      avg
 ────────────────────────────────────────────────────────────────────────────────
 Verify                     1   1.78ms   85.1%  1.78ms   2.22MiB   72.6%  2.22MiB
   Zonotope Loop            1   1.76ms   84.1%  1.76ms   2.22MiB   72.5%  2.22MiB
     Zonotope Propa...      1   1.63ms   77.9%  1.63ms   1.34MiB   43.7%  1.34MiB
       DiffZonotope...      4   1.09ms   52.2%   274μs    289KiB    9.2%  72.2KiB
         Zonotope_D...      8    488μs   23.2%  60.9μs    149KiB    4.8%  18.6KiB
       DiffZonotope...      3    529μs   25.2%   176μs   1.05MiB   34.5%   360KiB
         Zonotope_R...      6    270μs   12.9%  45.1μs    716KiB   22.8%   119KiB
           Influenc...      6    109μs    5.2%  18.1μs    216KiB    6.9%  36.0KiB
             Multiply       6   75.8μs    3.6%  12.6μs    135KiB    4.3%  22.5KiB
             Alloca...      6   20.4μs    1.0%  3.40μs   79.1KiB    2.5%  13.2KiB
             Set Ma...      6   7.23μs    0.3%  1.20μs     0.00B    0.0%    0.00B
           Column M...      6   81.5μs    3.9%  13.6μs    235KiB    7.5%  39.2KiB
           Set Matrix       6   28.0μs    1.3%  4.67μs   5.44KiB    0.2%     928B
           Allocation       6   23.1μs    1.1%  3.86μs    235KiB    7.5%  39.1KiB
           Vectors          6   18.8μs    0.9%  3.14μs   19.5KiB    0.6%  3.26KiB
           Bounds           6   1.83μs    0.1%   305ns     0.00B    0.0%    0.00B
     Property Check         1   4.77μs    0.2%  4.77μs   1.23KiB    0.0%  1.23KiB
 Initialize                 1    314μs   14.9%   314μs    858KiB   27.4%   858KiB
 ────────────────────────────────────────────────────────────────────────────────
[VERYDIFF_TIMER] 0.027262483

[VERYDIFF_EXPERIMENT] Running on /home/i57/steuber/NeuroDiff/repos/VeryDiffExperiments/src/../benchmarks/mnist-prune/specs/mnist_3_local_21.vnnlib /home/i57/steuber/NeuroDiff/repos/VeryDiffExperiments/src/../benchmarks/mnist-prune/nets/mnist_relu_4_1024.onnx
Found input X
op: matmul, weight: (1024, 784), bias: nothing
op: bias, weight: nothing, bias: (1024,)
op: relu, weight: nothing, bias: nothing
op: matmul, weight: (1024, 1024), bias: nothing
op: bias, weight: nothing, bias: (1024,)
op: relu, weight: nothing, bias: nothing
op: matmul, weight: (1024, 1024), bias: nothing
op: bias, weight: nothing, bias: (1024,)
op: relu, weight: nothing, bias: nothing
op: matmul, weight: (10, 1024), bias: nothing
op: bias, weight: nothing, bias: (10,)
op: relu, weight: nothing, bias: nothing
op: matmul, weight: (10, 10), bias: nothing
op: bias, weight: nothing, bias: (10,)
Found input X
op: matmul, weight: (1024, 784), bias: nothing
op: bias, weight: nothing, bias: (1024,)
op: relu, weight: nothing, bias: nothing
op: matmul, weight: (1024, 1024), bias: nothing
op: bias, weight: nothing, bias: (1024,)
op: relu, weight: nothing, bias: nothing
op: matmul, weight: (1024, 1024), bias: nothing
op: bias, weight: nothing, bias: (1024,)
op: relu, weight: nothing, bias: nothing
op: matmul, weight: (10, 1024), bias: nothing
op: bias, weight: nothing, bias: (10,)
op: relu, weight: nothing, bias: nothing
op: matmul, weight: (10, 10), bias: nothing
op: bias, weight: nothing, bias: (10,)
Distance: 1266.8815759184893
Distance: 2876.6944248261216
Distance: 2831.8843567411013
Distance: 34.033756025192815
Distance: 0.0
Running with 1 threads
[Thread 1] Time to first task: 0.0s
Instable Generators: 350
Instable Generators: 681
Instable Generators: 973
Instable Generators: 10
Zono Bounds:
[-83.82006079542847, -82.42670715301712, -92.20662698971043, -91.00173747795951, -87.55444075483355, -93.2650281034187, -82.7896497303132, -87.16127574404038, -88.92873038719546, -91.47513057415318]
[83.82006079542847, 82.3435900103719, 92.20662698971043, 91.00173747795951, 85.99043140716923, 90.67615496618797, 81.80549701275449, 87.16127574404038, 86.70886636367572, 91.20572601962994]

Found counterexample: ([0.0, 0.0, 0.0, 0.0, 0.0, 0.0, 0.0, 0.0, 0.0, 0.0, 0.0, 0.0, 0.0, 0.0, 0.0, 0.0, 0.0, 0.0, 0.0, 0.0, 0.0, 0.0, 0.0, 0.0, 0.0, 0.0, 0.0, 0.0, 0.0, 0.0, 0.0, 0.0, 0.0, 0.0, 0.0, 0.0, 0.0, 0.0, 0.0, 0.0, 0.0, 0.0, 0.0, 0.0, 0.0, 0.0, 0.0, 0.0, 0.0, 0.0, 0.0, 1.0, 0.0, 0.0, 0.0, 0.0, 0.0, 0.0, 0.0, 0.0, 0.0, 0.0, 0.0, 0.0, 0.0, 0.0, 0.0, 0.0, 0.0, 0.0, 0.0, 0.0, 0.0, 0.0, 0.0, 0.0, 0.0, 0.0, 0.0, 0.0, 0.0, 0.0, 0.0, 0.0, 0.0, 0.0, 0.0, 0.0, 0.0, 0.0, 0.0, 0.0, 0.0, 0.0, 0.0, 0.0, 0.0, 0.0, 0.0, 0.0, 0.0, 0.0, 0.0, 0.0, 0.0, 0.0, 0.0, 0.0, 0.0, 0.0, 0.0, 0.0, 0.0, 0.0, 0.0, 0.0, 0.0, 0.0, 0.0, 0.0, 0.0, 0.0, 0.0, 0.0, 0.04313726, 0.58823532, 0.99215686, 0.79215688, 0.12156863, 0.0, 0.0, 0.0, 0.0, 0.0, 0.0, 0.0, 0.0, 0.0, 0.0, 0.0, 0.0, 0.0, 0.0, 0.0, 0.0, 0.0, 0.0, 0.0, 0.0, 0.0, 0.0, 0.0, 1.0, 0.98431373, 0.98431373, 0.99215686, 0.41960785, 0.0, 0.0, 0.0, 0.0, 0.0, 0.0, 0.0, 0.0, 0.0, 0.0, 0.0, 0.0, 0.0, 0.0, 0.0, 0.0, 0.0, 0.0, 1.0, 0.0, 0.0, 1.0, 0.08235294, 0.77254903, 0.98431373, 0.98431373, 0.99215686, 0.41960785, 0.0, 0.0, 0.0, 0.0, 0.0, 0.0, 0.0, 0.0, 0.0, 0.0, 0.0, 0.0, 0.0, 0.0, 0.0, 0.0, 0.0, 0.0, 0.0, 0.0, 0.0, 0.43137255, 0.74509805, 0.98431373, 0.98431373, 0.98431373, 0.99215686, 0.66274512, 0.42745098, 0.24313726, 0.0, 0.0, 0.0, 0.0, 0.0, 0.0, 0.0, 0.0, 0.0, 0.0, 0.0, 0.0, 0.0, 0.0, 0.0, 1.0, 0.0, 0.0, 0.0, 0.99215686, 0.98431373, 0.98431373, 0.98431373, 0.98431373, 0.99215686, 0.98431373, 0.98431373, 0.86274511, 0.2, 0.0, 0.0, 0.0, 0.0, 0.0, 0.0, 0.0, 0.0, 0.0, 0.0, 0.0, 0.0, 0.0, 0.0, 0.0, 0.0, 0.0, 0.71372551, 1.0, 0.99215686, 0.99215686, 0.99215686, 0.99215686, 0.91764706, 0.87058824, 0.99215686, 0.99215686, 0.99215686, 0.0, 0.0, 0.0, 0.0, 0.0, 0.0, 0.0, 0.0, 0.0, 0.0, 0.0, 0.0, 0.0, 0.0, 0.0, 0.0, 0.24705882, 0.86666667, 0.99215686, 0.98431373, 0.98431373, 0.98431373, 0.57647061, 0.3019608, 0.24313726, 0.50196081, 0.98431373, 0.98431373, 0.41176471, 0.0, 0.0, 0.0, 0.0, 0.0, 0.0, 0.0, 0.0, 0.0, 0.0, 0.0, 0.0, 0.0, 0.0, 0.1254902, 0.90588236, 0.98431373, 0.99215686, 0.98431373, 0.86274511, 0.53725493, 0.03921569, 0.0, 0.0, 0.12156863, 0.90196079, 0.98431373, 1.0, 0.44313726, 0.01960784, 0.0, 0.0, 0.0, 0.0, 0.0, 0.0, 0.0, 0.0, 0.0, 0.0, 0.0, 0.0, 0.14509805, 1.0, 0.98431373, 0.99215686, 0.73725492, 0.07843138, 0.0, 0.0, 0.0, 0.0, 0.0, 0.42745098, 0.98431373, 0.99215686, 0.98431373, 0.13725491, 1.0, 0.0, 0.0, 0.0, 0.0, 0.0, 0.0, 0.0, 0.0, 0.0, 0.0, 0.0, 0.14509805, 0.98431373, 0.98431373, 0.78823531, 0.11764706, 0.0, 0.0, 0.0, 0.0, 0.0, 0.0, 0.12156863, 0.78431374, 0.99215686, 0.98431373, 0.13725491, 0.0, 0.0, 0.0, 0.0, 0.0, 0.0, 0.0, 0.0, 0.0, 0.0, 0.0, 0.0, 1.0, 0.99215686, 0.99215686, 0.0, 0.0, 0.0, 0.0, 0.0, 0.0, 0.0, 0.0, 0.1254902, 0.79215688, 1.0, 0.99215686, 0.64313728, 0.0, 0.0, 0.0, 0.0, 0.0, 0.0, 0.0, 0.0, 0.0, 0.0, 0.0, 0.0, 0.54901963, 0.98431373, 0.98431373, 0.0, 0.0, 0.0, 0.0, 0.0, 0.0, 0.0, 0.0, 0.42745098, 0.98431373, 0.99215686, 0.98431373, 0.13725491, 0.0, 0.0, 0.0, 0.0, 0.0, 0.0, 0.0, 0.0, 0.0, 0.0, 0.0, 0.0, 0.8509804, 0.98431373, 0.98431373, 0.0, 0.0, 0.0, 0.0, 0.0, 0.0, 0.08235294, 0.24705882, 0.90588236, 0.98431373, 0.99215686, 0.90196079, 0.11764706, 0.0, 0.0, 0.0, 0.0, 0.0, 0.0, 0.0, 0.0, 0.0, 0.0, 0.0, 0.0, 0.8509804, 0.98431373, 0.98431373, 0.0, 0.0, 0.0, 0.0, 0.0, 0.0, 0.56470591, 0.98431373, 0.98431373, 0.98431373, 0.86666667, 0.23921569, 0.0, 0.0, 0.0, 0.0, 0.0, 0.0, 0.0, 0.0, 0.0, 0.0, 0.0, 0.0, 0.0, 0.8509804, 0.98431373, 0.98431373, 0.0, 0.0, 0.0, 0.0, 0.0, 0.71372551, 0.86666667, 0.98431373, 0.98431373, 0.98431373, 0.70588237, 0.0, 0.0, 0.0, 0.0, 0.0, 0.0, 0.0, 0.0, 0.0, 0.0, 0.0, 0.0, 0.0, 0.0, 0.85490197, 0.99215686, 0.99215686, 0.28627452, 0.28627452, 0.89411765, 0.99215686, 1.0, 1.0, 0.99215686, 0.99215686, 0.99215686, 0.99215686, 0.0, 0.0, 0.0, 0.0, 0.0, 0.0, 0.0, 0.0, 0.0, 0.0, 0.0, 0.0, 0.0, 0.0, 0.0, 0.44313726, 0.98431373, 0.98431373, 0.99215686, 0.98431373, 0.98431373, 0.98431373, 0.98431373, 0.99215686, 0.98431373, 0.98431373, 0.98431373, 0.57647061, 0.0, 0.0, 0.0, 0.0, 0.0, 0.0, 0.0, 0.0, 0.0, 0.0, 0.0, 0.0, 0.0, 0.0, 0.0, 0.12156863, 0.90196079, 0.98431373, 0.99215686, 0.98431373, 0.98431373, 0.98431373, 0.98431373, 0.99215686, 0.90196079, 0.74117649, 0.13725491, 0.03921569, 0.0, 0.0, 1.0, 0.0, 0.0, 0.0, 0.0, 0.0, 0.0, 0.0, 0.0, 0.0, 0.0, 0.0, 0.0, 0.0, 0.24313726, 0.55686277, 0.99215686, 0.98431373, 0.98431373, 0.98431373, 0.98431373, 0.99215686, 0.41960785, 0.0, 0.0, 0.0, 0.0, 0.0, 0.0, 0.0, 0.0, 0.0, 0.0, 0.0, 0.0, 0.0, 0.0, 0.0, 0.0, 0.0, 0.0, 0.0, 0.0, 0.0, 0.28235295, 0.68235296, 0.98431373, 0.67843139, 0.27843139, 0.28235295, 0.11764706, 0.0, 0.0, 0.0, 0.0, 0.0, 0.0, 0.0, 0.0, 0.0, 0.0, 0.0, 0.0, 0.0, 0.0, 0.0, 0.0, 0.0, 0.0, 0.0, 0.0, 0.0, 0.0, 0.0, 0.0, 0.0, 0.0, 0.0, 0.0, 0.0, 0.0, 0.0, 0.0, 0.0, 0.0, 0.0, 0.0, 0.0, 0.0, 0.0, 0.0, 0.0, 0.0, 0.0, 0.0, 0.0, 0.0, 0.0, 0.0, 0.0, 0.0, 0.0, 0.0, 0.0, 0.0, 0.0, 0.0, 0.0, 0.0, 0.0, 0.0, 0.0, 0.0, 0.0, 0.0, 0.0, 0.0, 0.0, 0.0, 0.0, 0.0, 0.0, 1.0, 0.0, 0.0, 0.0, 0.0, 0.0, 0.0, 0.0, 0.0, 0.0, 0.0, 0.0, 0.0, 0.0, 0.0, 0.0, 0.0, 0.0, 0.0, 0.0, 0.0, 0.0, 0.0, 0.0, 0.0, 0.0, 0.0, 0.0, 0.0, 0.0, 0.0, 0.0, 0.0, 0.0, 0.0, 0.0, 0.0, 0.0, 0.0, 0.0, 0.0, 0.0, 0.0, 0.0, 0.0, 0.0, 0.0, 0.0, 0.0, 0.0, 0.0, 0.0], ([23.2923074485058, 0.0, 5.043997887956866, 4.705424966572808, 0.0, 0.0, 0.0, 0.5826786368005445, 0.0, 0.0], [19.556070789685787, 0.0, 2.558121500257155, 4.545635859159982, 0.0, 0.24889039318967876, 0.0, 0.0, 0.0, 0.0], 3.7362366588200118))
[Thread 1] Total splits: 0
Processed 1 zonotopes (Work Done: 0.0%); Generated 0 (1.201800597s/loop)
[Thread 1] Finished in 1.2s
 ────────────────────────────────────────────────────────────────────────────────
                                        Time                    Allocations      
                               ───────────────────────   ────────────────────────
       Tot / % measured:            1.22s / 100.0%            302MiB / 100.0%    

 Section               ncalls     time    %tot     avg     alloc    %tot      avg
 ────────────────────────────────────────────────────────────────────────────────
 Verify                     1    1.20s   98.5%   1.20s    280MiB   92.6%   280MiB
   Zonotope Loop            1    1.20s   98.5%   1.20s    280MiB   92.6%   280MiB
     Zonotope Propa...      1    1.19s   97.5%   1.19s    278MiB   92.0%   278MiB
       DiffZonotope...      4    691ms   56.6%   173ms    220MiB   72.7%  54.9MiB
         Zonotope_R...      8    376ms   30.8%  47.0ms    136MiB   45.2%  17.1MiB
           Column M...      8    336ms   27.5%  42.0ms   55.7MiB   18.4%  6.97MiB
           Allocation       8   19.0ms    1.6%  2.37ms   55.7MiB   18.4%  6.97MiB
           Influenc...      8   12.5ms    1.0%  1.56ms   24.7MiB    8.2%  3.08MiB
             Multiply       8   12.1ms    1.0%  1.52ms   22.9MiB    7.6%  2.86MiB
             Alloca...      8    236μs    0.0%  29.5μs   1.81MiB    0.6%   231KiB
             Set Ma...      8    119μs    0.0%  14.9μs     0.00B    0.0%    0.00B
           Set Matrix       8   8.41ms    0.7%  1.05ms    107KiB    0.0%  13.3KiB
           Vectors          8    243μs    0.0%  30.4μs    272KiB    0.1%  34.0KiB
           Bounds           8   5.75μs    0.0%   719ns     0.00B    0.0%    0.00B
       DiffZonotope...      5    499ms   40.9%   100ms   58.4MiB   19.3%  11.7MiB
         Zonotope_D...     10    142ms   11.7%  14.2ms   24.0MiB    7.9%  2.40MiB
     Property Check         1   10.7ms    0.9%  10.7ms    534KiB    0.2%   534KiB
 Initialize                 1   18.8ms    1.5%  18.8ms   22.4MiB    7.4%  22.4MiB
 ────────────────────────────────────────────────────────────────────────────────
[VERYDIFF_TIMER] 1.315390915

[VERYDIFF_EXPERIMENT] NETWORK: /home/i57/steuber/NeuroDiff/repos/VeryDiffExperiments/src/../benchmarks/mnist-prune/specs/mnist_3_local_21.vnnlib
[VERYDIFF_EXPERIMENT] TIME: 2.320296922
