
[VERYDIFF_EXPERIMENT] Running on /home/i57/steuber/NeuroDiff/repos/VeryDiffExperiments/src/../benchmarks/mnist-prune/specs/mnist_35_global_4.vnnlib /home/i57/steuber/NeuroDiff/repos/VeryDiffExperiments/src/../benchmarks/mnist-prune/nets/mnist_relu_3_100.onnx
Found input X
op: matmul, weight: (100, 784), bias: nothing
op: bias, weight: nothing, bias: (100,)
op: relu, weight: nothing, bias: nothing
op: matmul, weight: (100, 100), bias: nothing
op: bias, weight: nothing, bias: (100,)
op: relu, weight: nothing, bias: nothing
op: matmul, weight: (10, 100), bias: nothing
op: bias, weight: nothing, bias: (10,)
op: relu, weight: nothing, bias: nothing
op: matmul, weight: (10, 10), bias: nothing
op: bias, weight: nothing, bias: (10,)
Found input X
op: gemm, weight: (100, 784), bias: (100,)
op: relu, weight: nothing, bias: nothing
op: gemm, weight: (100, 100), bias: (100,)
op: relu, weight: nothing, bias: nothing
op: gemm, weight: (10, 100), bias: (10,)
op: relu, weight: nothing, bias: nothing
op: gemm, weight: (10, 10), bias: (10,)
Distance: 1623.4465197373434
Distance: 201.62056963066925
Distance: 13.962962507051998
Distance: 0.183768135302671
Running with 1 threads
[Thread 1] Time to first task: 0.0s
Instable Generators: 22
Instable Generators: 28
Instable Generators: 3
Zono Bounds:
[-0.189191079684875, -1.7586655775457856, -2.363126113577854, -2.324950692542794, -0.0006454683348291704, -3.0190379925171995, -0.0004979136488219426, -2.6437732537864944, -2.188319090641129, -0.0022608501732483462]
[0.1929645305846218, 1.7022701998985514, 2.3852099557405957, 2.229640406765597, 0.002680050887065578, 2.3623760532793345, 0.0008540510913337747, 2.4892454109252213, 2.1505449516400654, 0.0025779745322099725]
[Thread 1] Processed 100 zonotopes (Work Done: 0.0%; Expected Zonos: Inf)
[Thread 1] Processed 200 zonotopes (Work Done: 0.0%; Expected Zonos: Inf)
[Thread 1] Processed 300 zonotopes (Work Done: 0.0%; Expected Zonos: Inf)
[Thread 1] Processed 400 zonotopes (Work Done: 0.0%; Expected Zonos: Inf)
[Thread 1] Processed 500 zonotopes (Work Done: 0.0%; Expected Zonos: Inf)


TIMEOUT REACHED
UNKNOWN
[Thread 1] Total splits: 583
Processed 583 zonotopes (Work Done: 0.0%); Generated 1166 (0.20590587172212693s/loop)
[Thread 1] Finished in 120.04s
 ────────────────────────────────────────────────────────────────────────────────
                                        Time                    Allocations      
                               ───────────────────────   ────────────────────────
       Tot / % measured:             120s / 100.0%           60.3GiB / 100.0%    

 Section               ncalls     time    %tot     avg     alloc    %tot      avg
 ────────────────────────────────────────────────────────────────────────────────
 Verify                     1     120s  100.0%    120s   60.3GiB  100.0%  60.3GiB
   Zonotope Loop            1     120s  100.0%    120s   60.3GiB  100.0%  60.3GiB
     Zonotope Propa...    583    66.7s   55.6%   114ms   40.3GiB   66.8%  70.8MiB
       DiffZonotope...  1.75k    50.5s   42.0%  28.9ms   38.0GiB   63.0%  22.2MiB
         Zonotope_R...  3.50k    49.8s   41.5%  14.2ms   37.1GiB   61.5%  10.9MiB
           Influenc...  3.50k    49.0s   40.8%  14.0ms   34.1GiB   56.5%  10.0MiB
             Multiply   3.50k    33.0s   27.5%  9.45ms   17.2GiB   28.6%  5.04MiB
             Alloca...  3.50k    13.5s   11.3%  3.87ms   16.9GiB   28.0%  4.94MiB
             Set Ma...  3.50k    2.43s    2.0%   694μs     0.00B    0.0%    0.00B
           Column M...  3.50k    473ms    0.4%   135μs   1.50GiB    2.5%   449KiB
           Set Matrix   3.50k    184ms    0.2%  52.6μs   2.43MiB    0.0%     729B
           Allocation   3.50k   76.9ms    0.1%  22.0μs   1.50GiB    2.5%   449KiB
           Vectors      3.50k   17.8ms    0.0%  5.09μs   11.1MiB    0.0%  3.26KiB
           Bounds       3.50k   2.48ms    0.0%   710ns     0.00B    0.0%    0.00B
       DiffZonotope...  2.33k    16.3s   13.6%  6.98ms   2.32GiB    3.9%  1.02MiB
         Zonotope_D...  4.66k    5.00s    4.2%  1.07ms   1.53GiB    2.5%   344KiB
     Compute Split        583    4.47s    3.7%  7.66ms   8.57GiB   14.2%  15.1MiB
     Property Check       583    642ms    0.5%  1.10ms   66.2MiB    0.1%   116KiB
 Initialize                 1    554μs    0.0%   554μs   5.41MiB    0.0%  5.41MiB
 ────────────────────────────────────────────────────────────────────────────────
[VERYDIFF_TIMER] 120.074774164

[VERYDIFF_EXPERIMENT] NETWORK: /home/i57/steuber/NeuroDiff/repos/VeryDiffExperiments/src/../benchmarks/mnist-prune/specs/mnist_35_global_4.vnnlib
[VERYDIFF_EXPERIMENT] TIME: 120.539385212
