
[VERYDIFF_EXPERIMENT] Running on /home/i57/steuber/NeuroDiff/repos/VeryDiffExperiments/src/../benchmarks/mnist-prune/specs/mnist_48_global_5.vnnlib /home/i57/steuber/NeuroDiff/repos/VeryDiffExperiments/src/../benchmarks/mnist-prune/nets/mnist_relu_2_512.onnx
Parsing /home/i57/steuber/NeuroDiff/repos/VeryDiffExperiments/src/../benchmarks/mnist-prune/nets/mnist_relu_2_512.onnx...
Found input X
op: matmul, weight: (512, 784), bias: nothing
op: bias, weight: nothing, bias: (512,)
op: relu, weight: nothing, bias: nothing
op: matmul, weight: (512, 512), bias: nothing
op: bias, weight: nothing, bias: (512,)
op: relu, weight: nothing, bias: nothing
op: matmul, weight: (10, 512), bias: nothing
op: bias, weight: nothing, bias: (10,)
Parsing /home/i57/steuber/NeuroDiff/repos/VeryDiffExperiments/src/../benchmarks/mnist-prune/nets_pruned/mnist_relu_2_512_0.79-old.onnx...
Found input X
op: gemm, weight: (512, 784), bias: (512,)
op: relu, weight: nothing, bias: nothing
op: gemm, weight: (512, 512), bias: (512,)
op: relu, weight: nothing, bias: nothing
op: gemm, weight: (10, 512), bias: (10,)
Distance: 973.3044369037136
Distance: 481.63499746812613
Distance: 8.744412635378467
Running with 1 threads
[Thread 1] Time to first task: 0.01s
Instable Generators: 117
Instable Generators: 205
Zono Bounds:
[-9.072007806918021, -7.823051376145902, -7.151038717637307, -7.758958675790965, -7.357415289951464, -7.392681361763755, -7.541726403163741, -8.216750130635521, -7.043816323472264, -7.140474935087611]
[13.217679340464874, 10.607995076611957, 9.812768055471219, 10.926542866766354, 8.72029101262275, 9.407985847766065, 10.049446408046839, 10.343834206690374, 9.244258927381374, 9.089961127074618]
[Thread 1] Total splits: 0
Processed 1 zonotopes (Work Done: 100.0%); Generated 0 (0.631431689s/loop)
[Thread 1] Finished in 0.63s
 ────────────────────────────────────────────────────────────────────────────────
                                        Time                    Allocations      
                               ───────────────────────   ────────────────────────
       Tot / % measured:            634ms / 100.0%            225MiB / 100.0%    

 Section               ncalls     time    %tot     avg     alloc    %tot      avg
 ────────────────────────────────────────────────────────────────────────────────
 Verify                     1    631ms   99.7%   631ms    215MiB   95.6%   215MiB
   Zonotope Loop            1    631ms   99.7%   631ms    215MiB   95.6%   215MiB
     Property Check         1    401ms   63.2%   401ms   78.7MiB   34.9%  78.7MiB
     Zonotope Propa...      1    221ms   34.8%   221ms    117MiB   51.9%   117MiB
       DiffZonotope...      2    115ms   18.1%  57.3ms   95.8MiB   42.5%  47.9MiB
         Zonotope_R...      4    106ms   16.8%  26.6ms   84.1MiB   37.3%  21.0MiB
           Influenc...      4   97.9ms   15.5%  24.5ms   52.5MiB   23.3%  13.1MiB
             Multiply       4   92.5ms   14.6%  23.1ms   28.4MiB   12.6%  7.10MiB
             Set Ma...      4   3.08ms    0.5%   770μs     0.00B    0.0%    0.00B
             Alloca...      4   2.30ms    0.4%   576μs   24.1MiB   10.7%  6.02MiB
           Column M...      4   5.65ms    0.9%  1.41ms   15.7MiB    7.0%  3.93MiB
           Set Matrix       4   1.96ms    0.3%   491μs   19.0KiB    0.0%  4.75KiB
           Allocation       4    723μs    0.1%   181μs   15.7MiB    7.0%  3.93MiB
           Vectors          4   74.7μs    0.0%  18.7μs    100KiB    0.0%  25.0KiB
           Bounds           4   2.74μs    0.0%   684ns     0.00B    0.0%    0.00B
       DiffZonotope...      3    106ms   16.7%  35.3ms   21.0MiB    9.3%  7.01MiB
         Zonotope_D...      6   49.5ms    7.8%  8.25ms   13.4MiB    5.9%  2.23MiB
 Initialize                 1   2.17ms    0.3%  2.17ms   9.84MiB    4.4%  9.84MiB
 ────────────────────────────────────────────────────────────────────────────────
[VERYDIFF_TIMER] 0.665351198

[VERYDIFF_EXPERIMENT] NETWORK: /home/i57/steuber/NeuroDiff/repos/VeryDiffExperiments/src/../benchmarks/mnist-prune/specs/mnist_48_global_5.vnnlib
[VERYDIFF_EXPERIMENT] TIME: 0.970063693
