
[VERYDIFF_EXPERIMENT] Running on /home/i57/steuber/NeuroDiff/repos/VeryDiffExperiments/src/../benchmarks/mnist-prune/specs/mnist_38_global_3.vnnlib /home/i57/steuber/NeuroDiff/repos/VeryDiffExperiments/src/../benchmarks/mnist-prune/nets/mnist_relu_3_100.onnx
Parsing /home/i57/steuber/NeuroDiff/repos/VeryDiffExperiments/src/../benchmarks/mnist-prune/nets/mnist_relu_3_100.onnx...
Found input X
op: matmul, weight: (100, 784), bias: nothing
op: bias, weight: nothing, bias: (100,)
op: relu, weight: nothing, bias: nothing
op: matmul, weight: (100, 100), bias: nothing
op: bias, weight: nothing, bias: (100,)
op: relu, weight: nothing, bias: nothing
op: matmul, weight: (10, 100), bias: nothing
op: bias, weight: nothing, bias: (10,)
op: relu, weight: nothing, bias: nothing
op: matmul, weight: (10, 10), bias: nothing
op: bias, weight: nothing, bias: (10,)
Parsing /home/i57/steuber/NeuroDiff/repos/VeryDiffExperiments/src/../benchmarks/mnist-prune/nets_pruned/mnist_relu_3_100_0.77-old.onnx...
Found input X
op: gemm, weight: (100, 784), bias: (100,)
op: relu, weight: nothing, bias: nothing
op: gemm, weight: (100, 100), bias: (100,)
op: relu, weight: nothing, bias: nothing
op: gemm, weight: (10, 100), bias: (10,)
op: relu, weight: nothing, bias: nothing
op: gemm, weight: (10, 10), bias: (10,)
Distance: 1958.4889029213523
Distance: 144.28197153992141
Distance: 22.063573056613677
Distance: 0.8412832540489035
Running with 1 threads
[Thread 1] Time to first task: 0.0s
Instable Generators: 27
Instable Generators: 33
Instable Generators: 3
Zono Bounds:
[-2.4496148050854543, -2.07437945115678, -2.7119112250122743, -2.5473256466348007, -0.021982760587663998, -3.381469472244007, -0.012078309382100218, -0.0059228309757402165, -2.6669482286045705, -0.010213867518665942]
[2.3071527389094038, 1.9167694435866427, 2.2893954651157564, 2.7336118102375364, -0.010478422784498904, 3.1890078625687397, -0.004497357311190876, 0.009360803548750685, 2.821954341699173, 0.0015403661825912351]
[Thread 1] Total splits: 0
Processed 1 zonotopes (Work Done: 100.0%); Generated 0 (0.127857851s/loop)
[Thread 1] Finished in 0.13s
 ────────────────────────────────────────────────────────────────────────────────
                                        Time                    Allocations      
                               ───────────────────────   ────────────────────────
       Tot / % measured:            128ms / 100.0%            149MiB / 100.0%    

 Section               ncalls     time    %tot     avg     alloc    %tot      avg
 ────────────────────────────────────────────────────────────────────────────────
 Verify                     1    128ms   99.6%   128ms    143MiB   96.4%   143MiB
   Zonotope Loop            1    128ms   99.5%   128ms    143MiB   96.4%   143MiB
     Property Check         1   74.5ms   58.0%  74.5ms   51.6MiB   34.7%  51.6MiB
     Zonotope Propa...      1   50.1ms   39.0%  50.1ms   71.7MiB   48.2%  71.7MiB
       DiffZonotope...      3   25.6ms   20.0%  8.55ms   67.6MiB   45.5%  22.5MiB
         Zonotope_R...      6   24.7ms   19.3%  4.12ms   66.0MiB   44.4%  11.0MiB
           Influenc...      6   23.5ms   18.3%  3.92ms   60.7MiB   40.8%  10.1MiB
             Multiply       6   18.1ms   14.1%  3.01ms   30.7MiB   20.7%  5.12MiB
             Set Ma...      6   4.14ms    3.2%   690μs     0.00B    0.0%    0.00B
             Alloca...      6   1.30ms    1.0%   217μs   29.9MiB   20.1%  4.99MiB
           Column M...      6    742μs    0.6%   124μs   2.66MiB    1.8%   453KiB
           Set Matrix       6    303μs    0.2%  50.4μs   4.73KiB    0.0%     808B
           Allocation       6    135μs    0.1%  22.5μs   2.66MiB    1.8%   453KiB
           Vectors          6   28.3μs    0.0%  4.71μs   19.5KiB    0.0%  3.26KiB
           Bounds           6   3.78μs    0.0%   630ns     0.00B    0.0%    0.00B
       DiffZonotope...      4   24.4ms   19.0%  6.10ms   4.11MiB    2.8%  1.03MiB
         Zonotope_D...      8   9.04ms    7.0%  1.13ms   2.70MiB    1.8%   346KiB
 Initialize                 1    549μs    0.4%   549μs   5.41MiB    3.6%  5.41MiB
 ────────────────────────────────────────────────────────────────────────────────
[VERYDIFF_TIMER] 0.154939119

[VERYDIFF_EXPERIMENT] NETWORK: /home/i57/steuber/NeuroDiff/repos/VeryDiffExperiments/src/../benchmarks/mnist-prune/specs/mnist_38_global_3.vnnlib
[VERYDIFF_EXPERIMENT] TIME: 0.457472705
