
[VERYDIFF_EXPERIMENT] Running on /home/i57/steuber/NeuroDiff/repos/VeryDiffExperiments/src/../benchmarks/mnist-prune/specs/mnist_22_global_6.vnnlib /home/i57/steuber/NeuroDiff/repos/VeryDiffExperiments/src/../benchmarks/mnist-prune/nets/mnist_relu_3_100.onnx
Found input X
op: matmul, weight: (100, 784), bias: nothing
op: bias, weight: nothing, bias: (100,)
op: relu, weight: nothing, bias: nothing
op: matmul, weight: (100, 100), bias: nothing
op: bias, weight: nothing, bias: (100,)
op: relu, weight: nothing, bias: nothing
op: matmul, weight: (10, 100), bias: nothing
op: bias, weight: nothing, bias: (10,)
op: relu, weight: nothing, bias: nothing
op: matmul, weight: (10, 10), bias: nothing
op: bias, weight: nothing, bias: (10,)
Found input X
op: gemm, weight: (100, 784), bias: (100,)
op: relu, weight: nothing, bias: nothing
op: gemm, weight: (100, 100), bias: (100,)
op: relu, weight: nothing, bias: nothing
op: gemm, weight: (10, 100), bias: (10,)
op: relu, weight: nothing, bias: nothing
op: gemm, weight: (10, 10), bias: (10,)
Distance: 368.62397500800625
Distance: 47.56803950402309
Distance: 2.8977568827249343
Distance: 0.01885471428334995
Running with 1 threads
[Thread 1] Time to first task: 0.0s
Instable Generators: 39
Instable Generators: 53
Instable Generators: 8
Zono Bounds:
[-1.433765872215888, -1.4297004022525848, -1.8508916441479921, -1.547648364171035, -1.6317705167836054, -1.4614137896258188, -1.483852305216499, -1.6593642622783893, -1.370983081884299, -0.001554882823522355]
[1.4288351330386713, 1.275564541598938, 1.6179514134465722, 1.392108452165168, 1.5732607711482596, 1.452851735242553, 1.7172364464903453, 1.4473319008650964, 1.3693272684863442, 0.0020387609310744638]
[Thread 1] Processed 100 zonotopes (Work Done: 0.0%; Expected Zonos: Inf)
[Thread 1] Processed 200 zonotopes (Work Done: 0.0%; Expected Zonos: Inf)
[Thread 1] Processed 300 zonotopes (Work Done: 0.0%; Expected Zonos: Inf)
[Thread 1] Processed 400 zonotopes (Work Done: 0.0%; Expected Zonos: Inf)
[Thread 1] Processed 500 zonotopes (Work Done: 0.0%; Expected Zonos: Inf)


TIMEOUT REACHED
UNKNOWN
[Thread 1] Total splits: 569
Processed 569 zonotopes (Work Done: 0.0%); Generated 1138 (0.21129836590685414s/loop)
[Thread 1] Finished in 120.23s
 ────────────────────────────────────────────────────────────────────────────────
                                        Time                    Allocations      
                               ───────────────────────   ────────────────────────
       Tot / % measured:             120s / 100.0%           61.2GiB / 100.0%    

 Section               ncalls     time    %tot     avg     alloc    %tot      avg
 ────────────────────────────────────────────────────────────────────────────────
 Verify                     1     120s  100.0%    120s   61.2GiB  100.0%  61.2GiB
   Zonotope Loop            1     120s  100.0%    120s   61.2GiB  100.0%  61.2GiB
     Zonotope Propa...    569    72.0s   59.8%   126ms   41.4GiB   67.6%  74.4MiB
       DiffZonotope...  1.71k    61.9s   51.5%  36.3ms   39.0GiB   63.8%  23.4MiB
         Zonotope_R...  3.41k    61.3s   51.0%  18.0ms   38.1GiB   62.3%  11.4MiB
           Influenc...  3.41k    53.5s   44.5%  15.7ms   35.0GiB   57.3%  10.5MiB
             Alloca...  3.41k    26.1s   21.7%  7.66ms   17.2GiB   28.1%  5.15MiB
             Multiply   3.41k    24.9s   20.7%  7.29ms   17.9GiB   29.2%  5.36MiB
             Set Ma...  3.41k    2.50s    2.1%   733μs     0.00B    0.0%    0.00B
           Allocation   3.41k    7.08s    5.9%  2.07ms   1.52GiB    2.5%   466KiB
           Column M...  3.41k    474ms    0.4%   139μs   1.52GiB    2.5%   466KiB
           Set Matrix   3.41k    193ms    0.2%  56.5μs   3.75MiB    0.0%  1.12KiB
           Vectors      3.41k   17.7ms    0.0%  5.19μs   10.9MiB    0.0%  3.26KiB
           Bounds       3.41k   2.49ms    0.0%   728ns     0.00B    0.0%    0.00B
       DiffZonotope...  2.28k    10.0s    8.4%  4.41ms   2.33GiB    3.8%  1.05MiB
         Zonotope_D...  4.55k    4.86s    4.0%  1.07ms   1.52GiB    2.5%   350KiB
     Compute Split        569    31.8s   26.4%  55.9ms   8.68GiB   14.2%  15.6MiB
     Property Check       569    629ms    0.5%  1.11ms   66.0MiB    0.1%   119KiB
 Initialize                 1    552μs    0.0%   552μs   5.41MiB    0.0%  5.41MiB
 ────────────────────────────────────────────────────────────────────────────────
[VERYDIFF_TIMER] 120.260329316

[VERYDIFF_EXPERIMENT] NETWORK: /home/i57/steuber/NeuroDiff/repos/VeryDiffExperiments/src/../benchmarks/mnist-prune/specs/mnist_22_global_6.vnnlib
[VERYDIFF_EXPERIMENT] TIME: 120.729070635
