
[VERYDIFF_EXPERIMENT] Running on /home/i57/steuber/NeuroDiff/repos/VeryDiffExperiments/src/../benchmarks/mnist-prune/specs/mnist_98_local_15.vnnlib /home/i57/steuber/NeuroDiff/repos/VeryDiffExperiments/src/../benchmarks/mnist-prune/nets/mnist_relu_3_100.onnx
Parsing /home/i57/steuber/NeuroDiff/repos/VeryDiffExperiments/src/../benchmarks/mnist-prune/nets/mnist_relu_3_100.onnx...
Found input X
op: matmul, weight: (100, 784), bias: nothing
op: bias, weight: nothing, bias: (100,)
op: relu, weight: nothing, bias: nothing
op: matmul, weight: (100, 100), bias: nothing
op: bias, weight: nothing, bias: (100,)
op: relu, weight: nothing, bias: nothing
op: matmul, weight: (10, 100), bias: nothing
op: bias, weight: nothing, bias: (10,)
op: relu, weight: nothing, bias: nothing
op: matmul, weight: (10, 10), bias: nothing
op: bias, weight: nothing, bias: (10,)
Parsing /home/i57/steuber/NeuroDiff/repos/VeryDiffExperiments/src/../benchmarks/mnist-prune/nets_pruned/mnist_relu_3_100_0.79_adam_1_stepsize-old.onnx...
Found input X
op: gemm, weight: (100, 784), bias: (100,)
op: relu, weight: nothing, bias: nothing
op: gemm, weight: (100, 100), bias: (100,)
op: relu, weight: nothing, bias: nothing
op: gemm, weight: (10, 100), bias: (10,)
op: relu, weight: nothing, bias: nothing
op: gemm, weight: (10, 10), bias: (10,)
Distance: 368.62397500800625
Distance: 47.56803950402309
Distance: 2.8977568827249343
Distance: 0.01885471428334995
Running with 1 threads
[Thread 1] Time to first task: 0.0s
Instable Generators: 39
Instable Generators: 44
Instable Generators: 6
Zono Bounds:
[-1.0678707447702098, -1.1059957397682423, -1.098137581448082, -0.001525743937888627, -1.1022239583340567, -1.2358750141846184, -1.0049711015922458, -0.0016368357950438317, -1.1519794844915607, -1.0416451989471651]
[1.0450389843714916, 0.9691404207239231, 0.9242287218477684, 0.0002519843176532837, 1.1002051963949457, 1.2646277053739392, 1.0413250486363295, 0.0016391120643113833, 1.0838446891031388, 1.039929307565311]
[Thread 1] Total splits: 1
Processed 3 zonotopes (Work Done: 100.0%); Generated 2 (0.028763776333333334s/loop)
[Thread 1] Finished in 0.09s
 ────────────────────────────────────────────────────────────────────────────────
                                        Time                    Allocations      
                               ───────────────────────   ────────────────────────
       Tot / % measured:           86.7ms / 100.0%           47.0MiB / 100.0%    

 Section               ncalls     time    %tot     avg     alloc    %tot      avg
 ────────────────────────────────────────────────────────────────────────────────
 Verify                     1   86.3ms   99.6%  86.3ms   46.2MiB   98.3%  46.2MiB
   Zonotope Loop            1   86.3ms   99.6%  86.3ms   46.2MiB   98.3%  46.2MiB
     Property Check         3   81.3ms   93.9%  27.1ms   39.5MiB   84.0%  13.2MiB
     Zonotope Propa...      3   4.55ms    5.2%  1.52ms   4.17MiB    8.9%  1.39MiB
       DiffZonotope...     12   3.08ms    3.6%   257μs    919KiB    1.9%  76.6KiB
         Zonotope_D...     24   1.29ms    1.5%  53.9μs    444KiB    0.9%  18.5KiB
       DiffZonotope...      9   1.44ms    1.7%   160μs   3.27MiB    7.0%   373KiB
         Zonotope_R...     18    643μs    0.7%  35.7μs   2.07MiB    4.4%   118KiB
           Influenc...     18    230μs    0.3%  12.8μs    533KiB    1.1%  29.6KiB
             Multiply      18    171μs    0.2%  9.50μs    351KiB    0.7%  19.5KiB
             Alloca...     18   31.1μs    0.0%  1.73μs    180KiB    0.4%  10.0KiB
             Set Ma...     18   16.1μs    0.0%   893ns     0.00B    0.0%    0.00B
           Column M...     18    193μs    0.2%  10.7μs    753KiB    1.6%  41.9KiB
           Set Matrix      18   79.2μs    0.1%  4.40μs   18.1KiB    0.0%  1.01KiB
           Allocation      18   65.8μs    0.1%  3.66μs    752KiB    1.6%  41.8KiB
           Vectors         18   50.8μs    0.1%  2.82μs   58.6KiB    0.1%  3.26KiB
           Bounds          18   5.37μs    0.0%   298ns     0.00B    0.0%    0.00B
     Compute Split          1    100μs    0.1%   100μs    158KiB    0.3%   158KiB
 Initialize                 1    342μs    0.4%   342μs    821KiB    1.7%   821KiB
 ────────────────────────────────────────────────────────────────────────────────
[VERYDIFF_TIMER] 0.116914255

[VERYDIFF_EXPERIMENT] NETWORK: /home/i57/steuber/NeuroDiff/repos/VeryDiffExperiments/src/../benchmarks/mnist-prune/specs/mnist_98_local_15.vnnlib
[VERYDIFF_EXPERIMENT] TIME: 0.418959028
