
[VERYDIFF_EXPERIMENT] Running on /home/i57/steuber/NeuroDiff/repos/VeryDiffExperiments/src/../benchmarks/mnist-prune/specs/mnist_38_local_21.vnnlib /home/i57/steuber/NeuroDiff/repos/VeryDiffExperiments/src/../benchmarks/mnist-prune/nets/mnist_relu_2_512.onnx
Parsing /home/i57/steuber/NeuroDiff/repos/VeryDiffExperiments/src/../benchmarks/mnist-prune/nets/mnist_relu_2_512.onnx...
Found input X
op: matmul, weight: (512, 784), bias: nothing
op: bias, weight: nothing, bias: (512,)
op: relu, weight: nothing, bias: nothing
op: matmul, weight: (512, 512), bias: nothing
op: bias, weight: nothing, bias: (512,)
op: relu, weight: nothing, bias: nothing
op: matmul, weight: (10, 512), bias: nothing
op: bias, weight: nothing, bias: (10,)
Parsing /home/i57/steuber/NeuroDiff/repos/VeryDiffExperiments/src/../benchmarks/mnist-prune/nets_pruned/mnist_relu_2_512_0.79-old.onnx...
Found input X
op: gemm, weight: (512, 784), bias: (512,)
op: relu, weight: nothing, bias: nothing
op: gemm, weight: (512, 512), bias: (512,)
op: relu, weight: nothing, bias: nothing
op: gemm, weight: (10, 512), bias: (10,)
Distance: 973.3044369037136
Distance: 481.63499746812613
Distance: 8.744412635378467
Running with 1 threads
[Thread 1] Time to first task: 0.0s
Instable Generators: 206
Instable Generators: 431
Zono Bounds:
[-23.7138108907471, -23.18069085697426, -20.410017267421942, -21.113355962666265, -23.38507107240841, -21.0920852694996, -22.04388609211605, -22.35687426444342, -18.52618945778478, -19.05565822433373]
[28.757899146965133, 26.08206168949166, 24.784950164471965, 24.24884604288604, 27.536364441957563, 23.328990233832904, 25.833895198252872, 26.079452644422304, 22.17576723456319, 22.14099553803958]
[Thread 1] Processed 100 zonotopes (Work Done: 0.0%; Expected Zonos: Inf)
[Thread 1] Processed 200 zonotopes (Work Done: 0.0%; Expected Zonos: Inf)


TIMEOUT REACHED
UNKNOWN
[Thread 1] Total splits: 208
Processed 208 zonotopes (Work Done: 0.0%); Generated 416 (0.5773817180096154s/loop)
[Thread 1] Finished in 120.1s
 ────────────────────────────────────────────────────────────────────────────────
                                        Time                    Allocations      
                               ───────────────────────   ────────────────────────
       Tot / % measured:             120s / 100.0%           19.7GiB / 100.0%    

 Section               ncalls     time    %tot     avg     alloc    %tot      avg
 ────────────────────────────────────────────────────────────────────────────────
 Verify                     1     120s  100.0%    120s   19.7GiB  100.0%  19.7GiB
   Zonotope Loop            1     120s  100.0%    120s   19.7GiB  100.0%  19.7GiB
     Property Check       208     114s   94.5%   546ms   14.0GiB   71.1%  69.1MiB
     Zonotope Propa...    208    6.50s    5.4%  31.3ms   5.43GiB   27.5%  26.7MiB
       DiffZonotope...    624    4.41s    3.7%  7.06ms    877MiB    4.3%  1.41MiB
         Zonotope_D...  1.25k    1.64s    1.4%  1.31ms    383MiB    1.9%   314KiB
       DiffZonotope...    416    2.09s    1.7%  5.03ms   4.58GiB   23.2%  11.3MiB
         Zonotope_R...    832    1.23s    1.0%  1.48ms   2.76GiB   14.0%  3.40MiB
           Column M...    832    661ms    0.6%   794μs   1.20GiB    6.1%  1.48MiB
           Allocation     832    261ms    0.2%   314μs   1.20GiB    6.1%  1.48MiB
           Influenc...    832    168ms    0.1%   202μs    342MiB    1.7%   421KiB
             Multiply     832    148ms    0.1%   178μs    292MiB    1.4%   359KiB
             Alloca...    832   16.8ms    0.0%  20.2μs   50.5MiB    0.3%  62.2KiB
             Set Ma...    832   2.13ms    0.0%  2.56μs     0.00B    0.0%    0.00B
           Set Matrix     832    120ms    0.1%   145μs   5.90MiB    0.0%  7.26KiB
           Vectors        832   21.6ms    0.0%  25.9μs   20.3MiB    0.1%  25.0KiB
           Bounds         832    468μs    0.0%   563ns     0.00B    0.0%    0.00B
     Compute Split        208   43.3ms    0.0%   208μs   85.9MiB    0.4%   423KiB
 Initialize                 1   1.91ms    0.0%  1.91ms   5.26MiB    0.0%  5.26MiB
 ────────────────────────────────────────────────────────────────────────────────
[VERYDIFF_TIMER] 120.138969805

[VERYDIFF_EXPERIMENT] NETWORK: /home/i57/steuber/NeuroDiff/repos/VeryDiffExperiments/src/../benchmarks/mnist-prune/specs/mnist_38_local_21.vnnlib
[VERYDIFF_EXPERIMENT] TIME: 120.441663312
