
[VERYDIFF_EXPERIMENT] Running on /home/i57/steuber/NeuroDiff/repos/VeryDiffExperiments/src/../benchmarks/mnist-prune/specs/mnist_49_global_6.vnnlib /home/i57/steuber/NeuroDiff/repos/VeryDiffExperiments/src/../benchmarks/mnist-prune/nets/mnist_relu_3_100.onnx
Total difference: 2125.6743
Average difference: 0.0238
Initial output delta:
[-6.618838 -6.730668 -7.866700 -7.193904 -8.117646 -7.901305 -8.202193 -8.804130 -7.466131 -7.593151 ]
[5.911128 6.455793 7.268644 6.959135 8.279152 6.966801 7.730137 7.488441 6.664526 7.729640 ]
setenv(`timeout -k 5 120 ../NeuroDiff/DiffNN-Code/delta_network_test 449 /home/i57/steuber/NeuroDiff/repos/VeryDiffExperiments/src/../benchmarks/mnist-prune/nets/mnist_relu_3_100.nnet /home/i57/steuber/NeuroDiff/repos/VeryDiffExperiments/src/../benchmarks/mnist-prune/nets_pruned/mnist_relu_3_100_0.77.nnet 1.0 -p 6`,["OMP_NUM_THREADS=1"])TIMEOUT
ProcessFailedException(Base.Process[Process(setenv(`timeout -k 5 120 ../NeuroDiff/DiffNN-Code/delta_network_test 449 /home/i57/steuber/NeuroDiff/repos/VeryDiffExperiments/src/../benchmarks/mnist-prune/nets/mnist_relu_3_100.nnet /home/i57/steuber/NeuroDiff/repos/VeryDiffExperiments/src/../benchmarks/mnist-prune/nets_pruned/mnist_relu_3_100_0.77.nnet 1.0 -p 6`,["OMP_NUM_THREADS=1"]), ProcessExited(124))])
nothing

[VERYDIFF_TIMER] 120.006892039

[VERYDIFF_EXPERIMENT] NETWORK: /home/i57/steuber/NeuroDiff/repos/VeryDiffExperiments/src/../benchmarks/mnist-prune/specs/mnist_49_global_6.vnnlib
[VERYDIFF_EXPERIMENT] TIME: 120.360301613
