
[VERYDIFF_EXPERIMENT] Running on /home/i57/steuber/NeuroDiff/repos/VeryDiffExperiments/src/../benchmarks/mnist-prune/specs/mnist_93_global_5.vnnlib /home/i57/steuber/NeuroDiff/repos/VeryDiffExperiments/src/../benchmarks/mnist-prune/nets/mnist_relu_2_512.onnx
Found input X
op: matmul, weight: (512, 784), bias: nothing
op: bias, weight: nothing, bias: (512,)
op: relu, weight: nothing, bias: nothing
op: matmul, weight: (512, 512), bias: nothing
op: bias, weight: nothing, bias: (512,)
op: relu, weight: nothing, bias: nothing
op: matmul, weight: (10, 512), bias: nothing
op: bias, weight: nothing, bias: (10,)
Found input X
op: gemm, weight: (512, 784), bias: (512,)
op: relu, weight: nothing, bias: nothing
op: gemm, weight: (512, 512), bias: (512,)
op: relu, weight: nothing, bias: nothing
op: gemm, weight: (10, 512), bias: (10,)
Distance: 973.3044369037136
Distance: 481.63499746812613
Distance: 8.744412635378467
Running with 1 threads
[Thread 1] Time to first task: 0.01s
Instable Generators: 101
Instable Generators: 171
Zono Bounds:
[-5.992011443659893, -6.063895565242506, -5.039862640672512, -4.545861944181876, -6.026742072791841, -5.1094115399625295, -6.46492302415718, -5.2573667191890285, -4.999872460527988, -4.322470445217882]
[8.638012023004459, 7.887060825535388, 6.8925827666139305, 5.1335348473839115, 8.282405819880289, 6.757390733742744, 8.55288193586268, 6.9796769295539045, 6.049959176146239, 5.9146316365751295]
[Thread 1] Processed 100 zonotopes (Work Done: 0.0%; Expected Zonos: Inf)
[Thread 1] Processed 200 zonotopes (Work Done: 0.0%; Expected Zonos: Inf)
[Thread 1] Processed 300 zonotopes (Work Done: 0.0%; Expected Zonos: Inf)


TIMEOUT REACHED
UNKNOWN
[Thread 1] Total splits: 308
Processed 308 zonotopes (Work Done: 0.0%); Generated 616 (0.390163404474026s/loop)
[Thread 1] Finished in 120.17s
 ────────────────────────────────────────────────────────────────────────────────
                                        Time                    Allocations      
                               ───────────────────────   ────────────────────────
       Tot / % measured:             120s / 100.0%           45.1GiB / 100.0%    

 Section               ncalls     time    %tot     avg     alloc    %tot      avg
 ────────────────────────────────────────────────────────────────────────────────
 Verify                     1     120s  100.0%    120s   45.0GiB  100.0%  45.0GiB
   Zonotope Loop            1     120s  100.0%    120s   45.0GiB  100.0%  45.0GiB
     Zonotope Propa...    308    92.9s   77.3%   302ms   33.6GiB   74.7%   112MiB
       DiffZonotope...    924    51.0s   42.5%  55.2ms   6.21GiB   13.8%  6.88MiB
         Zonotope_D...  1.85k    33.3s   27.7%  18.0ms   3.98GiB    8.8%  2.20MiB
       DiffZonotope...    616    41.8s   34.8%  67.9ms   27.4GiB   60.9%  45.6MiB
         Zonotope_R...  1.23k    34.9s   29.1%  28.3ms   24.2GiB   53.6%  20.1MiB
           Allocation   1.23k    22.1s   18.4%  18.0ms   4.56GiB   10.1%  3.79MiB
           Influenc...  1.23k    10.4s    8.6%  8.43ms   15.0GiB   33.3%  12.5MiB
             Multiply   1.23k    8.64s    7.2%  7.01ms   8.03GiB   17.8%  6.68MiB
             Set Ma...  1.23k    926ms    0.8%   752μs     0.00B    0.0%    0.00B
             Alloca...  1.23k    815ms    0.7%   662μs   6.98GiB   15.5%  5.80MiB
           Column M...  1.23k    1.80s    1.5%  1.47ms   4.56GiB   10.1%  3.79MiB
           Set Matrix   1.23k    555ms    0.5%   451μs   4.88MiB    0.0%  4.05KiB
           Vectors      1.23k   23.0ms    0.0%  18.7μs   30.0MiB    0.1%  25.0KiB
           Bounds       1.23k    947μs    0.0%   769ns     0.00B    0.0%    0.00B
     Compute Split        308    20.7s   17.2%  67.2ms   5.33GiB   11.8%  17.7MiB
     Property Check       308    274ms    0.2%   889μs   83.8MiB    0.2%   279KiB
 Initialize                 1   2.23ms    0.0%  2.23ms   9.84MiB    0.0%  9.84MiB
 ────────────────────────────────────────────────────────────────────────────────
[VERYDIFF_TIMER] 120.20941222

[VERYDIFF_EXPERIMENT] NETWORK: /home/i57/steuber/NeuroDiff/repos/VeryDiffExperiments/src/../benchmarks/mnist-prune/specs/mnist_93_global_5.vnnlib
[VERYDIFF_EXPERIMENT] TIME: 120.611096746
