
[VERYDIFF_EXPERIMENT] Running on /home/i57/steuber/NeuroDiff/repos/VeryDiffExperiments/src/../benchmarks/mnist-prune/specs/mnist_77_global_3.vnnlib /home/i57/steuber/NeuroDiff/repos/VeryDiffExperiments/src/../benchmarks/mnist-prune/nets/mnist_relu_2_512.onnx
Loading /home/i57/steuber/NeuroDiff/repos/VeryDiffExperiments/src/../benchmarks/mnist-prune/nets/mnist_relu_2_512.onnx and /home/i57/steuber/NeuroDiff/repos/VeryDiffExperiments/src/../benchmarks/mnist-prune/nets_pruned/mnist_relu_2_512_0.79-old.onnx
INPUT SHAPE: 784
NETWORKS EQUIVALENT
Refined: 0 | Refine Limit: -1 | Wrong: 0 | Right: 1 | Total: 1 | Total Zonos Considered: 1 | Expected 2 (50.0%)

time: 2.514725235

[VERYDIFF_TIMER] 2.54022318

[VERYDIFF_EXPERIMENT] NETWORK: /home/i57/steuber/NeuroDiff/repos/VeryDiffExperiments/src/../benchmarks/mnist-prune/specs/mnist_77_global_3.vnnlib
[VERYDIFF_EXPERIMENT] TIME: 2.838833242
