
[VERYDIFF_EXPERIMENT] Running on /home/i57/steuber/NeuroDiff/repos/VeryDiffExperiments/src/../benchmarks/mnist-prune/specs/mnist_85_global_4.vnnlib /home/i57/steuber/NeuroDiff/repos/VeryDiffExperiments/src/../benchmarks/mnist-prune/nets/mnist_relu_4_1024.onnx
Parsing /home/i57/steuber/NeuroDiff/repos/VeryDiffExperiments/src/../benchmarks/mnist-prune/nets/mnist_relu_4_1024.onnx...
Found input X
op: matmul, weight: (1024, 784), bias: nothing
op: bias, weight: nothing, bias: (1024,)
op: relu, weight: nothing, bias: nothing
op: matmul, weight: (1024, 1024), bias: nothing
op: bias, weight: nothing, bias: (1024,)
op: relu, weight: nothing, bias: nothing
op: matmul, weight: (1024, 1024), bias: nothing
op: bias, weight: nothing, bias: (1024,)
op: relu, weight: nothing, bias: nothing
op: matmul, weight: (10, 1024), bias: nothing
op: bias, weight: nothing, bias: (10,)
op: relu, weight: nothing, bias: nothing
op: matmul, weight: (10, 10), bias: nothing
op: bias, weight: nothing, bias: (10,)
Parsing /home/i57/steuber/NeuroDiff/repos/VeryDiffExperiments/src/../benchmarks/mnist-prune/nets_pruned/mnist_relu_4_1024_0.79-old.onnx...
Found input X
op: gemm, weight: (1024, 784), bias: (1024,)
op: relu, weight: nothing, bias: nothing
op: gemm, weight: (1024, 1024), bias: (1024,)
op: relu, weight: nothing, bias: nothing
op: gemm, weight: (1024, 1024), bias: (1024,)
op: relu, weight: nothing, bias: nothing
op: gemm, weight: (10, 1024), bias: (10,)
op: relu, weight: nothing, bias: nothing
op: gemm, weight: (10, 10), bias: (10,)
Distance: 915.6394868631054
Distance: 1298.7052820973968
Distance: 1296.587532894263
Distance: 6.054483317080667
Distance: 0.04942679278974538
Running with 1 threads
[Thread 1] Time to first task: 0.0s
Instable Generators: 258
Instable Generators: 453
Instable Generators: 863
Instable Generators: 10
Zono Bounds:
[-43.88827529173244, -43.71482636816381, -48.14222465805253, -49.8735366404289, -46.77293696950805, -50.10416449192114, -43.52370960539086, -46.676410496275764, -47.65132093000077, -48.972876345938374]
[43.12120824803614, 43.68862411171932, 47.45142688345115, 49.30745215959485, 47.930218602387654, 50.07876275172413, 43.52865789209089, 46.29242553265132, 47.38355964117459, 48.899866182517854]


TIMEOUT REACHED
UNKNOWN
[Thread 1] Total splits: 31
Processed 31 zonotopes (Work Done: 0.0%); Generated 62 (3.966304363903226s/loop)
[Thread 1] Finished in 122.96s
 ────────────────────────────────────────────────────────────────────────────────
                                        Time                    Allocations      
                               ───────────────────────   ────────────────────────
       Tot / % measured:             123s / 100.0%           27.8GiB / 100.0%    

 Section               ncalls     time    %tot     avg     alloc    %tot      avg
 ────────────────────────────────────────────────────────────────────────────────
 Verify                     1     123s  100.0%    123s   27.8GiB   99.9%  27.8GiB
   Zonotope Loop            1     123s  100.0%    123s   27.8GiB   99.9%  27.8GiB
     Property Check        31    62.7s   51.0%   2.02s   10.1GiB   36.4%   334MiB
     Zonotope Propa...     31    59.1s   48.1%   1.91s   16.1GiB   57.7%   530MiB
       DiffZonotope...    124    33.5s   27.2%   270ms   13.2GiB   47.4%   109MiB
         Zonotope_R...    248    30.9s   25.1%   125ms   10.8GiB   38.7%  44.5MiB
           Allocation     248    14.1s   11.5%  56.8ms   2.32GiB    8.3%  9.56MiB
           Influenc...    248    13.5s   11.0%  54.6ms   6.13GiB   22.1%  25.3MiB
             Multiply     248    12.7s   10.3%  51.1ms   3.52GiB   12.7%  14.5MiB
             Alloca...    248    456ms    0.4%  1.84ms   2.61GiB    9.4%  10.8MiB
             Set Ma...    248    405ms    0.3%  1.63ms     0.00B    0.0%    0.00B
           Column M...    248    2.83s    2.3%  11.4ms   2.32GiB    8.3%  9.56MiB
           Set Matrix     248    426ms    0.3%  1.72ms   2.51MiB    0.0%  10.4KiB
           Vectors        248   7.17ms    0.0%  28.9μs   8.23MiB    0.0%  34.0KiB
           Bounds         248    189μs    0.0%   761ns     0.00B    0.0%    0.00B
       DiffZonotope...    155    25.6s   20.8%   165ms   2.86GiB   10.3%  18.9MiB
         Zonotope_D...    310    9.20s    7.5%  29.7ms   1.59GiB    5.7%  5.27MiB
     Compute Split         31    1.06s    0.9%  34.3ms   1.01GiB    3.6%  33.4MiB
 Initialize                 1   15.4ms    0.0%  15.4ms   27.0MiB    0.1%  27.0MiB
 ────────────────────────────────────────────────────────────────────────────────
[VERYDIFF_TIMER] 123.048547978

[VERYDIFF_EXPERIMENT] NETWORK: /home/i57/steuber/NeuroDiff/repos/VeryDiffExperiments/src/../benchmarks/mnist-prune/specs/mnist_85_global_4.vnnlib
[VERYDIFF_EXPERIMENT] TIME: 123.358608493
