
[VERYDIFF_EXPERIMENT] Running on /home/i57/steuber/NeuroDiff/repos/VeryDiffExperiments/src/../benchmarks/mnist-prune/specs/mnist_58_local_24.vnnlib /home/i57/steuber/NeuroDiff/repos/VeryDiffExperiments/src/../benchmarks/mnist-prune/nets/mnist_relu_4_1024.onnx
Found input X
op: matmul, weight: (1024, 784), bias: nothing
op: bias, weight: nothing, bias: (1024,)
op: relu, weight: nothing, bias: nothing
op: matmul, weight: (1024, 1024), bias: nothing
op: bias, weight: nothing, bias: (1024,)
op: relu, weight: nothing, bias: nothing
op: matmul, weight: (1024, 1024), bias: nothing
op: bias, weight: nothing, bias: (1024,)
op: relu, weight: nothing, bias: nothing
op: matmul, weight: (10, 1024), bias: nothing
op: bias, weight: nothing, bias: (10,)
op: relu, weight: nothing, bias: nothing
op: matmul, weight: (10, 10), bias: nothing
op: bias, weight: nothing, bias: (10,)
Found input X
op: gemm, weight: (1024, 784), bias: (1024,)
op: relu, weight: nothing, bias: nothing
op: gemm, weight: (1024, 1024), bias: (1024,)
op: relu, weight: nothing, bias: nothing
op: gemm, weight: (1024, 1024), bias: (1024,)
op: relu, weight: nothing, bias: nothing
op: gemm, weight: (10, 1024), bias: (10,)
op: relu, weight: nothing, bias: nothing
op: gemm, weight: (10, 10), bias: (10,)
Distance: 915.6394868631054
Distance: 1298.7052820973968
Distance: 1296.587532894263
Distance: 6.054483317080667
Distance: 0.04942679278974538
Running with 1 threads
[Thread 1] Time to first task: 0.0s
Instable Generators: 501
Instable Generators: 939
Instable Generators: 1024
Instable Generators: 10
Zono Bounds:
[-194.14295943101527, -197.92232392191093, -218.60681478925605, -216.45568816827193, -208.68896544648368, -220.62792049618636, -196.88414772951037, -206.18067207969537, -210.99852294271832, -220.0105465394326]
[193.8936337718429, 197.58893349094436, 217.82452117263958, 216.2649514868629, 208.55954237548895, 220.45167083152486, 196.73955233033658, 205.189900157432, 211.12274040307065, 219.7547481965579]
[Thread 1] Processed 100 zonotopes (Work Done: 0.0%; Expected Zonos: Inf)


TIMEOUT REACHED
UNKNOWN
[Thread 1] Total splits: 123
Processed 123 zonotopes (Work Done: 0.0%); Generated 246 (0.9830076673170732s/loop)
[Thread 1] Finished in 120.91s
 ────────────────────────────────────────────────────────────────────────────────
                                        Time                    Allocations      
                               ───────────────────────   ────────────────────────
       Tot / % measured:             121s / 100.0%           40.9GiB / 100.0%    

 Section               ncalls     time    %tot     avg     alloc    %tot      avg
 ────────────────────────────────────────────────────────────────────────────────
 Verify                     1     121s  100.0%    121s   40.8GiB   99.9%  40.8GiB
   Zonotope Loop            1     121s  100.0%    121s   40.8GiB   99.9%  40.8GiB
     Zonotope Propa...    123     119s   98.8%   971ms   40.5GiB   99.1%   337MiB
       DiffZonotope...    615    66.3s   54.9%   108ms   8.78GiB   21.5%  14.6MiB
         Zonotope_D...  1.23k    21.9s   18.1%  17.8ms   3.57GiB    8.7%  2.97MiB
       DiffZonotope...    492    53.2s   44.0%   108ms   31.7GiB   77.6%  66.0MiB
         Zonotope_R...    984    17.0s   14.1%  17.3ms   19.8GiB   48.5%  20.6MiB
           Allocation     984    8.14s    6.7%  8.28ms   7.92GiB   19.4%  8.24MiB
           Column M...    984    5.38s    4.4%  5.46ms   7.92GiB   19.4%  8.24MiB
           Influenc...    984    2.08s    1.7%  2.11ms   3.94GiB    9.6%  4.10MiB
             Multiply     984    2.02s    1.7%  2.05ms   3.65GiB    8.9%  3.80MiB
             Alloca...    984   40.0ms    0.0%  40.7μs    296MiB    0.7%   308KiB
             Set Ma...    984   18.8ms    0.0%  19.1μs     0.00B    0.0%    0.00B
           Set Matrix     984    1.38s    1.1%  1.41ms   14.4MiB    0.0%  15.0KiB
           Vectors        984   25.2ms    0.0%  25.6μs   32.6MiB    0.1%  34.0KiB
           Bounds         984    626μs    0.0%   636ns     0.00B    0.0%    0.00B
     Property Check       123    1.32s    1.1%  10.7ms   66.6MiB    0.2%   554KiB
     Compute Split        123   80.4ms    0.1%   654μs    172MiB    0.4%  1.40MiB
 Initialize                 1   14.2ms    0.0%  14.2ms   22.4MiB    0.1%  22.4MiB
 ────────────────────────────────────────────────────────────────────────────────
[VERYDIFF_TIMER] 121.007561906

[VERYDIFF_EXPERIMENT] NETWORK: /home/i57/steuber/NeuroDiff/repos/VeryDiffExperiments/src/../benchmarks/mnist-prune/specs/mnist_58_local_24.vnnlib
[VERYDIFF_EXPERIMENT] TIME: 121.331821009
