
[VERYDIFF_EXPERIMENT] Running on /home/i57/steuber/NeuroDiff/repos/VeryDiffExperiments/src/../benchmarks/mnist-prune/specs/mnist_60_global_6.vnnlib /home/i57/steuber/NeuroDiff/repos/VeryDiffExperiments/src/../benchmarks/mnist-prune/nets/mnist_relu_2_512.onnx
Found input X
op: matmul, weight: (512, 784), bias: nothing
op: bias, weight: nothing, bias: (512,)
op: relu, weight: nothing, bias: nothing
op: matmul, weight: (512, 512), bias: nothing
op: bias, weight: nothing, bias: (512,)
op: relu, weight: nothing, bias: nothing
op: matmul, weight: (10, 512), bias: nothing
op: bias, weight: nothing, bias: (10,)
Found input X
op: matmul, weight: (512, 784), bias: nothing
op: bias, weight: nothing, bias: (512,)
op: relu, weight: nothing, bias: nothing
op: matmul, weight: (512, 512), bias: nothing
op: bias, weight: nothing, bias: (512,)
op: relu, weight: nothing, bias: nothing
op: matmul, weight: (10, 512), bias: nothing
op: bias, weight: nothing, bias: (10,)
Distance: 1085.5985166831802
Distance: 1719.8468985003963
Distance: 31.228482716001736
Running with 1 threads
[Thread 1] Time to first task: 0.02s
Zono Bounds:
[0.0, 0.0, 0.0, 0.0, 0.0, 0.0, 0.0, 0.0, 0.0, 0.0, 0.0, 0.0, 0.0, 0.0, 0.0, 0.0, 0.0, 0.0, 0.0, 0.0, 0.0, 0.0, 0.0, 0.0, 0.0, 0.0, 0.0, 0.0, 0.0, 0.0, 0.0, 0.0, 0.0, 0.0, 0.0, 0.0, 0.0, 0.0, 0.0, 0.0, 0.0, 0.0, 0.0, 0.0, 0.0, 0.0, 0.0, 0.0, 0.0, 0.0, 0.0, 0.0, 0.0, 0.0, 0.0, 0.0, 0.0, 0.0, 0.0, 0.0, 0.0, 0.0, 0.0, 0.0, 0.0, 0.0, 0.0, 0.0, 0.0, 0.0, 0.0, 0.0, 0.0, 0.0, 0.0, 0.0, 0.0, 0.0, 0.0, 0.0, 0.0, 0.0, 0.0, 0.0, 0.0, 0.0, 0.0, 0.0, 0.0, 0.0, 0.0, 0.0, 0.0, 0.0, 0.0, 0.0, 0.0, 0.0, 0.0, 0.0, 0.0, 0.0, 0.0, 0.0, 0.0, 0.0, 0.0, 0.0, 0.0, 0.0, 0.0, 0.0, 0.0, 0.0, 0.0, 0.0, 0.0, 0.0, 0.0, 0.0, 0.0, 0.0, 0.0, 0.0, 0.0, 0.0, 0.0, 0.0, 0.0, 0.0, 0.0, 0.0, 0.0, 0.0, 0.0, 0.0, 0.0, 0.0, 0.0, 0.0, 0.0, 0.0, 0.0, 0.0, 0.0, 0.0, 0.0, 0.0, 0.0, 0.0, 0.0, 0.0, 0.0, 0.0, 0.0, 0.0, 0.0, 0.0, 0.0, 0.0, 0.0, 0.0, 0.0, 0.0, 0.0, 0.0, 0.0, 0.0, 0.0, 0.0, 0.0, 0.0, 0.0, 0.0, 0.0, 0.0, 0.0, 0.0, 0.0, 0.0, 0.0, 0.0, 0.0, 0.0, 0.0, 0.0, 0.0, 0.0, 0.0, 0.0, 0.0, 0.0, 0.0, 0.0, 0.0, 0.0, 0.0, 0.0, 0.0, 0.0, 0.0, 0.0, 0.0, 0.0, 0.0, 0.0, 0.0, 0.0, 0.0, 0.0, 0.0, 0.0, 0.0, 0.0, 0.0, 0.0, 0.0, 0.0, 0.0, 0.0, 0.0, 0.0, 0.0, 0.0, 0.0, 0.0, 0.0, 0.0, 0.0, 0.0, 0.0, 0.0, 0.0, 0.0, 0.0, 0.0, 0.0, 0.0, 0.0, 0.0, 0.0, 0.0, 0.0, 0.0, 0.0, 0.0, 0.0, 0.0, 0.0, 0.0, 0.0, 0.0, 0.0, 0.0, 0.0, 0.0, 0.0, 0.0, 0.0, 0.0, 0.0, 0.0, 0.0, 0.0, 0.0, 0.0, 0.0, 0.0, 0.0, 0.0, 0.0, 0.0, 0.0, 0.0, 0.0, 0.0, 0.0, 0.0, 0.0, 0.0, 0.0, 0.0, 0.0, 0.0, 0.0, 0.0, 0.0, 0.0, 0.0, 0.0, 0.0, 0.0, 0.0, 0.0, 0.0, 0.0, 0.0, 0.0, 0.0, 0.0, 0.0, 0.0, 0.0, 0.0, 0.0, 0.0, 0.0, 0.0, 0.0, 0.0, 0.0, 0.0, 0.0, 0.0, 0.0, 0.0, 0.0, 0.0, 0.0, 0.0, 0.0, 0.0, 0.0, 0.0, 0.0, 0.0, 0.0, 0.0, 0.0, 0.0, 0.0, 0.0, 0.0, 0.0, 0.0, 0.0, 0.0, 0.0, 0.0, 0.0, 0.0, 0.0, 0.0, 0.0, 0.0, 0.0, 0.0, 0.0, 0.0, 0.0, 0.0, 0.0, 0.0, 0.0, 0.0, 0.0, 0.0, 0.0, 0.0, 0.0, 0.0, 0.0, 0.0, 0.0, 0.0, 0.0, 0.0, 0.0, 0.0, 0.0, 0.0, 0.0, 0.0, 0.0, 0.0, 0.0, 0.0, 0.0, 0.0, 0.0, 0.0, 0.0, 0.0, 0.0, 0.0, 0.0, 0.0, 0.0, 0.0, 0.0, 0.0, 0.0, 0.0, 0.0, 0.0, 0.0, 0.0, 0.0, 0.0, 0.0, 0.0, 0.0, 0.0, 0.0, 0.0, 0.0, 0.0, 0.0, 0.0, 0.0, 0.0, 0.0, 0.0, 0.0, 0.0, 0.0, 0.0, 0.0, 0.0, 0.0, 0.0, 0.0, 0.0, 0.0, 0.0, 0.0, 0.0, 0.0, 0.0, 0.0, 0.0, 0.0, 0.0, 0.0, 0.0, 0.0, 0.0, 0.0, 0.0, 0.0, 0.0, 0.0, 0.0, 0.0, 0.0, 0.0, 0.0, 0.0, 0.0, 0.0, 0.0, 0.0, 0.0, 0.0, 0.0, 0.0, 0.0, 0.0, 0.0, 0.0, 0.0, 0.0, 0.0, 0.0, 0.0, 0.0, 0.0, 0.0, 0.0, 0.0, 0.0, 0.0, 0.0, 0.0, 0.0, 0.0, 0.0, 0.0, 0.0, 0.0, 0.0, 0.0, 0.0, 0.0, 0.0, 0.0, 0.0, 0.0, 0.0, 0.0, 0.0, 0.0, 0.0, 0.0, 0.0, 0.0, 0.0, 0.0, 0.0, 0.0, 0.0, 0.0, 0.0, 0.0, 0.0, 0.0, 0.0, 0.0, 0.0, 0.0, 0.0, 0.0, 0.0, 0.0, 0.0, 0.0, 0.0, 0.0, 0.0, 0.0, 0.0, 0.0, 0.0, 0.0, 0.0, 0.0, 0.0, 0.0, 0.0, 0.0, 0.0, 0.0, 0.0, 0.0, 0.0, 0.0, 0.0, 0.0, 0.0, 0.0, 0.0, 0.0, 0.0, 0.0, 0.0, 0.0, 0.0, 0.0, 0.0, 0.0, 0.0, 0.0, 0.0, 0.0, 0.0, 0.0, 0.0, 0.0, 0.0, 0.0, 0.0, 0.0, 0.0, 0.0, 0.0, 0.0, 0.0, 0.0, 0.0, 0.0, 0.0, 0.0, 0.0, 0.0, 0.0, 0.0, 0.0, 0.0, 0.0, 0.0, 0.0, 0.0, 0.0, 0.0, 0.0, 0.0, 0.0, 0.0, 0.0, 0.0, 0.0, 0.0, 0.0, 0.0, 0.0, 0.0, 0.0, 0.0, 0.0, 0.0, 0.0, 0.0, 0.0, 0.0, 0.0, 0.0, 0.0, 0.0, 0.0, 0.0, 0.0, 0.0, 0.0, 0.0, 0.0, 0.0, 0.0, 0.0, 0.0, 0.0, 0.0, 0.0, 0.0, 0.0, 0.0, 0.0, 0.0, 0.0, 0.0, 0.0, 0.0, 0.0, 0.0, 0.0, 0.0, 0.0, 0.0, 0.0, 0.0, 0.0, 0.0, 0.0, 0.0, 0.0, 0.0, 0.0, 0.0, 0.0, 0.0, 0.0, 0.0, 0.0, 0.0, 0.0, 0.0, 0.0, 0.0, 0.0, 0.0, 0.0, 0.0, 0.0, 0.0, 0.0, 0.0, 0.0, 0.0, 0.0, 0.0, 0.0, 0.0, 0.0, 0.0, 0.0, 0.0, 0.0, 0.0, 0.0, 0.0, 0.0, 0.0, 0.0, 0.0, 0.0, 0.0, 0.0, 0.0, 0.0, 0.0, 0.0, 0.0, 0.0, 0.0, 0.0, 0.0, 0.0, 0.0, 0.0, 0.0, 0.0, 0.0, 0.0, 0.0, 0.0, 0.0, 0.0, 0.0, 0.0, 0.0, 0.0, 0.0, 0.0, 0.0, 0.0, 0.0, 0.0, 0.0, 0.0, 0.0, 0.0, 0.0, 0.0, 0.0, 0.0, 0.0, 0.0, 0.0, 0.0, 0.0, 0.0, 0.0, 0.0, 0.0, 0.0, 0.0, 0.0, 0.0, 0.0, 0.0, 0.0, 0.0, 0.0, 0.0, 0.0, 0.0, 0.0, 0.0, 0.0, 0.0, 0.0, 0.0, 0.0, 0.0, 0.0, 0.0, 0.0, 0.0, 0.0, 0.0, 0.0, 0.0, 0.0, 0.0, 0.0, 0.0, 0.0, 0.0, 0.0, 0.0, 0.0, 0.0, 0.0, 0.0, 0.0, 0.0, 0.0, 0.0, 0.0, 0.0, 0.0, 0.0, 0.0, 0.0, 0.0]
[0.0, 0.0, 0.0, 0.0, 0.0, 0.0, 0.0, 0.0, 0.0, 0.0, 0.0, 0.0, 0.0, 0.0, 0.0, 0.0, 0.0, 0.0, 0.0, 0.0, 0.0, 0.0, 0.0, 0.0, 0.0, 0.0, 0.0, 0.0, 0.0, 0.0, 0.0, 0.0, 0.0, 0.0, 0.0, 0.0, 0.0, 0.0, 0.0, 0.0, 0.0, 0.0, 0.0, 0.0, 0.0, 0.0, 0.0, 0.0, 0.0, 0.0, 0.0, 0.0, 0.0, 0.0, 0.0, 0.0, 0.0, 0.0, 0.0, 0.0, 0.0, 0.0, 0.0, 0.0, 0.0, 0.0, 0.0, 0.0, 0.0, 0.0, 0.0, 0.0, 0.0, 0.0, 0.0, 0.0, 0.0, 0.0, 0.0, 0.0, 0.0, 0.0, 0.0, 0.0, 0.0, 0.0, 0.0, 0.0, 0.0, 0.0, 0.0, 0.0, 0.0, 0.0, 0.0, 0.0, 0.0, 0.0, 0.0, 0.0, 0.0, 0.0, 0.0, 0.0, 0.0, 0.0, 0.0, 0.0, 0.0, 0.0, 0.0, 0.0, 0.0, 0.0, 0.0, 0.0, 0.0, 0.0, 0.0, 0.0, 0.0, 0.0, 0.0, 0.0, 0.0, 0.0, 0.0, 0.0, 0.0, 0.0, 0.0, 0.0, 0.0, 0.0, 0.0, 0.0, 0.0, 0.0, 0.0, 0.0, 0.0, 0.0, 0.0, 0.0, 0.0, 0.0, 0.0, 0.0, 0.0, 0.0, 0.0, 0.0, 0.0, 0.0, 0.0, 0.0, 0.0, 0.0, 0.0, 0.0, 0.0, 0.0, 0.0, 0.0, 0.0, 0.0, 0.0, 0.0, 0.0, 0.0, 0.0, 0.0, 0.0, 0.0, 0.0, 0.0, 0.0, 0.0, 0.0, 0.0, 0.0, 0.0, 0.0, 0.0, 0.0, 0.0, 0.0, 0.0, 0.0, 0.0, 0.0, 0.0, 0.0, 0.0, 0.0, 0.0, 0.0, 0.0, 0.0, 0.0, 0.0, 0.0, 0.0, 0.0, 0.0, 0.0, 0.0, 0.0, 0.0, 0.0, 0.0, 0.0, 0.0, 0.0, 0.0, 0.0, 0.0, 0.0, 0.0, 0.0, 0.0, 0.0, 0.0, 0.0, 0.0, 0.0, 0.0, 0.0, 0.0, 0.0, 0.0, 0.0, 0.0, 0.0, 0.0, 0.0, 0.0, 0.0, 0.0, 0.0, 0.0, 0.0, 0.0, 0.0, 0.0, 0.0, 0.0, 0.0, 0.0, 0.0, 0.0, 0.0, 0.0, 0.0, 0.0, 0.0, 0.0, 0.0, 0.0, 0.0, 0.0, 0.0, 0.0, 0.0, 0.0, 0.0, 0.0, 0.0, 0.0, 0.0, 0.0, 0.0, 0.0, 0.0, 0.0, 0.0, 0.0, 0.0, 0.0, 0.0, 0.0, 0.0, 0.0, 0.0, 0.0, 0.0, 0.0, 0.0, 0.0, 0.0, 0.0, 0.0, 0.0, 0.0, 0.0, 0.0, 0.0, 0.0, 0.0, 0.0, 0.0, 0.0, 0.0, 0.0, 0.0, 0.0, 0.0, 0.0, 0.0, 0.0, 0.0, 0.0, 0.0, 0.0, 0.0, 0.0, 0.0, 0.0, 0.0, 0.0, 0.0, 0.0, 0.0, 0.0, 0.0, 0.0, 0.0, 0.0, 0.0, 0.0, 0.0, 0.0, 0.0, 0.0, 0.0, 0.0, 0.0, 0.0, 0.0, 0.0, 0.0, 0.0, 0.0, 0.0, 0.0, 0.0, 0.0, 0.0, 0.0, 0.0, 0.0, 0.0, 0.0, 0.0, 0.0, 0.0, 0.0, 0.0, 0.0, 0.0, 0.0, 0.0, 0.0, 0.0, 0.0, 0.0, 0.0, 0.0, 0.0, 0.0, 0.0, 0.0, 0.0, 0.0, 0.0, 0.0, 0.0, 0.0, 0.0, 0.0, 0.0, 0.0, 0.0, 0.0, 0.0, 0.0, 0.0, 0.0, 0.0, 0.0, 0.0, 0.0, 0.0, 0.0, 0.0, 0.0, 0.0, 0.0, 0.0, 0.0, 0.0, 0.0, 0.0, 0.0, 0.0, 0.0, 0.0, 0.0, 0.0, 0.0, 0.0, 0.0, 0.0, 0.0, 0.0, 0.0, 0.0, 0.0, 0.0, 0.0, 0.0, 0.0, 0.0, 0.0, 0.0, 0.0, 0.0, 0.0, 0.0, 0.0, 0.0, 0.0, 0.0, 0.0, 0.0, 0.0, 0.0, 0.0, 0.0, 0.0, 0.0, 0.0, 0.0, 0.0, 0.0, 0.0, 0.0, 0.0, 0.0, 0.0, 0.0, 0.0, 0.0, 0.0, 0.0, 0.0, 0.0, 0.0, 0.0, 0.0, 0.0, 0.0, 0.0, 0.0, 0.0, 0.0, 0.0, 0.0, 0.0, 0.0, 0.0, 0.0, 0.0, 0.0, 0.0, 0.0, 0.0, 0.0, 0.0, 0.0, 0.0, 0.0, 0.0, 0.0, 0.0, 0.0, 0.0, 0.0, 0.0, 0.0, 0.0, 0.0, 0.0, 0.0, 0.0, 0.0, 0.0, 0.0, 0.0, 0.0, 0.0, 0.0, 0.0, 0.0, 0.0, 0.0, 0.0, 0.0, 0.0, 0.0, 0.0, 0.0, 0.0, 0.0, 0.0, 0.0, 0.0, 0.0, 0.0, 0.0, 0.0, 0.0, 0.0, 0.0, 0.0, 0.0, 0.0, 0.0, 0.0, 0.0, 0.0, 0.0, 0.0, 0.0, 0.0, 0.0, 0.0, 0.0, 0.0, 0.0, 0.0, 0.0, 0.0, 0.0, 0.0, 0.0, 0.0, 0.0, 0.0, 0.0, 0.0, 0.0, 0.0, 0.0, 0.0, 0.0, 0.0, 0.0, 0.0, 0.0, 0.0, 0.0, 0.0, 0.0, 0.0, 0.0, 0.0, 0.0, 0.0, 0.0, 0.0, 0.0, 0.0, 0.0, 0.0, 0.0, 0.0, 0.0, 0.0, 0.0, 0.0, 0.0, 0.0, 0.0, 0.0, 0.0, 0.0, 0.0, 0.0, 0.0, 0.0, 0.0, 0.0, 0.0, 0.0, 0.0, 0.0, 0.0, 0.0, 0.0, 0.0, 0.0, 0.0, 0.0, 0.0, 0.0, 0.0, 0.0, 0.0, 0.0, 0.0, 0.0, 0.0, 0.0, 0.0, 0.0, 0.0, 0.0, 0.0, 0.0, 0.0, 0.0, 0.0, 0.0, 0.0, 0.0, 0.0, 0.0, 0.0, 0.0, 0.0, 0.0, 0.0, 0.0, 0.0, 0.0, 0.0, 0.0, 0.0, 0.0, 0.0, 0.0, 0.0, 0.0, 0.0, 0.0, 0.0, 0.0, 0.0, 0.0, 0.0, 0.0, 0.0, 0.0, 0.0, 0.0, 0.0, 0.0, 0.0, 0.0, 0.0, 0.0, 0.0, 0.0, 0.0, 0.0, 0.0, 0.0, 0.0, 0.0, 0.0, 0.0, 0.0, 0.0, 0.0, 0.0, 0.0, 0.0, 0.0, 0.0, 0.0, 0.0, 0.0, 0.0, 0.0, 0.0, 0.0, 0.0, 0.0, 0.0, 0.0, 0.0, 0.0, 0.0, 0.0, 0.0, 0.0, 0.0, 0.0, 0.0, 0.0, 0.0, 0.0, 0.0, 0.0, 0.0, 0.0, 0.0, 0.0, 0.0, 0.0, 0.0, 0.0, 0.0, 0.0, 0.0, 0.0, 0.0, 0.0, 0.0, 0.0, 0.0, 0.0, 0.0, 0.0, 0.0, 0.0, 0.0, 0.0, 0.0, 0.0, 0.0, 0.0, 0.0, 0.0, 0.0, 0.0, 0.0, 0.0, 0.0, 0.0, 0.0, 0.0, 0.0, 0.0, 0.0, 0.0, 0.0, 0.0, 0.0, 0.0, 0.0, 0.0, 0.0, 0.0, 0.0, 0.0, 0.0, 0.0, 0.0, 0.0, 0.0, 0.0, 0.0, 0.0, 0.0, 0.0, 0.0, 0.0, 0.0, 0.0, 0.0, 0.0, 0.0, 0.0, 0.0, 0.0, 0.0, 0.0, 0.0, 0.0, 0.0, 0.0, 0.0]

Found counterexample: ([0.011764705, 0.011764705, 0.011764705, 0.011764705, 0.011764705, 0.011764705, 0.011764705, 0.011764705, 0.011764705, 0.011764705, 0.011764705, 0.011764705, 0.011764705, 0.011764705, 0.011764705, 0.011764705, 0.011764705, 0.011764705, 0.011764705, 0.011764705, 0.011764705, 0.011764705, 0.011764705, 0.011764705, 0.011764705, 0.011764705, 0.011764705, 0.011764705, 0.011764705, 0.011764705, 0.011764705, 0.011764705, 0.011764705, 0.011764705, 0.011764705, 0.011764705, 0.011764705, 0.011764705, 0.011764705, 0.011764705, 0.011764705, 0.011764705, 0.011764705, 0.011764705, 0.011764705, 0.011764705, 0.011764705, 0.011764705, 0.011764705, 0.011764705, 0.011764705, 0.011764705, 0.011764705, 0.011764705, 0.011764705, 0.011764705, 0.011764705, 0.011764705, 0.011764705, 0.011764705, 0.011764705, 0.011764705, 0.011764705, 0.011764705, 0.011764705, 0.011764705, 0.011764705, 0.011764705, 0.011764705, 0.011764705, 0.011764705, 0.011764705, 0.011764705, 0.011764705, 0.011764705, 0.011764705, 0.011764705, 0.011764705, 0.011764705, 0.011764705, 0.011764705, 0.011764705, 0.011764705, 0.011764705, 0.011764705, 0.011764705, 0.011764705, 0.011764705, 0.011764705, 0.011764705, 0.011764705, 0.011764705, 0.011764705, 0.011764705, 0.011764705, 0.011764705, 0.011764705, 0.011764705, 0.011764705, 0.011764705, 0.011764705, 0.011764705, 0.011764705, 0.011764705, 0.011764705, 0.011764705, 0.011764705, 0.011764705, 0.011764705, 0.011764705, 0.011764705, 0.011764705, 0.011764705, 0.011764705, 0.011764705, 0.011764705, 0.011764705, 0.011764705, 0.011764705, 0.011764705, 0.011764705, 0.011764705, 0.011764705, 0.011764705, 0.011764705, 0.011764705, 0.011764705, 0.011764705, 0.011764705, 0.011764705, 0.011764705, 0.011764705, 0.011764705, 0.011764705, 0.011764705, 0.011764705, 0.011764705, 0.011764705, 0.011764705, 0.011764705, 0.011764705, 0.011764705, 0.011764705, 0.011764705, 0.011764705, 0.011764705, 0.011764705, 0.011764705, 0.011764705, 0.011764705, 0.011764705, 0.011764705, 0.011764705, 0.011764705, 0.011764705, 0.011764705, 0.011764705, 0.011764705, 0.011764705, 0.011764705, 0.011764705, 0.011764705, 0.011764705, 0.011764705, 0.011764705, 0.011764705, 0.011764705, 0.011764705, 0.011764705, 0.011764705, 0.011764705, 0.011764705, 0.011764705, 0.011764705, 0.011764705, 0.011764705, 0.011764705, 0.011764705, 0.011764705, 0.011764705, 0.011764705, 0.011764705, 0.011764705, 0.011764705, 0.011764705, 0.011764705, 0.011764705, 0.011764705, 0.011764705, 0.011764705, 0.011764705, 0.011764705, 0.011764705, 0.011764705, 0.011764705, 0.011764705, 0.011764705, 0.011764705, 0.2509804, 0.74901962, 0.988235295, 0.501960795, 0.501960795, 0.501960795, 0.2509804, 0.011764705, 0.011764705, 0.011764705, 0.011764705, 0.011764705, 0.011764705, 0.011764705, 0.011764705, 0.011764705, 0.011764705, 0.011764705, 0.011764705, 0.011764705, 0.011764705, 0.011764705, 0.011764705, 0.011764705, 0.011764705, 0.011764705, 0.011764705, 0.011764705, 0.501960795, 0.988235295, 0.988235295, 0.988235295, 0.988235295, 0.988235295, 0.988235295, 0.988235295, 0.988235295, 0.988235295, 0.988235295, 0.501960795, 0.501960795, 0.2509804, 0.011764705, 0.011764705, 0.011764705, 0.011764705, 0.011764705, 0.011764705, 0.011764705, 0.011764705, 0.011764705, 0.011764705, 0.011764705, 0.011764705, 0.011764705, 0.011764705, 0.2509804, 0.988235295, 0.988235295, 0.988235295, 0.988235295, 0.988235295, 0.988235295, 0.988235295, 0.988235295, 0.988235295, 0.988235295, 0.988235295, 0.988235295, 0.988235295, 0.74901962, 0.2509804, 0.011764705, 0.011764705, 0.011764705, 0.011764705, 0.011764705, 0.011764705, 0.011764705, 0.011764705, 0.011764705, 0.011764705, 0.011764705, 0.011764705, 0.011764705, 0.011764705, 0.2509804, 0.2509804, 0.501960795, 0.501960795, 0.501960795, 0.501960795, 0.988235295, 0.988235295, 0.988235295, 0.988235295, 0.988235295, 0.988235295, 0.988235295, 0.988235295, 0.501960795, 0.011764705, 0.011764705, 0.011764705, 0.011764705, 0.011764705, 0.011764705, 0.011764705, 0.011764705, 0.011764705, 0.011764705, 0.011764705, 0.011764705, 0.011764705, 0.011764705, 0.011764705, 0.011764705, 0.011764705, 0.011764705, 0.011764705, 0.011764705, 0.011764705, 0.011764705, 0.2509804, 0.74901962, 0.988235295, 0.988235295, 0.988235295, 0.988235295, 0.988235295, 0.2509804, 0.011764705, 0.011764705, 0.011764705, 0.011764705, 0.011764705, 0.011764705, 0.011764705, 0.011764705, 0.011764705, 0.011764705, 0.011764705, 0.011764705, 0.011764705, 0.011764705, 0.011764705, 0.011764705, 0.011764705, 0.011764705, 0.011764705, 0.011764705, 0.011764705, 0.011764705, 0.2509804, 0.988235295, 0.988235295, 0.988235295, 0.988235295, 0.501960795, 0.011764705, 0.011764705, 0.011764705, 0.011764705, 0.011764705, 0.011764705, 0.011764705, 0.011764705, 0.011764705, 0.011764705, 0.011764705, 0.011764705, 0.011764705, 0.011764705, 0.011764705, 0.011764705, 0.011764705, 0.011764705, 0.011764705, 0.011764705, 0.011764705, 0.011764705, 0.011764705, 0.2509804, 0.988235295, 0.988235295, 0.988235295, 0.501960795, 0.011764705, 0.011764705, 0.011764705, 0.011764705, 0.011764705, 0.011764705, 0.011764705, 0.011764705, 0.011764705, 0.011764705, 0.011764705, 0.011764705, 0.011764705, 0.011764705, 0.011764705, 0.011764705, 0.011764705, 0.011764705, 0.011764705, 0.011764705, 0.011764705, 0.011764705, 0.011764705, 0.011764705, 0.501960795, 0.988235295, 0.988235295, 0.988235295, 0.011764705, 0.011764705, 0.011764705, 0.011764705, 0.011764705, 0.011764705, 0.011764705, 0.011764705, 0.011764705, 0.011764705, 0.011764705, 0.011764705, 0.011764705, 0.011764705, 0.011764705, 0.011764705, 0.011764705, 0.011764705, 0.011764705, 0.011764705, 0.011764705, 0.011764705, 0.011764705, 0.011764705, 0.501960795, 0.988235295, 0.988235295, 0.988235295, 0.2509804, 0.011764705, 0.011764705, 0.011764705, 0.011764705, 0.011764705, 0.011764705, 0.011764705, 0.011764705, 0.011764705, 0.011764705, 0.011764705, 0.011764705, 0.011764705, 0.011764705, 0.011764705, 0.011764705, 0.011764705, 0.011764705, 0.011764705, 0.011764705, 0.011764705, 0.011764705, 0.011764705, 0.501960795, 0.988235295, 0.988235295, 0.988235295, 0.501960795, 0.011764705, 0.011764705, 0.011764705, 0.011764705, 0.011764705, 0.011764705, 0.011764705, 0.011764705, 0.011764705, 0.011764705, 0.011764705, 0.011764705, 0.011764705, 0.011764705, 0.011764705, 0.011764705, 0.011764705, 0.011764705, 0.011764705, 0.011764705, 0.011764705, 0.011764705, 0.011764705, 0.501960795, 0.988235295, 0.988235295, 0.988235295, 0.011764705, 0.011764705, 0.011764705, 0.011764705, 0.011764705, 0.011764705, 0.011764705, 0.011764705, 0.011764705, 0.011764705, 0.011764705, 0.011764705, 0.011764705, 0.011764705, 0.011764705, 0.011764705, 0.011764705, 0.011764705, 0.011764705, 0.011764705, 0.011764705, 0.011764705, 0.011764705, 0.011764705, 0.501960795, 0.988235295, 0.988235295, 0.74901962, 0.011764705, 0.011764705, 0.011764705, 0.011764705, 0.011764705, 0.011764705, 0.011764705, 0.011764705, 0.011764705, 0.011764705, 0.011764705, 0.011764705, 0.011764705, 0.011764705, 0.011764705, 0.011764705, 0.011764705, 0.011764705, 0.011764705, 0.011764705, 0.011764705, 0.011764705, 0.011764705, 0.011764705, 0.74901962, 0.988235295, 0.988235295, 0.501960795, 0.011764705, 0.011764705, 0.011764705, 0.011764705, 0.011764705, 0.011764705, 0.011764705, 0.011764705, 0.011764705, 0.011764705, 0.011764705, 0.011764705, 0.011764705, 0.011764705, 0.011764705, 0.011764705, 0.011764705, 0.011764705, 0.011764705, 0.011764705, 0.011764705, 0.011764705, 0.011764705, 0.501960795, 0.988235295, 0.988235295, 0.988235295, 0.2509804, 0.011764705, 0.011764705, 0.011764705, 0.011764705, 0.011764705, 0.011764705, 0.011764705, 0.011764705, 0.011764705, 0.011764705, 0.011764705, 0.011764705, 0.011764705, 0.011764705, 0.011764705, 0.011764705, 0.011764705, 0.011764705, 0.011764705, 0.011764705, 0.011764705, 0.011764705, 0.011764705, 0.988235295, 0.988235295, 0.988235295, 0.74901962, 0.011764705, 0.011764705, 0.011764705, 0.011764705, 0.011764705, 0.011764705, 0.011764705, 0.011764705, 0.011764705, 0.011764705, 0.011764705, 0.011764705, 0.011764705, 0.011764705, 0.011764705, 0.011764705, 0.011764705, 0.011764705, 0.011764705, 0.011764705, 0.011764705, 0.011764705, 0.011764705, 0.011764705, 0.988235295, 0.988235295, 0.988235295, 0.2509804, 0.011764705, 0.011764705, 0.011764705, 0.011764705, 0.011764705, 0.011764705, 0.011764705, 0.011764705, 0.011764705, 0.011764705, 0.011764705, 0.011764705, 0.011764705, 0.011764705, 0.011764705, 0.011764705, 0.011764705, 0.011764705, 0.011764705, 0.011764705, 0.011764705, 0.011764705, 0.011764705, 0.74901962, 0.988235295, 0.988235295, 0.988235295, 0.011764705, 0.011764705, 0.011764705, 0.011764705, 0.011764705, 0.011764705, 0.011764705, 0.011764705, 0.011764705, 0.011764705, 0.011764705, 0.011764705, 0.011764705, 0.011764705, 0.011764705, 0.011764705, 0.011764705, 0.011764705, 0.011764705, 0.011764705, 0.011764705, 0.011764705, 0.011764705, 0.501960795, 0.988235295, 0.988235295, 0.988235295, 0.74901962, 0.011764705, 0.011764705, 0.011764705, 0.011764705, 0.011764705, 0.011764705, 0.011764705, 0.011764705, 0.011764705, 0.011764705, 0.011764705, 0.011764705, 0.011764705, 0.011764705, 0.011764705, 0.011764705, 0.011764705, 0.011764705, 0.011764705, 0.011764705, 0.011764705, 0.011764705, 0.011764705, 0.501960795, 0.988235295, 0.988235295, 0.74901962, 0.011764705, 0.011764705, 0.011764705, 0.011764705, 0.011764705, 0.011764705, 0.011764705, 0.011764705, 0.011764705, 0.011764705, 0.011764705, 0.011764705, 0.011764705, 0.011764705, 0.011764705, 0.011764705, 0.011764705, 0.011764705, 0.011764705, 0.011764705, 0.011764705, 0.011764705, 0.011764705, 0.011764705, 0.501960795, 0.988235295, 0.988235295, 0.2509804, 0.011764705, 0.011764705, 0.011764705, 0.011764705, 0.011764705, 0.011764705, 0.011764705, 0.011764705, 0.011764705, 0.011764705, 0.011764705, 0.011764705, 0.011764705, 0.011764705, 0.011764705, 0.011764705, 0.011764705, 0.011764705, 0.011764705, 0.011764705, 0.011764705, 0.011764705, 0.011764705, 0.011764705, 0.011764705, 0.011764705, 0.011764705, 0.011764705, 0.011764705, 0.011764705, 0.011764705, 0.011764705, 0.011764705, 0.011764705, 0.011764705, 0.011764705, 0.011764705, 0.011764705], ([-127.61650956042543, -126.9797428830853, -75.5145075866591, -77.87892270022621, -166.21991946404614, -94.15278536949762, -175.81256445496803, 44.48047281761195, -147.28364874220958, -83.76606443120276], [-109.83548189413118, -117.94001148471958, -66.13425776069231, -71.57754257726242, -151.69115131950676, -80.13258218421906, -156.9033297559804, 38.2782108733798, -135.83846803271797, -71.94106029613754], 18.909234698987632))
[Thread 1] Total splits: 0
Processed 1 zonotopes (Work Done: 0.0%); Generated 0 (0.213487297s/loop)
[Thread 1] Finished in 0.21s
 ────────────────────────────────────────────────────────────────────────────────
                                        Time                    Allocations      
                               ───────────────────────   ────────────────────────
       Tot / % measured:            216ms / 100.0%            130MiB / 100.0%    

 Section               ncalls     time    %tot     avg     alloc    %tot      avg
 ────────────────────────────────────────────────────────────────────────────────
 Verify                     1    214ms   99.0%   214ms    120MiB   92.4%   120MiB
   Zonotope Loop            1    213ms   99.0%   213ms    120MiB   92.4%   120MiB
     Zonotope Propa...      1    186ms   86.3%   186ms   98.6MiB   75.9%  98.6MiB
       DiffZonotope...      2    128ms   59.5%  64.1ms   85.1MiB   65.5%  42.5MiB
         Zonotope_R...      4    127ms   59.1%  31.8ms   85.0MiB   65.4%  21.2MiB
           Column M...      4   71.0ms   32.9%  17.7ms   15.9MiB   12.2%  3.98MiB
           Influenc...      4   49.5ms   22.9%  12.4ms   53.0MiB   40.8%  13.3MiB
             Multiply       4   34.8ms   16.1%  8.70ms   28.7MiB   22.1%  7.17MiB
             Alloca...      4   11.4ms    5.3%  2.85ms   24.4MiB   18.8%  6.09MiB
             Set Ma...      4   3.26ms    1.5%   816μs     0.00B    0.0%    0.00B
           Allocation       4   4.75ms    2.2%  1.19ms   15.9MiB   12.2%  3.98MiB
           Set Matrix       4   2.01ms    0.9%   503μs   18.9KiB    0.0%  4.72KiB
           Vectors          4    133μs    0.1%  33.2μs    100KiB    0.1%  25.0KiB
           Bounds           4   2.25μs    0.0%   563ns     0.00B    0.0%    0.00B
       DiffZonotope...      3   57.7ms   26.8%  19.2ms   13.5MiB   10.4%  4.52MiB
         Zonotope_D...      6   57.7ms   26.8%  9.62ms   13.5MiB   10.4%  2.26MiB
     Property Check         1   1.70ms    0.8%  1.70ms    338KiB    0.3%   338KiB
 Initialize                 1   2.15ms    1.0%  2.15ms   9.84MiB    7.6%  9.84MiB
 ────────────────────────────────────────────────────────────────────────────────
[VERYDIFF_TIMER] 0.247781688

[VERYDIFF_EXPERIMENT] Running on /home/i57/steuber/NeuroDiff/repos/VeryDiffExperiments/src/../benchmarks/mnist-prune/specs/mnist_60_global_6.vnnlib /home/i57/steuber/NeuroDiff/repos/VeryDiffExperiments/src/../benchmarks/mnist-prune/nets/mnist_relu_3_100.onnx
Found input X
op: matmul, weight: (100, 784), bias: nothing
op: bias, weight: nothing, bias: (100,)
op: relu, weight: nothing, bias: nothing
op: matmul, weight: (100, 100), bias: nothing
op: bias, weight: nothing, bias: (100,)
op: relu, weight: nothing, bias: nothing
op: matmul, weight: (10, 100), bias: nothing
op: bias, weight: nothing, bias: (10,)
op: relu, weight: nothing, bias: nothing
op: matmul, weight: (10, 10), bias: nothing
op: bias, weight: nothing, bias: (10,)
Found input X
op: matmul, weight: (100, 784), bias: nothing
op: bias, weight: nothing, bias: (100,)
op: relu, weight: nothing, bias: nothing
op: matmul, weight: (100, 100), bias: nothing
op: bias, weight: nothing, bias: (100,)
op: relu, weight: nothing, bias: nothing
op: matmul, weight: (10, 100), bias: nothing
op: bias, weight: nothing, bias: (10,)
op: relu, weight: nothing, bias: nothing
op: matmul, weight: (10, 10), bias: nothing
op: bias, weight: nothing, bias: (10,)
Distance: 296.6600370998244
Distance: 77.24290861755458
Distance: 5.7170369567975285
Distance: 0.0
Running with 1 threads
[Thread 1] Time to first task: 0.0s
Zono Bounds:
[0.0, 0.0, 0.0, 0.0, 0.0, 0.0, 0.0, 0.0, 0.0, 0.0, 0.0, 0.0, 0.0, 0.0, 0.0, 0.0, 0.0, 0.0, 0.0, 0.0, 0.0, 0.0, 0.0, 0.0, 0.0, 0.0, 0.0, 0.0, 0.0, 0.0, 0.0, 0.0, 0.0, 0.0, 0.0, 0.0, 0.0, 0.0, 0.0, 0.0, 0.0, 0.0, 0.0, 0.0, 0.0, 0.0, 0.0, 0.0, 0.0, 0.0, 0.0, 0.0, 0.0, 0.0, 0.0, 0.0, 0.0, 0.0, 0.0, 0.0, 0.0, 0.0, 0.0, 0.0, 0.0, 0.0, 0.0, 0.0, 0.0, 0.0, 0.0, 0.0, 0.0, 0.0, 0.0, 0.0, 0.0, 0.0, 0.0, 0.0, 0.0, 0.0, 0.0, 0.0, 0.0, 0.0, 0.0, 0.0, 0.0, 0.0, 0.0, 0.0, 0.0, 0.0, 0.0, 0.0, 0.0, 0.0, 0.0, 0.0, 0.0, 0.0, 0.0, 0.0, 0.0, 0.0, 0.0, 0.0, 0.0, 0.0, 0.0, 0.0, 0.0, 0.0, 0.0, 0.0, 0.0, 0.0, 0.0, 0.0, 0.0, 0.0, 0.0, 0.0, 0.0, 0.0, 0.0, 0.0, 0.0, 0.0, 0.0, 0.0, 0.0, 0.0, 0.0, 0.0, 0.0, 0.0, 0.0, 0.0, 0.0, 0.0, 0.0, 0.0, 0.0, 0.0, 0.0, 0.0, 0.0, 0.0, 0.0, 0.0, 0.0, 0.0, 0.0, 0.0, 0.0, 0.0, 0.0, 0.0, 0.0, 0.0, 0.0, 0.0, 0.0, 0.0, 0.0, 0.0, 0.0, 0.0, 0.0, 0.0, 0.0, 0.0, 0.0, 0.0, 0.0, 0.0, 0.0, 0.0, 0.0, 0.0, 0.0, 0.0, 0.0, 0.0, 0.0, 0.0, 0.0, 0.0, 0.0, 0.0, 0.0, 0.0, 0.0, 0.0, 0.0, 0.0, 0.0, 0.0, 0.0, 0.0, 0.0, 0.0, 0.0, 0.0, 0.0, 0.0, 0.0, 0.0, 0.0, 0.0, 0.0, 0.0, 0.0, 0.0, 0.0, 0.0, 0.0, 0.0, 0.0, 0.0, 0.0, 0.0, 0.0, 0.0, 0.0, 0.0, 0.0, 0.0, 0.0, 0.0, 0.0, 0.0, 0.0, 0.0, 0.0, 0.0, 0.0, 0.0, 0.0, 0.0, 0.0, 0.0, 0.0, 0.0, 0.0, 0.0, 0.0, 0.0, 0.0, 0.0, 0.0, 0.0, 0.0, 0.0, 0.0, 0.0, 0.0, 0.0, 0.0, 0.0, 0.0, 0.0, 0.0, 0.0, 0.0, 0.0, 0.0, 0.0, 0.0, 0.0, 0.0, 0.0, 0.0, 0.0, 0.0, 0.0, 0.0, 0.0, 0.0, 0.0, 0.0, 0.0, 0.0, 0.0, 0.0, 0.0, 0.0, 0.0, 0.0, 0.0, 0.0, 0.0, 0.0, 0.0, 0.0, 0.0, 0.0, 0.0, 0.0, 0.0, 0.0, 0.0, 0.0, 0.0, 0.0, 0.0, 0.0, 0.0, 0.0, 0.0, 0.0, 0.0, 0.0, 0.0, 0.0, 0.0, 0.0, 0.0, 0.0, 0.0, 0.0, 0.0, 0.0, 0.0, 0.0, 0.0, 0.0, 0.0, 0.0, 0.0, 0.0, 0.0, 0.0, 0.0, 0.0, 0.0, 0.0, 0.0, 0.0, 0.0, 0.0, 0.0, 0.0, 0.0, 0.0, 0.0, 0.0, 0.0, 0.0, 0.0, 0.0, 0.0, 0.0, 0.0, 0.0, 0.0, 0.0, 0.0, 0.0, 0.0, 0.0, 0.0, 0.0, 0.0, 0.0, 0.0, 0.0, 0.0, 0.0, 0.0, 0.0, 0.0, 0.0, 0.0, 0.0, 0.0, 0.0, 0.0, 0.0, 0.0, 0.0, 0.0, 0.0, 0.0, 0.0, 0.0, 0.0, 0.0, 0.0, 0.0, 0.0, 0.0, 0.0, 0.0, 0.0, 0.0, 0.0, 0.0, 0.0, 0.0, 0.0, 0.0, 0.0, 0.0, 0.0, 0.0, 0.0, 0.0, 0.0, 0.0, 0.0, 0.0, 0.0, 0.0, 0.0, 0.0, 0.0, 0.0, 0.0, 0.0, 0.0, 0.0, 0.0, 0.0, 0.0, 0.0, 0.0, 0.0, 0.0, 0.0, 0.0, 0.0, 0.0, 0.0, 0.0, 0.0, 0.0, 0.0, 0.0, 0.0, 0.0, 0.0, 0.0, 0.0, 0.0, 0.0, 0.0, 0.0, 0.0, 0.0, 0.0, 0.0, 0.0, 0.0, 0.0, 0.0, 0.0, 0.0, 0.0, 0.0, 0.0, 0.0, 0.0, 0.0, 0.0, 0.0, 0.0, 0.0, 0.0, 0.0, 0.0, 0.0, 0.0, 0.0, 0.0, 0.0, 0.0, 0.0, 0.0, 0.0, 0.0, 0.0, 0.0, 0.0, 0.0, 0.0, 0.0, 0.0, 0.0, 0.0, 0.0, 0.0, 0.0, 0.0, 0.0, 0.0, 0.0, 0.0, 0.0, 0.0, 0.0, 0.0, 0.0, 0.0, 0.0, 0.0, 0.0, 0.0, 0.0, 0.0, 0.0, 0.0, 0.0, 0.0, 0.0, 0.0, 0.0, 0.0, 0.0, 0.0, 0.0, 0.0, 0.0, 0.0, 0.0, 0.0, 0.0, 0.0, 0.0, 0.0, 0.0, 0.0, 0.0, 0.0, 0.0, 0.0, 0.0, 0.0, 0.0, 0.0, 0.0, 0.0, 0.0, 0.0, 0.0, 0.0, 0.0, 0.0, 0.0, 0.0, 0.0, 0.0, 0.0, 0.0, 0.0, 0.0, 0.0, 0.0, 0.0, 0.0, 0.0, 0.0, 0.0, 0.0, 0.0, 0.0, 0.0, 0.0, 0.0, 0.0, 0.0, 0.0, 0.0, 0.0, 0.0, 0.0, 0.0, 0.0, 0.0, 0.0, 0.0, 0.0, 0.0, 0.0, 0.0, 0.0, 0.0, 0.0, 0.0, 0.0, 0.0, 0.0, 0.0, 0.0, 0.0, 0.0, 0.0, 0.0, 0.0, 0.0, 0.0, 0.0, 0.0, 0.0, 0.0, 0.0, 0.0, 0.0, 0.0, 0.0, 0.0, 0.0, 0.0, 0.0, 0.0, 0.0, 0.0, 0.0, 0.0, 0.0, 0.0, 0.0, 0.0, 0.0, 0.0, 0.0, 0.0, 0.0, 0.0, 0.0, 0.0, 0.0, 0.0, 0.0, 0.0, 0.0, 0.0, 0.0, 0.0, 0.0, 0.0, 0.0, 0.0, 0.0, 0.0, 0.0, 0.0, 0.0, 0.0, 0.0, 0.0, 0.0, 0.0, 0.0, 0.0, 0.0, 0.0, 0.0, 0.0, 0.0, 0.0, 0.0, 0.0, 0.0, 0.0, 0.0, 0.0, 0.0, 0.0, 0.0, 0.0, 0.0, 0.0, 0.0, 0.0, 0.0, 0.0, 0.0, 0.0, 0.0, 0.0, 0.0, 0.0, 0.0, 0.0, 0.0, 0.0, 0.0, 0.0, 0.0, 0.0, 0.0, 0.0, 0.0, 0.0, 0.0, 0.0, 0.0, 0.0, 0.0, 0.0, 0.0, 0.0, 0.0, 0.0, 0.0, 0.0, 0.0, 0.0, 0.0, 0.0, 0.0, 0.0, 0.0, 0.0, 0.0, 0.0, 0.0, 0.0, 0.0, 0.0, 0.0, 0.0, 0.0, 0.0, 0.0, 0.0, 0.0, 0.0, 0.0, 0.0, 0.0, 0.0, 0.0, 0.0, 0.0, 0.0, 0.0, 0.0, 0.0, 0.0, 0.0, 0.0, 0.0, 0.0, 0.0, 0.0, 0.0, 0.0, 0.0, 0.0, 0.0, 0.0, 0.0, 0.0, 0.0, 0.0, 0.0, 0.0, 0.0, 0.0, 0.0, 0.0, 0.0, 0.0, 0.0, 0.0, 0.0, 0.0, 0.0, 0.0, 0.0, 0.0, 0.0, 0.0, 0.0, 0.0, 0.0, 0.0, 0.0, 0.0, 0.0]
[0.0, 0.0, 0.0, 0.0, 0.0, 0.0, 0.0, 0.0, 0.0, 0.0, 0.0, 0.0, 0.0, 0.0, 0.0, 0.0, 0.0, 0.0, 0.0, 0.0, 0.0, 0.0, 0.0, 0.0, 0.0, 0.0, 0.0, 0.0, 0.0, 0.0, 0.0, 0.0, 0.0, 0.0, 0.0, 0.0, 0.0, 0.0, 0.0, 0.0, 0.0, 0.0, 0.0, 0.0, 0.0, 0.0, 0.0, 0.0, 0.0, 0.0, 0.0, 0.0, 0.0, 0.0, 0.0, 0.0, 0.0, 0.0, 0.0, 0.0, 0.0, 0.0, 0.0, 0.0, 0.0, 0.0, 0.0, 0.0, 0.0, 0.0, 0.0, 0.0, 0.0, 0.0, 0.0, 0.0, 0.0, 0.0, 0.0, 0.0, 0.0, 0.0, 0.0, 0.0, 0.0, 0.0, 0.0, 0.0, 0.0, 0.0, 0.0, 0.0, 0.0, 0.0, 0.0, 0.0, 0.0, 0.0, 0.0, 0.0, 0.0, 0.0, 0.0, 0.0, 0.0, 0.0, 0.0, 0.0, 0.0, 0.0, 0.0, 0.0, 0.0, 0.0, 0.0, 0.0, 0.0, 0.0, 0.0, 0.0, 0.0, 0.0, 0.0, 0.0, 0.0, 0.0, 0.0, 0.0, 0.0, 0.0, 0.0, 0.0, 0.0, 0.0, 0.0, 0.0, 0.0, 0.0, 0.0, 0.0, 0.0, 0.0, 0.0, 0.0, 0.0, 0.0, 0.0, 0.0, 0.0, 0.0, 0.0, 0.0, 0.0, 0.0, 0.0, 0.0, 0.0, 0.0, 0.0, 0.0, 0.0, 0.0, 0.0, 0.0, 0.0, 0.0, 0.0, 0.0, 0.0, 0.0, 0.0, 0.0, 0.0, 0.0, 0.0, 0.0, 0.0, 0.0, 0.0, 0.0, 0.0, 0.0, 0.0, 0.0, 0.0, 0.0, 0.0, 0.0, 0.0, 0.0, 0.0, 0.0, 0.0, 0.0, 0.0, 0.0, 0.0, 0.0, 0.0, 0.0, 0.0, 0.0, 0.0, 0.0, 0.0, 0.0, 0.0, 0.0, 0.0, 0.0, 0.0, 0.0, 0.0, 0.0, 0.0, 0.0, 0.0, 0.0, 0.0, 0.0, 0.0, 0.0, 0.0, 0.0, 0.0, 0.0, 0.0, 0.0, 0.0, 0.0, 0.0, 0.0, 0.0, 0.0, 0.0, 0.0, 0.0, 0.0, 0.0, 0.0, 0.0, 0.0, 0.0, 0.0, 0.0, 0.0, 0.0, 0.0, 0.0, 0.0, 0.0, 0.0, 0.0, 0.0, 0.0, 0.0, 0.0, 0.0, 0.0, 0.0, 0.0, 0.0, 0.0, 0.0, 0.0, 0.0, 0.0, 0.0, 0.0, 0.0, 0.0, 0.0, 0.0, 0.0, 0.0, 0.0, 0.0, 0.0, 0.0, 0.0, 0.0, 0.0, 0.0, 0.0, 0.0, 0.0, 0.0, 0.0, 0.0, 0.0, 0.0, 0.0, 0.0, 0.0, 0.0, 0.0, 0.0, 0.0, 0.0, 0.0, 0.0, 0.0, 0.0, 0.0, 0.0, 0.0, 0.0, 0.0, 0.0, 0.0, 0.0, 0.0, 0.0, 0.0, 0.0, 0.0, 0.0, 0.0, 0.0, 0.0, 0.0, 0.0, 0.0, 0.0, 0.0, 0.0, 0.0, 0.0, 0.0, 0.0, 0.0, 0.0, 0.0, 0.0, 0.0, 0.0, 0.0, 0.0, 0.0, 0.0, 0.0, 0.0, 0.0, 0.0, 0.0, 0.0, 0.0, 0.0, 0.0, 0.0, 0.0, 0.0, 0.0, 0.0, 0.0, 0.0, 0.0, 0.0, 0.0, 0.0, 0.0, 0.0, 0.0, 0.0, 0.0, 0.0, 0.0, 0.0, 0.0, 0.0, 0.0, 0.0, 0.0, 0.0, 0.0, 0.0, 0.0, 0.0, 0.0, 0.0, 0.0, 0.0, 0.0, 0.0, 0.0, 0.0, 0.0, 0.0, 0.0, 0.0, 0.0, 0.0, 0.0, 0.0, 0.0, 0.0, 0.0, 0.0, 0.0, 0.0, 0.0, 0.0, 0.0, 0.0, 0.0, 0.0, 0.0, 0.0, 0.0, 0.0, 0.0, 0.0, 0.0, 0.0, 0.0, 0.0, 0.0, 0.0, 0.0, 0.0, 0.0, 0.0, 0.0, 0.0, 0.0, 0.0, 0.0, 0.0, 0.0, 0.0, 0.0, 0.0, 0.0, 0.0, 0.0, 0.0, 0.0, 0.0, 0.0, 0.0, 0.0, 0.0, 0.0, 0.0, 0.0, 0.0, 0.0, 0.0, 0.0, 0.0, 0.0, 0.0, 0.0, 0.0, 0.0, 0.0, 0.0, 0.0, 0.0, 0.0, 0.0, 0.0, 0.0, 0.0, 0.0, 0.0, 0.0, 0.0, 0.0, 0.0, 0.0, 0.0, 0.0, 0.0, 0.0, 0.0, 0.0, 0.0, 0.0, 0.0, 0.0, 0.0, 0.0, 0.0, 0.0, 0.0, 0.0, 0.0, 0.0, 0.0, 0.0, 0.0, 0.0, 0.0, 0.0, 0.0, 0.0, 0.0, 0.0, 0.0, 0.0, 0.0, 0.0, 0.0, 0.0, 0.0, 0.0, 0.0, 0.0, 0.0, 0.0, 0.0, 0.0, 0.0, 0.0, 0.0, 0.0, 0.0, 0.0, 0.0, 0.0, 0.0, 0.0, 0.0, 0.0, 0.0, 0.0, 0.0, 0.0, 0.0, 0.0, 0.0, 0.0, 0.0, 0.0, 0.0, 0.0, 0.0, 0.0, 0.0, 0.0, 0.0, 0.0, 0.0, 0.0, 0.0, 0.0, 0.0, 0.0, 0.0, 0.0, 0.0, 0.0, 0.0, 0.0, 0.0, 0.0, 0.0, 0.0, 0.0, 0.0, 0.0, 0.0, 0.0, 0.0, 0.0, 0.0, 0.0, 0.0, 0.0, 0.0, 0.0, 0.0, 0.0, 0.0, 0.0, 0.0, 0.0, 0.0, 0.0, 0.0, 0.0, 0.0, 0.0, 0.0, 0.0, 0.0, 0.0, 0.0, 0.0, 0.0, 0.0, 0.0, 0.0, 0.0, 0.0, 0.0, 0.0, 0.0, 0.0, 0.0, 0.0, 0.0, 0.0, 0.0, 0.0, 0.0, 0.0, 0.0, 0.0, 0.0, 0.0, 0.0, 0.0, 0.0, 0.0, 0.0, 0.0, 0.0, 0.0, 0.0, 0.0, 0.0, 0.0, 0.0, 0.0, 0.0, 0.0, 0.0, 0.0, 0.0, 0.0, 0.0, 0.0, 0.0, 0.0, 0.0, 0.0, 0.0, 0.0, 0.0, 0.0, 0.0, 0.0, 0.0, 0.0, 0.0, 0.0, 0.0, 0.0, 0.0, 0.0, 0.0, 0.0, 0.0, 0.0, 0.0, 0.0, 0.0, 0.0, 0.0, 0.0, 0.0, 0.0, 0.0, 0.0, 0.0, 0.0, 0.0, 0.0, 0.0, 0.0, 0.0, 0.0, 0.0, 0.0, 0.0, 0.0, 0.0, 0.0, 0.0, 0.0, 0.0, 0.0, 0.0, 0.0, 0.0, 0.0, 0.0, 0.0, 0.0, 0.0, 0.0, 0.0, 0.0, 0.0, 0.0, 0.0, 0.0, 0.0, 0.0, 0.0, 0.0, 0.0, 0.0, 0.0, 0.0, 0.0, 0.0, 0.0, 0.0, 0.0, 0.0, 0.0, 0.0, 0.0, 0.0, 0.0, 0.0, 0.0, 0.0, 0.0, 0.0, 0.0, 0.0, 0.0, 0.0, 0.0, 0.0, 0.0, 0.0, 0.0, 0.0, 0.0, 0.0, 0.0, 0.0, 0.0, 0.0, 0.0, 0.0, 0.0, 0.0, 0.0, 0.0, 0.0, 0.0, 0.0, 0.0, 0.0, 0.0, 0.0, 0.0, 0.0, 0.0, 0.0, 0.0, 0.0, 0.0, 0.0, 0.0, 0.0, 0.0, 0.0, 0.0, 0.0, 0.0, 0.0, 0.0, 0.0, 0.0, 0.0, 0.0, 0.0, 0.0, 0.0, 0.0, 0.0, 0.0, 0.0, 0.0, 0.0, 0.0, 0.0]
[Thread 1] Processed 100 zonotopes (Work Done: 0.0%; Expected Zonos: Inf)
[Thread 1] Processed 200 zonotopes (Work Done: 0.0%; Expected Zonos: Inf)
[Thread 1] Processed 300 zonotopes (Work Done: 0.0%; Expected Zonos: Inf)
[Thread 1] Processed 400 zonotopes (Work Done: 0.0%; Expected Zonos: Inf)
[Thread 1] Processed 500 zonotopes (Work Done: 0.0%; Expected Zonos: Inf)
[Thread 1] Processed 600 zonotopes (Work Done: 0.0%; Expected Zonos: Inf)


TIMEOUT REACHED
UNKNOWN
[Thread 1] Total splits: 602
Processed 602 zonotopes (Work Done: 0.0%); Generated 1204 (0.1995871603770764s/loop)
[Thread 1] Finished in 120.15s
 ────────────────────────────────────────────────────────────────────────────────
                                        Time                    Allocations      
                               ───────────────────────   ────────────────────────
       Tot / % measured:             120s / 100.0%           61.7GiB / 100.0%    

 Section               ncalls     time    %tot     avg     alloc    %tot      avg
 ────────────────────────────────────────────────────────────────────────────────
 Verify                     1     120s  100.0%    120s   61.7GiB  100.0%  61.7GiB
   Zonotope Loop            1     120s  100.0%    120s   61.7GiB  100.0%  61.7GiB
     Zonotope Propa...    602    71.8s   59.8%   119ms   40.9GiB   66.2%  69.6MiB
       DiffZonotope...  1.81k    63.6s   52.9%  35.2ms   39.3GiB   63.7%  22.3MiB
         Zonotope_R...  3.61k    63.5s   52.8%  17.6ms   39.3GiB   63.6%  11.1MiB
           Influenc...  3.61k    62.6s   52.1%  17.3ms   36.1GiB   58.5%  10.2MiB
             Multiply   3.61k    37.1s   30.8%  10.3ms   18.3GiB   29.7%  5.20MiB
             Alloca...  3.61k    22.9s   19.1%  6.34ms   17.8GiB   28.8%  5.05MiB
             Set Ma...  3.61k    2.66s    2.2%   735μs     0.00B    0.0%    0.00B
           Column M...  3.61k    505ms    0.4%   140μs   1.58GiB    2.6%   458KiB
           Set Matrix   3.61k    203ms    0.2%  56.3μs   3.11MiB    0.0%     902B
           Allocation   3.61k   97.5ms    0.1%  27.0μs   1.58GiB    2.6%   458KiB
           Vectors      3.61k   18.2ms    0.0%  5.04μs   11.5MiB    0.0%  3.26KiB
           Bounds       3.61k   1.92ms    0.0%   530ns     0.00B    0.0%    0.00B
       DiffZonotope...  2.41k    8.22s    6.8%  3.41ms   1.60GiB    2.6%   696KiB
         Zonotope_D...  4.82k    8.21s    6.8%  1.71ms   1.60GiB    2.6%   348KiB
     Compute Split        602    14.9s   12.4%  24.8ms   8.99GiB   14.6%  15.3MiB
     Property Check       602    137ms    0.1%   227μs    123MiB    0.2%   210KiB
 Initialize                 1    562μs    0.0%   562μs   5.41MiB    0.0%  5.41MiB
 ────────────────────────────────────────────────────────────────────────────────
[VERYDIFF_TIMER] 120.180826731

[VERYDIFF_EXPERIMENT] Running on /home/i57/steuber/NeuroDiff/repos/VeryDiffExperiments/src/../benchmarks/mnist-prune/specs/mnist_60_global_6.vnnlib /home/i57/steuber/NeuroDiff/repos/VeryDiffExperiments/src/../benchmarks/mnist-prune/nets/mnist_relu_4_1024.onnx
Found input X
op: matmul, weight: (1024, 784), bias: nothing
op: bias, weight: nothing, bias: (1024,)
op: relu, weight: nothing, bias: nothing
op: matmul, weight: (1024, 1024), bias: nothing
op: bias, weight: nothing, bias: (1024,)
op: relu, weight: nothing, bias: nothing
op: matmul, weight: (1024, 1024), bias: nothing
op: bias, weight: nothing, bias: (1024,)
op: relu, weight: nothing, bias: nothing
op: matmul, weight: (10, 1024), bias: nothing
op: bias, weight: nothing, bias: (10,)
op: relu, weight: nothing, bias: nothing
op: matmul, weight: (10, 10), bias: nothing
op: bias, weight: nothing, bias: (10,)
Found input X
op: matmul, weight: (1024, 784), bias: nothing
op: bias, weight: nothing, bias: (1024,)
op: relu, weight: nothing, bias: nothing
op: matmul, weight: (1024, 1024), bias: nothing
op: bias, weight: nothing, bias: (1024,)
op: relu, weight: nothing, bias: nothing
op: matmul, weight: (1024, 1024), bias: nothing
op: bias, weight: nothing, bias: (1024,)
op: relu, weight: nothing, bias: nothing
op: matmul, weight: (10, 1024), bias: nothing
op: bias, weight: nothing, bias: (10,)
op: relu, weight: nothing, bias: nothing
op: matmul, weight: (10, 10), bias: nothing
op: bias, weight: nothing, bias: (10,)
Distance: 1266.8815759184893
Distance: 2876.6944248261216
Distance: 2831.8843567411013
Distance: 34.033756025192815
Distance: 0.0
Running with 1 threads
[Thread 1] Time to first task: 0.01s
Zono Bounds:
[0.0, 0.0, 0.0, 0.0, 0.0, 0.0, 0.0, 0.0, 0.0, 0.0, 0.0, 0.0, 0.0, 0.0, 0.0, 0.0, 0.0, 0.0, 0.0, 0.0, 0.0, 0.0, 0.0, 0.0, 0.0, 0.0, 0.0, 0.0, 0.0, 0.0, 0.0, 0.0, 0.0, 0.0, 0.0, 0.0, 0.0, 0.0, 0.0, 0.0, 0.0, 0.0, 0.0, 0.0, 0.0, 0.0, 0.0, 0.0, 0.0, 0.0, 0.0, 0.0, 0.0, 0.0, 0.0, 0.0, 0.0, 0.0, 0.0, 0.0, 0.0, 0.0, 0.0, 0.0, 0.0, 0.0, 0.0, 0.0, 0.0, 0.0, 0.0, 0.0, 0.0, 0.0, 0.0, 0.0, 0.0, 0.0, 0.0, 0.0, 0.0, 0.0, 0.0, 0.0, 0.0, 0.0, 0.0, 0.0, 0.0, 0.0, 0.0, 0.0, 0.0, 0.0, 0.0, 0.0, 0.0, 0.0, 0.0, 0.0, 0.0, 0.0, 0.0, 0.0, 0.0, 0.0, 0.0, 0.0, 0.0, 0.0, 0.0, 0.0, 0.0, 0.0, 0.0, 0.0, 0.0, 0.0, 0.0, 0.0, 0.0, 0.0, 0.0, 0.0, 0.0, 0.0, 0.0, 0.0, 0.0, 0.0, 0.0, 0.0, 0.0, 0.0, 0.0, 0.0, 0.0, 0.0, 0.0, 0.0, 0.0, 0.0, 0.0, 0.0, 0.0, 0.0, 0.0, 0.0, 0.0, 0.0, 0.0, 0.0, 0.0, 0.0, 0.0, 0.0, 0.0, 0.0, 0.0, 0.0, 0.0, 0.0, 0.0, 0.0, 0.0, 0.0, 0.0, 0.0, 0.0, 0.0, 0.0, 0.0, 0.0, 0.0, 0.0, 0.0, 0.0, 0.0, 0.0, 0.0, 0.0, 0.0, 0.0, 0.0, 0.0, 0.0, 0.0, 0.0, 0.0, 0.0, 0.0, 0.0, 0.0, 0.0, 0.0, 0.0, 0.0, 0.0, 0.0, 0.0, 0.0, 0.0, 0.0, 0.0, 0.0, 0.0, 0.0, 0.0, 0.0, 0.0, 0.0, 0.0, 0.0, 0.0, 0.0, 0.0, 0.0, 0.0, 0.0, 0.0, 0.0, 0.0, 0.0, 0.0, 0.0, 0.0, 0.0, 0.0, 0.0, 0.0, 0.0, 0.0, 0.0, 0.0, 0.0, 0.0, 0.0, 0.0, 0.0, 0.0, 0.0, 0.0, 0.0, 0.0, 0.0, 0.0, 0.0, 0.0, 0.0, 0.0, 0.0, 0.0, 0.0, 0.0, 0.0, 0.0, 0.0, 0.0, 0.0, 0.0, 0.0, 0.0, 0.0, 0.0, 0.0, 0.0, 0.0, 0.0, 0.0, 0.0, 0.0, 0.0, 0.0, 0.0, 0.0, 0.0, 0.0, 0.0, 0.0, 0.0, 0.0, 0.0, 0.0, 0.0, 0.0, 0.0, 0.0, 0.0, 0.0, 0.0, 0.0, 0.0, 0.0, 0.0, 0.0, 0.0, 0.0, 0.0, 0.0, 0.0, 0.0, 0.0, 0.0, 0.0, 0.0, 0.0, 0.0, 0.0, 0.0, 0.0, 0.0, 0.0, 0.0, 0.0, 0.0, 0.0, 0.0, 0.0, 0.0, 0.0, 0.0, 0.0, 0.0, 0.0, 0.0, 0.0, 0.0, 0.0, 0.0, 0.0, 0.0, 0.0, 0.0, 0.0, 0.0, 0.0, 0.0, 0.0, 0.0, 0.0, 0.0, 0.0, 0.0, 0.0, 0.0, 0.0, 0.0, 0.0, 0.0, 0.0, 0.0, 0.0, 0.0, 0.0, 0.0, 0.0, 0.0, 0.0, 0.0, 0.0, 0.0, 0.0, 0.0, 0.0, 0.0, 0.0, 0.0, 0.0, 0.0, 0.0, 0.0, 0.0, 0.0, 0.0, 0.0, 0.0, 0.0, 0.0, 0.0, 0.0, 0.0, 0.0, 0.0, 0.0, 0.0, 0.0, 0.0, 0.0, 0.0, 0.0, 0.0, 0.0, 0.0, 0.0, 0.0, 0.0, 0.0, 0.0, 0.0, 0.0, 0.0, 0.0, 0.0, 0.0, 0.0, 0.0, 0.0, 0.0, 0.0, 0.0, 0.0, 0.0, 0.0, 0.0, 0.0, 0.0, 0.0, 0.0, 0.0, 0.0, 0.0, 0.0, 0.0, 0.0, 0.0, 0.0, 0.0, 0.0, 0.0, 0.0, 0.0, 0.0, 0.0, 0.0, 0.0, 0.0, 0.0, 0.0, 0.0, 0.0, 0.0, 0.0, 0.0, 0.0, 0.0, 0.0, 0.0, 0.0, 0.0, 0.0, 0.0, 0.0, 0.0, 0.0, 0.0, 0.0, 0.0, 0.0, 0.0, 0.0, 0.0, 0.0, 0.0, 0.0, 0.0, 0.0, 0.0, 0.0, 0.0, 0.0, 0.0, 0.0, 0.0, 0.0, 0.0, 0.0, 0.0, 0.0, 0.0, 0.0, 0.0, 0.0, 0.0, 0.0, 0.0, 0.0, 0.0, 0.0, 0.0, 0.0, 0.0, 0.0, 0.0, 0.0, 0.0, 0.0, 0.0, 0.0, 0.0, 0.0, 0.0, 0.0, 0.0, 0.0, 0.0, 0.0, 0.0, 0.0, 0.0, 0.0, 0.0, 0.0, 0.0, 0.0, 0.0, 0.0, 0.0, 0.0, 0.0, 0.0, 0.0, 0.0, 0.0, 0.0, 0.0, 0.0, 0.0, 0.0, 0.0, 0.0, 0.0, 0.0, 0.0, 0.0, 0.0, 0.0, 0.0, 0.0, 0.0, 0.0, 0.0, 0.0, 0.0, 0.0, 0.0, 0.0, 0.0, 0.0, 0.0, 0.0, 0.0, 0.0, 0.0, 0.0, 0.0, 0.0, 0.0, 0.0, 0.0, 0.0, 0.0, 0.0, 0.0, 0.0, 0.0, 0.0, 0.0, 0.0, 0.0, 0.0, 0.0, 0.0, 0.0, 0.0, 0.0, 0.0, 0.0, 0.0, 0.0, 0.0, 0.0, 0.0, 0.0, 0.0, 0.0, 0.0, 0.0, 0.0, 0.0, 0.0, 0.0, 0.0, 0.0, 0.0, 0.0, 0.0, 0.0, 0.0, 0.0, 0.0, 0.0, 0.0, 0.0, 0.0, 0.0, 0.0, 0.0, 0.0, 0.0, 0.0, 0.0, 0.0, 0.0, 0.0, 0.0, 0.0, 0.0, 0.0, 0.0, 0.0, 0.0, 0.0, 0.0, 0.0, 0.0, 0.0, 0.0, 0.0, 0.0, 0.0, 0.0, 0.0, 0.0, 0.0, 0.0, 0.0, 0.0, 0.0, 0.0, 0.0, 0.0, 0.0, 0.0, 0.0, 0.0, 0.0, 0.0, 0.0, 0.0, 0.0, 0.0, 0.0, 0.0, 0.0, 0.0, 0.0, 0.0, 0.0, 0.0, 0.0, 0.0, 0.0, 0.0, 0.0, 0.0, 0.0, 0.0, 0.0, 0.0, 0.0, 0.0, 0.0, 0.0, 0.0, 0.0, 0.0, 0.0, 0.0, 0.0, 0.0, 0.0, 0.0, 0.0, 0.0, 0.0, 0.0, 0.0, 0.0, 0.0, 0.0, 0.0, 0.0, 0.0, 0.0, 0.0, 0.0, 0.0, 0.0, 0.0, 0.0, 0.0, 0.0, 0.0, 0.0, 0.0, 0.0, 0.0, 0.0, 0.0, 0.0, 0.0, 0.0, 0.0, 0.0, 0.0, 0.0, 0.0, 0.0, 0.0, 0.0, 0.0, 0.0, 0.0, 0.0, 0.0, 0.0, 0.0, 0.0, 0.0, 0.0, 0.0, 0.0, 0.0, 0.0, 0.0, 0.0, 0.0, 0.0, 0.0, 0.0, 0.0, 0.0, 0.0, 0.0, 0.0, 0.0, 0.0, 0.0, 0.0, 0.0, 0.0, 0.0, 0.0, 0.0, 0.0, 0.0, 0.0, 0.0, 0.0, 0.0, 0.0, 0.0, 0.0, 0.0, 0.0, 0.0, 0.0, 0.0, 0.0, 0.0, 0.0, 0.0, 0.0, 0.0, 0.0, 0.0, 0.0, 0.0, 0.0, 0.0, 0.0, 0.0, 0.0, 0.0]
[0.0, 0.0, 0.0, 0.0, 0.0, 0.0, 0.0, 0.0, 0.0, 0.0, 0.0, 0.0, 0.0, 0.0, 0.0, 0.0, 0.0, 0.0, 0.0, 0.0, 0.0, 0.0, 0.0, 0.0, 0.0, 0.0, 0.0, 0.0, 0.0, 0.0, 0.0, 0.0, 0.0, 0.0, 0.0, 0.0, 0.0, 0.0, 0.0, 0.0, 0.0, 0.0, 0.0, 0.0, 0.0, 0.0, 0.0, 0.0, 0.0, 0.0, 0.0, 0.0, 0.0, 0.0, 0.0, 0.0, 0.0, 0.0, 0.0, 0.0, 0.0, 0.0, 0.0, 0.0, 0.0, 0.0, 0.0, 0.0, 0.0, 0.0, 0.0, 0.0, 0.0, 0.0, 0.0, 0.0, 0.0, 0.0, 0.0, 0.0, 0.0, 0.0, 0.0, 0.0, 0.0, 0.0, 0.0, 0.0, 0.0, 0.0, 0.0, 0.0, 0.0, 0.0, 0.0, 0.0, 0.0, 0.0, 0.0, 0.0, 0.0, 0.0, 0.0, 0.0, 0.0, 0.0, 0.0, 0.0, 0.0, 0.0, 0.0, 0.0, 0.0, 0.0, 0.0, 0.0, 0.0, 0.0, 0.0, 0.0, 0.0, 0.0, 0.0, 0.0, 0.0, 0.0, 0.0, 0.0, 0.0, 0.0, 0.0, 0.0, 0.0, 0.0, 0.0, 0.0, 0.0, 0.0, 0.0, 0.0, 0.0, 0.0, 0.0, 0.0, 0.0, 0.0, 0.0, 0.0, 0.0, 0.0, 0.0, 0.0, 0.0, 0.0, 0.0, 0.0, 0.0, 0.0, 0.0, 0.0, 0.0, 0.0, 0.0, 0.0, 0.0, 0.0, 0.0, 0.0, 0.0, 0.0, 0.0, 0.0, 0.0, 0.0, 0.0, 0.0, 0.0, 0.0, 0.0, 0.0, 0.0, 0.0, 0.0, 0.0, 0.0, 0.0, 0.0, 0.0, 0.0, 0.0, 0.0, 0.0, 0.0, 0.0, 0.0, 0.0, 0.0, 0.0, 0.0, 0.0, 0.0, 0.0, 0.0, 0.0, 0.0, 0.0, 0.0, 0.0, 0.0, 0.0, 0.0, 0.0, 0.0, 0.0, 0.0, 0.0, 0.0, 0.0, 0.0, 0.0, 0.0, 0.0, 0.0, 0.0, 0.0, 0.0, 0.0, 0.0, 0.0, 0.0, 0.0, 0.0, 0.0, 0.0, 0.0, 0.0, 0.0, 0.0, 0.0, 0.0, 0.0, 0.0, 0.0, 0.0, 0.0, 0.0, 0.0, 0.0, 0.0, 0.0, 0.0, 0.0, 0.0, 0.0, 0.0, 0.0, 0.0, 0.0, 0.0, 0.0, 0.0, 0.0, 0.0, 0.0, 0.0, 0.0, 0.0, 0.0, 0.0, 0.0, 0.0, 0.0, 0.0, 0.0, 0.0, 0.0, 0.0, 0.0, 0.0, 0.0, 0.0, 0.0, 0.0, 0.0, 0.0, 0.0, 0.0, 0.0, 0.0, 0.0, 0.0, 0.0, 0.0, 0.0, 0.0, 0.0, 0.0, 0.0, 0.0, 0.0, 0.0, 0.0, 0.0, 0.0, 0.0, 0.0, 0.0, 0.0, 0.0, 0.0, 0.0, 0.0, 0.0, 0.0, 0.0, 0.0, 0.0, 0.0, 0.0, 0.0, 0.0, 0.0, 0.0, 0.0, 0.0, 0.0, 0.0, 0.0, 0.0, 0.0, 0.0, 0.0, 0.0, 0.0, 0.0, 0.0, 0.0, 0.0, 0.0, 0.0, 0.0, 0.0, 0.0, 0.0, 0.0, 0.0, 0.0, 0.0, 0.0, 0.0, 0.0, 0.0, 0.0, 0.0, 0.0, 0.0, 0.0, 0.0, 0.0, 0.0, 0.0, 0.0, 0.0, 0.0, 0.0, 0.0, 0.0, 0.0, 0.0, 0.0, 0.0, 0.0, 0.0, 0.0, 0.0, 0.0, 0.0, 0.0, 0.0, 0.0, 0.0, 0.0, 0.0, 0.0, 0.0, 0.0, 0.0, 0.0, 0.0, 0.0, 0.0, 0.0, 0.0, 0.0, 0.0, 0.0, 0.0, 0.0, 0.0, 0.0, 0.0, 0.0, 0.0, 0.0, 0.0, 0.0, 0.0, 0.0, 0.0, 0.0, 0.0, 0.0, 0.0, 0.0, 0.0, 0.0, 0.0, 0.0, 0.0, 0.0, 0.0, 0.0, 0.0, 0.0, 0.0, 0.0, 0.0, 0.0, 0.0, 0.0, 0.0, 0.0, 0.0, 0.0, 0.0, 0.0, 0.0, 0.0, 0.0, 0.0, 0.0, 0.0, 0.0, 0.0, 0.0, 0.0, 0.0, 0.0, 0.0, 0.0, 0.0, 0.0, 0.0, 0.0, 0.0, 0.0, 0.0, 0.0, 0.0, 0.0, 0.0, 0.0, 0.0, 0.0, 0.0, 0.0, 0.0, 0.0, 0.0, 0.0, 0.0, 0.0, 0.0, 0.0, 0.0, 0.0, 0.0, 0.0, 0.0, 0.0, 0.0, 0.0, 0.0, 0.0, 0.0, 0.0, 0.0, 0.0, 0.0, 0.0, 0.0, 0.0, 0.0, 0.0, 0.0, 0.0, 0.0, 0.0, 0.0, 0.0, 0.0, 0.0, 0.0, 0.0, 0.0, 0.0, 0.0, 0.0, 0.0, 0.0, 0.0, 0.0, 0.0, 0.0, 0.0, 0.0, 0.0, 0.0, 0.0, 0.0, 0.0, 0.0, 0.0, 0.0, 0.0, 0.0, 0.0, 0.0, 0.0, 0.0, 0.0, 0.0, 0.0, 0.0, 0.0, 0.0, 0.0, 0.0, 0.0, 0.0, 0.0, 0.0, 0.0, 0.0, 0.0, 0.0, 0.0, 0.0, 0.0, 0.0, 0.0, 0.0, 0.0, 0.0, 0.0, 0.0, 0.0, 0.0, 0.0, 0.0, 0.0, 0.0, 0.0, 0.0, 0.0, 0.0, 0.0, 0.0, 0.0, 0.0, 0.0, 0.0, 0.0, 0.0, 0.0, 0.0, 0.0, 0.0, 0.0, 0.0, 0.0, 0.0, 0.0, 0.0, 0.0, 0.0, 0.0, 0.0, 0.0, 0.0, 0.0, 0.0, 0.0, 0.0, 0.0, 0.0, 0.0, 0.0, 0.0, 0.0, 0.0, 0.0, 0.0, 0.0, 0.0, 0.0, 0.0, 0.0, 0.0, 0.0, 0.0, 0.0, 0.0, 0.0, 0.0, 0.0, 0.0, 0.0, 0.0, 0.0, 0.0, 0.0, 0.0, 0.0, 0.0, 0.0, 0.0, 0.0, 0.0, 0.0, 0.0, 0.0, 0.0, 0.0, 0.0, 0.0, 0.0, 0.0, 0.0, 0.0, 0.0, 0.0, 0.0, 0.0, 0.0, 0.0, 0.0, 0.0, 0.0, 0.0, 0.0, 0.0, 0.0, 0.0, 0.0, 0.0, 0.0, 0.0, 0.0, 0.0, 0.0, 0.0, 0.0, 0.0, 0.0, 0.0, 0.0, 0.0, 0.0, 0.0, 0.0, 0.0, 0.0, 0.0, 0.0, 0.0, 0.0, 0.0, 0.0, 0.0, 0.0, 0.0, 0.0, 0.0, 0.0, 0.0, 0.0, 0.0, 0.0, 0.0, 0.0, 0.0, 0.0, 0.0, 0.0, 0.0, 0.0, 0.0, 0.0, 0.0, 0.0, 0.0, 0.0, 0.0, 0.0, 0.0, 0.0, 0.0, 0.0, 0.0, 0.0, 0.0, 0.0, 0.0, 0.0, 0.0, 0.0, 0.0, 0.0, 0.0, 0.0, 0.0, 0.0, 0.0, 0.0, 0.0, 0.0, 0.0, 0.0, 0.0, 0.0, 0.0, 0.0, 0.0, 0.0, 0.0, 0.0, 0.0, 0.0, 0.0, 0.0, 0.0, 0.0, 0.0, 0.0, 0.0, 0.0, 0.0, 0.0, 0.0, 0.0, 0.0, 0.0, 0.0, 0.0, 0.0, 0.0, 0.0, 0.0, 0.0, 0.0, 0.0, 0.0, 0.0, 0.0, 0.0, 0.0, 0.0, 0.0, 0.0, 0.0, 0.0, 0.0, 0.0, 0.0, 0.0, 0.0, 0.0, 0.0, 0.0, 0.0, 0.0, 0.0, 0.0]

Found counterexample: ([0.011764705, 0.011764705, 0.011764705, 0.011764705, 0.011764705, 0.011764705, 0.011764705, 0.011764705, 0.011764705, 0.011764705, 0.011764705, 0.011764705, 0.011764705, 0.011764705, 0.011764705, 0.011764705, 0.011764705, 0.011764705, 0.011764705, 0.011764705, 0.011764705, 0.011764705, 0.011764705, 0.011764705, 0.011764705, 0.011764705, 0.011764705, 0.011764705, 0.011764705, 0.011764705, 0.011764705, 0.011764705, 0.011764705, 0.011764705, 0.011764705, 0.011764705, 0.011764705, 0.011764705, 0.011764705, 0.011764705, 0.011764705, 0.011764705, 0.011764705, 0.011764705, 0.011764705, 0.011764705, 0.011764705, 0.011764705, 0.011764705, 0.011764705, 0.011764705, 0.011764705, 0.011764705, 0.011764705, 0.011764705, 0.011764705, 0.011764705, 0.011764705, 0.011764705, 0.011764705, 0.011764705, 0.011764705, 0.011764705, 0.011764705, 0.011764705, 0.011764705, 0.011764705, 0.011764705, 0.011764705, 0.011764705, 0.011764705, 0.011764705, 0.011764705, 0.011764705, 0.011764705, 0.011764705, 0.011764705, 0.011764705, 0.011764705, 0.011764705, 0.011764705, 0.011764705, 0.011764705, 0.011764705, 0.011764705, 0.011764705, 0.011764705, 0.011764705, 0.011764705, 0.011764705, 0.011764705, 0.011764705, 0.011764705, 0.011764705, 0.011764705, 0.011764705, 0.011764705, 0.011764705, 0.011764705, 0.011764705, 0.011764705, 0.011764705, 0.011764705, 0.011764705, 0.011764705, 0.011764705, 0.011764705, 0.011764705, 0.011764705, 0.011764705, 0.011764705, 0.011764705, 0.011764705, 0.011764705, 0.011764705, 0.011764705, 0.011764705, 0.011764705, 0.011764705, 0.011764705, 0.011764705, 0.011764705, 0.011764705, 0.011764705, 0.011764705, 0.011764705, 0.011764705, 0.011764705, 0.011764705, 0.011764705, 0.011764705, 0.011764705, 0.011764705, 0.011764705, 0.011764705, 0.011764705, 0.011764705, 0.011764705, 0.011764705, 0.011764705, 0.011764705, 0.011764705, 0.011764705, 0.011764705, 0.011764705, 0.011764705, 0.011764705, 0.011764705, 0.011764705, 0.011764705, 0.011764705, 0.011764705, 0.011764705, 0.011764705, 0.011764705, 0.011764705, 0.011764705, 0.011764705, 0.011764705, 0.011764705, 0.011764705, 0.011764705, 0.011764705, 0.011764705, 0.011764705, 0.011764705, 0.011764705, 0.011764705, 0.011764705, 0.011764705, 0.011764705, 0.011764705, 0.011764705, 0.011764705, 0.011764705, 0.011764705, 0.011764705, 0.011764705, 0.011764705, 0.011764705, 0.011764705, 0.011764705, 0.011764705, 0.011764705, 0.011764705, 0.011764705, 0.011764705, 0.011764705, 0.011764705, 0.011764705, 0.011764705, 0.011764705, 0.011764705, 0.011764705, 0.011764705, 0.011764705, 0.011764705, 0.011764705, 0.2509804, 0.74901962, 0.988235295, 0.501960795, 0.501960795, 0.501960795, 0.2509804, 0.011764705, 0.011764705, 0.011764705, 0.011764705, 0.011764705, 0.011764705, 0.011764705, 0.011764705, 0.011764705, 0.011764705, 0.011764705, 0.011764705, 0.011764705, 0.011764705, 0.011764705, 0.011764705, 0.011764705, 0.011764705, 0.011764705, 0.011764705, 0.011764705, 0.501960795, 0.988235295, 0.988235295, 0.988235295, 0.988235295, 0.988235295, 0.988235295, 0.988235295, 0.988235295, 0.988235295, 0.988235295, 0.501960795, 0.501960795, 0.2509804, 0.011764705, 0.011764705, 0.011764705, 0.011764705, 0.011764705, 0.011764705, 0.011764705, 0.011764705, 0.011764705, 0.011764705, 0.011764705, 0.011764705, 0.011764705, 0.011764705, 0.2509804, 0.988235295, 0.988235295, 0.988235295, 0.988235295, 0.988235295, 0.988235295, 0.988235295, 0.988235295, 0.988235295, 0.988235295, 0.988235295, 0.988235295, 0.988235295, 0.74901962, 0.2509804, 0.011764705, 0.011764705, 0.011764705, 0.011764705, 0.011764705, 0.011764705, 0.011764705, 0.011764705, 0.011764705, 0.011764705, 0.011764705, 0.011764705, 0.011764705, 0.011764705, 0.2509804, 0.2509804, 0.501960795, 0.501960795, 0.501960795, 0.501960795, 0.988235295, 0.988235295, 0.988235295, 0.988235295, 0.988235295, 0.988235295, 0.988235295, 0.988235295, 0.501960795, 0.011764705, 0.011764705, 0.011764705, 0.011764705, 0.011764705, 0.011764705, 0.011764705, 0.011764705, 0.011764705, 0.011764705, 0.011764705, 0.011764705, 0.011764705, 0.011764705, 0.011764705, 0.011764705, 0.011764705, 0.011764705, 0.011764705, 0.011764705, 0.011764705, 0.011764705, 0.2509804, 0.74901962, 0.988235295, 0.988235295, 0.988235295, 0.988235295, 0.988235295, 0.2509804, 0.011764705, 0.011764705, 0.011764705, 0.011764705, 0.011764705, 0.011764705, 0.011764705, 0.011764705, 0.011764705, 0.011764705, 0.011764705, 0.011764705, 0.011764705, 0.011764705, 0.011764705, 0.011764705, 0.011764705, 0.011764705, 0.011764705, 0.011764705, 0.011764705, 0.011764705, 0.2509804, 0.988235295, 0.988235295, 0.988235295, 0.988235295, 0.501960795, 0.011764705, 0.011764705, 0.011764705, 0.011764705, 0.011764705, 0.011764705, 0.011764705, 0.011764705, 0.011764705, 0.011764705, 0.011764705, 0.011764705, 0.011764705, 0.011764705, 0.011764705, 0.011764705, 0.011764705, 0.011764705, 0.011764705, 0.011764705, 0.011764705, 0.011764705, 0.011764705, 0.2509804, 0.988235295, 0.988235295, 0.988235295, 0.501960795, 0.011764705, 0.011764705, 0.011764705, 0.011764705, 0.011764705, 0.011764705, 0.011764705, 0.011764705, 0.011764705, 0.011764705, 0.011764705, 0.011764705, 0.011764705, 0.011764705, 0.011764705, 0.011764705, 0.011764705, 0.011764705, 0.011764705, 0.011764705, 0.011764705, 0.011764705, 0.011764705, 0.011764705, 0.501960795, 0.988235295, 0.988235295, 0.988235295, 0.011764705, 0.011764705, 0.011764705, 0.011764705, 0.011764705, 0.011764705, 0.011764705, 0.011764705, 0.011764705, 0.011764705, 0.011764705, 0.011764705, 0.011764705, 0.011764705, 0.011764705, 0.011764705, 0.011764705, 0.011764705, 0.011764705, 0.011764705, 0.011764705, 0.011764705, 0.011764705, 0.011764705, 0.501960795, 0.988235295, 0.988235295, 0.988235295, 0.2509804, 0.011764705, 0.011764705, 0.011764705, 0.011764705, 0.011764705, 0.011764705, 0.011764705, 0.011764705, 0.011764705, 0.011764705, 0.011764705, 0.011764705, 0.011764705, 0.011764705, 0.011764705, 0.011764705, 0.011764705, 0.011764705, 0.011764705, 0.011764705, 0.011764705, 0.011764705, 0.011764705, 0.501960795, 0.988235295, 0.988235295, 0.988235295, 0.501960795, 0.011764705, 0.011764705, 0.011764705, 0.011764705, 0.011764705, 0.011764705, 0.011764705, 0.011764705, 0.011764705, 0.011764705, 0.011764705, 0.011764705, 0.011764705, 0.011764705, 0.011764705, 0.011764705, 0.011764705, 0.011764705, 0.011764705, 0.011764705, 0.011764705, 0.011764705, 0.011764705, 0.501960795, 0.988235295, 0.988235295, 0.988235295, 0.011764705, 0.011764705, 0.011764705, 0.011764705, 0.011764705, 0.011764705, 0.011764705, 0.011764705, 0.011764705, 0.011764705, 0.011764705, 0.011764705, 0.011764705, 0.011764705, 0.011764705, 0.011764705, 0.011764705, 0.011764705, 0.011764705, 0.011764705, 0.011764705, 0.011764705, 0.011764705, 0.011764705, 0.501960795, 0.988235295, 0.988235295, 0.74901962, 0.011764705, 0.011764705, 0.011764705, 0.011764705, 0.011764705, 0.011764705, 0.011764705, 0.011764705, 0.011764705, 0.011764705, 0.011764705, 0.011764705, 0.011764705, 0.011764705, 0.011764705, 0.011764705, 0.011764705, 0.011764705, 0.011764705, 0.011764705, 0.011764705, 0.011764705, 0.011764705, 0.011764705, 0.74901962, 0.988235295, 0.988235295, 0.501960795, 0.011764705, 0.011764705, 0.011764705, 0.011764705, 0.011764705, 0.011764705, 0.011764705, 0.011764705, 0.011764705, 0.011764705, 0.011764705, 0.011764705, 0.011764705, 0.011764705, 0.011764705, 0.011764705, 0.011764705, 0.011764705, 0.011764705, 0.011764705, 0.011764705, 0.011764705, 0.011764705, 0.501960795, 0.988235295, 0.988235295, 0.988235295, 0.2509804, 0.011764705, 0.011764705, 0.011764705, 0.011764705, 0.011764705, 0.011764705, 0.011764705, 0.011764705, 0.011764705, 0.011764705, 0.011764705, 0.011764705, 0.011764705, 0.011764705, 0.011764705, 0.011764705, 0.011764705, 0.011764705, 0.011764705, 0.011764705, 0.011764705, 0.011764705, 0.011764705, 0.988235295, 0.988235295, 0.988235295, 0.74901962, 0.011764705, 0.011764705, 0.011764705, 0.011764705, 0.011764705, 0.011764705, 0.011764705, 0.011764705, 0.011764705, 0.011764705, 0.011764705, 0.011764705, 0.011764705, 0.011764705, 0.011764705, 0.011764705, 0.011764705, 0.011764705, 0.011764705, 0.011764705, 0.011764705, 0.011764705, 0.011764705, 0.011764705, 0.988235295, 0.988235295, 0.988235295, 0.2509804, 0.011764705, 0.011764705, 0.011764705, 0.011764705, 0.011764705, 0.011764705, 0.011764705, 0.011764705, 0.011764705, 0.011764705, 0.011764705, 0.011764705, 0.011764705, 0.011764705, 0.011764705, 0.011764705, 0.011764705, 0.011764705, 0.011764705, 0.011764705, 0.011764705, 0.011764705, 0.011764705, 0.74901962, 0.988235295, 0.988235295, 0.988235295, 0.011764705, 0.011764705, 0.011764705, 0.011764705, 0.011764705, 0.011764705, 0.011764705, 0.011764705, 0.011764705, 0.011764705, 0.011764705, 0.011764705, 0.011764705, 0.011764705, 0.011764705, 0.011764705, 0.011764705, 0.011764705, 0.011764705, 0.011764705, 0.011764705, 0.011764705, 0.011764705, 0.501960795, 0.988235295, 0.988235295, 0.988235295, 0.74901962, 0.011764705, 0.011764705, 0.011764705, 0.011764705, 0.011764705, 0.011764705, 0.011764705, 0.011764705, 0.011764705, 0.011764705, 0.011764705, 0.011764705, 0.011764705, 0.011764705, 0.011764705, 0.011764705, 0.011764705, 0.011764705, 0.011764705, 0.011764705, 0.011764705, 0.011764705, 0.011764705, 0.501960795, 0.988235295, 0.988235295, 0.74901962, 0.011764705, 0.011764705, 0.011764705, 0.011764705, 0.011764705, 0.011764705, 0.011764705, 0.011764705, 0.011764705, 0.011764705, 0.011764705, 0.011764705, 0.011764705, 0.011764705, 0.011764705, 0.011764705, 0.011764705, 0.011764705, 0.011764705, 0.011764705, 0.011764705, 0.011764705, 0.011764705, 0.011764705, 0.501960795, 0.988235295, 0.988235295, 0.2509804, 0.011764705, 0.011764705, 0.011764705, 0.011764705, 0.011764705, 0.011764705, 0.011764705, 0.011764705, 0.011764705, 0.011764705, 0.011764705, 0.011764705, 0.011764705, 0.011764705, 0.011764705, 0.011764705, 0.011764705, 0.011764705, 0.011764705, 0.011764705, 0.011764705, 0.011764705, 0.011764705, 0.011764705, 0.011764705, 0.011764705, 0.011764705, 0.011764705, 0.011764705, 0.011764705, 0.011764705, 0.011764705, 0.011764705, 0.011764705, 0.011764705, 0.011764705, 0.011764705, 0.011764705], ([0.0, 0.0, 4.52513173765899, 13.189560936656262, 0.0, 5.5081342577624355, 0.0, 28.615785854297567, 0.0, 4.989288166200673], [0.0, 0.0, 2.484177564977696, 11.904650831244462, 0.0, 6.922109471943679, 0.0, 24.756596202193165, 0.0, 3.272076508074426], 3.8591896521044013))
[Thread 1] Total splits: 0
Processed 1 zonotopes (Work Done: 0.0%); Generated 0 (1.712386552s/loop)
[Thread 1] Finished in 1.71s
 ────────────────────────────────────────────────────────────────────────────────
                                        Time                    Allocations      
                               ───────────────────────   ────────────────────────
       Tot / % measured:            1.74s / 100.0%            547MiB / 100.0%    

 Section               ncalls     time    %tot     avg     alloc    %tot      avg
 ────────────────────────────────────────────────────────────────────────────────
 Verify                     1    1.71s   98.7%   1.71s    520MiB   95.1%   520MiB
   Zonotope Loop            1    1.71s   98.7%   1.71s    520MiB   95.1%   520MiB
     Zonotope Propa...      1    1.69s   97.3%   1.69s    499MiB   91.1%   499MiB
       DiffZonotope...      4    1.26s   72.3%   314ms    438MiB   80.1%   110MiB
         Zonotope_R...      8    1.25s   72.1%   156ms    438MiB   80.0%  54.8MiB
           Influenc...      8    855ms   49.3%   107ms    254MiB   46.4%  31.7MiB
             Multiply       8    554ms   31.9%  69.2ms    150MiB   27.3%  18.7MiB
             Alloca...      8    285ms   16.4%  35.7ms    104MiB   19.0%  13.0MiB
             Set Ma...      8   16.2ms    0.9%  2.03ms     0.00B    0.0%    0.00B
           Column M...      8    361ms   20.8%  45.1ms   92.0MiB   16.8%  11.5MiB
           Allocation       8   18.1ms    1.0%  2.26ms   92.0MiB   16.8%  11.5MiB
           Set Matrix       8   16.0ms    0.9%  2.00ms    107KiB    0.0%  13.3KiB
           Vectors          8    215μs    0.0%  26.9μs    272KiB    0.0%  34.0KiB
           Bounds           8   4.85μs    0.0%   606ns     0.00B    0.0%    0.00B
       DiffZonotope...      5    434ms   25.0%  86.8ms   60.3MiB   11.0%  12.1MiB
         Zonotope_D...     10    434ms   25.0%  43.4ms   60.3MiB   11.0%  6.03MiB
     Property Check         1   7.38ms    0.4%  7.38ms    805KiB    0.1%   805KiB
 Initialize                 1   23.2ms    1.3%  23.2ms   27.0MiB    4.9%  27.0MiB
 ────────────────────────────────────────────────────────────────────────────────
[VERYDIFF_TIMER] 1.822322651

[VERYDIFF_EXPERIMENT] NETWORK: /home/i57/steuber/NeuroDiff/repos/VeryDiffExperiments/src/../benchmarks/mnist-prune/specs/mnist_60_global_6.vnnlib
[VERYDIFF_EXPERIMENT] TIME: 123.309417431
