
[VERYDIFF_EXPERIMENT] Running on /home/i57/steuber/NeuroDiff/repos/VeryDiffExperiments/src/../benchmarks/mnist-prune/specs/mnist_33_local_15.vnnlib /home/i57/steuber/NeuroDiff/repos/VeryDiffExperiments/src/../benchmarks/mnist-prune/nets/mnist_relu_3_100.onnx
Parsing /home/i57/steuber/NeuroDiff/repos/VeryDiffExperiments/src/../benchmarks/mnist-prune/nets/mnist_relu_3_100.onnx...
Found input X
op: matmul, weight: (100, 784), bias: nothing
op: bias, weight: nothing, bias: (100,)
op: relu, weight: nothing, bias: nothing
op: matmul, weight: (100, 100), bias: nothing
op: bias, weight: nothing, bias: (100,)
op: relu, weight: nothing, bias: nothing
op: matmul, weight: (10, 100), bias: nothing
op: bias, weight: nothing, bias: (10,)
op: relu, weight: nothing, bias: nothing
op: matmul, weight: (10, 10), bias: nothing
op: bias, weight: nothing, bias: (10,)
Parsing /home/i57/steuber/NeuroDiff/repos/VeryDiffExperiments/src/../benchmarks/mnist-prune/nets_pruned/mnist_relu_3_100_0.79_adam_1_stepsize-old.onnx...
Found input X
op: gemm, weight: (100, 784), bias: (100,)
op: relu, weight: nothing, bias: nothing
op: gemm, weight: (100, 100), bias: (100,)
op: relu, weight: nothing, bias: nothing
op: gemm, weight: (10, 100), bias: (10,)
op: relu, weight: nothing, bias: nothing
op: gemm, weight: (10, 10), bias: (10,)
Distance: 368.62397500800625
Distance: 47.56803950402309
Distance: 2.8977568827249343
Distance: 0.01885471428334995
Running with 1 threads
[Thread 1] Time to first task: 0.0s
Instable Generators: 24
Instable Generators: 36
Instable Generators: 4
Zono Bounds:
[-0.7241505278119779, -0.00044734358197588605, -0.7429296498989948, -0.000643009677223463, -0.6579450032026996, -0.7016108231558699, -0.77929849739329, -0.8159313544118957, -0.7186167691696957, -0.001961911078643028]
[0.6230011970675257, 0.0004487936179087355, 0.7368974440954368, 0.0006524887797648416, 0.8245313753268589, 0.6967401960991003, 0.7392986840608003, 0.6307109002843391, 0.6832924509005717, -5.237761140891963e-5]
[Thread 1] Processed 100 zonotopes (Work Done: 0.0%; Expected Zonos: Inf)
[Thread 1] Processed 200 zonotopes (Work Done: 8.59375%; Expected Zonos: 2327.2727272727275)
[Thread 1] Processed 300 zonotopes (Work Done: 19.14062%; Expected Zonos: 1567.3469387755101)
[Thread 1] Processed 400 zonotopes (Work Done: 34.375%; Expected Zonos: 1163.6363636363637)
[Thread 1] Processed 500 zonotopes (Work Done: 48.04688%; Expected Zonos: 1040.6504065040651)
[Thread 1] Processed 600 zonotopes (Work Done: 56.64062%; Expected Zonos: 1059.3103448275863)
[Thread 1] Processed 700 zonotopes (Work Done: 66.89453%; Expected Zonos: 1046.4233576642337)
[Thread 1] Processed 800 zonotopes (Work Done: 74.70703%; Expected Zonos: 1070.8496732026144)
[Thread 1] Processed 900 zonotopes (Work Done: 80.66406%; Expected Zonos: 1115.7384987893463)
[Thread 1] Processed 1000 zonotopes (Work Done: 86.96289%; Expected Zonos: 1149.915777653004)
[Thread 1] Processed 1100 zonotopes (Work Done: 92.28516%; Expected Zonos: 1191.957671957672)
[Thread 1] Processed 1200 zonotopes (Work Done: 96.04492%; Expected Zonos: 1249.415353329944)
[Thread 1] Processed 1300 zonotopes (Work Done: 98.29102%; Expected Zonos: 1322.6030799801292)
[Thread 1] Processed 1400 zonotopes (Work Done: 99.34082%; Expected Zonos: 1409.2897517817646)
[Thread 1] Total splits: 735
Processed 1471 zonotopes (Work Done: 100.0%); Generated 1470 (0.0178896443874915s/loop)
[Thread 1] Finished in 26.32s
 ────────────────────────────────────────────────────────────────────────────────
                                        Time                    Allocations      
                               ───────────────────────   ────────────────────────
       Tot / % measured:            26.3s / 100.0%           11.4GiB / 100.0%    

 Section               ncalls     time    %tot     avg     alloc    %tot      avg
 ────────────────────────────────────────────────────────────────────────────────
 Verify                     1    26.3s  100.0%   26.3s   11.4GiB  100.0%  11.4GiB
   Zonotope Loop            1    26.3s  100.0%   26.3s   11.4GiB  100.0%  11.4GiB
     Property Check     1.47k    23.7s   90.0%  16.1ms   8.98GiB   78.6%  6.25MiB
     Zonotope Propa...  1.47k    2.31s    8.8%  1.57ms   1.22GiB   10.7%   870KiB
       DiffZonotope...  5.88k    1.45s    5.5%   247μs    280MiB    2.4%  48.8KiB
         Zonotope_D...  11.8k    614ms    2.3%  52.2μs    148MiB    1.3%  12.9KiB
       DiffZonotope...  4.41k    846ms    3.2%   192μs   0.95GiB    8.3%   225KiB
         Zonotope_R...  8.83k    532ms    2.0%  60.2μs    599MiB    5.1%  69.5KiB
           Influenc...  8.83k    314ms    1.2%  35.5μs    133MiB    1.1%  15.5KiB
             Multiply   8.83k    291ms    1.1%  32.9μs   82.0MiB    0.7%  9.51KiB
             Alloca...  8.83k   11.9ms    0.0%  1.35μs   51.3MiB    0.4%  5.96KiB
             Set Ma...  8.83k   5.77ms    0.0%   653ns     0.00B    0.0%    0.00B
           Column M...  8.83k   94.8ms    0.4%  10.7μs    217MiB    1.9%  25.1KiB
           Allocation   8.83k   54.7ms    0.2%  6.20μs    216MiB    1.8%  25.0KiB
           Vectors      8.83k   29.3ms    0.1%  3.31μs   28.1MiB    0.2%  3.26KiB
           Set Matrix   8.83k   23.5ms    0.1%  2.67μs   5.55MiB    0.0%     659B
           Bounds       8.83k   2.42ms    0.0%   274ns     0.00B    0.0%    0.00B
     Compute Split        735   63.4ms    0.2%  86.3μs    101MiB    0.9%   141KiB
 Initialize                 1    356μs    0.0%   356μs    821KiB    0.0%   821KiB
 ────────────────────────────────────────────────────────────────────────────────
[VERYDIFF_TIMER] 26.360476201

[VERYDIFF_EXPERIMENT] NETWORK: /home/i57/steuber/NeuroDiff/repos/VeryDiffExperiments/src/../benchmarks/mnist-prune/specs/mnist_33_local_15.vnnlib
[VERYDIFF_EXPERIMENT] TIME: 26.665385559
