
[VERYDIFF_EXPERIMENT] Running on /home/i57/steuber/NeuroDiff/repos/VeryDiffExperiments/src/../benchmarks/mnist-prune/specs/mnist_0_local_18.vnnlib /home/i57/steuber/NeuroDiff/repos/VeryDiffExperiments/src/../benchmarks/mnist-prune/nets/mnist_relu_2_512.onnx
Parsing /home/i57/steuber/NeuroDiff/repos/VeryDiffExperiments/src/../benchmarks/mnist-prune/nets/mnist_relu_2_512.onnx...
Found input X
op: matmul, weight: (512, 784), bias: nothing
op: bias, weight: nothing, bias: (512,)
op: relu, weight: nothing, bias: nothing
op: matmul, weight: (512, 512), bias: nothing
op: bias, weight: nothing, bias: (512,)
op: relu, weight: nothing, bias: nothing
op: matmul, weight: (10, 512), bias: nothing
op: bias, weight: nothing, bias: (10,)
Parsing /home/i57/steuber/NeuroDiff/repos/VeryDiffExperiments/src/../benchmarks/mnist-prune/nets_pruned/mnist_relu_2_512_pruned5.onnx...
Found input X
op: matmul, weight: (512, 784), bias: nothing
op: bias, weight: nothing, bias: (512,)
op: relu, weight: nothing, bias: nothing
op: matmul, weight: (512, 512), bias: nothing
op: bias, weight: nothing, bias: (512,)
op: relu, weight: nothing, bias: nothing
op: matmul, weight: (10, 512), bias: nothing
op: bias, weight: nothing, bias: (10,)
Distance: 1085.5985166831802
Distance: 1719.8468985003963
Distance: 31.228482716001736
Running with 1 threads
[Thread 1] Time to first task: 0.0s
Instable Generators: 172
Instable Generators: 307
Zono Bounds:
[-16.405548573685326, -12.226155272790447, -12.001482987116676, -13.540634676780886, -15.58144083085253, -18.236885465037826, -18.913787646490675, -4.455108463665889, -13.581587910237866, -12.367957651674075]
[12.508053010713427, 19.981344973196943, 12.288578702369728, 12.893848704085503, 12.103618241949471, 6.505941143765192, 10.60702170024243, 20.657520382236456, 9.00541379200281, 9.880639704196444]
[Thread 1] Total splits: 0
Processed 1 zonotopes (Work Done: 100.0%); Generated 0 (0.159262249s/loop)
[Thread 1] Finished in 0.16s
 ────────────────────────────────────────────────────────────────────────────────
                                        Time                    Allocations      
                               ───────────────────────   ────────────────────────
       Tot / % measured:            161ms / 100.0%           88.5MiB / 100.0%    

 Section               ncalls     time    %tot     avg     alloc    %tot      avg
 ────────────────────────────────────────────────────────────────────────────────
 Verify                     1    159ms   98.8%   159ms   83.3MiB   94.1%  83.3MiB
   Zonotope Loop            1    159ms   98.8%   159ms   83.3MiB   94.1%  83.3MiB
     Property Check         1    124ms   76.9%   124ms   57.4MiB   64.8%  57.4MiB
     Zonotope Propa...      1   35.1ms   21.7%  35.1ms   25.0MiB   28.3%  25.0MiB
       DiffZonotope...      3   28.9ms   17.9%  9.64ms   4.09MiB    4.6%  1.36MiB
         Zonotope_D...      6   8.42ms    5.2%  1.40ms   1.78MiB    2.0%   303KiB
       DiffZonotope...      2   6.10ms    3.8%  3.05ms   20.9MiB   23.7%  10.5MiB
         Zonotope_R...      4   2.86ms    1.8%   716μs   12.6MiB   14.2%  3.14MiB
           Column M...      4   1.41ms    0.9%   352μs   5.52MiB    6.2%  1.38MiB
           Influenc...      4    654μs    0.4%   163μs   1.39MiB    1.6%   356KiB
             Multiply       4    595μs    0.4%   149μs   1.20MiB    1.4%   306KiB
             Alloca...      4   43.9μs    0.0%  11.0μs    199KiB    0.2%  49.8KiB
             Set Ma...      4   8.83μs    0.0%  2.21μs     0.00B    0.0%    0.00B
           Set Matrix       4    459μs    0.3%   115μs   27.1KiB    0.0%  6.79KiB
           Allocation       4    243μs    0.2%  60.8μs   5.52MiB    6.2%  1.38MiB
           Vectors          4   85.6μs    0.1%  21.4μs    100KiB    0.1%  25.0KiB
           Bounds           4   1.96μs    0.0%   489ns     0.00B    0.0%    0.00B
 Initialize                 1   1.92ms    1.2%  1.92ms   5.24MiB    5.9%  5.24MiB
 ────────────────────────────────────────────────────────────────────────────────
[VERYDIFF_TIMER] 0.192713068

[VERYDIFF_EXPERIMENT] Running on /home/i57/steuber/NeuroDiff/repos/VeryDiffExperiments/src/../benchmarks/mnist-prune/specs/mnist_0_local_18.vnnlib /home/i57/steuber/NeuroDiff/repos/VeryDiffExperiments/src/../benchmarks/mnist-prune/nets/mnist_relu_3_100.onnx
Parsing /home/i57/steuber/NeuroDiff/repos/VeryDiffExperiments/src/../benchmarks/mnist-prune/nets/mnist_relu_3_100.onnx...
Found input X
op: matmul, weight: (100, 784), bias: nothing
op: bias, weight: nothing, bias: (100,)
op: relu, weight: nothing, bias: nothing
op: matmul, weight: (100, 100), bias: nothing
op: bias, weight: nothing, bias: (100,)
op: relu, weight: nothing, bias: nothing
op: matmul, weight: (10, 100), bias: nothing
op: bias, weight: nothing, bias: (10,)
op: relu, weight: nothing, bias: nothing
op: matmul, weight: (10, 10), bias: nothing
op: bias, weight: nothing, bias: (10,)
Parsing /home/i57/steuber/NeuroDiff/repos/VeryDiffExperiments/src/../benchmarks/mnist-prune/nets_pruned/mnist_relu_3_100_pruned5.onnx...
Found input X
op: matmul, weight: (100, 784), bias: nothing
op: bias, weight: nothing, bias: (100,)
op: relu, weight: nothing, bias: nothing
op: matmul, weight: (100, 100), bias: nothing
op: bias, weight: nothing, bias: (100,)
op: relu, weight: nothing, bias: nothing
op: matmul, weight: (10, 100), bias: nothing
op: bias, weight: nothing, bias: (10,)
op: relu, weight: nothing, bias: nothing
op: matmul, weight: (10, 10), bias: nothing
op: bias, weight: nothing, bias: (10,)
Distance: 296.6600370998244
Distance: 77.24290861755458
Distance: 5.7170369567975285
Distance: 0.0
Running with 1 threads
[Thread 1] Time to first task: 0.0s
Instable Generators: 40
Instable Generators: 49
Instable Generators: 7
Zono Bounds:
[-1.2905929545025443, -1.0904162785807912, -1.2675661006461565, -1.4090482965396662, 0.0, -1.7038400025174048, 0.0, -0.11114248837177798, -1.168483760270734, -1.0844427586498484]
[0.5191429174584404, 1.0904162785807912, 0.7922086856360131, 1.4090482965396662, 0.0, 0.9627688853260088, 0.0, 2.070847843435395, 1.168483760270734, 1.0844427586498484]
[Thread 1] Total splits: 0
Processed 1 zonotopes (Work Done: 100.0%); Generated 0 (0.030327953s/loop)
[Thread 1] Finished in 0.03s
 ────────────────────────────────────────────────────────────────────────────────
                                        Time                    Allocations      
                               ───────────────────────   ────────────────────────
       Tot / % measured:           30.7ms / 100.0%           17.1MiB / 100.0%    

 Section               ncalls     time    %tot     avg     alloc    %tot      avg
 ────────────────────────────────────────────────────────────────────────────────
 Verify                     1   30.4ms   98.9%  30.4ms   16.2MiB   95.2%  16.2MiB
   Zonotope Loop            1   30.3ms   98.8%  30.3ms   16.2MiB   95.2%  16.2MiB
     Property Check         1   28.4ms   92.5%  28.4ms   13.8MiB   81.0%  13.8MiB
     Zonotope Propa...      1   1.80ms    5.9%  1.80ms   1.59MiB    9.3%  1.59MiB
       DiffZonotope...      4   1.13ms    3.7%   282μs    340KiB    1.9%  85.1KiB
         Zonotope_D...      8    505μs    1.6%  63.1μs    166KiB    0.9%  20.7KiB
       DiffZonotope...      3    662μs    2.2%   221μs   1.25MiB    7.3%   427KiB
         Zonotope_R...      6    345μs    1.1%  57.4μs    834KiB    4.8%   139KiB
           Influenc...      6    123μs    0.4%  20.4μs    237KiB    1.4%  39.5KiB
             Multiply       6   85.8μs    0.3%  14.3μs    154KiB    0.9%  25.6KiB
             Alloca...      6   23.4μs    0.1%  3.91μs   81.0KiB    0.5%  13.5KiB
             Set Ma...      6   7.66μs    0.0%  1.28μs     0.00B    0.0%    0.00B
           Column M...      6   92.6μs    0.3%  15.4μs    283KiB    1.6%  47.2KiB
           Allocation       6   62.1μs    0.2%  10.4μs    283KiB    1.6%  47.1KiB
           Set Matrix       6   35.4μs    0.1%  5.90μs   6.52KiB    0.0%  1.09KiB
           Vectors          6   20.4μs    0.1%  3.41μs   19.5KiB    0.1%  3.26KiB
           Bounds           6   1.91μs    0.0%   318ns     0.00B    0.0%    0.00B
 Initialize                 1    334μs    1.1%   334μs    839KiB    4.8%   839KiB
 ────────────────────────────────────────────────────────────────────────────────
[VERYDIFF_TIMER] 0.055469341

[VERYDIFF_EXPERIMENT] NETWORK: /home/i57/steuber/NeuroDiff/repos/VeryDiffExperiments/src/../benchmarks/mnist-prune/specs/mnist_0_local_18.vnnlib
[VERYDIFF_EXPERIMENT] TIME: 0.857992001
