
[VERYDIFF_EXPERIMENT] Running on /home/i57/steuber/NeuroDiff/repos/VeryDiffExperiments/src/../benchmarks/mnist-prune/specs/mnist_42_local_24.vnnlib /home/i57/steuber/NeuroDiff/repos/VeryDiffExperiments/src/../benchmarks/mnist-prune/nets/mnist_relu_2_512.onnx
Found input X
op: matmul, weight: (512, 784), bias: nothing
op: bias, weight: nothing, bias: (512,)
op: relu, weight: nothing, bias: nothing
op: matmul, weight: (512, 512), bias: nothing
op: bias, weight: nothing, bias: (512,)
op: relu, weight: nothing, bias: nothing
op: matmul, weight: (10, 512), bias: nothing
op: bias, weight: nothing, bias: (10,)
Found input X
op: gemm, weight: (512, 784), bias: (512,)
op: relu, weight: nothing, bias: nothing
op: gemm, weight: (512, 512), bias: (512,)
op: relu, weight: nothing, bias: nothing
op: gemm, weight: (10, 512), bias: (10,)
Distance: 973.3044369037136
Distance: 481.63499746812613
Distance: 8.744412635378467
Running with 1 threads
[Thread 1] Time to first task: 0.0s
Instable Generators: 210
Instable Generators: 431
Zono Bounds:
[-25.44202710076885, -23.93809619611489, -21.487825616788648, -23.46203311970551, -24.080126246218718, -21.425683806634076, -22.95992251985874, -23.60452540789762, -20.474479357880657, -20.33778753959689]
[31.33749767329076, 30.031007711834185, 25.681111538958362, 26.69566693682644, 28.609921535262792, 24.770402068280454, 29.06602277186118, 28.376918599010132, 23.711504855509187, 23.25710773502845]
[Thread 1] Processed 100 zonotopes (Work Done: 0.0%; Expected Zonos: Inf)
[Thread 1] Processed 200 zonotopes (Work Done: 0.0%; Expected Zonos: Inf)
[Thread 1] Processed 300 zonotopes (Work Done: 0.0%; Expected Zonos: Inf)
[Thread 1] Processed 400 zonotopes (Work Done: 0.0%; Expected Zonos: Inf)
[Thread 1] Processed 500 zonotopes (Work Done: 0.0%; Expected Zonos: Inf)
[Thread 1] Processed 600 zonotopes (Work Done: 0.0%; Expected Zonos: Inf)
[Thread 1] Processed 700 zonotopes (Work Done: 0.0%; Expected Zonos: Inf)
[Thread 1] Processed 800 zonotopes (Work Done: 0.0%; Expected Zonos: Inf)
[Thread 1] Processed 900 zonotopes (Work Done: 0.0%; Expected Zonos: Inf)
[Thread 1] Processed 1000 zonotopes (Work Done: 0.0%; Expected Zonos: Inf)
[Thread 1] Processed 1100 zonotopes (Work Done: 0.0%; Expected Zonos: Inf)
[Thread 1] Processed 1200 zonotopes (Work Done: 0.0%; Expected Zonos: Inf)
[Thread 1] Processed 1300 zonotopes (Work Done: 0.0%; Expected Zonos: Inf)
[Thread 1] Processed 1400 zonotopes (Work Done: 0.0%; Expected Zonos: Inf)
[Thread 1] Processed 1500 zonotopes (Work Done: 0.0%; Expected Zonos: Inf)
[Thread 1] Processed 1600 zonotopes (Work Done: 0.0%; Expected Zonos: Inf)
[Thread 1] Processed 1700 zonotopes (Work Done: 0.0%; Expected Zonos: Inf)
[Thread 1] Processed 1800 zonotopes (Work Done: 0.0%; Expected Zonos: Inf)
[Thread 1] Processed 1900 zonotopes (Work Done: 0.0%; Expected Zonos: Inf)
[Thread 1] Processed 2000 zonotopes (Work Done: 0.0%; Expected Zonos: Inf)
[Thread 1] Processed 2100 zonotopes (Work Done: 0.0%; Expected Zonos: Inf)
[Thread 1] Processed 2200 zonotopes (Work Done: 0.0%; Expected Zonos: Inf)
[Thread 1] Processed 2300 zonotopes (Work Done: 0.0%; Expected Zonos: Inf)
[Thread 1] Processed 2400 zonotopes (Work Done: 0.0%; Expected Zonos: Inf)
[Thread 1] Processed 2500 zonotopes (Work Done: 0.0%; Expected Zonos: Inf)
[Thread 1] Processed 2600 zonotopes (Work Done: 0.0%; Expected Zonos: Inf)
[Thread 1] Processed 2700 zonotopes (Work Done: 0.0%; Expected Zonos: Inf)
[Thread 1] Processed 2800 zonotopes (Work Done: 0.0%; Expected Zonos: Inf)
[Thread 1] Processed 2900 zonotopes (Work Done: 0.0%; Expected Zonos: Inf)
[Thread 1] Processed 3000 zonotopes (Work Done: 0.0%; Expected Zonos: Inf)
[Thread 1] Processed 3100 zonotopes (Work Done: 0.0%; Expected Zonos: Inf)
[Thread 1] Processed 3200 zonotopes (Work Done: 0.0%; Expected Zonos: Inf)
[Thread 1] Processed 3300 zonotopes (Work Done: 0.0%; Expected Zonos: Inf)
[Thread 1] Processed 3400 zonotopes (Work Done: 0.0%; Expected Zonos: Inf)
[Thread 1] Processed 3500 zonotopes (Work Done: 0.0%; Expected Zonos: Inf)
[Thread 1] Processed 3600 zonotopes (Work Done: 0.0%; Expected Zonos: Inf)
[Thread 1] Processed 3700 zonotopes (Work Done: 0.0%; Expected Zonos: Inf)
[Thread 1] Processed 3800 zonotopes (Work Done: 0.0%; Expected Zonos: Inf)
[Thread 1] Processed 3900 zonotopes (Work Done: 0.0%; Expected Zonos: Inf)


TIMEOUT REACHED
UNKNOWN
[Thread 1] Total splits: 3981
Processed 3981 zonotopes (Work Done: 0.0%); Generated 7962 (0.030147348063551873s/loop)
[Thread 1] Finished in 120.02s
 ────────────────────────────────────────────────────────────────────────────────
                                        Time                    Allocations      
                               ───────────────────────   ────────────────────────
       Tot / % measured:             120s / 100.0%            103GiB / 100.0%    

 Section               ncalls     time    %tot     avg     alloc    %tot      avg
 ────────────────────────────────────────────────────────────────────────────────
 Verify                     1     120s  100.0%    120s    103GiB  100.0%   103GiB
   Zonotope Loop            1     120s  100.0%    120s    103GiB  100.0%   103GiB
     Zonotope Propa...  3.98k     109s   91.1%  27.5ms   97.3GiB   94.2%  25.0MiB
       DiffZonotope...  11.9k    82.4s   68.7%  6.90ms   15.7GiB   15.2%  1.34MiB
         Zonotope_D...  23.9k    30.5s   25.4%  1.28ms   6.93GiB    6.7%   304KiB
       DiffZonotope...  7.96k    26.8s   22.3%  3.36ms   81.6GiB   79.0%  10.5MiB
         Zonotope_R...  15.9k    15.9s   13.3%   999μs   49.4GiB   47.8%  3.18MiB
           Column M...  15.9k    7.36s    6.1%   462μs   21.5GiB   20.8%  1.38MiB
           Influenc...  15.9k    3.72s    3.1%   234μs   5.98GiB    5.8%   394KiB
             Multiply   15.9k    3.39s    2.8%   213μs   4.97GiB    4.8%   327KiB
             Alloca...  15.9k    269ms    0.2%  16.9μs   1.01GiB    1.0%  66.3KiB
             Set Ma...  15.9k   44.6ms    0.0%  2.80μs     0.00B    0.0%    0.00B
           Allocation   15.9k    2.55s    2.1%   160μs   21.5GiB   20.8%  1.38MiB
           Set Matrix   15.9k    1.90s    1.6%   119μs    105MiB    0.1%  6.74KiB
           Vectors      15.9k    346ms    0.3%  21.7μs    388MiB    0.4%  25.0KiB
           Bounds       15.9k   9.67ms    0.0%   607ns     0.00B    0.0%    0.00B
     Property Check     3.98k    9.31s    7.8%  2.34ms    788MiB    0.7%   203KiB
     Compute Split      3.98k    780ms    0.6%   196μs   1.68GiB    1.6%   443KiB
 Initialize                 1   1.94ms    0.0%  1.94ms   5.28MiB    0.0%  5.28MiB
 ────────────────────────────────────────────────────────────────────────────────
[VERYDIFF_TIMER] 120.055447942

[VERYDIFF_EXPERIMENT] NETWORK: /home/i57/steuber/NeuroDiff/repos/VeryDiffExperiments/src/../benchmarks/mnist-prune/specs/mnist_42_local_24.vnnlib
[VERYDIFF_EXPERIMENT] TIME: 120.36452272
