
[VERYDIFF_EXPERIMENT] Running on /home/i57/steuber/NeuroDiff/repos/VeryDiffExperiments/src/../benchmarks/mnist-prune/specs/mnist_84_local_21.vnnlib /home/i57/steuber/NeuroDiff/repos/VeryDiffExperiments/src/../benchmarks/mnist-prune/nets/mnist_relu_4_1024.onnx
Parsing /home/i57/steuber/NeuroDiff/repos/VeryDiffExperiments/src/../benchmarks/mnist-prune/nets/mnist_relu_4_1024.onnx...
Found input X
op: matmul, weight: (1024, 784), bias: nothing
op: bias, weight: nothing, bias: (1024,)
op: relu, weight: nothing, bias: nothing
op: matmul, weight: (1024, 1024), bias: nothing
op: bias, weight: nothing, bias: (1024,)
op: relu, weight: nothing, bias: nothing
op: matmul, weight: (1024, 1024), bias: nothing
op: bias, weight: nothing, bias: (1024,)
op: relu, weight: nothing, bias: nothing
op: matmul, weight: (10, 1024), bias: nothing
op: bias, weight: nothing, bias: (10,)
op: relu, weight: nothing, bias: nothing
op: matmul, weight: (10, 10), bias: nothing
op: bias, weight: nothing, bias: (10,)
Parsing /home/i57/steuber/NeuroDiff/repos/VeryDiffExperiments/src/../benchmarks/mnist-prune/nets_pruned/mnist_relu_4_1024_0.79-old.onnx...
Found input X
op: gemm, weight: (1024, 784), bias: (1024,)
op: relu, weight: nothing, bias: nothing
op: gemm, weight: (1024, 1024), bias: (1024,)
op: relu, weight: nothing, bias: nothing
op: gemm, weight: (1024, 1024), bias: (1024,)
op: relu, weight: nothing, bias: nothing
op: gemm, weight: (10, 1024), bias: (10,)
op: relu, weight: nothing, bias: nothing
op: gemm, weight: (10, 10), bias: (10,)
Distance: 915.6394868631054
Distance: 1298.7052820973968
Distance: 1296.587532894263
Distance: 6.054483317080667
Distance: 0.04942679278974538
Running with 1 threads
[Thread 1] Time to first task: 0.0s
Instable Generators: 435
Instable Generators: 918
Instable Generators: 1024
Instable Generators: 10
Zono Bounds:
[-156.04872412855937, -159.42634061019788, -175.72111570690458, -174.46499861030753, -167.37438295277994, -177.39364273198905, -158.92804366944998, -165.94282281524045, -169.70288618832063, -176.64614625889743]
[155.98905027100997, 158.5655917162032, 175.10451264869687, 174.10210211521513, 167.29585474054053, 176.95707603659812, 158.90886089971477, 164.73381245710812, 169.80499512210616, 176.46452743804792]


TIMEOUT REACHED
UNKNOWN
[Thread 1] Total splits: 47
Processed 47 zonotopes (Work Done: 0.0%); Generated 94 (2.599396677042553s/loop)
[Thread 1] Finished in 122.17s
 ────────────────────────────────────────────────────────────────────────────────
                                        Time                    Allocations      
                               ───────────────────────   ────────────────────────
       Tot / % measured:             122s / 100.0%           29.7GiB / 100.0%    

 Section               ncalls     time    %tot     avg     alloc    %tot      avg
 ────────────────────────────────────────────────────────────────────────────────
 Verify                     1     122s  100.0%    122s   29.7GiB   99.9%  29.7GiB
   Zonotope Loop            1     122s  100.0%    122s   29.7GiB   99.9%  29.7GiB
     Property Check        47    75.7s   62.0%   1.61s   15.1GiB   50.8%   329MiB
     Zonotope Propa...     47    46.4s   38.0%   988ms   14.5GiB   48.8%   316MiB
       DiffZonotope...    235    25.5s   20.9%   109ms   3.10GiB   10.4%  13.5MiB
         Zonotope_D...    470    10.4s    8.5%  22.2ms   1.26GiB    4.2%  2.74MiB
       DiffZonotope...    188    20.9s   17.1%   111ms   11.4GiB   38.4%  62.1MiB
         Zonotope_R...    376    7.20s    5.9%  19.2ms   7.11GiB   23.9%  19.4MiB
           Column M...    376    3.31s    2.7%  8.81ms   2.86GiB    9.6%  7.80MiB
           Allocation     376    2.64s    2.2%  7.01ms   2.86GiB    9.6%  7.80MiB
           Influenc...    376    741ms    0.6%  1.97ms   1.36GiB    4.6%  3.71MiB
             Multiply     376    721ms    0.6%  1.92ms   1.27GiB    4.3%  3.46MiB
             Alloca...    376   12.9ms    0.0%  34.4μs   94.5MiB    0.3%   257KiB
             Set Ma...    376   6.06ms    0.0%  16.1μs     0.00B    0.0%    0.00B
           Set Matrix     376    496ms    0.4%  1.32ms   5.33MiB    0.0%  14.5KiB
           Vectors        376   16.0ms    0.0%  42.5μs   12.5MiB    0.0%  34.0KiB
           Bounds         376    245μs    0.0%   652ns     0.00B    0.0%    0.00B
     Compute Split         47   28.1ms    0.0%   598μs   58.0MiB    0.2%  1.23MiB
 Initialize                 1   14.7ms    0.0%  14.7ms   22.4MiB    0.1%  22.4MiB
 ────────────────────────────────────────────────────────────────────────────────
[VERYDIFF_TIMER] 122.26250646

[VERYDIFF_EXPERIMENT] NETWORK: /home/i57/steuber/NeuroDiff/repos/VeryDiffExperiments/src/../benchmarks/mnist-prune/specs/mnist_84_local_21.vnnlib
[VERYDIFF_EXPERIMENT] TIME: 122.581449352
