
[VERYDIFF_EXPERIMENT] Running on /home/i57/steuber/NeuroDiff/repos/VeryDiffExperiments/src/../benchmarks/mnist-prune/specs/mnist_27_local_21.vnnlib /home/i57/steuber/NeuroDiff/repos/VeryDiffExperiments/src/../benchmarks/mnist-prune/nets/mnist_relu_2_512.onnx
Parsing /home/i57/steuber/NeuroDiff/repos/VeryDiffExperiments/src/../benchmarks/mnist-prune/nets/mnist_relu_2_512.onnx...
Found input X
op: matmul, weight: (512, 784), bias: nothing
op: bias, weight: nothing, bias: (512,)
op: relu, weight: nothing, bias: nothing
op: matmul, weight: (512, 512), bias: nothing
op: bias, weight: nothing, bias: (512,)
op: relu, weight: nothing, bias: nothing
op: matmul, weight: (10, 512), bias: nothing
op: bias, weight: nothing, bias: (10,)
Parsing /home/i57/steuber/NeuroDiff/repos/VeryDiffExperiments/src/../benchmarks/mnist-prune/nets_pruned/mnist_relu_2_512_0.79-old.onnx...
Found input X
op: gemm, weight: (512, 784), bias: (512,)
op: relu, weight: nothing, bias: nothing
op: gemm, weight: (512, 512), bias: (512,)
op: relu, weight: nothing, bias: nothing
op: gemm, weight: (10, 512), bias: (10,)
Distance: 973.3044369037136
Distance: 481.63499746812613
Distance: 8.744412635378467
Running with 1 threads
[Thread 1] Time to first task: 0.0s
Instable Generators: 178
Instable Generators: 398
Zono Bounds:
[-20.527026284626345, -19.299055460779304, -16.55196789710752, -18.304067500858498, -18.08017268591817, -17.76025440810228, -18.896337879386728, -18.29194235628397, -16.6015355504964, -15.841663793145411]
[24.00351870930769, 23.975764991580025, 20.127852283781696, 21.31822108950895, 22.90255048951672, 20.31269932834797, 21.36133985789119, 22.14021522095969, 18.60369714853354, 18.169964962067898]
[Thread 1] Processed 100 zonotopes (Work Done: 7.8125%; Expected Zonos: 1280.0)


TIMEOUT REACHED
UNKNOWN
[Thread 1] Total splits: 109
Processed 116 zonotopes (Work Done: 12.5%); Generated 218 (1.0389906849913793s/loop)
[Thread 1] Finished in 120.52s
 ────────────────────────────────────────────────────────────────────────────────
                                        Time                    Allocations      
                               ───────────────────────   ────────────────────────
       Tot / % measured:             121s / 100.0%           9.66GiB / 100.0%    

 Section               ncalls     time    %tot     avg     alloc    %tot      avg
 ────────────────────────────────────────────────────────────────────────────────
 Verify                     1     121s  100.0%    121s   9.65GiB   99.9%  9.65GiB
   Zonotope Loop            1     121s  100.0%    121s   9.65GiB   99.9%  9.65GiB
     Property Check       116     117s   97.5%   1.01s   6.83GiB   70.7%  60.3MiB
     Zonotope Propa...    116    3.00s    2.5%  25.8ms   2.68GiB   27.8%  23.7MiB
       DiffZonotope...    348    2.26s    1.9%  6.48ms    442MiB    4.5%  1.27MiB
         Zonotope_D...    696    844ms    0.7%  1.21ms    195MiB    2.0%   286KiB
       DiffZonotope...    232    740ms    0.6%  3.19ms   2.25GiB   23.3%  9.93MiB
         Zonotope_R...    464    435ms    0.4%   937μs   1.35GiB   14.0%  2.99MiB
           Column M...    464    242ms    0.2%   521μs    608MiB    6.2%  1.31MiB
           Influenc...    464   77.4ms    0.1%   167μs    156MiB    1.6%   345KiB
             Multiply     464   69.1ms    0.1%   149μs    131MiB    1.3%   290KiB
             Alloca...    464   6.65ms    0.0%  14.3μs   25.0MiB    0.3%  55.1KiB
             Set Ma...    464   1.07ms    0.0%  2.31μs     0.00B    0.0%    0.00B
           Allocation     464   53.1ms    0.0%   115μs    608MiB    6.2%  1.31MiB
           Set Matrix     464   52.8ms    0.0%   114μs   2.93MiB    0.0%  6.47KiB
           Vectors        464   8.94ms    0.0%  19.3μs   11.3MiB    0.1%  25.0KiB
           Bounds         464    248μs    0.0%   535ns     0.00B    0.0%    0.00B
     Compute Split        109   19.8ms    0.0%   182μs   41.9MiB    0.4%   393KiB
 Initialize                 1   1.94ms    0.0%  1.94ms   5.26MiB    0.1%  5.26MiB
 ────────────────────────────────────────────────────────────────────────────────
[VERYDIFF_TIMER] 120.555072944

[VERYDIFF_EXPERIMENT] NETWORK: /home/i57/steuber/NeuroDiff/repos/VeryDiffExperiments/src/../benchmarks/mnist-prune/specs/mnist_27_local_21.vnnlib
[VERYDIFF_EXPERIMENT] TIME: 120.857638044
