
[VERYDIFF_EXPERIMENT] Running on /home/i57/steuber/NeuroDiff/repos/VeryDiffExperiments/src/../benchmarks/mnist-prune/specs/mnist_98_local_18.vnnlib /home/i57/steuber/NeuroDiff/repos/VeryDiffExperiments/src/../benchmarks/mnist-prune/nets/mnist_relu_2_512.onnx
Parsing /home/i57/steuber/NeuroDiff/repos/VeryDiffExperiments/src/../benchmarks/mnist-prune/nets/mnist_relu_2_512.onnx...
Found input X
op: matmul, weight: (512, 784), bias: nothing
op: bias, weight: nothing, bias: (512,)
op: relu, weight: nothing, bias: nothing
op: matmul, weight: (512, 512), bias: nothing
op: bias, weight: nothing, bias: (512,)
op: relu, weight: nothing, bias: nothing
op: matmul, weight: (10, 512), bias: nothing
op: bias, weight: nothing, bias: (10,)
Parsing /home/i57/steuber/NeuroDiff/repos/VeryDiffExperiments/src/../benchmarks/mnist-prune/nets_pruned/mnist_relu_2_512_0.79-old.onnx...
Found input X
op: gemm, weight: (512, 784), bias: (512,)
op: relu, weight: nothing, bias: nothing
op: gemm, weight: (512, 512), bias: (512,)
op: relu, weight: nothing, bias: nothing
op: gemm, weight: (10, 512), bias: (10,)
Distance: 973.3044369037136
Distance: 481.63499746812613
Distance: 8.744412635378467
Running with 1 threads
[Thread 1] Time to first task: 0.0s
Instable Generators: 135
Instable Generators: 223
Zono Bounds:
[-9.233510589277952, -9.827323445305655, -7.602128251455358, -9.091446050201428, -9.92677385824317, -9.133562565882398, -9.05529575277548, -9.21316041251518, -8.406911865286167, -8.767079810205606]
[13.218425390640082, 12.112102425557865, 11.080059209670694, 11.330829814542769, 12.180197362219207, 9.632210569246821, 11.075783425355274, 11.883649559470367, 10.238061244913565, 9.954354107492778]
[Thread 1] Total splits: 0
Processed 1 zonotopes (Work Done: 100.0%); Generated 0 (0.527123835s/loop)
[Thread 1] Finished in 0.53s
 ────────────────────────────────────────────────────────────────────────────────
                                        Time                    Allocations      
                               ───────────────────────   ────────────────────────
       Tot / % measured:            529ms / 100.0%           76.3MiB / 100.0%    

 Section               ncalls     time    %tot     avg     alloc    %tot      avg
 ────────────────────────────────────────────────────────────────────────────────
 Verify                     1    527ms   99.6%   527ms   71.1MiB   93.1%  71.1MiB
   Zonotope Loop            1    527ms   99.6%   527ms   71.1MiB   93.1%  71.1MiB
     Property Check         1    497ms   93.9%   497ms   51.6MiB   67.6%  51.6MiB
     Zonotope Propa...      1   30.0ms    5.7%  30.0ms   18.7MiB   24.5%  18.7MiB
       DiffZonotope...      3   26.4ms    5.0%  8.79ms   3.23MiB    4.2%  1.08MiB
         Zonotope_D...      6   14.7ms    2.8%  2.45ms   1.42MiB    1.9%   242KiB
       DiffZonotope...      2   3.63ms    0.7%  1.81ms   15.5MiB   20.2%  7.73MiB
         Zonotope_R...      4   2.03ms    0.4%   507μs   9.20MiB   12.1%  2.30MiB
           Column M...      4   1.08ms    0.2%   270μs   4.11MiB    5.4%  1.03MiB
           Influenc...      4    362μs    0.1%  90.5μs    872KiB    1.1%   218KiB
             Multiply       4    332μs    0.1%  83.0μs    721KiB    0.9%   180KiB
             Alloca...      4   16.2μs    0.0%  4.06μs    148KiB    0.2%  37.1KiB
             Set Ma...      4   7.92μs    0.0%  1.98μs     0.00B    0.0%    0.00B
           Set Matrix       4    311μs    0.1%  77.7μs   20.3KiB    0.0%  5.09KiB
           Allocation       4    187μs    0.0%  46.7μs   4.11MiB    5.4%  1.03MiB
           Vectors          4   75.4μs    0.0%  18.9μs    100KiB    0.1%  25.0KiB
           Bounds           4   1.92μs    0.0%   479ns     0.00B    0.0%    0.00B
 Initialize                 1   1.94ms    0.4%  1.94ms   5.24MiB    6.9%  5.24MiB
 ────────────────────────────────────────────────────────────────────────────────
[VERYDIFF_TIMER] 0.559526195

[VERYDIFF_EXPERIMENT] NETWORK: /home/i57/steuber/NeuroDiff/repos/VeryDiffExperiments/src/../benchmarks/mnist-prune/specs/mnist_98_local_18.vnnlib
[VERYDIFF_EXPERIMENT] TIME: 0.861041213
