
[VERYDIFF_EXPERIMENT] Running on /home/i57/steuber/NeuroDiff/repos/VeryDiffExperiments/src/../benchmarks/mnist-prune/specs/mnist_28_local_15.vnnlib /home/i57/steuber/NeuroDiff/repos/VeryDiffExperiments/src/../benchmarks/mnist-prune/nets/mnist_relu_2_512.onnx
Loading /home/i57/steuber/NeuroDiff/repos/VeryDiffExperiments/src/../benchmarks/mnist-prune/nets/mnist_relu_2_512.onnx and /home/i57/steuber/NeuroDiff/repos/VeryDiffExperiments/src/../benchmarks/mnist-prune/nets_pruned/mnist_relu_2_512_pruned5.onnx
INPUT SHAPE: 784
Refined: 7 | Refine Limit: 5 | Wrong: 0 | Right: 2 | Total: 2 | Total Zonos Considered: 9 | Expected 15 (13.333333333333334%)Refined: 12 | Refine Limit: 10 | Wrong: 0 | Right: 7 | Total: 7 | Total Zonos Considered: 19 | Expected 55 (12.727272727272727%)Refined: 16 | Refine Limit: 9 | Wrong: 0 | Right: 15 | Total: 15 | Total Zonos Considered: 31 | Expected 119 (12.605042016806722%)Refined: 20 | Refine Limit: 10 | Wrong: 0 | Right: 23 | Total: 23 | Total Zonos Considered: 43 | Expected 183 (12.568306010928962%)Refined: 25 | Refine Limit: 10 | Wrong: 0 | Right: 32 | Total: 32 | Total Zonos Considered: 57 | Expected 254 (12.598425196850393%)Refined: 30 | Refine Limit: 10 | Wrong: 0 | Right: 38 | Total: 38 | Total Zonos Considered: 68 | Expected 301 (12.624584717607974%)Refined: 33 | Refine Limit: 6 | Wrong: 0 | Right: 49 | Total: 49 | Total Zonos Considered: 82 | Expected 387 (12.661498708010335%)Refined: 40 | Refine Limit: 14 | Wrong: 0 | Right: 53 | Total: 53 | Total Zonos Considered: 93 | Expected 418 (12.679425837320574%)Refined: 46 | Refine Limit: 10 | Wrong: 0 | Right: 57 | Total: 57 | Total Zonos Considered: 103 | Expected 450 (12.666666666666668%)Refined: 54 | Refine Limit: 22 | Wrong: 0 | Right: 58 | Total: 58 | Total Zonos Considered: 112 | Expected 458 (12.663755458515283%)Refined: 54 | Refine Limit: 17 | Wrong: 0 | Right: 73 | Total: 73 | Total Zonos Considered: 127 | Expected 576 (12.67361111111111%)Refined: 56 | Refine Limit: 8 | Wrong: 0 | Right: 89 | Total: 89 | Total Zonos Considered: 145 | Expected 702 (12.678062678062679%)Refined: 62 | Refine Limit: 10 | Wrong: 0 | Right: 91 | Total: 91 | Total Zonos Considered: 153 | Expected 718 (12.674094707520892%)Refined: 70 | Refine Limit: 22 | Wrong: 0 | Right: 92 | Total: 92 | Total Zonos Considered: 162 | Expected 726 (12.672176308539946%)Refined: 74 | Refine Limit: 23 | Wrong: 0 | Right: 103 | Total: 103 | Total Zonos Considered: 177 | Expected 813 (12.669126691266912%)Refined: 74 | Refine Limit: 14 | Wrong: 0 | Right: 120 | Total: 120 | Total Zonos Considered: 194 | Expected 947 (12.671594508975712%)NETWORKS EQUIVALENT
Refined: 74 | Refine Limit: 2 | Wrong: 0 | Right: 138 | Total: 138 | Total Zonos Considered: 212 | Expected 832 (16.58653846153846%)

time: 38.389359453

[VERYDIFF_TIMER] 38.412750038

[VERYDIFF_EXPERIMENT] Running on /home/i57/steuber/NeuroDiff/repos/VeryDiffExperiments/src/../benchmarks/mnist-prune/specs/mnist_28_local_15.vnnlib /home/i57/steuber/NeuroDiff/repos/VeryDiffExperiments/src/../benchmarks/mnist-prune/nets/mnist_relu_3_100.onnx
Loading /home/i57/steuber/NeuroDiff/repos/VeryDiffExperiments/src/../benchmarks/mnist-prune/nets/mnist_relu_3_100.onnx and /home/i57/steuber/NeuroDiff/repos/VeryDiffExperiments/src/../benchmarks/mnist-prune/nets_pruned/mnist_relu_3_100_pruned5.onnx
INPUT SHAPE: 784
Skipping 0 row
Skipping 0 row
NETWORKS EQUIVALENT
Refined: 0 | Refine Limit: -1 | Wrong: 0 | Right: 1 | Total: 1 | Total Zonos Considered: 1 | Expected 2 (50.0%)

time: 0.335765373

[VERYDIFF_TIMER] 0.366955513

[VERYDIFF_EXPERIMENT] NETWORK: /home/i57/steuber/NeuroDiff/repos/VeryDiffExperiments/src/../benchmarks/mnist-prune/specs/mnist_28_local_15.vnnlib
[VERYDIFF_EXPERIMENT] TIME: 39.348963444
