
[VERYDIFF_EXPERIMENT] Running on /home/i57/steuber/NeuroDiff/repos/VeryDiffExperiments/src/../benchmarks/mnist-prune/specs/mnist_70_local_21.vnnlib /home/i57/steuber/NeuroDiff/repos/VeryDiffExperiments/src/../benchmarks/mnist-prune/nets/mnist_relu_3_100.onnx
Parsing /home/i57/steuber/NeuroDiff/repos/VeryDiffExperiments/src/../benchmarks/mnist-prune/nets/mnist_relu_3_100.onnx...
Found input X
op: matmul, weight: (100, 784), bias: nothing
op: bias, weight: nothing, bias: (100,)
op: relu, weight: nothing, bias: nothing
op: matmul, weight: (100, 100), bias: nothing
op: bias, weight: nothing, bias: (100,)
op: relu, weight: nothing, bias: nothing
op: matmul, weight: (10, 100), bias: nothing
op: bias, weight: nothing, bias: (10,)
op: relu, weight: nothing, bias: nothing
op: matmul, weight: (10, 10), bias: nothing
op: bias, weight: nothing, bias: (10,)
Parsing /home/i57/steuber/NeuroDiff/repos/VeryDiffExperiments/src/../benchmarks/mnist-prune/nets_pruned/mnist_relu_3_100_0.79_adam_1_stepsize-old.onnx...
Found input X
op: gemm, weight: (100, 784), bias: (100,)
op: relu, weight: nothing, bias: nothing
op: gemm, weight: (100, 100), bias: (100,)
op: relu, weight: nothing, bias: nothing
op: gemm, weight: (10, 100), bias: (10,)
op: relu, weight: nothing, bias: nothing
op: gemm, weight: (10, 10), bias: (10,)
Distance: 368.62397500800625
Distance: 47.56803950402309
Distance: 2.8977568827249343
Distance: 0.01885471428334995
Running with 1 threads
[Thread 1] Time to first task: 0.0s
Instable Generators: 36
Instable Generators: 49
Instable Generators: 6
Zono Bounds:
[-1.2465070619042047, -1.3769750369293023, -1.3696590070644885, -1.3685127459122208, -0.0007283199978852603, -1.6661910103427533, -0.00012088126730990304, -1.2940449286719151, -1.302377693319236, -1.5281027870908073]
[1.247058304428756, 1.2691759202233095, 1.219151982944394, 1.2790632835245415, 0.0009440187681707572, 1.5650697337264483, 0.0007576171572218072, 1.4105773787306701, 1.2915305670707096, 1.5207470776128043]
[Thread 1] Total splits: 0
Processed 1 zonotopes (Work Done: 100.0%); Generated 0 (0.031534783s/loop)
[Thread 1] Finished in 0.03s
 ────────────────────────────────────────────────────────────────────────────────
                                        Time                    Allocations      
                               ───────────────────────   ────────────────────────
       Tot / % measured:           31.9ms / 100.0%           17.2MiB / 100.0%    

 Section               ncalls     time    %tot     avg     alloc    %tot      avg
 ────────────────────────────────────────────────────────────────────────────────
 Verify                     1   31.6ms   99.0%  31.6ms   16.3MiB   95.1%  16.3MiB
   Zonotope Loop            1   31.5ms   98.9%  31.5ms   16.3MiB   95.1%  16.3MiB
     Property Check         1   29.7ms   93.3%  29.7ms   13.9MiB   81.0%  13.9MiB
     Zonotope Propa...      1   1.67ms    5.3%  1.67ms   1.55MiB    9.0%  1.55MiB
       DiffZonotope...      4   1.10ms    3.4%   275μs    330KiB    1.9%  82.5KiB
         Zonotope_D...      8    477μs    1.5%  59.6μs    165KiB    0.9%  20.6KiB
       DiffZonotope...      3    565μs    1.8%   188μs   1.22MiB    7.1%   417KiB
         Zonotope_R...      6    284μs    0.9%  47.4μs    826KiB    4.7%   138KiB
           Influenc...      6    108μs    0.3%  18.0μs    251KiB    1.4%  41.9KiB
             Multiply       6   72.8μs    0.2%  12.1μs    159KiB    0.9%  26.5KiB
             Alloca...      6   22.7μs    0.1%  3.78μs   90.4KiB    0.5%  15.1KiB
             Set Ma...      6   7.69μs    0.0%  1.28μs     0.00B    0.0%    0.00B
           Column M...      6   78.7μs    0.2%  13.1μs    272KiB    1.5%  45.4KiB
           Allocation       6   37.5μs    0.1%  6.25μs    272KiB    1.5%  45.3KiB
           Set Matrix       6   31.0μs    0.1%  5.16μs   6.09KiB    0.0%  1.02KiB
           Vectors          6   18.5μs    0.1%  3.08μs   19.5KiB    0.1%  3.26KiB
           Bounds           6   2.08μs    0.0%   347ns     0.00B    0.0%    0.00B
 Initialize                 1    311μs    1.0%   311μs    858KiB    4.9%   858KiB
 ────────────────────────────────────────────────────────────────────────────────
[VERYDIFF_TIMER] 0.061627444

[VERYDIFF_EXPERIMENT] NETWORK: /home/i57/steuber/NeuroDiff/repos/VeryDiffExperiments/src/../benchmarks/mnist-prune/specs/mnist_70_local_21.vnnlib
[VERYDIFF_EXPERIMENT] TIME: 0.370726744
