
[VERYDIFF_EXPERIMENT] Running on /home/i57/steuber/NeuroDiff/repos/VeryDiffExperiments/src/../benchmarks/mnist-prune/specs/mnist_21_global_4.vnnlib /home/i57/steuber/NeuroDiff/repos/VeryDiffExperiments/src/../benchmarks/mnist-prune/nets/mnist_relu_3_100.onnx
Found input X
op: matmul, weight: (100, 784), bias: nothing
op: bias, weight: nothing, bias: (100,)
op: relu, weight: nothing, bias: nothing
op: matmul, weight: (100, 100), bias: nothing
op: bias, weight: nothing, bias: (100,)
op: relu, weight: nothing, bias: nothing
op: matmul, weight: (10, 100), bias: nothing
op: bias, weight: nothing, bias: (10,)
op: relu, weight: nothing, bias: nothing
op: matmul, weight: (10, 10), bias: nothing
op: bias, weight: nothing, bias: (10,)
Found input X
op: gemm, weight: (100, 784), bias: (100,)
op: relu, weight: nothing, bias: nothing
op: gemm, weight: (100, 100), bias: (100,)
op: relu, weight: nothing, bias: nothing
op: gemm, weight: (10, 100), bias: (10,)
op: relu, weight: nothing, bias: nothing
op: gemm, weight: (10, 10), bias: (10,)
Distance: 1958.4889029213523
Distance: 144.28197153992141
Distance: 22.063573056613677
Distance: 0.8412832540489035
Running with 1 threads
[Thread 1] Time to first task: 0.0s
Instable Generators: 35
Instable Generators: 51
Instable Generators: 6
Zono Bounds:
[-5.048513469895011, -4.3884246335097, -5.298269596063799, -0.022744504971815814, -5.476245560714383, -5.697723366973322, -5.262688898078983, -0.015562556273121276, -4.642812894680046, -0.007922520037207162]
[4.56700114342016, 4.3093155439099355, 4.89186021157891, -0.009168816657648564, 5.587352252825522, 5.602637889295383, 5.07068050700027, -0.0006544980865996284, 4.957910442103086, 0.019900899989891134]
[Thread 1] Processed 100 zonotopes (Work Done: 0.0%; Expected Zonos: Inf)
[Thread 1] Processed 200 zonotopes (Work Done: 0.0%; Expected Zonos: Inf)
[Thread 1] Processed 300 zonotopes (Work Done: 0.0%; Expected Zonos: Inf)
[Thread 1] Processed 400 zonotopes (Work Done: 0.0%; Expected Zonos: Inf)
[Thread 1] Processed 500 zonotopes (Work Done: 0.0%; Expected Zonos: Inf)


TIMEOUT REACHED
UNKNOWN
[Thread 1] Total splits: 572
Processed 572 zonotopes (Work Done: 0.0%); Generated 1144 (0.21008972439335663s/loop)
[Thread 1] Finished in 120.17s
 ────────────────────────────────────────────────────────────────────────────────
                                        Time                    Allocations      
                               ───────────────────────   ────────────────────────
       Tot / % measured:             120s / 100.0%           61.3GiB / 100.0%    

 Section               ncalls     time    %tot     avg     alloc    %tot      avg
 ────────────────────────────────────────────────────────────────────────────────
 Verify                     1     120s  100.0%    120s   61.3GiB  100.0%  61.3GiB
   Zonotope Loop            1     120s  100.0%    120s   61.3GiB  100.0%  61.3GiB
     Zonotope Propa...    572    72.6s   60.4%   127ms   41.3GiB   67.4%  74.0MiB
       DiffZonotope...  1.72k    62.5s   52.0%  36.4ms   39.0GiB   63.6%  23.3MiB
         Zonotope_R...  3.43k    61.9s   51.5%  18.0ms   38.1GiB   62.1%  11.4MiB
           Influenc...  3.43k    54.1s   45.0%  15.8ms   35.0GiB   57.2%  10.5MiB
             Alloca...  3.43k    26.3s   21.9%  7.66ms   17.2GiB   28.0%  5.13MiB
             Multiply   3.43k    25.3s   21.1%  7.38ms   17.8GiB   29.1%  5.32MiB
             Set Ma...  3.43k    2.48s    2.1%   723μs     0.00B    0.0%    0.00B
           Column M...  3.43k    3.99s    3.3%  1.16ms   1.52GiB    2.5%   464KiB
           Allocation   3.43k    3.61s    3.0%  1.05ms   1.52GiB    2.5%   464KiB
           Set Matrix   3.43k    191ms    0.2%  55.7μs   3.61MiB    0.0%  1.08KiB
           Vectors      3.43k   17.8ms    0.0%  5.18μs   10.9MiB    0.0%  3.26KiB
           Bounds       3.43k   2.50ms    0.0%   728ns     0.00B    0.0%    0.00B
       DiffZonotope...  2.29k    10.0s    8.3%  4.37ms   2.33GiB    3.8%  1.04MiB
         Zonotope_D...  4.58k    4.83s    4.0%  1.06ms   1.52GiB    2.5%   349KiB
     Compute Split        572    31.7s   26.4%  55.4ms   8.70GiB   14.2%  15.6MiB
     Property Check       572    113ms    0.1%   197μs    119MiB    0.2%   213KiB
 Initialize                 1    559μs    0.0%   559μs   5.41MiB    0.0%  5.41MiB
 ────────────────────────────────────────────────────────────────────────────────
[VERYDIFF_TIMER] 120.201749628

[VERYDIFF_EXPERIMENT] NETWORK: /home/i57/steuber/NeuroDiff/repos/VeryDiffExperiments/src/../benchmarks/mnist-prune/specs/mnist_21_global_4.vnnlib
[VERYDIFF_EXPERIMENT] TIME: 120.661576599
