
[VERYDIFF_EXPERIMENT] Running on /home/i57/steuber/NeuroDiff/repos/VeryDiffExperiments/src/../benchmarks/mnist-prune/specs/mnist_7_global_5.vnnlib /home/i57/steuber/NeuroDiff/repos/VeryDiffExperiments/src/../benchmarks/mnist-prune/nets/mnist_relu_3_100.onnx
Found input X
op: matmul, weight: (100, 784), bias: nothing
op: bias, weight: nothing, bias: (100,)
op: relu, weight: nothing, bias: nothing
op: matmul, weight: (100, 100), bias: nothing
op: bias, weight: nothing, bias: (100,)
op: relu, weight: nothing, bias: nothing
op: matmul, weight: (10, 100), bias: nothing
op: bias, weight: nothing, bias: (10,)
op: relu, weight: nothing, bias: nothing
op: matmul, weight: (10, 10), bias: nothing
op: bias, weight: nothing, bias: (10,)
Found input X
op: gemm, weight: (100, 784), bias: (100,)
op: relu, weight: nothing, bias: nothing
op: gemm, weight: (100, 100), bias: (100,)
op: relu, weight: nothing, bias: nothing
op: gemm, weight: (10, 100), bias: (10,)
op: relu, weight: nothing, bias: nothing
op: gemm, weight: (10, 10), bias: (10,)
Distance: 368.62397500800625
Distance: 47.56803950402309
Distance: 2.8977568827249343
Distance: 0.01885471428334995
Running with 1 threads
[Thread 1] Time to first task: 0.0s
Instable Generators: 49
Instable Generators: 83
Instable Generators: 9
Zono Bounds:
[-0.0002611467422599089, -2.159502796410209, -2.3851420994545993, -2.314154769744404, -2.51952361104966, -2.6206375244132256, -2.4379844469633274, -2.350126328164167, -2.193662339632169, -2.2427279799189117]
[0.0006561602667941659, 2.0607007545103566, 2.3835271944603917, 2.305397574263677, 2.375227750686391, 2.5526382164874595, 2.4378669310310435, 2.19321927504182, 2.1189841117992914, 2.2282157564924985]
[Thread 1] Processed 100 zonotopes (Work Done: 0.0%; Expected Zonos: Inf)
[Thread 1] Processed 200 zonotopes (Work Done: 0.0%; Expected Zonos: Inf)
[Thread 1] Processed 300 zonotopes (Work Done: 0.0%; Expected Zonos: Inf)
[Thread 1] Processed 400 zonotopes (Work Done: 0.0%; Expected Zonos: Inf)
[Thread 1] Processed 500 zonotopes (Work Done: 0.0%; Expected Zonos: Inf)


TIMEOUT REACHED
UNKNOWN
[Thread 1] Total splits: 552
Processed 552 zonotopes (Work Done: 0.0%); Generated 1104 (0.21756610710144927s/loop)
[Thread 1] Finished in 120.1s
 ────────────────────────────────────────────────────────────────────────────────
                                        Time                    Allocations      
                               ───────────────────────   ────────────────────────
       Tot / % measured:             120s / 100.0%           61.2GiB / 100.0%    

 Section               ncalls     time    %tot     avg     alloc    %tot      avg
 ────────────────────────────────────────────────────────────────────────────────
 Verify                     1     120s  100.0%    120s   61.2GiB  100.0%  61.2GiB
   Zonotope Loop            1     120s  100.0%    120s   61.2GiB  100.0%  61.2GiB
     Zonotope Propa...    552     112s   93.1%   202ms   41.7GiB   68.1%  77.4MiB
       DiffZonotope...  2.21k    77.2s   64.3%  35.0ms   2.29GiB    3.7%  1.06MiB
         Zonotope_D...  4.42k    72.2s   60.1%  16.3ms   1.49GiB    2.4%   353KiB
       DiffZonotope...  1.66k    34.6s   28.8%  20.9ms   39.4GiB   64.4%  24.4MiB
         Zonotope_R...  3.31k    34.0s   28.3%  10.3ms   38.4GiB   62.8%  11.9MiB
           Influenc...  3.31k    33.0s   27.4%  10.0ms   35.4GiB   57.8%  10.9MiB
             Alloca...  3.31k    18.2s   15.2%  5.51ms   17.2GiB   28.2%  5.33MiB
             Multiply   3.31k    12.2s   10.2%  3.68ms   18.2GiB   29.7%  5.62MiB
             Set Ma...  3.31k    2.50s    2.1%   754μs     0.00B    0.0%    0.00B
           Column M...  3.31k    459ms    0.4%   138μs   1.51GiB    2.5%   480KiB
           Allocation   3.31k    353ms    0.3%   107μs   1.51GiB    2.5%   480KiB
           Set Matrix   3.31k    192ms    0.2%  57.9μs   4.62MiB    0.0%  1.43KiB
           Vectors      3.31k   17.1ms    0.0%  5.15μs   10.5MiB    0.0%  3.26KiB
           Bounds       3.31k   2.36ms    0.0%   711ns     0.00B    0.0%    0.00B
     Compute Split        552    4.09s    3.4%  7.40ms   8.68GiB   14.2%  16.1MiB
     Property Check       552    608ms    0.5%  1.10ms   64.7MiB    0.1%   120KiB
 Initialize                 1    526μs    0.0%   526μs   5.41MiB    0.0%  5.41MiB
 ────────────────────────────────────────────────────────────────────────────────
[VERYDIFF_TIMER] 120.128213703

[VERYDIFF_EXPERIMENT] NETWORK: /home/i57/steuber/NeuroDiff/repos/VeryDiffExperiments/src/../benchmarks/mnist-prune/specs/mnist_7_global_5.vnnlib
[VERYDIFF_EXPERIMENT] TIME: 120.539671989
