
[VERYDIFF_EXPERIMENT] Running on /home/i57/steuber/NeuroDiff/repos/VeryDiffExperiments/src/../benchmarks/mnist-prune/specs/mnist_73_local_15.vnnlib /home/i57/steuber/NeuroDiff/repos/VeryDiffExperiments/src/../benchmarks/mnist-prune/nets/mnist_relu_4_1024.onnx
Parsing /home/i57/steuber/NeuroDiff/repos/VeryDiffExperiments/src/../benchmarks/mnist-prune/nets/mnist_relu_4_1024.onnx...
Found input X
op: matmul, weight: (1024, 784), bias: nothing
op: bias, weight: nothing, bias: (1024,)
op: relu, weight: nothing, bias: nothing
op: matmul, weight: (1024, 1024), bias: nothing
op: bias, weight: nothing, bias: (1024,)
op: relu, weight: nothing, bias: nothing
op: matmul, weight: (1024, 1024), bias: nothing
op: bias, weight: nothing, bias: (1024,)
op: relu, weight: nothing, bias: nothing
op: matmul, weight: (10, 1024), bias: nothing
op: bias, weight: nothing, bias: (10,)
op: relu, weight: nothing, bias: nothing
op: matmul, weight: (10, 10), bias: nothing
op: bias, weight: nothing, bias: (10,)
Parsing /home/i57/steuber/NeuroDiff/repos/VeryDiffExperiments/src/../benchmarks/mnist-prune/nets_pruned/mnist_relu_4_1024_0.79-old.onnx...
Found input X
op: gemm, weight: (1024, 784), bias: (1024,)
op: relu, weight: nothing, bias: nothing
op: gemm, weight: (1024, 1024), bias: (1024,)
op: relu, weight: nothing, bias: nothing
op: gemm, weight: (1024, 1024), bias: (1024,)
op: relu, weight: nothing, bias: nothing
op: gemm, weight: (10, 1024), bias: (10,)
op: relu, weight: nothing, bias: nothing
op: gemm, weight: (10, 10), bias: (10,)
Distance: 915.6394868631054
Distance: 1298.7052820973968
Distance: 1296.587532894263
Distance: 6.054483317080667
Distance: 0.04942679278974538
Running with 1 threads
[Thread 1] Time to first task: 0.0s
Instable Generators: 284
Instable Generators: 458
Instable Generators: 923
Instable Generators: 9
Zono Bounds:
[-46.7025998396712, -46.389721826613716, -51.018605506854996, -52.03759314817863, -49.20774346590754, -51.84209254632338, -0.014341621001897852, -49.555496698897414, -49.85069167021278, -51.53945594280099]
[46.70498991142308, 46.30176329857644, 50.90716843853288, 51.46165989800552, 49.17758825332284, 51.144174470138246, 0.01890877454299945, 49.43414132050337, 49.32518881208689, 51.46654855691907]


TIMEOUT REACHED
UNKNOWN
[Thread 1] Total splits: 91
Processed 91 zonotopes (Work Done: 0.0%); Generated 182 (1.3228149975274726s/loop)
[Thread 1] Finished in 120.38s
 ────────────────────────────────────────────────────────────────────────────────
                                        Time                    Allocations      
                               ───────────────────────   ────────────────────────
       Tot / % measured:             120s / 100.0%           29.6GiB / 100.0%    

 Section               ncalls     time    %tot     avg     alloc    %tot      avg
 ────────────────────────────────────────────────────────────────────────────────
 Verify                     1     120s  100.0%    120s   29.6GiB   99.9%  29.6GiB
   Zonotope Loop            1     120s  100.0%    120s   29.6GiB   99.9%  29.6GiB
     Property Check        91    86.8s   72.1%   954ms   15.0GiB   50.8%   169MiB
     Zonotope Propa...     91    33.5s   27.8%   368ms   14.4GiB   48.7%   162MiB
       DiffZonotope...    455    24.1s   20.0%  53.0ms   3.07GiB   10.4%  6.90MiB
         Zonotope_D...    910    8.29s    6.9%  9.11ms   1.26GiB    4.2%  1.42MiB
       DiffZonotope...    364    9.38s    7.8%  25.8ms   11.4GiB   38.4%  32.0MiB
         Zonotope_R...    728    3.59s    3.0%  4.93ms   6.84GiB   23.1%  9.62MiB
           Column M...    728    1.85s    1.5%  2.54ms   2.99GiB   10.1%  4.20MiB
           Allocation     728    843ms    0.7%  1.16ms   2.99GiB   10.1%  4.20MiB
           Influenc...    728    477ms    0.4%   655μs    856MiB    2.8%  1.18MiB
             Multiply     728    462ms    0.4%   634μs    785MiB    2.6%  1.08MiB
             Alloca...    728   8.47ms    0.0%  11.6μs   71.3MiB    0.2%   100KiB
             Set Ma...    728   5.26ms    0.0%  7.23μs     0.00B    0.0%    0.00B
           Set Matrix     728    385ms    0.3%   528μs   6.14MiB    0.0%  8.64KiB
           Vectors        728   31.5ms    0.0%  43.3μs   24.2MiB    0.1%  34.0KiB
           Bounds         728    459μs    0.0%   631ns     0.00B    0.0%    0.00B
     Compute Split         91   32.4ms    0.0%   356μs   54.7MiB    0.2%   615KiB
 Initialize                 1   14.3ms    0.0%  14.3ms   22.3MiB    0.1%  22.3MiB
 ────────────────────────────────────────────────────────────────────────────────
[VERYDIFF_TIMER] 120.459290372

[VERYDIFF_EXPERIMENT] NETWORK: /home/i57/steuber/NeuroDiff/repos/VeryDiffExperiments/src/../benchmarks/mnist-prune/specs/mnist_73_local_15.vnnlib
[VERYDIFF_EXPERIMENT] TIME: 120.772479976
