
[VERYDIFF_EXPERIMENT] Running on /home/i57/steuber/NeuroDiff/repos/VeryDiffExperiments/src/../benchmarks/mnist-prune/specs/mnist_71_global_5.vnnlib /home/i57/steuber/NeuroDiff/repos/VeryDiffExperiments/src/../benchmarks/mnist-prune/nets/mnist_relu_3_100.onnx
Parsing /home/i57/steuber/NeuroDiff/repos/VeryDiffExperiments/src/../benchmarks/mnist-prune/nets/mnist_relu_3_100.onnx...
Found input X
op: matmul, weight: (100, 784), bias: nothing
op: bias, weight: nothing, bias: (100,)
op: relu, weight: nothing, bias: nothing
op: matmul, weight: (100, 100), bias: nothing
op: bias, weight: nothing, bias: (100,)
op: relu, weight: nothing, bias: nothing
op: matmul, weight: (10, 100), bias: nothing
op: bias, weight: nothing, bias: (10,)
op: relu, weight: nothing, bias: nothing
op: matmul, weight: (10, 10), bias: nothing
op: bias, weight: nothing, bias: (10,)
Parsing /home/i57/steuber/NeuroDiff/repos/VeryDiffExperiments/src/../benchmarks/mnist-prune/nets_pruned/mnist_relu_3_100_0.79_adam_1_stepsize-old.onnx...
Found input X
op: gemm, weight: (100, 784), bias: (100,)
op: relu, weight: nothing, bias: nothing
op: gemm, weight: (100, 100), bias: (100,)
op: relu, weight: nothing, bias: nothing
op: gemm, weight: (10, 100), bias: (10,)
op: relu, weight: nothing, bias: nothing
op: gemm, weight: (10, 10), bias: (10,)
Distance: 368.62397500800625
Distance: 47.56803950402309
Distance: 2.8977568827249343
Distance: 0.01885471428334995
Running with 1 threads
[Thread 1] Time to first task: 0.0s
Instable Generators: 22
Instable Generators: 21
Instable Generators: 3
Zono Bounds:
[-0.3764563606814266, 0.00026892447389975974, -0.4417680457164912, -0.0002823051826352369, -0.4841808397165043, -0.047330683193289834, -0.34103313934907464, -0.7049196391561329, -0.0005577397693680016, -0.4254953095414766]
[0.5018342418637554, 0.0010308555755502195, 0.4955258285049359, 0.0006933905664485457, 0.4829804397594094, 0.04754916375274119, 0.49132490556075903, 0.5120636482971735, -0.00028693913451236007, 0.4087046255801308]
[Thread 1] Total splits: 0
Processed 1 zonotopes (Work Done: 100.0%); Generated 0 (0.28576797s/loop)
[Thread 1] Finished in 0.29s
 ────────────────────────────────────────────────────────────────────────────────
                                        Time                    Allocations      
                               ───────────────────────   ────────────────────────
       Tot / % measured:            286ms / 100.0%            150MiB / 100.0%    

 Section               ncalls     time    %tot     avg     alloc    %tot      avg
 ────────────────────────────────────────────────────────────────────────────────
 Verify                     1    286ms   99.8%   286ms    144MiB   96.4%   144MiB
   Zonotope Loop            1    286ms   99.8%   286ms    144MiB   96.4%   144MiB
     Property Check         1    233ms   81.5%   233ms   53.9MiB   36.0%  53.9MiB
     Zonotope Propa...      1   49.1ms   17.2%  49.1ms   70.4MiB   47.1%  70.4MiB
       DiffZonotope...      4   24.8ms    8.6%  6.19ms   4.08MiB    2.7%  1.02MiB
         Zonotope_D...      8   9.07ms    3.2%  1.13ms   2.69MiB    1.8%   344KiB
       DiffZonotope...      3   24.3ms    8.5%  8.11ms   66.4MiB   44.3%  22.1MiB
         Zonotope_R...      6   23.5ms    8.2%  3.92ms   64.9MiB   43.3%  10.8MiB
           Influenc...      6   22.3ms    7.8%  3.71ms   59.6MiB   39.8%  9.93MiB
             Multiply       6   16.9ms    5.9%  2.81ms   30.1MiB   20.1%  5.01MiB
             Set Ma...      6   4.06ms    1.4%   676μs     0.00B    0.0%    0.00B
             Alloca...      6   1.32ms    0.5%   220μs   29.5MiB   19.7%  4.92MiB
           Column M...      6    802μs    0.3%   134μs   2.62MiB    1.8%   447KiB
           Set Matrix       6    302μs    0.1%  50.4μs   4.03KiB    0.0%     688B
           Allocation       6    127μs    0.0%  21.2μs   2.62MiB    1.8%   447KiB
           Vectors          6   28.3μs    0.0%  4.72μs   19.5KiB    0.0%  3.26KiB
           Bounds           6   3.58μs    0.0%   597ns     0.00B    0.0%    0.00B
 Initialize                 1    567μs    0.2%   567μs   5.41MiB    3.6%  5.41MiB
 ────────────────────────────────────────────────────────────────────────────────
[VERYDIFF_TIMER] 0.316677096

[VERYDIFF_EXPERIMENT] NETWORK: /home/i57/steuber/NeuroDiff/repos/VeryDiffExperiments/src/../benchmarks/mnist-prune/specs/mnist_71_global_5.vnnlib
[VERYDIFF_EXPERIMENT] TIME: 0.622518585
