
[VERYDIFF_EXPERIMENT] Running on /home/i57/steuber/NeuroDiff/repos/VeryDiffExperiments/src/../benchmarks/mnist-prune/specs/mnist_19_local_18.vnnlib /home/i57/steuber/NeuroDiff/repos/VeryDiffExperiments/src/../benchmarks/mnist-prune/nets/mnist_relu_2_512.onnx
Found input X
op: matmul, weight: (512, 784), bias: nothing
op: bias, weight: nothing, bias: (512,)
op: relu, weight: nothing, bias: nothing
op: matmul, weight: (512, 512), bias: nothing
op: bias, weight: nothing, bias: (512,)
op: relu, weight: nothing, bias: nothing
op: matmul, weight: (10, 512), bias: nothing
op: bias, weight: nothing, bias: (10,)
Found input X
op: matmul, weight: (512, 784), bias: nothing
op: bias, weight: nothing, bias: (512,)
op: relu, weight: nothing, bias: nothing
op: matmul, weight: (512, 512), bias: nothing
op: bias, weight: nothing, bias: (512,)
op: relu, weight: nothing, bias: nothing
op: matmul, weight: (10, 512), bias: nothing
op: bias, weight: nothing, bias: (10,)
Distance: 1085.5985166831802
Distance: 1719.8468985003963
Distance: 31.228482716001736
Running with 1 threads
[Thread 1] Time to first task: 0.0s
Instable Generators: 208
Instable Generators: 404
Zono Bounds:
[-16.04570040407639, -12.41417950801538, -15.831571082355758, -13.453559930345815, -9.570286850950755, -11.638470329827356, -12.037939250561628, -13.42070414329304, -10.271876168528921, -11.893323881577892]
[12.950105255856585, 14.992662933762357, 11.494311983401225, 12.72910047168602, 16.120102963173867, 12.28865432277951, 14.05625871434852, 13.87182632111374, 10.534079388683148, 9.909911841526668]

Found counterexample: ([0.0, 0.0, 0.0, 0.0, 0.0, 0.0, 0.0, 0.0, 0.0, 0.0, 0.0, 0.0, 0.0, 0.0, 0.0, 0.0, 0.0, 0.0, 0.0, 0.0, 0.0, 0.0, 0.0, 0.0, 0.0, 0.0, 0.0, 0.0, 0.0, 0.0, 0.0, 0.0, 0.0, 0.0, 0.0, 0.0, 0.0, 0.0, 0.0, 0.0, 0.0, 0.0, 0.0, 0.0, 0.0, 0.0, 0.0, 0.0, 0.0, 0.0, 0.0, 0.0, 0.0, 0.0, 0.0, 0.0, 0.0, 0.0, 0.0, 0.0, 0.0, 0.0, 0.0, 0.0, 0.0, 0.0, 0.0, 0.0, 0.0, 1.0, 0.0, 0.0, 0.0, 0.0, 0.0, 0.0, 0.0, 0.0, 0.0, 0.0, 0.0, 0.0, 0.0, 0.0, 0.0, 0.0, 0.0, 0.0, 0.0, 0.0, 0.0, 0.0, 0.0, 0.0, 0.0, 0.0, 0.0, 0.0, 0.0, 0.0, 0.0, 0.0, 0.0, 0.0, 0.0, 0.0, 0.0, 0.0, 0.0, 0.0, 0.0, 0.0, 0.0, 0.0, 0.0, 0.0, 1.0, 0.0, 0.0, 0.0, 0.0, 0.0, 0.0, 0.0, 0.0, 0.0, 0.0, 0.0, 0.0, 0.0, 0.0, 0.0, 0.0, 0.0, 0.0, 0.0, 0.0, 0.0, 0.0, 0.0, 0.0, 0.0, 0.0, 0.0, 0.0, 0.0, 0.0, 0.0, 0.0, 0.0, 0.0, 0.0, 0.0, 0.0, 0.0, 0.0, 0.0, 0.0, 1.0, 0.35686275, 0.0, 0.0, 0.0, 0.0, 0.0, 0.0, 0.0, 0.0, 0.0, 0.0, 0.0, 0.0, 0.0, 0.0, 0.0, 0.0, 0.0, 0.0, 0.0, 0.0, 0.0, 0.0, 0.0, 1.0, 0.0, 0.00784314, 0.91764706, 0.49411765, 0.0, 0.0, 0.0, 0.0, 0.0, 0.0, 0.0, 0.0, 0.0, 0.0, 1.0, 0.0, 0.0, 0.0, 0.0, 0.0, 0.0, 0.0, 0.0, 0.0, 0.0, 0.0, 0.0, 0.0, 0.0, 0.2, 0.99607843, 0.49411765, 0.0, 0.0, 0.0, 1.0, 0.0, 0.0, 0.0, 0.0, 0.0, 0.0, 0.0, 0.0, 0.0, 0.0, 0.0, 0.0, 0.0, 0.14901961, 0.69803923, 0.12156863, 0.0, 0.0, 0.0, 0.0, 0.0, 0.2, 0.99607843, 0.31764707, 0.0, 0.0, 0.0, 0.0, 0.0, 0.0, 0.0, 0.0, 1.0, 0.0, 0.0, 0.0, 0.0, 0.0, 0.0, 0.0, 0.0, 0.36862746, 0.99607843, 0.32549021, 0.0, 0.0, 0.0, 0.0, 0.0, 0.34117648, 0.99607843, 0.21176471, 0.0, 0.0, 0.0, 0.0, 0.0, 0.0, 0.0, 0.0, 0.0, 0.0, 0.0, 1.0, 0.0, 0.0, 0.0, 0.0, 0.0, 0.627451, 0.99607843, 0.21960784, 0.0, 0.0, 0.0, 0.0, 0.0, 0.74117649, 0.93333334, 0.01568628, 0.0, 0.0, 0.0, 0.0, 0.0, 0.0, 0.0, 0.0, 0.0, 0.0, 0.0, 0.0, 0.0, 0.0, 0.0, 0.0, 0.05098039, 0.89019608, 0.65882355, 0.00784314, 0.0, 0.0, 0.0, 0.0, 0.0, 0.0, 0.9254902, 0.0, 0.0, 0.0, 0.0, 0.0, 0.0, 0.0, 0.0, 0.0, 0.0, 0.0, 0.0, 0.0, 0.0, 0.0, 0.0, 0.0, 0.21568628, 0.99607843, 0.44705883, 0.0, 0.0, 0.0, 0.0, 1.0, 0.0627451, 0.92156863, 0.65490198, 0.0, 0.0, 0.0, 0.0, 0.0, 0.0, 0.0, 0.0, 0.0, 0.0, 0.0, 0.0, 0.0, 0.0, 0.0, 0.0, 0.0, 0.4509804, 0.99607843, 0.19607843, 0.0, 0.0, 0.0, 0.0, 0.0, 0.40392157, 0.99607843, 0.41176471, 0.0, 0.0, 0.0, 0.0, 0.0, 0.0, 0.0, 0.0, 0.0, 0.0, 0.0, 0.0, 0.0, 0.0, 0.0, 0.0, 0.02745098, 0.86666667, 0.9254902, 0.29411766, 0.61176473, 0.70588237, 0.74509805, 0.98823529, 0.98823529, 0.99215686, 0.99607843, 0.44705883, 0.0, 0.0, 0.0, 0.0, 0.0, 0.0, 0.0, 0.0, 0.0, 0.0, 0.0, 0.0, 0.0, 0.0, 0.0, 0.0, 0.05882353, 0.99607843, 0.99607843, 0.99607843, 0.98823529, 0.82745099, 0.7019608, 0.7019608, 0.7019608, 0.0, 0.99607843, 0.96862745, 0.36862746, 0.0, 0.0, 0.0, 0.0, 0.0, 0.0, 0.0, 0.0, 0.0, 0.0, 0.0, 0.0, 0.0, 0.0, 0.0, 0.03137255, 0.8509804, 0.93725491, 0.45882353, 0.08627451, 0.0, 0.0, 0.0, 0.0, 0.88627452, 0.99607843, 0.94901961, 0.77254903, 0.0, 0.0, 0.0, 0.0, 0.0, 0.0, 0.0, 0.0, 0.0, 0.0, 0.0, 0.0, 0.0, 0.0, 0.0, 0.0, 0.05490196, 0.07058824, 0.0, 0.0, 0.0, 0.0, 0.0, 0.10588235, 0.95294118, 0.81176472, 0.18039216, 0.14509805, 0.0, 0.0, 0.0, 0.0, 0.0, 0.0, 0.0, 0.0, 0.0, 0.0, 0.0, 0.0, 0.0, 0.0, 0.0, 0.0, 1.0, 0.0, 0.0, 0.0, 0.0, 0.0, 0.0, 0.3882353, 0.99607843, 0.51764709, 0.0, 0.0, 0.0, 0.0, 0.0, 0.0, 0.0, 0.0, 0.0, 0.0, 0.0, 0.0, 0.0, 0.0, 0.0, 0.0, 0.0, 0.0, 0.0, 0.0, 0.0, 0.0, 0.0, 0.0, 0.0, 0.45490196, 0.99607843, 0.26274511, 0.0, 0.0, 0.0, 0.0, 0.0, 0.0, 0.0, 0.0, 0.0, 0.0, 0.0, 0.0, 0.0, 0.0, 0.0, 0.0, 0.0, 0.0, 0.0, 0.0, 0.0, 0.0, 1.0, 0.0, 0.0, 0.45490196, 0.99607843, 0.23921569, 0.0, 0.0, 0.0, 0.0, 0.0, 0.0, 0.0, 0.0, 0.0, 0.0, 0.0, 0.0, 0.0, 0.0, 0.0, 0.0, 0.0, 0.0, 0.0, 0.0, 0.0, 0.0, 0.0, 0.0, 0.0, 0.45490196, 0.99607843, 0.23921569, 0.0, 0.0, 0.0, 0.0, 0.0, 0.0, 0.0, 0.0, 0.0, 0.0, 0.0, 0.0, 0.0, 0.0, 0.0, 0.0, 0.0, 0.0, 0.0, 0.0, 0.0, 0.0, 0.0, 0.0, 0.0, 0.68235296, 1.0, 0.39215687, 0.0, 0.0, 0.0, 0.0, 0.0, 0.0, 0.0, 0.0, 0.0, 0.0, 0.0, 0.0, 0.0, 0.0, 0.0, 0.0, 0.0, 0.0, 0.0, 0.0, 0.0, 0.0, 0.0, 0.0, 0.0, 0.73333335, 0.99607843, 0.32549021, 0.0, 0.0, 0.0, 0.0, 0.0, 0.0, 0.0, 0.0, 0.0, 0.0, 0.0, 0.0, 0.0, 0.0, 0.0, 0.0, 0.0, 1.0, 0.0, 0.0, 0.0, 0.0, 0.0, 0.0, 0.0, 0.4509804, 0.6901961, 0.03921569, 0.0, 0.0, 0.0, 0.0, 0.0, 0.0, 0.0, 0.0, 0.0, 0.0, 0.0, 0.0, 0.0, 0.0, 0.0, 0.0, 0.0, 0.0, 0.0, 0.0, 0.0, 0.0, 0.0, 0.0, 0.0, 0.0, 0.0, 0.0, 0.0, 0.0, 0.0, 0.0, 0.0, 0.0, 0.0, 0.0, 0.0, 0.0, 0.0, 0.0, 0.0, 0.0, 0.0, 0.0, 0.0, 0.0, 0.0, 0.0, 0.0, 0.0, 0.0, 0.0, 0.0, 0.0, 0.0, 0.0, 0.0, 0.0, 0.0, 0.0, 0.0, 0.0, 0.0, 0.0, 0.0, 0.0, 0.0, 0.0, 0.0, 0.0, 0.0, 0.0, 0.0, 1.0, 0.0, 0.0, 0.0, 0.0, 0.0, 0.0, 0.0, 0.0, 0.0, 0.0, 0.0, 0.0, 0.0, 0.0, 0.0, 0.0, 0.0, 1.0, 0.0, 0.0], ([-60.47233978128987, -29.746641549092068, -39.69644589240649, -48.38322373304281, 1.5484814802902902, -35.65074558265432, -37.135736611727594, -29.134844582848377, -43.31228851575375, -39.01956625349179], [-56.50549069416458, -27.376755582636843, -35.35670838687323, -45.54758842198228, 1.0500554000217006, -33.479982256157975, -35.54839991857269, -26.240032460402862, -40.65509188220774, -35.54901571130909], 4.339737505533257))
[Thread 1] Total splits: 0
Processed 1 zonotopes (Work Done: 0.0%); Generated 0 (0.034493014s/loop)
[Thread 1] Finished in 0.03s
 ────────────────────────────────────────────────────────────────────────────────
                                        Time                    Allocations      
                               ───────────────────────   ────────────────────────
       Tot / % measured:           36.5ms / 100.0%           37.7MiB / 100.0%    

 Section               ncalls     time    %tot     avg     alloc    %tot      avg
 ────────────────────────────────────────────────────────────────────────────────
 Verify                     1   34.5ms   94.7%  34.5ms   32.5MiB   86.1%  32.5MiB
   Zonotope Loop            1   34.5ms   94.6%  34.5ms   32.5MiB   86.1%  32.5MiB
     Zonotope Propa...      1   31.8ms   87.4%  31.8ms   31.0MiB   82.2%  31.0MiB
       DiffZonotope...      3   24.4ms   67.0%  8.14ms   4.85MiB   12.9%  1.62MiB
         Zonotope_D...      6   8.74ms   24.0%  1.46ms   2.08MiB    5.5%   355KiB
       DiffZonotope...      2   7.40ms   20.3%  3.70ms   26.2MiB   69.4%  13.1MiB
         Zonotope_R...      4   3.77ms   10.3%   942μs   15.8MiB   42.0%  3.96MiB
           Column M...      4   1.85ms    5.1%   463μs   6.84MiB   18.1%  1.71MiB
           Influenc...      4    916μs    2.5%   229μs   2.01MiB    5.3%   515KiB
             Multiply       4    809μs    2.2%   202μs   1.77MiB    4.7%   453KiB
             Alloca...      4   90.8μs    0.2%  22.7μs    247KiB    0.6%  61.7KiB
             Set Ma...      4   9.71μs    0.0%  2.43μs     0.00B    0.0%    0.00B
           Set Matrix       4    657μs    1.8%   164μs   33.1KiB    0.1%  8.27KiB
           Allocation       4    262μs    0.7%  65.6μs   6.84MiB   18.1%  1.71MiB
           Vectors          4   66.9μs    0.2%  16.7μs    100KiB    0.3%  25.0KiB
           Bounds           4   2.20μs    0.0%   551ns     0.00B    0.0%    0.00B
     Property Check         1   2.19ms    6.0%  2.19ms    195KiB    0.5%   195KiB
 Initialize                 1   1.93ms    5.3%  1.93ms   5.24MiB   13.9%  5.24MiB
 ────────────────────────────────────────────────────────────────────────────────
[VERYDIFF_TIMER] 0.066252706

[VERYDIFF_EXPERIMENT] Running on /home/i57/steuber/NeuroDiff/repos/VeryDiffExperiments/src/../benchmarks/mnist-prune/specs/mnist_19_local_18.vnnlib /home/i57/steuber/NeuroDiff/repos/VeryDiffExperiments/src/../benchmarks/mnist-prune/nets/mnist_relu_3_100.onnx
Found input X
op: matmul, weight: (100, 784), bias: nothing
op: bias, weight: nothing, bias: (100,)
op: relu, weight: nothing, bias: nothing
op: matmul, weight: (100, 100), bias: nothing
op: bias, weight: nothing, bias: (100,)
op: relu, weight: nothing, bias: nothing
op: matmul, weight: (10, 100), bias: nothing
op: bias, weight: nothing, bias: (10,)
op: relu, weight: nothing, bias: nothing
op: matmul, weight: (10, 10), bias: nothing
op: bias, weight: nothing, bias: (10,)
Found input X
op: matmul, weight: (100, 784), bias: nothing
op: bias, weight: nothing, bias: (100,)
op: relu, weight: nothing, bias: nothing
op: matmul, weight: (100, 100), bias: nothing
op: bias, weight: nothing, bias: (100,)
op: relu, weight: nothing, bias: nothing
op: matmul, weight: (10, 100), bias: nothing
op: bias, weight: nothing, bias: (10,)
op: relu, weight: nothing, bias: nothing
op: matmul, weight: (10, 10), bias: nothing
op: bias, weight: nothing, bias: (10,)
Distance: 296.6600370998244
Distance: 77.24290861755458
Distance: 5.7170369567975285
Distance: 0.0
Running with 1 threads
[Thread 1] Time to first task: 0.0s
Instable Generators: 47
Instable Generators: 67
Instable Generators: 8
Zono Bounds:
[0.0, -1.0571905230386827, -0.8560623750952439, -1.1378626445715705, -0.6798724692505302, -1.6321874670643224, -1.3808732536243133, -1.0706094014836083, -1.0455268471442685, -1.4217672044332925]
[0.0, 1.0571905230386827, 0.8560623750952441, 0.818420206289625, 1.5972414335866703, 1.6321874670643224, 1.3808732536243133, 1.0706094014836083, 0.856303736148047, 0.7222788602665897]
[Thread 1] Processed 100 zonotopes (Work Done: 0.0%; Expected Zonos: Inf)
[Thread 1] Processed 200 zonotopes (Work Done: 0.0%; Expected Zonos: Inf)
[Thread 1] Processed 300 zonotopes (Work Done: 0.0%; Expected Zonos: Inf)
[Thread 1] Processed 400 zonotopes (Work Done: 0.09766%; Expected Zonos: 409600.0)
[Thread 1] Processed 500 zonotopes (Work Done: 3.51562%; Expected Zonos: 14222.222222222223)
[Thread 1] Processed 600 zonotopes (Work Done: 6.32324%; Expected Zonos: 9488.803088803088)
[Thread 1] Processed 700 zonotopes (Work Done: 9.35059%; Expected Zonos: 7486.1618798955615)
[Thread 1] Processed 800 zonotopes (Work Done: 13.11035%; Expected Zonos: 6102.048417132216)
[Thread 1] Processed 900 zonotopes (Work Done: 16.08887%; Expected Zonos: 5593.930197268589)
[Thread 1] Processed 1000 zonotopes (Work Done: 19.92188%; Expected Zonos: 5019.607843137255)
[Thread 1] Processed 1100 zonotopes (Work Done: 25.02441%; Expected Zonos: 4395.707317073171)
[Thread 1] Processed 1200 zonotopes (Work Done: 28.50952%; Expected Zonos: 4209.120102761722)
[Thread 1] Processed 1300 zonotopes (Work Done: 31.98853%; Expected Zonos: 4063.957260064873)
[Thread 1] Processed 1400 zonotopes (Work Done: 37.12158%; Expected Zonos: 3771.390989805985)
[Thread 1] Processed 1500 zonotopes (Work Done: 43.20068%; Expected Zonos: 3472.1672788923424)
[Thread 1] Processed 1600 zonotopes (Work Done: 47.88208%; Expected Zonos: 3341.542383683875)
[Thread 1] Processed 1700 zonotopes (Work Done: 53.62549%; Expected Zonos: 3170.134304575461)
[Thread 1] Processed 1800 zonotopes (Work Done: 58.91724%; Expected Zonos: 3055.133119237543)
[Thread 1] Processed 1900 zonotopes (Work Done: 63.17139%; Expected Zonos: 3007.690821256039)
[Thread 1] Processed 2000 zonotopes (Work Done: 68.48145%; Expected Zonos: 2920.499108734403)
[Thread 1] Processed 2100 zonotopes (Work Done: 75.80566%; Expected Zonos: 2770.24154589372)
[Thread 1] Processed 2200 zonotopes (Work Done: 81.10962%; Expected Zonos: 2712.3786590413124)
[Thread 1] Processed 2300 zonotopes (Work Done: 87.96997%; Expected Zonos: 2614.528550614029)
[Thread 1] Processed 2400 zonotopes (Work Done: 94.74487%; Expected Zonos: 2533.118598209109)
[Thread 1] Processed 2500 zonotopes (Work Done: 99.97559%; Expected Zonos: 2500.610500610501)
[Thread 1] Total splits: 1250
Processed 2501 zonotopes (Work Done: 100.0%); Generated 2500 (0.0014961546545381847s/loop)
[Thread 1] Finished in 3.74s
 ────────────────────────────────────────────────────────────────────────────────
                                        Time                    Allocations      
                               ───────────────────────   ────────────────────────
       Tot / % measured:            3.74s / 100.0%           5.69GiB / 100.0%    

 Section               ncalls     time    %tot     avg     alloc    %tot      avg
 ────────────────────────────────────────────────────────────────────────────────
 Verify                     1    3.74s  100.0%   3.74s   5.69GiB  100.0%  5.69GiB
   Zonotope Loop            1    3.74s  100.0%   3.74s   5.69GiB  100.0%  5.69GiB
     Zonotope Propa...  2.50k    3.16s   84.3%  1.26ms   3.38GiB   59.4%  1.38MiB
       DiffZonotope...  10.0k    2.14s   57.3%   214μs    737MiB   12.6%  75.4KiB
         Zonotope_D...  20.0k    956ms   25.5%  47.8μs    367MiB    6.3%  18.8KiB
       DiffZonotope...  7.50k    999ms   26.7%   133μs   2.66GiB   46.7%   372KiB
         Zonotope_R...  15.0k    533ms   14.2%  35.5μs   1.72GiB   30.2%   120KiB
           Column M...  15.0k    177ms    4.7%  11.8μs    607MiB   10.4%  41.4KiB
           Influenc...  15.0k    176ms    4.7%  11.7μs    485MiB    8.3%  33.1KiB
             Multiply   15.0k    135ms    3.6%  9.00μs    312MiB    5.3%  21.3KiB
             Alloca...  15.0k   21.1ms    0.6%  1.41μs    173MiB    3.0%  11.8KiB
             Set Ma...  15.0k   12.4ms    0.3%   825ns     0.00B    0.0%    0.00B
           Allocation   15.0k   66.1ms    1.8%  4.41μs    606MiB   10.4%  41.3KiB
           Set Matrix   15.0k   60.1ms    1.6%  4.00μs   14.2MiB    0.2%     991B
           Vectors      15.0k   39.7ms    1.1%  2.64μs   47.7MiB    0.8%  3.26KiB
           Bounds       15.0k   3.05ms    0.1%   204ns     0.00B    0.0%    0.00B
     Property Check     2.50k    171ms    4.6%  68.3μs   83.9MiB    1.4%  34.4KiB
     Compute Split      1.25k   58.9ms    1.6%  47.1μs    215MiB    3.7%   176KiB
 Initialize                 1    350μs    0.0%   350μs    839KiB    0.0%   839KiB
 ────────────────────────────────────────────────────────────────────────────────
[VERYDIFF_TIMER] 3.767191645

[VERYDIFF_EXPERIMENT] Running on /home/i57/steuber/NeuroDiff/repos/VeryDiffExperiments/src/../benchmarks/mnist-prune/specs/mnist_19_local_18.vnnlib /home/i57/steuber/NeuroDiff/repos/VeryDiffExperiments/src/../benchmarks/mnist-prune/nets/mnist_relu_4_1024.onnx
Found input X
op: matmul, weight: (1024, 784), bias: nothing
op: bias, weight: nothing, bias: (1024,)
op: relu, weight: nothing, bias: nothing
op: matmul, weight: (1024, 1024), bias: nothing
op: bias, weight: nothing, bias: (1024,)
op: relu, weight: nothing, bias: nothing
op: matmul, weight: (1024, 1024), bias: nothing
op: bias, weight: nothing, bias: (1024,)
op: relu, weight: nothing, bias: nothing
op: matmul, weight: (10, 1024), bias: nothing
op: bias, weight: nothing, bias: (10,)
op: relu, weight: nothing, bias: nothing
op: matmul, weight: (10, 10), bias: nothing
op: bias, weight: nothing, bias: (10,)
Found input X
op: matmul, weight: (1024, 784), bias: nothing
op: bias, weight: nothing, bias: (1024,)
op: relu, weight: nothing, bias: nothing
op: matmul, weight: (1024, 1024), bias: nothing
op: bias, weight: nothing, bias: (1024,)
op: relu, weight: nothing, bias: nothing
op: matmul, weight: (1024, 1024), bias: nothing
op: bias, weight: nothing, bias: (1024,)
op: relu, weight: nothing, bias: nothing
op: matmul, weight: (10, 1024), bias: nothing
op: bias, weight: nothing, bias: (10,)
op: relu, weight: nothing, bias: nothing
op: matmul, weight: (10, 10), bias: nothing
op: bias, weight: nothing, bias: (10,)
Distance: 1266.8815759184893
Distance: 2876.6944248261216
Distance: 2831.8843567411013
Distance: 34.033756025192815
Distance: 0.0
Running with 1 threads
[Thread 1] Time to first task: 0.0s
Instable Generators: 496
Instable Generators: 925
Instable Generators: 973
Instable Generators: 10
Zono Bounds:
[-87.18136477259377, -89.20531105507362, -99.45651309307773, -99.0826688222627, -95.3458226844274, -102.55483923647203, -90.54140591426997, -94.53618626834162, -95.17075628545962, -101.42312917236515]
[87.18136477259377, 89.20531105507362, 97.11105094527572, 99.0826688222627, 95.3458226844274, 97.05656023114621, 87.94498680813035, 94.53618626834162, 95.17075628545962, 101.42312917236515]

Found counterexample: ([0.0, 0.0, 0.0, 0.0, 0.0, 0.0, 0.0, 0.0, 0.0, 0.0, 0.0, 0.0, 0.0, 0.0, 0.0, 0.0, 0.0, 0.0, 0.0, 0.0, 0.0, 0.0, 0.0, 0.0, 0.0, 0.0, 0.0, 0.0, 0.0, 0.0, 0.0, 0.0, 0.0, 0.0, 0.0, 0.0, 0.0, 0.0, 0.0, 0.0, 0.0, 0.0, 0.0, 0.0, 0.0, 0.0, 0.0, 0.0, 0.0, 0.0, 0.0, 0.0, 0.0, 0.0, 0.0, 0.0, 0.0, 0.0, 0.0, 0.0, 0.0, 0.0, 0.0, 0.0, 0.0, 0.0, 0.0, 0.0, 0.0, 0.0, 0.0, 0.0, 0.0, 0.0, 0.0, 0.0, 0.0, 0.0, 0.0, 0.0, 0.0, 0.0, 0.0, 0.0, 0.0, 0.0, 0.0, 0.0, 0.0, 0.0, 0.0, 0.0, 0.0, 0.0, 0.0, 0.0, 0.0, 0.0, 0.0, 0.0, 0.0, 0.0, 0.0, 0.0, 0.0, 0.0, 0.0, 0.0, 0.0, 0.0, 0.0, 0.0, 0.0, 0.0, 0.0, 0.0, 0.0, 0.0, 0.0, 0.0, 0.0, 0.0, 0.0, 0.0, 0.0, 0.0, 0.0, 0.0, 0.0, 0.0, 0.0, 0.0, 0.0, 0.0, 0.0, 0.0, 0.0, 0.0, 0.0, 0.0, 0.0, 0.0, 0.0, 0.0, 0.0, 0.0, 0.0, 0.0, 0.0, 0.0, 0.0, 0.0, 0.0, 0.0, 0.0, 0.0, 0.0, 0.0, 1.0, 0.35686275, 0.0, 0.0, 0.0, 0.0, 0.0, 0.0, 0.0, 0.0, 0.0, 0.0, 0.0, 0.0, 0.0, 0.0, 0.0, 0.0, 0.0, 0.0, 0.0, 0.0, 0.0, 0.0, 0.0, 1.0, 0.0, 0.00784314, 0.91764706, 0.49411765, 0.0, 0.0, 0.0, 0.0, 0.0, 0.0, 0.0, 0.0, 0.0, 0.0, 0.0, 0.0, 0.0, 0.0, 0.0, 0.0, 0.0, 0.0, 0.0, 0.0, 0.0, 0.0, 0.0, 0.0, 0.0, 0.2, 0.99607843, 0.49411765, 0.0, 0.0, 0.0, 0.0, 0.0, 0.0, 0.0, 0.0, 0.0, 0.0, 0.0, 0.0, 0.0, 0.0, 0.0, 0.0, 0.0, 0.14901961, 0.69803923, 0.12156863, 0.0, 0.0, 0.0, 0.0, 0.0, 0.2, 0.99607843, 0.31764707, 0.0, 0.0, 0.0, 0.0, 0.0, 0.0, 0.0, 0.0, 1.0, 0.0, 0.0, 0.0, 0.0, 0.0, 0.0, 0.0, 0.0, 0.36862746, 0.99607843, 0.32549021, 0.0, 0.0, 0.0, 0.0, 0.0, 0.34117648, 0.99607843, 0.21176471, 0.0, 0.0, 0.0, 0.0, 0.0, 0.0, 0.0, 0.0, 0.0, 0.0, 0.0, 0.0, 0.0, 0.0, 0.0, 0.0, 0.0, 0.627451, 0.99607843, 0.21960784, 0.0, 0.0, 0.0, 0.0, 0.0, 0.74117649, 0.93333334, 0.01568628, 0.0, 0.0, 0.0, 0.0, 0.0, 0.0, 0.0, 0.0, 0.0, 0.0, 0.0, 0.0, 0.0, 0.0, 0.0, 0.0, 0.05098039, 0.89019608, 0.65882355, 0.00784314, 0.0, 0.0, 0.0, 0.0, 0.0, 1.0, 0.9254902, 0.0, 0.0, 0.0, 0.0, 0.0, 0.0, 0.0, 0.0, 0.0, 0.0, 0.0, 0.0, 0.0, 0.0, 0.0, 0.0, 0.0, 0.21568628, 0.99607843, 0.44705883, 0.0, 0.0, 0.0, 0.0, 0.0, 0.0627451, 0.92156863, 0.65490198, 0.0, 0.0, 0.0, 0.0, 0.0, 0.0, 0.0, 0.0, 0.0, 0.0, 0.0, 0.0, 0.0, 0.0, 0.0, 0.0, 0.0, 0.4509804, 0.99607843, 0.19607843, 0.0, 0.0, 0.0, 0.0, 0.0, 0.40392157, 0.99607843, 0.41176471, 0.0, 0.0, 0.0, 0.0, 0.0, 0.0, 0.0, 0.0, 0.0, 0.0, 0.0, 0.0, 0.0, 0.0, 0.0, 0.0, 0.02745098, 0.86666667, 0.9254902, 0.29411766, 0.61176473, 0.70588237, 0.74509805, 0.98823529, 0.98823529, 0.99215686, 0.99607843, 0.44705883, 0.0, 0.0, 0.0, 0.0, 0.0, 0.0, 0.0, 0.0, 0.0, 0.0, 0.0, 0.0, 0.0, 0.0, 0.0, 0.0, 0.05882353, 0.99607843, 0.99607843, 0.99607843, 0.98823529, 0.82745099, 0.7019608, 0.7019608, 0.7019608, 1.0, 0.99607843, 0.96862745, 0.36862746, 0.0, 0.0, 0.0, 0.0, 0.0, 0.0, 0.0, 0.0, 0.0, 0.0, 0.0, 0.0, 0.0, 0.0, 0.0, 0.03137255, 0.8509804, 0.93725491, 0.45882353, 0.08627451, 0.0, 0.0, 0.0, 0.0, 0.88627452, 0.99607843, 0.94901961, 0.77254903, 0.0, 0.0, 0.0, 0.0, 0.0, 0.0, 0.0, 0.0, 0.0, 0.0, 0.0, 0.0, 0.0, 0.0, 0.0, 0.0, 0.05490196, 0.07058824, 0.0, 0.0, 0.0, 0.0, 0.0, 0.10588235, 0.95294118, 0.81176472, 0.18039216, 0.14509805, 0.0, 0.0, 0.0, 0.0, 0.0, 0.0, 0.0, 0.0, 0.0, 0.0, 0.0, 0.0, 0.0, 0.0, 0.0, 0.0, 1.0, 0.0, 0.0, 0.0, 0.0, 0.0, 0.0, 0.3882353, 0.99607843, 0.51764709, 0.0, 0.0, 0.0, 0.0, 1.0, 0.0, 0.0, 0.0, 0.0, 0.0, 0.0, 0.0, 0.0, 0.0, 0.0, 0.0, 0.0, 0.0, 0.0, 0.0, 0.0, 0.0, 0.0, 0.0, 0.0, 0.45490196, 0.99607843, 0.26274511, 0.0, 0.0, 0.0, 0.0, 0.0, 0.0, 0.0, 0.0, 0.0, 0.0, 0.0, 0.0, 0.0, 0.0, 0.0, 0.0, 0.0, 0.0, 0.0, 0.0, 0.0, 0.0, 0.0, 0.0, 0.0, 0.45490196, 0.99607843, 0.23921569, 0.0, 0.0, 0.0, 0.0, 0.0, 0.0, 0.0, 0.0, 0.0, 0.0, 0.0, 0.0, 0.0, 0.0, 0.0, 0.0, 0.0, 0.0, 0.0, 0.0, 0.0, 0.0, 0.0, 0.0, 0.0, 0.45490196, 0.99607843, 0.23921569, 0.0, 0.0, 0.0, 0.0, 0.0, 0.0, 0.0, 0.0, 0.0, 0.0, 0.0, 0.0, 0.0, 0.0, 0.0, 0.0, 0.0, 0.0, 0.0, 0.0, 0.0, 0.0, 0.0, 0.0, 0.0, 0.68235296, 1.0, 0.39215687, 0.0, 0.0, 0.0, 0.0, 0.0, 0.0, 0.0, 0.0, 0.0, 0.0, 0.0, 0.0, 0.0, 0.0, 0.0, 0.0, 0.0, 0.0, 0.0, 0.0, 0.0, 0.0, 0.0, 0.0, 0.0, 0.73333335, 0.99607843, 0.32549021, 0.0, 0.0, 0.0, 0.0, 0.0, 0.0, 0.0, 0.0, 0.0, 0.0, 0.0, 0.0, 0.0, 0.0, 0.0, 0.0, 0.0, 1.0, 0.0, 0.0, 0.0, 0.0, 0.0, 0.0, 0.0, 0.4509804, 0.6901961, 0.03921569, 0.0, 0.0, 0.0, 0.0, 0.0, 0.0, 0.0, 0.0, 0.0, 0.0, 0.0, 0.0, 0.0, 0.0, 0.0, 0.0, 0.0, 0.0, 0.0, 0.0, 0.0, 0.0, 0.0, 0.0, 0.0, 0.0, 0.0, 0.0, 0.0, 0.0, 0.0, 0.0, 0.0, 0.0, 0.0, 0.0, 0.0, 0.0, 0.0, 0.0, 0.0, 0.0, 0.0, 0.0, 0.0, 0.0, 0.0, 0.0, 0.0, 0.0, 0.0, 0.0, 0.0, 0.0, 0.0, 0.0, 0.0, 0.0, 0.0, 0.0, 0.0, 0.0, 0.0, 0.0, 0.0, 0.0, 0.0, 0.0, 0.0, 0.0, 0.0, 0.0, 0.0, 1.0, 0.0, 0.0, 0.0, 0.0, 0.0, 0.0, 0.0, 0.0, 0.0, 0.0, 0.0, 0.0, 0.0, 0.0, 0.0, 0.0, 0.0, 1.0, 0.0, 0.0], ([0.0, 6.484256852779477, 0.0, 0.0, 21.02857212843904, 0.0, 0.0, 7.191197201042036, 0.0, 10.237618674200533], [0.0, 5.346075219108925, 0.0, 0.0, 18.18487792782457, 0.0, 0.0, 4.986901069363647, 0.0, 9.745000229114382], 3.141630236090748))
[Thread 1] Total splits: 0
Processed 1 zonotopes (Work Done: 0.0%); Generated 0 (0.811538335s/loop)
[Thread 1] Finished in 0.81s
 ────────────────────────────────────────────────────────────────────────────────
                                        Time                    Allocations      
                               ───────────────────────   ────────────────────────
       Tot / % measured:            829ms / 100.0%            384MiB / 100.0%    

 Section               ncalls     time    %tot     avg     alloc    %tot      avg
 ────────────────────────────────────────────────────────────────────────────────
 Verify                     1    812ms   98.0%   812ms    362MiB   94.2%   362MiB
   Zonotope Loop            1    812ms   98.0%   812ms    362MiB   94.2%   362MiB
     Zonotope Propa...      1    800ms   96.6%   800ms    360MiB   93.7%   360MiB
       DiffZonotope...      5    586ms   70.8%   117ms   79.7MiB   20.7%  15.9MiB
         Zonotope_D...     10    204ms   24.6%  20.4ms   32.4MiB    8.4%  3.24MiB
       DiffZonotope...      4    214ms   25.8%  53.5ms    280MiB   73.0%  70.1MiB
         Zonotope_R...      8    132ms   16.0%  16.5ms    175MiB   45.7%  21.9MiB
           Column M...      8   56.3ms    6.8%  7.03ms   70.3MiB   18.3%  8.79MiB
           Allocation       8   37.1ms    4.5%  4.64ms   70.3MiB   18.3%  8.79MiB
           Influenc...      8   27.3ms    3.3%  3.41ms   34.5MiB    9.0%  4.31MiB
             Multiply       8   26.8ms    3.2%  3.35ms   32.6MiB    8.5%  4.07MiB
             Alloca...      8    337μs    0.0%  42.1μs   1.91MiB    0.5%   245KiB
             Set Ma...      8    128μs    0.0%  16.0μs     0.00B    0.0%    0.00B
           Set Matrix       8   11.3ms    1.4%  1.42ms    125KiB    0.0%  15.6KiB
           Vectors          8    194μs    0.0%  24.2μs    272KiB    0.1%  34.0KiB
           Bounds           8   6.29μs    0.0%   787ns     0.00B    0.0%    0.00B
     Property Check         1   10.7ms    1.3%  10.7ms    547KiB    0.1%   547KiB
 Initialize                 1   17.0ms    2.0%  17.0ms   22.4MiB    5.8%  22.4MiB
 ────────────────────────────────────────────────────────────────────────────────
[VERYDIFF_TIMER] 0.902243044

[VERYDIFF_EXPERIMENT] NETWORK: /home/i57/steuber/NeuroDiff/repos/VeryDiffExperiments/src/../benchmarks/mnist-prune/specs/mnist_19_local_18.vnnlib
[VERYDIFF_EXPERIMENT] TIME: 5.687771848
