
[VERYDIFF_EXPERIMENT] Running on /home/i57/steuber/NeuroDiff/repos/VeryDiffExperiments/src/../benchmarks/mnist-prune/specs/mnist_2_global_6.vnnlib /home/i57/steuber/NeuroDiff/repos/VeryDiffExperiments/src/../benchmarks/mnist-prune/nets/mnist_relu_3_100.onnx
Found input X
op: matmul, weight: (100, 784), bias: nothing
op: bias, weight: nothing, bias: (100,)
op: relu, weight: nothing, bias: nothing
op: matmul, weight: (100, 100), bias: nothing
op: bias, weight: nothing, bias: (100,)
op: relu, weight: nothing, bias: nothing
op: matmul, weight: (10, 100), bias: nothing
op: bias, weight: nothing, bias: (10,)
op: relu, weight: nothing, bias: nothing
op: matmul, weight: (10, 10), bias: nothing
op: bias, weight: nothing, bias: (10,)
Found input X
op: gemm, weight: (100, 784), bias: (100,)
op: relu, weight: nothing, bias: nothing
op: gemm, weight: (100, 100), bias: (100,)
op: relu, weight: nothing, bias: nothing
op: gemm, weight: (10, 100), bias: (10,)
op: relu, weight: nothing, bias: nothing
op: gemm, weight: (10, 10), bias: (10,)
Distance: 1958.4889029213523
Distance: 144.28197153992141
Distance: 22.063573056613677
Distance: 0.8412832540489035
Running with 1 threads
[Thread 1] Time to first task: 0.0s
Instable Generators: 58
Instable Generators: 84
Instable Generators: 10
Zono Bounds:
[-10.71200365123359, -11.669686016393603, -13.007526946065296, -12.798497699575375, -13.57280394642737, -14.391908172124708, -13.696912133385004, -13.927179893839595, -12.653757638178119, -12.696123636172894]
[10.714061657183226, 11.439447852417034, 13.265468500830055, 13.009344086689072, 13.816716490442932, 14.468036252293633, 13.802863809434745, 14.1293132980865, 12.90131232844112, 12.864023122655675]
[Thread 1] Processed 100 zonotopes (Work Done: 0.0%; Expected Zonos: Inf)
[Thread 1] Processed 200 zonotopes (Work Done: 0.0%; Expected Zonos: Inf)
[Thread 1] Processed 300 zonotopes (Work Done: 0.0%; Expected Zonos: Inf)
[Thread 1] Processed 400 zonotopes (Work Done: 0.0%; Expected Zonos: Inf)
[Thread 1] Processed 500 zonotopes (Work Done: 0.0%; Expected Zonos: Inf)


TIMEOUT REACHED
UNKNOWN
[Thread 1] Total splits: 559
Processed 559 zonotopes (Work Done: 0.0%); Generated 1118 (0.21519208896243291s/loop)
[Thread 1] Finished in 120.29s
 ────────────────────────────────────────────────────────────────────────────────
                                        Time                    Allocations      
                               ───────────────────────   ────────────────────────
       Tot / % measured:             120s / 100.0%           62.7GiB / 100.0%    

 Section               ncalls     time    %tot     avg     alloc    %tot      avg
 ────────────────────────────────────────────────────────────────────────────────
 Verify                     1     120s  100.0%    120s   62.6GiB  100.0%  62.6GiB
   Zonotope Loop            1     120s  100.0%    120s   62.6GiB  100.0%  62.6GiB
     Zonotope Propa...    559     112s   93.5%   201ms   42.8GiB   68.4%  78.5MiB
       DiffZonotope...  2.24k    76.5s   63.6%  34.2ms   2.34GiB    3.7%  1.07MiB
         Zonotope_D...  4.47k    71.4s   59.4%  16.0ms   1.51GiB    2.4%   355KiB
       DiffZonotope...  1.68k    36.0s   29.9%  21.4ms   40.5GiB   64.6%  24.7MiB
         Zonotope_R...  3.35k    35.4s   29.4%  10.5ms   39.5GiB   63.0%  12.0MiB
           Influenc...  3.35k    34.6s   28.8%  10.3ms   36.3GiB   58.0%  11.1MiB
             Alloca...  3.35k    18.8s   15.6%  5.59ms   17.7GiB   28.2%  5.39MiB
             Multiply   3.35k    13.3s   11.0%  3.96ms   18.7GiB   29.8%  5.71MiB
             Set Ma...  3.35k    2.54s    2.1%   757μs     0.00B    0.0%    0.00B
           Column M...  3.35k    448ms    0.4%   134μs   1.55GiB    2.5%   485KiB
           Set Matrix   3.35k    196ms    0.2%  58.4μs   4.90MiB    0.0%  1.49KiB
           Allocation   3.35k    104ms    0.1%  31.1μs   1.55GiB    2.5%   485KiB
           Vectors      3.35k   16.9ms    0.0%  5.04μs   10.7MiB    0.0%  3.26KiB
           Bounds       3.35k   2.36ms    0.0%   703ns     0.00B    0.0%    0.00B
     Compute Split        559    4.12s    3.4%  7.38ms   8.87GiB   14.2%  16.3MiB
     Property Check       559    607ms    0.5%  1.09ms   65.1MiB    0.1%   119KiB
 Initialize                 1    524μs    0.0%   524μs   5.41MiB    0.0%  5.41MiB
 ────────────────────────────────────────────────────────────────────────────────
[VERYDIFF_TIMER] 120.327009821

[VERYDIFF_EXPERIMENT] NETWORK: /home/i57/steuber/NeuroDiff/repos/VeryDiffExperiments/src/../benchmarks/mnist-prune/specs/mnist_2_global_6.vnnlib
[VERYDIFF_EXPERIMENT] TIME: 120.792289032
