
[VERYDIFF_EXPERIMENT] Running on /home/i57/steuber/NeuroDiff/repos/VeryDiffExperiments/src/../benchmarks/mnist-prune/specs/mnist_56_local_24.vnnlib /home/i57/steuber/NeuroDiff/repos/VeryDiffExperiments/src/../benchmarks/mnist-prune/nets/mnist_relu_4_1024.onnx
Found input X
op: matmul, weight: (1024, 784), bias: nothing
op: bias, weight: nothing, bias: (1024,)
op: relu, weight: nothing, bias: nothing
op: matmul, weight: (1024, 1024), bias: nothing
op: bias, weight: nothing, bias: (1024,)
op: relu, weight: nothing, bias: nothing
op: matmul, weight: (1024, 1024), bias: nothing
op: bias, weight: nothing, bias: (1024,)
op: relu, weight: nothing, bias: nothing
op: matmul, weight: (10, 1024), bias: nothing
op: bias, weight: nothing, bias: (10,)
op: relu, weight: nothing, bias: nothing
op: matmul, weight: (10, 10), bias: nothing
op: bias, weight: nothing, bias: (10,)
Found input X
op: gemm, weight: (1024, 784), bias: (1024,)
op: relu, weight: nothing, bias: nothing
op: gemm, weight: (1024, 1024), bias: (1024,)
op: relu, weight: nothing, bias: nothing
op: gemm, weight: (1024, 1024), bias: (1024,)
op: relu, weight: nothing, bias: nothing
op: gemm, weight: (10, 1024), bias: (10,)
op: relu, weight: nothing, bias: nothing
op: gemm, weight: (10, 10), bias: (10,)
Distance: 915.6394868631054
Distance: 1298.7052820973968
Distance: 1296.587532894263
Distance: 6.054483317080667
Distance: 0.04942679278974538
Running with 1 threads
[Thread 1] Time to first task: 0.0s
Instable Generators: 455
Instable Generators: 896
Instable Generators: 1024
Instable Generators: 10
Zono Bounds:
[-178.28881187438293, -181.67217504957432, -200.06924615288062, -198.58195343515962, -191.5578296944113, -202.20816503357784, -180.80473579540134, -189.46738924368054, -193.60739949224083, -201.66163751947897]
[178.2120538810085, 180.90105230414565, 199.9022536223933, 198.06120337825212, 191.42653889877616, 202.01082617209605, 180.7883270373476, 188.29224626248873, 193.70963794231406, 201.46728327663897]
[Thread 1] Processed 100 zonotopes (Work Done: 0.0%; Expected Zonos: Inf)


TIMEOUT REACHED
UNKNOWN
[Thread 1] Total splits: 132
Processed 132 zonotopes (Work Done: 0.0%); Generated 264 (0.9093189148560605s/loop)
[Thread 1] Finished in 120.03s
 ────────────────────────────────────────────────────────────────────────────────
                                        Time                    Allocations      
                               ───────────────────────   ────────────────────────
       Tot / % measured:             120s / 100.0%           41.3GiB / 100.0%    

 Section               ncalls     time    %tot     avg     alloc    %tot      avg
 ────────────────────────────────────────────────────────────────────────────────
 Verify                     1     120s  100.0%    120s   41.3GiB   99.9%  41.3GiB
   Zonotope Loop            1     120s  100.0%    120s   41.3GiB   99.9%  41.3GiB
     Zonotope Propa...    132     119s   99.5%   905ms   40.9GiB   99.1%   318MiB
       DiffZonotope...    660    63.7s   53.0%  96.5ms   8.76GiB   21.2%  13.6MiB
         Zonotope_D...  1.32k    22.0s   18.3%  16.7ms   3.57GiB    8.6%  2.77MiB
       DiffZonotope...    528    55.8s   46.5%   106ms   32.2GiB   77.9%  62.4MiB
         Zonotope_R...  1.06k    16.5s   13.7%  15.6ms   20.1GiB   48.6%  19.5MiB
           Allocation   1.06k    8.95s    7.5%  8.47ms   8.07GiB   19.5%  7.82MiB
           Column M...  1.06k    4.08s    3.4%  3.86ms   8.07GiB   19.5%  7.82MiB
           Influenc...  1.06k    2.04s    1.7%  1.93ms   3.91GiB    9.5%  3.79MiB
             Multiply   1.06k    1.97s    1.6%  1.87ms   3.61GiB    8.7%  3.50MiB
             Alloca...  1.06k   43.9ms    0.0%  41.6μs    303MiB    0.7%   294KiB
             Set Ma...  1.06k   19.1ms    0.0%  18.1μs     0.00B    0.0%    0.00B
           Set Matrix   1.06k    1.38s    1.1%  1.31ms   14.9MiB    0.0%  14.5KiB
           Vectors      1.06k   25.4ms    0.0%  24.0μs   35.0MiB    0.1%  34.0KiB
           Bounds       1.06k    685μs    0.0%   649ns     0.00B    0.0%    0.00B
     Property Check       132    485ms    0.4%  3.68ms   65.8MiB    0.2%   510KiB
     Compute Split        132   68.1ms    0.1%   516μs    179MiB    0.4%  1.35MiB
 Initialize                 1   14.3ms    0.0%  14.3ms   22.4MiB    0.1%  22.4MiB
 ────────────────────────────────────────────────────────────────────────────────
[VERYDIFF_TIMER] 120.125057879

[VERYDIFF_EXPERIMENT] NETWORK: /home/i57/steuber/NeuroDiff/repos/VeryDiffExperiments/src/../benchmarks/mnist-prune/specs/mnist_56_local_24.vnnlib
[VERYDIFF_EXPERIMENT] TIME: 120.462124415
