
[VERYDIFF_EXPERIMENT] Running on /home/i57/steuber/NeuroDiff/repos/VeryDiffExperiments/src/../benchmarks/mnist-prune/specs/mnist_90_global_5.vnnlib /home/i57/steuber/NeuroDiff/repos/VeryDiffExperiments/src/../benchmarks/mnist-prune/nets/mnist_relu_4_1024.onnx
Found input X
op: matmul, weight: (1024, 784), bias: nothing
op: bias, weight: nothing, bias: (1024,)
op: relu, weight: nothing, bias: nothing
op: matmul, weight: (1024, 1024), bias: nothing
op: bias, weight: nothing, bias: (1024,)
op: relu, weight: nothing, bias: nothing
op: matmul, weight: (1024, 1024), bias: nothing
op: bias, weight: nothing, bias: (1024,)
op: relu, weight: nothing, bias: nothing
op: matmul, weight: (10, 1024), bias: nothing
op: bias, weight: nothing, bias: (10,)
op: relu, weight: nothing, bias: nothing
op: matmul, weight: (10, 10), bias: nothing
op: bias, weight: nothing, bias: (10,)
Found input X
op: gemm, weight: (1024, 784), bias: (1024,)
op: relu, weight: nothing, bias: nothing
op: gemm, weight: (1024, 1024), bias: (1024,)
op: relu, weight: nothing, bias: nothing
op: gemm, weight: (1024, 1024), bias: (1024,)
op: relu, weight: nothing, bias: nothing
op: gemm, weight: (10, 1024), bias: (10,)
op: relu, weight: nothing, bias: nothing
op: gemm, weight: (10, 10), bias: (10,)
Distance: 915.6394868631054
Distance: 1298.7052820973968
Distance: 1296.587532894263
Distance: 6.054483317080667
Distance: 0.04942679278974538
Running with 1 threads
[Thread 1] Time to first task: 0.01s
Instable Generators: 383
Instable Generators: 668
Instable Generators: 1022
Instable Generators: 10
Zono Bounds:
[-95.10219582033189, -97.38503022408001, -107.47028817315604, -105.80123172179536, -102.57681970884893, -108.46510775498595, -96.29075129103501, -101.56591648466203, -103.72720543748088, -107.51162376728283]
[95.0302583724279, 96.95062610884109, 106.99262072745697, 105.64609766848282, 102.55184322880957, 108.36521046330884, 96.29796189738738, 100.42470452692147, 103.82489205006601, 107.2753727007121]


TIMEOUT REACHED
UNKNOWN
[Thread 1] Total splits: 49
Processed 49 zonotopes (Work Done: 0.0%); Generated 98 (2.482049175265306s/loop)
[Thread 1] Finished in 121.62s
 ────────────────────────────────────────────────────────────────────────────────
                                        Time                    Allocations      
                               ───────────────────────   ────────────────────────
       Tot / % measured:             122s / 100.0%           34.1GiB / 100.0%    

 Section               ncalls     time    %tot     avg     alloc    %tot      avg
 ────────────────────────────────────────────────────────────────────────────────
 Verify                     1     122s  100.0%    122s   34.1GiB   99.9%  34.1GiB
   Zonotope Loop            1     122s  100.0%    122s   34.1GiB   99.9%  34.1GiB
     Zonotope Propa...     49     119s   97.7%   2.43s   31.2GiB   91.5%   652MiB
       DiffZonotope...    196    67.8s   55.7%   346ms   25.8GiB   75.7%   135MiB
         Zonotope_R...    392    40.7s   33.5%   104ms   20.9GiB   61.3%  54.6MiB
           Influenc...    392    17.8s   14.6%  45.3ms   12.1GiB   35.5%  31.6MiB
             Multiply     392    16.1s   13.2%  41.1ms   7.14GiB   20.9%  18.6MiB
             Alloca...    392    865ms    0.7%  2.21ms   4.97GiB   14.6%  13.0MiB
             Set Ma...    392    786ms    0.6%  2.01ms     0.00B    0.0%    0.00B
           Column M...    392    16.8s   13.8%  42.8ms   4.38GiB   12.9%  11.5MiB
           Allocation     392    5.37s    4.4%  13.7ms   4.38GiB   12.9%  11.5MiB
           Set Matrix     392    807ms    0.7%  2.06ms   5.10MiB    0.0%  13.3KiB
           Vectors        392   11.4ms    0.0%  29.2μs   13.0MiB    0.0%  34.0KiB
           Bounds         392    286μs    0.0%   731ns     0.00B    0.0%    0.00B
       DiffZonotope...    245    51.0s   42.0%   208ms   5.40GiB   15.8%  22.6MiB
         Zonotope_D...    490    26.4s   21.7%  53.9ms   2.87GiB    8.4%  6.00MiB
     Compute Split         49    2.07s    1.7%  42.3ms   1.89GiB    5.5%  39.5MiB
     Property Check        49    559ms    0.5%  11.4ms   28.2MiB    0.1%   589KiB
 Initialize                 1   14.9ms    0.0%  14.9ms   27.0MiB    0.1%  27.0MiB
 ────────────────────────────────────────────────────────────────────────────────
[VERYDIFF_TIMER] 121.728000163

[VERYDIFF_EXPERIMENT] NETWORK: /home/i57/steuber/NeuroDiff/repos/VeryDiffExperiments/src/../benchmarks/mnist-prune/specs/mnist_90_global_5.vnnlib
[VERYDIFF_EXPERIMENT] TIME: 122.076294443
