
[VERYDIFF_EXPERIMENT] Running on /home/i57/steuber/NeuroDiff/repos/VeryDiffExperiments/src/../benchmarks/mnist-prune/specs/mnist_46_global_3.vnnlib /home/i57/steuber/NeuroDiff/repos/VeryDiffExperiments/src/../benchmarks/mnist-prune/nets/mnist_relu_2_512.onnx
/home/i57/steuber/NeuroDiff/repos/VeryDiffExperiments/src/../benchmarks/mnist-prune/nets/mnist_relu_2_512.onnx
/home/i57/steuber/NeuroDiff/repos/VeryDiffExperiments/src/../benchmarks/mnist-prune/nets_pruned/mnist_relu_2_512_pruned5.onnx
[[0.         0.01176471]
 [0.         0.01176471]
 [0.         0.01176471]
 ...
 [0.         0.01176471]
 [0.         0.01176471]
 [0.         0.01176471]]
1.0
120
False
512
512
512
512
Set parameter TimeLimit to value 120
Set parameter Threads to value 1
Set parameter BestObjStop to value 1
Set parameter BestBdStop to value 1
Gurobi Optimizer version 10.0.0 build v10.0.0rc2 (linux64)

CPU model: Intel(R) Core(TM) i5-6500 CPU @ 3.20GHz, instruction set [SSE2|AVX|AVX2]
Thread count: 4 physical cores, 4 logical processors, using up to 1 threads

Optimize a model with 14479 rows, 7010 columns and 1321743 nonzeros
Model fingerprint: 0xcabb6273
Variable types: 4932 continuous, 2078 integer (2078 binary)
Coefficient statistics:
  Matrix range     [1e-07, 2e+06]
  Objective range  [1e+00, 1e+00]
  Bounds range     [4e-03, 1e+00]
  RHS range        [1e-04, 2e+06]
Warning: Model contains large matrix coefficient range
         Consider reformulating model or setting NumericFocus parameter
         to avoid numerical issues.
Presolve removed 8669 rows and 2641 columns
Presolve time: 1.92s
Presolved: 5810 rows, 4369 columns, 507642 nonzeros
Variable types: 3257 continuous, 1112 integer (1112 binary)

Root relaxation: objective 3.253744e+02, 4624 iterations, 2.23 seconds (4.88 work units)

    Nodes    |    Current Node    |     Objective Bounds      |     Work
 Expl Unexpl |  Obj  Depth IntInf | Incumbent    BestBd   Gap | It/Node Time

     0     0  325.37439    0  557          -  325.37439      -     -    4s
     0     0  310.47781    0  539          -  310.47781      -     -   14s
     0     0  309.68201    0  639          -  309.68201      -     -   15s
     0     0  309.67805    0  639          -  309.67805      -     -   15s
     0     0  309.67633    0  640          -  309.67633      -     -   15s
     0     0  309.67625    0  640          -  309.67625      -     -   16s
     0     0  309.48764    0  661          -  309.48764      -     -   20s
     0     0  307.39736    0  628          -  307.39736      -     -   21s
     0     0  307.39288    0  623          -  307.39288      -     -   21s
     0     0  307.35929    0  620          -  307.35929      -     -   21s
     0     0  307.34263    0  615          -  307.34263      -     -   22s
     0     0  307.30854    0  605          -  307.30854      -     -   22s
     0     0  307.30658    0  608          -  307.30658      -     -   23s
     0     0  307.27643    0  610          -  307.27643      -     -   29s
     0     0  307.27472    0  611          -  307.27472      -     -   30s
     0     0  307.26361    0  610          -  307.26361      -     -   36s
     0     0  307.26197    0  609          -  307.26197      -     -   37s
     0     0  307.25429    0  611          -  307.25429      -     -   40s
     0     0  307.25429    0  474          -  307.25429      -     -   48s
     0     2  276.37463    0  470          -  276.37463      -     -   68s
     1     3  270.68295    1  678          -  270.68295      -  7571   75s
     3     5  261.24615    2  636          -  261.24615      -  5172   83s
     4     6   63.06487    3  539          -  258.65634      -  5219   87s
    15    11   71.15187    9  552          -  258.65634      -  1607   90s
    49    25   66.08939   26  536          -  258.65634      -   633   95s
    92    42   62.07155   50  506          -  258.65634      -   411  100s
   129    57 infeasible   69               -  258.65634      -   343  105s
   165    69   54.17258   87  470          -  258.65634      -   307  110s
   208    94   50.34885  108  448          -  258.65634      -   275  115s

Cutting planes:
  Gomory: 1
  Implied bound: 4
  MIR: 104
  Flow cover: 23
  RLT: 283

Explored 251 nodes (84170 simplex iterations) in 120.00 seconds (201.15 work units)
Thread count was 1 (of 4 available processors)

Solution count 0

Time limit reached
Best objective -, best bound 2.586563433273e+02, gap -


TIMEOUT
time: 151.525371588

[VERYDIFF_TIMER] 151.588878396

[VERYDIFF_EXPERIMENT] Running on /home/i57/steuber/NeuroDiff/repos/VeryDiffExperiments/src/../benchmarks/mnist-prune/specs/mnist_46_global_3.vnnlib /home/i57/steuber/NeuroDiff/repos/VeryDiffExperiments/src/../benchmarks/mnist-prune/nets/mnist_relu_3_100.onnx
/home/i57/steuber/NeuroDiff/repos/VeryDiffExperiments/src/../benchmarks/mnist-prune/nets/mnist_relu_3_100.onnx
/home/i57/steuber/NeuroDiff/repos/VeryDiffExperiments/src/../benchmarks/mnist-prune/nets_pruned/mnist_relu_3_100_pruned5.onnx
[[0.         0.01176471]
 [0.         0.01176471]
 [0.         0.01176471]
 ...
 [0.         0.01176471]
 [0.         0.01176471]
 [0.         0.01176471]]
1.0
120
False
100
100
10
100
100
10
Set parameter TimeLimit to value 120
Set parameter Threads to value 1
Set parameter BestObjStop to value 1
Set parameter BestBdStop to value 1
Gurobi Optimizer version 10.0.0 build v10.0.0rc2 (linux64)

CPU model: Intel(R) Core(TM) i5-6500 CPU @ 3.20GHz, instruction set [SSE2|AVX|AVX2]
Thread count: 4 physical cores, 4 logical processors, using up to 1 threads

Optimize a model with 3083 rows, 2126 columns and 179668 nonzeros
Model fingerprint: 0xf7a79e11
Variable types: 1676 continuous, 450 integer (450 binary)
Coefficient statistics:
  Matrix range     [1e-06, 2e+06]
  Objective range  [1e+00, 1e+00]
  Bounds range     [4e-03, 1e+00]
  RHS range        [1e-03, 2e+06]
Warning: Model contains large matrix coefficient range
         Consider reformulating model or setting NumericFocus parameter
         to avoid numerical issues.
Presolve removed 1698 rows and 556 columns
Presolve time: 0.51s
Presolved: 1385 rows, 1570 columns, 85023 nonzeros
Variable types: 1329 continuous, 241 integer (241 binary)

Root relaxation: objective 1.821659e+01, 1294 iterations, 0.11 seconds (0.24 work units)

    Nodes    |    Current Node    |     Objective Bounds      |     Work
 Expl Unexpl |  Obj  Depth IntInf | Incumbent    BestBd   Gap | It/Node Time

     0     0   18.21659    0  103          -   18.21659      -     -    0s
     0     0   17.71114    0  105          -   17.71114      -     -    1s
     0     0   17.67652    0  106          -   17.67652      -     -    1s
     0     0   17.47921    0  111          -   17.47921      -     -    2s
     0     0   17.43988    0  114          -   17.43988      -     -    2s
     0     0   17.43910    0  114          -   17.43910      -     -    2s
     0     0   17.40506    0  117          -   17.40506      -     -    2s
     0     0   17.40042    0  127          -   17.40042      -     -    2s
     0     0   17.39977    0  127          -   17.39977      -     -    2s
     0     0   17.39975    0  127          -   17.39975      -     -    2s
     0     0   17.38642    0  131          -   17.38642      -     -    3s
     0     0   17.38252    0  130          -   17.38252      -     -    3s
     0     0   17.38190    0  130          -   17.38190      -     -    3s
     0     0   17.38153    0  131          -   17.38153      -     -    3s
     0     0   17.37905    0  134          -   17.37905      -     -    3s
     0     0   17.37828    0  129          -   17.37828      -     -    3s
     0     0   17.37816    0  128          -   17.37816      -     -    4s
     0     0   17.37694    0  135          -   17.37694      -     -    4s
     0     0   17.37641    0  126          -   17.37641      -     -    4s
     0     0   17.37631    0  125          -   17.37631      -     -    4s
     0     0   17.37558    0  126          -   17.37558      -     -    4s
     0     0   17.37558    0  118          -   17.37558      -     -    5s
     0     2   17.36704    0  118          -   17.36704      -     -    7s
    90    52    0.99244   52   52          -   14.37795      -   102   10s
   516   285    8.23310   13    4          -   13.71582      -  63.5   16s
   521   290    0.30497   78    1          -   13.71582      -  67.3   21s
H  521   275                       0.3137761   13.71582  4271%  67.3   22s
   574   280    1.54619   52   35    0.31378    7.36010  2246%  72.7   25s
  1133   451     cutoff  114         0.31378    4.54450  1348%  59.8   30s
  2211  1024    2.08168   63   45    0.31378    4.52464  1342%  45.6   35s
  2788  1399     cutoff   79         0.31378    3.99184  1172%  42.8   40s
  3559  1934     cutoff   84         0.31378    3.90286  1144%  41.5   45s
  4441  2507    0.49308   81   23    0.31378    3.90213  1144%  40.0   50s
H 4588  2586                       0.3139937    3.90195  1143%  40.0   51s
  5054  2845    2.31453   61   58    0.31399    3.87987  1136%  40.1   55s
H 5598  3214                       0.3139937    3.85643  1128%  40.1   61s
  6054  3526    3.30333   47   45    0.31399    3.85643  1128%  40.8   65s
  6760  4022 infeasible   42         0.31399    3.85643  1128%  41.7   70s
H 7387  4384                       0.3140313    3.57700  1039%  41.7   75s
  8138  4868     cutoff   85         0.31403    3.44435   997%  40.8   80s
H 8387  5035                       0.3140313    3.42473   991%  40.7   82s
  8669  5251    3.40030   68   13    0.31403    3.40030   983%  41.2   85s
  8945  5203 infeasible   75         0.31403    3.40030   983%  45.0   90s
  9299  5177     cutoff   50         0.31403    3.40030   983%  47.1   95s
  9752  5372    0.57757   75   21    0.31403    3.37920   976%  46.9  100s
H 9767  5374                       0.3295448    3.37004   923%  46.9  103s
  9894  5459    0.99852   74   20    0.32954    3.34606   915%  46.9  105s

Explored 10202 nodes (482621 simplex iterations) in 120.20 seconds (184.01 work units)
Thread count was 1 (of 4 available processors)

Solution count 4: 0.329545 0.314031 0.313994 0.313776 

Time limit reached
Best objective 3.295447901089e-01, best bound 3.309412365199e+00, gap 904.2375%


TIMEOUT
time: 124.424911439

[VERYDIFF_TIMER] 124.460705319

[VERYDIFF_EXPERIMENT] Running on /home/i57/steuber/NeuroDiff/repos/VeryDiffExperiments/src/../benchmarks/mnist-prune/specs/mnist_46_global_3.vnnlib /home/i57/steuber/NeuroDiff/repos/VeryDiffExperiments/src/../benchmarks/mnist-prune/nets/mnist_relu_4_1024.onnx
/home/i57/steuber/NeuroDiff/repos/VeryDiffExperiments/src/../benchmarks/mnist-prune/nets/mnist_relu_4_1024.onnx
/home/i57/steuber/NeuroDiff/repos/VeryDiffExperiments/src/../benchmarks/mnist-prune/nets_pruned/mnist_relu_4_1024_pruned5.onnx
[[0.         0.01176471]
 [0.         0.01176471]
 [0.         0.01176471]
 ...
 [0.         0.01176471]
 [0.         0.01176471]
 [0.         0.01176471]]
1.0
120
False
1024
1024
1024
10
1024
1024
1024
10
Set parameter TimeLimit to value 120
Set parameter Threads to value 1
Set parameter BestObjStop to value 1
Set parameter BestBdStop to value 1
Gurobi Optimizer version 10.0.0 build v10.0.0rc2 (linux64)

CPU model: Intel(R) Core(TM) i5-6500 CPU @ 3.20GHz, instruction set [SSE2|AVX|AVX2]
Thread count: 4 physical cores, 4 logical processors, using up to 1 threads

Optimize a model with 43291 rows, 19358 columns and 5656712 nonzeros
Model fingerprint: 0x82306d4f
Variable types: 13164 continuous, 6194 integer (6194 binary)
Coefficient statistics:
  Matrix range     [2e-08, 2e+06]
  Objective range  [1e+00, 1e+00]
  Bounds range     [4e-03, 1e+00]
  RHS range        [1e-07, 2e+06]
Warning: Model contains large matrix coefficient range
         Consider reformulating model or setting NumericFocus parameter
         to avoid numerical issues.
Presolve removed 19249 rows and 4218 columns (presolve time = 5s) ...
Presolve removed 19249 rows and 4218 columns (presolve time = 10s) ...
Presolve removed 19796 rows and 4218 columns (presolve time = 15s) ...
Presolve removed 19796 rows and 4218 columns
Presolve time: 15.82s
Presolved: 23495 rows, 15140 columns, 4188945 nonzeros
Variable types: 10571 continuous, 4569 integer (4569 binary)

Root simplex log...

Iteration    Objective       Primal Inf.    Dual Inf.      Time
       0    1.1778495e+04   7.519059e+03   0.000000e+00     28s
    2567    1.2937830e+03   9.915747e+02   0.000000e+00     30s
    5047    1.2937571e+03   1.423564e+03   0.000000e+00     35s
    6367    1.2937541e+03   1.416400e+04   0.000000e+00     41s
    7487    1.2937515e+03   1.356202e+03   0.000000e+00     45s
    8947    1.2937495e+03   1.384611e+03   0.000000e+00     50s
   10524    1.2937490e+03   0.000000e+00   0.000000e+00     55s
   10750    1.2937564e+03   0.000000e+00   0.000000e+00     56s

Root relaxation: objective 1.293756e+03, 10750 iterations, 30.73 seconds (74.04 work units)
Total elapsed time = 83.75s
Total elapsed time = 88.01s
Total elapsed time = 90.65s

    Nodes    |    Current Node    |     Objective Bounds      |     Work
 Expl Unexpl |  Obj  Depth IntInf | Incumbent    BestBd   Gap | It/Node Time

     0     0 1293.75637    0 1224          - 1293.75637      -     -   95s

Explored 1 nodes (22630 simplex iterations) in 120.10 seconds (175.95 work units)
Thread count was 1 (of 4 available processors)

Solution count 0

Time limit reached
Best objective -, best bound 1.293756369112e+03, gap -


TIMEOUT
time: 263.684216974

[VERYDIFF_TIMER] 263.715575072

[VERYDIFF_EXPERIMENT] NETWORK: /home/i57/steuber/NeuroDiff/repos/VeryDiffExperiments/src/../benchmarks/mnist-prune/specs/mnist_46_global_3.vnnlib
[VERYDIFF_EXPERIMENT] TIME: 540.811221295
