
[VERYDIFF_EXPERIMENT] Running on /home/i57/steuber/NeuroDiff/repos/VeryDiffExperiments/src/../benchmarks/mnist-prune/specs/mnist_84_global_3.vnnlib /home/i57/steuber/NeuroDiff/repos/VeryDiffExperiments/src/../benchmarks/mnist-prune/nets/mnist_relu_4_1024.onnx
Parsing /home/i57/steuber/NeuroDiff/repos/VeryDiffExperiments/src/../benchmarks/mnist-prune/nets/mnist_relu_4_1024.onnx...
Found input X
op: matmul, weight: (1024, 784), bias: nothing
op: bias, weight: nothing, bias: (1024,)
op: relu, weight: nothing, bias: nothing
op: matmul, weight: (1024, 1024), bias: nothing
op: bias, weight: nothing, bias: (1024,)
op: relu, weight: nothing, bias: nothing
op: matmul, weight: (1024, 1024), bias: nothing
op: bias, weight: nothing, bias: (1024,)
op: relu, weight: nothing, bias: nothing
op: matmul, weight: (10, 1024), bias: nothing
op: bias, weight: nothing, bias: (10,)
op: relu, weight: nothing, bias: nothing
op: matmul, weight: (10, 10), bias: nothing
op: bias, weight: nothing, bias: (10,)
Parsing /home/i57/steuber/NeuroDiff/repos/VeryDiffExperiments/src/../benchmarks/mnist-prune/nets_pruned/mnist_relu_4_1024_0.79-old.onnx...
Found input X
op: gemm, weight: (1024, 784), bias: (1024,)
op: relu, weight: nothing, bias: nothing
op: gemm, weight: (1024, 1024), bias: (1024,)
op: relu, weight: nothing, bias: nothing
op: gemm, weight: (1024, 1024), bias: (1024,)
op: relu, weight: nothing, bias: nothing
op: gemm, weight: (10, 1024), bias: (10,)
op: relu, weight: nothing, bias: nothing
op: gemm, weight: (10, 10), bias: (10,)
Distance: 915.6394868631054
Distance: 1298.7052820973968
Distance: 1296.587532894263
Distance: 6.054483317080667
Distance: 0.04942679278974538
Running with 1 threads
[Thread 1] Time to first task: 0.01s
Instable Generators: 251
Instable Generators: 447
Instable Generators: 913
Instable Generators: 10
Zono Bounds:
[-35.80694831643482, -36.7000656939206, -39.82980177271968, -40.278348265635884, -38.74426351044109, -40.6852970439316, -36.82606809652643, -38.45876309654501, -38.99109288831517, -40.21863187868441]
[35.8065947981762, 35.58410378843994, 39.437047886989276, 40.23013447897958, 38.28344271704724, 40.67017960060238, 36.820226589223935, 37.64819539663755, 40.01213186256695, 40.16346405276747]


TIMEOUT REACHED
UNKNOWN
[Thread 1] Total splits: 34
Processed 34 zonotopes (Work Done: 0.0%); Generated 68 (3.628192165764706s/loop)
[Thread 1] Finished in 123.36s
 ────────────────────────────────────────────────────────────────────────────────
                                        Time                    Allocations      
                               ───────────────────────   ────────────────────────
       Tot / % measured:             123s / 100.0%           30.8GiB / 100.0%    

 Section               ncalls     time    %tot     avg     alloc    %tot      avg
 ────────────────────────────────────────────────────────────────────────────────
 Verify                     1     123s  100.0%    123s   30.8GiB   99.9%  30.8GiB
   Zonotope Loop            1     123s  100.0%    123s   30.8GiB   99.9%  30.8GiB
     Zonotope Propa...     34    64.6s   52.4%   1.90s   17.8GiB   57.6%   535MiB
       DiffZonotope...    136    33.6s   27.2%   247ms   14.6GiB   47.5%   110MiB
         Zonotope_R...    272    21.4s   17.3%  78.6ms   12.0GiB   38.8%  45.0MiB
           Influenc...    272    11.7s    9.5%  43.0ms   6.83GiB   22.2%  25.7MiB
             Multiply     272    10.5s    8.5%  38.7ms   3.93GiB   12.8%  14.8MiB
             Alloca...    272    707ms    0.6%  2.60ms   2.90GiB    9.4%  10.9MiB
             Set Ma...    272    449ms    0.4%  1.65ms     0.00B    0.0%    0.00B
           Column M...    272    8.97s    7.3%  33.0ms   2.56GiB    8.3%  9.64MiB
           Set Matrix     272    449ms    0.4%  1.65ms   2.82MiB    0.0%  10.6KiB
           Allocation     272    255ms    0.2%   937μs   2.56GiB    8.3%  9.64MiB
           Vectors        272   7.17ms    0.0%  26.3μs   9.02MiB    0.0%  34.0KiB
           Bounds         272    207μs    0.0%   762ns     0.00B    0.0%    0.00B
       DiffZonotope...    170    31.0s   25.2%   183ms   3.12GiB   10.1%  18.8MiB
         Zonotope_D...    340    17.7s   14.3%  52.1ms   1.74GiB    5.7%  5.25MiB
     Property Check        34    57.6s   46.7%   1.69s   11.2GiB   36.5%   339MiB
     Compute Split         34    1.02s    0.8%  30.0ms   1.13GiB    3.7%  33.9MiB
 Initialize                 1   17.2ms    0.0%  17.2ms   27.0MiB    0.1%  27.0MiB
 ────────────────────────────────────────────────────────────────────────────────
[VERYDIFF_TIMER] 123.454631183

[VERYDIFF_EXPERIMENT] NETWORK: /home/i57/steuber/NeuroDiff/repos/VeryDiffExperiments/src/../benchmarks/mnist-prune/specs/mnist_84_global_3.vnnlib
[VERYDIFF_EXPERIMENT] TIME: 123.763793593
