
[VERYDIFF_EXPERIMENT] Running on /home/i57/steuber/NeuroDiff/repos/VeryDiffExperiments/src/../benchmarks/mnist-prune/specs/mnist_22_local_15.vnnlib /home/i57/steuber/NeuroDiff/repos/VeryDiffExperiments/src/../benchmarks/mnist-prune/nets/mnist_relu_2_512.onnx
/home/i57/steuber/NeuroDiff/repos/VeryDiffExperiments/src/../benchmarks/mnist-prune/nets/mnist_relu_2_512.onnx
/home/i57/steuber/NeuroDiff/repos/VeryDiffExperiments/src/../benchmarks/mnist-prune/nets_pruned/mnist_relu_2_512_pruned5.onnx
[[0. 0.]
 [0. 0.]
 [0. 0.]
 ...
 [0. 0.]
 [0. 0.]
 [0. 0.]]
1.0
120
False
512
512
512
512
Set parameter TimeLimit to value 120
Set parameter Threads to value 1
Set parameter BestObjStop to value 1
Set parameter BestBdStop to value 1
Gurobi Optimizer version 10.0.0 build v10.0.0rc2 (linux64)

CPU model: Intel(R) Core(TM) i5-6500 CPU @ 3.20GHz, instruction set [SSE2|AVX|AVX2]
Thread count: 4 physical cores, 4 logical processors, using up to 1 threads

Optimize a model with 14479 rows, 7010 columns and 1321743 nonzeros
Model fingerprint: 0x05a04f13
Variable types: 4932 continuous, 2078 integer (2078 binary)
Coefficient statistics:
  Matrix range     [1e-07, 2e+06]
  Objective range  [1e+00, 1e+00]
  Bounds range     [1e-01, 1e+00]
  RHS range        [1e-04, 2e+06]
Warning: Model contains large matrix coefficient range
         Consider reformulating model or setting NumericFocus parameter
         to avoid numerical issues.
Presolve removed 8248 rows and 3173 columns
Presolve time: 1.69s
Presolved: 6231 rows, 3837 columns, 232329 nonzeros
Variable types: 2633 continuous, 1204 integer (1204 binary)

Root relaxation: objective 4.321758e+02, 3565 iterations, 0.95 seconds (2.27 work units)

    Nodes    |    Current Node    |     Objective Bounds      |     Work
 Expl Unexpl |  Obj  Depth IntInf | Incumbent    BestBd   Gap | It/Node Time

     0     0  432.17582    0  588          -  432.17582      -     -    5s
     0     0  431.23236    0  595          -  431.23236      -     -   18s
     0     0  431.23231    0  594          -  431.23231      -     -   18s
     0     0  429.50177    0  596          -  429.50177      -     -   23s
     0     0  429.50171    0  633          -  429.50171      -     -   23s
     0     0  429.46967    0  657          -  429.46967      -     -   27s
     0     0  429.46943    0  678          -  429.46943      -     -   27s
     0     0  429.46741    0  701          -  429.46741      -     -   37s
     0     0  429.41116    0 1000          -  429.41116      -     -   39s
     0     0  429.40395    0  991          -  429.40395      -     -   40s
     0     0  429.39795    0  992          -  429.39795      -     -   40s
     0     0  429.36199    0  980          -  429.36199      -     -   40s
     0     0  429.36129    0  979          -  429.36129      -     -   41s
     0     0  429.33146    0  995          -  429.33146      -     -   50s
     0     0  429.31559    0  995          -  429.31559      -     -   51s
     0     0  429.30684    0  996          -  429.30684      -     -   51s
     0     0  429.30076    0  999          -  429.30076      -     -   52s
     0     0  428.99864    0  967          -  428.99864      -     -   53s
     0     0  428.99338    0  977          -  428.99338      -     -   53s
     0     0  428.99129    0  975          -  428.99129      -     -   53s
     0     0  428.98980    0  976          -  428.98980      -     -   54s
     0     0  428.98849    0  977          -  428.98849      -     -   54s
     0     0  428.98733    0  980          -  428.98733      -     -   55s
     0     0  428.98470    0  983          -  428.98470      -     -   60s
     0     0  428.98295    0  985          -  428.98295      -     -   60s
     0     0  428.98175    0  983          -  428.98175      -     -   65s
     0     0  428.98175    0  911          -  428.98175      -     -   73s
H    0     0                       3.6946482  428.98175      -     -   90s

Cutting planes:
  Gomory: 21
  Cover: 9
  Implied bound: 40
  Clique: 11
  MIR: 89
  StrongCG: 1
  Flow cover: 27
  RLT: 838
  Relax-and-lift: 189
  BQP: 2

Explored 1 nodes (23067 simplex iterations) in 90.92 seconds (96.05 work units)
Thread count was 1 (of 4 available processors)

Solution count 1: 3.69465 

Optimization achieved user objective limit
Best objective 3.694648194005e+00, best bound 4.289817481456e+02, gap 11510.8957%


512
512
512
512
NETWORKS NOT EQUIVALENT
512
512
x_2_0 : -45.44073408289533
x_2_1 : -68.71320226576577
x_2_2 : -70.13075870778525
x_2_3 : -71.86145968644726
x_2_4 : -48.52986924802471
x_2_5 : -42.8612107660849
x_2_6 : 1.4586381193521905
x_2_7 : -66.72099551698878
x_2_8 : -42.26723533636684
x_2_9 : -78.56954741237108
512
512
x_2_0 : -43.2014058841878
x_2_1 : -68.51796127877907
x_2_2 : -66.43611051377977
x_2_3 : -70.1506864685133
x_2_4 : -50.88306003268851
x_2_5 : -41.88151689201614
x_2_6 : 3.385245354686152
x_2_7 : -64.9559788995876
x_2_8 : -40.038684471093106
x_2_9 : -75.10309136175329
512
512
512
512
Distance:  3.694648194005481
Input:  [0.0, 0.0, 0.0, 0.0, 0.0, 0.0, 0.0, 0.0, 0.0, 0.0, 0.0, 0.0, 0.0, 0.0, 0.0, 0.0, 0.0, 0.0, 0.0, 0.0, 0.0, 0.0, 0.0, 0.0, 0.0, 0.0, 0.0, 0.0, 0.0, 0.0, 0.0, 0.0, 0.0, 0.0, 0.0, 0.0, 0.0, 0.0, 0.0, 0.0, 0.0, 0.0, 0.0, 0.0, 0.0, 0.0, 0.0, 0.0, 0.0, 0.0, 0.0, 0.0, 0.0, 0.0, 0.0, 0.0, 0.0, 0.0, 0.0, 0.0, 0.0, 0.0, 0.0, 0.0, 0.0, 0.0, 0.0, 0.0, 0.0, 0.0, 0.0, 0.0, 0.0, 0.0, 0.0, 0.0, 0.0, 0.0, 0.0, 0.0, 0.0, 0.0, 0.0, 0.0, 0.0, 0.0, 0.0, 0.0, 0.0, 0.0, 0.0, 0.0, 0.0, 0.44705883, 1.0, 0.22352941, 0.0, 0.0, 0.0, 0.0, 0.0, 0.0, 0.0, 0.0, 0.0, 0.0, 0.0, 0.0, 0.0, 0.0, 0.0, 0.0, 0.0, 0.0, 0.0, 0.0, 0.2688630304883433, 0.0, 0.0, 0.0, 0.0, 0.88627452, 1.0, 0.22352941, 0.0, 0.0, 0.8325462884158117, 0.0, 0.0, 0.0, 0.0, 0.0, 0.0, 0.32603219290417845, 0.0, 0.0, 0.0, 0.0, 0.0, 0.0, 0.0, 0.0, 0.0, 0.0, 0.0, 0.0, 0.0, 0.0, 0.11372549, 1.0, 0.44705883, 0.0, 0.0, 0.0, 0.0, 0.0, 0.0, 0.0, 0.0, 0.0, 0.0, 0.0, 0.0, 0.0, 0.0, 0.0, 0.0, 0.0, 0.0, 0.0, 0.0, 0.0, 0.0, 0.0, 0.0, 0.0, 0.44705883, 1.0, 0.33725491, 0.0, 0.0, 0.0, 0.0, 0.0, 0.0, 0.0, 0.0, 0.0, 0.0, 0.0, 0.0, 0.0, 0.0, 0.0, 0.0, 0.0, 0.0, 0.0, 0.0, 0.0, 0.0, 0.0, 0.0, 0.0, 0.7764706, 1.0, 0.11372549, 0.0, 0.0, 0.0, 0.0, 0.0, 0.0, 0.0, 0.0, 0.0, 0.0, 0.0, 0.0, 0.0, 0.0, 0.0, 0.0, 0.0, 0.0, 0.0, 0.0, 0.0, 0.0, 0.0, 0.0, 0.11372549, 1.0, 0.88627452, 0.0, 0.0, 0.0, 0.0, 0.0, 0.0, 0.0, 0.0, 0.0, 0.0, 0.0, 0.0, 0.0, 0.0, 0.0, 0.0, 0.0, 0.0, 0.0, 0.0, 0.0, 0.0, 0.0, 0.0, 0.0, 0.5529412, 0.9196328845413055, 0.5529412, 0.0, 0.0, 0.0, 0.0, 0.0, 0.0, 0.22352941, 0.33725491, 0.33725491, 0.5529412, 0.22352941, 0.0, 0.0, 0.0, 0.0, 0.0, 0.0, 0.0, 0.0, 0.0, 0.0, 0.0, 0.0, 0.0, 0.0, 0.66666669, 1.0, 0.33725491, 0.0, 0.8637411728669694, 0.0, 0.0, 0.0, 0.22352941, 0.88627452, 1.0, 1.0, 1.0, 1.0, 0.22352941, 0.0, 0.0, 0.0, 0.0, 0.0, 0.0, 0.0, 0.0, 0.0, 0.0, 0.0, 0.0, 0.0, 0.66666669, 1.0, 0.33725491, 0.0, 0.0, 0.0, 0.0, 0.0, 0.66666669, 1.0, 1.0, 0.44705883, 0.22352941, 0.88627452, 0.7764706, 0.0, 0.0, 0.0, 0.0, 0.0, 0.0, 0.0, 0.0, 0.0, 0.0, 0.0, 0.0, 0.0, 0.66666669, 1.0, 0.33725491, 0.0, 0.0, 0.0, 0.0, 0.22352941, 1.0, 1.0, 0.33725491, 0.0, 0.0, 0.66666669, 1.0, 0.0, 0.0, 0.0, 0.0, 0.0, 0.0, 0.0, 0.0, 0.0, 0.0, 0.0, 0.0, 0.0, 0.66666669, 1.0, 0.33725491, 0.0, 0.0, 0.0, 0.0, 0.66666669, 1.0, 0.33725491, 0.0, 0.0, 0.0, 0.66666669, 1.0, 0.33725491, 0.0, 0.019226082373573004, 0.0, 0.0, 0.0, 0.0, 0.0, 0.0, 0.0, 0.0, 0.0, 0.0, 0.5529412, 1.0, 0.44705883, 0.0, 0.0, 0.0, 0.11372549, 1.0, 0.7764706, 0.0, 0.0, 0.0, 0.0, 0.66666669, 1.0, 0.33725491, 0.0, 0.0, 0.0, 0.0, 0.0, 0.0, 0.0, 0.0, 0.0, 0.0, 0.0, 0.0, 0.11372549, 1.0, 1.0, 0.0, 0.0, 0.0, 0.66666669, 1.0, 0.44705883, 0.0, 0.0, 0.0, 0.0, 0.7764706, 0.88627452, 0.0, 0.0, 0.0, 0.0, 0.0, 0.0, 0.0, 0.0, 0.0, 0.0, 0.0, 0.0, 0.0, 0.0, 0.7764706, 1.0, 0.44705883, 0.0, 0.0, 0.66666669, 1.0, 0.33725491, 0.0, 0.0, 0.0, 0.0, 1.0, 0.44705883, 0.0, 0.0, 0.0, 0.0, 0.0, 0.0, 0.0, 0.0, 0.0, 0.0, 0.0, 0.0, 0.0, 1.0, 0.33725491, 1.0, 1.0, 0.840804633528287, 0.22352941, 1.0, 1.0, 0.11372549, 0.0, 0.0, 0.33725491, 0.88627452, 0.88627452, 0.11372549, 0.0, 0.0, 0.0, 0.0, 0.0, 0.0, 0.0, 0.0, 0.0, 0.0, 0.0, 0.0, 0.0, 0.0, 0.0, 0.44705883, 0.88627452, 1.0, 1.0, 1.0, 1.0, 0.33725491, 0.33725491, 0.66666669, 1.0, 1.0, 0.22352941, 0.0, 0.0, 0.0, 0.0, 0.0, 0.0, 0.0, 0.0, 0.0, 0.0, 0.0, 0.0, 0.0, 0.0, 0.0, 0.0, 0.0, 0.11372549, 0.5529412, 1.0, 1.0, 1.0, 1.0, 1.0, 1.0, 0.7764706, 0.11372549, 0.0, 0.0, 0.0, 0.0, 0.0, 0.0, 0.0, 0.0, 0.0, 0.14614905748594328, 0.0, 0.0, 0.0, 0.0, 0.0, 0.0, 0.0, 0.0, 0.0, 0.0, 0.0, 0.88627452, 1.0, 1.0, 0.5529412, 0.33725491, 0.0, 0.0, 0.0, 0.0, 0.0, 0.0, 0.0, 0.0, 0.0, 0.0, 0.0, 0.0, 0.0, 0.0, 0.0, 0.0, 0.0, 0.0, 0.0, 0.0, 0.0, 0.0, 0.0, 0.5529412, 1.0, 1.0, 0.66666669, 0.66666669, 0.22352941, 0.0, 0.0, 0.0, 0.0, 0.0, 0.0, 0.0, 0.0, 0.0, 0.0, 0.0, 0.0, 0.0, 0.0, 0.0, 0.0, 0.0, 0.0, 0.0, 0.0, 0.0, 0.0, 0.0, 0.5529412, 0.88627452, 0.66666669, 0.44705883, 0.11372549, 0.0, 0.0, 0.0, 0.0, 0.0, 0.0, 0.0, 0.0, 0.0, 0.0, 0.0, 0.0, 0.0, 0.0, 0.0, 0.0, 0.0, 0.0, 0.0, 0.0, 0.0, 0.0, 0.0, 0.0, 0.0, 0.0, 0.0, 0.0, 0.0, 0.0, 0.0, 0.0, 0.0, 0.0, 0.0, 0.0, 0.0, 0.0, 0.0, 0.0, 0.0, 0.0, 0.0, 0.0, 0.0, 0.0, 0.0, 0.0, 0.0, 0.0, 0.0, 0.0, 0.0, 0.0, 0.0, 0.0, 0.0, 0.0, 0.0, 0.0, 0.0, 0.0, 0.0, 0.0, 0.0, 0.0, 0.0, 0.0, 0.0, 0.0, 0.0, 0.0, 0.0, 0.0, 0.0, 0.0, 0.0, 0.0, 0.0, 0.0, 0.0, 0.0, 0.0, 0.0, 0.0, 0.0, 0.012643903426811341, 0.0, 0.0, 0.0, 0.0, 0.0, 0.0, 0.0, 0.0, 0.0, 0.0, 0.0, 0.0, 0.0, 0.0, 0.0, 0.0, 0.0, 0.0, 0.0, 0.0, 0.0, 0.0, 0.0, 0.0, 0.0, 0.0, 0.0, 0.0, 0.0, 0.0, 0.0, 0.0, 0.0, 0.0, 0.0, 0.0, 0.0, 0.0, 0.0, 0.0, 0.0, 0.0, 0.0, 0.0, 0.0, 0.0, 0.0, 0.0, 0.0, 0.0, 0.0, 0.0, 0.0, 0.0, 0.0, 0.0, 0.0, 0.0, 0.0, 0.0, 0.0, 0.0]
time: 158.049080052

[VERYDIFF_TIMER] 158.111352837

[VERYDIFF_EXPERIMENT] Running on /home/i57/steuber/NeuroDiff/repos/VeryDiffExperiments/src/../benchmarks/mnist-prune/specs/mnist_22_local_15.vnnlib /home/i57/steuber/NeuroDiff/repos/VeryDiffExperiments/src/../benchmarks/mnist-prune/nets/mnist_relu_3_100.onnx
/home/i57/steuber/NeuroDiff/repos/VeryDiffExperiments/src/../benchmarks/mnist-prune/nets/mnist_relu_3_100.onnx
/home/i57/steuber/NeuroDiff/repos/VeryDiffExperiments/src/../benchmarks/mnist-prune/nets_pruned/mnist_relu_3_100_pruned5.onnx
[[0. 0.]
 [0. 0.]
 [0. 0.]
 ...
 [0. 0.]
 [0. 0.]
 [0. 0.]]
1.0
120
False
100
100
10
100
100
10
Set parameter TimeLimit to value 120
Set parameter Threads to value 1
Set parameter BestObjStop to value 1
Set parameter BestBdStop to value 1
Gurobi Optimizer version 10.0.0 build v10.0.0rc2 (linux64)

CPU model: Intel(R) Core(TM) i5-6500 CPU @ 3.20GHz, instruction set [SSE2|AVX|AVX2]
Thread count: 4 physical cores, 4 logical processors, using up to 1 threads

Optimize a model with 3083 rows, 2126 columns and 179668 nonzeros
Model fingerprint: 0x58a6c51b
Variable types: 1676 continuous, 450 integer (450 binary)
Coefficient statistics:
  Matrix range     [1e-06, 2e+06]
  Objective range  [1e+00, 1e+00]
  Bounds range     [1e-01, 1e+00]
  RHS range        [1e-03, 2e+06]
Warning: Model contains large matrix coefficient range
         Consider reformulating model or setting NumericFocus parameter
         to avoid numerical issues.
Presolve removed 1744 rows and 1291 columns
Presolve time: 0.31s
Presolved: 1339 rows, 835 columns, 14414 nonzeros
Variable types: 578 continuous, 257 integer (257 binary)

Root relaxation: objective 2.332588e+01, 847 iterations, 0.03 seconds (0.06 work units)

    Nodes    |    Current Node    |     Objective Bounds      |     Work
 Expl Unexpl |  Obj  Depth IntInf | Incumbent    BestBd   Gap | It/Node Time

     0     0   23.32588    0  116          -   23.32588      -     -    0s
     0     0   23.32101    0  124          -   23.32101      -     -    0s
     0     0   23.13485    0   81          -   23.13485      -     -    0s
     0     0   22.12007    0   85          -   22.12007      -     -    0s
     0     0   22.10696    0   82          -   22.10696      -     -    0s
     0     0   21.91658    0   85          -   21.91658      -     -    0s
     0     0   21.91658    0   85          -   21.91658      -     -    0s
     0     0   18.88239    0   34          -   18.88239      -     -    1s
     0     0   18.23438    0   19          -   18.23438      -     -    1s
     0     0   18.23438    0   33          -   18.23438      -     -    1s
     0     0   18.23217    0   83          -   18.23217      -     -    1s
     0     0   18.23213    0   68          -   18.23213      -     -    1s
     0     0   18.23189    0   73          -   18.23189      -     -    1s
     0     0   18.20808    0   49          -   18.20808      -     -    1s
     0     0   18.19352    0   91          -   18.19352      -     -    1s
     0     0   18.18047    0   97          -   18.18047      -     -    1s
     0     0   18.17983    0   95          -   18.17983      -     -    1s
     0     0   18.16284    0   84          -   18.16284      -     -    1s
     0     0   18.16278    0   84          -   18.16278      -     -    1s
     0     0   18.16053    0   82          -   18.16053      -     -    1s
     0     0   18.16024    0   94          -   18.16024      -     -    1s
     0     0   18.07089    0  106          -   18.07089      -     -    1s
     0     0   18.07089    0   94          -   18.07089      -     -    1s
     0     0   18.07089    0   75          -   18.07089      -     -    2s
     0     0   18.07089    0   72          -   18.07089      -     -    2s
     0     0   18.07089    0    6          -   18.07089      -     -    2s
     0     0   18.07089    0    6          -   18.07089      -     -    2s
     0     0   18.07089    0    6          -   18.07089      -     -    2s
     0     0   18.07089    0    5          -   18.07089      -     -    2s
     0     0   18.07089    0    6          -   18.07089      -     -    2s
     0     0   18.07089    0    6          -   18.07089      -     -    2s
     0     0   18.07089    0    6          -   18.07089      -     -    2s
     0     0   17.49909    0   88          -   17.49909      -     -    3s
     0     0   15.99047    0   79          -   15.99047      -     -    3s
     0     0   15.99047    0   79          -   15.99047      -     -    3s
     0     0   15.83206    0   90          -   15.83206      -     -    3s
     0     0   15.83131    0   90          -   15.83131      -     -    3s
     0     0   15.75047    0   91          -   15.75047      -     -    3s
     0     0   15.74722    0   92          -   15.74722      -     -    3s
     0     0   15.74629    0   94          -   15.74629      -     -    3s
     0     0   15.74577    0   94          -   15.74577      -     -    3s
     0     0   15.74569    0   94          -   15.74569      -     -    3s
     0     0   15.74104    0   93          -   15.74104      -     -    3s
     0     0   15.74021    0   95          -   15.74021      -     -    3s
     0     0   15.73995    0   95          -   15.73995      -     -    3s
     0     0   15.73711    0   95          -   15.73711      -     -    3s
     0     0   15.73577    0   94          -   15.73577      -     -    3s
     0     0   15.73564    0   94          -   15.73564      -     -    3s
     0     0   15.73539    0   93          -   15.73539      -     -    3s
     0     0   15.73539    0   93          -   15.73539      -     -    4s
H    0     0                       0.0013420   15.73539      -     -    4s
     0     2   14.90038    0   93    0.00134   14.90038      -     -    4s
    18    11    3.03832   16   62    0.00134   11.52783      -  70.8    5s
   548   365    5.90013   37   84    0.00134   10.27785      -  35.1   10s
  1871   755    1.90059   48   53    0.00134    3.23899      -  28.0   15s
H 3742  1971                       0.0014561    2.42709      -  22.7   19s
H 3777  1970                       0.0014562    2.42709      -  22.9   20s
  4268  2022    2.41726   87    5    0.00146    2.42709      -  26.4   25s
  4892  2059    2.41616   52   14    0.00146    2.42709      -  29.3   30s
  6103  2466    1.58588   43   57    0.00146    2.42709      -  30.1   35s
  8003  3444 infeasible   61         0.00146    2.40754      -  29.3   40s
H 8762  3860                       0.0014577    2.26043      -  28.3   41s
H 9612  4344                       0.0015262    2.17053      -  26.7   43s
H10202  4768                       0.0015297    2.13004      -  25.8   54s
 10203  4769    0.30614   72    6    0.00153    2.13004      -  25.8   57s
 10236  4783    2.13004   54   51    0.00153    2.13004      -  26.1   60s
 12496  5790    0.08342   99    8    0.00153    2.13004      -  25.5   65s
 15287  7204    0.29332   94   22    0.00153    2.13004      -  24.8   70s
 18981  9035    0.14116   83   19    0.00153    2.13004      -  23.4   75s
 22224 10465    0.02243  110    8    0.00153    2.13004      -  22.9   80s
H22561 10403                       0.0015379    2.13004      -  22.9   81s
H22645 10209                       0.0015382    2.13004      -  22.9   81s
 23690 10713    0.56330   66   36    0.00154    2.13004      -  23.6   85s
 25943 12248    2.13004   73   24    0.00154    2.13004      -  24.5   90s
 27758 13250    0.04134   81   47    0.00154    2.13004      -  25.4   95s
 29239 14052    0.31407   82   23    0.00154    2.13004      -  26.2  100s
 30954 15098    0.00638  122    7    0.00154    2.13004      -  26.8  105s
 32883 16198    0.76316   71   47    0.00154    2.13004      -  27.4  110s
 34322 17007    2.09882   69   56    0.00154    2.13004      -  27.9  115s

Cutting planes:
  Gomory: 7
  Implied bound: 7
  MIR: 5
  Flow cover: 2
  Relax-and-lift: 4

Explored 36245 nodes (1038498 simplex iterations) in 120.01 seconds (128.35 work units)
Thread count was 1 (of 4 available processors)

Solution count 8: 0.00153817 0.00153791 0.00152969 ... 0.00134196

Time limit reached
Best objective 1.538172534117e-03, best bound 2.130043059185e+00, gap 138378.8125%


TIMEOUT
time: 124.549019675

[VERYDIFF_TIMER] 124.577061607

[VERYDIFF_EXPERIMENT] Running on /home/i57/steuber/NeuroDiff/repos/VeryDiffExperiments/src/../benchmarks/mnist-prune/specs/mnist_22_local_15.vnnlib /home/i57/steuber/NeuroDiff/repos/VeryDiffExperiments/src/../benchmarks/mnist-prune/nets/mnist_relu_4_1024.onnx
/home/i57/steuber/NeuroDiff/repos/VeryDiffExperiments/src/../benchmarks/mnist-prune/nets/mnist_relu_4_1024.onnx
/home/i57/steuber/NeuroDiff/repos/VeryDiffExperiments/src/../benchmarks/mnist-prune/nets_pruned/mnist_relu_4_1024_pruned5.onnx
[[0. 0.]
 [0. 0.]
 [0. 0.]
 ...
 [0. 0.]
 [0. 0.]
 [0. 0.]]
1.0
120
False
1024
1024
1024
10
1024
1024
1024
10
Set parameter TimeLimit to value 120
Set parameter Threads to value 1
Set parameter BestObjStop to value 1
Set parameter BestBdStop to value 1
Gurobi Optimizer version 10.0.0 build v10.0.0rc2 (linux64)

CPU model: Intel(R) Core(TM) i5-6500 CPU @ 3.20GHz, instruction set [SSE2|AVX|AVX2]
Thread count: 4 physical cores, 4 logical processors, using up to 1 threads

Optimize a model with 43291 rows, 19358 columns and 5656712 nonzeros
Model fingerprint: 0x320790b3
Variable types: 13164 continuous, 6194 integer (6194 binary)
Coefficient statistics:
  Matrix range     [2e-08, 2e+06]
  Objective range  [1e+00, 1e+00]
  Bounds range     [1e-01, 1e+00]
  RHS range        [1e-07, 2e+06]
Warning: Model contains large matrix coefficient range
         Consider reformulating model or setting NumericFocus parameter
         to avoid numerical issues.
Presolve removed 18193 rows and 4478 columns (presolve time = 5s) ...
Presolve removed 18921 rows and 4478 columns (presolve time = 10s) ...
Presolve removed 18921 rows and 4478 columns (presolve time = 15s) ...
Presolve removed 18921 rows and 4478 columns
Presolve time: 15.58s
Presolved: 24370 rows, 14880 columns, 3418489 nonzeros
Variable types: 10128 continuous, 4752 integer (4752 binary)

Root simplex log...

Iteration    Objective       Primal Inf.    Dual Inf.      Time
       0    8.9999910e+06   2.136238e+06   0.000000e+00     21s
    1904    9.9999900e+05   8.342972e+03   0.000000e+00     25s
    3264    9.9999900e+05   2.255146e+03   0.000000e+00     30s
    4644    9.9999900e+05   7.885066e+03   0.000000e+00     36s
    5924    9.9999900e+05   2.340142e+03   0.000000e+00     40s
    7334    9.9999900e+05   4.056164e+02   0.000000e+00     45s
    8564    9.9999900e+05   2.401892e+02   0.000000e+00     50s
    9227    9.9999900e+05   0.000000e+00   0.000000e+00     53s

Root relaxation: objective 9.999990e+05, 9227 iterations, 33.77 seconds (92.94 work units)

    Nodes    |    Current Node    |     Objective Bounds      |     Work
 Expl Unexpl |  Obj  Depth IntInf | Incumbent    BestBd   Gap | It/Node Time

     0     0 999999.000    0  126          - 999999.000      -     -  120s

Explored 1 nodes (26646 simplex iterations) in 120.03 seconds (268.94 work units)
Thread count was 1 (of 4 available processors)

Solution count 0

Time limit reached
Best objective -, best bound 9.999990000000e+05, gap -


TIMEOUT
time: 264.085692348

[VERYDIFF_TIMER] 264.1177023

[VERYDIFF_EXPERIMENT] NETWORK: /home/i57/steuber/NeuroDiff/repos/VeryDiffExperiments/src/../benchmarks/mnist-prune/specs/mnist_22_local_15.vnnlib
[VERYDIFF_EXPERIMENT] TIME: 547.850665581
