
[VERYDIFF_EXPERIMENT] Running on /home/i57/steuber/NeuroDiff/repos/VeryDiffExperiments/src/../benchmarks/mnist-prune/specs/mnist_74_local_15.vnnlib /home/i57/steuber/NeuroDiff/repos/VeryDiffExperiments/src/../benchmarks/mnist-prune/nets/mnist_relu_4_1024.onnx
Found input X
op: matmul, weight: (1024, 784), bias: nothing
op: bias, weight: nothing, bias: (1024,)
op: relu, weight: nothing, bias: nothing
op: matmul, weight: (1024, 1024), bias: nothing
op: bias, weight: nothing, bias: (1024,)
op: relu, weight: nothing, bias: nothing
op: matmul, weight: (1024, 1024), bias: nothing
op: bias, weight: nothing, bias: (1024,)
op: relu, weight: nothing, bias: nothing
op: matmul, weight: (10, 1024), bias: nothing
op: bias, weight: nothing, bias: (10,)
op: relu, weight: nothing, bias: nothing
op: matmul, weight: (10, 10), bias: nothing
op: bias, weight: nothing, bias: (10,)
Found input X
op: gemm, weight: (1024, 784), bias: (1024,)
op: relu, weight: nothing, bias: nothing
op: gemm, weight: (1024, 1024), bias: (1024,)
op: relu, weight: nothing, bias: nothing
op: gemm, weight: (1024, 1024), bias: (1024,)
op: relu, weight: nothing, bias: nothing
op: gemm, weight: (10, 1024), bias: (10,)
op: relu, weight: nothing, bias: nothing
op: gemm, weight: (10, 10), bias: (10,)
Distance: 915.6394868631054
Distance: 1298.7052820973968
Distance: 1296.587532894263
Distance: 6.054483317080667
Distance: 0.04942679278974538
Running with 1 threads
[Thread 1] Time to first task: 0.0s
Instable Generators: 382
Instable Generators: 666
Instable Generators: 1023
Instable Generators: 10
Zono Bounds:
[-77.01030432738474, -78.38993342069395, -87.16644457168404, -86.22621430883656, -82.93075875249085, -87.70218188934716, -78.54602694774927, -81.65821280930543, -83.8898208338992, -87.18471719622674]
[76.99326550661505, 78.21433264473373, 86.62095771879332, 85.86266625688548, 82.88501555521518, 87.60768400210601, 78.53750663085044, 81.41920702093866, 83.77734971181306, 86.6079431038175]
[Thread 1] Processed 100 zonotopes (Work Done: 0.0%; Expected Zonos: Inf)


TIMEOUT REACHED
UNKNOWN
[Thread 1] Total splits: 161
Processed 161 zonotopes (Work Done: 0.0%); Generated 322 (0.7458304182298137s/loop)
[Thread 1] Finished in 120.08s
 ────────────────────────────────────────────────────────────────────────────────
                                        Time                    Allocations      
                               ───────────────────────   ────────────────────────
       Tot / % measured:             120s / 100.0%           35.3GiB / 100.0%    

 Section               ncalls     time    %tot     avg     alloc    %tot      avg
 ────────────────────────────────────────────────────────────────────────────────
 Verify                     1     120s  100.0%    120s   35.3GiB   99.9%  35.3GiB
   Zonotope Loop            1     120s  100.0%    120s   35.3GiB   99.9%  35.3GiB
     Zonotope Propa...    161     119s   99.4%   742ms   35.0GiB   99.1%   223MiB
       DiffZonotope...    644    63.9s   53.2%  99.3ms   27.7GiB   78.4%  44.1MiB
         Zonotope_R...  1.29k    42.7s   35.6%  33.2ms   16.9GiB   47.9%  13.4MiB
           Allocation   1.29k    28.5s   23.7%  22.1ms   7.14GiB   20.2%  5.67MiB
           Column M...  1.29k    11.6s    9.7%  9.02ms   7.14GiB   20.2%  5.67MiB
           Influenc...  1.29k    1.50s    1.2%  1.16ms   2.58GiB    7.3%  2.05MiB
             Multiply   1.29k    1.44s    1.2%  1.12ms   2.42GiB    6.8%  1.92MiB
             Alloca...  1.29k   43.3ms    0.0%  33.7μs    171MiB    0.5%   136KiB
             Set Ma...  1.29k   12.3ms    0.0%  9.53μs     0.00B    0.0%    0.00B
           Set Matrix   1.29k    1.09s    0.9%   843μs   14.2MiB    0.0%  11.3KiB
           Vectors      1.29k   38.8ms    0.0%  30.1μs   42.7MiB    0.1%  34.0KiB
           Bounds       1.29k    836μs    0.0%   649ns     0.00B    0.0%    0.00B
       DiffZonotope...    805    55.5s   46.2%  68.9ms   7.30GiB   20.7%  9.29MiB
         Zonotope_D...  1.61k    18.8s   15.6%  11.6ms   2.98GiB    8.4%  1.89MiB
     Property Check       161    594ms    0.5%  3.69ms   66.6MiB    0.2%   423KiB
     Compute Split        161   57.8ms    0.0%   359μs    124MiB    0.3%   791KiB
 Initialize                 1   14.9ms    0.0%  14.9ms   22.3MiB    0.1%  22.3MiB
 ────────────────────────────────────────────────────────────────────────────────
[VERYDIFF_TIMER] 120.17338192

[VERYDIFF_EXPERIMENT] NETWORK: /home/i57/steuber/NeuroDiff/repos/VeryDiffExperiments/src/../benchmarks/mnist-prune/specs/mnist_74_local_15.vnnlib
[VERYDIFF_EXPERIMENT] TIME: 120.425775742
