
[VERYDIFF_EXPERIMENT] Running on /home/i57/steuber/NeuroDiff/repos/VeryDiffExperiments/src/../benchmarks/mnist-prune/specs/mnist_54_global_4.vnnlib /home/i57/steuber/NeuroDiff/repos/VeryDiffExperiments/src/../benchmarks/mnist-prune/nets/mnist_relu_3_100.onnx
Found input X
op: matmul, weight: (100, 784), bias: nothing
op: bias, weight: nothing, bias: (100,)
op: relu, weight: nothing, bias: nothing
op: matmul, weight: (100, 100), bias: nothing
op: bias, weight: nothing, bias: (100,)
op: relu, weight: nothing, bias: nothing
op: matmul, weight: (10, 100), bias: nothing
op: bias, weight: nothing, bias: (10,)
op: relu, weight: nothing, bias: nothing
op: matmul, weight: (10, 10), bias: nothing
op: bias, weight: nothing, bias: (10,)
Found input X
op: gemm, weight: (100, 784), bias: (100,)
op: relu, weight: nothing, bias: nothing
op: gemm, weight: (100, 100), bias: (100,)
op: relu, weight: nothing, bias: nothing
op: gemm, weight: (10, 100), bias: (10,)
op: relu, weight: nothing, bias: nothing
op: gemm, weight: (10, 10), bias: (10,)
Distance: 368.62397500800625
Distance: 47.56803950402309
Distance: 2.8977568827249343
Distance: 0.01885471428334995
Running with 1 threads
[Thread 1] Time to first task: 0.0s
Instable Generators: 19
Instable Generators: 23
Instable Generators: 5
Zono Bounds:
[-0.4935948316706192, -0.3934863788485358, -0.5348144131816461, -0.0008633853548592258, -0.4984085914565624, -0.536165449025709, -0.4145670280936977, -0.0008450664206902194, -0.44987601475838696, -0.000630537761333078]
[0.4904605526256725, 0.3746439645394249, 0.5349709760560319, 1.4442082432006786e-5, 0.49559303990170006, 0.4969680913673343, 0.5203732428836692, 0.0007142938654587023, 0.37097411235865, 0.0009004828239762661]
[Thread 1] Processed 100 zonotopes (Work Done: 0.0%; Expected Zonos: Inf)
[Thread 1] Processed 200 zonotopes (Work Done: 0.0%; Expected Zonos: Inf)
[Thread 1] Processed 300 zonotopes (Work Done: 0.0%; Expected Zonos: Inf)
[Thread 1] Processed 400 zonotopes (Work Done: 0.0%; Expected Zonos: Inf)
[Thread 1] Processed 500 zonotopes (Work Done: 0.0%; Expected Zonos: Inf)


TIMEOUT REACHED
UNKNOWN
[Thread 1] Total splits: 584
Processed 584 zonotopes (Work Done: 0.0%); Generated 1168 (0.20587587164041096s/loop)
[Thread 1] Finished in 120.23s
 ────────────────────────────────────────────────────────────────────────────────
                                        Time                    Allocations      
                               ───────────────────────   ────────────────────────
       Tot / % measured:             120s / 100.0%           60.1GiB / 100.0%    

 Section               ncalls     time    %tot     avg     alloc    %tot      avg
 ────────────────────────────────────────────────────────────────────────────────
 Verify                     1     120s  100.0%    120s   60.1GiB  100.0%  60.1GiB
   Zonotope Loop            1     120s  100.0%    120s   60.1GiB  100.0%  60.1GiB
     Zonotope Propa...    584    70.7s   58.8%   121ms   40.1GiB   66.7%  70.3MiB
       DiffZonotope...  1.75k    57.8s   48.1%  33.0ms   37.8GiB   62.8%  22.1MiB
         Zonotope_R...  3.50k    57.4s   47.7%  16.4ms   36.9GiB   61.4%  10.8MiB
           Influenc...  3.50k    56.6s   47.1%  16.2ms   33.9GiB   56.4%  9.91MiB
             Alloca...  3.50k    29.1s   24.2%  8.31ms   16.8GiB   27.9%  4.91MiB
             Multiply   3.50k    25.1s   20.8%  7.15ms   17.1GiB   28.5%  5.00MiB
             Set Ma...  3.50k    2.43s    2.0%   694μs     0.00B    0.0%    0.00B
           Column M...  3.50k    476ms    0.4%   136μs   1.49GiB    2.5%   446KiB
           Set Matrix   3.50k    185ms    0.2%  52.8μs   2.28MiB    0.0%     681B
           Allocation   3.50k   80.7ms    0.1%  23.0μs   1.49GiB    2.5%   446KiB
           Vectors      3.50k   17.2ms    0.0%  4.91μs   11.1MiB    0.0%  3.26KiB
           Bounds       3.50k   2.45ms    0.0%   701ns     0.00B    0.0%    0.00B
       DiffZonotope...  2.34k    12.8s   10.7%  5.50ms   2.32GiB    3.9%  1.02MiB
         Zonotope_D...  4.67k    4.98s    4.1%  1.06ms   1.53GiB    2.5%   344KiB
     Compute Split        584    6.94s    5.8%  11.9ms   8.55GiB   14.2%  15.0MiB
     Property Check       584    113ms    0.1%   194μs    117MiB    0.2%   206KiB
 Initialize                 1    544μs    0.0%   544μs   5.41MiB    0.0%  5.41MiB
 ────────────────────────────────────────────────────────────────────────────────
[VERYDIFF_TIMER] 120.263732719

[VERYDIFF_EXPERIMENT] NETWORK: /home/i57/steuber/NeuroDiff/repos/VeryDiffExperiments/src/../benchmarks/mnist-prune/specs/mnist_54_global_4.vnnlib
[VERYDIFF_EXPERIMENT] TIME: 120.728849052
