[runlim] version:		2.0.0rc12
[runlim] host:			i57pool5
[runlim] time limit:		311040000 seconds
[runlim] real time limit:	120 seconds
[runlim] space limit:		15563 MB
[runlim] argv[0]:		/home/i57/steuber/.local/bin/Marabou
[runlim] argv[1]:		./mnist-prune/nets/product_mnist_relu_3_100_mnist_relu_3_100_pruned5_eps.onnx
[runlim] argv[2]:		./mnist-prune/specs/product_mnist_88_local_18_eps_1.0.vnnlib
[runlim] start:			Fri Oct  4 06:30:37 2024
[runlim] child:			1016331
Network: ./mnist-prune/nets/product_mnist_relu_3_100_mnist_relu_3_100_pruned5_eps.onnx
Property: ./mnist-prune/specs/product_mnist_88_local_18_eps_1.0.vnnlib

Engine::processInputQuery: Input query (before preprocessing): 450 equations, 1654 variables
Engine::processInputQuery: Input query (after preprocessing): 830 equations, 1874 variables

Input bounds:
	x0: [ -0.0000,  -0.0000] [FIXED]
	x1: [ -0.0000,  -0.0000] [FIXED]
	x2: [ -0.0000,  -0.0000] [FIXED]
	x3: [ -0.0000,  -0.0000] [FIXED]
	x4: [ -0.0000,  -0.0000] [FIXED]
	x5: [ -0.0000,  -0.0000] [FIXED]
	x6: [ -0.0000,  -0.0000] [FIXED]
	x7: [ -0.0000,   1.0000] 
	x8: [ -0.0000,  -0.0000] [FIXED]
	x9: [ -0.0000,  -0.0000] [FIXED]
	x10: [ -0.0000,  -0.0000] [FIXED]
	x11: [ -0.0000,  -0.0000] [FIXED]
	x12: [ -0.0000,  -0.0000] [FIXED]
	x13: [ -0.0000,  -0.0000] [FIXED]
	x14: [ -0.0000,   1.0000] 
	x15: [ -0.0000,  -0.0000] [FIXED]
	x16: [ -0.0000,  -0.0000] [FIXED]
	x17: [ -0.0000,  -0.0000] [FIXED]
	x18: [ -0.0000,  -0.0000] [FIXED]
	x19: [ -0.0000,  -0.0000] [FIXED]
	x20: [ -0.0000,  -0.0000] [FIXED]
	x21: [ -0.0000,   1.0000] 
	x22: [ -0.0000,  -0.0000] [FIXED]
	x23: [ -0.0000,  -0.0000] [FIXED]
	x24: [ -0.0000,  -0.0000] [FIXED]
	x25: [ -0.0000,  -0.0000] [FIXED]
	x26: [ -0.0000,  -0.0000] [FIXED]
	x27: [ -0.0000,  -0.0000] [FIXED]
	x28: [ -0.0000,  -0.0000] [FIXED]
	x29: [ -0.0000,  -0.0000] [FIXED]
	x30: [ -0.0000,  -0.0000] [FIXED]
	x31: [ -0.0000,  -0.0000] [FIXED]
	x32: [ -0.0000,  -0.0000] [FIXED]
	x33: [ -0.0000,  -0.0000] [FIXED]
	x34: [ -0.0000,  -0.0000] [FIXED]
	x35: [ -0.0000,  -0.0000] [FIXED]
	x36: [ -0.0000,  -0.0000] [FIXED]
	x37: [ -0.0000,  -0.0000] [FIXED]
	x38: [ -0.0000,  -0.0000] [FIXED]
	x39: [ -0.0000,  -0.0000] [FIXED]
	x40: [ -0.0000,  -0.0000] [FIXED]
	x41: [ -0.0000,  -0.0000] [FIXED]
	x42: [ -0.0000,  -0.0000] [FIXED]
	x43: [ -0.0000,  -0.0000] [FIXED]
	x44: [ -0.0000,  -0.0000] [FIXED]
	x45: [ -0.0000,  -0.0000] [FIXED]
	x46: [ -0.0000,  -0.0000] [FIXED]
	x47: [ -0.0000,  -0.0000] [FIXED]
	x48: [ -0.0000,  -0.0000] [FIXED]
	x49: [ -0.0000,  -0.0000] [FIXED]
	x50: [ -0.0000,  -0.0000] [FIXED]
	x51: [ -0.0000,   1.0000] 
	x52: [ -0.0000,  -0.0000] [FIXED]
	x53: [ -0.0000,  -0.0000] [FIXED]
	x54: [ -0.0000,  -0.0000] [FIXED]
	x55: [ -0.0000,  -0.0000] [FIXED]
	x56: [ -0.0000,  -0.0000] [FIXED]
	x57: [ -0.0000,  -0.0000] [FIXED]
	x58: [ -0.0000,  -0.0000] [FIXED]
	x59: [ -0.0000,  -0.0000] [FIXED]
	x60: [ -0.0000,  -0.0000] [FIXED]
	x61: [ -0.0000,  -0.0000] [FIXED]
	x62: [ -0.0000,  -0.0000] [FIXED]
	x63: [ -0.0000,  -0.0000] [FIXED]
	x64: [ -0.0000,  -0.0000] [FIXED]
	x65: [ -0.0000,  -0.0000] [FIXED]
	x66: [ -0.0000,  -0.0000] [FIXED]
	x67: [  0.1765,   0.1765] [FIXED]
	x68: [ -0.0000,   1.0000] 
	x69: [  0.9961,   0.9961] [FIXED]
	x70: [  0.3647,   0.3647] [FIXED]
	x71: [  0.0039,   0.0039] [FIXED]
	x72: [ -0.0000,  -0.0000] [FIXED]
	x73: [ -0.0000,  -0.0000] [FIXED]
	x74: [ -0.0000,  -0.0000] [FIXED]
	x75: [ -0.0000,  -0.0000] [FIXED]
	x76: [ -0.0000,  -0.0000] [FIXED]
	x77: [ -0.0000,  -0.0000] [FIXED]
	x78: [ -0.0000,  -0.0000] [FIXED]
	x79: [ -0.0000,  -0.0000] [FIXED]
	x80: [ -0.0000,  -0.0000] [FIXED]
	x81: [ -0.0000,  -0.0000] [FIXED]
	x82: [ -0.0000,  -0.0000] [FIXED]
	x83: [ -0.0000,  -0.0000] [FIXED]
	x84: [ -0.0000,  -0.0000] [FIXED]
	x85: [ -0.0000,  -0.0000] [FIXED]
	x86: [ -0.0000,  -0.0000] [FIXED]
	x87: [ -0.0000,  -0.0000] [FIXED]
	x88: [ -0.0000,  -0.0000] [FIXED]
	x89: [ -0.0000,  -0.0000] [FIXED]
	x90: [ -0.0000,  -0.0000] [FIXED]
	x91: [ -0.0000,  -0.0000] [FIXED]
	x92: [ -0.0000,  -0.0000] [FIXED]
	x93: [ -0.0000,  -0.0000] [FIXED]
	x94: [  0.0235,   0.0235] [FIXED]
	x95: [  0.7804,   0.7804] [FIXED]
	x96: [  0.9922,   0.9922] [FIXED]
	x97: [  0.9922,   0.9922] [FIXED]
	x98: [  0.9922,   0.9922] [FIXED]
	x99: [  0.0431,   0.0431] [FIXED]
	x100: [ -0.0000,  -0.0000] [FIXED]
	x101: [ -0.0000,  -0.0000] [FIXED]
	x102: [ -0.0000,  -0.0000] [FIXED]
	x103: [ -0.0000,  -0.0000] [FIXED]
	x104: [ -0.0000,  -0.0000] [FIXED]
	x105: [ -0.0000,  -0.0000] [FIXED]
	x106: [ -0.0000,  -0.0000] [FIXED]
	x107: [ -0.0000,  -0.0000] [FIXED]
	x108: [ -0.0000,  -0.0000] [FIXED]
	x109: [ -0.0000,  -0.0000] [FIXED]
	x110: [ -0.0000,  -0.0000] [FIXED]
	x111: [ -0.0000,  -0.0000] [FIXED]
	x112: [ -0.0000,  -0.0000] [FIXED]
	x113: [ -0.0000,  -0.0000] [FIXED]
	x114: [ -0.0000,  -0.0000] [FIXED]
	x115: [ -0.0000,  -0.0000] [FIXED]
	x116: [ -0.0000,  -0.0000] [FIXED]
	x117: [ -0.0000,  -0.0000] [FIXED]
	x118: [ -0.0000,  -0.0000] [FIXED]
	x119: [ -0.0000,  -0.0000] [FIXED]
	x120: [ -0.0000,  -0.0000] [FIXED]
	x121: [ -0.0000,  -0.0000] [FIXED]
	x122: [  0.3098,   0.3098] [FIXED]
	x123: [  0.9922,   0.9922] [FIXED]
	x124: [  0.7843,   0.7843] [FIXED]
	x125: [  0.3765,   0.3765] [FIXED]
	x126: [  0.8078,   0.8078] [FIXED]
	x127: [  0.0392,   0.0392] [FIXED]
	x128: [ -0.0000,  -0.0000] [FIXED]
	x129: [ -0.0000,  -0.0000] [FIXED]
	x130: [ -0.0000,  -0.0000] [FIXED]
	x131: [ -0.0000,  -0.0000] [FIXED]
	x132: [ -0.0000,  -0.0000] [FIXED]
	x133: [ -0.0000,  -0.0000] [FIXED]
	x134: [ -0.0000,  -0.0000] [FIXED]
	x135: [ -0.0000,  -0.0000] [FIXED]
	x136: [ -0.0000,  -0.0000] [FIXED]
	x137: [ -0.0000,  -0.0000] [FIXED]
	x138: [ -0.0000,  -0.0000] [FIXED]
	x139: [ -0.0000,  -0.0000] [FIXED]
	x140: [ -0.0000,  -0.0000] [FIXED]
	x141: [ -0.0000,  -0.0000] [FIXED]
	x142: [ -0.0000,   1.0000] 
	x143: [ -0.0000,  -0.0000] [FIXED]
	x144: [ -0.0000,  -0.0000] [FIXED]
	x145: [ -0.0000,  -0.0000] [FIXED]
	x146: [ -0.0000,  -0.0000] [FIXED]
	x147: [ -0.0000,  -0.0000] [FIXED]
	x148: [ -0.0000,  -0.0000] [FIXED]
	x149: [  0.1294,   0.1294] [FIXED]
	x150: [  0.9020,   0.9020] [FIXED]
	x151: [  0.9922,   0.9922] [FIXED]
	x152: [  0.6588,   0.6588] [FIXED]
	x153: [ -0.0000,  -0.0000] [FIXED]
	x154: [ -0.0000,  -0.0000] [FIXED]
	x155: [ -0.0000,  -0.0000] [FIXED]
	x156: [ -0.0000,  -0.0000] [FIXED]
	x157: [ -0.0000,  -0.0000] [FIXED]
	x158: [ -0.0000,  -0.0000] [FIXED]
	x159: [ -0.0000,  -0.0000] [FIXED]
	x160: [ -0.0000,  -0.0000] [FIXED]
	x161: [ -0.0000,  -0.0000] [FIXED]
	x162: [ -0.0000,  -0.0000] [FIXED]
	x163: [ -0.0000,  -0.0000] [FIXED]
	x164: [ -0.0000,  -0.0000] [FIXED]
	x165: [ -0.0000,  -0.0000] [FIXED]
	x166: [ -0.0000,  -0.0000] [FIXED]
	x167: [ -0.0000,  -0.0000] [FIXED]
	x168: [ -0.0000,  -0.0000] [FIXED]
	x169: [ -0.0000,  -0.0000] [FIXED]
	x170: [ -0.0000,  -0.0000] [FIXED]
	x171: [ -0.0000,  -0.0000] [FIXED]
	x172: [ -0.0000,  -0.0000] [FIXED]
	x173: [ -0.0000,  -0.0000] [FIXED]
	x174: [ -0.0000,  -0.0000] [FIXED]
	x175: [ -0.0000,  -0.0000] [FIXED]
	x176: [ -0.0000,  -0.0000] [FIXED]
	x177: [  0.3059,   0.3059] [FIXED]
	x178: [  0.9922,   0.9922] [FIXED]
	x179: [  0.9255,   0.9255] [FIXED]
	x180: [  0.2784,   0.2784] [FIXED]
	x181: [ -0.0000,  -0.0000] [FIXED]
	x182: [ -0.0000,  -0.0000] [FIXED]
	x183: [ -0.0000,  -0.0000] [FIXED]
	x184: [ -0.0000,  -0.0000] [FIXED]
	x185: [ -0.0000,  -0.0000] [FIXED]
	x186: [ -0.0000,  -0.0000] [FIXED]
	x187: [ -0.0000,  -0.0000] [FIXED]
	x188: [ -0.0000,  -0.0000] [FIXED]
	x189: [ -0.0000,  -0.0000] [FIXED]
	x190: [ -0.0000,  -0.0000] [FIXED]
	x191: [ -0.0000,  -0.0000] [FIXED]
	x192: [ -0.0000,  -0.0000] [FIXED]
	x193: [ -0.0000,  -0.0000] [FIXED]
	x194: [ -0.0000,  -0.0000] [FIXED]
	x195: [ -0.0000,  -0.0000] [FIXED]
	x196: [ -0.0000,  -0.0000] [FIXED]
	x197: [ -0.0000,  -0.0000] [FIXED]
	x198: [ -0.0000,  -0.0000] [FIXED]
	x199: [ -0.0000,  -0.0000] [FIXED]
	x200: [ -0.0000,  -0.0000] [FIXED]
	x201: [ -0.0000,  -0.0000] [FIXED]
	x202: [ -0.0000,  -0.0000] [FIXED]
	x203: [ -0.0000,  -0.0000] [FIXED]
	x204: [ -0.0000,  -0.0000] [FIXED]
	x205: [  0.6627,   0.6627] [FIXED]
	x206: [  0.9922,   0.9922] [FIXED]
	x207: [ -0.0000,   1.0000] 
	x208: [ -0.0000,  -0.0000] [FIXED]
	x209: [ -0.0000,  -0.0000] [FIXED]
	x210: [ -0.0000,  -0.0000] [FIXED]
	x211: [ -0.0000,  -0.0000] [FIXED]
	x212: [ -0.0000,  -0.0000] [FIXED]
	x213: [ -0.0000,  -0.0000] [FIXED]
	x214: [ -0.0000,  -0.0000] [FIXED]
	x215: [ -0.0000,  -0.0000] [FIXED]
	x216: [ -0.0000,  -0.0000] [FIXED]
	x217: [ -0.0000,  -0.0000] [FIXED]
	x218: [ -0.0000,  -0.0000] [FIXED]
	x219: [ -0.0000,  -0.0000] [FIXED]
	x220: [ -0.0000,  -0.0000] [FIXED]
	x221: [ -0.0000,  -0.0000] [FIXED]
	x222: [ -0.0000,  -0.0000] [FIXED]
	x223: [ -0.0000,  -0.0000] [FIXED]
	x224: [ -0.0000,  -0.0000] [FIXED]
	x225: [ -0.0000,  -0.0000] [FIXED]
	x226: [ -0.0000,  -0.0000] [FIXED]
	x227: [ -0.0000,  -0.0000] [FIXED]
	x228: [ -0.0000,  -0.0000] [FIXED]
	x229: [ -0.0000,  -0.0000] [FIXED]
	x230: [ -0.0000,  -0.0000] [FIXED]
	x231: [ -0.0000,  -0.0000] [FIXED]
	x232: [  0.1176,   0.1176] [FIXED]
	x233: [  0.9333,   0.9333] [FIXED]
	x234: [  0.9922,   0.9922] [FIXED]
	x235: [  0.2353,   0.2353] [FIXED]
	x236: [ -0.0000,  -0.0000] [FIXED]
	x237: [ -0.0000,  -0.0000] [FIXED]
	x238: [ -0.0000,  -0.0000] [FIXED]
	x239: [ -0.0000,  -0.0000] [FIXED]
	x240: [ -0.0000,  -0.0000] [FIXED]
	x241: [ -0.0000,  -0.0000] [FIXED]
	x242: [ -0.0000,  -0.0000] [FIXED]
	x243: [ -0.0000,  -0.0000] [FIXED]
	x244: [ -0.0000,  -0.0000] [FIXED]
	x245: [ -0.0000,  -0.0000] [FIXED]
	x246: [ -0.0000,  -0.0000] [FIXED]
	x247: [ -0.0000,  -0.0000] [FIXED]
	x248: [ -0.0000,  -0.0000] [FIXED]
	x249: [ -0.0000,  -0.0000] [FIXED]
	x250: [ -0.0000,  -0.0000] [FIXED]
	x251: [ -0.0000,  -0.0000] [FIXED]
	x252: [ -0.0000,  -0.0000] [FIXED]
	x253: [ -0.0000,  -0.0000] [FIXED]
	x254: [ -0.0000,  -0.0000] [FIXED]
	x255: [ -0.0000,  -0.0000] [FIXED]
	x256: [ -0.0000,  -0.0000] [FIXED]
	x257: [ -0.0000,   1.0000] 
	x258: [ -0.0000,  -0.0000] [FIXED]
	x259: [ -0.0000,  -0.0000] [FIXED]
	x260: [  0.1451,   0.1451] [FIXED]
	x261: [  0.9922,   0.9922] [FIXED]
	x262: [  0.9922,   0.9922] [FIXED]
	x263: [  0.2353,   0.2353] [FIXED]
	x264: [ -0.0000,  -0.0000] [FIXED]
	x265: [ -0.0000,  -0.0000] [FIXED]
	x266: [ -0.0000,  -0.0000] [FIXED]
	x267: [ -0.0000,  -0.0000] [FIXED]
	x268: [ -0.0000,  -0.0000] [FIXED]
	x269: [ -0.0000,  -0.0000] [FIXED]
	x270: [ -0.0000,  -0.0000] [FIXED]
	x271: [ -0.0000,  -0.0000] [FIXED]
	x272: [ -0.0000,  -0.0000] [FIXED]
	x273: [ -0.0000,  -0.0000] [FIXED]
	x274: [ -0.0000,  -0.0000] [FIXED]
	x275: [ -0.0000,  -0.0000] [FIXED]
	x276: [ -0.0000,  -0.0000] [FIXED]
	x277: [ -0.0000,  -0.0000] [FIXED]
	x278: [ -0.0000,  -0.0000] [FIXED]
	x279: [ -0.0000,  -0.0000] [FIXED]
	x280: [ -0.0000,  -0.0000] [FIXED]
	x281: [ -0.0000,  -0.0000] [FIXED]
	x282: [ -0.0000,  -0.0000] [FIXED]
	x283: [ -0.0000,  -0.0000] [FIXED]
	x284: [ -0.0000,  -0.0000] [FIXED]
	x285: [ -0.0000,  -0.0000] [FIXED]
	x286: [ -0.0000,  -0.0000] [FIXED]
	x287: [ -0.0000,  -0.0000] [FIXED]
	x288: [  0.5725,   0.5725] [FIXED]
	x289: [  0.9922,   0.9922] [FIXED]
	x290: [  0.9922,   0.9922] [FIXED]
	x291: [  0.2353,   0.2353] [FIXED]
	x292: [ -0.0000,  -0.0000] [FIXED]
	x293: [ -0.0000,  -0.0000] [FIXED]
	x294: [ -0.0000,  -0.0000] [FIXED]
	x295: [ -0.0000,   1.0000] 
	x296: [ -0.0000,  -0.0000] [FIXED]
	x297: [ -0.0000,  -0.0000] [FIXED]
	x298: [ -0.0000,  -0.0000] [FIXED]
	x299: [ -0.0000,  -0.0000] [FIXED]
	x300: [ -0.0000,  -0.0000] [FIXED]
	x301: [ -0.0000,  -0.0000] [FIXED]
	x302: [ -0.0000,  -0.0000] [FIXED]
	x303: [ -0.0000,  -0.0000] [FIXED]
	x304: [ -0.0000,  -0.0000] [FIXED]
	x305: [ -0.0000,  -0.0000] [FIXED]
	x306: [ -0.0000,  -0.0000] [FIXED]
	x307: [ -0.0000,  -0.0000] [FIXED]
	x308: [ -0.0000,  -0.0000] [FIXED]
	x309: [ -0.0000,  -0.0000] [FIXED]
	x310: [ -0.0000,  -0.0000] [FIXED]
	x311: [ -0.0000,  -0.0000] [FIXED]
	x312: [ -0.0000,  -0.0000] [FIXED]
	x313: [ -0.0000,  -0.0000] [FIXED]
	x314: [ -0.0000,  -0.0000] [FIXED]
	x315: [ -0.0000,  -0.0000] [FIXED]
	x316: [  0.6157,   0.6157] [FIXED]
	x317: [  0.9922,   0.9922] [FIXED]
	x318: [  0.9922,   0.9922] [FIXED]
	x319: [  0.2353,   0.2353] [FIXED]
	x320: [ -0.0000,  -0.0000] [FIXED]
	x321: [ -0.0000,  -0.0000] [FIXED]
	x322: [ -0.0000,  -0.0000] [FIXED]
	x323: [ -0.0000,  -0.0000] [FIXED]
	x324: [ -0.0000,  -0.0000] [FIXED]
	x325: [ -0.0000,  -0.0000] [FIXED]
	x326: [  0.2980,   0.2980] [FIXED]
	x327: [  0.7922,   0.7922] [FIXED]
	x328: [  0.6078,   0.6078] [FIXED]
	x329: [  0.1137,   0.1137] [FIXED]
	x330: [ -0.0000,  -0.0000] [FIXED]
	x331: [ -0.0000,  -0.0000] [FIXED]
	x332: [ -0.0000,  -0.0000] [FIXED]
	x333: [ -0.0000,  -0.0000] [FIXED]
	x334: [ -0.0000,  -0.0000] [FIXED]
	x335: [ -0.0000,  -0.0000] [FIXED]
	x336: [ -0.0000,  -0.0000] [FIXED]
	x337: [ -0.0000,  -0.0000] [FIXED]
	x338: [ -0.0000,  -0.0000] [FIXED]
	x339: [ -0.0000,  -0.0000] [FIXED]
	x340: [ -0.0000,  -0.0000] [FIXED]
	x341: [ -0.0000,  -0.0000] [FIXED]
	x342: [ -0.0000,  -0.0000] [FIXED]
	x343: [ -0.0000,  -0.0000] [FIXED]
	x344: [  0.6196,   0.6196] [FIXED]
	x345: [  0.9961,   0.9961] [FIXED]
	x346: [  0.9961,   0.9961] [FIXED]
	x347: [  0.2353,   0.2353] [FIXED]
	x348: [ -0.0000,  -0.0000] [FIXED]
	x349: [ -0.0000,  -0.0000] [FIXED]
	x350: [ -0.0000,  -0.0000] [FIXED]
	x351: [ -0.0000,  -0.0000] [FIXED]
	x352: [  0.0039,   0.0039] [FIXED]
	x353: [  0.3216,   0.3216] [FIXED]
	x354: [  0.8196,   0.8196] [FIXED]
	x355: [  0.9961,   0.9961] [FIXED]
	x356: [  0.9961,   0.9961] [FIXED]
	x357: [  0.8627,   0.8627] [FIXED]
	x358: [  0.1216,   0.1216] [FIXED]
	x359: [ -0.0000,  -0.0000] [FIXED]
	x360: [ -0.0000,  -0.0000] [FIXED]
	x361: [ -0.0000,  -0.0000] [FIXED]
	x362: [ -0.0000,  -0.0000] [FIXED]
	x363: [ -0.0000,  -0.0000] [FIXED]
	x364: [ -0.0000,  -0.0000] [FIXED]
	x365: [ -0.0000,  -0.0000] [FIXED]
	x366: [ -0.0000,  -0.0000] [FIXED]
	x367: [ -0.0000,  -0.0000] [FIXED]
	x368: [ -0.0000,  -0.0000] [FIXED]
	x369: [ -0.0000,  -0.0000] [FIXED]
	x370: [ -0.0000,  -0.0000] [FIXED]
	x371: [ -0.0000,  -0.0000] [FIXED]
	x372: [  0.6157,   0.6157] [FIXED]
	x373: [  0.9922,   0.9922] [FIXED]
	x374: [  0.9922,   0.9922] [FIXED]
	x375: [  0.2353,   0.2353] [FIXED]
	x376: [ -0.0000,  -0.0000] [FIXED]
	x377: [ -0.0000,  -0.0000] [FIXED]
	x378: [ -0.0000,  -0.0000] [FIXED]
	x379: [ -0.0000,  -0.0000] [FIXED]
	x380: [  0.3216,   0.3216] [FIXED]
	x381: [  0.9922,   0.9922] [FIXED]
	x382: [  0.9922,   0.9922] [FIXED]
	x383: [  0.9922,   0.9922] [FIXED]
	x384: [  0.9922,   0.9922] [FIXED]
	x385: [  0.9922,   0.9922] [FIXED]
	x386: [  0.8510,   0.8510] [FIXED]
	x387: [  0.0824,   0.0824] [FIXED]
	x388: [ -0.0000,  -0.0000] [FIXED]
	x389: [ -0.0000,  -0.0000] [FIXED]
	x390: [ -0.0000,  -0.0000] [FIXED]
	x391: [ -0.0000,  -0.0000] [FIXED]
	x392: [ -0.0000,  -0.0000] [FIXED]
	x393: [ -0.0000,   1.0000] 
	x394: [ -0.0000,  -0.0000] [FIXED]
	x395: [ -0.0000,   1.0000] 
	x396: [ -0.0000,  -0.0000] [FIXED]
	x397: [ -0.0000,  -0.0000] [FIXED]
	x398: [ -0.0000,  -0.0000] [FIXED]
	x399: [ -0.0000,  -0.0000] [FIXED]
	x400: [  0.5490,   0.5490] [FIXED]
	x401: [  0.9922,   0.9922] [FIXED]
	x402: [  0.9922,   0.9922] [FIXED]
	x403: [  0.2353,   0.2353] [FIXED]
	x404: [ -0.0000,  -0.0000] [FIXED]
	x405: [ -0.0000,  -0.0000] [FIXED]
	x406: [ -0.0000,  -0.0000] [FIXED]
	x407: [  0.0706,   0.0706] [FIXED]
	x408: [  0.8196,   0.8196] [FIXED]
	x409: [  0.9922,   0.9922] [FIXED]
	x410: [  0.9059,   0.9059] [FIXED]
	x411: [  0.5333,   0.5333] [FIXED]
	x412: [  0.3765,   0.3765] [FIXED]
	x413: [  0.8471,   0.8471] [FIXED]
	x414: [  0.9922,   0.9922] [FIXED]
	x415: [  0.4353,   0.4353] [FIXED]
	x416: [ -0.0000,  -0.0000] [FIXED]
	x417: [ -0.0000,  -0.0000] [FIXED]
	x418: [ -0.0000,  -0.0000] [FIXED]
	x419: [ -0.0000,  -0.0000] [FIXED]
	x420: [ -0.0000,  -0.0000] [FIXED]
	x421: [ -0.0000,  -0.0000] [FIXED]
	x422: [ -0.0000,  -0.0000] [FIXED]
	x423: [ -0.0000,  -0.0000] [FIXED]
	x424: [ -0.0000,  -0.0000] [FIXED]
	x425: [ -0.0000,  -0.0000] [FIXED]
	x426: [ -0.0000,  -0.0000] [FIXED]
	x427: [ -0.0000,  -0.0000] [FIXED]
	x428: [  0.1451,   0.1451] [FIXED]
	x429: [  0.9922,   0.9922] [FIXED]
	x430: [  0.9922,   0.9922] [FIXED]
	x431: [  0.2353,   0.2353] [FIXED]
	x432: [ -0.0000,  -0.0000] [FIXED]
	x433: [ -0.0000,  -0.0000] [FIXED]
	x434: [ -0.0000,  -0.0000] [FIXED]
	x435: [  0.5647,   0.5647] [FIXED]
	x436: [  0.9961,   0.9961] [FIXED]
	x437: [  0.8392,   0.8392] [FIXED]
	x438: [  0.1255,   0.1255] [FIXED]
	x439: [ -0.0000,  -0.0000] [FIXED]
	x440: [ -0.0000,  -0.0000] [FIXED]
	x441: [  0.7608,   0.7608] [FIXED]
	x442: [  0.9922,   0.9922] [FIXED]
	x443: [  0.6118,   0.6118] [FIXED]
	x444: [ -0.0000,  -0.0000] [FIXED]
	x445: [ -0.0000,  -0.0000] [FIXED]
	x446: [ -0.0000,  -0.0000] [FIXED]
	x447: [ -0.0000,  -0.0000] [FIXED]
	x448: [ -0.0000,  -0.0000] [FIXED]
	x449: [ -0.0000,  -0.0000] [FIXED]
	x450: [ -0.0000,  -0.0000] [FIXED]
	x451: [ -0.0000,  -0.0000] [FIXED]
	x452: [ -0.0000,  -0.0000] [FIXED]
	x453: [ -0.0000,  -0.0000] [FIXED]
	x454: [ -0.0000,  -0.0000] [FIXED]
	x455: [ -0.0000,  -0.0000] [FIXED]
	x456: [  0.1098,   0.1098] [FIXED]
	x457: [  0.9137,   0.9137] [FIXED]
	x458: [  0.9922,   0.9922] [FIXED]
	x459: [  0.3490,   0.3490] [FIXED]
	x460: [ -0.0000,  -0.0000] [FIXED]
	x461: [ -0.0000,  -0.0000] [FIXED]
	x462: [  0.6471,   0.6471] [FIXED]
	x463: [  0.9804,   0.9804] [FIXED]
	x464: [  0.9647,   0.9647] [FIXED]
	x465: [  0.1216,   0.1216] [FIXED]
	x466: [ -0.0000,  -0.0000] [FIXED]
	x467: [ -0.0000,  -0.0000] [FIXED]
	x468: [ -0.0000,  -0.0000] [FIXED]
	x469: [  0.7608,   0.7608] [FIXED]
	x470: [  0.9922,   0.9922] [FIXED]
	x471: [  0.5020,   0.5020] [FIXED]
	x472: [ -0.0000,  -0.0000] [FIXED]
	x473: [ -0.0000,  -0.0000] [FIXED]
	x474: [ -0.0000,  -0.0000] [FIXED]
	x475: [ -0.0000,  -0.0000] [FIXED]
	x476: [ -0.0000,  -0.0000] [FIXED]
	x477: [ -0.0000,  -0.0000] [FIXED]
	x478: [ -0.0000,  -0.0000] [FIXED]
	x479: [ -0.0000,  -0.0000] [FIXED]
	x480: [ -0.0000,  -0.0000] [FIXED]
	x481: [ -0.0000,  -0.0000] [FIXED]
	x482: [ -0.0000,  -0.0000] [FIXED]
	x483: [ -0.0000,  -0.0000] [FIXED]
	x484: [ -0.0000,  -0.0000] [FIXED]
	x485: [  0.5294,   0.5294] [FIXED]
	x486: [  0.9922,   0.9922] [FIXED]
	x487: [  0.9255,   0.9255] [FIXED]
	x488: [  0.2824,   0.2824] [FIXED]
	x489: [  0.1098,   0.1098] [FIXED]
	x490: [  0.9294,   0.9294] [FIXED]
	x491: [  0.9922,   0.9922] [FIXED]
	x492: [  0.4549,   0.4549] [FIXED]
	x493: [ -0.0000,  -0.0000] [FIXED]
	x494: [ -0.0000,  -0.0000] [FIXED]
	x495: [  0.0549,   0.0549] [FIXED]
	x496: [  0.4000,   0.4000] [FIXED]
	x497: [  0.9373,   0.9373] [FIXED]
	x498: [  0.7373,   0.7373] [FIXED]
	x499: [  0.0353,   0.0353] [FIXED]
	x500: [ -0.0000,  -0.0000] [FIXED]
	x501: [ -0.0000,  -0.0000] [FIXED]
	x502: [ -0.0000,  -0.0000] [FIXED]
	x503: [ -0.0000,  -0.0000] [FIXED]
	x504: [ -0.0000,  -0.0000] [FIXED]
	x505: [ -0.0000,  -0.0000] [FIXED]
	x506: [ -0.0000,  -0.0000] [FIXED]
	x507: [ -0.0000,  -0.0000] [FIXED]
	x508: [ -0.0000,  -0.0000] [FIXED]
	x509: [ -0.0000,  -0.0000] [FIXED]
	x510: [ -0.0000,  -0.0000] [FIXED]
	x511: [ -0.0000,  -0.0000] [FIXED]
	x512: [ -0.0000,  -0.0000] [FIXED]
	x513: [  0.1294,   0.1294] [FIXED]
	x514: [  0.8980,   0.8980] [FIXED]
	x515: [  0.9922,   0.9922] [FIXED]
	x516: [  0.9294,   0.9294] [FIXED]
	x517: [  0.8784,   0.8784] [FIXED]
	x518: [  0.9922,   0.9922] [FIXED]
	x519: [  0.9922,   0.9922] [FIXED]
	x520: [ -0.0000,  -0.0000] [FIXED]
	x521: [ -0.0000,  -0.0000] [FIXED]
	x522: [  0.2078,   0.2078] [FIXED]
	x523: [  0.6863,   0.6863] [FIXED]
	x524: [  0.9922,   0.9922] [FIXED]
	x525: [  0.9922,   0.9922] [FIXED]
	x526: [  0.5020,   0.5020] [FIXED]
	x527: [ -0.0000,  -0.0000] [FIXED]
	x528: [ -0.0000,  -0.0000] [FIXED]
	x529: [ -0.0000,  -0.0000] [FIXED]
	x530: [ -0.0000,  -0.0000] [FIXED]
	x531: [ -0.0000,  -0.0000] [FIXED]
	x532: [ -0.0000,  -0.0000] [FIXED]
	x533: [ -0.0000,  -0.0000] [FIXED]
	x534: [ -0.0000,  -0.0000] [FIXED]
	x535: [ -0.0000,  -0.0000] [FIXED]
	x536: [ -0.0000,  -0.0000] [FIXED]
	x537: [ -0.0000,  -0.0000] [FIXED]
	x538: [ -0.0000,  -0.0000] [FIXED]
	x539: [ -0.0000,  -0.0000] [FIXED]
	x540: [ -0.0000,  -0.0000] [FIXED]
	x541: [ -0.0000,  -0.0000] [FIXED]
	x542: [  0.2157,   0.2157] [FIXED]
	x543: [  0.9059,   0.9059] [FIXED]
	x544: [  0.9922,   0.9922] [FIXED]
	x545: [  0.9922,   0.9922] [FIXED]
	x546: [  0.9922,   0.9922] [FIXED]
	x547: [  0.9922,   0.9922] [FIXED]
	x548: [  0.8353,   0.8353] [FIXED]
	x549: [  0.6510,   0.6510] [FIXED]
	x550: [  0.9412,   0.9412] [FIXED]
	x551: [  0.9922,   0.9922] [FIXED]
	x552: [  0.9922,   0.9922] [FIXED]
	x553: [  0.5647,   0.5647] [FIXED]
	x554: [  0.0275,   0.0275] [FIXED]
	x555: [ -0.0000,  -0.0000] [FIXED]
	x556: [ -0.0000,  -0.0000] [FIXED]
	x557: [ -0.0000,  -0.0000] [FIXED]
	x558: [ -0.0000,  -0.0000] [FIXED]
	x559: [ -0.0000,  -0.0000] [FIXED]
	x560: [ -0.0000,  -0.0000] [FIXED]
	x561: [ -0.0000,  -0.0000] [FIXED]
	x562: [ -0.0000,  -0.0000] [FIXED]
	x563: [ -0.0000,  -0.0000] [FIXED]
	x564: [ -0.0000,  -0.0000] [FIXED]
	x565: [ -0.0000,  -0.0000] [FIXED]
	x566: [ -0.0000,  -0.0000] [FIXED]
	x567: [ -0.0000,  -0.0000] [FIXED]
	x568: [ -0.0000,  -0.0000] [FIXED]
	x569: [ -0.0000,  -0.0000] [FIXED]
	x570: [ -0.0000,  -0.0000] [FIXED]
	x571: [  0.4353,   0.4353] [FIXED]
	x572: [  0.9137,   0.9137] [FIXED]
	x573: [  0.9922,   0.9922] [FIXED]
	x574: [  0.9922,   0.9922] [FIXED]
	x575: [  0.9922,   0.9922] [FIXED]
	x576: [  0.9961,   0.9961] [FIXED]
	x577: [  0.9922,   0.9922] [FIXED]
	x578: [  0.9922,   0.9922] [FIXED]
	x579: [  0.9098,   0.9098] [FIXED]
	x580: [  0.4549,   0.4549] [FIXED]
	x581: [  0.0235,   0.0235] [FIXED]
	x582: [ -0.0000,  -0.0000] [FIXED]
	x583: [ -0.0000,  -0.0000] [FIXED]
	x584: [ -0.0000,  -0.0000] [FIXED]
	x585: [ -0.0000,  -0.0000] [FIXED]
	x586: [ -0.0000,  -0.0000] [FIXED]
	x587: [ -0.0000,  -0.0000] [FIXED]
	x588: [ -0.0000,  -0.0000] [FIXED]
	x589: [ -0.0000,  -0.0000] [FIXED]
	x590: [ -0.0000,  -0.0000] [FIXED]
	x591: [ -0.0000,   1.0000] 
	x592: [ -0.0000,  -0.0000] [FIXED]
	x593: [ -0.0000,  -0.0000] [FIXED]
	x594: [ -0.0000,  -0.0000] [FIXED]
	x595: [ -0.0000,  -0.0000] [FIXED]
	x596: [ -0.0000,   1.0000] 
	x597: [ -0.0000,  -0.0000] [FIXED]
	x598: [ -0.0000,  -0.0000] [FIXED]
	x599: [ -0.0000,  -0.0000] [FIXED]
	x600: [  0.0353,   0.0353] [FIXED]
	x601: [  0.4549,   0.4549] [FIXED]
	x602: [  0.5176,   0.5176] [FIXED]
	x603: [  0.9725,   0.9725] [FIXED]
	x604: [  0.9961,   0.9961] [FIXED]
	x605: [  0.9490,   0.9490] [FIXED]
	x606: [  0.5176,   0.5176] [FIXED]
	x607: [  0.1922,   0.1922] [FIXED]
	x608: [ -0.0000,  -0.0000] [FIXED]
	x609: [ -0.0000,  -0.0000] [FIXED]
	x610: [ -0.0000,  -0.0000] [FIXED]
	x611: [ -0.0000,  -0.0000] [FIXED]
	x612: [ -0.0000,  -0.0000] [FIXED]
	x613: [ -0.0000,  -0.0000] [FIXED]
	x614: [ -0.0000,  -0.0000] [FIXED]
	x615: [ -0.0000,  -0.0000] [FIXED]
	x616: [ -0.0000,  -0.0000] [FIXED]
	x617: [ -0.0000,  -0.0000] [FIXED]
	x618: [ -0.0000,  -0.0000] [FIXED]
	x619: [ -0.0000,  -0.0000] [FIXED]
	x620: [ -0.0000,  -0.0000] [FIXED]
	x621: [ -0.0000,  -0.0000] [FIXED]
	x622: [ -0.0000,  -0.0000] [FIXED]
	x623: [ -0.0000,  -0.0000] [FIXED]
	x624: [ -0.0000,  -0.0000] [FIXED]
	x625: [ -0.0000,  -0.0000] [FIXED]
	x626: [ -0.0000,  -0.0000] [FIXED]
	x627: [ -0.0000,  -0.0000] [FIXED]
	x628: [ -0.0000,  -0.0000] [FIXED]
	x629: [ -0.0000,  -0.0000] [FIXED]
	x630: [ -0.0000,  -0.0000] [FIXED]
	x631: [ -0.0000,  -0.0000] [FIXED]
	x632: [ -0.0000,  -0.0000] [FIXED]
	x633: [ -0.0000,  -0.0000] [FIXED]
	x634: [ -0.0000,  -0.0000] [FIXED]
	x635: [ -0.0000,  -0.0000] [FIXED]
	x636: [ -0.0000,  -0.0000] [FIXED]
	x637: [ -0.0000,  -0.0000] [FIXED]
	x638: [ -0.0000,  -0.0000] [FIXED]
	x639: [ -0.0000,  -0.0000] [FIXED]
	x640: [ -0.0000,  -0.0000] [FIXED]
	x641: [ -0.0000,  -0.0000] [FIXED]
	x642: [ -0.0000,  -0.0000] [FIXED]
	x643: [ -0.0000,  -0.0000] [FIXED]
	x644: [ -0.0000,  -0.0000] [FIXED]
	x645: [ -0.0000,   1.0000] 
	x646: [ -0.0000,  -0.0000] [FIXED]
	x647: [ -0.0000,  -0.0000] [FIXED]
	x648: [ -0.0000,  -0.0000] [FIXED]
	x649: [ -0.0000,  -0.0000] [FIXED]
	x650: [ -0.0000,  -0.0000] [FIXED]
	x651: [ -0.0000,  -0.0000] [FIXED]
	x652: [ -0.0000,  -0.0000] [FIXED]
	x653: [ -0.0000,  -0.0000] [FIXED]
	x654: [ -0.0000,  -0.0000] [FIXED]
	x655: [ -0.0000,  -0.0000] [FIXED]
	x656: [ -0.0000,   1.0000] 
	x657: [ -0.0000,  -0.0000] [FIXED]
	x658: [ -0.0000,  -0.0000] [FIXED]
	x659: [ -0.0000,  -0.0000] [FIXED]
	x660: [ -0.0000,  -0.0000] [FIXED]
	x661: [ -0.0000,  -0.0000] [FIXED]
	x662: [ -0.0000,  -0.0000] [FIXED]
	x663: [ -0.0000,  -0.0000] [FIXED]
	x664: [ -0.0000,  -0.0000] [FIXED]
	x665: [ -0.0000,  -0.0000] [FIXED]
	x666: [ -0.0000,  -0.0000] [FIXED]
	x667: [ -0.0000,  -0.0000] [FIXED]
	x668: [ -0.0000,  -0.0000] [FIXED]
	x669: [ -0.0000,  -0.0000] [FIXED]
	x670: [ -0.0000,  -0.0000] [FIXED]
	x671: [ -0.0000,  -0.0000] [FIXED]
	x672: [ -0.0000,  -0.0000] [FIXED]
	x673: [ -0.0000,  -0.0000] [FIXED]
	x674: [ -0.0000,  -0.0000] [FIXED]
	x675: [ -0.0000,  -0.0000] [FIXED]
	x676: [ -0.0000,  -0.0000] [FIXED]
	x677: [ -0.0000,  -0.0000] [FIXED]
	x678: [ -0.0000,  -0.00[runlim] sample:		10.21 time, 10.01 real, 147 MB, 1.03 load
00] [FIXED]
	x679: [ -0.0000,  -0.0000] [FIXED]
	x680: [ -0.0000,  -0.0000] [FIXED]
	x681: [ -0.0000,  -0.0000] [FIXED]
	x682: [ -0.0000,  -0.0000] [FIXED]
	x683: [ -0.0000,  -0.0000] [FIXED]
	x684: [ -0.0000,  -0.0000] [FIXED]
	x685: [ -0.0000,  -0.0000] [FIXED]
	x686: [ -0.0000,  -0.0000] [FIXED]
	x687: [ -0.0000,  -0.0000] [FIXED]
	x688: [ -0.0000,  -0.0000] [FIXED]
	x689: [ -0.0000,  -0.0000] [FIXED]
	x690: [ -0.0000,  -0.0000] [FIXED]
	x691: [ -0.0000,  -0.0000] [FIXED]
	x692: [ -0.0000,  -0.0000] [FIXED]
	x693: [ -0.0000,  -0.0000] [FIXED]
	x694: [ -0.0000,  -0.0000] [FIXED]
	x695: [ -0.0000,  -0.0000] [FIXED]
	x696: [ -0.0000,  -0.0000] [FIXED]
	x697: [ -0.0000,  -0.0000] [FIXED]
	x698: [ -0.0000,  -0.0000] [FIXED]
	x699: [ -0.0000,  -0.0000] [FIXED]
	x700: [ -0.0000,  -0.0000] [FIXED]
	x701: [ -0.0000,  -0.0000] [FIXED]
	x702: [ -0.0000,  -0.0000] [FIXED]
	x703: [ -0.0000,  -0.0000] [FIXED]
	x704: [ -0.0000,  -0.0000] [FIXED]
	x705: [ -0.0000,  -0.0000] [FIXED]
	x706: [ -0.0000,  -0.0000] [FIXED]
	x707: [ -0.0000,  -0.0000] [FIXED]
	x708: [ -0.0000,  -0.0000] [FIXED]
	x709: [ -0.0000,  -0.0000] [FIXED]
	x710: [ -0.0000,   1.0000] 
	x711: [ -0.0000,  -0.0000] [FIXED]
	x712: [ -0.0000,  -0.0000] [FIXED]
	x713: [ -0.0000,  -0.0000] [FIXED]
	x714: [ -0.0000,  -0.0000] [FIXED]
	x715: [ -0.0000,  -0.0000] [FIXED]
	x716: [ -0.0000,  -0.0000] [FIXED]
	x717: [ -0.0000,  -0.0000] [FIXED]
	x718: [ -0.0000,  -0.0000] [FIXED]
	x719: [ -0.0000,  -0.0000] [FIXED]
	x720: [ -0.0000,  -0.0000] [FIXED]
	x721: [ -0.0000,  -0.0000] [FIXED]
	x722: [ -0.0000,  -0.0000] [FIXED]
	x723: [ -0.0000,  -0.0000] [FIXED]
	x724: [ -0.0000,  -0.0000] [FIXED]
	x725: [ -0.0000,  -0.0000] [FIXED]
	x726: [ -0.0000,  -0.0000] [FIXED]
	x727: [ -0.0000,  -0.0000] [FIXED]
	x728: [ -0.0000,  -0.0000] [FIXED]
	x729: [ -0.0000,   1.0000] 
	x730: [ -0.0000,  -0.0000] [FIXED]
	x731: [ -0.0000,  -0.0000] [FIXED]
	x732: [ -0.0000,  -0.0000] [FIXED]
	x733: [ -0.0000,  -0.0000] [FIXED]
	x734: [ -0.0000,  -0.0000] [FIXED]
	x735: [ -0.0000,  -0.0000] [FIXED]
	x736: [ -0.0000,  -0.0000] [FIXED]
	x737: [ -0.0000,  -0.0000] [FIXED]
	x738: [ -0.0000,  -0.0000] [FIXED]
	x739: [ -0.0000,  -0.0000] [FIXED]
	x740: [ -0.0000,  -0.0000] [FIXED]
	x741: [ -0.0000,  -0.0000] [FIXED]
	x742: [ -0.0000,  -0.0000] [FIXED]
	x743: [ -0.0000,  -0.0000] [FIXED]
	x744: [ -0.0000,  -0.0000] [FIXED]
	x745: [ -0.0000,  -0.0000] [FIXED]
	x746: [ -0.0000,  -0.0000] [FIXED]
	x747: [ -0.0000,  -0.0000] [FIXED]
	x748: [ -0.0000,  -0.0000] [FIXED]
	x749: [ -0.0000,  -0.0000] [FIXED]
	x750: [ -0.0000,  -0.0000] [FIXED]
	x751: [ -0.0000,  -0.0000] [FIXED]
	x752: [ -0.0000,  -0.0000] [FIXED]
	x753: [ -0.0000,  -0.0000] [FIXED]
	x754: [ -0.0000,  -0.0000] [FIXED]
	x755: [ -0.0000,  -0.0000] [FIXED]
	x756: [ -0.0000,  -0.0000] [FIXED]
	x757: [ -0.0000,  -0.0000] [FIXED]
	x758: [ -0.0000,  -0.0000] [FIXED]
	x759: [ -0.0000,  -0.0000] [FIXED]
	x760: [ -0.0000,  -0.0000] [FIXED]
	x761: [ -0.0000,  -0.0000] [FIXED]
	x762: [ -0.0000,  -0.0000] [FIXED]
	x763: [ -0.0000,  -0.0000] [FIXED]
	x764: [ -0.0000,  -0.0000] [FIXED]
	x765: [ -0.0000,  -0.0000] [FIXED]
	x766: [ -0.0000,  -0.0000] [FIXED]
	x767: [ -0.0000,  -0.0000] [FIXED]
	x768: [ -0.0000,  -0.0000] [FIXED]
	x769: [ -0.0000,  -0.0000] [FIXED]
	x770: [ -0.0000,  -0.0000] [FIXED]
	x771: [ -0.0000,  -0.0000] [FIXED]
	x772: [ -0.0000,   1.0000] 
	x773: [ -0.0000,  -0.0000] [FIXED]
	x774: [ -0.0000,  -0.0000] [FIXED]
	x775: [ -0.0000,  -0.0000] [FIXED]
	x776: [ -0.0000,  -0.0000] [FIXED]
	x777: [ -0.0000,  -0.0000] [FIXED]
	x778: [ -0.0000,  -0.0000] [FIXED]
	x779: [ -0.0000,  -0.0000] [FIXED]
	x780: [ -0.0000,  -0.0000] [FIXED]
	x781: [ -0.0000,  -0.0000] [FIXED]
	x782: [ -0.0000,  -0.0000] [FIXED]
	x783: [ -0.0000,  -0.0000] [FIXED]

Branching heuristics set to PseudoImpact

Engine::solve: Initial statistics

06:30:44 Statistics update:
	--- Time Statistics ---
	Total time elapsed: 7070 milli (00:00:07)
		Main loop: 0 milli (00:00:00)
		Preprocessing time: 284 milli (00:00:00)
		Unknown: 6785 milli (00:00:06)
	Breakdown for main loop:
		[0.00%] Simplex steps: 0 milli
		[0.00%] Explicit-basis bound tightening: 0 milli
		[0.00%] Constraint-matrix bound tightening: 0 milli
		[0.00%] Degradation checking: 0 milli
		[0.00%] Precision restoration: 0 milli
		[0.00%] Statistics handling: 0 milli
		[0.00%] Constraint-fixing steps: 0 milli
		[0.00%] Valid case splits: 0 milli. Average per split: 0.00 milli
		[0.00%] Applying stored bound-tightening: 0 milli
		[0.00%] SMT core: 0 milli
		[0.00%] Symbolic Bound Tightening: 24 milli
		[0.00%] SoI-based local search: 0 milli
		[0.00%] SoI-based local search: 0 milli
		[0.00%] Unaccounted for: 0 milli
	--- Preprocessor Statistics ---
	Number of preprocessor bound-tightening loop iterations: 5
	Number of eliminated variables: 966
	Number of constraints removed due to variable elimination: 160
	Number of equations removed due to variable elimination: 0
	--- Engine Statistics ---
	Number of main loop iterations: 1
		0 iterations were simplex steps. Total time: 0 milli. Average: 0.00 milli.
		0 iterations were constraint-fixing steps. Total time: 0 milli. Average: 0.00 milli
	Number of active piecewise-linear constraints: 150 / 261
		Constraints disabled by valid splits: 111. By SMT-originated splits: 0
	Last reported degradation: 0.0000000000. Max degradation so far: 0.0000000000. Restorations so far: 0
	Number of simplex pivots we attempted to skip because of instability: 0.
	Unstable pivots performed anyway: 0
	--- Tableau Statistics ---
	Total number of pivots performed: 0
		Real pivots: 0. Degenerate: 0 (0.00%)
		Degenerate pivots by request (e.g., to fix a PL constraint): 0 (0.00%)
		Average time per pivot: 0.00 milli
	Total number of fake pivots performed: 0
	Total number of rows added: 0. Number of merged columns: 0
	Current tableau dimensions: M = 830, N = 2704
	--- SMT Core Statistics ---
	Total depth is 0. Total visited states: 1. Number of splits: 0. Number of pops: 0
	Max stack depth: 0
	--- Bound Tightening Statistics ---
	Number of tightened bounds: 0.
		Number of rows examined by row tightener: 0. Consequent tightenings: 0
		Number of explicit basis matrices examined by row tightener: 0. Consequent tightenings: 0
		Number of bound tightening rounds on the entire constraint matrix: 0. Consequent tightenings: 0
		Number of bound notifications sent to PL constraints: 1580. Tightenings proposed: 0
	--- Basis Factorization statistics ---
	Number of basis refactorizations: 2
	--- Projected Steepest Edge Statistics ---
	Number of iterations: 0.
	Number of resets to reference space: 1. Avg. iterations per reset: 0
	--- SBT ---
	Number of tightened bounds: 707
	--- SoI-based local search ---
	Number of proposed phase pattern update: 0. Number of accepted update: 0 [0.00%]
	Total time (% of local search time) updating SoI phase pattern : 0 milli [0.00%]
	Total time obtaining current assignment: 0 milli [0.00%]
	Total time getting SoI phase pattern : 0 milli [0.00%]
	--- Context dependent statistics ---
	Number of pushes / pops: 0 / 0
		[0.00%] Pre-Push hook: 0 milli
		[0.00%] Push : 0 milli
		[0.00%] Post-Pop hook: 0 milli
		[0.00%] Pop : 0 milli
		[0.00%] Total context-switching time: 0 milli
	--- Proof Certificate ---
	Number of certified leaves: 0
	Number of leaves to delegate: 0

---

06:30:51 Statistics update:
	--- Time Statistics ---
	Total time elapsed: 14240 milli (00:00:14)
		Main loop: 7121 milli (00:00:07)
		Preprocessing time: 284 milli (00:00:00)
		Unknown: 6834 milli (00:00:06)
	Breakdown for main loop:
		[59.52%] Simplex steps: 4238 milli
		[16.99%] Explicit-basis bound tightening: 1209 milli
		[0.00%] Constraint-matrix bound tightening: 0 milli
		[0.66%] Degradation checking: 46 milli
		[0.00%] Precision restoration: 0 milli
		[0.27%] Statistics handling: 19 milli
		[0.00%] Constraint-fixing steps: 0 milli
		[0.03%] Valid case splits: 2 milli. Average per split: 0.00 milli
		[0.07%] Applying stored bound-tightening: 4 milli
		[1.21%] SMT core: 86 milli
		[16.17%] Symbolic Bound Tightening: 1151 milli
		[52.26%] SoI-based local search: 3721 milli
		[0.00%] SoI-based local search: 0 milli
		[5.08%] Unaccounted for: [runlim] sample:		20.21 time, 20.01 real, 160 MB, 1.03 load
[runlim] sample:		30.21 time, 30.01 real, 160 MB, 1.02 load
361 milli
	--- Preprocessor Statistics ---
	Number of preprocessor bound-tightening loop iterations: 5
	Number of eliminated variables: 966
	Number of constraints removed due to variable elimination: 160
	Number of equations removed due to variable elimination: 0
	--- Engine Statistics ---
	Number of main loop iterations: 10000
		9850 iterations were simplex steps. Total time: 4238 milli. Average: 0.43 milli.
		0 iterations were constraint-fixing steps. Total time: 0 milli. Average: 0.00 milli
	Number of active piecewise-linear constraints: 92 / 261
		Constraints disabled by valid splits: 122. By SMT-originated splits: 47
	Last reported degradation: 0.0000000000. Max degradation so far: 0.0000000049. Restorations so far: 0
	Number of simplex pivots we attempted to skip because of instability: 37.
	Unstable pivots performed anyway: 2
	--- Tableau Statistics ---
	Total number of pivots performed: 8199
		Real pivots: 8191. Degenerate: 8 (0.10%)
		Degenerate pivots by request (e.g., to fix a PL constraint): 0 (0.00%)
		Average time per pivot: 0.15 milli
	Total number of fake pivots performed: 276
	Total number of rows added: 0. Number of merged columns: 0
	Current tableau dimensions: M = 830, N = 2704
	--- SMT Core Statistics ---
	Total depth is 47. Total visited states: 80. Number of splits: 62. Number of pops: 17
	Max stack depth: 49
	--- Bound Tightening Statistics ---
	Number of tightened bounds: 6948.
		Number of rows examined by row tightener: 8199. Consequent tightenings: 62
		Number of explicit basis matrices examined by row tightener: 20. Consequent tightenings: 270
		Number of bound tightening rounds on the entire constraint matrix: 0. Consequent tightenings: 0
		Number of bound notifications sent to PL constraints: 12740. Tightenings proposed: 0
	--- Basis Factorization statistics ---
	Number of basis refactorizations: 76
	--- Projected Steepest Edge Statistics ---
	Number of iterations: 8510.
	Number of resets to reference space: 26. Avg. iterations per reset: 327
	--- SBT ---
	Number of tightened bounds: 7655
	--- SoI-based local search ---
	Number of proposed phase pattern update: 625. Number of accepted update: 572 [91.52%]
	Total time (% of local search time) updating SoI phase pattern : 36363 milli [0.98%]
	Total time obtaining current assignment: 216194 milli [5.81%]
	Total time getting SoI phase pattern : 31592 milli [0.44%]
	--- Context dependent statistics ---
	Number of pushes / pops: 79 / 32
		[0.13%] Pre-Push hook: 9 milli
		[0.00%] Push : 0 milli
		[0.04%] Post-Pop hook: 3 milli
		[0.04%] Pop : 3 milli
		[0.22%] Total context-switching time: 15 milli
	--- Proof Certificate ---
	Number of certified leaves: 0
	Number of leaves to delegate: 0

06:31:01 Statistics update:
	--- Time Statistics ---
	Total time elapsed: 24471 milli (00:00:24)
		Main loop: 17399 milli (00:00:17)
		Preprocessing time: 284 milli (00:00:00)
		Unknown: 6787 milli (00:00:06)
	Breakdown for main loop:
		[48.64%] Simplex steps: 8462 milli
		[21.11%] Explicit-basis bound tightening: 3672 milli
		[0.00%] Constraint-matrix bound tightening: 0 milli
		[0.55%] Degradation checking: 95 milli
		[0.00%] Precision restoration: 0 milli
		[0.23%] Statistics handling: 39 milli
		[0.00%] Constraint-fixing steps: 0 milli
		[0.04%] Valid case splits: 6 milli. Average per split: 0.00 milli
		[0.05%] Applying stored bound-tightening: 9 milli
		[2.54%] SMT core: 441 milli
		[20.47%] Symbolic Bound Tightening: 3561 milli
		[40.62%] SoI-based local search: 7066 milli
		[0.00%] SoI-based local search: 0 milli
		[6.39%] Unaccounted for: 1111 milli
	--- Preprocessor Statistics ---
	Number of preprocessor bound-tightening loop iterations: 5
	Number of eliminated variables: 966
	Number of constraints removed due to variable elimination: 160
	Number of equations removed due to variable elimination: 0
	--- Engine Statistics ---
	Number of main loop iterations: 20000
		19646 iterations were simplex steps. Total time: 8462 milli. Average: 0.43 milli.
		0 iterations were constraint-fixing steps. Total time: 0 milli. Average: 0.00 milli
	Number of active piecewise-linear constraints: 100 / 261
		Constraints disabled by valid splits: 128. By SMT-originated splits: 33
	Last reported degradation: 0.0000000000. Max degradation so far: 0.0000000049. Restorations so far: 0
	Number of simplex pivots we attempted to skip because of instability: 44.
	Unstable pivots performed anyway: 2
	--- Tableau Statistics ---
	Total number of pivots performed: 15997
		Real pivots: 15974. Degenerate: 23 (0.14%)
		Degenerate pivots by request (e.g., to fix a PL constraint): 0 (0.00%)
		Average time per pivot: 0.14 milli
	Total number of fake pivots performed: 585
	Total number of rows added: 0. Number of merged columns: 0
	Current tableau dimensions: M = 830, N = 2704
	--- SMT Core Statistics ---
	Total depth is 33. Total visited states: 229. Number of splits: 130. Number of pops: 98
	Max stack depth: 50
	--- Bound Tightening Statistics ---
	Number of tightened bounds: 28787.
		Number of rows examined by row tightener: 15997. Consequent tightenings: 403
		Number of explicit basis matrices examined by row tightener: 63. Consequent tightenings: 1146
		Number of bound tightening rounds on the entire constraint matrix: 0. Consequent tightenings: 0
		Number of bound notifications sent to PL constraints: 43021. Tightenings proposed: 0
	--- Basis Factorization statistics ---
	Number of basis refactorizations: 144
	--- Projected Steepest Edge Statistics ---
	Number of iterations: 16624.
	Number of resets to reference space: 109. Avg. iterations per reset: 152
	--- SBT ---
	Number of tightened bounds: 29494
	--- SoI-based local search ---
	Number of proposed phase pattern update: 1409. Number of accepted update: 1288 [91.41%]
	Total time (% of local search time) updating SoI phase pattern : 74335 milli [1.05%]
	Total time obtaining current assignment: 508988 milli [7.20%]
	Total time getting SoI phase pattern : 64202 milli [0.37%]
	--- Context dependent statistics ---
	Number of pushes / pops: 228 / 195
		[0.13%] Pre-Push hook: 21 milli
		[0.00%] Push : 0 milli
		[0.10%] Post-Pop hook: 17 milli
		[0.11%] Pop : 19 milli
		[0.34%] Total context-switching time: 59 milli
	--- Proof Certificate ---
	Number of certified leaves: 0
	Number of leaves to delegate: 0

06:31:10 Statistics update:
	--- Time Statistics ---
	Total time elapsed: 33176 milli (00:00:33)
		Main loop: 26034 milli (00:00:26)
		Preprocessing time: 284 milli (00:00:00)
		Unknown: 6857 milli (00:00:06)
	Breakdown for main loop:
		[49.26%] Simplex steps: 12825 milli
		[19.63%] Explicit-basis bound tightening: 5111 milli
		[0.00%] Constraint-matrix bound tightening: 0 milli
		[0.55%] Degradation checking: 144 milli
		[0.00%] Precision restoration: 0 milli
		[0.23%] Statistics handling: 59 milli
		[0.00%] Constraint-fixing steps: 0 milli
		[0.04%] Valid case splits: 9 milli. Average per split: 0.00 milli
		[0.05%] Applying stored bound-tightening: 13 milli
		[2.82%] SMT core: 732 milli
		[21.26%] Symbolic Bound Tightening: 5535 milli
		[41.15%] SoI-based local search: 10712 milli
		[0.00%] SoI-based local search: 0 milli
		[6.16%] Unaccounted for: 1602 milli
	--- Preprocessor Statistics ---
	Number of preprocessor bound-tightening loop iterations: 5
	Number of eliminated variables: 966
	Number of constraints removed due to variable elimination: 160
	Number of equations removed due to variable elimination: 0
	--- Engine Statistics ---
	Number of main loop iterations: 30000
		29467 iterations were simplex steps. Total time: 12825 milli. Average: 0.44 milli.
		0 iterations were constraint-fixing steps. Total time: 0 milli. Average: 0.00 milli
	Number of active piecewise-linear constraints: 113 / 261
		Constraints disabled by valid splits: 122. By SMT-originated splits: 26
	Last reported degradation: 0.0000000000. Max degradation so far: 0.0000000049. Restorations so far: 0
	Number of simplex pivots we attempted to skip because of instability: 44.
	Unstable pivots performed anyway: 2
	--- Tableau Statistics ---
	Total number of pivots performed: 23959
		Real pivots: 23921. Degenerate: 38 (0.16%)
		Degenerate pivots by request (e.g., to fix a PL constraint):[runlim] sample:		40.21 time, 40.01 real, 160 MB, 1.02 load
[runlim] sample:		50.20 time, 50.01 real, 160 MB, 1.02 load
 0 (0.00%)
		Average time per pivot: 0.15 milli
	Total number of fake pivots performed: 890
	Total number of rows added: 0. Number of merged columns: 0
	Current tableau dimensions: M = 830, N = 2704
	--- SMT Core Statistics ---
	Total depth is 26. Total visited states: 354. Number of splits: 189. Number of pops: 164
	Max stack depth: 50
	--- Bound Tightening Statistics ---
	Number of tightened bounds: 44384.
		Number of rows examined by row tightener: 23959. Consequent tightenings: 852
		Number of explicit basis matrices examined by row tightener: 88. Consequent tightenings: 1521
		Number of bound tightening rounds on the entire constraint matrix: 0. Consequent tightenings: 0
		Number of bound notifications sent to PL constraints: 61940. Tightenings proposed: 0
	--- Basis Factorization statistics ---
	Number of basis refactorizations: 213
	--- Projected Steepest Edge Statistics ---
	Number of iterations: 24891.
	Number of resets to reference space: 176. Avg. iterations per reset: 141
	--- SBT ---
	Number of tightened bounds: 42975
	--- SoI-based local search ---
	Number of proposed phase pattern update: 2138. Number of accepted update: 1957 [91.53%]
	Total time (% of local search time) updating SoI phase pattern : 108468 milli [1.01%]
	Total time obtaining current assignment: 782573 milli [7.31%]
	Total time getting SoI phase pattern : 100924 milli [0.39%]
	--- Context dependent statistics ---
	Number of pushes / pops: 353 / 327
		[0.12%] Pre-Push hook: 32 milli
		[0.00%] Push : 0 milli
		[0.12%] Post-Pop hook: 30 milli
		[0.13%] Pop : 33 milli
		[0.37%] Total context-switching time: 95 milli
	--- Proof Certificate ---
	Number of certified leaves: 0
	Number of leaves to delegate: 0

06:31:19 Statistics update:
	--- Time Statistics ---
	Total time elapsed: 42566 milli (00:00:42)
		Main loop: 35492 milli (00:00:35)
		Preprocessing time: 284 milli (00:00:00)
		Unknown: 6789 milli (00:00:06)
	Breakdown for main loop:
		[48.61%] Simplex steps: 17251 milli
		[17.88%] Explicit-basis bound tightening: 6345 milli
		[0.00%] Constraint-matrix bound tightening: 0 milli
		[0.55%] Degradation checking: 194 milli
		[0.00%] Precision restoration: 0 milli
		[0.22%] Statistics handling: 79 milli
		[0.00%] Constraint-fixing steps: 0 milli
		[0.04%] Valid case splits: 13 milli. Average per split: 0.00 milli
		[0.05%] Applying stored bound-tightening: 19 milli
		[3.06%] SMT core: 1087 milli
		[22.89%] Symbolic Bound Tightening: 8122 milli
		[40.89%] SoI-based local search: 14514 milli
		[0.00%] SoI-based local search: 0 milli
		[6.70%] Unaccounted for: 2379 milli
	--- Preprocessor Statistics ---
	Number of preprocessor bound-tightening loop iterations: 5
	Number of eliminated variables: 966
	Number of constraints removed due to variable elimination: 160
	Number of equations removed due to variable elimination: 0
	--- Engine Statistics ---
	Number of main loop iterations: 40000
		39232 iterations were simplex steps. Total time: 17251 milli. Average: 0.44 milli.
		0 iterations were constraint-fixing steps. Total time: 0 milli. Average: 0.00 milli
	Number of active piecewise-linear constraints: 111 / 261
		Constraints disabled by valid splits: 122. By SMT-originated splits: 28
	Last reported degradation: 0.0000000000. Max degradation so far: 0.0000000049. Restorations so far: 0
	Number of simplex pivots we attempted to skip because of instability: 44.
	Unstable pivots performed anyway: 2
	--- Tableau Statistics ---
	Total number of pivots performed: 31607
		Real pivots: 31556. Degenerate: 51 (0.16%)
		Degenerate pivots by request (e.g., to fix a PL constraint): 0 (0.00%)
		Average time per pivot: 0.15 milli
	Total number of fake pivots performed: 1117
	Total number of rows added: 0. Number of merged columns: 0
	Current tableau dimensions: M = 830, N = 2704
	--- SMT Core Statistics ---
	Total depth is 28. Total visited states: 513. Number of splits: 269. Number of pops: 243
	Max stack depth: 50
	--- Bound Tightening Statistics ---
	Number of tightened bounds: 63225.
		Number of rows examined by row tightener: 31607. Consequent tightenings: 1009
		Number of explicit basis matrices examined by row tightener: 110. Consequent tightenings: 2543
		Number of bound tightening rounds on the entire constraint matrix: 0. Consequent tightenings: 0
		Number of bound notifications sent to PL constraints: 85791. Tightenings proposed: 0
	--- Basis Factorization statistics ---
	Number of basis refactorizations: 278
	--- Projected Steepest Edge Statistics ---
	Number of iterations: 32766.
	Number of resets to reference space: 257. Avg. iterations per reset: 127
	--- SBT ---
	Number of tightened bounds: 59708
	--- SoI-based local search ---
	Number of proposed phase pattern update: 3026. Number of accepted update: 2766 [91.41%]
	Total time (% of local search time) updating SoI phase pattern : 152981 milli [1.05%]
	Total time obtaining current assignment: 1124571 milli [7.75%]
	Total time getting SoI phase pattern : 144627 milli [0.41%]
	--- Context dependent statistics ---
	Number of pushes / pops: 512 / 484
		[0.13%] Pre-Push hook: 46 milli
		[0.00%] Push : 0 milli
		[0.13%] Post-Pop hook: 46 milli
		[0.14%] Pop : 49 milli
		[0.40%] Total context-switching time: 142 milli
	--- Proof Certificate ---
	Number of certified leaves: 0
	Number of leaves to delegate: 0

06:31:27 Statistics update:
	--- Time Statistics ---
	Total time elapsed: 50293 milli (00:00:50)
		Main loop: 43216 milli (00:00:43)
		Preprocessing time: 284 milli (00:00:00)
		Unknown: 6791 milli (00:00:06)
	Breakdown for main loop:
		[48.76%] Simplex steps: 21071 milli
		[16.38%] Explicit-basis bound tightening: 7076 milli
		[0.00%] Constraint-matrix bound tightening: 0 milli
		[0.56%] Degradation checking: 243 milli
		[0.00%] Precision restoration: 0 milli
		[0.23%] Statistics handling: 98 milli
		[0.00%] Constraint-fixing steps: 0 milli
		[0.04%] Valid case splits: 16 milli. Average per split: 0.00 milli
		[0.06%] Applying stored bound-tightening: 23 milli
		[3.26%] SMT core: 1406 milli
		[24.10%] Symbolic Bound Tightening: 10413 milli
		[39.20%] SoI-based local search: 16942 milli
		[0.00%] SoI-based local search: 0 milli
		[6.63%] Unaccounted for: 2864 milli
	--- Preprocessor Statistics ---
	Number of preprocessor bound-tightening loop iterations: 5
	Number of eliminated variables: 966
	Number of constraints removed due to variable elimination: 160
	Number of equations removed due to variable elimination: 0
	--- Engine Statistics ---
	Number of main loop iterations: 50000
		49033 iterations were simplex steps. Total time: 21071 milli. Average: 0.43 milli.
		0 iterations were constraint-fixing steps. Total time: 0 milli. Average: 0.00 milli
	Number of active piecewise-linear constraints: 118 / 261
		Constraints disabled by valid splits: 121. By SMT-originated splits: 22
	Last reported degradation: 0.0000299750. Max degradation so far: 0.0000299750. Restorations so far: 0
	Number of simplex pivots we attempted to skip because of instability: 69.
	Unstable pivots performed anyway: 7
	--- Tableau Statistics ---
	Total number of pivots performed: 39623
		Real pivots: 39564. Degenerate: 59 (0.15%)
		Degenerate pivots by request (e.g., to fix a PL constraint): 0 (0.00%)
		Average time per pivot: 0.14 milli
	Total number of fake pivots performed: 1459
	Total number of rows added: 0. Number of merged columns: 0
	Current tableau dimensions: M = 830, N = 2704
	--- SMT Core Statistics ---
	Total depth is 22. Total visited states: 649. Number of splits: 334. Number of pops: 314
	Max stack depth: 50
	--- Bound Tightening Statistics ---
	Number of tightened bounds: 81715.
		Number of rows examined by row tightener: 39623. Consequent tightenings: 1220
		Number of explicit basis matrices examined by row tightener: 123. Consequent tightenings: 2816
		Number of bound tightening rounds on the entire constraint matrix: 0. Consequent tightenings: 0
		Number of bound notifications sent to PL constraints: 106947. Tightenings proposed: 0
	--- Basis Factorization statistics ---
	Number of basis refactorizations: 325
	--- Projected Steepest Edge Statistics ---
	Number of iterations: 41144.
	Number of resets to reference space: 331. Avg. ite[runlim] sample:		60.21 time, 60.01 real, 160 MB, 1.01 load
[runlim] sample:		70.21 time, 70.01 real, 160 MB, 1.01 load
rations per reset: 124
	--- SBT ---
	Number of tightened bounds: 78198
	--- SoI-based local search ---
	Number of proposed phase pattern update: 3690. Number of accepted update: 3365 [91.19%]
	Total time (% of local search time) updating SoI phase pattern : 189495 milli [1.12%]
	Total time obtaining current assignment: 1376955 milli [8.13%]
	Total time getting SoI phase pattern : 178510 milli [0.41%]
	--- Context dependent statistics ---
	Number of pushes / pops: 648 / 626
		[0.14%] Pre-Push hook: 58 milli
		[0.00%] Push : 0 milli
		[0.14%] Post-Pop hook: 61 milli
		[0.15%] Pop : 64 milli
		[0.43%] Total context-switching time: 184 milli
	--- Proof Certificate ---
	Number of certified leaves: 0
	Number of leaves to delegate: 0
Performing precision restoration. Degradation before: 0.000087212103332. After: 0.000000000000092

06:31:32 Statistics update:
	--- Time Statistics ---
	Total time elapsed: 55116 milli (00:00:55)
		Main loop: 47931 milli (00:00:47)
		Preprocessing time: 284 milli (00:00:00)
		Unknown: 6900 milli (00:00:06)
	Breakdown for main loop:
		[52.07%] Simplex steps: 24958 milli
		[15.42%] Explicit-basis bound tightening: 7392 milli
		[0.00%] Constraint-matrix bound tightening: 0 milli
		[0.61%] Degradation checking: 290 milli
		[0.06%] Precision restoration: 27 milli
		[0.25%] Statistics handling: 117 milli
		[0.00%] Constraint-fixing steps: 0 milli
		[0.04%] Valid case splits: 17 milli. Average per split: 0.00 milli
		[0.05%] Applying stored bound-tightening: 24 milli
		[3.02%] SMT core: 1448 milli
		[22.51%] Symbolic Bound Tightening: 10787 milli
		[37.66%] SoI-based local search: 18050 milli
		[0.00%] SoI-based local search: 0 milli
		[5.98%] Unaccounted for: 2867 milli
	--- Preprocessor Statistics ---
	Number of preprocessor bound-tightening loop iterations: 5
	Number of eliminated variables: 966
	Number of constraints removed due to variable elimination: 160
	Number of equations removed due to variable elimination: 0
	--- Engine Statistics ---
	Number of main loop iterations: 60000
		58999 iterations were simplex steps. Total time: 24958 milli. Average: 0.42 milli.
		0 iterations were constraint-fixing steps. Total time: 0 milli. Average: 0.00 milli
	Number of active piecewise-linear constraints: 113 / 261
		Constraints disabled by valid splits: 124. By SMT-originated splits: 24
	Last reported degradation: 0.0000000000. Max degradation so far: 0.0000871040. Restorations so far: 1
	Number of simplex pivots we attempted to skip because of instability: 74.
	Unstable pivots performed anyway: 7
	--- Tableau Statistics ---
	Total number of pivots performed: 49148
		Real pivots: 49088. Degenerate: 60 (0.12%)
		Degenerate pivots by request (e.g., to fix a PL constraint): 0 (0.00%)
		Average time per pivot: 0.12 milli
	Total number of fake pivots performed: 1547
	Total number of rows added: 0. Number of merged columns: 0
	Current tableau dimensions: M = 830, N = 2704
	--- SMT Core Statistics ---
	Total depth is 24. Total visited states: 670. Number of splits: 346. Number of pops: 323
	Max stack depth: 50
	--- Bound Tightening Statistics ---
	Number of tightened bounds: 84305.
		Number of rows examined by row tightener: 49148. Consequent tightenings: 1230
		Number of explicit basis matrices examined by row tightener: 127. Consequent tightenings: 2946
		Number of bound tightening rounds on the entire constraint matrix: 0. Consequent tightenings: 0
		Number of bound notifications sent to PL constraints: 110442. Tightenings proposed: 0
	--- Basis Factorization statistics ---
	Number of basis refactorizations: 345
	--- Projected Steepest Edge Statistics ---
	Number of iterations: 50762.
	Number of resets to reference space: 350. Avg. iterations per reset: 145
	--- SBT ---
	Number of tightened bounds: 80788
	--- SoI-based local search ---
	Number of proposed phase pattern update: 3855. Number of accepted update: 3517 [91.23%]
	Total time (% of local search time) updating SoI phase pattern : 196721 milli [1.09%]
	Total time obtaining current assignment: 1438932 milli [7.97%]
	Total time getting SoI phase pattern : 187271 milli [0.39%]
	--- Context dependent statistics ---
	Number of pushes / pops: 669 / 645
		[0.13%] Pre-Push hook: 60 milli
		[0.00%] Push : 0 milli
		[0.13%] Post-Pop hook: 63 milli
		[0.14%] Pop : 66 milli
		[0.40%] Total context-switching time: 190 milli
	--- Proof Certificate ---
	Number of certified leaves: 0
	Number of leaves to delegate: 0

06:31:42 Statistics update:
	--- Time Statistics ---
	Total time elapsed: 65229 milli (00:01:05)
		Main loop: 58064 milli (00:00:58)
		Preprocessing time: 284 milli (00:00:00)
		Unknown: 6880 milli (00:00:06)
	Breakdown for main loop:
		[51.57%] Simplex steps: 29944 milli
		[15.62%] Explicit-basis bound tightening: 9070 milli
		[0.00%] Constraint-matrix bound tightening: 0 milli
		[0.59%] Degradation checking: 339 milli
		[0.05%] Precision restoration: 27 milli
		[0.24%] Statistics handling: 138 milli
		[0.00%] Constraint-fixing steps: 0 milli
		[0.04%] Valid case splits: 21 milli. Average per split: 0.00 milli
		[0.05%] Applying stored bound-tightening: 29 milli
		[3.11%] SMT core: 1804 milli
		[22.64%] Symbolic Bound Tightening: 13145 milli
		[38.81%] SoI-based local search: 22534 milli
		[0.00%] SoI-based local search: 0 milli
		[6.10%] Unaccounted for: 3541 milli
	--- Preprocessor Statistics ---
	Number of preprocessor bound-tightening loop iterations: 5
	Number of eliminated variables: 966
	Number of constraints removed due to variable elimination: 160
	Number of equations removed due to variable elimination: 0
	--- Engine Statistics ---
	Number of main loop iterations: 70000
		68770 iterations were simplex steps. Total time: 29944 milli. Average: 0.44 milli.
		0 iterations were constraint-fixing steps. Total time: 0 milli. Average: 0.00 milli
	Number of active piecewise-linear constraints: 122 / 261
		Constraints disabled by valid splits: 121. By SMT-originated splits: 18
	Last reported degradation: 0.0000000000. Max degradation so far: 0.0000871040. Restorations so far: 1
	Number of simplex pivots we attempted to skip because of instability: 116.
	Unstable pivots performed anyway: 10
	--- Tableau Statistics ---
	Total number of pivots performed: 56890
		Real pivots: 56801. Degenerate: 89 (0.16%)
		Degenerate pivots by request (e.g., to fix a PL constraint): 0 (0.00%)
		Average time per pivot: 0.12 milli
	Total number of fake pivots performed: 1809
	Total number of rows added: 0. Number of merged columns: 0
	Current tableau dimensions: M = 830, N = 2704
	--- SMT Core Statistics ---
	Total depth is 18. Total visited states: 822. Number of splits: 419. Number of pops: 402
	Max stack depth: 50
	--- Bound Tightening Statistics ---
	Number of tightened bounds: 110047.
		Number of rows examined by row tightener: 56890. Consequent tightenings: 1428
		Number of explicit basis matrices examined by row tightener: 148. Consequent tightenings: 4113
		Number of bound tightening rounds on the entire constraint matrix: 0. Consequent tightenings: 0
		Number of bound notifications sent to PL constraints: 137017. Tightenings proposed: 0
	--- Basis Factorization statistics ---
	Number of basis refactorizations: 414
	--- Projected Steepest Edge Statistics ---
	Number of iterations: 58805.
	Number of resets to reference space: 431. Avg. iterations per reset: 136
	--- SBT ---
	Number of tightened bounds: 102389
	--- SoI-based local search ---
	Number of proposed phase pattern update: 4681. Number of accepted update: 4270 [91.22%]
	Total time (% of local search time) updating SoI phase pattern : 239727 milli [1.06%]
	Total time obtaining current assignment: 1759614 milli [7.81%]
	Total time getting SoI phase pattern : 229221 milli [0.39%]
	--- Context dependent statistics ---
	Number of pushes / pops: 821 / 803
		[0.13%] Pre-Push hook: 74 milli
		[0.00%] Push : 0 milli
		[0.14%] Post-Pop hook: 80 milli
		[0.14%] Pop : 83 milli
		[0.41%] Total context-switching time: 238 milli
	--- Proof Certificate ---
	Number of certified leaves: 0
	Number of leaves to delegate: 0

06:31:53 Statistics update:
	--- Time Statistics ---
	Total time elapsed: 76461 milli (00:01:16)
		Main loop: 69360 milli (00:01[runlim] sample:		80.21 time, 80.01 real, 160 MB, 1.01 load
[runlim] sample:		90.20 time, 90.01 real, 160 MB, 1.01 load
:09)
		Preprocessing time: 284 milli (00:00:00)
		Unknown: 6816 milli (00:00:06)
	Breakdown for main loop:
		[50.60%] Simplex steps: 35093 milli
		[17.25%] Explicit-basis bound tightening: 11961 milli
		[0.00%] Constraint-matrix bound tightening: 0 milli
		[0.56%] Degradation checking: 390 milli
		[0.04%] Precision restoration: 27 milli
		[0.23%] Statistics handling: 158 milli
		[0.00%] Constraint-fixing steps: 0 milli
		[0.04%] Valid case splits: 25 milli. Average per split: 0.00 milli
		[0.05%] Applying stored bound-tightening: 35 milli
		[2.97%] SMT core: 2061 milli
		[21.92%] Symbolic Bound Tightening: 15205 milli
		[37.67%] SoI-based local search: 26125 milli
		[0.00%] SoI-based local search: 0 milli
		[6.35%] Unaccounted for: 4400 milli
	--- Preprocessor Statistics ---
	Number of preprocessor bound-tightening loop iterations: 5
	Number of eliminated variables: 966
	Number of constraints removed due to variable elimination: 160
	Number of equations removed due to variable elimination: 0
	--- Engine Statistics ---
	Number of main loop iterations: 80000
		78568 iterations were simplex steps. Total time: 35093 milli. Average: 0.45 milli.
		0 iterations were constraint-fixing steps. Total time: 0 milli. Average: 0.00 milli
	Number of active piecewise-linear constraints: 103 / 261
		Constraints disabled by valid splits: 125. By SMT-originated splits: 33
	Last reported degradation: 0.0000000000. Max degradation so far: 0.0000871040. Restorations so far: 1
	Number of simplex pivots we attempted to skip because of instability: 123.
	Unstable pivots performed anyway: 11
	--- Tableau Statistics ---
	Total number of pivots performed: 64782
		Real pivots: 64681. Degenerate: 101 (0.16%)
		Degenerate pivots by request (e.g., to fix a PL constraint): 0 (0.00%)
		Average time per pivot: 0.13 milli
	Total number of fake pivots performed: 2141
	Total number of rows added: 0. Number of merged columns: 0
	Current tableau dimensions: M = 830, N = 2704
	--- SMT Core Statistics ---
	Total depth is 33. Total visited states: 950. Number of splits: 490. Number of pops: 459
	Max stack depth: 50
	--- Bound Tightening Statistics ---
	Number of tightened bounds: 136002.
		Number of rows examined by row tightener: 64782. Consequent tightenings: 1915
		Number of explicit basis matrices examined by row tightener: 188. Consequent tightenings: 4824
		Number of bound tightening rounds on the entire constraint matrix: 0. Consequent tightenings: 0
		Number of bound notifications sent to PL constraints: 167269. Tightenings proposed: 0
	--- Basis Factorization statistics ---
	Number of basis refactorizations: 483
	--- Projected Steepest Edge Statistics ---
	Number of iterations: 67035.
	Number of resets to reference space: 490. Avg. iterations per reset: 136
	--- SBT ---
	Number of tightened bounds: 128344
	--- SoI-based local search ---
	Number of proposed phase pattern update: 5422. Number of accepted update: 4940 [91.11%]
	Total time (% of local search time) updating SoI phase pattern : 281220 milli [1.08%]
	Total time obtaining current assignment: 2047593 milli [7.84%]
	Total time getting SoI phase pattern : 266944 milli [0.38%]
	--- Context dependent statistics ---
	Number of pushes / pops: 949 / 916
		[0.12%] Pre-Push hook: 85 milli
		[0.00%] Push : 0 milli
		[0.13%] Post-Pop hook: 91 milli
		[0.14%] Pop : 95 milli
		[0.39%] Total context-switching time: 272 milli
	--- Proof Certificate ---
	Number of certified leaves: 0
	Number of leaves to delegate: 0

06:32:05 Statistics update:
	--- Time Statistics ---
	Total time elapsed: 87627 milli (00:01:27)
		Main loop: 80539 milli (00:01:20)
		Preprocessing time: 284 milli (00:00:00)
		Unknown: 6804 milli (00:00:06)
	Breakdown for main loop:
		[49.54%] Simplex steps: 39900 milli
		[17.73%] Explicit-basis bound tightening: 14278 milli
		[0.00%] Constraint-matrix bound tightening: 0 milli
		[0.55%] Degradation checking: 440 milli
		[0.03%] Precision restoration: 27 milli
		[0.22%] Statistics handling: 178 milli
		[0.00%] Constraint-fixing steps: 0 milli
		[0.04%] Valid case splits: 30 milli. Average per split: 0.00 milli
		[0.05%] Applying stored bound-tightening: 42 milli
		[3.08%] SMT core: 2483 milli
		[22.33%] Symbolic Bound Tightening: 17984 milli
		[37.06%] SoI-based local search: 29845 milli
		[0.00%] SoI-based local search: 0 milli
		[6.42%] Unaccounted for: 5173 milli
	--- Preprocessor Statistics ---
	Number of preprocessor bound-tightening loop iterations: 5
	Number of eliminated variables: 966
	Number of constraints removed due to variable elimination: 160
	Number of equations removed due to variable elimination: 0
	--- Engine Statistics ---
	Number of main loop iterations: 90000
		88312 iterations were simplex steps. Total time: 39900 milli. Average: 0.45 milli.
		0 iterations were constraint-fixing steps. Total time: 0 milli. Average: 0.00 milli
	Number of active piecewise-linear constraints: 110 / 261
		Constraints disabled by valid splits: 125. By SMT-originated splits: 26
	Last reported degradation: 0.0000000000. Max degradation so far: 0.0000871040. Restorations so far: 1
	Number of simplex pivots we attempted to skip because of instability: 123.
	Unstable pivots performed anyway: 11
	--- Tableau Statistics ---
	Total number of pivots performed: 71956
		Real pivots: 71841. Degenerate: 115 (0.16%)
		Degenerate pivots by request (e.g., to fix a PL constraint): 0 (0.00%)
		Average time per pivot: 0.13 milli
	Total number of fake pivots performed: 2634
	Total number of rows added: 0. Number of merged columns: 0
	Current tableau dimensions: M = 830, N = 2704
	--- SMT Core Statistics ---
	Total depth is 26. Total visited states: 1132. Number of splits: 578. Number of pops: 553
	Max stack depth: 50
	--- Bound Tightening Statistics ---
	Number of tightened bounds: 160953.
		Number of rows examined by row tightener: 71956. Consequent tightenings: 2237
		Number of explicit basis matrices examined by row tightener: 218. Consequent tightenings: 5581
		Number of bound tightening rounds on the entire constraint matrix: 0. Consequent tightenings: 0
		Number of bound notifications sent to PL constraints: 197561. Tightenings proposed: 0
	--- Basis Factorization statistics ---
	Number of basis refactorizations: 541
	--- Projected Steepest Edge Statistics ---
	Number of iterations: 74702.
	Number of resets to reference space: 585. Avg. iterations per reset: 127
	--- SBT ---
	Number of tightened bounds: 151225
	--- SoI-based local search ---
	Number of proposed phase pattern update: 6385. Number of accepted update: 5815 [91.07%]
	Total time (% of local search time) updating SoI phase pattern : 331300 milli [1.11%]
	Total time obtaining current assignment: 2430163 milli [8.14%]
	Total time getting SoI phase pattern : 316047 milli [0.39%]
	--- Context dependent statistics ---
	Number of pushes / pops: 1131 / 1105
		[0.13%] Pre-Push hook: 102 milli
		[0.00%] Push : 0 milli
		[0.14%] Post-Pop hook: 108 milli
		[0.14%] Pop : 114 milli
		[0.40%] Total context-switching time: 325 milli
	--- Proof Certificate ---
	Number of certified leaves: 0
	Number of leaves to delegate: 0

06:32:16 Statistics update:
	--- Time Statistics ---
	Total time elapsed: 99264 milli (00:01:39)
		Main loop: 92143 milli (00:01:32)
		Preprocessing time: 284 milli (00:00:00)
		Unknown: 6836 milli (00:00:06)
	Breakdown for main loop:
		[48.60%] Simplex steps: 44785 milli
		[18.32%] Explicit-basis bound tightening: 16876 milli
		[0.00%] Constraint-matrix bound tightening: 0 milli
		[0.53%] Degradation checking: 490 milli
		[0.03%] Precision restoration: 27 milli
		[0.22%] Statistics handling: 198 milli
		[0.00%] Constraint-fixing steps: 0 milli
		[0.04%] Valid case splits: 35 milli. Average per split: 0.00 milli
		[0.05%] Applying stored bound-tightening: 48 milli
		[3.14%] SMT core: 2894 milli
		[22.65%] Symbolic Bound Tightening: 20868 milli
		[36.19%] SoI-based local search: 33346 milli
		[0.00%] SoI-based local search: 0 milli
		[6.42%] Unaccounted for: 5918 milli
	--- Preprocessor Statistics ---
	Number of preprocessor bound-tightening loop iterations: 5
	Number of eliminated variables: 966
	Number of constraints removed due to variable elimination: 160
	Nu[runlim] sample:		100.21 time, 100.01 real, 160 MB, 1.00 load
[runlim] sample:		110.20 time, 110.01 real, 160 MB, 1.08 load
mber of equations removed due to variable elimination: 0
	--- Engine Statistics ---
	Number of main loop iterations: 100000
		98077 iterations were simplex steps. Total time: 44785 milli. Average: 0.46 milli.
		0 iterations were constraint-fixing steps. Total time: 0 milli. Average: 0.00 milli
	Number of active piecewise-linear constraints: 112 / 261
		Constraints disabled by valid splits: 130. By SMT-originated splits: 19
	Last reported degradation: 0.0000000000. Max degradation so far: 0.0000871040. Restorations so far: 1
	Number of simplex pivots we attempted to skip because of instability: 141.
	Unstable pivots performed anyway: 12
	--- Tableau Statistics ---
	Total number of pivots performed: 79445
		Real pivots: 79312. Degenerate: 133 (0.17%)
		Degenerate pivots by request (e.g., to fix a PL constraint): 0 (0.00%)
		Average time per pivot: 0.13 milli
	Total number of fake pivots performed: 3008
	Total number of rows added: 0. Number of merged columns: 0
	Current tableau dimensions: M = 830, N = 2704
	--- SMT Core Statistics ---
	Total depth is 19. Total visited states: 1310. Number of splits: 663. Number of pops: 646
	Max stack depth: 50
	--- Bound Tightening Statistics ---
	Number of tightened bounds: 187376.
		Number of rows examined by row tightener: 79445. Consequent tightenings: 3007
		Number of explicit basis matrices examined by row tightener: 252. Consequent tightenings: 7047
		Number of bound tightening rounds on the entire constraint matrix: 0. Consequent tightenings: 0
		Number of bound notifications sent to PL constraints: 231021. Tightenings proposed: 0
	--- Basis Factorization statistics ---
	Number of basis refactorizations: 605
	--- Projected Steepest Edge Statistics ---
	Number of iterations: 82582.
	Number of resets to reference space: 679. Avg. iterations per reset: 121
	--- SBT ---
	Number of tightened bounds: 177648
	--- SoI-based local search ---
	Number of proposed phase pattern update: 7277. Number of accepted update: 6621 [90.99%]
	Total time (% of local search time) updating SoI phase pattern : 378465 milli [1.13%]
	Total time obtaining current assignment: 2776459 milli [8.33%]
	Total time getting SoI phase pattern : 362124 milli [0.39%]
	--- Context dependent statistics ---
	Number of pushes / pops: 1309 / 1290
		[0.13%] Pre-Push hook: 118 milli
		[0.00%] Push : 0 milli
		[0.14%] Post-Pop hook: 125 milli
		[0.14%] Pop : 132 milli
		[0.41%] Total context-switching time: 376 milli
	--- Proof Certificate ---
	Number of certified leaves: 0
	Number of leaves to delegate: 0

06:32:25 Statistics update:
	--- Time Statistics ---
	Total time elapsed: 108157 milli (00:01:48)
		Main loop: 100966 milli (00:01:40)
		Preprocessing time: 284 milli (00:00:00)
		Unknown: 6905 milli (00:00:06)
	Breakdown for main loop:
		[49.13%] Simplex steps: 49602 milli
		[17.77%] Explicit-basis bound tightening: 17943 milli
		[0.00%] Constraint-matrix bound tightening: 0 milli
		[0.53%] Degradation checking: 539 milli
		[0.03%] Precision restoration: 27 milli
		[0.22%] Statistics handling: 218 milli
		[0.00%] Constraint-fixing steps: 0 milli
		[0.04%] Valid case splits: 38 milli. Average per split: 0.00 milli
		[0.05%] Applying stored bound-tightening: 53 milli
		[3.14%] SMT core: 3165 milli
		[22.70%] Symbolic Bound Tightening: 22921 milli
		[37.18%] SoI-based local search: 37537 milli
		[0.00%] SoI-based local search: 0 milli
		[6.39%] Unaccounted for: 6456 milli
	--- Preprocessor Statistics ---
	Number of preprocessor bound-tightening loop iterations: 5
	Number of eliminated variables: 966
	Number of constraints removed due to variable elimination: 160
	Number of equations removed due to variable elimination: 0
	--- Engine Statistics ---
	Number of main loop iterations: 110000
		107892 iterations were simplex steps. Total time: 49602 milli. Average: 0.46 milli.
		0 iterations were constraint-fixing steps. Total time: 0 milli. Average: 0.00 milli
	Number of active piecewise-linear constraints: 107 / 261
		Constraints disabled by valid splits: 126. By SMT-originated splits: 28
	Last reported degradation: 0.0000000000. Max degradation so far: 0.0000871040. Restorations so far: 1
	Number of simplex pivots we attempted to skip because of instability: 145.
	Unstable pivots performed anyway: 13
	--- Tableau Statistics ---
	Total number of pivots performed: 87025
		Real pivots: 86883. Degenerate: 142 (0.16%)
		Degenerate pivots by request (e.g., to fix a PL constraint): 0 (0.00%)
		Average time per pivot: 0.13 milli
	Total number of fake pivots performed: 3369
	Total number of rows added: 0. Number of merged columns: 0
	Current tableau dimensions: M = 830, N = 2704
	--- SMT Core Statistics ---
	Total depth is 28. Total visited states: 1439. Number of splits: 732. Number of pops: 706
	Max stack depth: 50
	--- Bound Tightening Statistics ---
	Number of tightened bounds: 206406.
		Number of rows examined by row tightener: 87025. Consequent tightenings: 3112
		Number of explicit basis matrices examined by row tightener: 266. Consequent tightenings: 8464
		Number of bound tightening rounds on the entire constraint matrix: 0. Consequent tightenings: 0
		Number of bound notifications sent to PL constraints: 252375. Tightenings proposed: 0
	--- Basis Factorization statistics ---
	Number of basis refactorizations: 670
	--- Projected Steepest Edge Statistics ---
	Number of iterations: 90526.
	Number of resets to reference space: 743. Avg. iterations per reset: 121
	--- SBT ---
	Number of tightened bounds: 196678
	--- SoI-based local search ---
	Number of proposed phase pattern update: 8158. Number of accepted update: 7433 [91.11%]
	Total time (% of local search time) updating SoI phase pattern : 417985 milli [1.11%]
	Total time obtaining current assignment: 3119451 milli [8.31%]
	Total time getting SoI phase pattern : 408774 milli [0.40%]
	--- Context dependent statistics ---
	Number of pushes / pops: 1438 / 1410
		[0.13%] Pre-Push hook: 129 milli
		[0.00%] Push : 0 milli
		[0.14%] Post-Pop hook: 137 milli
		[0.14%] Pop : 144 milli
		[0.41%] Total context-switching time: 411 milli
	--- Proof Certificate ---
	Number of certified leaves: 0
	Number of leaves to delegate: 0

06:32:34 Statistics update:
	--- Time Statistics ---
	Total time elapsed: 117344 milli (00:01:57)
		Main loop: 110248 milli (00:01:50)
		Preprocessing time: 284 milli (00:00:00)
		Unknown: 6812 milli (00:00:06)
	Breakdown for main loop:
		[49.46%] Simplex steps: 54530 milli
		[17.04%] Explicit-basis bound tightening: 18783 milli
		[0.00%] Constraint-matrix bound tightening: 0 milli
		[0.53%] Degradation checking: 589 milli
		[0.03%] Precision restoration: 27 milli
		[0.22%] Statistics handling: 238 milli
		[0.00%] Constraint-fixing steps: 0 milli
		[0.04%] Valid case splits: 42 milli. Average per split: 0.00 milli
		[0.05%] Applying stored bound-tightening: 59 milli
		[3.21%] SMT core: 3536 milli
		[22.99%] Symbolic Bound Tightening: 25349 milli
		[38.09%] SoI-based local search: 41992 milli
		[0.00%] SoI-based local search: 0 milli
		[6.43%] Unaccounted for: 7090 milli
	--- Preprocessor Statistics ---
	Number of preprocessor bound-tightening loop iterations: 5
	Number of eliminated variables: 966
	Number of constraints removed due to variable elimination: 160
	Number of equations removed due to variable elimination: 0
	--- Engine Statistics ---
	Number of main loop iterations: 120000
		117664 iterations were simplex steps. Total time: 54530 milli. Average: 0.46 milli.
		0 iterations were constraint-fixing steps. Total time: 0 milli. Average: 0.00 milli
	Number of active piecewise-linear constraints: 112 / 261
		Constraints disabled by valid splits: 125. By SMT-originated splits: 24
	Last reported degradation: 0.0000000000. Max degradation so far: 0.0000871040. Restorations so far: 1
	Number of simplex pivots we attempted to skip because of instability: 145.
	Unstable pivots performed anyway: 13
	--- Tableau Statistics ---
	Total number of pivots performed: 94524
		Real pivots: 94364. Degenerate: 160 (0.17%)
		Degenerate pivots by request (e.g., to fix a PL constraint): 0 (0.00%)
		Average time per pivot: 0.13 milli
	Total number of fake pivots performed: 3747
	Total number of rows [runlim] sample:		120.20 time, 120.01 real, 160 MB, 1.07 load
added: 0. Number of merged columns: 0
	Current tableau dimensions: M = 830, N = 2704
	--- SMT Core Statistics ---
	Total depth is 24. Total visited states: 1597. Number of splits: 808. Number of pops: 788
	Max stack depth: 50
	--- Bound Tightening Statistics ---
	Number of tightened bounds: 226726.
		Number of rows examined by row tightener: 94524. Consequent tightenings: 3238
		Number of explicit basis matrices examined by row tightener: 276. Consequent tightenings: 8872
		Number of bound tightening rounds on the entire constraint matrix: 0. Consequent tightenings: 0
		Number of bound notifications sent to PL constraints: 274359. Tightenings proposed: 0
	--- Basis Factorization statistics ---
	Number of basis refactorizations: 734
	--- Projected Steepest Edge Statistics ---
	Number of iterations: 98403.
	Number of resets to reference space: 827. Avg. iterations per reset: 118
	--- SBT ---
	Number of tightened bounds: 216998
	--- SoI-based local search ---
	Number of proposed phase pattern update: 9042. Number of accepted update: 8242 [91.15%]
	Total time (% of local search time) updating SoI phase pattern : 460454 milli [1.10%]
	Total time obtaining current assignment: 3470039 milli [8.26%]
	Total time getting SoI phase pattern : 452940 milli [0.41%]
	--- Context dependent statistics ---
	Number of pushes / pops: 1596 / 1572
		[0.13%] Pre-Push hook: 144 milli
		[0.00%] Push : 0 milli
		[0.14%] Post-Pop hook: 155 milli
		[0.15%] Pop : 161 milli
		[0.42%] Total context-switching time: 461 milli
	--- Proof Certificate ---
	Number of certified leaves: 0
	Number of leaves to delegate: 0


Engine: quitting due to external request...

Final statistics:

06:32:37 Statistics update:
	--- Time Statistics ---
	Total time elapsed: 119993 milli (00:01:59)
		Main loop: 112906 milli (00:01:52)
		Preprocessing time: 284 milli (00:00:00)
		Unknown: 6802 milli (00:00:06)
	Breakdown for main loop:
		[49.26%] Simplex steps: 55612 milli
		[17.30%] Explicit-basis bound tightening: 19532 milli
		[0.00%] Constraint-matrix bound tightening: 0 milli
		[0.53%] Degradation checking: 600 milli
		[0.02%] Precision restoration: 27 milli
		[0.22%] Statistics handling: 243 milli
		[0.00%] Constraint-fixing steps: 0 milli
		[0.04%] Valid case splits: 43 milli. Average per split: 0.00 milli
		[0.05%] Applying stored bound-tightening: 60 milli
		[3.20%] SMT core: 3611 milli
		[22.98%] Symbolic Bound Tightening: 25948 milli
		[37.86%] SoI-based local search: 42743 milli
		[0.00%] SoI-based local search: 0 milli
		[6.40%] Unaccounted for: 7225 milli
	--- Preprocessor Statistics ---
	Number of preprocessor bound-tightening loop iterations: 5
	Number of eliminated variables: 966
	Number of constraints removed due to variable elimination: 160
	Number of equations removed due to variable elimination: 0
	--- Engine Statistics ---
	Number of main loop iterations: 122171
		119788 iterations were simplex steps. Total time: 55612 milli. Average: 0.46 milli.
		0 iterations were constraint-fixing steps. Total time: 0 milli. Average: 0.00 milli
	Number of active piecewise-linear constraints: 108 / 261
		Constraints disabled by valid splits: 127. By SMT-originated splits: 26
	Last reported degradation: 0.0000000000. Max degradation so far: 0.0000871040. Restorations so far: 1
	Number of simplex pivots we attempted to skip because of instability: 145.
	Unstable pivots performed anyway: 13
	--- Tableau Statistics ---
	Total number of pivots performed: 96114
		Real pivots: 95950. Degenerate: 164 (0.17%)
		Degenerate pivots by request (e.g., to fix a PL constraint): 0 (0.00%)
		Average time per pivot: 0.13 milli
	Total number of fake pivots performed: 3848
	Total number of rows added: 0. Number of merged columns: 0
	Current tableau dimensions: M = 830, N = 2704
	--- SMT Core Statistics ---
	Total depth is 26. Total visited states: 1632. Number of splits: 827. Number of pops: 804
	Max stack depth: 50
	--- Bound Tightening Statistics ---
	Number of tightened bounds: 234712.
		Number of rows examined by row tightener: 96114. Consequent tightenings: 3335
		Number of explicit basis matrices examined by row tightener: 285. Consequent tightenings: 9088
		Number of bound tightening rounds on the entire constraint matrix: 0. Consequent tightenings: 0
		Number of bound notifications sent to PL constraints: 281823. Tightenings proposed: 0
	--- Basis Factorization statistics ---
	Number of basis refactorizations: 748
	--- Projected Steepest Edge Statistics ---
	Number of iterations: 100094.
	Number of resets to reference space: 844. Avg. iterations per reset: 118
	--- SBT ---
	Number of tightened bounds: 224984
	--- SoI-based local search ---
	Number of proposed phase pattern update: 9241. Number of accepted update: 8422 [91.14%]
	Total time (% of local search time) updating SoI phase pattern : 470603 milli [1.10%]
	Total time obtaining current assignment: 3551577 milli [8.31%]
	Total time getting SoI phase pattern : 463001 milli [0.41%]
	--- Context dependent statistics ---
	Number of pushes / pops: 1631 / 1605
		[0.13%] Pre-Push hook: 147 milli
		[0.00%] Push : 0 milli
		[0.14%] Post-Pop hook: 158 milli
		[0.15%] Pop : 165 milli
		[0.42%] Total context-switching time: 471 milli
	--- Proof Certificate ---
	Number of certified leaves: 0
	Number of leaves to delegate: 0
Unexpected exit code! (this should not happen)[runlim] end:			Fri Oct  4 06:32:38 2024
[runlim] status:		out of time
[runlim] result:		2
[runlim] children:		1
[runlim] processes:		2
[runlim] real:			121.11 seconds
[runlim] time:			120.20 seconds
[runlim] space:			160 MB
[runlim] load:			1.08 maximum
[runlim] samples:		1200

real	2m1,116s
user	2m1,258s
sys	0m3,284s
