
[VERYDIFF_EXPERIMENT] Running on /home/i57/steuber/NeuroDiff/repos/VeryDiffExperiments/src/../benchmarks/mnist-prune/specs/mnist_5_local_18.vnnlib /home/i57/steuber/NeuroDiff/repos/VeryDiffExperiments/src/../benchmarks/mnist-prune/nets/mnist_relu_3_100.onnx
Found input X
op: matmul, weight: (100, 784), bias: nothing
op: bias, weight: nothing, bias: (100,)
op: relu, weight: nothing, bias: nothing
op: matmul, weight: (100, 100), bias: nothing
op: bias, weight: nothing, bias: (100,)
op: relu, weight: nothing, bias: nothing
op: matmul, weight: (10, 100), bias: nothing
op: bias, weight: nothing, bias: (10,)
op: relu, weight: nothing, bias: nothing
op: matmul, weight: (10, 10), bias: nothing
op: bias, weight: nothing, bias: (10,)
Found input X
op: gemm, weight: (100, 784), bias: (100,)
op: relu, weight: nothing, bias: nothing
op: gemm, weight: (100, 100), bias: (100,)
op: relu, weight: nothing, bias: nothing
op: gemm, weight: (10, 100), bias: (10,)
op: relu, weight: nothing, bias: nothing
op: gemm, weight: (10, 10), bias: (10,)
Distance: 1958.4889029213523
Distance: 144.28197153992141
Distance: 22.063573056613677
Distance: 0.8412832540489035
Running with 1 threads
[Thread 1] Time to first task: 0.0s
Instable Generators: 40
Instable Generators: 52
Instable Generators: 8
Zono Bounds:
[-0.013605863533249685, -6.637547339619224, -8.90683430088672, -7.781947306272874, -8.238338373771361, -9.15531475458739, -8.848379032921047, -7.798805202035862, -7.819710281239201, -8.541669600639086]
[0.008400006538621095, 6.996108348082765, 8.955977804304696, 7.87765320074004, 8.47213833253121, 8.181761281153012, 8.849170407853334, 8.701372200908477, 7.860215222074084, 8.679676516479145]
[Thread 1] Processed 100 zonotopes (Work Done: 0.0%; Expected Zonos: Inf)
[Thread 1] Processed 200 zonotopes (Work Done: 0.0%; Expected Zonos: Inf)
[Thread 1] Processed 300 zonotopes (Work Done: 0.0%; Expected Zonos: Inf)
[Thread 1] Processed 400 zonotopes (Work Done: 0.0%; Expected Zonos: Inf)
[Thread 1] Processed 500 zonotopes (Work Done: 0.0%; Expected Zonos: Inf)
[Thread 1] Processed 600 zonotopes (Work Done: 0.0%; Expected Zonos: Inf)
[Thread 1] Processed 700 zonotopes (Work Done: 0.0%; Expected Zonos: Inf)
[Thread 1] Processed 800 zonotopes (Work Done: 0.0%; Expected Zonos: Inf)
[Thread 1] Processed 900 zonotopes (Work Done: 0.0%; Expected Zonos: Inf)
[Thread 1] Processed 1000 zonotopes (Work Done: 0.0%; Expected Zonos: Inf)
[Thread 1] Processed 1100 zonotopes (Work Done: 0.0%; Expected Zonos: Inf)
[Thread 1] Processed 1200 zonotopes (Work Done: 0.0%; Expected Zonos: Inf)
[Thread 1] Processed 1300 zonotopes (Work Done: 0.0%; Expected Zonos: Inf)
[Thread 1] Processed 1400 zonotopes (Work Done: 0.0%; Expected Zonos: Inf)
[Thread 1] Processed 1500 zonotopes (Work Done: 0.0%; Expected Zonos: Inf)
[Thread 1] Processed 1600 zonotopes (Work Done: 0.0%; Expected Zonos: Inf)
[Thread 1] Processed 1700 zonotopes (Work Done: 0.0%; Expected Zonos: Inf)
[Thread 1] Processed 1800 zonotopes (Work Done: 0.0%; Expected Zonos: Inf)
[Thread 1] Processed 1900 zonotopes (Work Done: 0.0%; Expected Zonos: Inf)
[Thread 1] Processed 2000 zonotopes (Work Done: 0.0%; Expected Zonos: Inf)
[Thread 1] Processed 2100 zonotopes (Work Done: 0.0%; Expected Zonos: Inf)
[Thread 1] Processed 2200 zonotopes (Work Done: 0.0%; Expected Zonos: Inf)
[Thread 1] Processed 2300 zonotopes (Work Done: 0.0%; Expected Zonos: Inf)
[Thread 1] Processed 2400 zonotopes (Work Done: 0.0%; Expected Zonos: Inf)
[Thread 1] Processed 2500 zonotopes (Work Done: 0.0%; Expected Zonos: Inf)
[Thread 1] Processed 2600 zonotopes (Work Done: 0.0%; Expected Zonos: Inf)
[Thread 1] Processed 2700 zonotopes (Work Done: 0.0%; Expected Zonos: Inf)
[Thread 1] Processed 2800 zonotopes (Work Done: 0.0%; Expected Zonos: Inf)
[Thread 1] Processed 2900 zonotopes (Work Done: 0.0%; Expected Zonos: Inf)
[Thread 1] Processed 3000 zonotopes (Work Done: 0.0%; Expected Zonos: Inf)
[Thread 1] Processed 3100 zonotopes (Work Done: 0.0%; Expected Zonos: Inf)
[Thread 1] Processed 3200 zonotopes (Work Done: 0.0%; Expected Zonos: Inf)
[Thread 1] Processed 3300 zonotopes (Work Done: 0.0%; Expected Zonos: Inf)
[Thread 1] Processed 3400 zonotopes (Work Done: 0.0%; Expected Zonos: Inf)
[Thread 1] Processed 3500 zonotopes (Work Done: 0.0%; Expected Zonos: Inf)
[Thread 1] Processed 3600 zonotopes (Work Done: 0.0%; Expected Zonos: Inf)
[Thread 1] Processed 3700 zonotopes (Work Done: 0.0%; Expected Zonos: Inf)
[Thread 1] Processed 3800 zonotopes (Work Done: 0.0%; Expected Zonos: Inf)
[Thread 1] Processed 3900 zonotopes (Work Done: 0.0%; Expected Zonos: Inf)
[Thread 1] Processed 4000 zonotopes (Work Done: 0.0%; Expected Zonos: Inf)
[Thread 1] Processed 4100 zonotopes (Work Done: 0.0%; Expected Zonos: Inf)
[Thread 1] Processed 4200 zonotopes (Work Done: 0.0%; Expected Zonos: Inf)
[Thread 1] Processed 4300 zonotopes (Work Done: 0.0%; Expected Zonos: Inf)
[Thread 1] Processed 4400 zonotopes (Work Done: 0.0%; Expected Zonos: Inf)
[Thread 1] Processed 4500 zonotopes (Work Done: 0.0%; Expected Zonos: Inf)
[Thread 1] Processed 4600 zonotopes (Work Done: 0.0%; Expected Zonos: Inf)
[Thread 1] Processed 4700 zonotopes (Work Done: 0.0%; Expected Zonos: Inf)
[Thread 1] Processed 4800 zonotopes (Work Done: 0.0%; Expected Zonos: Inf)
[Thread 1] Processed 4900 zonotopes (Work Done: 0.0%; Expected Zonos: Inf)
[Thread 1] Processed 5000 zonotopes (Work Done: 0.0%; Expected Zonos: Inf)
[Thread 1] Processed 5100 zonotopes (Work Done: 0.0%; Expected Zonos: Inf)
[Thread 1] Processed 5200 zonotopes (Work Done: 0.0%; Expected Zonos: Inf)
[Thread 1] Processed 5300 zonotopes (Work Done: 0.0%; Expected Zonos: Inf)
[Thread 1] Processed 5400 zonotopes (Work Done: 0.0%; Expected Zonos: Inf)
[Thread 1] Processed 5500 zonotopes (Work Done: 0.0%; Expected Zonos: Inf)
[Thread 1] Processed 5600 zonotopes (Work Done: 0.0%; Expected Zonos: Inf)
[Thread 1] Processed 5700 zonotopes (Work Done: 0.0%; Expected Zonos: Inf)
[Thread 1] Processed 5800 zonotopes (Work Done: 0.0%; Expected Zonos: Inf)
[Thread 1] Processed 5900 zonotopes (Work Done: 0.0%; Expected Zonos: Inf)
[Thread 1] Processed 6000 zonotopes (Work Done: 0.0%; Expected Zonos: Inf)
[Thread 1] Processed 6100 zonotopes (Work Done: 0.0%; Expected Zonos: Inf)
[Thread 1] Processed 6200 zonotopes (Work Done: 0.0%; Expected Zonos: Inf)
[Thread 1] Processed 6300 zonotopes (Work Done: 0.0%; Expected Zonos: Inf)
[Thread 1] Processed 6400 zonotopes (Work Done: 0.0%; Expected Zonos: Inf)
[Thread 1] Processed 6500 zonotopes (Work Done: 0.0%; Expected Zonos: Inf)
[Thread 1] Processed 6600 zonotopes (Work Done: 0.0%; Expected Zonos: Inf)
[Thread 1] Processed 6700 zonotopes (Work Done: 0.0%; Expected Zonos: Inf)
[Thread 1] Processed 6800 zonotopes (Work Done: 0.0%; Expected Zonos: Inf)
[Thread 1] Processed 6900 zonotopes (Work Done: 0.0%; Expected Zonos: Inf)
[Thread 1] Processed 7000 zonotopes (Work Done: 0.0%; Expected Zonos: Inf)
[Thread 1] Processed 7100 zonotopes (Work Done: 0.0%; Expected Zonos: Inf)
[Thread 1] Processed 7200 zonotopes (Work Done: 0.0%; Expected Zonos: Inf)
[Thread 1] Processed 7300 zonotopes (Work Done: 0.0%; Expected Zonos: Inf)
[Thread 1] Processed 7400 zonotopes (Work Done: 0.0%; Expected Zonos: Inf)
[Thread 1] Processed 7500 zonotopes (Work Done: 0.0%; Expected Zonos: Inf)
[Thread 1] Processed 7600 zonotopes (Work Done: 0.0%; Expected Zonos: Inf)
[Thread 1] Processed 7700 zonotopes (Work Done: 0.0%; Expected Zonos: Inf)
[Thread 1] Processed 7800 zonotopes (Work Done: 0.0%; Expected Zonos: Inf)
[Thread 1] Processed 7900 zonotopes (Work Done: 0.0%; Expected Zonos: Inf)
[Thread 1] Processed 8000 zonotopes (Work Done: 0.0%; Expected Zonos: Inf)
[Thread 1] Processed 8100 zonotopes (Work Done: 0.0%; Expected Zonos: Inf)
[Thread 1] Processed 8200 zonotopes (Work Done: 0.0%; Expected Zonos: Inf)
[Thread 1] Processed 8300 zonotopes (Work Done: 0.0%; Expected Zonos: Inf)
[Thread 1] Processed 8400 zonotopes (Work Done: 0.0%; Expected Zonos: Inf)
[Thread 1] Processed 8500 zonotopes (Work Done: 0.0%; Expected Zonos: Inf)
[Thread 1] Processed 8600 zonotopes (Work Done: 0.0%; Expected Zonos: Inf)
[Thread 1] Processed 8700 zonotopes (Work Done: 0.0%; Expected Zonos: Inf)
[Thread 1] Processed 8800 zonotopes (Work Done: 0.0%; Expected Zonos: Inf)
[Thread 1] Processed 8900 zonotopes (Work Done: 0.0%; Expected Zonos: Inf)
[Thread 1] Processed 9000 zonotopes (Work Done: 0.0%; Expected Zonos: Inf)
[Thread 1] Processed 9100 zonotopes (Work Done: 0.0%; Expected Zonos: Inf)
[Thread 1] Processed 9200 zonotopes (Work Done: 0.0%; Expected Zonos: Inf)
[Thread 1] Processed 9300 zonotopes (Work Done: 0.0%; Expected Zonos: Inf)
[Thread 1] Processed 9400 zonotopes (Work Done: 0.0%; Expected Zonos: Inf)
[Thread 1] Processed 9500 zonotopes (Work Done: 0.0%; Expected Zonos: Inf)
[Thread 1] Processed 9600 zonotopes (Work Done: 0.0%; Expected Zonos: Inf)
[Thread 1] Processed 9700 zonotopes (Work Done: 0.0%; Expected Zonos: Inf)
[Thread 1] Processed 9800 zonotopes (Work Done: 0.0%; Expected Zonos: Inf)
[Thread 1] Processed 9900 zonotopes (Work Done: 0.0%; Expected Zonos: Inf)
[Thread 1] Processed 10000 zonotopes (Work Done: 0.0%; Expected Zonos: Inf)
[Thread 1] Processed 10100 zonotopes (Work Done: 0.0%; Expected Zonos: Inf)
[Thread 1] Processed 10200 zonotopes (Work Done: 0.0%; Expected Zonos: Inf)
[Thread 1] Processed 10300 zonotopes (Work Done: 0.0%; Expected Zonos: Inf)
[Thread 1] Processed 10400 zonotopes (Work Done: 0.0%; Expected Zonos: Inf)
[Thread 1] Processed 10500 zonotopes (Work Done: 0.0%; Expected Zonos: Inf)
[Thread 1] Processed 10600 zonotopes (Work Done: 0.0%; Expected Zonos: Inf)
[Thread 1] Processed 10700 zonotopes (Work Done: 0.0%; Expected Zonos: Inf)
[Thread 1] Processed 10800 zonotopes (Work Done: 0.0%; Expected Zonos: Inf)
[Thread 1] Processed 10900 zonotopes (Work Done: 0.0%; Expected Zonos: Inf)
[Thread 1] Processed 11000 zonotopes (Work Done: 0.0%; Expected Zonos: Inf)
[Thread 1] Processed 11100 zonotopes (Work Done: 0.0%; Expected Zonos: Inf)
[Thread 1] Processed 11200 zonotopes (Work Done: 0.0%; Expected Zonos: Inf)
[Thread 1] Processed 11300 zonotopes (Work Done: 0.0%; Expected Zonos: Inf)
[Thread 1] Processed 11400 zonotopes (Work Done: 0.0%; Expected Zonos: Inf)
[Thread 1] Processed 11500 zonotopes (Work Done: 0.0%; Expected Zonos: Inf)
[Thread 1] Processed 11600 zonotopes (Work Done: 0.0%; Expected Zonos: Inf)
[Thread 1] Processed 11700 zonotopes (Work Done: 0.0%; Expected Zonos: Inf)
[Thread 1] Processed 11800 zonotopes (Work Done: 0.0%; Expected Zonos: Inf)
[Thread 1] Processed 11900 zonotopes (Work Done: 0.0%; Expected Zonos: Inf)
[Thread 1] Processed 12000 zonotopes (Work Done: 0.0%; Expected Zonos: Inf)
[Thread 1] Processed 12100 zonotopes (Work Done: 0.0%; Expected Zonos: Inf)
[Thread 1] Processed 12200 zonotopes (Work Done: 0.0%; Expected Zonos: Inf)
[Thread 1] Processed 12300 zonotopes (Work Done: 0.0%; Expected Zonos: Inf)
[Thread 1] Processed 12400 zonotopes (Work Done: 0.0%; Expected Zonos: Inf)
[Thread 1] Processed 12500 zonotopes (Work Done: 0.0%; Expected Zonos: Inf)
[Thread 1] Processed 12600 zonotopes (Work Done: 0.0%; Expected Zonos: Inf)
[Thread 1] Processed 12700 zonotopes (Work Done: 0.0%; Expected Zonos: Inf)
[Thread 1] Processed 12800 zonotopes (Work Done: 0.0%; Expected Zonos: Inf)
[Thread 1] Processed 12900 zonotopes (Work Done: 0.0%; Expected Zonos: Inf)
[Thread 1] Processed 13000 zonotopes (Work Done: 0.0%; Expected Zonos: Inf)
[Thread 1] Processed 13100 zonotopes (Work Done: 0.0%; Expected Zonos: Inf)
[Thread 1] Processed 13200 zonotopes (Work Done: 0.0%; Expected Zonos: Inf)
[Thread 1] Processed 13300 zonotopes (Work Done: 0.0%; Expected Zonos: Inf)
[Thread 1] Processed 13400 zonotopes (Work Done: 0.0%; Expected Zonos: Inf)
[Thread 1] Processed 13500 zonotopes (Work Done: 0.0%; Expected Zonos: Inf)
[Thread 1] Processed 13600 zonotopes (Work Done: 0.0%; Expected Zonos: Inf)
[Thread 1] Processed 13700 zonotopes (Work Done: 0.0%; Expected Zonos: Inf)
[Thread 1] Processed 13800 zonotopes (Work Done: 0.0%; Expected Zonos: Inf)
[Thread 1] Processed 13900 zonotopes (Work Done: 0.0%; Expected Zonos: Inf)
[Thread 1] Processed 14000 zonotopes (Work Done: 0.0%; Expected Zonos: Inf)
[Thread 1] Processed 14100 zonotopes (Work Done: 0.0%; Expected Zonos: Inf)
[Thread 1] Processed 14200 zonotopes (Work Done: 0.0%; Expected Zonos: Inf)
[Thread 1] Processed 14300 zonotopes (Work Done: 0.0%; Expected Zonos: Inf)
[Thread 1] Processed 14400 zonotopes (Work Done: 0.0%; Expected Zonos: Inf)
[Thread 1] Processed 14500 zonotopes (Work Done: 0.0%; Expected Zonos: Inf)
[Thread 1] Processed 14600 zonotopes (Work Done: 0.0%; Expected Zonos: Inf)
[Thread 1] Processed 14700 zonotopes (Work Done: 0.0%; Expected Zonos: Inf)
[Thread 1] Processed 14800 zonotopes (Work Done: 0.0%; Expected Zonos: Inf)
[Thread 1] Processed 14900 zonotopes (Work Done: 0.0%; Expected Zonos: Inf)
[Thread 1] Processed 15000 zonotopes (Work Done: 0.0%; Expected Zonos: Inf)
[Thread 1] Processed 15100 zonotopes (Work Done: 0.0%; Expected Zonos: Inf)
[Thread 1] Processed 15200 zonotopes (Work Done: 0.0%; Expected Zonos: Inf)
[Thread 1] Processed 15300 zonotopes (Work Done: 0.0%; Expected Zonos: Inf)
[Thread 1] Processed 15400 zonotopes (Work Done: 0.0%; Expected Zonos: Inf)
[Thread 1] Processed 15500 zonotopes (Work Done: 0.0%; Expected Zonos: Inf)
[Thread 1] Processed 15600 zonotopes (Work Done: 0.0%; Expected Zonos: Inf)
[Thread 1] Processed 15700 zonotopes (Work Done: 0.0%; Expected Zonos: Inf)
[Thread 1] Processed 15800 zonotopes (Work Done: 0.0%; Expected Zonos: Inf)
[Thread 1] Processed 15900 zonotopes (Work Done: 0.0%; Expected Zonos: Inf)
[Thread 1] Processed 16000 zonotopes (Work Done: 0.0%; Expected Zonos: Inf)
[Thread 1] Processed 16100 zonotopes (Work Done: 0.0%; Expected Zonos: Inf)
[Thread 1] Processed 16200 zonotopes (Work Done: 0.0%; Expected Zonos: Inf)
[Thread 1] Processed 16300 zonotopes (Work Done: 0.0%; Expected Zonos: Inf)
[Thread 1] Processed 16400 zonotopes (Work Done: 0.0%; Expected Zonos: Inf)
[Thread 1] Processed 16500 zonotopes (Work Done: 0.0%; Expected Zonos: Inf)
[Thread 1] Processed 16600 zonotopes (Work Done: 0.0%; Expected Zonos: Inf)
[Thread 1] Processed 16700 zonotopes (Work Done: 0.0%; Expected Zonos: Inf)
[Thread 1] Processed 16800 zonotopes (Work Done: 0.0%; Expected Zonos: Inf)
[Thread 1] Processed 16900 zonotopes (Work Done: 0.0%; Expected Zonos: Inf)
[Thread 1] Processed 17000 zonotopes (Work Done: 0.0%; Expected Zonos: Inf)
[Thread 1] Processed 17100 zonotopes (Work Done: 0.0%; Expected Zonos: Inf)
[Thread 1] Processed 17200 zonotopes (Work Done: 0.0%; Expected Zonos: Inf)
[Thread 1] Processed 17300 zonotopes (Work Done: 0.0%; Expected Zonos: Inf)
[Thread 1] Processed 17400 zonotopes (Work Done: 0.0%; Expected Zonos: Inf)
[Thread 1] Processed 17500 zonotopes (Work Done: 0.0%; Expected Zonos: Inf)
[Thread 1] Processed 17600 zonotopes (Work Done: 0.0%; Expected Zonos: Inf)
[Thread 1] Processed 17700 zonotopes (Work Done: 0.0%; Expected Zonos: Inf)
[Thread 1] Processed 17800 zonotopes (Work Done: 0.0%; Expected Zonos: Inf)
[Thread 1] Processed 17900 zonotopes (Work Done: 0.0%; Expected Zonos: Inf)
[Thread 1] Processed 18000 zonotopes (Work Done: 0.0%; Expected Zonos: Inf)
[Thread 1] Processed 18100 zonotopes (Work Done: 0.0%; Expected Zonos: Inf)
[Thread 1] Processed 18200 zonotopes (Work Done: 0.0%; Expected Zonos: Inf)
[Thread 1] Processed 18300 zonotopes (Work Done: 0.0%; Expected Zonos: Inf)
[Thread 1] Processed 18400 zonotopes (Work Done: 0.0%; Expected Zonos: Inf)
[Thread 1] Processed 18500 zonotopes (Work Done: 0.0%; Expected Zonos: Inf)
[Thread 1] Processed 18600 zonotopes (Work Done: 0.0%; Expected Zonos: Inf)
[Thread 1] Processed 18700 zonotopes (Work Done: 0.0%; Expected Zonos: Inf)
[Thread 1] Processed 18800 zonotopes (Work Done: 0.0%; Expected Zonos: Inf)
[Thread 1] Processed 18900 zonotopes (Work Done: 0.0%; Expected Zonos: Inf)
[Thread 1] Processed 19000 zonotopes (Work Done: 0.0%; Expected Zonos: Inf)
[Thread 1] Processed 19100 zonotopes (Work Done: 0.0%; Expected Zonos: Inf)
[Thread 1] Processed 19200 zonotopes (Work Done: 0.0%; Expected Zonos: Inf)
[Thread 1] Processed 19300 zonotopes (Work Done: 0.0%; Expected Zonos: Inf)
[Thread 1] Processed 19400 zonotopes (Work Done: 0.0%; Expected Zonos: Inf)
[Thread 1] Processed 19500 zonotopes (Work Done: 0.0%; Expected Zonos: Inf)
[Thread 1] Processed 19600 zonotopes (Work Done: 0.0%; Expected Zonos: Inf)
[Thread 1] Processed 19700 zonotopes (Work Done: 0.0%; Expected Zonos: Inf)
[Thread 1] Processed 19800 zonotopes (Work Done: 0.0%; Expected Zonos: Inf)
[Thread 1] Processed 19900 zonotopes (Work Done: 0.0%; Expected Zonos: Inf)
[Thread 1] Processed 20000 zonotopes (Work Done: 0.0%; Expected Zonos: Inf)
[Thread 1] Processed 20100 zonotopes (Work Done: 0.0%; Expected Zonos: Inf)
[Thread 1] Processed 20200 zonotopes (Work Done: 0.0%; Expected Zonos: Inf)
[Thread 1] Processed 20300 zonotopes (Work Done: 0.0%; Expected Zonos: Inf)
[Thread 1] Processed 20400 zonotopes (Work Done: 0.0%; Expected Zonos: Inf)
[Thread 1] Processed 20500 zonotopes (Work Done: 0.0%; Expected Zonos: Inf)
[Thread 1] Processed 20600 zonotopes (Work Done: 0.0%; Expected Zonos: Inf)
[Thread 1] Processed 20700 zonotopes (Work Done: 0.0%; Expected Zonos: Inf)
[Thread 1] Processed 20800 zonotopes (Work Done: 0.0%; Expected Zonos: Inf)
[Thread 1] Processed 20900 zonotopes (Work Done: 0.0%; Expected Zonos: Inf)
[Thread 1] Processed 21000 zonotopes (Work Done: 0.0%; Expected Zonos: Inf)
[Thread 1] Processed 21100 zonotopes (Work Done: 0.0%; Expected Zonos: Inf)
[Thread 1] Processed 21200 zonotopes (Work Done: 0.0%; Expected Zonos: Inf)
[Thread 1] Processed 21300 zonotopes (Work Done: 0.0%; Expected Zonos: Inf)
[Thread 1] Processed 21400 zonotopes (Work Done: 0.0%; Expected Zonos: Inf)
[Thread 1] Processed 21500 zonotopes (Work Done: 0.0%; Expected Zonos: Inf)
[Thread 1] Processed 21600 zonotopes (Work Done: 0.0%; Expected Zonos: Inf)
[Thread 1] Processed 21700 zonotopes (Work Done: 0.0%; Expected Zonos: Inf)
[Thread 1] Processed 21800 zonotopes (Work Done: 0.0%; Expected Zonos: Inf)
[Thread 1] Processed 21900 zonotopes (Work Done: 0.0%; Expected Zonos: Inf)
[Thread 1] Processed 22000 zonotopes (Work Done: 0.0%; Expected Zonos: Inf)
[Thread 1] Processed 22100 zonotopes (Work Done: 0.0%; Expected Zonos: Inf)
[Thread 1] Processed 22200 zonotopes (Work Done: 0.0%; Expected Zonos: Inf)
[Thread 1] Processed 22300 zonotopes (Work Done: 0.0%; Expected Zonos: Inf)
[Thread 1] Processed 22400 zonotopes (Work Done: 0.0%; Expected Zonos: Inf)
[Thread 1] Processed 22500 zonotopes (Work Done: 0.0%; Expected Zonos: Inf)
[Thread 1] Processed 22600 zonotopes (Work Done: 0.0%; Expected Zonos: Inf)
[Thread 1] Processed 22700 zonotopes (Work Done: 0.0%; Expected Zonos: Inf)
[Thread 1] Processed 22800 zonotopes (Work Done: 0.0%; Expected Zonos: Inf)
[Thread 1] Processed 22900 zonotopes (Work Done: 0.0%; Expected Zonos: Inf)
[Thread 1] Processed 23000 zonotopes (Work Done: 0.0%; Expected Zonos: Inf)
[Thread 1] Processed 23100 zonotopes (Work Done: 0.0%; Expected Zonos: Inf)
[Thread 1] Processed 23200 zonotopes (Work Done: 0.0%; Expected Zonos: Inf)
[Thread 1] Processed 23300 zonotopes (Work Done: 0.0%; Expected Zonos: Inf)
[Thread 1] Processed 23400 zonotopes (Work Done: 0.0%; Expected Zonos: Inf)
[Thread 1] Processed 23500 zonotopes (Work Done: 0.0%; Expected Zonos: Inf)
[Thread 1] Processed 23600 zonotopes (Work Done: 0.0%; Expected Zonos: Inf)
[Thread 1] Processed 23700 zonotopes (Work Done: 0.0%; Expected Zonos: Inf)
[Thread 1] Processed 23800 zonotopes (Work Done: 0.0%; Expected Zonos: Inf)
[Thread 1] Processed 23900 zonotopes (Work Done: 0.0%; Expected Zonos: Inf)
[Thread 1] Processed 24000 zonotopes (Work Done: 0.0%; Expected Zonos: Inf)
[Thread 1] Processed 24100 zonotopes (Work Done: 0.0%; Expected Zonos: Inf)
[Thread 1] Processed 24200 zonotopes (Work Done: 0.0%; Expected Zonos: Inf)
[Thread 1] Processed 24300 zonotopes (Work Done: 0.0%; Expected Zonos: Inf)
[Thread 1] Processed 24400 zonotopes (Work Done: 0.0%; Expected Zonos: Inf)
[Thread 1] Processed 24500 zonotopes (Work Done: 0.0%; Expected Zonos: Inf)
[Thread 1] Processed 24600 zonotopes (Work Done: 0.0%; Expected Zonos: Inf)
[Thread 1] Processed 24700 zonotopes (Work Done: 0.0%; Expected Zonos: Inf)
[Thread 1] Processed 24800 zonotopes (Work Done: 0.0%; Expected Zonos: Inf)
[Thread 1] Processed 24900 zonotopes (Work Done: 0.0%; Expected Zonos: Inf)
[Thread 1] Processed 25000 zonotopes (Work Done: 0.0%; Expected Zonos: Inf)
[Thread 1] Processed 25100 zonotopes (Work Done: 0.0%; Expected Zonos: Inf)
[Thread 1] Processed 25200 zonotopes (Work Done: 0.0%; Expected Zonos: Inf)
[Thread 1] Processed 25300 zonotopes (Work Done: 0.0%; Expected Zonos: Inf)
[Thread 1] Processed 25400 zonotopes (Work Done: 0.0%; Expected Zonos: Inf)
[Thread 1] Processed 25500 zonotopes (Work Done: 0.0%; Expected Zonos: Inf)
[Thread 1] Processed 25600 zonotopes (Work Done: 0.0%; Expected Zonos: Inf)
[Thread 1] Processed 25700 zonotopes (Work Done: 0.0%; Expected Zonos: Inf)
[Thread 1] Processed 25800 zonotopes (Work Done: 0.0%; Expected Zonos: Inf)
[Thread 1] Processed 25900 zonotopes (Work Done: 0.0%; Expected Zonos: Inf)
[Thread 1] Processed 26000 zonotopes (Work Done: 0.0%; Expected Zonos: Inf)
[Thread 1] Processed 26100 zonotopes (Work Done: 0.0%; Expected Zonos: Inf)
[Thread 1] Processed 26200 zonotopes (Work Done: 0.0%; Expected Zonos: Inf)
[Thread 1] Processed 26300 zonotopes (Work Done: 0.0%; Expected Zonos: Inf)
[Thread 1] Processed 26400 zonotopes (Work Done: 0.0%; Expected Zonos: Inf)
[Thread 1] Processed 26500 zonotopes (Work Done: 0.0%; Expected Zonos: Inf)
[Thread 1] Processed 26600 zonotopes (Work Done: 0.0%; Expected Zonos: Inf)
[Thread 1] Processed 26700 zonotopes (Work Done: 0.0%; Expected Zonos: Inf)
[Thread 1] Processed 26800 zonotopes (Work Done: 0.0%; Expected Zonos: Inf)
[Thread 1] Processed 26900 zonotopes (Work Done: 0.0%; Expected Zonos: Inf)
[Thread 1] Processed 27000 zonotopes (Work Done: 0.0%; Expected Zonos: Inf)
[Thread 1] Processed 27100 zonotopes (Work Done: 0.0%; Expected Zonos: Inf)
[Thread 1] Processed 27200 zonotopes (Work Done: 0.0%; Expected Zonos: Inf)
[Thread 1] Processed 27300 zonotopes (Work Done: 0.0%; Expected Zonos: Inf)
[Thread 1] Processed 27400 zonotopes (Work Done: 0.0%; Expected Zonos: Inf)
[Thread 1] Processed 27500 zonotopes (Work Done: 0.0%; Expected Zonos: Inf)
[Thread 1] Processed 27600 zonotopes (Work Done: 0.0%; Expected Zonos: Inf)
[Thread 1] Processed 27700 zonotopes (Work Done: 0.0%; Expected Zonos: Inf)
[Thread 1] Processed 27800 zonotopes (Work Done: 0.0%; Expected Zonos: Inf)
[Thread 1] Processed 27900 zonotopes (Work Done: 0.0%; Expected Zonos: Inf)
[Thread 1] Processed 28000 zonotopes (Work Done: 0.0%; Expected Zonos: Inf)
[Thread 1] Processed 28100 zonotopes (Work Done: 0.0%; Expected Zonos: Inf)
[Thread 1] Processed 28200 zonotopes (Work Done: 0.0%; Expected Zonos: Inf)
[Thread 1] Processed 28300 zonotopes (Work Done: 0.0%; Expected Zonos: Inf)
[Thread 1] Processed 28400 zonotopes (Work Done: 0.0%; Expected Zonos: Inf)
[Thread 1] Processed 28500 zonotopes (Work Done: 0.0%; Expected Zonos: Inf)
[Thread 1] Processed 28600 zonotopes (Work Done: 0.0%; Expected Zonos: Inf)
[Thread 1] Processed 28700 zonotopes (Work Done: 0.0%; Expected Zonos: Inf)
[Thread 1] Processed 28800 zonotopes (Work Done: 0.0%; Expected Zonos: Inf)
[Thread 1] Processed 28900 zonotopes (Work Done: 0.0%; Expected Zonos: Inf)
[Thread 1] Processed 29000 zonotopes (Work Done: 0.0%; Expected Zonos: Inf)
[Thread 1] Processed 29100 zonotopes (Work Done: 0.0%; Expected Zonos: Inf)
[Thread 1] Processed 29200 zonotopes (Work Done: 0.0%; Expected Zonos: Inf)
[Thread 1] Processed 29300 zonotopes (Work Done: 0.0%; Expected Zonos: Inf)
[Thread 1] Processed 29400 zonotopes (Work Done: 0.0%; Expected Zonos: Inf)
[Thread 1] Processed 29500 zonotopes (Work Done: 0.0%; Expected Zonos: Inf)
[Thread 1] Processed 29600 zonotopes (Work Done: 0.0%; Expected Zonos: Inf)
[Thread 1] Processed 29700 zonotopes (Work Done: 0.0%; Expected Zonos: Inf)
[Thread 1] Processed 29800 zonotopes (Work Done: 0.0%; Expected Zonos: Inf)
[Thread 1] Processed 29900 zonotopes (Work Done: 0.0%; Expected Zonos: Inf)
[Thread 1] Processed 30000 zonotopes (Work Done: 0.0%; Expected Zonos: Inf)
[Thread 1] Processed 30100 zonotopes (Work Done: 0.0%; Expected Zonos: Inf)
[Thread 1] Processed 30200 zonotopes (Work Done: 0.0%; Expected Zonos: Inf)
[Thread 1] Processed 30300 zonotopes (Work Done: 0.0%; Expected Zonos: Inf)
[Thread 1] Processed 30400 zonotopes (Work Done: 0.0%; Expected Zonos: Inf)
[Thread 1] Processed 30500 zonotopes (Work Done: 0.0%; Expected Zonos: Inf)
[Thread 1] Processed 30600 zonotopes (Work Done: 0.0%; Expected Zonos: Inf)
[Thread 1] Processed 30700 zonotopes (Work Done: 0.0%; Expected Zonos: Inf)
[Thread 1] Processed 30800 zonotopes (Work Done: 0.0%; Expected Zonos: Inf)
[Thread 1] Processed 30900 zonotopes (Work Done: 0.0%; Expected Zonos: Inf)
[Thread 1] Processed 31000 zonotopes (Work Done: 0.0%; Expected Zonos: Inf)
[Thread 1] Processed 31100 zonotopes (Work Done: 0.0%; Expected Zonos: Inf)
[Thread 1] Processed 31200 zonotopes (Work Done: 0.0%; Expected Zonos: Inf)
[Thread 1] Processed 31300 zonotopes (Work Done: 0.0%; Expected Zonos: Inf)
[Thread 1] Processed 31400 zonotopes (Work Done: 0.0%; Expected Zonos: Inf)
[Thread 1] Processed 31500 zonotopes (Work Done: 0.0%; Expected Zonos: Inf)
[Thread 1] Processed 31600 zonotopes (Work Done: 0.0%; Expected Zonos: Inf)
[Thread 1] Processed 31700 zonotopes (Work Done: 0.0%; Expected Zonos: Inf)
[Thread 1] Processed 31800 zonotopes (Work Done: 0.0%; Expected Zonos: Inf)
[Thread 1] Processed 31900 zonotopes (Work Done: 0.0%; Expected Zonos: Inf)
[Thread 1] Processed 32000 zonotopes (Work Done: 0.0%; Expected Zonos: Inf)
[Thread 1] Processed 32100 zonotopes (Work Done: 0.0%; Expected Zonos: Inf)
[Thread 1] Processed 32200 zonotopes (Work Done: 0.0%; Expected Zonos: Inf)
[Thread 1] Processed 32300 zonotopes (Work Done: 0.0%; Expected Zonos: Inf)
[Thread 1] Processed 32400 zonotopes (Work Done: 0.0%; Expected Zonos: Inf)
[Thread 1] Processed 32500 zonotopes (Work Done: 0.0%; Expected Zonos: Inf)
[Thread 1] Processed 32600 zonotopes (Work Done: 0.0%; Expected Zonos: Inf)
[Thread 1] Processed 32700 zonotopes (Work Done: 0.0%; Expected Zonos: Inf)
[Thread 1] Processed 32800 zonotopes (Work Done: 0.0%; Expected Zonos: Inf)
[Thread 1] Processed 32900 zonotopes (Work Done: 0.0%; Expected Zonos: Inf)
[Thread 1] Processed 33000 zonotopes (Work Done: 0.0%; Expected Zonos: Inf)
[Thread 1] Processed 33100 zonotopes (Work Done: 0.0%; Expected Zonos: Inf)
[Thread 1] Processed 33200 zonotopes (Work Done: 0.0%; Expected Zonos: Inf)
[Thread 1] Processed 33300 zonotopes (Work Done: 0.0%; Expected Zonos: Inf)
[Thread 1] Processed 33400 zonotopes (Work Done: 0.0%; Expected Zonos: Inf)
[Thread 1] Processed 33500 zonotopes (Work Done: 0.0%; Expected Zonos: Inf)
[Thread 1] Processed 33600 zonotopes (Work Done: 0.0%; Expected Zonos: Inf)
[Thread 1] Processed 33700 zonotopes (Work Done: 0.0%; Expected Zonos: Inf)
[Thread 1] Processed 33800 zonotopes (Work Done: 0.0%; Expected Zonos: Inf)
[Thread 1] Processed 33900 zonotopes (Work Done: 0.0%; Expected Zonos: Inf)
[Thread 1] Processed 34000 zonotopes (Work Done: 0.0%; Expected Zonos: Inf)
[Thread 1] Processed 34100 zonotopes (Work Done: 0.0%; Expected Zonos: Inf)
[Thread 1] Processed 34200 zonotopes (Work Done: 0.0%; Expected Zonos: Inf)
[Thread 1] Processed 34300 zonotopes (Work Done: 0.0%; Expected Zonos: Inf)
[Thread 1] Processed 34400 zonotopes (Work Done: 0.0%; Expected Zonos: Inf)
[Thread 1] Processed 34500 zonotopes (Work Done: 0.0%; Expected Zonos: Inf)
[Thread 1] Processed 34600 zonotopes (Work Done: 0.0%; Expected Zonos: Inf)
[Thread 1] Processed 34700 zonotopes (Work Done: 0.0%; Expected Zonos: Inf)
[Thread 1] Processed 34800 zonotopes (Work Done: 0.0%; Expected Zonos: Inf)
[Thread 1] Processed 34900 zonotopes (Work Done: 0.0%; Expected Zonos: Inf)
[Thread 1] Processed 35000 zonotopes (Work Done: 0.0%; Expected Zonos: Inf)
[Thread 1] Processed 35100 zonotopes (Work Done: 0.0%; Expected Zonos: Inf)
[Thread 1] Processed 35200 zonotopes (Work Done: 0.0%; Expected Zonos: Inf)
[Thread 1] Processed 35300 zonotopes (Work Done: 0.0%; Expected Zonos: Inf)
[Thread 1] Processed 35400 zonotopes (Work Done: 0.0%; Expected Zonos: Inf)
[Thread 1] Processed 35500 zonotopes (Work Done: 0.0%; Expected Zonos: Inf)
[Thread 1] Processed 35600 zonotopes (Work Done: 0.0%; Expected Zonos: Inf)
[Thread 1] Processed 35700 zonotopes (Work Done: 0.0%; Expected Zonos: Inf)
[Thread 1] Processed 35800 zonotopes (Work Done: 0.0%; Expected Zonos: Inf)
[Thread 1] Processed 35900 zonotopes (Work Done: 0.0%; Expected Zonos: Inf)
[Thread 1] Processed 36000 zonotopes (Work Done: 0.0%; Expected Zonos: Inf)
[Thread 1] Processed 36100 zonotopes (Work Done: 0.0%; Expected Zonos: Inf)
[Thread 1] Processed 36200 zonotopes (Work Done: 0.0%; Expected Zonos: Inf)
[Thread 1] Processed 36300 zonotopes (Work Done: 0.0%; Expected Zonos: Inf)
[Thread 1] Processed 36400 zonotopes (Work Done: 0.0%; Expected Zonos: Inf)
[Thread 1] Processed 36500 zonotopes (Work Done: 0.0%; Expected Zonos: Inf)
[Thread 1] Processed 36600 zonotopes (Work Done: 0.0%; Expected Zonos: Inf)
[Thread 1] Processed 36700 zonotopes (Work Done: 0.0%; Expected Zonos: Inf)
[Thread 1] Processed 36800 zonotopes (Work Done: 0.0%; Expected Zonos: Inf)
[Thread 1] Processed 36900 zonotopes (Work Done: 0.0%; Expected Zonos: Inf)
[Thread 1] Processed 37000 zonotopes (Work Done: 0.0%; Expected Zonos: Inf)
[Thread 1] Processed 37100 zonotopes (Work Done: 0.0%; Expected Zonos: Inf)
[Thread 1] Processed 37200 zonotopes (Work Done: 0.0%; Expected Zonos: Inf)
[Thread 1] Processed 37300 zonotopes (Work Done: 0.0%; Expected Zonos: Inf)
[Thread 1] Processed 37400 zonotopes (Work Done: 0.0%; Expected Zonos: Inf)
[Thread 1] Processed 37500 zonotopes (Work Done: 0.0%; Expected Zonos: Inf)
[Thread 1] Processed 37600 zonotopes (Work Done: 0.0%; Expected Zonos: Inf)
[Thread 1] Processed 37700 zonotopes (Work Done: 0.0%; Expected Zonos: Inf)
[Thread 1] Processed 37800 zonotopes (Work Done: 0.0%; Expected Zonos: Inf)
[Thread 1] Processed 37900 zonotopes (Work Done: 0.0%; Expected Zonos: Inf)
[Thread 1] Processed 38000 zonotopes (Work Done: 0.0%; Expected Zonos: Inf)
[Thread 1] Processed 38100 zonotopes (Work Done: 0.0%; Expected Zonos: Inf)
[Thread 1] Processed 38200 zonotopes (Work Done: 0.0%; Expected Zonos: Inf)
[Thread 1] Processed 38300 zonotopes (Work Done: 0.0%; Expected Zonos: Inf)
[Thread 1] Processed 38400 zonotopes (Work Done: 0.0%; Expected Zonos: Inf)
[Thread 1] Processed 38500 zonotopes (Work Done: 0.0%; Expected Zonos: Inf)
[Thread 1] Processed 38600 zonotopes (Work Done: 0.0%; Expected Zonos: Inf)
[Thread 1] Processed 38700 zonotopes (Work Done: 0.0%; Expected Zonos: Inf)
[Thread 1] Processed 38800 zonotopes (Work Done: 0.0%; Expected Zonos: Inf)
[Thread 1] Processed 38900 zonotopes (Work Done: 0.0%; Expected Zonos: Inf)
[Thread 1] Processed 39000 zonotopes (Work Done: 0.0%; Expected Zonos: Inf)
[Thread 1] Processed 39100 zonotopes (Work Done: 0.0%; Expected Zonos: Inf)
[Thread 1] Processed 39200 zonotopes (Work Done: 0.0%; Expected Zonos: Inf)
[Thread 1] Processed 39300 zonotopes (Work Done: 0.0%; Expected Zonos: Inf)
[Thread 1] Processed 39400 zonotopes (Work Done: 0.0%; Expected Zonos: Inf)
[Thread 1] Processed 39500 zonotopes (Work Done: 0.0%; Expected Zonos: Inf)
[Thread 1] Processed 39600 zonotopes (Work Done: 0.0%; Expected Zonos: Inf)
[Thread 1] Processed 39700 zonotopes (Work Done: 0.0%; Expected Zonos: Inf)
[Thread 1] Processed 39800 zonotopes (Work Done: 0.0%; Expected Zonos: Inf)
[Thread 1] Processed 39900 zonotopes (Work Done: 0.0%; Expected Zonos: Inf)
[Thread 1] Processed 40000 zonotopes (Work Done: 0.0%; Expected Zonos: Inf)
[Thread 1] Processed 40100 zonotopes (Work Done: 0.0%; Expected Zonos: Inf)
[Thread 1] Processed 40200 zonotopes (Work Done: 0.0%; Expected Zonos: Inf)
[Thread 1] Processed 40300 zonotopes (Work Done: 0.0%; Expected Zonos: Inf)
[Thread 1] Processed 40400 zonotopes (Work Done: 0.0%; Expected Zonos: Inf)
[Thread 1] Processed 40500 zonotopes (Work Done: 0.0%; Expected Zonos: Inf)
[Thread 1] Processed 40600 zonotopes (Work Done: 0.0%; Expected Zonos: Inf)
[Thread 1] Processed 40700 zonotopes (Work Done: 0.0%; Expected Zonos: Inf)
[Thread 1] Processed 40800 zonotopes (Work Done: 0.0%; Expected Zonos: Inf)
[Thread 1] Processed 40900 zonotopes (Work Done: 0.0%; Expected Zonos: Inf)
[Thread 1] Processed 41000 zonotopes (Work Done: 0.0%; Expected Zonos: Inf)
[Thread 1] Processed 41100 zonotopes (Work Done: 0.0%; Expected Zonos: Inf)
[Thread 1] Processed 41200 zonotopes (Work Done: 0.0%; Expected Zonos: Inf)
[Thread 1] Processed 41300 zonotopes (Work Done: 0.0%; Expected Zonos: Inf)
[Thread 1] Processed 41400 zonotopes (Work Done: 0.0%; Expected Zonos: Inf)
[Thread 1] Processed 41500 zonotopes (Work Done: 0.0%; Expected Zonos: Inf)
[Thread 1] Processed 41600 zonotopes (Work Done: 0.0%; Expected Zonos: Inf)
[Thread 1] Processed 41700 zonotopes (Work Done: 0.0%; Expected Zonos: Inf)
[Thread 1] Processed 41800 zonotopes (Work Done: 0.0%; Expected Zonos: Inf)
[Thread 1] Processed 41900 zonotopes (Work Done: 0.0%; Expected Zonos: Inf)
[Thread 1] Processed 42000 zonotopes (Work Done: 0.0%; Expected Zonos: Inf)
[Thread 1] Processed 42100 zonotopes (Work Done: 0.0%; Expected Zonos: Inf)
[Thread 1] Processed 42200 zonotopes (Work Done: 0.0%; Expected Zonos: Inf)
[Thread 1] Processed 42300 zonotopes (Work Done: 0.0%; Expected Zonos: Inf)
[Thread 1] Processed 42400 zonotopes (Work Done: 0.0%; Expected Zonos: Inf)
[Thread 1] Processed 42500 zonotopes (Work Done: 0.0%; Expected Zonos: Inf)
[Thread 1] Processed 42600 zonotopes (Work Done: 0.0%; Expected Zonos: Inf)


TIMEOUT REACHED
UNKNOWN
[Thread 1] Total splits: 42698
Processed 42698 zonotopes (Work Done: 0.0%); Generated 85396 (0.0028104453051196777s/loop)
[Thread 1] Finished in 120.0s
 ────────────────────────────────────────────────────────────────────────────────
                                        Time                    Allocations      
                               ───────────────────────   ────────────────────────
       Tot / % measured:             120s / 100.0%           92.7GiB / 100.0%    

 Section               ncalls     time    %tot     avg     alloc    %tot      avg
 ────────────────────────────────────────────────────────────────────────────────
 Verify                     1     120s  100.0%    120s   92.7GiB  100.0%  92.7GiB
   Zonotope Loop            1     120s  100.0%    120s   92.7GiB  100.0%  92.7GiB
     Zonotope Propa...  42.7k    77.6s   64.7%  1.82ms   48.7GiB   52.5%  1.17MiB
       DiffZonotope...   171k    45.8s   38.2%   268μs   10.5GiB   11.3%  64.5KiB
         Zonotope_D...   342k    21.0s   17.5%  61.4μs   5.41GiB    5.8%  16.6KiB
       DiffZonotope...   128k    31.5s   26.3%   246μs   38.2GiB   41.2%   313KiB
         Zonotope_R...   256k    18.7s   15.6%  73.1μs   24.5GiB   26.4%   100KiB
           Allocation    256k    6.06s    5.1%  23.7μs   8.48GiB    9.1%  34.7KiB
           Column M...   256k    5.40s    4.5%  21.1μs   8.50GiB    9.2%  34.8KiB
           Influenc...   256k    4.78s    4.0%  18.7μs   6.53GiB    7.0%  26.7KiB
             Multiply    256k    3.72s    3.1%  14.5μs   4.10GiB    4.4%  16.8KiB
             Alloca...   256k    698ms    0.6%  2.73μs   2.43GiB    2.6%  9.94KiB
             Set Ma...   256k    220ms    0.2%   859ns     0.00B    0.0%    0.00B
           Set Matrix    256k    1.29s    1.1%  5.02μs    207MiB    0.2%     846B
           Vectors       256k    922ms    0.8%  3.60μs    814MiB    0.9%  3.26KiB
           Bounds        256k   59.4ms    0.0%   232ns     0.00B    0.0%    0.00B
     Compute Split      42.7k    6.79s    5.7%   159μs   6.82GiB    7.4%   167KiB
     Property Check     42.7k    6.78s    5.6%   159μs   2.68GiB    2.9%  65.7KiB
 Initialize                 1    334μs    0.0%   334μs    839KiB    0.0%   839KiB
 ────────────────────────────────────────────────────────────────────────────────
[VERYDIFF_TIMER] 120.036127553

[VERYDIFF_EXPERIMENT] NETWORK: /home/i57/steuber/NeuroDiff/repos/VeryDiffExperiments/src/../benchmarks/mnist-prune/specs/mnist_5_local_18.vnnlib
[VERYDIFF_EXPERIMENT] TIME: 120.654365597
