
[VERYDIFF_EXPERIMENT] Running on /home/i57/steuber/NeuroDiff/repos/VeryDiffExperiments/src/../benchmarks/mnist-prune/specs/mnist_70_local_24.vnnlib /home/i57/steuber/NeuroDiff/repos/VeryDiffExperiments/src/../benchmarks/mnist-prune/nets/mnist_relu_2_512.onnx
Total difference: 1461.7794
Average difference: 0.0022
Initial output delta:
[-30.234450 -33.618039 -26.014847 -27.721377 -31.432602 -28.026413 -30.648373 -28.271304 -25.798234 -26.093186 ]
[29.486591 29.779760 25.607841 27.439023 28.795194 27.068607 30.952133 24.738180 25.347978 23.259778 ]
setenv(`timeout -k 5 120 ../NeuroDiff/DiffNN-Code/delta_network_test 470 /home/i57/steuber/NeuroDiff/repos/VeryDiffExperiments/src/../benchmarks/mnist-prune/nets/mnist_relu_2_512.nnet /home/i57/steuber/NeuroDiff/repos/VeryDiffExperiments/src/../benchmarks/mnist-prune/nets_pruned/mnist_relu_2_512_0.79.nnet 1.0 -x 24`,["OMP_NUM_THREADS=1"])TIMEOUT
ProcessFailedException(Base.Process[Process(setenv(`timeout -k 5 120 ../NeuroDiff/DiffNN-Code/delta_network_test 470 /home/i57/steuber/NeuroDiff/repos/VeryDiffExperiments/src/../benchmarks/mnist-prune/nets/mnist_relu_2_512.nnet /home/i57/steuber/NeuroDiff/repos/VeryDiffExperiments/src/../benchmarks/mnist-prune/nets_pruned/mnist_relu_2_512_0.79.nnet 1.0 -x 24`,["OMP_NUM_THREADS=1"]), ProcessExited(124))])
nothing

[VERYDIFF_TIMER] 120.00799674

[VERYDIFF_EXPERIMENT] NETWORK: /home/i57/steuber/NeuroDiff/repos/VeryDiffExperiments/src/../benchmarks/mnist-prune/specs/mnist_70_local_24.vnnlib
[VERYDIFF_EXPERIMENT] TIME: 120.359505866
