
[VERYDIFF_EXPERIMENT] Running on /home/i57/steuber/NeuroDiff/repos/VeryDiffExperiments/src/../benchmarks/mnist-prune/specs/mnist_28_global_5.vnnlib /home/i57/steuber/NeuroDiff/repos/VeryDiffExperiments/src/../benchmarks/mnist-prune/nets/mnist_relu_4_1024.onnx
Total difference: 3502.7419
Average difference: 0.0012
Initial output delta:
[-245.905945 -251.950242 -275.509095 -273.050049 -261.860901 -277.813965 -249.146378 -262.310486 -266.671601 -277.489258 ]
[246.189575 252.720626 276.493194 274.107574 261.332458 279.258453 250.184494 263.932128 266.186370 277.595092 ]
setenv(`timeout -k 5 120 ../NeuroDiff/DiffNN-Code/delta_network_test 428 /home/i57/steuber/NeuroDiff/repos/VeryDiffExperiments/src/../benchmarks/mnist-prune/nets/mnist_relu_4_1024.nnet /home/i57/steuber/NeuroDiff/repos/VeryDiffExperiments/src/../benchmarks/mnist-prune/nets_pruned/mnist_relu_4_1024_0.79.nnet 1.0 -p 5`,["OMP_NUM_THREADS=1"])TIMEOUT
ProcessFailedException(Base.Process[Process(setenv(`timeout -k 5 120 ../NeuroDiff/DiffNN-Code/delta_network_test 428 /home/i57/steuber/NeuroDiff/repos/VeryDiffExperiments/src/../benchmarks/mnist-prune/nets/mnist_relu_4_1024.nnet /home/i57/steuber/NeuroDiff/repos/VeryDiffExperiments/src/../benchmarks/mnist-prune/nets_pruned/mnist_relu_4_1024_0.79.nnet 1.0 -p 5`,["OMP_NUM_THREADS=1"]), ProcessExited(124))])
nothing

[VERYDIFF_TIMER] 120.029746931

[VERYDIFF_EXPERIMENT] NETWORK: /home/i57/steuber/NeuroDiff/repos/VeryDiffExperiments/src/../benchmarks/mnist-prune/specs/mnist_28_global_5.vnnlib
[VERYDIFF_EXPERIMENT] TIME: 120.260786171
