
[VERYDIFF_EXPERIMENT] Running on /home/i57/steuber/NeuroDiff/repos/VeryDiffExperiments/src/../benchmarks/mnist-prune/specs/mnist_68_local_15.vnnlib /home/i57/steuber/NeuroDiff/repos/VeryDiffExperiments/src/../benchmarks/mnist-prune/nets/mnist_relu_4_1024.onnx
Found input X
op: matmul, weight: (1024, 784), bias: nothing
op: bias, weight: nothing, bias: (1024,)
op: relu, weight: nothing, bias: nothing
op: matmul, weight: (1024, 1024), bias: nothing
op: bias, weight: nothing, bias: (1024,)
op: relu, weight: nothing, bias: nothing
op: matmul, weight: (1024, 1024), bias: nothing
op: bias, weight: nothing, bias: (1024,)
op: relu, weight: nothing, bias: nothing
op: matmul, weight: (10, 1024), bias: nothing
op: bias, weight: nothing, bias: (10,)
op: relu, weight: nothing, bias: nothing
op: matmul, weight: (10, 10), bias: nothing
op: bias, weight: nothing, bias: (10,)
Found input X
op: gemm, weight: (1024, 784), bias: (1024,)
op: relu, weight: nothing, bias: nothing
op: gemm, weight: (1024, 1024), bias: (1024,)
op: relu, weight: nothing, bias: nothing
op: gemm, weight: (1024, 1024), bias: (1024,)
op: relu, weight: nothing, bias: nothing
op: gemm, weight: (10, 1024), bias: (10,)
op: relu, weight: nothing, bias: nothing
op: gemm, weight: (10, 10), bias: (10,)
Distance: 915.6394868631054
Distance: 1298.7052820973968
Distance: 1296.587532894263
Distance: 6.054483317080667
Distance: 0.04942679278974538
Running with 1 threads
[Thread 1] Time to first task: 0.0s
Instable Generators: 274
Instable Generators: 407
Instable Generators: 713
Instable Generators: 8
Zono Bounds:
[-35.16201784447778, -36.33960277594344, -40.21105639876963, -37.792552478438346, -38.44013426558566, -39.98095495869416, -0.0020580540568224696, -37.81420889310531, -39.12373200587351, -40.9629624308584]
[34.52016363699443, 36.31617592758936, 38.77718702321941, 39.08803776636881, 38.434231790102764, 39.91617253264713, 0.011529617901111264, 37.52326982828813, 39.20637292701659, 40.77651213779296]
[Thread 1] Processed 100 zonotopes (Work Done: 0.0%; Expected Zonos: Inf)
[Thread 1] Processed 200 zonotopes (Work Done: 0.0%; Expected Zonos: Inf)
[Thread 1] Processed 300 zonotopes (Work Done: 0.0%; Expected Zonos: Inf)


TIMEOUT REACHED
UNKNOWN
[Thread 1] Total splits: 367
Processed 367 zonotopes (Work Done: 0.0%); Generated 734 (0.32698715740599454s/loop)
[Thread 1] Finished in 120.0s
 ────────────────────────────────────────────────────────────────────────────────
                                        Time                    Allocations      
                               ───────────────────────   ────────────────────────
       Tot / % measured:             120s / 100.0%           46.5GiB / 100.0%    

 Section               ncalls     time    %tot     avg     alloc    %tot      avg
 ────────────────────────────────────────────────────────────────────────────────
 Verify                     1     120s  100.0%    120s   46.5GiB  100.0%  46.5GiB
   Zonotope Loop            1     120s  100.0%    120s   46.5GiB  100.0%  46.5GiB
     Zonotope Propa...    367     116s   96.6%   316ms   45.8GiB   98.6%   128MiB
       DiffZonotope...  1.83k    84.1s   70.1%  45.8ms   10.7GiB   23.0%  5.97MiB
         Zonotope_D...  3.67k    29.1s   24.2%  7.93ms   4.40GiB    9.5%  1.23MiB
       DiffZonotope...  1.47k    31.9s   26.5%  21.7ms   35.1GiB   75.6%  24.5MiB
         Zonotope_R...  2.94k    15.4s   12.9%  5.26ms   20.9GiB   45.0%  7.29MiB
           Column M...  2.94k    8.45s    7.0%  2.88ms   9.40GiB   20.2%  3.28MiB
           Allocation   2.94k    4.60s    3.8%  1.57ms   9.40GiB   20.2%  3.28MiB
           Influenc...  2.94k    1.24s    1.0%   422μs   1.99GiB    4.3%   711KiB
             Multiply   2.94k    1.18s    1.0%   401μs   1.78GiB    3.8%   635KiB
             Alloca...  2.94k   39.6ms    0.0%  13.5μs    218MiB    0.5%  76.1KiB
             Set Ma...  2.94k   17.2ms    0.0%  5.85μs     0.00B    0.0%    0.00B
           Set Matrix   2.94k    1.05s    0.9%   359μs   18.7MiB    0.0%  6.52KiB
           Vectors      2.94k   79.2ms    0.1%  27.0μs   97.4MiB    0.2%  34.0KiB
           Bounds       2.94k   2.08ms    0.0%   708ns     0.00B    0.0%    0.00B
     Property Check       367    3.91s    3.3%  10.7ms    182MiB    0.4%   509KiB
     Compute Split        367   72.6ms    0.1%   198μs    169MiB    0.4%   473KiB
 Initialize                 1   14.5ms    0.0%  14.5ms   22.3MiB    0.0%  22.3MiB
 ────────────────────────────────────────────────────────────────────────────────
[VERYDIFF_TIMER] 120.099792726

[VERYDIFF_EXPERIMENT] NETWORK: /home/i57/steuber/NeuroDiff/repos/VeryDiffExperiments/src/../benchmarks/mnist-prune/specs/mnist_68_local_15.vnnlib
[VERYDIFF_EXPERIMENT] TIME: 120.416153252
