
[VERYDIFF_EXPERIMENT] Running on /home/i57/steuber/NeuroDiff/repos/VeryDiffExperiments/src/../benchmarks/mnist-prune/specs/mnist_38_global_5.vnnlib /home/i57/steuber/NeuroDiff/repos/VeryDiffExperiments/src/../benchmarks/mnist-prune/nets/mnist_relu_3_100.onnx
Parsing /home/i57/steuber/NeuroDiff/repos/VeryDiffExperiments/src/../benchmarks/mnist-prune/nets/mnist_relu_3_100.onnx...
Found input X
op: matmul, weight: (100, 784), bias: nothing
op: bias, weight: nothing, bias: (100,)
op: relu, weight: nothing, bias: nothing
op: matmul, weight: (100, 100), bias: nothing
op: bias, weight: nothing, bias: (100,)
op: relu, weight: nothing, bias: nothing
op: matmul, weight: (10, 100), bias: nothing
op: bias, weight: nothing, bias: (10,)
op: relu, weight: nothing, bias: nothing
op: matmul, weight: (10, 10), bias: nothing
op: bias, weight: nothing, bias: (10,)
Parsing /home/i57/steuber/NeuroDiff/repos/VeryDiffExperiments/src/../benchmarks/mnist-prune/nets_pruned/mnist_relu_3_100_0.79_adam_1_stepsize-old.onnx...
Found input X
op: gemm, weight: (100, 784), bias: (100,)
op: relu, weight: nothing, bias: nothing
op: gemm, weight: (100, 100), bias: (100,)
op: relu, weight: nothing, bias: nothing
op: gemm, weight: (10, 100), bias: (10,)
op: relu, weight: nothing, bias: nothing
op: gemm, weight: (10, 10), bias: (10,)
Distance: 368.62397500800625
Distance: 47.56803950402309
Distance: 2.8977568827249343
Distance: 0.01885471428334995
Running with 1 threads
[Thread 1] Time to first task: 0.0s
Instable Generators: 40
Instable Generators: 56
Instable Generators: 7
Zono Bounds:
[-1.2892579264016726, -1.271473983021322, -1.539180945861175, -1.5007269689547633, -0.0006947830963914997, -1.748207384793432, -1.4884773377032796, -1.4889906197106668, -1.342703908060223, -0.002852270617842408]
[1.2808217190291697, 1.2717408135315948, 1.3691977432542857, 1.379840896074501, 0.0018191827599075127, 1.7202482482961794, 1.4871721757772378, 1.4286552720303505, 1.287308448445944, 0.00172348711886232]
[Thread 1] Processed 100 zonotopes (Work Done: 0.0%; Expected Zonos: Inf)
[Thread 1] Processed 200 zonotopes (Work Done: 0.0%; Expected Zonos: Inf)
[Thread 1] Processed 300 zonotopes (Work Done: 0.0%; Expected Zonos: Inf)


TIMEOUT REACHED
UNKNOWN
[Thread 1] Total splits: 313
Processed 313 zonotopes (Work Done: 0.0%); Generated 626 (0.38389552869329074s/loop)
[Thread 1] Finished in 120.16s
 ────────────────────────────────────────────────────────────────────────────────
                                        Time                    Allocations      
                               ───────────────────────   ────────────────────────
       Tot / % measured:             120s / 100.0%           55.4GiB / 100.0%    

 Section               ncalls     time    %tot     avg     alloc    %tot      avg
 ────────────────────────────────────────────────────────────────────────────────
 Verify                     1     120s  100.0%    120s   55.4GiB  100.0%  55.4GiB
   Zonotope Loop            1     120s  100.0%    120s   55.4GiB  100.0%  55.4GiB
     Property Check       313     102s   84.8%   325ms   21.7GiB   39.2%  71.0MiB
     Zonotope Propa...    313    14.3s   11.9%  45.7ms   22.8GiB   41.2%  74.6MiB
       DiffZonotope...    939    9.47s    7.9%  10.1ms   21.5GiB   38.9%  23.5MiB
         Zonotope_R...  1.88k    9.17s    7.6%  4.88ms   21.0GiB   37.9%  11.5MiB
           Influenc...  1.88k    8.72s    7.3%  4.65ms   19.3GiB   34.9%  10.5MiB
             Multiply   1.88k    6.53s    5.4%  3.48ms   9.86GiB   17.8%  5.38MiB
             Set Ma...  1.88k    1.34s    1.1%   711μs     0.00B    0.0%    0.00B
             Alloca...  1.88k    847ms    0.7%   451μs   9.47GiB   17.1%  5.16MiB
           Column M...  1.88k    290ms    0.2%   155μs    856MiB    1.5%   467KiB
           Set Matrix   1.88k   96.6ms    0.1%  51.4μs   2.08MiB    0.0%  1.13KiB
           Allocation   1.88k   47.3ms    0.0%  25.2μs    856MiB    1.5%   467KiB
           Vectors      1.88k   9.17ms    0.0%  4.88μs   5.97MiB    0.0%  3.26KiB
           Bounds       1.88k   1.27ms    0.0%   675ns     0.00B    0.0%    0.00B
       DiffZonotope...  1.25k    4.83s    4.0%  3.86ms   1.28GiB    2.3%  1.05MiB
         Zonotope_D...  2.50k    2.33s    1.9%   930μs    855MiB    1.5%   350KiB
     Compute Split        313    1.93s    1.6%  6.16ms   4.79GiB    8.6%  15.7MiB
 Initialize                 1    579μs    0.0%   579μs   5.41MiB    0.0%  5.41MiB
 ────────────────────────────────────────────────────────────────────────────────
[VERYDIFF_TIMER] 120.197403449

[VERYDIFF_EXPERIMENT] NETWORK: /home/i57/steuber/NeuroDiff/repos/VeryDiffExperiments/src/../benchmarks/mnist-prune/specs/mnist_38_global_5.vnnlib
[VERYDIFF_EXPERIMENT] TIME: 120.611688219
