
[VERYDIFF_EXPERIMENT] Running on /home/i57/steuber/NeuroDiff/repos/VeryDiffExperiments/src/../benchmarks/mnist-prune/specs/mnist_26_local_21.vnnlib /home/i57/steuber/NeuroDiff/repos/VeryDiffExperiments/src/../benchmarks/mnist-prune/nets/mnist_relu_2_512.onnx
Parsing /home/i57/steuber/NeuroDiff/repos/VeryDiffExperiments/src/../benchmarks/mnist-prune/nets/mnist_relu_2_512.onnx...
Found input X
op: matmul, weight: (512, 784), bias: nothing
op: bias, weight: nothing, bias: (512,)
op: relu, weight: nothing, bias: nothing
op: matmul, weight: (512, 512), bias: nothing
op: bias, weight: nothing, bias: (512,)
op: relu, weight: nothing, bias: nothing
op: matmul, weight: (10, 512), bias: nothing
op: bias, weight: nothing, bias: (10,)
Parsing /home/i57/steuber/NeuroDiff/repos/VeryDiffExperiments/src/../benchmarks/mnist-prune/nets_pruned/mnist_relu_2_512_0.79-old.onnx...
Found input X
op: gemm, weight: (512, 784), bias: (512,)
op: relu, weight: nothing, bias: nothing
op: gemm, weight: (512, 512), bias: (512,)
op: relu, weight: nothing, bias: nothing
op: gemm, weight: (10, 512), bias: (10,)
Distance: 973.3044369037136
Distance: 481.63499746812613
Distance: 8.744412635378467
Running with 1 threads
[Thread 1] Time to first task: 0.0s
Instable Generators: 198
Instable Generators: 359
Zono Bounds:
[-18.641180222252085, -19.514796759221305, -16.293353155383798, -18.585243092577244, -19.115063264143732, -17.23909585937339, -17.739878852225072, -17.227784413692437, -16.067847405600677, -16.035868191884752]
[24.493981658579006, 23.675224475284935, 19.602749344368625, 20.32321389540543, 22.203326013890372, 19.92011912756973, 23.032504838179133, 21.633185755180317, 18.124429374706235, 17.927110543489277]
[Thread 1] Total splits: 16
Processed 33 zonotopes (Work Done: 100.0%); Generated 32 (0.8085037563333333s/loop)
[Thread 1] Finished in 26.68s
 ────────────────────────────────────────────────────────────────────────────────
                                        Time                    Allocations      
                               ───────────────────────   ────────────────────────
       Tot / % measured:            26.7s / 100.0%           2.80GiB / 100.0%    

 Section               ncalls     time    %tot     avg     alloc    %tot      avg
 ────────────────────────────────────────────────────────────────────────────────
 Verify                     1    26.7s  100.0%   26.7s   2.79GiB   99.8%  2.79GiB
   Zonotope Loop            1    26.7s  100.0%   26.7s   2.79GiB   99.8%  2.79GiB
     Property Check        33    25.8s   96.6%   781ms   1.94GiB   69.3%  60.1MiB
     Zonotope Propa...     33    905ms    3.4%  27.4ms    841MiB   29.3%  25.5MiB
       DiffZonotope...     99    699ms    2.6%  7.06ms    141MiB    4.9%  1.43MiB
         Zonotope_D...    198    254ms    1.0%  1.29ms   61.4MiB    2.1%   318KiB
       DiffZonotope...     66    206ms    0.8%  3.11ms    700MiB   24.4%  10.6MiB
         Zonotope_R...    132    106ms    0.4%   800μs    422MiB   14.7%  3.19MiB
           Column M...    132   50.2ms    0.2%   381μs    184MiB    6.4%  1.40MiB
           Influenc...    132   21.4ms    0.1%   162μs   49.0MiB    1.7%   380KiB
             Multiply     132   19.4ms    0.1%   147μs   41.4MiB    1.4%   321KiB
             Alloca...    132   1.48ms    0.0%  11.2μs   7.57MiB    0.3%  58.7KiB
             Set Ma...    132    335μs    0.0%  2.54μs     0.00B    0.0%    0.00B
           Set Matrix     132   15.9ms    0.1%   121μs    887KiB    0.0%  6.72KiB
           Allocation     132   13.6ms    0.1%   103μs    184MiB    6.4%  1.40MiB
           Vectors        132   4.13ms    0.0%  31.3μs   3.22MiB    0.1%  25.0KiB
           Bounds         132   74.3μs    0.0%   563ns     0.00B    0.0%    0.00B
     Compute Split         16   2.37ms    0.0%   148μs   6.42MiB    0.2%   411KiB
 Initialize                 1   1.94ms    0.0%  1.94ms   5.26MiB    0.2%  5.26MiB
 ────────────────────────────────────────────────────────────────────────────────
[VERYDIFF_TIMER] 26.713998853

[VERYDIFF_EXPERIMENT] NETWORK: /home/i57/steuber/NeuroDiff/repos/VeryDiffExperiments/src/../benchmarks/mnist-prune/specs/mnist_26_local_21.vnnlib
[VERYDIFF_EXPERIMENT] TIME: 27.020000062
