
[VERYDIFF_EXPERIMENT] Running on /home/i57/steuber/NeuroDiff/repos/VeryDiffExperiments/src/../benchmarks/mnist-prune/specs/mnist_75_global_6.vnnlib /home/i57/steuber/NeuroDiff/repos/VeryDiffExperiments/src/../benchmarks/mnist-prune/nets/mnist_relu_4_1024.onnx
Found input X
op: matmul, weight: (1024, 784), bias: nothing
op: bias, weight: nothing, bias: (1024,)
op: relu, weight: nothing, bias: nothing
op: matmul, weight: (1024, 1024), bias: nothing
op: bias, weight: nothing, bias: (1024,)
op: relu, weight: nothing, bias: nothing
op: matmul, weight: (1024, 1024), bias: nothing
op: bias, weight: nothing, bias: (1024,)
op: relu, weight: nothing, bias: nothing
op: matmul, weight: (10, 1024), bias: nothing
op: bias, weight: nothing, bias: (10,)
op: relu, weight: nothing, bias: nothing
op: matmul, weight: (10, 10), bias: nothing
op: bias, weight: nothing, bias: (10,)
Found input X
op: gemm, weight: (1024, 784), bias: (1024,)
op: relu, weight: nothing, bias: nothing
op: gemm, weight: (1024, 1024), bias: (1024,)
op: relu, weight: nothing, bias: nothing
op: gemm, weight: (1024, 1024), bias: (1024,)
op: relu, weight: nothing, bias: nothing
op: gemm, weight: (10, 1024), bias: (10,)
op: relu, weight: nothing, bias: nothing
op: gemm, weight: (10, 10), bias: (10,)
Distance: 915.6394868631054
Distance: 1298.7052820973968
Distance: 1296.587532894263
Distance: 6.054483317080667
Distance: 0.04942679278974538
Running with 1 threads
[Thread 1] Time to first task: 0.0s
Instable Generators: 459
Instable Generators: 808
Instable Generators: 1024
Instable Generators: 10
Zono Bounds:
[-140.07758203331846, -142.90551766274814, -157.93619622442498, -156.32881390210048, -150.68852280943844, -159.1930707959725, -142.0928927388417, -148.74794815796102, -152.18010764029088, -158.61187458953316]
[140.0442991944661, 142.43602321946275, 157.0976397431907, 155.71138287757952, 150.59784426282152, 158.8429725116653, 142.09439907200212, 148.22984479343458, 152.26409363768528, 158.466470293724]


TIMEOUT REACHED
UNKNOWN
[Thread 1] Total splits: 46
Processed 46 zonotopes (Work Done: 0.0%); Generated 92 (2.6238804841956522s/loop)
[Thread 1] Finished in 120.7s
 ────────────────────────────────────────────────────────────────────────────────
                                        Time                    Allocations      
                               ───────────────────────   ────────────────────────
       Tot / % measured:             121s / 100.0%           35.2GiB / 100.0%    

 Section               ncalls     time    %tot     avg     alloc    %tot      avg
 ────────────────────────────────────────────────────────────────────────────────
 Verify                     1     121s  100.0%    121s   35.1GiB   99.9%  35.1GiB
   Zonotope Loop            1     121s  100.0%    121s   35.1GiB   99.9%  35.1GiB
     Zonotope Propa...     46     116s   95.8%   2.51s   32.3GiB   91.9%   719MiB
       DiffZonotope...    184    72.0s   59.6%   391ms   26.7GiB   75.9%   149MiB
         Zonotope_R...    368    68.5s   56.7%   186ms   21.6GiB   61.3%  60.0MiB
           Influenc...    368    50.8s   42.1%   138ms   12.6GiB   35.7%  35.0MiB
             Multiply     368    35.0s   29.0%  95.1ms   7.48GiB   21.3%  20.8MiB
             Alloca...    368    15.0s   12.4%  40.7ms   5.08GiB   14.5%  14.1MiB
             Set Ma...    368    800ms    0.7%  2.17ms     0.00B    0.0%    0.00B
           Column M...    368    12.8s   10.6%  34.9ms   4.49GiB   12.8%  12.5MiB
           Allocation     368    3.98s    3.3%  10.8ms   4.49GiB   12.8%  12.5MiB
           Set Matrix     368    835ms    0.7%  2.27ms   5.27MiB    0.0%  14.7KiB
           Vectors        368   10.0ms    0.0%  27.2μs   12.2MiB    0.0%  34.0KiB
           Bounds         368    278μs    0.0%   756ns     0.00B    0.0%    0.00B
       DiffZonotope...    230    43.6s   36.1%   190ms   5.60GiB   15.9%  24.9MiB
         Zonotope_D...    460    16.5s   13.6%  35.8ms   2.91GiB    8.3%  6.48MiB
     Compute Split         46    4.78s    4.0%   104ms   1.90GiB    5.4%  42.3MiB
     Property Check        46    171ms    0.1%  3.73ms   31.2MiB    0.1%   694KiB
 Initialize                 1   15.6ms    0.0%  15.6ms   27.0MiB    0.1%  27.0MiB
 ────────────────────────────────────────────────────────────────────────────────
[VERYDIFF_TIMER] 120.79421589

[VERYDIFF_EXPERIMENT] NETWORK: /home/i57/steuber/NeuroDiff/repos/VeryDiffExperiments/src/../benchmarks/mnist-prune/specs/mnist_75_global_6.vnnlib
[VERYDIFF_EXPERIMENT] TIME: 121.080366655
