
[VERYDIFF_EXPERIMENT] Running on /home/i57/steuber/NeuroDiff/repos/VeryDiffExperiments/src/../benchmarks/mnist-prune/specs/mnist_80_local_24.vnnlib /home/i57/steuber/NeuroDiff/repos/VeryDiffExperiments/src/../benchmarks/mnist-prune/nets/mnist_relu_3_100.onnx
Loading /home/i57/steuber/NeuroDiff/repos/VeryDiffExperiments/src/../benchmarks/mnist-prune/nets/mnist_relu_3_100.onnx and /home/i57/steuber/NeuroDiff/repos/VeryDiffExperiments/src/../benchmarks/mnist-prune/nets_pruned/mnist_relu_3_100_0.49-old.onnx
INPUT SHAPE: 784
Refined: 71 | Refine Limit: 15 | Wrong: 0 | Right: 104 | Total: 104 | Total Zonos Considered: 175 | Expected 212855 (0.04885955227737192%)Refined: 161 | Refine Limit: 13 | Wrong: 0 | Right: 279 | Total: 279 | Total Zonos Considered: 440 | Expected 568202 (0.049102255887870865%)Refined: 229 | Refine Limit: 14 | Wrong: 0 | Right: 413 | Total: 413 | Total Zonos Considered: 642 | Expected 839874 (0.04917404277308263%)Refined: 319 | Refine Limit: 26 | Wrong: 0 | Right: 579 | Total: 579 | Total Zonos Considered: 898 | Expected 1177309 (0.049179951907273284%)Refined: 396 | Refine Limit: 33 | Wrong: 0 | Right: 704 | Total: 704 | Total Zonos Considered: 1100 | Expected 1336775 (0.05266406089282041%)Refined: 482 | Refine Limit: 29 | Wrong: 0 | Right: 877 | Total: 877 | Total Zonos Considered: 1359 | Expected 1665272 (0.05266406929318453%)Refined: 577 | Refine Limit: 35 | Wrong: 0 | Right: 1055 | Total: 1055 | Total Zonos Considered: 1632 | Expected 2003263 (0.05266407855583615%)Refined: 651 | Refine Limit: 25 | Wrong: 0 | Right: 1223 | Total: 1223 | Total Zonos Considered: 1874 | Expected 2322267 (0.05266405628637878%)Refined: 737 | Refine Limit: 32 | Wrong: 0 | Right: 1383 | Total: 1383 | Total Zonos Considered: 2120 | Expected 2626079 (0.052664066846427694%)Refined: 833 | Refine Limit: 32 | Wrong: 0 | Right: 1557 | Total: 1557 | Total Zonos Considered: 2390 | Expected 2956475 (0.052664067851072645%)Refined: 937 | Refine Limit: 37 | Wrong: 0 | Right: 1750 | Total: 1750 | Total Zonos Considered: 2687 | Expected 3322949 (0.05266406435969977%)Refined: 1044 | Refine Limit: 37 | Wrong: 0 | Right: 1962 | Total: 1962 | Total Zonos Considered: 3006 | Expected 3725501 (0.05266405780054817%)Refined: 1151 | Refine Limit: 36 | Wrong: 0 | Right: 2175 | Total: 2175 | Total Zonos Considered: 3326 | Expected 4129951 (0.052664063084525696%)Refined: 1266 | Refine Limit: 44 | Wrong: 0 | Right: 2375 | Total: 2375 | Total Zonos Considered: 3641 | Expected 4509717 (0.052664058520745315%)Refined: 1376 | Refine Limit: 44 | Wrong: 0 | Right: 2585 | Total: 2585 | Total Zonos Considered: 3961 | Expected 4908471 (0.05266405770758348%)Refined: 1485 | Refine Limit: 35 | Wrong: 0 | Right: 2799 | Total: 2799 | Total Zonos Considered: 4284 | Expected 5314820 (0.05266406011868699%)UNKNOWN
TIMEOUT
Refined: 1541 | Refine Limit: 35 | Wrong: 0 | Right: 2906 | Total: 2906 | Total Zonos Considered: 4447 | Expected 5517994 (0.05266406596310181%)

time: 120.168483714

[VERYDIFF_TIMER] 120.195508427

[VERYDIFF_EXPERIMENT] NETWORK: /home/i57/steuber/NeuroDiff/repos/VeryDiffExperiments/src/../benchmarks/mnist-prune/specs/mnist_80_local_24.vnnlib
[VERYDIFF_EXPERIMENT] TIME: 120.48549486
