
[VERYDIFF_EXPERIMENT] Running on /home/i57/steuber/NeuroDiff/repos/VeryDiffExperiments/src/../benchmarks/mnist-prune/specs/mnist_25_local_15.vnnlib /home/i57/steuber/NeuroDiff/repos/VeryDiffExperiments/src/../benchmarks/mnist-prune/nets/mnist_relu_3_100.onnx
Loading /home/i57/steuber/NeuroDiff/repos/VeryDiffExperiments/src/../benchmarks/mnist-prune/nets/mnist_relu_3_100.onnx and /home/i57/steuber/NeuroDiff/repos/VeryDiffExperiments/src/../benchmarks/mnist-prune/nets_pruned/mnist_relu_3_100_0.79_adam_1_stepsize-old.onnx
INPUT SHAPE: 784
Refined: 90 | Refine Limit: 14 | Wrong: 0 | Right: 119 | Total: 119 | Total Zonos Considered: 209 | Expected 3807 (3.12582085631731%)Refined: 160 | Refine Limit: 4 | Wrong: 0 | Right: 273 | Total: 273 | Total Zonos Considered: 433 | Expected 8066 (3.384577237788247%)Refined: 244 | Refine Limit: 26 | Wrong: 0 | Right: 391 | Total: 391 | Total Zonos Considered: 635 | Expected 11545 (3.3867475097444784%)Refined: 330 | Refine Limit: 30 | Wrong: 0 | Right: 538 | Total: 538 | Total Zonos Considered: 868 | Expected 15885 (3.3868429335851435%)Refined: 427 | Refine Limit: 31 | Wrong: 0 | Right: 681 | Total: 681 | Total Zonos Considered: 1108 | Expected 20108 (3.38671175651482%)Refined: 524 | Refine Limit: 31 | Wrong: 0 | Right: 826 | Total: 826 | Total Zonos Considered: 1350 | Expected 24389 (3.3867727254089957%)Refined: 613 | Refine Limit: 23 | Wrong: 0 | Right: 987 | Total: 987 | Total Zonos Considered: 1600 | Expected 29143 (3.38674810417596%)Refined: 704 | Refine Limit: 34 | Wrong: 0 | Right: 1135 | Total: 1135 | Total Zonos Considered: 1839 | Expected 33513 (3.386745442067257%)Refined: 800 | Refine Limit: 35 | Wrong: 0 | Right: 1293 | Total: 1293 | Total Zonos Considered: 2093 | Expected 38179 (3.386678540558946%)Refined: 891 | Refine Limit: 29 | Wrong: 0 | Right: 1458 | Total: 1458 | Total Zonos Considered: 2349 | Expected 43051 (3.3866809133353466%)Refined: 978 | Refine Limit: 21 | Wrong: 0 | Right: 1623 | Total: 1623 | Total Zonos Considered: 2601 | Expected 47923 (3.3866828036642116%)Refined: 1068 | Refine Limit: 28 | Wrong: 0 | Right: 1768 | Total: 1768 | Total Zonos Considered: 2836 | Expected 52204 (3.386713661788369%)Refined: 1161 | Refine Limit: 26 | Wrong: 0 | Right: 1934 | Total: 1934 | Total Zonos Considered: 3095 | Expected 57106 (3.386684411445382%)Refined: 1249 | Refine Limit: 19 | Wrong: 0 | Right: 2092 | Total: 2092 | Total Zonos Considered: 3341 | Expected 61771 (3.386702497935925%)Refined: 1345 | Refine Limit: 24 | Wrong: 0 | Right: 2258 | Total: 2258 | Total Zonos Considered: 3603 | Expected 66673 (3.3866782655647714%)Refined: 1424 | Refine Limit: 16 | Wrong: 0 | Right: 2424 | Total: 2424 | Total Zonos Considered: 3848 | Expected 71565 (3.387130580591071%)Refined: 1511 | Refine Limit: 21 | Wrong: 0 | Right: 2574 | Total: 2574 | Total Zonos Considered: 4085 | Expected 75994 (3.3871095086454197%)Refined: 1596 | Refine Limit: 37 | Wrong: 0 | Right: 2707 | Total: 2707 | Total Zonos Considered: 4303 | Expected 79921 (3.3870947560716207%)Refined: 1677 | Refine Limit: 22 | Wrong: 0 | Right: 2871 | Total: 2871 | Total Zonos Considered: 4548 | Expected 84762 (3.3871310256954765%)Refined: 1753 | Refine Limit: 22 | Wrong: 0 | Right: 3024 | Total: 3024 | Total Zonos Considered: 4777 | Expected 89278 (3.3871726517171084%)Refined: 1831 | Refine Limit: 25 | Wrong: 0 | Right: 3174 | Total: 3174 | Total Zonos Considered: 5005 | Expected 93682 (3.3880574710189792%)Refined: 1913 | Refine Limit: 25 | Wrong: 0 | Right: 3326 | Total: 3326 | Total Zonos Considered: 5239 | Expected 98168 (3.3880694319941327%)Refined: 1984 | Refine Limit: 14 | Wrong: 0 | Right: 3481 | Total: 3481 | Total Zonos Considered: 5465 | Expected 102712 (3.3890879351974457%)Refined: 2066 | Refine Limit: 25 | Wrong: 0 | Right: 3625 | Total: 3625 | Total Zonos Considered: 5691 | Expected 106568 (3.40158396516778%)Refined: 2139 | Refine Limit: 16 | Wrong: 0 | Right: 3791 | Total: 3791 | Total Zonos Considered: 5930 | Expected 111431 (3.402105338729797%)Refined: 2222 | Refine Limit: 26 | Wrong: 0 | Right: 3929 | Total: 3929 | Total Zonos Considered: 6151 | Expected 111772 (3.515191640124539%)Refined: 2314 | Refine Limit: 16 | Wrong: 0 | Right: 4111 | Total: 4111 | Total Zonos Considered: 6425 | Expected 116950 (3.515177426250535%)Refined: 2405 | Refine Limit: 23 | Wrong: 0 | Right: 4270 | Total: 4270 | Total Zonos Considered: 6675 | Expected 121457 (3.5156475131116363%)Refined: 2478 | Refine Limit: 22 | Wrong: 0 | Right: 4422 | Total: 4422 | Total Zonos Considered: 6900 | Expected 125713 (3.5175359747997423%)Refined: 2542 | Refine Limit: 4 | Wrong: 0 | Right: 4576 | Total: 4576 | Total Zonos Considered: 7118 | Expected 56106 (8.155990446654547%)Refined: 2624 | Refine Limit: 8 | Wrong: 0 | Right: 4715 | Total: 4715 | Total Zonos Considered: 7339 | Expected 57495 (8.200713105487434%)Refined: 2713 | Refine Limit: 28 | Wrong: 0 | Right: 4845 | Total: 4845 | Total Zonos Considered: 7558 | Expected 47407 (10.220009703208387%)Refined: 2795 | Refine Limit: 14 | Wrong: 0 | Right: 4998 | Total: 4998 | Total Zonos Considered: 7793 | Expected 48903 (10.220231887614256%)Refined: 2892 | Refine Limit: 29 | Wrong: 0 | Right: 5151 | Total: 5151 | Total Zonos Considered: 8043 | Expected 50400 (10.220238095238095%)Refined: 2993 | Refine Limit: 31 | Wrong: 0 | Right: 5311 | Total: 5311 | Total Zonos Considered: 8304 | Expected 51965 (10.220340613874724%)Refined: 3077 | Refine Limit: 15 | Wrong: 0 | Right: 5470 | Total: 5470 | Total Zonos Considered: 8547 | Expected 53521 (10.220287363838493%)Refined: 3166 | Refine Limit: 28 | Wrong: 0 | Right: 5611 | Total: 5611 | Total Zonos Considered: 8777 | Expected 54901 (10.220214568040655%)Refined: 3247 | Refine Limit: 17 | Wrong: 0 | Right: 5773 | Total: 5773 | Total Zonos Considered: 9020 | Expected 56486 (10.220231561802924%)Refined: 3335 | Refine Limit: 18 | Wrong: 0 | Right: 5929 | Total: 5929 | Total Zonos Considered: 9264 | Expected 58012 (10.22029924843136%)Refined: 3417 | Refine Limit: 16 | Wrong: 0 | Right: 6081 | Total: 6081 | Total Zonos Considered: 9498 | Expected 59499 (10.22033983764433%)Refined: 3505 | Refine Limit: 18 | Wrong: 0 | Right: 6235 | Total: 6235 | Total Zonos Considered: 9740 | Expected 60994 (10.222316949208118%)Refined: 3578 | Refine Limit: 11 | Wrong: 0 | Right: 6388 | Total: 6388 | Total Zonos Considered: 9966 | Expected 62475 (10.224889955982393%)Refined: 3657 | Refine Limit: 31 | Wrong: 0 | Right: 6510 | Total: 6510 | Total Zonos Considered: 10167 | Expected 63668 (10.224916755670039%)Refined: 3722 | Refine Limit: 6 | Wrong: 0 | Right: 6653 | Total: 6653 | Total Zonos Considered: 10375 | Expected 61970 (10.735839922543168%)Refined: 3812 | Refine Limit: 12 | Wrong: 0 | Right: 6818 | Total: 6818 | Total Zonos Considered: 10630 | Expected 63505 (10.73616250688922%)NETWORKS EQUIVALENT
Refined: 3848 | Refine Limit: 5 | Wrong: 0 | Right: 6901 | Total: 6901 | Total Zonos Considered: 10749 | Expected 58855 (11.725426896610314%)

time: 119.941545042

[VERYDIFF_TIMER] 119.967065977

[VERYDIFF_EXPERIMENT] NETWORK: /home/i57/steuber/NeuroDiff/repos/VeryDiffExperiments/src/../benchmarks/mnist-prune/specs/mnist_25_local_15.vnnlib
[VERYDIFF_EXPERIMENT] TIME: 120.275219632
