
[VERYDIFF_EXPERIMENT] Running on /home/i57/steuber/NeuroDiff/repos/VeryDiffExperiments/src/../benchmarks/mnist-prune/specs/mnist_83_global_3.vnnlib /home/i57/steuber/NeuroDiff/repos/VeryDiffExperiments/src/../benchmarks/mnist-prune/nets/mnist_relu_3_100.onnx
Parsing /home/i57/steuber/NeuroDiff/repos/VeryDiffExperiments/src/../benchmarks/mnist-prune/nets/mnist_relu_3_100.onnx...
Found input X
op: matmul, weight: (100, 784), bias: nothing
op: bias, weight: nothing, bias: (100,)
op: relu, weight: nothing, bias: nothing
op: matmul, weight: (100, 100), bias: nothing
op: bias, weight: nothing, bias: (100,)
op: relu, weight: nothing, bias: nothing
op: matmul, weight: (10, 100), bias: nothing
op: bias, weight: nothing, bias: (10,)
op: relu, weight: nothing, bias: nothing
op: matmul, weight: (10, 10), bias: nothing
op: bias, weight: nothing, bias: (10,)
Parsing /home/i57/steuber/NeuroDiff/repos/VeryDiffExperiments/src/../benchmarks/mnist-prune/nets_pruned/mnist_relu_3_100_0.79_adam_1_stepsize-old.onnx...
Found input X
op: gemm, weight: (100, 784), bias: (100,)
op: relu, weight: nothing, bias: nothing
op: gemm, weight: (100, 100), bias: (100,)
op: relu, weight: nothing, bias: nothing
op: gemm, weight: (10, 100), bias: (10,)
op: relu, weight: nothing, bias: nothing
op: gemm, weight: (10, 10), bias: (10,)
Distance: 368.62397500800625
Distance: 47.56803950402309
Distance: 2.8977568827249343
Distance: 0.01885471428334995
Running with 1 threads
[Thread 1] Time to first task: 0.0s
Instable Generators: 26
Instable Generators: 26
Instable Generators: 4
Zono Bounds:
[0.0005294134924727752, -0.00040463891491273284, -0.4082673376830959, -0.40527373769328345, -0.4922396509663093, -0.5185324829383797, 0.0003841254547719677, -0.4198898009338968, -0.0006634860590112136, -0.44453565022919717]
[0.0007664777082406899, 0.00011267605047225705, 0.3673004633301437, 0.40186332362978694, 0.49288908970613043, 0.4696349798577167, 0.0006101554271012254, 0.5094111737738709, -0.00022330194415837818, 0.4286768232267746]
[Thread 1] Total splits: 0
Processed 1 zonotopes (Work Done: 100.0%); Generated 0 (0.148668539s/loop)
[Thread 1] Finished in 0.15s
 ────────────────────────────────────────────────────────────────────────────────
                                        Time                    Allocations      
                               ───────────────────────   ────────────────────────
       Tot / % measured:            149ms / 100.0%            148MiB / 100.0%    

 Section               ncalls     time    %tot     avg     alloc    %tot      avg
 ────────────────────────────────────────────────────────────────────────────────
 Verify                     1    149ms   99.6%   149ms    142MiB   96.3%   142MiB
   Zonotope Loop            1    149ms   99.6%   149ms    142MiB   96.3%   142MiB
     Property Check         1   95.4ms   63.9%  95.4ms   51.3MiB   34.7%  51.3MiB
     Zonotope Propa...      1   49.9ms   33.4%  49.9ms   71.2MiB   48.1%  71.2MiB
       DiffZonotope...      4   25.0ms   16.8%  6.26ms   4.10MiB    2.8%  1.03MiB
         Zonotope_D...      8   9.40ms    6.3%  1.18ms   2.70MiB    1.8%   345KiB
       DiffZonotope...      3   24.8ms   16.7%  8.28ms   67.1MiB   45.4%  22.4MiB
         Zonotope_R...      6   24.0ms   16.1%  4.00ms   65.6MiB   44.3%  10.9MiB
           Influenc...      6   22.7ms   15.2%  3.79ms   60.2MiB   40.7%  10.0MiB
             Multiply       6   17.3ms   11.6%  2.88ms   30.5MiB   20.6%  5.08MiB
             Set Ma...      6   4.14ms    2.8%   691μs     0.00B    0.0%    0.00B
             Alloca...      6   1.30ms    0.9%   217μs   29.8MiB   20.1%  4.96MiB
           Column M...      6    771μs    0.5%   129μs   2.64MiB    1.8%   451KiB
           Set Matrix       6    320μs    0.2%  53.3μs   4.50KiB    0.0%     768B
           Allocation       6    127μs    0.1%  21.1μs   2.64MiB    1.8%   451KiB
           Vectors          6   28.8μs    0.0%  4.80μs   19.5KiB    0.0%  3.26KiB
           Bounds           6   3.93μs    0.0%   655ns     0.00B    0.0%    0.00B
 Initialize                 1    544μs    0.4%   544μs   5.41MiB    3.7%  5.41MiB
 ────────────────────────────────────────────────────────────────────────────────
[VERYDIFF_TIMER] 0.175645152

[VERYDIFF_EXPERIMENT] NETWORK: /home/i57/steuber/NeuroDiff/repos/VeryDiffExperiments/src/../benchmarks/mnist-prune/specs/mnist_83_global_3.vnnlib
[VERYDIFF_EXPERIMENT] TIME: 0.47747297
