
[VERYDIFF_EXPERIMENT] Running on /home/i57/steuber/NeuroDiff/repos/VeryDiffExperiments/src/../benchmarks/mnist-prune/specs/mnist_30_local_21.vnnlib /home/i57/steuber/NeuroDiff/repos/VeryDiffExperiments/src/../benchmarks/mnist-prune/nets/mnist_relu_3_100.onnx
Parsing /home/i57/steuber/NeuroDiff/repos/VeryDiffExperiments/src/../benchmarks/mnist-prune/nets/mnist_relu_3_100.onnx...
Found input X
op: matmul, weight: (100, 784), bias: nothing
op: bias, weight: nothing, bias: (100,)
op: relu, weight: nothing, bias: nothing
op: matmul, weight: (100, 100), bias: nothing
op: bias, weight: nothing, bias: (100,)
op: relu, weight: nothing, bias: nothing
op: matmul, weight: (10, 100), bias: nothing
op: bias, weight: nothing, bias: (10,)
op: relu, weight: nothing, bias: nothing
op: matmul, weight: (10, 10), bias: nothing
op: bias, weight: nothing, bias: (10,)
Parsing /home/i57/steuber/NeuroDiff/repos/VeryDiffExperiments/src/../benchmarks/mnist-prune/nets_pruned/mnist_relu_3_100_0.77-old.onnx...
Found input X
op: gemm, weight: (100, 784), bias: (100,)
op: relu, weight: nothing, bias: nothing
op: gemm, weight: (100, 100), bias: (100,)
op: relu, weight: nothing, bias: nothing
op: gemm, weight: (10, 100), bias: (10,)
op: relu, weight: nothing, bias: nothing
op: gemm, weight: (10, 10), bias: (10,)
Distance: 1958.4889029213523
Distance: 144.28197153992141
Distance: 22.063573056613677
Distance: 0.8412832540489035
Running with 1 threads
[Thread 1] Time to first task: 0.0s
Instable Generators: 30
Instable Generators: 51
Instable Generators: 5
Zono Bounds:
[-0.021725544284465326, -6.314242287903548, -7.633345829223046, -6.86235968188394, -0.32967373804982386, -8.919953101396514, -0.004572715146722646, -6.5856104422554615, -6.239240637930782, -6.825514092315472]
[0.005682657472942278, 6.390575262477315, 7.760409878736141, 6.674618707056779, 0.3081303459848677, 8.906122036374258, 0.013094627021830348, 6.681151194942103, 6.347372996597339, 6.882877165013764]
[Thread 1] Total splits: 0
Processed 1 zonotopes (Work Done: 100.0%); Generated 0 (0.027424787s/loop)
[Thread 1] Finished in 0.03s
 ────────────────────────────────────────────────────────────────────────────────
                                        Time                    Allocations      
                               ───────────────────────   ────────────────────────
       Tot / % measured:           27.8ms / 100.0%           15.9MiB / 100.0%    

 Section               ncalls     time    %tot     avg     alloc    %tot      avg
 ────────────────────────────────────────────────────────────────────────────────
 Verify                     1   27.5ms   98.9%  27.5ms   15.1MiB   94.7%  15.1MiB
   Zonotope Loop            1   27.4ms   98.8%  27.4ms   15.1MiB   94.7%  15.1MiB
     Property Check         1   25.5ms   92.0%  25.5ms   12.7MiB   79.9%  12.7MiB
     Zonotope Propa...      1   1.75ms    6.3%  1.75ms   1.48MiB    9.3%  1.48MiB
       DiffZonotope...      4   1.16ms    4.2%   289μs    307KiB    1.9%  76.7KiB
         Zonotope_D...      8    504μs    1.8%  63.0μs    156KiB    1.0%  19.5KiB
       DiffZonotope...      3    588μs    2.1%   196μs   1.18MiB    7.4%   402KiB
         Zonotope_R...      6    278μs    1.0%  46.3μs    797KiB    4.9%   133KiB
           Influenc...      6    113μs    0.4%  18.8μs    243KiB    1.5%  40.5KiB
             Multiply       6   81.1μs    0.3%  13.5μs    153KiB    0.9%  25.5KiB
             Alloca...      6   18.0μs    0.1%  3.00μs   87.8KiB    0.5%  14.6KiB
             Set Ma...      6   8.42μs    0.0%  1.40μs     0.00B    0.0%    0.00B
           Column M...      6   78.5μs    0.3%  13.1μs    262KiB    1.6%  43.6KiB
           Set Matrix       6   33.0μs    0.1%  5.50μs   6.23KiB    0.0%  1.04KiB
           Allocation       6   22.1μs    0.1%  3.69μs    261KiB    1.6%  43.6KiB
           Vectors          6   20.1μs    0.1%  3.36μs   19.5KiB    0.1%  3.26KiB
           Bounds           6   2.07μs    0.0%   345ns     0.00B    0.0%    0.00B
 Initialize                 1    319μs    1.1%   319μs    858KiB    5.3%   858KiB
 ────────────────────────────────────────────────────────────────────────────────
[VERYDIFF_TIMER] 0.053745735

[VERYDIFF_EXPERIMENT] NETWORK: /home/i57/steuber/NeuroDiff/repos/VeryDiffExperiments/src/../benchmarks/mnist-prune/specs/mnist_30_local_21.vnnlib
[VERYDIFF_EXPERIMENT] TIME: 0.359072632
