
[VERYDIFF_EXPERIMENT] Running on /home/i57/steuber/NeuroDiff/repos/VeryDiffExperiments/src/../benchmarks/mnist-prune/specs/mnist_31_local_21.vnnlib /home/i57/steuber/NeuroDiff/repos/VeryDiffExperiments/src/../benchmarks/mnist-prune/nets/mnist_relu_2_512.onnx
Found input X
op: matmul, weight: (512, 784), bias: nothing
op: bias, weight: nothing, bias: (512,)
op: relu, weight: nothing, bias: nothing
op: matmul, weight: (512, 512), bias: nothing
op: bias, weight: nothing, bias: (512,)
op: relu, weight: nothing, bias: nothing
op: matmul, weight: (10, 512), bias: nothing
op: bias, weight: nothing, bias: (10,)
Found input X
op: gemm, weight: (512, 784), bias: (512,)
op: relu, weight: nothing, bias: nothing
op: gemm, weight: (512, 512), bias: (512,)
op: relu, weight: nothing, bias: nothing
op: gemm, weight: (10, 512), bias: (10,)
Distance: 973.3044369037136
Distance: 481.63499746812613
Distance: 8.744412635378467
Running with 1 threads
[Thread 1] Time to first task: 0.0s
Instable Generators: 254
Instable Generators: 512
Zono Bounds:
[-30.42772644964849, -29.727769221227643, -26.427281667066723, -28.875783225490125, -28.766690632902204, -26.92064791896426, -28.045402749414443, -28.742886026233926, -24.083488499175566, -24.116433894264148]
[36.054550534881756, 34.44271932202393, 29.49784318209339, 30.847715998329683, 33.75278067714857, 30.180247664974058, 33.77343820782386, 32.11714714124875, 27.91090017947662, 26.845904800029437]
[Thread 1] Processed 100 zonotopes (Work Done: 0.0%; Expected Zonos: Inf)
[Thread 1] Processed 200 zonotopes (Work Done: 0.0%; Expected Zonos: Inf)
[Thread 1] Processed 300 zonotopes (Work Done: 0.0%; Expected Zonos: Inf)
[Thread 1] Processed 400 zonotopes (Work Done: 0.0%; Expected Zonos: Inf)
[Thread 1] Processed 500 zonotopes (Work Done: 0.0%; Expected Zonos: Inf)
[Thread 1] Processed 600 zonotopes (Work Done: 0.0%; Expected Zonos: Inf)
[Thread 1] Processed 700 zonotopes (Work Done: 0.0%; Expected Zonos: Inf)
[Thread 1] Processed 800 zonotopes (Work Done: 0.0%; Expected Zonos: Inf)
[Thread 1] Processed 900 zonotopes (Work Done: 0.0%; Expected Zonos: Inf)
[Thread 1] Processed 1000 zonotopes (Work Done: 0.0%; Expected Zonos: Inf)
[Thread 1] Processed 1100 zonotopes (Work Done: 0.0%; Expected Zonos: Inf)
[Thread 1] Processed 1200 zonotopes (Work Done: 0.0%; Expected Zonos: Inf)
[Thread 1] Processed 1300 zonotopes (Work Done: 0.0%; Expected Zonos: Inf)
[Thread 1] Processed 1400 zonotopes (Work Done: 0.0%; Expected Zonos: Inf)
[Thread 1] Processed 1500 zonotopes (Work Done: 0.0%; Expected Zonos: Inf)
[Thread 1] Processed 1600 zonotopes (Work Done: 0.0%; Expected Zonos: Inf)
[Thread 1] Processed 1700 zonotopes (Work Done: 0.0%; Expected Zonos: Inf)
[Thread 1] Processed 1800 zonotopes (Work Done: 0.0%; Expected Zonos: Inf)
[Thread 1] Processed 1900 zonotopes (Work Done: 0.0%; Expected Zonos: Inf)
[Thread 1] Processed 2000 zonotopes (Work Done: 0.0%; Expected Zonos: Inf)
[Thread 1] Processed 2100 zonotopes (Work Done: 0.0%; Expected Zonos: Inf)
[Thread 1] Processed 2200 zonotopes (Work Done: 0.0%; Expected Zonos: Inf)
[Thread 1] Processed 2300 zonotopes (Work Done: 0.0%; Expected Zonos: Inf)
[Thread 1] Processed 2400 zonotopes (Work Done: 0.0%; Expected Zonos: Inf)
[Thread 1] Processed 2500 zonotopes (Work Done: 0.0%; Expected Zonos: Inf)
[Thread 1] Processed 2600 zonotopes (Work Done: 0.0%; Expected Zonos: Inf)
[Thread 1] Processed 2700 zonotopes (Work Done: 0.0%; Expected Zonos: Inf)
[Thread 1] Processed 2800 zonotopes (Work Done: 0.0%; Expected Zonos: Inf)
[Thread 1] Processed 2900 zonotopes (Work Done: 0.0%; Expected Zonos: Inf)
[Thread 1] Processed 3000 zonotopes (Work Done: 0.0%; Expected Zonos: Inf)
[Thread 1] Processed 3100 zonotopes (Work Done: 0.0%; Expected Zonos: Inf)
[Thread 1] Processed 3200 zonotopes (Work Done: 0.0%; Expected Zonos: Inf)
[Thread 1] Processed 3300 zonotopes (Work Done: 0.0%; Expected Zonos: Inf)
[Thread 1] Processed 3400 zonotopes (Work Done: 0.0%; Expected Zonos: Inf)
[Thread 1] Processed 3500 zonotopes (Work Done: 0.0%; Expected Zonos: Inf)
[Thread 1] Processed 3600 zonotopes (Work Done: 0.0%; Expected Zonos: Inf)
[Thread 1] Processed 3700 zonotopes (Work Done: 0.0%; Expected Zonos: Inf)


TIMEOUT REACHED
UNKNOWN
[Thread 1] Total splits: 3723
Processed 3723 zonotopes (Work Done: 0.0%); Generated 7446 (0.03223859934730056s/loop)
[Thread 1] Finished in 120.02s
 ────────────────────────────────────────────────────────────────────────────────
                                        Time                    Allocations      
                               ───────────────────────   ────────────────────────
       Tot / % measured:             120s / 100.0%            114GiB / 100.0%    

 Section               ncalls     time    %tot     avg     alloc    %tot      avg
 ────────────────────────────────────────────────────────────────────────────────
 Verify                     1     120s  100.0%    120s    114GiB  100.0%   114GiB
   Zonotope Loop            1     120s  100.0%    120s    114GiB  100.0%   114GiB
     Zonotope Propa...  3.72k     116s   96.5%  31.1ms    109GiB   95.3%  30.0MiB
       DiffZonotope...  11.2k    84.5s   70.4%  7.56ms   16.4GiB   14.3%  1.51MiB
         Zonotope_D...  22.3k    31.4s   26.2%  1.41ms   7.12GiB    6.2%   334KiB
       DiffZonotope...  7.45k    31.3s   26.1%  4.21ms   92.7GiB   81.0%  12.8MiB
         Zonotope_R...  14.9k    19.2s   16.0%  1.29ms   56.2GiB   49.1%  3.86MiB
           Column M...  14.9k    7.31s    6.1%   491μs   24.2GiB   21.1%  1.66MiB
           Influenc...  14.9k    5.13s    4.3%   345μs   7.30GiB    6.4%   514KiB
             Multiply   14.9k    4.62s    3.8%   310μs   6.30GiB    5.5%   444KiB
             Alloca...  14.9k    457ms    0.4%  30.7μs   0.99GiB    0.9%  70.0KiB
             Set Ma...  14.9k   40.1ms    0.0%  2.69μs     0.00B    0.0%    0.00B
           Allocation   14.9k    3.87s    3.2%   260μs   24.2GiB   21.1%  1.66MiB
           Set Matrix   14.9k    2.53s    2.1%   170μs    120MiB    0.1%  8.23KiB
           Vectors      14.9k    305ms    0.3%  20.5μs    363MiB    0.3%  25.0KiB
           Bounds       14.9k   9.40ms    0.0%   631ns     0.00B    0.0%    0.00B
     Property Check     3.72k    3.16s    2.6%   848μs    562MiB    0.5%   154KiB
     Compute Split      3.72k    642ms    0.5%   173μs   1.63GiB    1.4%   459KiB
 Initialize                 1   1.94ms    0.0%  1.94ms   5.26MiB    0.0%  5.26MiB
 ────────────────────────────────────────────────────────────────────────────────
[VERYDIFF_TIMER] 120.05630538

[VERYDIFF_EXPERIMENT] NETWORK: /home/i57/steuber/NeuroDiff/repos/VeryDiffExperiments/src/../benchmarks/mnist-prune/specs/mnist_31_local_21.vnnlib
[VERYDIFF_EXPERIMENT] TIME: 120.360226228
