
[VERYDIFF_EXPERIMENT] Running on /home/i57/steuber/NeuroDiff/repos/VeryDiffExperiments/src/../benchmarks/mnist-prune/specs/mnist_16_local_15.vnnlib /home/i57/steuber/NeuroDiff/repos/VeryDiffExperiments/src/../benchmarks/mnist-prune/nets/mnist_relu_4_1024.onnx
Found input X
op: matmul, weight: (1024, 784), bias: nothing
op: bias, weight: nothing, bias: (1024,)
op: relu, weight: nothing, bias: nothing
op: matmul, weight: (1024, 1024), bias: nothing
op: bias, weight: nothing, bias: (1024,)
op: relu, weight: nothing, bias: nothing
op: matmul, weight: (1024, 1024), bias: nothing
op: bias, weight: nothing, bias: (1024,)
op: relu, weight: nothing, bias: nothing
op: matmul, weight: (10, 1024), bias: nothing
op: bias, weight: nothing, bias: (10,)
op: relu, weight: nothing, bias: nothing
op: matmul, weight: (10, 10), bias: nothing
op: bias, weight: nothing, bias: (10,)
Found input X
op: gemm, weight: (1024, 784), bias: (1024,)
op: relu, weight: nothing, bias: nothing
op: gemm, weight: (1024, 1024), bias: (1024,)
op: relu, weight: nothing, bias: nothing
op: gemm, weight: (1024, 1024), bias: (1024,)
op: relu, weight: nothing, bias: nothing
op: gemm, weight: (10, 1024), bias: (10,)
op: relu, weight: nothing, bias: nothing
op: gemm, weight: (10, 10), bias: (10,)
Distance: 915.6394868631054
Distance: 1298.7052820973968
Distance: 1296.587532894263
Distance: 6.054483317080667
Distance: 0.04942679278974538
Running with 1 threads
[Thread 1] Time to first task: 0.0s
Instable Generators: 327
Instable Generators: 631
Instable Generators: 1018
Instable Generators: 10
Zono Bounds:
[-73.8344617060683, -75.28200816821789, -82.96481198420264, -81.96006374236417, -79.15664657403393, -83.84383299630124, -74.67774002069112, -78.10072142101755, -80.51651378339398, -82.84676190417323]
[73.81854486588865, 74.7570253826313, 82.86662224407502, 81.92482491099143, 79.1127145754348, 83.42371209101086, 74.60944214908139, 77.95154760823404, 80.55148245714352, 82.75670171067563]
[Thread 1] Processed 100 zonotopes (Work Done: 0.0%; Expected Zonos: Inf)


TIMEOUT REACHED
UNKNOWN
[Thread 1] Total splits: 167
Processed 167 zonotopes (Work Done: 0.0%); Generated 334 (0.7189033301556886s/loop)
[Thread 1] Finished in 120.06s
 ────────────────────────────────────────────────────────────────────────────────
                                        Time                    Allocations      
                               ───────────────────────   ────────────────────────
       Tot / % measured:             120s / 100.0%           33.9GiB / 100.0%    

 Section               ncalls     time    %tot     avg     alloc    %tot      avg
 ────────────────────────────────────────────────────────────────────────────────
 Verify                     1     120s  100.0%    120s   33.9GiB   99.9%  33.9GiB
   Zonotope Loop            1     120s  100.0%    120s   33.9GiB   99.9%  33.9GiB
     Zonotope Propa...    167     118s   98.5%   708ms   33.6GiB   99.0%   206MiB
       DiffZonotope...    668    65.0s   54.1%  97.2ms   26.6GiB   78.5%  40.8MiB
         Zonotope_R...  1.34k    45.6s   38.0%  34.1ms   16.2GiB   47.8%  12.4MiB
           Column M...  1.34k    39.5s   32.9%  29.6ms   6.89GiB   20.3%  5.28MiB
           Allocation   1.34k    3.61s    3.0%  2.70ms   6.89GiB   20.3%  5.28MiB
           Influenc...  1.34k    1.39s    1.2%  1.04ms   2.38GiB    7.0%  1.82MiB
             Multiply   1.34k    1.32s    1.1%   989μs   2.21GiB    6.5%  1.70MiB
             Alloca...  1.34k   50.8ms    0.0%  38.0μs    165MiB    0.5%   127KiB
             Set Ma...  1.34k   12.1ms    0.0%  9.04μs     0.00B    0.0%    0.00B
           Set Matrix   1.34k    995ms    0.8%   745μs   14.0MiB    0.0%  10.7KiB
           Vectors      1.34k   57.7ms    0.0%  43.2μs   44.3MiB    0.1%  34.0KiB
           Bounds       1.34k    912μs    0.0%   683ns     0.00B    0.0%    0.00B
       DiffZonotope...    835    53.3s   44.4%  63.8ms   6.93GiB   20.4%  8.49MiB
         Zonotope_D...  1.67k    17.9s   14.9%  10.7ms   2.82GiB    8.3%  1.73MiB
     Property Check       167    1.77s    1.5%  10.6ms   86.8MiB    0.2%   532KiB
     Compute Split        167   61.7ms    0.1%   369μs    123MiB    0.4%   751KiB
 Initialize                 1   14.3ms    0.0%  14.3ms   22.3MiB    0.1%  22.3MiB
 ────────────────────────────────────────────────────────────────────────────────
[VERYDIFF_TIMER] 120.148713159

[VERYDIFF_EXPERIMENT] NETWORK: /home/i57/steuber/NeuroDiff/repos/VeryDiffExperiments/src/../benchmarks/mnist-prune/specs/mnist_16_local_15.vnnlib
[VERYDIFF_EXPERIMENT] TIME: 120.397580147
