
[VERYDIFF_EXPERIMENT] Running on /home/i57/steuber/NeuroDiff/repos/VeryDiffExperiments/src/../benchmarks/mnist-prune/specs/mnist_85_local_18.vnnlib /home/i57/steuber/NeuroDiff/repos/VeryDiffExperiments/src/../benchmarks/mnist-prune/nets/mnist_relu_3_100.onnx
Loading /home/i57/steuber/NeuroDiff/repos/VeryDiffExperiments/src/../benchmarks/mnist-prune/nets/mnist_relu_3_100.onnx and /home/i57/steuber/NeuroDiff/repos/VeryDiffExperiments/src/../benchmarks/mnist-prune/nets_pruned/mnist_relu_3_100_0.77-old.onnx
INPUT SHAPE: 784
Skipping 0 row
Skipping 0 row
Skipping 0 row
Skipping 0 row
Skipping 0 row
Skipping 0 row
Skipping 0 row
Skipping 0 row
Skipping 0 row
Skipping 0 row
Skipping 0 row
Skipping 0 row
Skipping 0 row
Skipping 0 row
Skipping 0 row
Skipping 0 row
Skipping 0 row
Skipping 0 row
Skipping 0 row
Skipping 0 row
Skipping 0 row
Skipping 0 row
Skipping 0 row
Skipping 0 row
Skipping 0 row
Skipping 0 row
Skipping 0 row
Skipping 0 row
Skipping 0 row
Skipping 0 row
Skipping 0 row
Skipping 0 row
Skipping 0 row
Skipping 0 row
Skipping 0 row
Skipping 0 row
Skipping 0 row
Skipping 0 row
Skipping 0 row
Skipping 0 row
Skipping 0 row
Skipping 0 row
Skipping 0 row
Skipping 0 row
Skipping 0 row
Skipping 0 row
Skipping 0 row
Skipping 0 row
Skipping 0 row
Skipping 0 row
Skipping 0 row
Skipping 0 row
Skipping 0 row
Skipping 0 row
Skipping 0 row
Skipping 0 row
Skipping 0 row
Skipping 0 row
Skipping 0 row
Skipping 0 row
Skipping 0 row
Skipping 0 row
Skipping 0 row
Skipping 0 row
Skipping 0 row
Skipping 0 row
Skipping 0 row
Skipping 0 row
Skipping 0 row
Skipping 0 row
Skipping 0 row
Skipping 0 row
Skipping 0 row
Skipping 0 row
Skipping 0 row
Skipping 0 row
Skipping 0 row
Skipping 0 row
Skipping 0 row
Skipping 0 row
Skipping 0 row
Skipping 0 row
Skipping 0 row
Skipping 0 row
Skipping 0 row
Skipping 0 row
Skipping 0 row
Skipping 0 row
Skipping 0 row
Skipping 0 row
Skipping 0 row
Skipping 0 row
Skipping 0 row
Skipping 0 row
Skipping 0 row
Skipping 0 row
Skipping 0 row
Skipping 0 row
Skipping 0 row
Skipping 0 row
Skipping 0 row
Skipping 0 row
Skipping 0 row
Skipping 0 row
Skipping 0 row
Skipping 0 row
Skipping 0 row
Skipping 0 row
Skipping 0 row
Skipping 0 row
Skipping 0 row
Skipping 0 row
Skipping 0 row
Skipping 0 row
Skipping 0 row
Skipping 0 row
Skipping 0 row
Skipping 0 row
Skipping 0 row
Skipping 0 row
Skipping 0 row
Skipping 0 row
Skipping 0 row
Skipping 0 row
Skipping 0 row
Skipping 0 row
Skipping 0 row
Skipping 0 row
Skipping 0 row
Skipping 0 row
Skipping 0 row
Skipping 0 row
Skipping 0 row
Skipping 0 row
Skipping 0 row
Skipping 0 row
Skipping 0 row
Skipping 0 row
Skipping 0 row
Skipping 0 row
Skipping 0 row
Skipping 0 row
Skipping 0 row
Skipping 0 row
Skipping 0 row
Skipping 0 row
Skipping 0 row
Skipping 0 row
Skipping 0 row
Skipping 0 row
Skipping 0 row
Skipping 0 row
Skipping 0 row
Skipping 0 row
Skipping 0 row
Skipping 0 row
Skipping 0 row
Skipping 0 row
Skipping 0 row
Skipping 0 row
Skipping 0 row
Skipping 0 row
Skipping 0 row
Skipping 0 row
Skipping 0 row
Skipping 0 row
Skipping 0 row
Skipping 0 row
Skipping 0 row
Skipping 0 row
Skipping 0 row
Skipping 0 row
Skipping 0 row
Skipping 0 row
Skipping 0 row
Skipping 0 row
Skipping 0 row
Skipping 0 row
Skipping 0 row
Skipping 0 row
Skipping 0 row
Skipping 0 row
Skipping 0 row
Skipping 0 row
Skipping 0 row
Skipping 0 row
Skipping 0 row
Skipping 0 row
Skipping 0 row
Skipping 0 row
Skipping 0 row
Skipping 0 row
Skipping 0 row
Skipping 0 row
Skipping 0 row
Skipping 0 row
Skipping 0 row
Skipping 0 row
Skipping 0 row
Skipping 0 row
Skipping 0 row
Skipping 0 row
Skipping 0 row
Skipping 0 row
Skipping 0 row
Skipping 0 row
Skipping 0 row
Skipping 0 row
Skipping 0 row
Skipping 0 row
Skipping 0 row
Skipping 0 row
Skipping 0 row
Skipping 0 row
Skipping 0 row
Skipping 0 row
Skipping 0 row
Skipping 0 row
Skipping 0 row
Skipping 0 row
Skipping 0 row
Skipping 0 row
Skipping 0 row
Skipping 0 row
Skipping 0 row
Skipping 0 row
Skipping 0 row
Skipping 0 row
Skipping 0 row
Skipping 0 row
Skipping 0 row
Skipping 0 row
Skipping 0 row
Skipping 0 row
Skipping 0 row
Skipping 0 row
Skipping 0 row
Skipping 0 row
Skipping 0 row
Skipping 0 row
Skipping 0 row
Skipping 0 row
Skipping 0 row
Skipping 0 row
Skipping 0 row
Skipping 0 row
Skipping 0 row
Skipping 0 row
Skipping 0 row
Skipping 0 row
Skipping 0 row
Skipping 0 row
Skipping 0 row
Skipping 0 row
Skipping 0 row
Skipping 0 row
Skipping 0 row
Skipping 0 row
Skipping 0 row
Skipping 0 row
Skipping 0 row
Skipping 0 row
Skipping 0 row
Skipping 0 row
Skipping 0 row
Skipping 0 row
Skipping 0 row
Skipping 0 row
Skipping 0 row
Skipping 0 row
Skipping 0 row
Skipping 0 row
Skipping 0 row
Skipping 0 row
Skipping 0 row
Skipping 0 row
Skipping 0 row
Skipping 0 row
Skipping 0 row
Skipping 0 row
Skipping 0 row
Skipping 0 row
Skipping 0 row
Skipping 0 row
Skipping 0 row
Skipping 0 row
Skipping 0 row
Skipping 0 row
Skipping 0 row
Skipping 0 row
Skipping 0 row
Skipping 0 row
Skipping 0 row
Skipping 0 row
Skipping 0 row
Skipping 0 row
Skipping 0 row
Skipping 0 row
Skipping 0 row
Skipping 0 row
Skipping 0 row
Skipping 0 row
Skipping 0 row
Skipping 0 row
Skipping 0 row
Skipping 0 row
Skipping 0 row
Skipping 0 row
Skipping 0 row
Skipping 0 row
Skipping 0 row
Skipping 0 row
Skipping 0 row
Skipping 0 row
Skipping 0 row
Skipping 0 row
Skipping 0 row
Skipping 0 row
Skipping 0 row
Skipping 0 row
Skipping 0 row
Skipping 0 row
Skipping 0 row
Skipping 0 row
Skipping 0 row
Skipping 0 row
Skipping 0 row
Skipping 0 row
Skipping 0 row
Skipping 0 row
Skipping 0 row
Skipping 0 row
Skipping 0 row
Skipping 0 row
Skipping 0 row
Skipping 0 row
Skipping 0 row
Skipping 0 row
Skipping 0 row
Skipping 0 row
Skipping 0 row
Skipping 0 row
Skipping 0 row
Skipping 0 row
Skipping 0 row
Skipping 0 row
Skipping 0 row
Skipping 0 row
Skipping 0 row
Skipping 0 row
Skipping 0 row
Skipping 0 row
Skipping 0 row
Skipping 0 row
Skipping 0 row
Skipping 0 row
Skipping 0 row
Skipping 0 row
Skipping 0 row
Skipping 0 row
Skipping 0 row
Skipping 0 row
Skipping 0 row
Skipping 0 row
Skipping 0 row
Skipping 0 row
Skipping 0 row
Skipping 0 row
Skipping 0 row
Skipping 0 row
Skipping 0 row
Skipping 0 row
Skipping 0 row
Skipping 0 row
Skipping 0 row
Skipping 0 row
Skipping 0 row
Skipping 0 row
Skipping 0 row
Skipping 0 row
Skipping 0 row
Skipping 0 row
Skipping 0 row
Skipping 0 row
Skipping 0 row
Skipping 0 row
Skipping 0 row
Skipping 0 row
Skipping 0 row
Skipping 0 row
Skipping 0 row
Skipping 0 row
Skipping 0 row
Skipping 0 row
Skipping 0 row
Skipping 0 row
Skipping 0 row
Skipping 0 row
Skipping 0 row
Skipping 0 row
Skipping 0 row
Skipping 0 row
Skipping 0 row
Skipping 0 row
Skipping 0 row
Skipping 0 row
Skipping 0 row
Skipping 0 row
Skipping 0 row
Skipping 0 row
Skipping 0 row
Skipping 0 row
Skipping 0 row
Skipping 0 row
Skipping 0 row
Skipping 0 row
Skipping 0 row
Skipping 0 row
Skipping 0 row
Skipping 0 row
Skipping 0 row
Skipping 0 row
Skipping 0 row
Skipping 0 row
Skipping 0 row
Skipping 0 row
Skipping 0 row
Skipping 0 row
Skipping 0 row
Skipping 0 row
Skipping 0 row
Skipping 0 row
Skipping 0 row
Skipping 0 row
Skipping 0 row
Skipping 0 row
Skipping 0 row
Skipping 0 row
Skipping 0 row
Skipping 0 row
Skipping 0 row
Skipping 0 row
Skipping 0 row
Skipping 0 row
Skipping 0 row
Skipping 0 row
Skipping 0 row
Skipping 0 row
Skipping 0 row
Skipping 0 row
Skipping 0 row
Skipping 0 row
Skipping 0 row
Skipping 0 row
Skipping 0 row
Skipping 0 row
Skipping 0 row
Skipping 0 row
Skipping 0 row
Skipping 0 row
Skipping 0 row
Skipping 0 row
Skipping 0 row
Skipping 0 row
Skipping 0 row
Skipping 0 row
Skipping 0 row
Skipping 0 row
Skipping 0 row
Skipping 0 row
Skipping 0 row
Skipping 0 row
Skipping 0 row
Skipping 0 row
Skipping 0 row
Skipping 0 row
Skipping 0 row
Skipping 0 row
Skipping 0 row
Skipping 0 row
Skipping 0 row
Skipping 0 row
Skipping 0 row
Skipping 0 row
Skipping 0 row
Skipping 0 row
Refined: 33 | Refine Limit: 24 | Wrong: 0 | Right: 25 | Total: 25 | Total Zonos Considered: 58 | Expected 199 (12.562814070351758%)Skipping 0 row
Skipping 0 row
Skipping 0 row
Skipping 0 row
Skipping 0 row
Skipping 0 row
Skipping 0 row
Skipping 0 row
Skipping 0 row
Skipping 0 row
Skipping 0 row
Skipping 0 row
Skipping 0 row
Skipping 0 row
Skipping 0 row
Skipping 0 row
Skipping 0 row
Skipping 0 row
Skipping 0 row
Skipping 0 row
Skipping 0 row
Skipping 0 row
Skipping 0 row
Skipping 0 row
Skipping 0 row
Skipping 0 row
Skipping 0 row
Skipping 0 row
Skipping 0 row
Skipping 0 row
Skipping 0 row
Skipping 0 row
Skipping 0 row
Skipping 0 row
Skipping 0 row
Skipping 0 row
Skipping 0 row
Skipping 0 row
Skipping 0 row
Skipping 0 row
Skipping 0 row
Skipping 0 row
Skipping 0 row
Skipping 0 row
Skipping 0 row
Skipping 0 row
Skipping 0 row
Skipping 0 row
Skipping 0 row
Skipping 0 row
Skipping 0 row
Skipping 0 row
Skipping 0 row
Skipping 0 row
Skipping 0 row
Skipping 0 row
Skipping 0 row
Skipping 0 row
Skipping 0 row
Skipping 0 row
Skipping 0 row
Skipping 0 row
Skipping 0 row
Skipping 0 row
Skipping 0 row
Skipping 0 row
Skipping 0 row
Skipping 0 row
Skipping 0 row
Skipping 0 row
Skipping 0 row
Skipping 0 row
Skipping 0 row
Skipping 0 row
Skipping 0 row
Skipping 0 row
Skipping 0 row
Skipping 0 row
Skipping 0 row
Skipping 0 row
Skipping 0 row
Skipping 0 row
Skipping 0 row
Skipping 0 row
Skipping 0 row
Skipping 0 row
Skipping 0 row
Skipping 0 row
Skipping 0 row
Skipping 0 row
Skipping 0 row
Skipping 0 row
Skipping 0 row
Skipping 0 row
Skipping 0 row
Skipping 0 row
Skipping 0 row
Skipping 0 row
Skipping 0 row
Skipping 0 row
Skipping 0 row
Skipping 0 row
Skipping 0 row
Skipping 0 row
Skipping 0 row
Skipping 0 row
Skipping 0 row
Skipping 0 row
Skipping 0 row
Skipping 0 row
Skipping 0 row
Skipping 0 row
Skipping 0 row
Skipping 0 row
Skipping 0 row
Skipping 0 row
Skipping 0 row
Skipping 0 row
Skipping 0 row
Skipping 0 row
Skipping 0 row
Skipping 0 row
Skipping 0 row
Skipping 0 row
Skipping 0 row
Skipping 0 row
Skipping 0 row
Skipping 0 row
Skipping 0 row
Skipping 0 row
Skipping 0 row
Skipping 0 row
Skipping 0 row
Skipping 0 row
Skipping 0 row
Skipping 0 row
Skipping 0 row
Skipping 0 row
Skipping 0 row
Skipping 0 row
Skipping 0 row
Skipping 0 row
Skipping 0 row
Skipping 0 row
Skipping 0 row
Skipping 0 row
Skipping 0 row
Skipping 0 row
Skipping 0 row
Skipping 0 row
Skipping 0 row
Skipping 0 row
Skipping 0 row
Skipping 0 row
Skipping 0 row
Skipping 0 row
Skipping 0 row
Skipping 0 row
Skipping 0 row
Skipping 0 row
Skipping 0 row
Skipping 0 row
Skipping 0 row
Skipping 0 row
Skipping 0 row
Skipping 0 row
Skipping 0 row
Skipping 0 row
Skipping 0 row
Skipping 0 row
Skipping 0 row
Skipping 0 row
Skipping 0 row
Skipping 0 row
Skipping 0 row
Skipping 0 row
Skipping 0 row
Skipping 0 row
Skipping 0 row
Skipping 0 row
Skipping 0 row
Skipping 0 row
Skipping 0 row
Skipping 0 row
Skipping 0 row
Skipping 0 row
Skipping 0 row
Skipping 0 row
Skipping 0 row
Skipping 0 row
Skipping 0 row
Skipping 0 row
Skipping 0 row
Skipping 0 row
Skipping 0 row
Skipping 0 row
Skipping 0 row
Skipping 0 row
Skipping 0 row
Skipping 0 row
Skipping 0 row
Skipping 0 row
Skipping 0 row
Skipping 0 row
Skipping 0 row
Skipping 0 row
Skipping 0 row
Skipping 0 row
Skipping 0 row
Skipping 0 row
Skipping 0 row
Skipping 0 row
Skipping 0 row
Skipping 0 row
Skipping 0 row
Skipping 0 row
Skipping 0 row
Skipping 0 row
Skipping 0 row
Skipping 0 row
Skipping 0 row
Skipping 0 row
Skipping 0 row
Skipping 0 row
Skipping 0 row
Skipping 0 row
Skipping 0 row
Skipping 0 row
Skipping 0 row
Skipping 0 row
Skipping 0 row
Skipping 0 row
Skipping 0 row
Skipping 0 row
Skipping 0 row
Skipping 0 row
Skipping 0 row
Skipping 0 row
Skipping 0 row
Skipping 0 row
Skipping 0 row
Skipping 0 row
Skipping 0 row
Skipping 0 row
Skipping 0 row
Skipping 0 row
Skipping 0 row
Skipping 0 row
Skipping 0 row
Skipping 0 row
Skipping 0 row
Skipping 0 row
Skipping 0 row
Skipping 0 row
Skipping 0 row
Skipping 0 row
Skipping 0 row
Skipping 0 row
Skipping 0 row
Skipping 0 row
Skipping 0 row
Skipping 0 row
Skipping 0 row
Skipping 0 row
Skipping 0 row
Skipping 0 row
Skipping 0 row
Skipping 0 row
Skipping 0 row
Skipping 0 row
Skipping 0 row
Skipping 0 row
Skipping 0 row
Skipping 0 row
Skipping 0 row
Skipping 0 row
Skipping 0 row
Skipping 0 row
Skipping 0 row
Skipping 0 row
Skipping 0 row
Skipping 0 row
Skipping 0 row
Skipping 0 row
Skipping 0 row
Skipping 0 row
Skipping 0 row
Skipping 0 row
Skipping 0 row
Skipping 0 row
Skipping 0 row
Skipping 0 row
Skipping 0 row
Skipping 0 row
Skipping 0 row
Skipping 0 row
Skipping 0 row
Skipping 0 row
Skipping 0 row
Skipping 0 row
Skipping 0 row
Skipping 0 row
Skipping 0 row
Skipping 0 row
Skipping 0 row
Skipping 0 row
Skipping 0 row
Skipping 0 row
Skipping 0 row
Skipping 0 row
Skipping 0 row
Skipping 0 row
Skipping 0 row
Skipping 0 row
Skipping 0 row
Skipping 0 row
Skipping 0 row
Skipping 0 row
Skipping 0 row
Skipping 0 row
Skipping 0 row
Skipping 0 row
Skipping 0 row
Skipping 0 row
Skipping 0 row
Skipping 0 row
Skipping 0 row
Skipping 0 row
Skipping 0 row
Skipping 0 row
Skipping 0 row
Skipping 0 row
Skipping 0 row
Skipping 0 row
Skipping 0 row
Skipping 0 row
Skipping 0 row
Skipping 0 row
Skipping 0 row
Skipping 0 row
Skipping 0 row
Skipping 0 row
Skipping 0 row
Skipping 0 row
Skipping 0 row
Skipping 0 row
Skipping 0 row
Skipping 0 row
Skipping 0 row
Skipping 0 row
Skipping 0 row
Skipping 0 row
Skipping 0 row
Skipping 0 row
Skipping 0 row
Skipping 0 row
Skipping 0 row
Skipping 0 row
Skipping 0 row
Skipping 0 row
Skipping 0 row
Skipping 0 row
Skipping 0 row
Skipping 0 row
Skipping 0 row
Skipping 0 row
Skipping 0 row
Skipping 0 row
Skipping 0 row
Skipping 0 row
Skipping 0 row
Skipping 0 row
Skipping 0 row
Skipping 0 row
Skipping 0 row
Skipping 0 row
Skipping 0 row
Skipping 0 row
Skipping 0 row
Skipping 0 row
Skipping 0 row
Skipping 0 row
Skipping 0 row
Skipping 0 row
Skipping 0 row
Skipping 0 row
Skipping 0 row
Skipping 0 row
Skipping 0 row
Skipping 0 row
Skipping 0 row
Skipping 0 row
Skipping 0 row
Skipping 0 row
Skipping 0 row
Skipping 0 row
Skipping 0 row
Skipping 0 row
Skipping 0 row
Skipping 0 row
Skipping 0 row
Skipping 0 row
Skipping 0 row
Skipping 0 row
Skipping 0 row
Skipping 0 row
Skipping 0 row
Skipping 0 row
Skipping 0 row
Skipping 0 row
Skipping 0 row
Skipping 0 row
Skipping 0 row
Skipping 0 row
Skipping 0 row
Skipping 0 row
Skipping 0 row
Skipping 0 row
Skipping 0 row
Skipping 0 row
Skipping 0 row
Skipping 0 row
Skipping 0 row
Skipping 0 row
Skipping 0 row
Skipping 0 row
Skipping 0 row
Skipping 0 row
Skipping 0 row
Skipping 0 row
Skipping 0 row
Skipping 0 row
Skipping 0 row
Skipping 0 row
Skipping 0 row
Skipping 0 row
Skipping 0 row
Skipping 0 row
Skipping 0 row
Skipping 0 row
Skipping 0 row
Skipping 0 row
Skipping 0 row
Skipping 0 row
Skipping 0 row
Skipping 0 row
Skipping 0 row
Skipping 0 row
Skipping 0 row
Skipping 0 row
Skipping 0 row
Skipping 0 row
Skipping 0 row
Skipping 0 row
Skipping 0 row
Skipping 0 row
Skipping 0 row
Skipping 0 row
Skipping 0 row
Skipping 0 row
Skipping 0 row
Skipping 0 row
Skipping 0 row
Skipping 0 row
Skipping 0 row
Skipping 0 row
Skipping 0 row
Skipping 0 row
Skipping 0 row
Skipping 0 row
Skipping 0 row
Skipping 0 row
Skipping 0 row
Skipping 0 row
Skipping 0 row
Skipping 0 row
Skipping 0 row
Skipping 0 row
Skipping 0 row
Skipping 0 row
Skipping 0 row
Skipping 0 row
Skipping 0 row
Skipping 0 row
Skipping 0 row
Skipping 0 row
Skipping 0 row
Skipping 0 row
Skipping 0 row
Skipping 0 row
Skipping 0 row
Skipping 0 row
Skipping 0 row
Skipping 0 row
Skipping 0 row
Skipping 0 row
Skipping 0 row
Skipping 0 row
Skipping 0 row
Skipping 0 row
Skipping 0 row
Skipping 0 row
Skipping 0 row
Skipping 0 row
Skipping 0 row
Skipping 0 row
Skipping 0 row
Skipping 0 row
Skipping 0 row
Skipping 0 row
Skipping 0 row
Skipping 0 row
Skipping 0 row
Skipping 0 row
Skipping 0 row
Skipping 0 row
Skipping 0 row
Skipping 0 row
Skipping 0 row
Skipping 0 row
Skipping 0 row
Skipping 0 row
Skipping 0 row
Skipping 0 row
Skipping 0 row
Skipping 0 row
Skipping 0 row
Skipping 0 row
Skipping 0 row
Skipping 0 row
Skipping 0 row
Skipping 0 row
Skipping 0 row
Skipping 0 row
Skipping 0 row
Skipping 0 row
Skipping 0 row
Skipping 0 row
Skipping 0 row
Skipping 0 row
Skipping 0 row
Skipping 0 row
Skipping 0 row
Skipping 0 row
Skipping 0 row
Skipping 0 row
Skipping 0 row
Skipping 0 row
Skipping 0 row
Skipping 0 row
Skipping 0 row
Skipping 0 row
Skipping 0 row
Skipping 0 row
Skipping 0 row
Skipping 0 row
Skipping 0 row
Skipping 0 row
Skipping 0 row
Skipping 0 row
Skipping 0 row
Skipping 0 row
Skipping 0 row
Skipping 0 row
Skipping 0 row
Skipping 0 row
Skipping 0 row
Skipping 0 row
Skipping 0 row
Skipping 0 row
Skipping 0 row
Skipping 0 row
Skipping 0 row
Skipping 0 row
Skipping 0 row
Skipping 0 row
Skipping 0 row
Skipping 0 row
Skipping 0 row
Skipping 0 row
Skipping 0 row
Skipping 0 row
Skipping 0 row
Skipping 0 row
Skipping 0 row
Skipping 0 row
Skipping 0 row
Skipping 0 row
Skipping 0 row
Skipping 0 row
Skipping 0 row
Skipping 0 row
Skipping 0 row
Skipping 0 row
Skipping 0 row
Skipping 0 row
Skipping 0 row
Skipping 0 row
Skipping 0 row
Skipping 0 row
Skipping 0 row
Skipping 0 row
Skipping 0 row
Skipping 0 row
Skipping 0 row
Skipping 0 row
Skipping 0 row
Skipping 0 row
Skipping 0 row
Skipping 0 row
Skipping 0 row
Skipping 0 row
Skipping 0 row
Skipping 0 row
Skipping 0 row
Skipping 0 row
Skipping 0 row
Skipping 0 row
Skipping 0 row
Skipping 0 row
Skipping 0 row
Skipping 0 row
Skipping 0 row
Skipping 0 row
Skipping 0 row
Skipping 0 row
Skipping 0 row
Skipping 0 row
Skipping 0 row
Skipping 0 row
Skipping 0 row
Skipping 0 row
Skipping 0 row
Skipping 0 row
Skipping 0 row
Skipping 0 row
Skipping 0 row
Skipping 0 row
Skipping 0 row
Skipping 0 row
Skipping 0 row
Skipping 0 row
Skipping 0 row
Skipping 0 row
Skipping 0 row
Skipping 0 row
Skipping 0 row
Skipping 0 row
Skipping 0 row
Skipping 0 row
Skipping 0 row
Skipping 0 row
Skipping 0 row
Skipping 0 row
Skipping 0 row
Skipping 0 row
Skipping 0 row
Skipping 0 row
Skipping 0 row
Skipping 0 row
Skipping 0 row
Skipping 0 row
Skipping 0 row
Skipping 0 row
Skipping 0 row
Skipping 0 row
Skipping 0 row
Skipping 0 row
Skipping 0 row
Skipping 0 row
Skipping 0 row
Skipping 0 row
Skipping 0 row
Skipping 0 row
Skipping 0 row
Skipping 0 row
Skipping 0 row
Skipping 0 row
Skipping 0 row
Skipping 0 row
Skipping 0 row
Skipping 0 row
Skipping 0 row
Skipping 0 row
Skipping 0 row
Skipping 0 row
Skipping 0 row
Skipping 0 row
Skipping 0 row
Skipping 0 row
Skipping 0 row
Skipping 0 row
Skipping 0 row
Skipping 0 row
Skipping 0 row
Skipping 0 row
Skipping 0 row
Skipping 0 row
Skipping 0 row
Skipping 0 row
Skipping 0 row
Skipping 0 row
Skipping 0 row
Skipping 0 row
Skipping 0 row
Skipping 0 row
Skipping 0 row
Skipping 0 row
Skipping 0 row
Skipping 0 row
Skipping 0 row
Skipping 0 row
Skipping 0 row
Skipping 0 row
Skipping 0 row
Skipping 0 row
Skipping 0 row
Skipping 0 row
Skipping 0 row
Skipping 0 row
Skipping 0 row
Skipping 0 row
Skipping 0 row
Skipping 0 row
Skipping 0 row
Skipping 0 row
Skipping 0 row
Skipping 0 row
Skipping 0 row
Skipping 0 row
Skipping 0 row
Skipping 0 row
Skipping 0 row
Skipping 0 row
Skipping 0 row
Skipping 0 row
Skipping 0 row
Skipping 0 row
Skipping 0 row
Skipping 0 row
Skipping 0 row
Skipping 0 row
Skipping 0 row
Skipping 0 row
Skipping 0 row
Skipping 0 row
Skipping 0 row
Skipping 0 row
Skipping 0 row
Skipping 0 row
Skipping 0 row
Skipping 0 row
Skipping 0 row
Skipping 0 row
Skipping 0 row
Skipping 0 row
Skipping 0 row
Skipping 0 row
Skipping 0 row
Skipping 0 row
Skipping 0 row
Skipping 0 row
Skipping 0 row
Skipping 0 row
Skipping 0 row
Skipping 0 row
Skipping 0 row
Skipping 0 row
Skipping 0 row
Skipping 0 row
Skipping 0 row
Skipping 0 row
Skipping 0 row
Skipping 0 row
Skipping 0 row
Skipping 0 row
Skipping 0 row
Skipping 0 row
Skipping 0 row
Skipping 0 row
Skipping 0 row
Skipping 0 row
Skipping 0 row
Skipping 0 row
Skipping 0 row
Skipping 0 row
Skipping 0 row
Skipping 0 row
Skipping 0 row
Skipping 0 row
Skipping 0 row
Skipping 0 row
Skipping 0 row
Skipping 0 row
Skipping 0 row
Skipping 0 row
Skipping 0 row
Skipping 0 row
Skipping 0 row
Skipping 0 row
Skipping 0 row
Skipping 0 row
Skipping 0 row
Skipping 0 row
Skipping 0 row
Skipping 0 row
Skipping 0 row
Skipping 0 row
Skipping 0 row
Skipping 0 row
Skipping 0 row
Skipping 0 row
Skipping 0 row
Skipping 0 row
Skipping 0 row
Skipping 0 row
Skipping 0 row
Skipping 0 row
Skipping 0 row
Skipping 0 row
Skipping 0 row
Skipping 0 row
Skipping 0 row
Skipping 0 row
Skipping 0 row
Skipping 0 row
Skipping 0 row
Skipping 0 row
Skipping 0 row
Skipping 0 row
Skipping 0 row
Skipping 0 row
Skipping 0 row
Skipping 0 row
Skipping 0 row
Skipping 0 row
Skipping 0 row
Skipping 0 row
Skipping 0 row
Skipping 0 row
Skipping 0 row
Skipping 0 row
Skipping 0 row
Skipping 0 row
Skipping 0 row
Skipping 0 row
Skipping 0 row
Skipping 0 row
Skipping 0 row
Skipping 0 row
Skipping 0 row
Skipping 0 row
Skipping 0 row
Skipping 0 row
Skipping 0 row
Skipping 0 row
Skipping 0 row
Skipping 0 row
Skipping 0 row
Skipping 0 row
Skipping 0 row
Skipping 0 row
Skipping 0 row
Skipping 0 row
Skipping 0 row
Skipping 0 row
Skipping 0 row
Skipping 0 row
Skipping 0 row
Skipping 0 row
Skipping 0 row
Skipping 0 row
Skipping 0 row
Skipping 0 row
Skipping 0 row
Skipping 0 row
Skipping 0 row
Skipping 0 row
Skipping 0 row
Skipping 0 row
Skipping 0 row
Skipping 0 row
Skipping 0 row
Skipping 0 row
Skipping 0 row
Skipping 0 row
Skipping 0 row
Skipping 0 row
Skipping 0 row
Skipping 0 row
Skipping 0 row
Skipping 0 row
Skipping 0 row
Skipping 0 row
Skipping 0 row
Skipping 0 row
Skipping 0 row
Skipping 0 row
Skipping 0 row
Skipping 0 row
Skipping 0 row
Skipping 0 row
Skipping 0 row
Skipping 0 row
Skipping 0 row
Skipping 0 row
Skipping 0 row
Skipping 0 row
Skipping 0 row
Skipping 0 row
Skipping 0 row
Skipping 0 row
Skipping 0 row
Skipping 0 row
Skipping 0 row
Skipping 0 row
Skipping 0 row
Skipping 0 row
Skipping 0 row
Skipping 0 row
Skipping 0 row
Skipping 0 row
Skipping 0 row
Skipping 0 row
Skipping 0 row
Skipping 0 row
Skipping 0 row
Skipping 0 row
Skipping 0 row
Skipping 0 row
Skipping 0 row
Skipping 0 row
Skipping 0 row
Skipping 0 row
Skipping 0 row
Skipping 0 row
Skipping 0 row
Skipping 0 row
Skipping 0 row
Skipping 0 row
Skipping 0 row
Skipping 0 row
Skipping 0 row
Skipping 0 row
Skipping 0 row
Skipping 0 row
Skipping 0 row
Skipping 0 row
Skipping 0 row
Skipping 0 row
Skipping 0 row
Skipping 0 row
Skipping 0 row
Skipping 0 row
Skipping 0 row
Skipping 0 row
Skipping 0 row
Skipping 0 row
Skipping 0 row
Skipping 0 row
Skipping 0 row
Skipping 0 row
Skipping 0 row
Skipping 0 row
Skipping 0 row
Skipping 0 row
Skipping 0 row
Skipping 0 row
Skipping 0 row
Skipping 0 row
Skipping 0 row
Skipping 0 row
Skipping 0 row
Skipping 0 row
Skipping 0 row
Skipping 0 row
Skipping 0 row
Skipping 0 row
Skipping 0 row
Skipping 0 row
Skipping 0 row
Skipping 0 row
Skipping 0 row
Skipping 0 row
Skipping 0 row
Skipping 0 row
Skipping 0 row
Skipping 0 row
Skipping 0 row
Skipping 0 row
Skipping 0 row
Skipping 0 row
Skipping 0 row
Skipping 0 row
Skipping 0 row
Skipping 0 row
Skipping 0 row
Skipping 0 row
Skipping 0 row
Skipping 0 row
Skipping 0 row
Skipping 0 row
Skipping 0 row
Skipping 0 row
Skipping 0 row
Skipping 0 row
Skipping 0 row
Skipping 0 row
Skipping 0 row
Skipping 0 row
Skipping 0 row
Skipping 0 row
Skipping 0 row
Skipping 0 row
Skipping 0 row
Skipping 0 row
Skipping 0 row
Skipping 0 row
Skipping 0 row
Skipping 0 row
Skipping 0 row
Skipping 0 row
Skipping 0 row
Skipping 0 row
Skipping 0 row
Skipping 0 row
Skipping 0 row
Skipping 0 row
Skipping 0 row
Skipping 0 row
Skipping 0 row
Skipping 0 row
Skipping 0 row
Skipping 0 row
Skipping 0 row
Skipping 0 row
Skipping 0 row
Skipping 0 row
Skipping 0 row
Skipping 0 row
Skipping 0 row
Skipping 0 row
Skipping 0 row
Skipping 0 row
Skipping 0 row
Skipping 0 row
Skipping 0 row
Skipping 0 row
Skipping 0 row
Skipping 0 row
Skipping 0 row
Skipping 0 row
Skipping 0 row
Skipping 0 row
Skipping 0 row
Skipping 0 row
Skipping 0 row
Skipping 0 row
Skipping 0 row
Skipping 0 row
Skipping 0 row
Skipping 0 row
Skipping 0 row
Skipping 0 row
Skipping 0 row
Skipping 0 row
Skipping 0 row
Skipping 0 row
Skipping 0 row
Skipping 0 row
Skipping 0 row
Skipping 0 row
Skipping 0 row
Skipping 0 row
Skipping 0 row
Skipping 0 row
Skipping 0 row
Skipping 0 row
Skipping 0 row
Skipping 0 row
Skipping 0 row
Skipping 0 row
Skipping 0 row
Skipping 0 row
Skipping 0 row
Skipping 0 row
Skipping 0 row
Skipping 0 row
Skipping 0 row
Skipping 0 row
Skipping 0 row
Skipping 0 row
Skipping 0 row
Skipping 0 row
Skipping 0 row
Skipping 0 row
Skipping 0 row
Skipping 0 row
Skipping 0 row
Skipping 0 row
Skipping 0 row
Skipping 0 row
Skipping 0 row
Skipping 0 row
Skipping 0 row
Skipping 0 row
Skipping 0 row
Skipping 0 row
Skipping 0 row
Skipping 0 row
Skipping 0 row
Skipping 0 row
Skipping 0 row
Skipping 0 row
Skipping 0 row
Skipping 0 row
Skipping 0 row
Skipping 0 row
Skipping 0 row
Skipping 0 row
Skipping 0 row
Skipping 0 row
Skipping 0 row
Skipping 0 row
Skipping 0 row
Skipping 0 row
Skipping 0 row
Skipping 0 row
Skipping 0 row
Skipping 0 row
Skipping 0 row
Skipping 0 row
Skipping 0 row
Skipping 0 row
Skipping 0 row
Skipping 0 row
Skipping 0 row
Skipping 0 row
Skipping 0 row
Skipping 0 row
Skipping 0 row
Skipping 0 row
Skipping 0 row
Skipping 0 row
Skipping 0 row
Skipping 0 row
Skipping 0 row
Skipping 0 row
Skipping 0 row
Skipping 0 row
Skipping 0 row
Skipping 0 row
Skipping 0 row
Skipping 0 row
Skipping 0 row
Skipping 0 row
Skipping 0 row
Skipping 0 row
Skipping 0 row
Skipping 0 row
Skipping 0 row
Skipping 0 row
Skipping 0 row
Skipping 0 row
Skipping 0 row
Skipping 0 row
Skipping 0 row
Skipping 0 row
Skipping 0 row
Skipping 0 row
Skipping 0 row
Skipping 0 row
Skipping 0 row
Skipping 0 row
Skipping 0 row
Skipping 0 row
Skipping 0 row
Skipping 0 row
Skipping 0 row
Skipping 0 row
Skipping 0 row
Skipping 0 row
Skipping 0 row
Skipping 0 row
Skipping 0 row
Skipping 0 row
Skipping 0 row
Skipping 0 row
Skipping 0 row
Skipping 0 row
Skipping 0 row
Skipping 0 row
Skipping 0 row
Skipping 0 row
Skipping 0 row
Skipping 0 row
Skipping 0 row
Skipping 0 row
Skipping 0 row
Skipping 0 row
Skipping 0 row
Skipping 0 row
Skipping 0 row
Skipping 0 row
Skipping 0 row
Skipping 0 row
Skipping 0 row
Skipping 0 row
Skipping 0 row
Skipping 0 row
Skipping 0 row
Skipping 0 row
Skipping 0 row
Skipping 0 row
Skipping 0 row
Skipping 0 row
Skipping 0 row
Skipping 0 row
Skipping 0 row
Skipping 0 row
Skipping 0 row
Skipping 0 row
Skipping 0 row
Skipping 0 row
Skipping 0 row
Skipping 0 row
Skipping 0 row
Skipping 0 row
Skipping 0 row
Skipping 0 row
Skipping 0 row
Skipping 0 row
Skipping 0 row
Skipping 0 row
Skipping 0 row
Skipping 0 row
Skipping 0 row
Skipping 0 row
Skipping 0 row
Skipping 0 row
Skipping 0 row
Skipping 0 row
Skipping 0 row
Skipping 0 row
Skipping 0 row
Skipping 0 row
Skipping 0 row
Skipping 0 row
Skipping 0 row
Skipping 0 row
Skipping 0 row
Skipping 0 row
Skipping 0 row
Skipping 0 row
Skipping 0 row
Skipping 0 row
Skipping 0 row
Skipping 0 row
Skipping 0 row
Skipping 0 row
Skipping 0 row
Skipping 0 row
Skipping 0 row
Skipping 0 row
Skipping 0 row
Skipping 0 row
Skipping 0 row
Skipping 0 row
Skipping 0 row
Skipping 0 row
Skipping 0 row
Skipping 0 row
Skipping 0 row
Skipping 0 row
Skipping 0 row
Skipping 0 row
Skipping 0 row
Skipping 0 row
Skipping 0 row
Skipping 0 row
Skipping 0 row
Skipping 0 row
Skipping 0 row
Skipping 0 row
Skipping 0 row
Skipping 0 row
Skipping 0 row
Skipping 0 row
Skipping 0 row
Skipping 0 row
Skipping 0 row
Skipping 0 row
Skipping 0 row
Skipping 0 row
Skipping 0 row
Skipping 0 row
Skipping 0 row
Skipping 0 row
Skipping 0 row
Skipping 0 row
Skipping 0 row
Skipping 0 row
Skipping 0 row
Skipping 0 row
Skipping 0 row
Skipping 0 row
Skipping 0 row
Skipping 0 row
Skipping 0 row
Skipping 0 row
Skipping 0 row
Skipping 0 row
Skipping 0 row
Skipping 0 row
Skipping 0 row
Skipping 0 row
Skipping 0 row
Skipping 0 row
Skipping 0 row
Skipping 0 row
Skipping 0 row
Skipping 0 row
Skipping 0 row
Skipping 0 row
Skipping 0 row
Skipping 0 row
Skipping 0 row
Skipping 0 row
Skipping 0 row
Skipping 0 row
Skipping 0 row
Skipping 0 row
Skipping 0 row
Skipping 0 row
Skipping 0 row
Skipping 0 row
Skipping 0 row
Skipping 0 row
Skipping 0 row
Skipping 0 row
Skipping 0 row
Skipping 0 row
Skipping 0 row
Skipping 0 row
Skipping 0 row
Skipping 0 row
Skipping 0 row
Skipping 0 row
Skipping 0 row
Skipping 0 row
Skipping 0 row
Skipping 0 row
Skipping 0 row
Skipping 0 row
Skipping 0 row
Skipping 0 row
Skipping 0 row
Skipping 0 row
Skipping 0 row
Skipping 0 row
Skipping 0 row
Skipping 0 row
Skipping 0 row
Skipping 0 row
Skipping 0 row
Skipping 0 row
Skipping 0 row
Skipping 0 row
Skipping 0 row
Skipping 0 row
Skipping 0 row
Skipping 0 row
Skipping 0 row
Skipping 0 row
Skipping 0 row
Skipping 0 row
Skipping 0 row
Skipping 0 row
Skipping 0 row
Skipping 0 row
Skipping 0 row
Skipping 0 row
Skipping 0 row
Skipping 0 row
Skipping 0 row
Skipping 0 row
Skipping 0 row
Skipping 0 row
Skipping 0 row
Skipping 0 row
Skipping 0 row
Skipping 0 row
Skipping 0 row
Skipping 0 row
Skipping 0 row
Skipping 0 row
Skipping 0 row
Skipping 0 row
Skipping 0 row
Skipping 0 row
Skipping 0 row
Skipping 0 row
Skipping 0 row
Skipping 0 row
Skipping 0 row
Skipping 0 row
Skipping 0 row
Skipping 0 row
Skipping 0 row
Skipping 0 row
Skipping 0 row
Skipping 0 row
Skipping 0 row
Skipping 0 row
Skipping 0 row
Skipping 0 row
Skipping 0 row
Skipping 0 row
Skipping 0 row
Skipping 0 row
Skipping 0 row
Skipping 0 row
Skipping 0 row
Skipping 0 row
Skipping 0 row
Skipping 0 row
Skipping 0 row
Skipping 0 row
Skipping 0 row
Skipping 0 row
Skipping 0 row
Skipping 0 row
Skipping 0 row
Skipping 0 row
Skipping 0 row
Skipping 0 row
Skipping 0 row
Skipping 0 row
Skipping 0 row
Skipping 0 row
Skipping 0 row
Skipping 0 row
Skipping 0 row
Skipping 0 row
Skipping 0 row
Skipping 0 row
Skipping 0 row
Skipping 0 row
Skipping 0 row
Skipping 0 row
Skipping 0 row
Skipping 0 row
Skipping 0 row
Skipping 0 row
Skipping 0 row
Skipping 0 row
Skipping 0 row
Skipping 0 row
Skipping 0 row
Skipping 0 row
Skipping 0 row
Skipping 0 row
Skipping 0 row
Skipping 0 row
Skipping 0 row
Skipping 0 row
Skipping 0 row
Skipping 0 row
Skipping 0 row
Skipping 0 row
Skipping 0 row
Skipping 0 row
Skipping 0 row
Skipping 0 row
Skipping 0 row
Skipping 0 row
Skipping 0 row
Skipping 0 row
Skipping 0 row
Skipping 0 row
Skipping 0 row
Skipping 0 row
Skipping 0 row
Skipping 0 row
Skipping 0 row
Skipping 0 row
Skipping 0 row
Skipping 0 row
Skipping 0 row
Skipping 0 row
Skipping 0 row
Skipping 0 row
Skipping 0 row
Skipping 0 row
Skipping 0 row
Skipping 0 row
Skipping 0 row
Skipping 0 row
Skipping 0 row
Skipping 0 row
Skipping 0 row
Skipping 0 row
Skipping 0 row
Skipping 0 row
Skipping 0 row
Skipping 0 row
Skipping 0 row
Skipping 0 row
Skipping 0 row
Skipping 0 row
Skipping 0 row
Skipping 0 row
Skipping 0 row
Skipping 0 row
Skipping 0 row
Skipping 0 row
Skipping 0 row
Skipping 0 row
Skipping 0 row
Skipping 0 row
Skipping 0 row
Skipping 0 row
Skipping 0 row
Skipping 0 row
Skipping 0 row
Skipping 0 row
Skipping 0 row
Skipping 0 row
Skipping 0 row
Skipping 0 row
Skipping 0 row
Skipping 0 row
Skipping 0 row
Skipping 0 row
Skipping 0 row
Skipping 0 row
Skipping 0 row
Skipping 0 row
Skipping 0 row
Skipping 0 row
Skipping 0 row
Skipping 0 row
Skipping 0 row
Skipping 0 row
Skipping 0 row
Skipping 0 row
Skipping 0 row
Skipping 0 row
Skipping 0 row
Skipping 0 row
Skipping 0 row
Skipping 0 row
Skipping 0 row
Skipping 0 row
Skipping 0 row
Skipping 0 row
Skipping 0 row
Skipping 0 row
Skipping 0 row
Skipping 0 row
Skipping 0 row
Skipping 0 row
Skipping 0 row
Skipping 0 row
Skipping 0 row
Skipping 0 row
Skipping 0 row
Skipping 0 row
Skipping 0 row
Skipping 0 row
Skipping 0 row
Skipping 0 row
Skipping 0 row
Skipping 0 row
Skipping 0 row
Skipping 0 row
Skipping 0 row
Skipping 0 row
Skipping 0 row
Skipping 0 row
Skipping 0 row
Skipping 0 row
Skipping 0 row
Skipping 0 row
Skipping 0 row
Skipping 0 row
Skipping 0 row
Skipping 0 row
Skipping 0 row
Skipping 0 row
Skipping 0 row
Skipping 0 row
Skipping 0 row
Skipping 0 row
Skipping 0 row
Skipping 0 row
Skipping 0 row
Skipping 0 row
Skipping 0 row
Skipping 0 row
Skipping 0 row
Skipping 0 row
Skipping 0 row
Skipping 0 row
Skipping 0 row
Skipping 0 row
Skipping 0 row
Skipping 0 row
Skipping 0 row
Skipping 0 row
Skipping 0 row
Skipping 0 row
Skipping 0 row
Skipping 0 row
Skipping 0 row
Skipping 0 row
Skipping 0 row
Skipping 0 row
Skipping 0 row
Skipping 0 row
Skipping 0 row
Skipping 0 row
Skipping 0 row
Skipping 0 row
Skipping 0 row
Skipping 0 row
Skipping 0 row
Skipping 0 row
Skipping 0 row
Skipping 0 row
Skipping 0 row
Skipping 0 row
Skipping 0 row
Skipping 0 row
Skipping 0 row
Skipping 0 row
Skipping 0 row
Skipping 0 row
Skipping 0 row
Skipping 0 row
Skipping 0 row
Skipping 0 row
Skipping 0 row
Skipping 0 row
Skipping 0 row
Skipping 0 row
Skipping 0 row
Skipping 0 row
Skipping 0 row
Skipping 0 row
Skipping 0 row
Skipping 0 row
Skipping 0 row
Skipping 0 row
Skipping 0 row
Skipping 0 row
Skipping 0 row
Skipping 0 row
Skipping 0 row
Skipping 0 row
Skipping 0 row
Skipping 0 row
Skipping 0 row
Skipping 0 row
Skipping 0 row
Skipping 0 row
Skipping 0 row
Skipping 0 row
Skipping 0 row
Skipping 0 row
Skipping 0 row
Skipping 0 row
Skipping 0 row
Skipping 0 row
Skipping 0 row
Skipping 0 row
Skipping 0 row
Skipping 0 row
Skipping 0 row
Skipping 0 row
Skipping 0 row
Skipping 0 row
Skipping 0 row
Skipping 0 row
Skipping 0 row
Skipping 0 row
Skipping 0 row
Skipping 0 row
Skipping 0 row
Skipping 0 row
Skipping 0 row
Skipping 0 row
Skipping 0 row
Skipping 0 row
Skipping 0 row
Skipping 0 row
Skipping 0 row
Skipping 0 row
Skipping 0 row
Skipping 0 row
Skipping 0 row
Skipping 0 row
Skipping 0 row
Skipping 0 row
Skipping 0 row
Skipping 0 row
Skipping 0 row
Skipping 0 row
Skipping 0 row
Skipping 0 row
Skipping 0 row
Skipping 0 row
Skipping 0 row
Skipping 0 row
Skipping 0 row
Skipping 0 row
Skipping 0 row
Skipping 0 row
Skipping 0 row
Skipping 0 row
Skipping 0 row
Skipping 0 row
Skipping 0 row
Skipping 0 row
Skipping 0 row
Skipping 0 row
Skipping 0 row
Skipping 0 row
Skipping 0 row
Skipping 0 row
Skipping 0 row
Skipping 0 row
Skipping 0 row
Skipping 0 row
Skipping 0 row
Skipping 0 row
Skipping 0 row
Skipping 0 row
Skipping 0 row
Skipping 0 row
Skipping 0 row
Skipping 0 row
Skipping 0 row
Skipping 0 row
Skipping 0 row
Skipping 0 row
Skipping 0 row
Skipping 0 row
Skipping 0 row
Skipping 0 row
Skipping 0 row
Skipping 0 row
Skipping 0 row
Skipping 0 row
Skipping 0 row
Skipping 0 row
Skipping 0 row
Skipping 0 row
Skipping 0 row
Skipping 0 row
Skipping 0 row
Skipping 0 row
Skipping 0 row
Skipping 0 row
Skipping 0 row
Skipping 0 row
Skipping 0 row
Skipping 0 row
Skipping 0 row
Skipping 0 row
Skipping 0 row
Skipping 0 row
Skipping 0 row
Skipping 0 row
Skipping 0 row
Skipping 0 row
Skipping 0 row
Skipping 0 row
Skipping 0 row
Skipping 0 row
Skipping 0 row
Skipping 0 row
Skipping 0 row
Skipping 0 row
Skipping 0 row
Skipping 0 row
Skipping 0 row
Skipping 0 row
Skipping 0 row
Skipping 0 row
Skipping 0 row
Skipping 0 row
Skipping 0 row
Skipping 0 row
Skipping 0 row
Skipping 0 row
Skipping 0 row
Skipping 0 row
Skipping 0 row
Skipping 0 row
Skipping 0 row
Skipping 0 row
Skipping 0 row
Skipping 0 row
Skipping 0 row
Skipping 0 row
Skipping 0 row
Skipping 0 row
Skipping 0 row
Skipping 0 row
Skipping 0 row
Skipping 0 row
Skipping 0 row
Skipping 0 row
Skipping 0 row
Skipping 0 row
Skipping 0 row
Skipping 0 row
Skipping 0 row
Skipping 0 row
Skipping 0 row
Skipping 0 row
Skipping 0 row
Skipping 0 row
Skipping 0 row
Skipping 0 row
Skipping 0 row
Skipping 0 row
Skipping 0 row
Skipping 0 row
Skipping 0 row
Skipping 0 row
Skipping 0 row
Skipping 0 row
Skipping 0 row
Skipping 0 row
Skipping 0 row
Skipping 0 row
Skipping 0 row
Skipping 0 row
Skipping 0 row
Skipping 0 row
Skipping 0 row
Skipping 0 row
Skipping 0 row
Skipping 0 row
Skipping 0 row
Skipping 0 row
Skipping 0 row
Skipping 0 row
Skipping 0 row
Skipping 0 row
Skipping 0 row
Skipping 0 row
Skipping 0 row
Skipping 0 row
Skipping 0 row
Skipping 0 row
Skipping 0 row
Skipping 0 row
Skipping 0 row
Skipping 0 row
Skipping 0 row
Skipping 0 row
Skipping 0 row
Skipping 0 row
Skipping 0 row
Skipping 0 row
Skipping 0 row
Skipping 0 row
Skipping 0 row
Skipping 0 row
Skipping 0 row
Skipping 0 row
Skipping 0 row
Skipping 0 row
Skipping 0 row
Skipping 0 row
Skipping 0 row
Skipping 0 row
Skipping 0 row
Skipping 0 row
Skipping 0 row
Skipping 0 row
Skipping 0 row
Skipping 0 row
Skipping 0 row
Skipping 0 row
Skipping 0 row
Skipping 0 row
Skipping 0 row
Skipping 0 row
Skipping 0 row
Skipping 0 row
Skipping 0 row
Skipping 0 row
Skipping 0 row
Skipping 0 row
Skipping 0 row
Skipping 0 row
Skipping 0 row
Skipping 0 row
Skipping 0 row
Skipping 0 row
Skipping 0 row
Skipping 0 row
Skipping 0 row
Skipping 0 row
Skipping 0 row
Skipping 0 row
Skipping 0 row
Skipping 0 row
Skipping 0 row
Skipping 0 row
Skipping 0 row
Skipping 0 row
Skipping 0 row
Skipping 0 row
Skipping 0 row
Skipping 0 row
Skipping 0 row
Skipping 0 row
Skipping 0 row
Skipping 0 row
Skipping 0 row
Skipping 0 row
Skipping 0 row
Skipping 0 row
Skipping 0 row
Skipping 0 row
Skipping 0 row
Skipping 0 row
Skipping 0 row
Skipping 0 row
Skipping 0 row
Skipping 0 row
Skipping 0 row
Skipping 0 row
Skipping 0 row
Skipping 0 row
Skipping 0 row
Skipping 0 row
Skipping 0 row
Skipping 0 row
Skipping 0 row
Skipping 0 row
Skipping 0 row
Skipping 0 row
Skipping 0 row
Skipping 0 row
Skipping 0 row
Skipping 0 row
Skipping 0 row
Skipping 0 row
Skipping 0 row
Skipping 0 row
Skipping 0 row
Skipping 0 row
Skipping 0 row
Skipping 0 row
Skipping 0 row
Skipping 0 row
Skipping 0 row
Skipping 0 row
Skipping 0 row
Skipping 0 row
Skipping 0 row
Skipping 0 row
Skipping 0 row
Skipping 0 row
Skipping 0 row
Skipping 0 row
Skipping 0 row
Skipping 0 row
Skipping 0 row
Skipping 0 row
Skipping 0 row
Skipping 0 row
Skipping 0 row
Skipping 0 row
Skipping 0 row
Skipping 0 row
Skipping 0 row
Skipping 0 row
Skipping 0 row
Skipping 0 row
Skipping 0 row
Skipping 0 row
Skipping 0 row
Skipping 0 row
Skipping 0 row
Skipping 0 row
Skipping 0 row
Skipping 0 row
Skipping 0 row
Skipping 0 row
Skipping 0 row
Skipping 0 row
Skipping 0 row
Skipping 0 row
Skipping 0 row
Skipping 0 row
Skipping 0 row
Skipping 0 row
Skipping 0 row
Skipping 0 row
Skipping 0 row
Skipping 0 row
Skipping 0 row
Skipping 0 row
Skipping 0 row
Skipping 0 row
Skipping 0 row
Skipping 0 row
Skipping 0 row
Skipping 0 row
Skipping 0 row
Skipping 0 row
Skipping 0 row
Skipping 0 row
Skipping 0 row
Skipping 0 row
Skipping 0 row
Skipping 0 row
Skipping 0 row
Skipping 0 row
Skipping 0 row
Skipping 0 row
Skipping 0 row
Skipping 0 row
Skipping 0 row
Skipping 0 row
Refined: 66 | Refine Limit: 14 | Wrong: 0 | Right: 104 | Total: 104 | Total Zonos Considered: 170 | Expected 828 (12.560386473429952%)Skipping 0 row
Skipping 0 row
Skipping 0 row
Skipping 0 row
Skipping 0 row
Skipping 0 row
Skipping 0 row
Skipping 0 row
Skipping 0 row
Skipping 0 row
Skipping 0 row
Skipping 0 row
Skipping 0 row
Skipping 0 row
Skipping 0 row
Skipping 0 row
Skipping 0 row
Skipping 0 row
Skipping 0 row
Skipping 0 row
Skipping 0 row
Skipping 0 row
Skipping 0 row
Skipping 0 row
Skipping 0 row
Skipping 0 row
Skipping 0 row
Skipping 0 row
Skipping 0 row
Skipping 0 row
Skipping 0 row
Skipping 0 row
Skipping 0 row
Skipping 0 row
Skipping 0 row
Skipping 0 row
Skipping 0 row
Skipping 0 row
Skipping 0 row
Skipping 0 row
Skipping 0 row
Skipping 0 row
Skipping 0 row
Skipping 0 row
Skipping 0 row
Skipping 0 row
Skipping 0 row
Skipping 0 row
Skipping 0 row
Skipping 0 row
Skipping 0 row
Skipping 0 row
Skipping 0 row
Skipping 0 row
Skipping 0 row
Skipping 0 row
Skipping 0 row
Skipping 0 row
Skipping 0 row
Skipping 0 row
Skipping 0 row
Skipping 0 row
Skipping 0 row
Skipping 0 row
Skipping 0 row
Skipping 0 row
Skipping 0 row
Skipping 0 row
Skipping 0 row
Skipping 0 row
Skipping 0 row
Skipping 0 row
Skipping 0 row
Skipping 0 row
Skipping 0 row
Skipping 0 row
Skipping 0 row
Skipping 0 row
Skipping 0 row
Skipping 0 row
Skipping 0 row
Skipping 0 row
Skipping 0 row
Skipping 0 row
Skipping 0 row
Skipping 0 row
Skipping 0 row
Skipping 0 row
Skipping 0 row
Skipping 0 row
Skipping 0 row
Skipping 0 row
Skipping 0 row
Skipping 0 row
Skipping 0 row
Skipping 0 row
Skipping 0 row
Skipping 0 row
Skipping 0 row
Skipping 0 row
Skipping 0 row
Skipping 0 row
Skipping 0 row
Skipping 0 row
Skipping 0 row
Skipping 0 row
Skipping 0 row
Skipping 0 row
Skipping 0 row
Skipping 0 row
Skipping 0 row
Skipping 0 row
Skipping 0 row
Skipping 0 row
Skipping 0 row
Skipping 0 row
Skipping 0 row
Skipping 0 row
Skipping 0 row
Skipping 0 row
Skipping 0 row
Skipping 0 row
Skipping 0 row
Skipping 0 row
Skipping 0 row
Skipping 0 row
Skipping 0 row
Skipping 0 row
Skipping 0 row
Skipping 0 row
Skipping 0 row
Skipping 0 row
Skipping 0 row
Skipping 0 row
Skipping 0 row
Skipping 0 row
Skipping 0 row
Skipping 0 row
Skipping 0 row
Skipping 0 row
Skipping 0 row
Skipping 0 row
Skipping 0 row
Skipping 0 row
Skipping 0 row
Skipping 0 row
Skipping 0 row
Skipping 0 row
Skipping 0 row
Skipping 0 row
Skipping 0 row
Skipping 0 row
Skipping 0 row
Skipping 0 row
Skipping 0 row
Skipping 0 row
Skipping 0 row
Skipping 0 row
Skipping 0 row
Skipping 0 row
Skipping 0 row
Skipping 0 row
Skipping 0 row
Skipping 0 row
Skipping 0 row
Skipping 0 row
Skipping 0 row
Skipping 0 row
Skipping 0 row
Skipping 0 row
Skipping 0 row
Skipping 0 row
Skipping 0 row
Skipping 0 row
Skipping 0 row
Skipping 0 row
Skipping 0 row
Skipping 0 row
Skipping 0 row
Skipping 0 row
Skipping 0 row
Skipping 0 row
Skipping 0 row
Skipping 0 row
Skipping 0 row
Skipping 0 row
Skipping 0 row
Skipping 0 row
Skipping 0 row
Skipping 0 row
Skipping 0 row
Skipping 0 row
Skipping 0 row
Skipping 0 row
Skipping 0 row
Skipping 0 row
Skipping 0 row
Skipping 0 row
Skipping 0 row
Skipping 0 row
Skipping 0 row
Skipping 0 row
Skipping 0 row
Skipping 0 row
Skipping 0 row
Skipping 0 row
Skipping 0 row
Skipping 0 row
Skipping 0 row
Skipping 0 row
Skipping 0 row
Skipping 0 row
Skipping 0 row
Skipping 0 row
Skipping 0 row
Skipping 0 row
Skipping 0 row
Skipping 0 row
Skipping 0 row
Skipping 0 row
Skipping 0 row
Skipping 0 row
Skipping 0 row
Skipping 0 row
Skipping 0 row
Skipping 0 row
Skipping 0 row
Skipping 0 row
Skipping 0 row
Skipping 0 row
Skipping 0 row
Skipping 0 row
Skipping 0 row
Skipping 0 row
Skipping 0 row
Skipping 0 row
Skipping 0 row
Skipping 0 row
Skipping 0 row
Skipping 0 row
Skipping 0 row
Skipping 0 row
Skipping 0 row
Skipping 0 row
Skipping 0 row
Skipping 0 row
Skipping 0 row
Skipping 0 row
Skipping 0 row
Skipping 0 row
Skipping 0 row
Skipping 0 row
Skipping 0 row
Skipping 0 row
Skipping 0 row
Skipping 0 row
Skipping 0 row
Skipping 0 row
Skipping 0 row
Skipping 0 row
Skipping 0 row
Skipping 0 row
Skipping 0 row
Skipping 0 row
Skipping 0 row
Skipping 0 row
Skipping 0 row
Skipping 0 row
Skipping 0 row
Skipping 0 row
Skipping 0 row
Skipping 0 row
Skipping 0 row
Skipping 0 row
Skipping 0 row
Skipping 0 row
Skipping 0 row
Skipping 0 row
Skipping 0 row
Skipping 0 row
Skipping 0 row
Skipping 0 row
Skipping 0 row
Skipping 0 row
Skipping 0 row
Skipping 0 row
Skipping 0 row
Skipping 0 row
Skipping 0 row
Skipping 0 row
Skipping 0 row
Skipping 0 row
Skipping 0 row
Skipping 0 row
Skipping 0 row
Skipping 0 row
Skipping 0 row
Skipping 0 row
Skipping 0 row
Skipping 0 row
Skipping 0 row
Skipping 0 row
Skipping 0 row
Skipping 0 row
Skipping 0 row
Skipping 0 row
Skipping 0 row
Skipping 0 row
Skipping 0 row
Skipping 0 row
Skipping 0 row
Skipping 0 row
Skipping 0 row
Skipping 0 row
Skipping 0 row
Skipping 0 row
Skipping 0 row
Skipping 0 row
Skipping 0 row
Skipping 0 row
Skipping 0 row
Skipping 0 row
Skipping 0 row
Skipping 0 row
Skipping 0 row
Skipping 0 row
Skipping 0 row
Skipping 0 row
Skipping 0 row
Skipping 0 row
Skipping 0 row
Skipping 0 row
Skipping 0 row
Skipping 0 row
Skipping 0 row
Skipping 0 row
Skipping 0 row
Skipping 0 row
Skipping 0 row
Skipping 0 row
Skipping 0 row
Skipping 0 row
Skipping 0 row
Skipping 0 row
Skipping 0 row
Skipping 0 row
Skipping 0 row
Skipping 0 row
Skipping 0 row
Skipping 0 row
Skipping 0 row
Skipping 0 row
Skipping 0 row
Skipping 0 row
Skipping 0 row
Skipping 0 row
Skipping 0 row
Skipping 0 row
Skipping 0 row
Skipping 0 row
Skipping 0 row
Skipping 0 row
Skipping 0 row
Skipping 0 row
Skipping 0 row
Skipping 0 row
Skipping 0 row
Skipping 0 row
Skipping 0 row
Skipping 0 row
Skipping 0 row
Skipping 0 row
Skipping 0 row
Skipping 0 row
Skipping 0 row
Skipping 0 row
Skipping 0 row
Skipping 0 row
Skipping 0 row
Skipping 0 row
Skipping 0 row
Skipping 0 row
Skipping 0 row
Skipping 0 row
Skipping 0 row
Skipping 0 row
Skipping 0 row
Skipping 0 row
Skipping 0 row
Skipping 0 row
Skipping 0 row
Skipping 0 row
Skipping 0 row
Skipping 0 row
Skipping 0 row
Skipping 0 row
Skipping 0 row
Skipping 0 row
Skipping 0 row
Skipping 0 row
Skipping 0 row
Skipping 0 row
Skipping 0 row
Skipping 0 row
Skipping 0 row
Skipping 0 row
Skipping 0 row
Skipping 0 row
Skipping 0 row
Skipping 0 row
Skipping 0 row
Skipping 0 row
Skipping 0 row
Skipping 0 row
Skipping 0 row
Skipping 0 row
Skipping 0 row
Skipping 0 row
Skipping 0 row
Skipping 0 row
Skipping 0 row
Skipping 0 row
Skipping 0 row
Skipping 0 row
Skipping 0 row
Skipping 0 row
Skipping 0 row
Skipping 0 row
Skipping 0 row
Skipping 0 row
Skipping 0 row
Skipping 0 row
Skipping 0 row
Skipping 0 row
Skipping 0 row
Skipping 0 row
Skipping 0 row
Skipping 0 row
Skipping 0 row
Skipping 0 row
Skipping 0 row
Skipping 0 row
Skipping 0 row
Skipping 0 row
Skipping 0 row
Skipping 0 row
Skipping 0 row
Skipping 0 row
Skipping 0 row
Skipping 0 row
Skipping 0 row
Skipping 0 row
Skipping 0 row
Skipping 0 row
Skipping 0 row
Skipping 0 row
Skipping 0 row
Skipping 0 row
Skipping 0 row
Skipping 0 row
Skipping 0 row
Skipping 0 row
Skipping 0 row
Skipping 0 row
Skipping 0 row
Skipping 0 row
Skipping 0 row
Skipping 0 row
Skipping 0 row
Skipping 0 row
Skipping 0 row
Skipping 0 row
Skipping 0 row
Skipping 0 row
Skipping 0 row
Skipping 0 row
Skipping 0 row
Skipping 0 row
Skipping 0 row
Skipping 0 row
Skipping 0 row
Skipping 0 row
Skipping 0 row
Skipping 0 row
Skipping 0 row
Skipping 0 row
Skipping 0 row
Skipping 0 row
Skipping 0 row
Skipping 0 row
Skipping 0 row
Skipping 0 row
Skipping 0 row
Skipping 0 row
Skipping 0 row
Skipping 0 row
Skipping 0 row
Skipping 0 row
Skipping 0 row
Skipping 0 row
Skipping 0 row
Skipping 0 row
Skipping 0 row
Skipping 0 row
Skipping 0 row
Skipping 0 row
Skipping 0 row
Skipping 0 row
Skipping 0 row
Skipping 0 row
Skipping 0 row
Skipping 0 row
Skipping 0 row
Skipping 0 row
Skipping 0 row
Skipping 0 row
Skipping 0 row
Skipping 0 row
Skipping 0 row
Skipping 0 row
Skipping 0 row
Skipping 0 row
Skipping 0 row
Skipping 0 row
Skipping 0 row
Skipping 0 row
Skipping 0 row
Skipping 0 row
Skipping 0 row
Skipping 0 row
Skipping 0 row
Skipping 0 row
Skipping 0 row
Skipping 0 row
Skipping 0 row
Skipping 0 row
Skipping 0 row
Skipping 0 row
Skipping 0 row
Skipping 0 row
Skipping 0 row
Skipping 0 row
Skipping 0 row
Skipping 0 row
Skipping 0 row
Skipping 0 row
Skipping 0 row
Skipping 0 row
Skipping 0 row
Skipping 0 row
Skipping 0 row
Skipping 0 row
Skipping 0 row
Skipping 0 row
Skipping 0 row
Skipping 0 row
Skipping 0 row
Skipping 0 row
Skipping 0 row
Skipping 0 row
Skipping 0 row
Skipping 0 row
Skipping 0 row
Skipping 0 row
Skipping 0 row
Skipping 0 row
Skipping 0 row
Skipping 0 row
Skipping 0 row
Skipping 0 row
Skipping 0 row
Skipping 0 row
Skipping 0 row
Skipping 0 row
Skipping 0 row
Skipping 0 row
Skipping 0 row
Skipping 0 row
Skipping 0 row
Skipping 0 row
Skipping 0 row
Skipping 0 row
Skipping 0 row
Skipping 0 row
Skipping 0 row
Skipping 0 row
Skipping 0 row
Skipping 0 row
Skipping 0 row
Skipping 0 row
Skipping 0 row
Skipping 0 row
Skipping 0 row
Skipping 0 row
Skipping 0 row
Skipping 0 row
Skipping 0 row
Skipping 0 row
Skipping 0 row
Skipping 0 row
Skipping 0 row
Skipping 0 row
Skipping 0 row
Skipping 0 row
Skipping 0 row
Skipping 0 row
Skipping 0 row
Skipping 0 row
Skipping 0 row
Skipping 0 row
Skipping 0 row
Skipping 0 row
Skipping 0 row
Skipping 0 row
Skipping 0 row
Skipping 0 row
Skipping 0 row
Skipping 0 row
Skipping 0 row
Skipping 0 row
Skipping 0 row
Skipping 0 row
Skipping 0 row
Skipping 0 row
Skipping 0 row
Skipping 0 row
Skipping 0 row
Skipping 0 row
Skipping 0 row
Skipping 0 row
Skipping 0 row
Skipping 0 row
Skipping 0 row
Skipping 0 row
Skipping 0 row
Skipping 0 row
Skipping 0 row
Skipping 0 row
Skipping 0 row
Skipping 0 row
Skipping 0 row
Skipping 0 row
Skipping 0 row
Skipping 0 row
Skipping 0 row
Skipping 0 row
Skipping 0 row
Skipping 0 row
Skipping 0 row
Skipping 0 row
Skipping 0 row
Skipping 0 row
Skipping 0 row
Skipping 0 row
Skipping 0 row
Skipping 0 row
Skipping 0 row
Skipping 0 row
Skipping 0 row
Skipping 0 row
Skipping 0 row
Skipping 0 row
Skipping 0 row
Skipping 0 row
Skipping 0 row
Skipping 0 row
Skipping 0 row
Skipping 0 row
Skipping 0 row
Skipping 0 row
Skipping 0 row
Skipping 0 row
Skipping 0 row
Skipping 0 row
Skipping 0 row
Skipping 0 row
Skipping 0 row
Skipping 0 row
Skipping 0 row
Skipping 0 row
Skipping 0 row
Skipping 0 row
Skipping 0 row
Skipping 0 row
Skipping 0 row
Skipping 0 row
Skipping 0 row
Skipping 0 row
Skipping 0 row
Skipping 0 row
Skipping 0 row
Skipping 0 row
Skipping 0 row
Skipping 0 row
Skipping 0 row
Skipping 0 row
Skipping 0 row
Skipping 0 row
Skipping 0 row
Skipping 0 row
Skipping 0 row
Skipping 0 row
Skipping 0 row
Skipping 0 row
Skipping 0 row
Skipping 0 row
Skipping 0 row
Skipping 0 row
Skipping 0 row
Skipping 0 row
Skipping 0 row
Skipping 0 row
Skipping 0 row
Skipping 0 row
Skipping 0 row
Skipping 0 row
Skipping 0 row
Skipping 0 row
Skipping 0 row
Skipping 0 row
Skipping 0 row
Skipping 0 row
Skipping 0 row
Skipping 0 row
Skipping 0 row
Skipping 0 row
Skipping 0 row
Skipping 0 row
Skipping 0 row
Skipping 0 row
Skipping 0 row
Skipping 0 row
Skipping 0 row
Skipping 0 row
Skipping 0 row
Skipping 0 row
Skipping 0 row
Skipping 0 row
Skipping 0 row
Skipping 0 row
Skipping 0 row
Skipping 0 row
Skipping 0 row
Skipping 0 row
Skipping 0 row
Skipping 0 row
Skipping 0 row
Skipping 0 row
Skipping 0 row
Skipping 0 row
Skipping 0 row
Skipping 0 row
Skipping 0 row
Skipping 0 row
Skipping 0 row
Skipping 0 row
Skipping 0 row
Skipping 0 row
Skipping 0 row
Skipping 0 row
Skipping 0 row
Skipping 0 row
Skipping 0 row
Skipping 0 row
Skipping 0 row
Skipping 0 row
Skipping 0 row
Skipping 0 row
Skipping 0 row
Skipping 0 row
Skipping 0 row
Skipping 0 row
Skipping 0 row
Skipping 0 row
Skipping 0 row
Skipping 0 row
Skipping 0 row
Skipping 0 row
Skipping 0 row
Skipping 0 row
Skipping 0 row
Skipping 0 row
Skipping 0 row
Skipping 0 row
Skipping 0 row
Skipping 0 row
Skipping 0 row
Skipping 0 row
Skipping 0 row
Skipping 0 row
Skipping 0 row
Skipping 0 row
Skipping 0 row
Skipping 0 row
Skipping 0 row
Skipping 0 row
Skipping 0 row
Skipping 0 row
Skipping 0 row
Skipping 0 row
Skipping 0 row
Skipping 0 row
Skipping 0 row
Skipping 0 row
Skipping 0 row
Skipping 0 row
Skipping 0 row
Skipping 0 row
Skipping 0 row
Skipping 0 row
Skipping 0 row
Skipping 0 row
Skipping 0 row
Skipping 0 row
Skipping 0 row
Skipping 0 row
Skipping 0 row
Skipping 0 row
Skipping 0 row
Skipping 0 row
Skipping 0 row
Skipping 0 row
Skipping 0 row
Skipping 0 row
Skipping 0 row
Skipping 0 row
Skipping 0 row
Skipping 0 row
Skipping 0 row
Skipping 0 row
Skipping 0 row
Skipping 0 row
Skipping 0 row
Skipping 0 row
Skipping 0 row
Skipping 0 row
Skipping 0 row
Skipping 0 row
Skipping 0 row
Skipping 0 row
Skipping 0 row
Skipping 0 row
Skipping 0 row
Skipping 0 row
Skipping 0 row
Skipping 0 row
Skipping 0 row
Skipping 0 row
Skipping 0 row
Skipping 0 row
Skipping 0 row
Skipping 0 row
Skipping 0 row
Skipping 0 row
Skipping 0 row
Skipping 0 row
Skipping 0 row
Skipping 0 row
Skipping 0 row
Skipping 0 row
Skipping 0 row
Skipping 0 row
Skipping 0 row
Skipping 0 row
Skipping 0 row
Skipping 0 row
Skipping 0 row
Skipping 0 row
Skipping 0 row
Skipping 0 row
Skipping 0 row
Skipping 0 row
Skipping 0 row
Skipping 0 row
Skipping 0 row
Skipping 0 row
Skipping 0 row
Skipping 0 row
Skipping 0 row
Skipping 0 row
Skipping 0 row
Skipping 0 row
Skipping 0 row
Skipping 0 row
Skipping 0 row
Skipping 0 row
Skipping 0 row
Skipping 0 row
Skipping 0 row
Skipping 0 row
Skipping 0 row
Skipping 0 row
Skipping 0 row
Skipping 0 row
Skipping 0 row
Skipping 0 row
Skipping 0 row
Skipping 0 row
Skipping 0 row
Skipping 0 row
Skipping 0 row
Skipping 0 row
Skipping 0 row
Skipping 0 row
Skipping 0 row
Skipping 0 row
Skipping 0 row
Skipping 0 row
Skipping 0 row
Skipping 0 row
Skipping 0 row
Skipping 0 row
Skipping 0 row
Skipping 0 row
Skipping 0 row
Skipping 0 row
Skipping 0 row
Skipping 0 row
Skipping 0 row
Skipping 0 row
Skipping 0 row
Skipping 0 row
Skipping 0 row
Skipping 0 row
Skipping 0 row
Skipping 0 row
Skipping 0 row
Skipping 0 row
Skipping 0 row
Skipping 0 row
Skipping 0 row
Skipping 0 row
Skipping 0 row
Skipping 0 row
Skipping 0 row
Skipping 0 row
Skipping 0 row
Skipping 0 row
Skipping 0 row
Skipping 0 row
Skipping 0 row
Skipping 0 row
Skipping 0 row
Skipping 0 row
Skipping 0 row
Skipping 0 row
Skipping 0 row
Skipping 0 row
Skipping 0 row
Skipping 0 row
Skipping 0 row
Skipping 0 row
Skipping 0 row
Skipping 0 row
Skipping 0 row
Skipping 0 row
Skipping 0 row
Skipping 0 row
Skipping 0 row
Skipping 0 row
Skipping 0 row
Skipping 0 row
Skipping 0 row
Skipping 0 row
Skipping 0 row
Skipping 0 row
Skipping 0 row
Skipping 0 row
Skipping 0 row
Skipping 0 row
Skipping 0 row
Skipping 0 row
Skipping 0 row
Skipping 0 row
Skipping 0 row
Skipping 0 row
Skipping 0 row
Skipping 0 row
Skipping 0 row
Skipping 0 row
Skipping 0 row
Skipping 0 row
Skipping 0 row
Skipping 0 row
Skipping 0 row
Skipping 0 row
Skipping 0 row
Skipping 0 row
Skipping 0 row
Skipping 0 row
Skipping 0 row
Skipping 0 row
Skipping 0 row
Skipping 0 row
Skipping 0 row
Skipping 0 row
Skipping 0 row
Skipping 0 row
Skipping 0 row
Skipping 0 row
Skipping 0 row
Skipping 0 row
Skipping 0 row
Skipping 0 row
Skipping 0 row
Skipping 0 row
Skipping 0 row
Skipping 0 row
Skipping 0 row
Skipping 0 row
Skipping 0 row
Skipping 0 row
Skipping 0 row
Skipping 0 row
Skipping 0 row
Skipping 0 row
Skipping 0 row
Skipping 0 row
Skipping 0 row
Skipping 0 row
Skipping 0 row
Skipping 0 row
Skipping 0 row
Skipping 0 row
Skipping 0 row
Skipping 0 row
Skipping 0 row
Skipping 0 row
Skipping 0 row
Skipping 0 row
Skipping 0 row
Skipping 0 row
Skipping 0 row
Skipping 0 row
Skipping 0 row
Skipping 0 row
Skipping 0 row
Skipping 0 row
Skipping 0 row
Skipping 0 row
Skipping 0 row
Skipping 0 row
Skipping 0 row
Skipping 0 row
Skipping 0 row
Skipping 0 row
Skipping 0 row
Skipping 0 row
Skipping 0 row
Skipping 0 row
Skipping 0 row
Skipping 0 row
Skipping 0 row
Skipping 0 row
Skipping 0 row
Skipping 0 row
Skipping 0 row
Skipping 0 row
Skipping 0 row
Skipping 0 row
Skipping 0 row
Skipping 0 row
Skipping 0 row
Skipping 0 row
Skipping 0 row
Skipping 0 row
Skipping 0 row
Skipping 0 row
Skipping 0 row
Skipping 0 row
Skipping 0 row
Skipping 0 row
Skipping 0 row
Skipping 0 row
Skipping 0 row
Skipping 0 row
Skipping 0 row
Skipping 0 row
Skipping 0 row
Skipping 0 row
Skipping 0 row
Skipping 0 row
Skipping 0 row
Skipping 0 row
Skipping 0 row
Skipping 0 row
Skipping 0 row
Skipping 0 row
Skipping 0 row
Skipping 0 row
Skipping 0 row
Skipping 0 row
Skipping 0 row
Skipping 0 row
Skipping 0 row
Skipping 0 row
Skipping 0 row
Skipping 0 row
Skipping 0 row
Skipping 0 row
Skipping 0 row
Skipping 0 row
Skipping 0 row
Skipping 0 row
Skipping 0 row
Skipping 0 row
Skipping 0 row
Skipping 0 row
Skipping 0 row
Skipping 0 row
Skipping 0 row
Skipping 0 row
Skipping 0 row
Skipping 0 row
Skipping 0 row
Skipping 0 row
Skipping 0 row
Skipping 0 row
Skipping 0 row
Skipping 0 row
Skipping 0 row
Skipping 0 row
Skipping 0 row
Skipping 0 row
Skipping 0 row
Skipping 0 row
Skipping 0 row
Skipping 0 row
Skipping 0 row
Skipping 0 row
Skipping 0 row
Skipping 0 row
Skipping 0 row
Skipping 0 row
Skipping 0 row
Skipping 0 row
Skipping 0 row
Skipping 0 row
Skipping 0 row
Skipping 0 row
Skipping 0 row
Skipping 0 row
Skipping 0 row
Skipping 0 row
Skipping 0 row
Skipping 0 row
Skipping 0 row
Skipping 0 row
Skipping 0 row
Skipping 0 row
Skipping 0 row
Skipping 0 row
Skipping 0 row
Skipping 0 row
Skipping 0 row
Skipping 0 row
Skipping 0 row
Skipping 0 row
Skipping 0 row
Skipping 0 row
Skipping 0 row
Skipping 0 row
Skipping 0 row
Skipping 0 row
Skipping 0 row
Skipping 0 row
Skipping 0 row
Skipping 0 row
Skipping 0 row
Skipping 0 row
Skipping 0 row
Skipping 0 row
Skipping 0 row
Skipping 0 row
Skipping 0 row
Skipping 0 row
Skipping 0 row
Skipping 0 row
Skipping 0 row
Skipping 0 row
Skipping 0 row
Skipping 0 row
Skipping 0 row
Skipping 0 row
Skipping 0 row
Skipping 0 row
Skipping 0 row
Skipping 0 row
Skipping 0 row
Skipping 0 row
Skipping 0 row
Skipping 0 row
Skipping 0 row
Skipping 0 row
Skipping 0 row
Skipping 0 row
Skipping 0 row
Skipping 0 row
Skipping 0 row
Skipping 0 row
Skipping 0 row
Skipping 0 row
Skipping 0 row
Skipping 0 row
Skipping 0 row
Skipping 0 row
Skipping 0 row
Skipping 0 row
Skipping 0 row
Skipping 0 row
Skipping 0 row
Skipping 0 row
Skipping 0 row
Skipping 0 row
Skipping 0 row
Skipping 0 row
Skipping 0 row
Skipping 0 row
Skipping 0 row
Skipping 0 row
Skipping 0 row
Skipping 0 row
Skipping 0 row
Skipping 0 row
Skipping 0 row
Skipping 0 row
Skipping 0 row
Skipping 0 row
Skipping 0 row
Skipping 0 row
Skipping 0 row
Skipping 0 row
Skipping 0 row
Skipping 0 row
Skipping 0 row
Skipping 0 row
Skipping 0 row
Skipping 0 row
Skipping 0 row
Skipping 0 row
Skipping 0 row
Skipping 0 row
Skipping 0 row
Skipping 0 row
Skipping 0 row
Skipping 0 row
Skipping 0 row
Skipping 0 row
Skipping 0 row
Skipping 0 row
Skipping 0 row
Skipping 0 row
Skipping 0 row
Skipping 0 row
Skipping 0 row
Skipping 0 row
Skipping 0 row
Skipping 0 row
Skipping 0 row
Skipping 0 row
Skipping 0 row
Skipping 0 row
Skipping 0 row
Skipping 0 row
Skipping 0 row
Skipping 0 row
Skipping 0 row
Skipping 0 row
Skipping 0 row
Skipping 0 row
Skipping 0 row
Skipping 0 row
Skipping 0 row
Skipping 0 row
Skipping 0 row
Skipping 0 row
Skipping 0 row
Skipping 0 row
Skipping 0 row
Skipping 0 row
Skipping 0 row
Skipping 0 row
Skipping 0 row
Skipping 0 row
Skipping 0 row
Skipping 0 row
Skipping 0 row
Skipping 0 row
Skipping 0 row
Skipping 0 row
Skipping 0 row
Skipping 0 row
Skipping 0 row
Skipping 0 row
Skipping 0 row
Skipping 0 row
Skipping 0 row
Skipping 0 row
Skipping 0 row
Skipping 0 row
Skipping 0 row
Skipping 0 row
Skipping 0 row
Skipping 0 row
Skipping 0 row
Skipping 0 row
Skipping 0 row
Skipping 0 row
Skipping 0 row
Skipping 0 row
Skipping 0 row
Skipping 0 row
Skipping 0 row
Skipping 0 row
Skipping 0 row
Skipping 0 row
Skipping 0 row
Skipping 0 row
Skipping 0 row
Skipping 0 row
Skipping 0 row
Skipping 0 row
Skipping 0 row
Skipping 0 row
Skipping 0 row
Skipping 0 row
Skipping 0 row
Skipping 0 row
Skipping 0 row
Skipping 0 row
Skipping 0 row
Skipping 0 row
Skipping 0 row
Skipping 0 row
Skipping 0 row
Skipping 0 row
Skipping 0 row
Skipping 0 row
Skipping 0 row
Skipping 0 row
Skipping 0 row
Skipping 0 row
Skipping 0 row
Skipping 0 row
Skipping 0 row
Skipping 0 row
Skipping 0 row
Skipping 0 row
Skipping 0 row
Skipping 0 row
Skipping 0 row
Skipping 0 row
Skipping 0 row
Skipping 0 row
Skipping 0 row
Skipping 0 row
Skipping 0 row
Skipping 0 row
Skipping 0 row
Skipping 0 row
Skipping 0 row
Skipping 0 row
Skipping 0 row
Skipping 0 row
Skipping 0 row
Skipping 0 row
Skipping 0 row
Skipping 0 row
Skipping 0 row
Skipping 0 row
Skipping 0 row
Skipping 0 row
Skipping 0 row
Skipping 0 row
Skipping 0 row
Skipping 0 row
Skipping 0 row
Skipping 0 row
Skipping 0 row
Skipping 0 row
Skipping 0 row
Skipping 0 row
Skipping 0 row
Skipping 0 row
Skipping 0 row
Skipping 0 row
Skipping 0 row
Skipping 0 row
Skipping 0 row
Skipping 0 row
Skipping 0 row
Skipping 0 row
Skipping 0 row
Skipping 0 row
Skipping 0 row
Skipping 0 row
Skipping 0 row
Skipping 0 row
Skipping 0 row
Skipping 0 row
Skipping 0 row
Skipping 0 row
Skipping 0 row
Skipping 0 row
Skipping 0 row
Skipping 0 row
Skipping 0 row
Skipping 0 row
Skipping 0 row
Skipping 0 row
Skipping 0 row
Skipping 0 row
Skipping 0 row
Skipping 0 row
Skipping 0 row
Skipping 0 row
Skipping 0 row
Skipping 0 row
Skipping 0 row
Skipping 0 row
Skipping 0 row
Skipping 0 row
Skipping 0 row
Skipping 0 row
Skipping 0 row
Skipping 0 row
Skipping 0 row
Skipping 0 row
Skipping 0 row
Skipping 0 row
Skipping 0 row
Skipping 0 row
Skipping 0 row
Skipping 0 row
Skipping 0 row
Skipping 0 row
Skipping 0 row
Skipping 0 row
Skipping 0 row
Skipping 0 row
Skipping 0 row
Skipping 0 row
Skipping 0 row
Skipping 0 row
Skipping 0 row
Skipping 0 row
Skipping 0 row
Skipping 0 row
Skipping 0 row
Skipping 0 row
Skipping 0 row
Skipping 0 row
Skipping 0 row
Skipping 0 row
Skipping 0 row
Skipping 0 row
Skipping 0 row
Skipping 0 row
Skipping 0 row
Skipping 0 row
Skipping 0 row
Skipping 0 row
Skipping 0 row
Skipping 0 row
Skipping 0 row
Skipping 0 row
Skipping 0 row
Skipping 0 row
Skipping 0 row
Skipping 0 row
Skipping 0 row
Skipping 0 row
Skipping 0 row
Skipping 0 row
Skipping 0 row
Skipping 0 row
Skipping 0 row
Skipping 0 row
Skipping 0 row
Skipping 0 row
Skipping 0 row
Skipping 0 row
Skipping 0 row
Skipping 0 row
Skipping 0 row
Skipping 0 row
Skipping 0 row
Skipping 0 row
Skipping 0 row
Skipping 0 row
Skipping 0 row
Skipping 0 row
Skipping 0 row
Skipping 0 row
Skipping 0 row
Skipping 0 row
Skipping 0 row
Skipping 0 row
Skipping 0 row
Skipping 0 row
Skipping 0 row
Skipping 0 row
Skipping 0 row
Skipping 0 row
Skipping 0 row
Skipping 0 row
Skipping 0 row
Skipping 0 row
Skipping 0 row
Skipping 0 row
Skipping 0 row
Skipping 0 row
Skipping 0 row
Skipping 0 row
Skipping 0 row
Skipping 0 row
Skipping 0 row
Skipping 0 row
Skipping 0 row
Skipping 0 row
Skipping 0 row
Skipping 0 row
Skipping 0 row
Skipping 0 row
Skipping 0 row
Skipping 0 row
Skipping 0 row
Skipping 0 row
Skipping 0 row
Skipping 0 row
Skipping 0 row
Skipping 0 row
Skipping 0 row
Skipping 0 row
Skipping 0 row
Skipping 0 row
Skipping 0 row
Skipping 0 row
Skipping 0 row
Skipping 0 row
Skipping 0 row
Skipping 0 row
Refined: 95 | Refine Limit: 9 | Wrong: 0 | Right: 169 | Total: 169 | Total Zonos Considered: 264 | Expected 1346 (12.555720653789004%)Skipping 0 row
Skipping 0 row
Skipping 0 row
Skipping 0 row
Skipping 0 row
Skipping 0 row
Skipping 0 row
Skipping 0 row
Skipping 0 row
Skipping 0 row
Skipping 0 row
Skipping 0 row
Skipping 0 row
Skipping 0 row
Skipping 0 row
Skipping 0 row
Skipping 0 row
Skipping 0 row
Skipping 0 row
Skipping 0 row
Skipping 0 row
Skipping 0 row
Skipping 0 row
Skipping 0 row
Skipping 0 row
Skipping 0 row
Skipping 0 row
Skipping 0 row
Skipping 0 row
Skipping 0 row
Skipping 0 row
Skipping 0 row
Skipping 0 row
Skipping 0 row
Skipping 0 row
Skipping 0 row
Skipping 0 row
Skipping 0 row
Skipping 0 row
Skipping 0 row
Skipping 0 row
Skipping 0 row
Skipping 0 row
Skipping 0 row
Skipping 0 row
Skipping 0 row
Skipping 0 row
Skipping 0 row
Skipping 0 row
Skipping 0 row
Skipping 0 row
Skipping 0 row
Skipping 0 row
Skipping 0 row
Skipping 0 row
Skipping 0 row
Skipping 0 row
Skipping 0 row
Skipping 0 row
Skipping 0 row
Skipping 0 row
Skipping 0 row
Skipping 0 row
Skipping 0 row
Skipping 0 row
Skipping 0 row
Skipping 0 row
Skipping 0 row
Skipping 0 row
Skipping 0 row
Skipping 0 row
Skipping 0 row
Skipping 0 row
Skipping 0 row
Skipping 0 row
Skipping 0 row
Skipping 0 row
Skipping 0 row
Skipping 0 row
Skipping 0 row
Skipping 0 row
Skipping 0 row
Skipping 0 row
Skipping 0 row
Skipping 0 row
Skipping 0 row
Skipping 0 row
Skipping 0 row
Skipping 0 row
Skipping 0 row
Skipping 0 row
Skipping 0 row
Skipping 0 row
Skipping 0 row
Skipping 0 row
Skipping 0 row
Skipping 0 row
Skipping 0 row
Skipping 0 row
Skipping 0 row
Skipping 0 row
Skipping 0 row
Skipping 0 row
Skipping 0 row
Skipping 0 row
Skipping 0 row
Skipping 0 row
Skipping 0 row
Skipping 0 row
Skipping 0 row
Skipping 0 row
Skipping 0 row
Skipping 0 row
Skipping 0 row
Skipping 0 row
Skipping 0 row
Skipping 0 row
Skipping 0 row
Skipping 0 row
Skipping 0 row
Skipping 0 row
Skipping 0 row
Skipping 0 row
Skipping 0 row
Skipping 0 row
Skipping 0 row
Skipping 0 row
Skipping 0 row
NETWORKS EQUIVALENT
Refined: 96 | Refine Limit: 2 | Wrong: 0 | Right: 182 | Total: 182 | Total Zonos Considered: 278 | Expected 1145 (15.895196506550219%)

time: 8.916988029

[VERYDIFF_TIMER] 8.938356409

[VERYDIFF_EXPERIMENT] NETWORK: /home/i57/steuber/NeuroDiff/repos/VeryDiffExperiments/src/../benchmarks/mnist-prune/specs/mnist_85_local_18.vnnlib
[VERYDIFF_EXPERIMENT] TIME: 9.22569781
