
[VERYDIFF_EXPERIMENT] Running on /home/i57/steuber/NeuroDiff/repos/VeryDiffExperiments/src/../benchmarks/mnist-prune/specs/mnist_43_global_5.vnnlib /home/i57/steuber/NeuroDiff/repos/VeryDiffExperiments/src/../benchmarks/mnist-prune/nets/mnist_relu_2_512.onnx
Found input X
op: matmul, weight: (512, 784), bias: nothing
op: bias, weight: nothing, bias: (512,)
op: relu, weight: nothing, bias: nothing
op: matmul, weight: (512, 512), bias: nothing
op: bias, weight: nothing, bias: (512,)
op: relu, weight: nothing, bias: nothing
op: matmul, weight: (10, 512), bias: nothing
op: bias, weight: nothing, bias: (10,)
Found input X
op: gemm, weight: (512, 784), bias: (512,)
op: relu, weight: nothing, bias: nothing
op: gemm, weight: (512, 512), bias: (512,)
op: relu, weight: nothing, bias: nothing
op: gemm, weight: (10, 512), bias: (10,)
Distance: 973.3044369037136
Distance: 481.63499746812613
Distance: 8.744412635378467
Running with 1 threads
[Thread 1] Time to first task: 0.01s
Instable Generators: 170
Instable Generators: 313
Zono Bounds:
[-14.77589856691686, -13.545606010738485, -12.693832659139954, -14.149135598975558, -13.750044988078042, -11.985755811987266, -13.788885818116885, -13.042838932460599, -12.085598193723257, -10.877958839343313]
[17.865263585826565, 16.02683628288972, 15.499594319646867, 16.281981324459597, 16.59918171820976, 14.94499964251183, 16.233077629297462, 16.180949921363197, 13.353814055816375, 12.752042021643733]
[Thread 1] Processed 100 zonotopes (Work Done: 0.0%; Expected Zonos: Inf)
[Thread 1] Processed 200 zonotopes (Work Done: 0.0%; Expected Zonos: Inf)


TIMEOUT REACHED
UNKNOWN
[Thread 1] Total splits: 261
Processed 261 zonotopes (Work Done: 0.0%); Generated 522 (0.46035107241379314s/loop)
[Thread 1] Finished in 120.15s
 ────────────────────────────────────────────────────────────────────────────────
                                        Time                    Allocations      
                               ───────────────────────   ────────────────────────
       Tot / % measured:             120s / 100.0%           43.6GiB / 100.0%    

 Section               ncalls     time    %tot     avg     alloc    %tot      avg
 ────────────────────────────────────────────────────────────────────────────────
 Verify                     1     120s  100.0%    120s   43.6GiB  100.0%  43.6GiB
   Zonotope Loop            1     120s  100.0%    120s   43.6GiB  100.0%  43.6GiB
     Zonotope Propa...    261     110s   91.3%   420ms   33.3GiB   76.4%   131MiB
       DiffZonotope...    522    75.9s   63.1%   145ms   27.7GiB   63.4%  54.2MiB
         Zonotope_R...  1.04k    65.7s   54.7%  62.9ms   24.0GiB   55.1%  23.6MiB
           Influenc...  1.04k    39.7s   33.0%  38.0ms   15.2GiB   34.8%  14.9MiB
             Multiply   1.04k    28.3s   23.6%  27.1ms   8.42GiB   19.3%  8.26MiB
             Alloca...  1.04k    10.4s    8.7%  10.0ms   6.75GiB   15.5%  6.63MiB
             Set Ma...  1.04k    905ms    0.8%   867μs     0.00B    0.0%    0.00B
           Column M...  1.04k    17.2s   14.3%  16.4ms   4.41GiB   10.1%  4.33MiB
           Allocation   1.04k    8.23s    6.9%  7.89ms   4.41GiB   10.1%  4.33MiB
           Set Matrix   1.04k    597ms    0.5%   572μs   6.69MiB    0.0%  6.57KiB
           Vectors      1.04k   21.4ms    0.0%  20.5μs   25.5MiB    0.1%  25.0KiB
           Bounds       1.04k    770μs    0.0%   737ns     0.00B    0.0%    0.00B
       DiffZonotope...    783    33.8s   28.1%  43.1ms   5.63GiB   12.9%  7.36MiB
         Zonotope_D...  1.57k    13.3s   11.1%  8.50ms   3.52GiB    8.1%  2.30MiB
     Compute Split        261    4.66s    3.9%  17.8ms   5.15GiB   11.8%  20.2MiB
     Property Check       261    809ms    0.7%  3.10ms   62.3MiB    0.1%   244KiB
 Initialize                 1   2.17ms    0.0%  2.17ms   9.84MiB    0.0%  9.84MiB
 ────────────────────────────────────────────────────────────────────────────────
[VERYDIFF_TIMER] 120.191149754

[VERYDIFF_EXPERIMENT] NETWORK: /home/i57/steuber/NeuroDiff/repos/VeryDiffExperiments/src/../benchmarks/mnist-prune/specs/mnist_43_global_5.vnnlib
[VERYDIFF_EXPERIMENT] TIME: 120.58787065
