
[VERYDIFF_EXPERIMENT] Running on /home/i57/steuber/NeuroDiff/repos/VeryDiffExperiments/src/../benchmarks/mnist-prune/specs/mnist_29_local_18.vnnlib /home/i57/steuber/NeuroDiff/repos/VeryDiffExperiments/src/../benchmarks/mnist-prune/nets/mnist_relu_3_100.onnx
Loading /home/i57/steuber/NeuroDiff/repos/VeryDiffExperiments/src/../benchmarks/mnist-prune/nets/mnist_relu_3_100.onnx and /home/i57/steuber/NeuroDiff/repos/VeryDiffExperiments/src/../benchmarks/mnist-prune/nets_pruned/mnist_relu_3_100_0.49-old.onnx
INPUT SHAPE: 784
Refined: 62 | Refine Limit: 32 | Wrong: 0 | Right: 68 | Total: 68 | Total Zonos Considered: 130 | Expected 147329268 (4.615511970099519e-05%)Refined: 159 | Refine Limit: 24 | Wrong: 0 | Right: 253 | Total: 253 | Total Zonos Considered: 412 | Expected 548151195 (4.615514885450537e-05%)Refined: 287 | Refine Limit: 28 | Wrong: 0 | Right: 457 | Total: 457 | Total Zonos Considered: 744 | Expected 990137812 (4.6155191172519324e-05%)Refined: 397 | Refine Limit: 31 | Wrong: 0 | Right: 668 | Total: 668 | Total Zonos Considered: 1065 | Expected 1447175889 (4.615886742430381e-05%)Refined: 509 | Refine Limit: 23 | Wrong: 0 | Right: 886 | Total: 886 | Total Zonos Considered: 1395 | Expected 1918934634 (4.6171452862526215e-05%)Refined: 595 | Refine Limit: 40 | Wrong: 0 | Right: 1027 | Total: 1027 | Total Zonos Considered: 1622 | Expected 2224314777 (4.6171522601901955e-05%)Refined: 689 | Refine Limit: 32 | Wrong: 0 | Right: 1212 | Total: 1212 | Total Zonos Considered: 1901 | Expected 2624991862 (4.617157171209546e-05%)Refined: 786 | Refine Limit: 28 | Wrong: 0 | Right: 1410 | Total: 1410 | Total Zonos Considered: 2196 | Expected 3053826908 (4.617157561570611e-05%)Refined: 911 | Refine Limit: 13 | Wrong: 0 | Right: 1658 | Total: 1658 | Total Zonos Considered: 2569 | Expected 2603801636 (6.367612559561354e-05%)Refined: 1034 | Refine Limit: 24 | Wrong: 0 | Right: 1880 | Total: 1880 | Total Zonos Considered: 2914 | Expected 1757606677 (0.0001069636355278821%)Refined: 1180 | Refine Limit: 25 | Wrong: 0 | Right: 2133 | Total: 2133 | Total Zonos Considered: 3313 | Expected 1989003296 (0.00010723964129620025%)Refined: 1311 | Refine Limit: 14 | Wrong: 0 | Right: 2387 | Total: 2387 | Total Zonos Considered: 3698 | Expected 1656816808 (0.0001440714500525516%)Refined: 1464 | Refine Limit: 38 | Wrong: 0 | Right: 2625 | Total: 2625 | Total Zonos Considered: 4089 | Expected 1821643416 (0.00014410064982772676%)Refined: 1626 | Refine Limit: 37 | Wrong: 0 | Right: 2907 | Total: 2907 | Total Zonos Considered: 4533 | Expected 2017339770 (0.00014410066381628913%)Refined: 1743 | Refine Limit: 21 | Wrong: 0 | Right: 3154 | Total: 3154 | Total Zonos Considered: 4897 | Expected 2187827834 (0.00014416125213260268%)Refined: 1840 | Refine Limit: 20 | Wrong: 0 | Right: 3339 | Total: 3339 | Total Zonos Considered: 5179 | Expected 1955863134 (0.0001707174669820225%)Refined: 1927 | Refine Limit: 41 | Wrong: 0 | Right: 3478 | Total: 3478 | Total Zonos Considered: 5405 | Expected 2026868090 (0.00017159478789761793%)UNKNOWN
TIMEOUT
Refined: 1930 | Refine Limit: 39 | Wrong: 0 | Right: 3486 | Total: 3486 | Total Zonos Considered: 5416 | Expected 2031530237 (0.00017159478783578647%)

time: 120.16734011

[VERYDIFF_TIMER] 120.195695756

[VERYDIFF_EXPERIMENT] NETWORK: /home/i57/steuber/NeuroDiff/repos/VeryDiffExperiments/src/../benchmarks/mnist-prune/specs/mnist_29_local_18.vnnlib
[VERYDIFF_EXPERIMENT] TIME: 120.483831051
