
[VERYDIFF_EXPERIMENT] Running on /home/i57/steuber/NeuroDiff/repos/VeryDiffExperiments/src/../benchmarks/mnist-prune/specs/mnist_32_local_15.vnnlib /home/i57/steuber/NeuroDiff/repos/VeryDiffExperiments/src/../benchmarks/mnist-prune/nets/mnist_relu_2_512.onnx
/home/i57/steuber/NeuroDiff/repos/VeryDiffExperiments/src/../benchmarks/mnist-prune/nets/mnist_relu_2_512.onnx
/home/i57/steuber/NeuroDiff/repos/VeryDiffExperiments/src/../benchmarks/mnist-prune/nets_pruned/mnist_relu_2_512_pruned5.onnx
[[0. 0.]
 [0. 0.]
 [0. 0.]
 ...
 [0. 0.]
 [0. 0.]
 [0. 0.]]
1.0
120
False
512
512
512
512
Set parameter TimeLimit to value 120
Set parameter Threads to value 1
Set parameter BestObjStop to value 1
Set parameter BestBdStop to value 1
Gurobi Optimizer version 10.0.0 build v10.0.0rc2 (linux64)

CPU model: Intel(R) Core(TM) i5-6500 CPU @ 3.20GHz, instruction set [SSE2|AVX|AVX2]
Thread count: 4 physical cores, 4 logical processors, using up to 1 threads

Optimize a model with 14479 rows, 7010 columns and 1321743 nonzeros
Model fingerprint: 0xc18f4801
Variable types: 4932 continuous, 2078 integer (2078 binary)
Coefficient statistics:
  Matrix range     [1e-07, 2e+06]
  Objective range  [1e+00, 1e+00]
  Bounds range     [1e-02, 1e+00]
  RHS range        [1e-04, 2e+06]
Warning: Model contains large matrix coefficient range
         Consider reformulating model or setting NumericFocus parameter
         to avoid numerical issues.
Presolve removed 8379 rows and 3222 columns
Presolve time: 1.72s
Presolved: 6100 rows, 3788 columns, 249715 nonzeros
Variable types: 2625 continuous, 1163 integer (1163 binary)

Root relaxation: objective 4.946829e+02, 2904 iterations, 0.82 seconds (1.91 work units)

    Nodes    |    Current Node    |     Objective Bounds      |     Work
 Expl Unexpl |  Obj  Depth IntInf | Incumbent    BestBd   Gap | It/Node Time

     0     0  494.68294    0  584          -  494.68294      -     -    6s
     0     0  490.65504    0  560          -  490.65504      -     -   22s
     0     0  490.65393    0  556          -  490.65393      -     -   22s
     0     0  487.44636    0  540          -  487.44636      -     -   30s
     0     0  487.44633    0  601          -  487.44633      -     -   31s
     0     0  487.38734    0  651          -  487.38734      -     -   35s
     0     0  487.38559    0  702          -  487.38559      -     -   35s
     0     0  487.38461    0  725          -  487.38461      -     -   44s
     0     0  486.52870    0  938          -  486.52870      -     -   46s
     0     0  486.50346    0  929          -  486.50346      -     -   46s
     0     0  486.48657    0  927          -  486.48657      -     -   47s
     0     0  486.00980    0  933          -  486.00980      -     -   47s
     0     0  486.00819    0  936          -  486.00819      -     -   48s
     0     0  485.92635    0  934          -  485.92635      -     -   56s
     0     0  485.88528    0  943          -  485.88528      -     -   57s
     0     0  485.86775    0  939          -  485.86775      -     -   58s
     0     0  485.85778    0  937          -  485.85778      -     -   58s
     0     0  485.85343    0  945          -  485.85343      -     -   58s
     0     0  485.84464    0  945          -  485.84464      -     -   63s
     0     0  485.83369    0  957          -  485.83369      -     -   64s
     0     0  485.76677    0  943          -  485.76677      -     -   65s
     0     0  485.75778    0  961          -  485.75778      -     -   65s
     0     0  485.75173    0  967          -  485.75173      -     -   66s
     0     0  485.74558    0  971          -  485.74558      -     -   71s
     0     0  485.73861    0  971          -  485.73861      -     -   72s
     0     0  485.73523    0  978          -  485.73523      -     -   73s
     0     0  485.73302    0  977          -  485.73302      -     -   79s
     0     0  485.73302    0  967          -  485.73302      -     -   90s
H    0     0                      12.4131907  485.73302  3813%     -  108s

Cutting planes:
  Gomory: 189
  Cover: 6
  Implied bound: 16
  Clique: 4
  MIR: 115
  Flow cover: 16
  RLT: 749
  Relax-and-lift: 127
  BQP: 2

Explored 1 nodes (22366 simplex iterations) in 108.24 seconds (102.33 work units)
Thread count was 1 (of 4 available processors)

Solution count 1: 12.4132 

Optimization achieved user objective limit
Best objective 1.241319068167e+01, best bound 4.857330233250e+02, gap 3813.0392%


512
512
512
512
NETWORKS NOT EQUIVALENT
512
512
x_2_0 : -137.48633122206923
x_2_1 : -89.8325699247392
x_2_2 : -58.954694840946054
x_2_3 : 32.681146614610036
x_2_4 : -113.32036479753717
x_2_5 : -42.33461354625179
x_2_6 : -136.81162606474263
x_2_7 : -82.53601803294654
x_2_8 : -72.05221836158334
x_2_9 : -67.33459914301444
512
512
x_2_0 : -128.61199596354876
x_2_1 : -83.91133846123013
x_2_2 : -55.47426641261066
x_2_3 : 30.00099314691321
x_2_4 : -106.23653132979052
x_2_5 : -34.85680089229899
x_2_6 : -124.39843538307115
x_2_7 : -76.57389954804385
x_2_8 : -67.89244245918456
x_2_9 : -63.57992187459643
512
512
512
512
Distance:  12.41319068167148
Input:  [0.0, 0.0, 0.0, 0.0, 0.0, 0.0, 0.0, 0.0, 0.0, 0.0, 0.0, 0.0, 0.0, 0.0, 0.0, 0.0, 0.0, 0.0, 0.0, 0.0, 0.0, 0.0, 0.0, 0.0, 0.0, 0.0, 0.0, 0.0, 0.0, 0.0, 0.0, 0.0, 0.0, 0.0, 0.0, 0.0, 0.0, 0.0, 0.0, 0.0, 0.0, 0.0, 0.0, 0.0, 0.0, 0.0, 0.0, 0.0, 0.0, 0.0, 0.0, 0.9649949546051517, 0.0, 0.8309633999700216, 0.0, 0.0, 0.0, 0.0, 0.0, 0.0, 0.0, 0.0, 0.0, 0.0, 0.0, 0.0, 0.0, 0.0, 0.0, 0.0, 0.0, 0.0, 0.0, 0.0, 0.0, 0.0, 0.0, 0.0, 0.0, 0.0, 0.0, 0.0, 0.0, 0.0, 0.0, 0.0, 0.0, 0.0, 0.0, 0.0, 0.0, 0.0, 0.0, 0.0, 0.0, 0.0, 0.0, 0.0, 0.0, 0.0, 0.0, 0.0, 0.0, 0.0, 0.0, 0.0, 0.0, 0.0, 0.0, 0.0, 0.0, 0.3833383810217019, 0.0, 0.0, 0.0, 0.0, 0.0, 0.0, 0.9913038847976956, 0.0, 0.0, 0.0, 0.0, 0.0, 0.0, 0.0, 0.0, 0.0, 0.0, 0.0, 0.0, 0.0, 0.0, 0.0, 0.0, 0.0, 0.0, 0.0, 0.0, 0.0, 0.8968625507774716, 0.0, 0.0, 0.0, 0.0, 0.0, 0.0, 0.0, 0.3882353, 0.99607843, 0.99607843, 0.99607843, 0.99607843, 0.8509804, 0.4627451, 0.16078432, 0.0, 0.0, 0.0, 0.0, 0.0, 0.0, 0.0, 0.0, 0.0, 0.0, 0.0, 0.0, 0.0, 1.0, 0.0, 0.0, 0.0, 0.0, 0.0, 0.69803923, 0.96862745, 0.99215686, 0.99215686, 0.99215686, 0.99215686, 0.99215686, 0.99215686, 0.54901963, 0.0, 0.0, 0.0, 0.0, 0.0, 0.0, 0.0, 0.0, 0.0, 0.0, 0.0, 0.0, 0.0, 0.0, 0.0, 0.0, 0.0, 0.0, 0.25098041, 0.95686275, 0.43499664959890316, 0.81568629, 0.69411767, 0.69411767, 0.21568628, 0.3882353, 0.99215686, 0.97647059, 0.36078432, 0.0, 0.0, 0.0, 0.0, 0.0, 0.0, 0.0, 0.0, 0.8857228697436353, 0.0, 0.0, 0.0, 0.0, 0.0, 0.0, 0.0, 0.0, 0.07450981, 0.64705884, 0.7019608, 0.09803922, 0.0, 0.0, 0.0, 0.27058825, 0.99215686, 0.99215686, 0.42745098, 0.0, 0.0, 0.0, 0.0, 0.0, 0.0, 0.0, 0.0, 0.0, 0.0, 0.0, 0.0, 0.0, 0.0, 0.0, 0.0, 0.0, 0.0, 0.0, 0.0, 0.0, 0.0, 0.0, 0.0, 0.27058825, 0.99215686, 0.97647059, 0.37254903, 0.0, 0.0, 0.0, 0.0, 0.0, 0.0, 0.0, 0.0, 0.0, 0.0, 0.0, 0.0, 0.0, 0.0, 0.0, 0.0, 0.0, 0.0, 0.0, 0.0, 0.0, 0.0, 0.0, 0.05098039, 0.60000002, 0.99215686, 0.56078434, 0.0, 0.0, 0.0, 0.0, 0.0, 0.0, 0.0, 0.0, 0.0, 0.0, 0.0, 0.0, 0.0, 0.0, 0.0, 0.5791036559657277, 0.0, 0.0, 0.0, 0.0, 0.0, 0.0, 0.0, 0.22352941, 0.94117647, 0.99215686, 0.99215686, 0.34901962, 0.0, 0.0, 0.0, 0.0, 0.0, 0.0, 0.0, 0.0, 0.0, 0.0, 0.0, 0.0, 0.0, 0.0, 0.0, 0.0, 0.0, 0.0, 0.0, 0.0, 0.0, 0.02352941, 0.43529412, 0.96862745, 0.99215686, 0.99215686, 0.89019608, 0.16078432, 0.0, 0.0, 0.0, 0.0, 0.0, 0.0, 0.0, 0.0, 0.0, 0.0, 0.0, 0.0, 0.0, 0.0, 0.0, 0.0, 0.0, 0.0, 0.0, 0.0, 0.12156863, 0.89411765, 0.99215686, 0.99215686, 0.99215686, 0.99215686, 0.99215686, 0.86666667, 0.34509805, 0.0, 0.0, 0.0, 0.0, 0.0, 0.0, 0.0, 0.0, 0.0, 0.0, 0.0, 0.0, 0.0, 0.0, 0.0, 0.0, 0.0, 0.0, 0.0, 0.13725491, 0.99215686, 0.99215686, 0.99215686, 0.99215686, 0.99215686, 0.99215686, 0.99215686, 0.98823529, 0.80784315, 0.1882353, 0.0, 0.0, 0.0, 0.0, 0.0, 0.0, 0.0, 0.0, 0.0, 0.0, 0.0, 0.0, 0.0, 0.0, 0.0, 0.0, 0.0, 0.10980392, 0.80392158, 0.80392158, 0.80392158, 0.32156864, 0.26666668, 0.26666668, 0.73725492, 0.99215686, 0.99215686, 0.88627452, 0.2, 0.0, 0.0, 0.0, 0.0, 0.0, 0.0, 0.0, 0.0, 0.0, 0.0, 0.0, 0.0, 0.0, 0.0, 0.0, 0.0, 0.0, 0.0, 0.0, 0.0, 0.0, 0.0, 0.0, 0.22745098, 0.65490198, 0.99215686, 0.99215686, 0.87843138, 0.14117648, 0.0, 0.0, 0.0, 0.0, 0.0, 0.0, 0.0, 0.0, 0.0, 0.0, 0.0, 0.0, 0.0, 0.0, 0.0, 0.0, 0.0, 0.0, 0.0, 0.0, 0.0, 0.0, 0.0, 0.01176471, 0.6171989528207193, 0.99215686, 0.99215686, 0.22745098, 0.0, 0.0, 0.0, 0.0, 0.0, 0.0, 0.0, 0.0, 0.0, 0.8643375268371751, 0.0, 0.0, 0.0, 0.0, 0.0, 0.0, 0.0, 0.0, 0.0, 0.0, 0.0, 0.0, 0.0, 0.0, 0.0, 0.67843139, 0.99215686, 0.86666667, 0.14509805, 0.0, 0.0, 0.0, 0.9320108416077435, 0.0, 0.0, 0.0, 0.0, 0.0, 0.0, 0.0, 0.0, 0.0, 0.0, 0.0, 0.0, 0.0, 0.0, 0.0, 0.0, 0.0, 0.0, 0.0, 0.0, 0.40784314, 0.99215686, 0.99215686, 0.692423803255363, 0.0, 0.0, 0.0, 0.0, 0.0, 0.0, 0.0, 0.0, 0.0, 0.0, 0.0, 0.0, 0.0, 0.0, 0.0, 0.0, 0.0, 0.0, 0.0, 0.0, 0.0, 0.0, 0.0, 0.16078432, 0.89019608, 0.99215686, 0.99215686, 0.29411766, 0.0, 0.0, 1.0, 0.0, 0.0, 0.0, 0.0, 0.0, 0.0, 0.0, 0.0, 0.0, 0.0, 0.0, 0.0, 0.0, 0.0, 0.0, 0.0, 0.0, 0.04705882, 0.24705882, 0.54901963, 0.88627452, 0.99215686, 0.99215686, 0.93333334, 0.22352941, 0.0, 0.0, 0.0, 0.0, 0.0, 0.0, 0.0, 0.0, 0.0, 0.0, 0.0, 0.0, 0.0, 0.0, 0.0, 0.0, 0.0, 0.16078432, 0.16470589, 0.60000002, 0.75686276, 0.99215686, 0.99215686, 0.99215686, 0.99215686, 0.8509804, 0.33725491, 0.0, 0.0, 0.0, 0.0, 0.0, 0.0, 0.0, 0.0, 0.0, 0.0, 0.0, 0.0, 0.0, 0.0, 0.0, 0.01176471, 0.11372549, 0.61960787, 0.98431373, 0.99215686, 0.99215686, 0.99215686, 0.99215686, 0.99215686, 0.90980393, 0.40000001, 0.05098039, 0.0, 0.0, 0.0, 0.0, 0.0, 0.0, 0.0, 0.0, 0.0, 0.0, 0.0, 0.0, 0.0, 0.0, 0.0, 0.0, 0.0627451, 0.45490196, 0.72941178, 0.99215686, 0.99215686, 0.99215686, 0.89019608, 0.45490196, 0.44313726, 0.0, 0.0, 0.0, 0.0, 0.0, 0.0, 0.0, 0.0, 0.0, 0.0, 0.0, 0.0, 0.0, 0.0, 0.0, 0.0, 0.0, 0.0, 0.0, 0.0, 0.0, 0.0, 0.0, 0.0, 0.8226091569087723, 0.0, 0.0, 0.0, 0.0, 0.0, 0.0, 0.0, 0.0, 0.0, 0.0, 0.0, 0.0, 0.0, 0.0, 0.0, 0.0, 0.0, 0.0, 0.0, 0.0, 0.0, 0.0, 0.0, 0.0, 0.0, 0.0, 0.0, 0.0, 0.0, 0.0, 0.0, 0.0, 0.0, 0.0, 0.0, 0.0, 0.0, 0.0, 0.0, 0.0, 0.0, 0.0, 0.0, 0.0, 0.0, 0.0, 0.0, 0.0, 0.0, 0.0, 0.0, 0.0, 0.0, 0.0, 0.0, 0.0, 0.0, 0.0, 0.0, 0.0, 0.0, 0.0, 0.0, 0.0, 0.0, 0.0, 0.0, 0.0, 0.0, 0.0]
time: 174.304102806

[VERYDIFF_TIMER] 174.352501739

[VERYDIFF_EXPERIMENT] Running on /home/i57/steuber/NeuroDiff/repos/VeryDiffExperiments/src/../benchmarks/mnist-prune/specs/mnist_32_local_15.vnnlib /home/i57/steuber/NeuroDiff/repos/VeryDiffExperiments/src/../benchmarks/mnist-prune/nets/mnist_relu_3_100.onnx
/home/i57/steuber/NeuroDiff/repos/VeryDiffExperiments/src/../benchmarks/mnist-prune/nets/mnist_relu_3_100.onnx
/home/i57/steuber/NeuroDiff/repos/VeryDiffExperiments/src/../benchmarks/mnist-prune/nets_pruned/mnist_relu_3_100_pruned5.onnx
[[0. 0.]
 [0. 0.]
 [0. 0.]
 ...
 [0. 0.]
 [0. 0.]
 [0. 0.]]
1.0
120
False
100
100
10
100
100
10
Set parameter TimeLimit to value 120
Set parameter Threads to value 1
Set parameter BestObjStop to value 1
Set parameter BestBdStop to value 1
Gurobi Optimizer version 10.0.0 build v10.0.0rc2 (linux64)

CPU model: Intel(R) Core(TM) i5-6500 CPU @ 3.20GHz, instruction set [SSE2|AVX|AVX2]
Thread count: 4 physical cores, 4 logical processors, using up to 1 threads

Optimize a model with 3083 rows, 2126 columns and 179668 nonzeros
Model fingerprint: 0x45ef9221
Variable types: 1676 continuous, 450 integer (450 binary)
Coefficient statistics:
  Matrix range     [1e-06, 2e+06]
  Objective range  [1e+00, 1e+00]
  Bounds range     [1e-02, 1e+00]
  RHS range        [1e-03, 2e+06]
Warning: Model contains large matrix coefficient range
         Consider reformulating model or setting NumericFocus parameter
         to avoid numerical issues.
Presolve removed 2013 rows and 1444 columns
Presolve time: 0.25s
Presolved: 1070 rows, 682 columns, 11080 nonzeros
Variable types: 481 continuous, 201 integer (201 binary)

Root relaxation: objective 2.351469e+01, 614 iterations, 0.02 seconds (0.03 work units)

    Nodes    |    Current Node    |     Objective Bounds      |     Work
 Expl Unexpl |  Obj  Depth IntInf | Incumbent    BestBd   Gap | It/Node Time

     0     0   23.51469    0   87          -   23.51469      -     -    0s
     0     0   22.20241    0   92          -   22.20241      -     -    0s
     0     0   22.06241    0  123          -   22.06241      -     -    0s
     0     0   22.06088    0  122          -   22.06088      -     -    0s
     0     0   22.06088    0  122          -   22.06088      -     -    0s
     0     0   21.50115    0  122          -   21.50115      -     -    0s
     0     0   21.49591    0  121          -   21.49591      -     -    0s
     0     0   21.49419    0   99          -   21.49419      -     -    0s
     0     0   21.49371    0   99          -   21.49371      -     -    0s
     0     0   21.38597    0   98          -   21.38597      -     -    1s
     0     0   21.38254    0   99          -   21.38254      -     -    1s
     0     0   21.38170    0   99          -   21.38170      -     -    1s
     0     0   21.37899    0  100          -   21.37899      -     -    1s
     0     0   21.37829    0  101          -   21.37829      -     -    1s
     0     0   21.37641    0  102          -   21.37641      -     -    1s
     0     0   21.37641    0  100          -   21.37641      -     -    2s
H    0     0                       0.7990751   21.37641  2575%     -    2s
H    0     0                       0.7990751   21.37641  2575%     -    2s
     0     2   21.37630    0  100    0.79908   21.37630  2575%     -    2s
   518   325    1.89620   50   64    0.79908   11.90488  1390%  25.3    5s
* 2102   828              96       0.8100369    2.13547   164%  19.7    8s
* 2158   874              96       0.8139625    2.11881   160%  19.3    8s
H 2605  1158                       0.8139625    2.00078   146%  16.9    9s
  3195  1495 infeasible   61         0.81396    1.92919   137%  15.0   10s
* 3700  1771              89       0.8161362    1.89719   132%  13.9   10s
H 4474  2247                       0.8161362    1.87927   130%  13.6   11s
  6392  3105    1.39852   57   34    0.81614    1.82772   124%  14.5   15s
H 7334  3577                       0.8161977    1.79957   120%  13.7   16s
H 7666  3758                       0.8161977    1.78698   119%  13.3   16s
 10112  4781    1.37892   48   52    0.81620    1.70588   109%  12.1   20s
 14012  6280    1.12116   61   29    0.81620    1.61503  97.9%  11.1   25s
 16982  7329    1.27338   58   30    0.81620    1.55327  90.3%  10.6   30s
 20754  8650    1.10121   56   43    0.81620    1.49393  83.0%  10.3   35s
 24541  9786    1.10269   56   35    0.81620    1.44474  77.0%  10.0   40s
 27672 10518     cutoff   54         0.81620    1.41346  73.2%  10.3   45s
 31283 11480    1.27465   65   34    0.81620    1.38005  69.1%  10.2   50s
 34217 12225    0.97629   49   46    0.81620    1.36112  66.8%  10.8   55s
 37228 12843    0.96762   57   25    0.81620    1.33885  64.0%  10.9   60s
 40791 13687    1.12304   71   26    0.81620    1.31559  61.2%  10.7   65s
 44029 14172    0.81862   58   26    0.81620    1.29169  58.3%  10.7   70s
 47234 14668 infeasible   64         0.81620    1.26982  55.6%  10.6   75s
 50216 15047    0.83348   71   19    0.81620    1.25041  53.2%  10.6   80s
 53447 15473    1.05372   56   29    0.81620    1.23041  50.7%  10.6   85s
 56463 15741     cutoff   67         0.81620    1.21304  48.6%  10.6   90s
 59531 15991    0.89094   61   28    0.81620    1.19690  46.6%  10.6   95s
 62511 16283    1.15196   61   37    0.81620    1.18185  44.8%  10.6  100s
 65081 16503     cutoff   67         0.81620    1.17009  43.4%  10.5  105s
 66314 16547    1.10919   61  100    0.81620    1.16439  42.7%  10.6  117s

Cutting planes:
  Gomory: 28
  MIR: 3
  Relax-and-lift: 1

Explored 66517 nodes (710320 simplex iterations) in 120.01 seconds (100.59 work units)
Thread count was 1 (of 4 available processors)

Solution count 6: 0.816198 0.816136 0.813962 ... 0.799075

Time limit reached
Best objective 8.161977156104e-01, best bound 1.164387095745e+00, gap 42.6599%


TIMEOUT
time: 124.088436321

[VERYDIFF_TIMER] 124.116361685

[VERYDIFF_EXPERIMENT] Running on /home/i57/steuber/NeuroDiff/repos/VeryDiffExperiments/src/../benchmarks/mnist-prune/specs/mnist_32_local_15.vnnlib /home/i57/steuber/NeuroDiff/repos/VeryDiffExperiments/src/../benchmarks/mnist-prune/nets/mnist_relu_4_1024.onnx
/home/i57/steuber/NeuroDiff/repos/VeryDiffExperiments/src/../benchmarks/mnist-prune/nets/mnist_relu_4_1024.onnx
/home/i57/steuber/NeuroDiff/repos/VeryDiffExperiments/src/../benchmarks/mnist-prune/nets_pruned/mnist_relu_4_1024_pruned5.onnx
[[0. 0.]
 [0. 0.]
 [0. 0.]
 ...
 [0. 0.]
 [0. 0.]
 [0. 0.]]
1.0
120
False
1024
1024
1024
10
1024
1024
1024
10
Set parameter TimeLimit to value 120
Set parameter Threads to value 1
Set parameter BestObjStop to value 1
Set parameter BestBdStop to value 1
Gurobi Optimizer version 10.0.0 build v10.0.0rc2 (linux64)

CPU model: Intel(R) Core(TM) i5-6500 CPU @ 3.20GHz, instruction set [SSE2|AVX|AVX2]
Thread count: 4 physical cores, 4 logical processors, using up to 1 threads

Optimize a model with 43291 rows, 19358 columns and 5656712 nonzeros
Model fingerprint: 0x8aa8e720
Variable types: 13164 continuous, 6194 integer (6194 binary)
Coefficient statistics:
  Matrix range     [2e-08, 2e+06]
  Objective range  [1e+00, 1e+00]
  Bounds range     [1e-02, 1e+00]
  RHS range        [1e-07, 2e+06]
Warning: Model contains large matrix coefficient range
         Consider reformulating model or setting NumericFocus parameter
         to avoid numerical issues.
Presolve removed 19262 rows and 4995 columns (presolve time = 5s) ...
Presolve removed 19806 rows and 4995 columns (presolve time = 10s) ...
Presolve removed 19806 rows and 4995 columns
Presolve time: 14.05s
Presolved: 23485 rows, 14363 columns, 3265446 nonzeros
Variable types: 9795 continuous, 4568 integer (4568 binary)

Root simplex log...

Iteration    Objective       Primal Inf.    Dual Inf.      Time
       0    8.9999910e+06   2.135684e+06   0.000000e+00     19s
     825    9.9999900e+05   9.150068e+02   0.000000e+00     20s
    2585    9.9999900e+05   4.289501e+03   0.000000e+00     25s
    3985    9.9999900e+05   1.050842e+03   0.000000e+00     30s
    5275    9.9999900e+05   1.184725e+03   0.000000e+00     35s
    6645    9.9999900e+05   1.007738e+02   0.000000e+00     41s
    7522    9.9999900e+05   0.000000e+00   0.000000e+00     44s

Root relaxation: objective 9.999990e+05, 7522 iterations, 27.11 seconds (71.18 work units)
Total elapsed time = 100.84s
Total elapsed time = 108.17s

    Nodes    |    Current Node    |     Objective Bounds      |     Work
 Expl Unexpl |  Obj  Depth IntInf | Incumbent    BestBd   Gap | It/Node Time

     0     0 999999.000    0    4          - 999999.000      -     -  110s
     0     0 999999.000    0    8          - 999999.000      -     -  110s
     0     0 999999.000    0   12          - 999999.000      -     -  110s
     0     0 999999.000    0   28          - 999999.000      -     -  114s
     0     0 999999.000    0   32          - 999999.000      -     -  114s
     0     0 14428.1225    0   31          - 14428.1225      -     -  114s

Explored 1 nodes (25560 simplex iterations) in 120.02 seconds (265.63 work units)
Thread count was 1 (of 4 available processors)

Solution count 0

Time limit reached
Best objective -, best bound 1.442812247479e+04, gap -


TIMEOUT
time: 264.837832214

[VERYDIFF_TIMER] 264.86905004

[VERYDIFF_EXPERIMENT] NETWORK: /home/i57/steuber/NeuroDiff/repos/VeryDiffExperiments/src/../benchmarks/mnist-prune/specs/mnist_32_local_15.vnnlib
[VERYDIFF_EXPERIMENT] TIME: 564.381213524
