
[VERYDIFF_EXPERIMENT] Running on /home/i57/steuber/NeuroDiff/repos/VeryDiffExperiments/src/../benchmarks/mnist-prune/specs/mnist_44_local_15.vnnlib /home/i57/steuber/NeuroDiff/repos/VeryDiffExperiments/src/../benchmarks/mnist-prune/nets/mnist_relu_4_1024.onnx
Found input X
op: matmul, weight: (1024, 784), bias: nothing
op: bias, weight: nothing, bias: (1024,)
op: relu, weight: nothing, bias: nothing
op: matmul, weight: (1024, 1024), bias: nothing
op: bias, weight: nothing, bias: (1024,)
op: relu, weight: nothing, bias: nothing
op: matmul, weight: (1024, 1024), bias: nothing
op: bias, weight: nothing, bias: (1024,)
op: relu, weight: nothing, bias: nothing
op: matmul, weight: (10, 1024), bias: nothing
op: bias, weight: nothing, bias: (10,)
op: relu, weight: nothing, bias: nothing
op: matmul, weight: (10, 10), bias: nothing
op: bias, weight: nothing, bias: (10,)
Found input X
op: gemm, weight: (1024, 784), bias: (1024,)
op: relu, weight: nothing, bias: nothing
op: gemm, weight: (1024, 1024), bias: (1024,)
op: relu, weight: nothing, bias: nothing
op: gemm, weight: (1024, 1024), bias: (1024,)
op: relu, weight: nothing, bias: nothing
op: gemm, weight: (10, 1024), bias: (10,)
op: relu, weight: nothing, bias: nothing
op: gemm, weight: (10, 10), bias: (10,)
Distance: 915.6394868631054
Distance: 1298.7052820973968
Distance: 1296.587532894263
Distance: 6.054483317080667
Distance: 0.04942679278974538
Running with 1 threads
[Thread 1] Time to first task: 0.0s
Instable Generators: 345
Instable Generators: 606
Instable Generators: 1009
Instable Generators: 10
Zono Bounds:
[-68.35436048504089, -69.87556773969695, -77.56225042095967, -76.83353001931756, -74.71872976291495, -78.4134882760704, -69.71637544192538, -73.57527912075486, -75.3405080609489, -78.44030916937551]
[68.28805923984636, 69.79099761659015, 77.11795255157254, 76.71660518795302, 74.53811159256982, 78.33477403775639, 69.41961130086986, 72.76266606312433, 75.40496538773712, 78.32993591166336]
[Thread 1] Processed 100 zonotopes (Work Done: 0.0%; Expected Zonos: Inf)


TIMEOUT REACHED
UNKNOWN
[Thread 1] Total splits: 169
Processed 169 zonotopes (Work Done: 0.0%); Generated 338 (0.7125643433786982s/loop)
[Thread 1] Finished in 120.42s
 ────────────────────────────────────────────────────────────────────────────────
                                        Time                    Allocations      
                               ───────────────────────   ────────────────────────
       Tot / % measured:             120s / 100.0%           33.6GiB / 100.0%    

 Section               ncalls     time    %tot     avg     alloc    %tot      avg
 ────────────────────────────────────────────────────────────────────────────────
 Verify                     1     120s  100.0%    120s   33.5GiB   99.9%  33.5GiB
   Zonotope Loop            1     120s  100.0%    120s   33.5GiB   99.9%  33.5GiB
     Zonotope Propa...    169     119s   98.4%   701ms   33.2GiB   98.9%   201MiB
       DiffZonotope...    676    65.4s   54.3%  96.7ms   26.3GiB   78.4%  39.9MiB
         Zonotope_R...  1.35k    46.0s   38.2%  34.0ms   16.0GiB   47.7%  12.1MiB
           Column M...  1.35k    37.7s   31.3%  27.9ms   6.83GiB   20.3%  5.17MiB
           Allocation   1.35k    4.25s    3.5%  3.14ms   6.83GiB   20.3%  5.17MiB
           Influenc...  1.35k    2.54s    2.1%  1.88ms   2.30GiB    6.9%  1.74MiB
             Multiply   1.35k    2.00s    1.7%  1.48ms   2.14GiB    6.4%  1.62MiB
             Alloca...  1.35k    525ms    0.4%   388μs    164MiB    0.5%   124KiB
             Set Ma...  1.35k   12.0ms    0.0%  8.89μs     0.00B    0.0%    0.00B
           Set Matrix   1.35k    977ms    0.8%   722μs   13.9MiB    0.0%  10.5KiB
           Vectors      1.35k    533ms    0.4%   394μs   44.9MiB    0.1%  34.0KiB
           Bounds       1.35k    940μs    0.0%   695ns     0.00B    0.0%    0.00B
       DiffZonotope...    845    53.2s   44.1%  62.9ms   6.88GiB   20.5%  8.34MiB
         Zonotope_D...  1.69k    17.9s   14.8%  10.6ms   2.81GiB    8.4%  1.70MiB
     Property Check       169    1.80s    1.5%  10.6ms   87.5MiB    0.3%   530KiB
     Compute Split        169   60.4ms    0.1%   357μs    122MiB    0.4%   737KiB
 Initialize                 1   14.5ms    0.0%  14.5ms   22.3MiB    0.1%  22.3MiB
 ────────────────────────────────────────────────────────────────────────────────
[VERYDIFF_TIMER] 120.516422249

[VERYDIFF_EXPERIMENT] NETWORK: /home/i57/steuber/NeuroDiff/repos/VeryDiffExperiments/src/../benchmarks/mnist-prune/specs/mnist_44_local_15.vnnlib
[VERYDIFF_EXPERIMENT] TIME: 120.764386076
