
[VERYDIFF_EXPERIMENT] Running on /home/i57/steuber/NeuroDiff/repos/VeryDiffExperiments/src/../benchmarks/mnist-prune/specs/mnist_24_global_5.vnnlib /home/i57/steuber/NeuroDiff/repos/VeryDiffExperiments/src/../benchmarks/mnist-prune/nets/mnist_relu_4_1024.onnx
Found input X
op: matmul, weight: (1024, 784), bias: nothing
op: bias, weight: nothing, bias: (1024,)
op: relu, weight: nothing, bias: nothing
op: matmul, weight: (1024, 1024), bias: nothing
op: bias, weight: nothing, bias: (1024,)
op: relu, weight: nothing, bias: nothing
op: matmul, weight: (1024, 1024), bias: nothing
op: bias, weight: nothing, bias: (1024,)
op: relu, weight: nothing, bias: nothing
op: matmul, weight: (10, 1024), bias: nothing
op: bias, weight: nothing, bias: (10,)
op: relu, weight: nothing, bias: nothing
op: matmul, weight: (10, 10), bias: nothing
op: bias, weight: nothing, bias: (10,)
Found input X
op: gemm, weight: (1024, 784), bias: (1024,)
op: relu, weight: nothing, bias: nothing
op: gemm, weight: (1024, 1024), bias: (1024,)
op: relu, weight: nothing, bias: nothing
op: gemm, weight: (1024, 1024), bias: (1024,)
op: relu, weight: nothing, bias: nothing
op: gemm, weight: (10, 1024), bias: (10,)
op: relu, weight: nothing, bias: nothing
op: gemm, weight: (10, 10), bias: (10,)
Distance: 915.6394868631054
Distance: 1298.7052820973968
Distance: 1296.587532894263
Distance: 6.054483317080667
Distance: 0.04942679278974538
Running with 1 threads
[Thread 1] Time to first task: 0.0s
Instable Generators: 561
Instable Generators: 1000
Instable Generators: 1024
Instable Generators: 10
Zono Bounds:
[-155.7796000790006, -159.01870239921917, -175.25940924155185, -174.03881850735743, -167.563996418191, -177.18717179444926, -158.27064827865595, -165.49941967457946, -169.20736590785722, -176.32566213159956]
[155.65541017784983, 158.601935696528, 174.4896454412533, 173.5236385019467, 167.44261600915556, 177.054263500936, 158.25456968933221, 164.63051667716692, 169.3037308119183, 176.13683679577778]


TIMEOUT REACHED
UNKNOWN
[Thread 1] Total splits: 40
Processed 40 zonotopes (Work Done: 0.0%); Generated 80 (3.053525218475s/loop)
[Thread 1] Finished in 122.14s
 ────────────────────────────────────────────────────────────────────────────────
                                        Time                    Allocations      
                               ───────────────────────   ────────────────────────
       Tot / % measured:             122s / 100.0%           34.0GiB / 100.0%    

 Section               ncalls     time    %tot     avg     alloc    %tot      avg
 ────────────────────────────────────────────────────────────────────────────────
 Verify                     1     122s  100.0%    122s   34.0GiB   99.9%  34.0GiB
   Zonotope Loop            1     122s  100.0%    122s   34.0GiB   99.9%  34.0GiB
     Zonotope Propa...     40     120s   98.3%   3.00s   31.4GiB   92.3%   804MiB
       DiffZonotope...    160    71.8s   58.8%   449ms   25.9GiB   76.2%   166MiB
         Zonotope_R...    320    63.7s   52.1%   199ms   20.9GiB   61.3%  66.8MiB
           Influenc...    320    45.9s   37.6%   144ms   12.2GiB   35.9%  39.1MiB
             Alloca...    320    28.7s   23.5%  89.8ms   4.86GiB   14.3%  15.6MiB
             Multiply     320    16.4s   13.4%  51.3ms   7.36GiB   21.6%  23.6MiB
             Set Ma...    320    779ms    0.6%  2.43ms     0.00B    0.0%    0.00B
           Column M...    320    11.6s    9.5%  36.2ms   4.31GiB   12.7%  13.8MiB
           Allocation     320    5.33s    4.4%  16.7ms   4.31GiB   12.7%  13.8MiB
           Set Matrix     320    825ms    0.7%  2.58ms   5.10MiB    0.0%  16.3KiB
           Vectors        320   8.32ms    0.0%  26.0μs   10.6MiB    0.0%  34.0KiB
           Bounds         320    229μs    0.0%   715ns     0.00B    0.0%    0.00B
       DiffZonotope...    200    48.2s   39.5%   241ms   5.46GiB   16.1%  28.0MiB
         Zonotope_D...    400    24.8s   20.3%  62.0ms   2.76GiB    8.1%  7.08MiB
     Compute Split         40    1.75s    1.4%  43.7ms   1.79GiB    5.3%  45.7MiB
     Property Check        40    153ms    0.1%  3.83ms   28.8MiB    0.1%   738KiB
 Initialize                 1   14.7ms    0.0%  14.7ms   27.0MiB    0.1%  27.0MiB
 ────────────────────────────────────────────────────────────────────────────────
[VERYDIFF_TIMER] 122.24518147

[VERYDIFF_EXPERIMENT] NETWORK: /home/i57/steuber/NeuroDiff/repos/VeryDiffExperiments/src/../benchmarks/mnist-prune/specs/mnist_24_global_5.vnnlib
[VERYDIFF_EXPERIMENT] TIME: 122.584159793
