
[VERYDIFF_EXPERIMENT] Running on /home/i57/steuber/NeuroDiff/repos/VeryDiffExperiments/src/../benchmarks/mnist-prune/specs/mnist_2_global_6.vnnlib /home/i57/steuber/NeuroDiff/repos/VeryDiffExperiments/src/../benchmarks/mnist-prune/nets/mnist_relu_2_512.onnx
Loading /home/i57/steuber/NeuroDiff/repos/VeryDiffExperiments/src/../benchmarks/mnist-prune/nets/mnist_relu_2_512.onnx and /home/i57/steuber/NeuroDiff/repos/VeryDiffExperiments/src/../benchmarks/mnist-prune/nets_pruned/mnist_relu_2_512_pruned5.onnx
INPUT SHAPE: 784

[NEQUIV] 381.64492754854666

[-76.62139744   1.6047969  -43.18584992 -70.26200648 -40.76787337
 -52.88072397 -44.35968054 -44.35752833 -39.722362   -63.59367017]
[-70.34231418  -0.74333194 -39.27588199 -64.72118263 -41.19558727
 -50.23749771 -40.51337113 -43.80360168 -39.30396822 -61.54252357]
NETWORKS NOT EQUIVALENT
Refined: 0 | Refine Limit: -1 | Wrong: 0 | Right: 1 | Total: 1 | Total Zonos Considered: 1 | Expected 2 (50.0%)

time: 6.057123252

[VERYDIFF_TIMER] 6.082564851

[VERYDIFF_EXPERIMENT] Running on /home/i57/steuber/NeuroDiff/repos/VeryDiffExperiments/src/../benchmarks/mnist-prune/specs/mnist_2_global_6.vnnlib /home/i57/steuber/NeuroDiff/repos/VeryDiffExperiments/src/../benchmarks/mnist-prune/nets/mnist_relu_3_100.onnx
Loading /home/i57/steuber/NeuroDiff/repos/VeryDiffExperiments/src/../benchmarks/mnist-prune/nets/mnist_relu_3_100.onnx and /home/i57/steuber/NeuroDiff/repos/VeryDiffExperiments/src/../benchmarks/mnist-prune/nets_pruned/mnist_relu_3_100_pruned5.onnx
INPUT SHAPE: 784
UNKNOWN
TIMEOUT
Refined: 21 | Refine Limit: 17 | Wrong: 0 | Right: 3 | Total: 3 | Total Zonos Considered: 24 | Expected 94720160 (3.1672243796885475e-06%)

time: 120.749642107

[VERYDIFF_TIMER] 120.773895458

[VERYDIFF_EXPERIMENT] Running on /home/i57/steuber/NeuroDiff/repos/VeryDiffExperiments/src/../benchmarks/mnist-prune/specs/mnist_2_global_6.vnnlib /home/i57/steuber/NeuroDiff/repos/VeryDiffExperiments/src/../benchmarks/mnist-prune/nets/mnist_relu_4_1024.onnx
Loading /home/i57/steuber/NeuroDiff/repos/VeryDiffExperiments/src/../benchmarks/mnist-prune/nets/mnist_relu_4_1024.onnx and /home/i57/steuber/NeuroDiff/repos/VeryDiffExperiments/src/../benchmarks/mnist-prune/nets_pruned/mnist_relu_4_1024_pruned5.onnx
INPUT SHAPE: 784

[NEQUIV] 820.6675013195106

[ 0.         23.83580847  1.87953241  0.          2.17645566  0.
  0.         11.09515324  0.          0.        ]
[ 0.         20.38706108  1.55129145  0.          1.68970685  0.
  0.          8.68532668  0.          0.        ]
NETWORKS NOT EQUIVALENT
Refined: 0 | Refine Limit: -1 | Wrong: 0 | Right: 1 | Total: 1 | Total Zonos Considered: 1 | Expected 2 (50.0%)

time: 49.879376132

[VERYDIFF_TIMER] 49.922362131

[VERYDIFF_EXPERIMENT] NETWORK: /home/i57/steuber/NeuroDiff/repos/VeryDiffExperiments/src/../benchmarks/mnist-prune/specs/mnist_2_global_6.vnnlib
[VERYDIFF_EXPERIMENT] TIME: 177.644149399
