
[VERYDIFF_EXPERIMENT] Running on /home/i57/steuber/NeuroDiff/repos/VeryDiffExperiments/src/../benchmarks/mnist-prune/specs/mnist_65_global_3.vnnlib /home/i57/steuber/NeuroDiff/repos/VeryDiffExperiments/src/../benchmarks/mnist-prune/nets/mnist_relu_3_100.onnx
Total difference: 419.1098
Average difference: 0.0047
Initial output delta:
[-0.849272 -0.841671 -0.924649 -0.934896 -1.094669 -1.049299 -1.069840 -1.001817 -0.885542 -0.968451 ]
[0.878836 0.820180 0.924466 0.978892 1.040880 1.085363 1.013295 1.071580 0.925436 1.020435 ]

No adv!
time: 0.412963 


numSplits: 1
setenv(`timeout -k 5 120 ../NeuroDiff/DiffNN-Code/delta_network_test 465 /home/i57/steuber/NeuroDiff/repos/VeryDiffExperiments/src/../benchmarks/mnist-prune/nets/mnist_relu_3_100.nnet /home/i57/steuber/NeuroDiff/repos/VeryDiffExperiments/src/../benchmarks/mnist-prune/nets_pruned/mnist_relu_3_100_0.79_adam_1_stepsize.nnet 1.0 -p 3`,["OMP_NUM_THREADS=1"])
[VERYDIFF_TIMER] 0.472096972

[VERYDIFF_EXPERIMENT] NETWORK: /home/i57/steuber/NeuroDiff/repos/VeryDiffExperiments/src/../benchmarks/mnist-prune/specs/mnist_65_global_3.vnnlib
[VERYDIFF_EXPERIMENT] TIME: 0.702236774
