
[VERYDIFF_EXPERIMENT] Running on /home/i57/steuber/NeuroDiff/repos/VeryDiffExperiments/src/../benchmarks/mnist-prune/specs/mnist_1_global_4.vnnlib /home/i57/steuber/NeuroDiff/repos/VeryDiffExperiments/src/../benchmarks/mnist-prune/nets/mnist_relu_3_100.onnx
Found input X
op: matmul, weight: (100, 784), bias: nothing
op: bias, weight: nothing, bias: (100,)
op: relu, weight: nothing, bias: nothing
op: matmul, weight: (100, 100), bias: nothing
op: bias, weight: nothing, bias: (100,)
op: relu, weight: nothing, bias: nothing
op: matmul, weight: (10, 100), bias: nothing
op: bias, weight: nothing, bias: (10,)
op: relu, weight: nothing, bias: nothing
op: matmul, weight: (10, 10), bias: nothing
op: bias, weight: nothing, bias: (10,)
Found input X
op: gemm, weight: (100, 784), bias: (100,)
op: relu, weight: nothing, bias: nothing
op: gemm, weight: (100, 100), bias: (100,)
op: relu, weight: nothing, bias: nothing
op: gemm, weight: (10, 100), bias: (10,)
op: relu, weight: nothing, bias: nothing
op: gemm, weight: (10, 10), bias: (10,)
Distance: 1958.4889029213523
Distance: 144.28197153992141
Distance: 22.063573056613677
Distance: 0.8412832540489035
Running with 1 threads
[Thread 1] Time to first task: 0.0s
Instable Generators: 22
Instable Generators: 23
Instable Generators: 4
Zono Bounds:
[-2.9401904730898325, -2.3829710171543743, -3.38990359664232, -2.0973637202783557, -0.02806025915439888, -3.7279904096933767, -2.9182957682017197, 0.0003015059555884596, -2.9213489776315043, -0.004807641313359578]
[2.8117204485812906, 1.560962099995602, 2.0229709054886555, 2.9277315126743977, -0.015654829034697525, 3.4465980675006604, 2.853040983131839, 0.016258379740865695, 3.0072043849719, 0.004519202253385527]
[Thread 1] Processed 100 zonotopes (Work Done: 0.0%; Expected Zonos: Inf)
[Thread 1] Processed 200 zonotopes (Work Done: 0.0%; Expected Zonos: Inf)
[Thread 1] Processed 300 zonotopes (Work Done: 0.0%; Expected Zonos: Inf)
[Thread 1] Processed 400 zonotopes (Work Done: 0.0%; Expected Zonos: Inf)
[Thread 1] Processed 500 zonotopes (Work Done: 0.0%; Expected Zonos: Inf)


TIMEOUT REACHED
UNKNOWN
[Thread 1] Total splits: 583
Processed 583 zonotopes (Work Done: 0.0%); Generated 1166 (0.2058653414974271s/loop)
[Thread 1] Finished in 120.02s
 ────────────────────────────────────────────────────────────────────────────────
                                        Time                    Allocations      
                               ───────────────────────   ────────────────────────
       Tot / % measured:             120s / 100.0%           60.3GiB / 100.0%    

 Section               ncalls     time    %tot     avg     alloc    %tot      avg
 ────────────────────────────────────────────────────────────────────────────────
 Verify                     1     120s  100.0%    120s   60.3GiB  100.0%  60.3GiB
   Zonotope Loop            1     120s  100.0%    120s   60.3GiB  100.0%  60.3GiB
     Zonotope Propa...    583    66.9s   55.7%   115ms   40.3GiB   66.8%  70.7MiB
       DiffZonotope...  1.75k    50.6s   42.2%  29.0ms   38.0GiB   62.9%  22.2MiB
         Zonotope_R...  3.50k    50.0s   41.6%  14.3ms   37.1GiB   61.5%  10.9MiB
           Influenc...  3.50k    49.2s   41.0%  14.1ms   34.1GiB   56.5%  10.0MiB
             Multiply   3.50k    33.2s   27.7%  9.50ms   17.2GiB   28.5%  5.04MiB
             Alloca...  3.50k    13.5s   11.3%  3.87ms   16.9GiB   27.9%  4.93MiB
             Set Ma...  3.50k    2.43s    2.0%   694μs     0.00B    0.0%    0.00B
           Column M...  3.50k    456ms    0.4%   130μs   1.50GiB    2.5%   449KiB
           Set Matrix   3.50k    185ms    0.2%  52.9μs   2.41MiB    0.0%     721B
           Allocation   3.50k   78.7ms    0.1%  22.5μs   1.50GiB    2.5%   449KiB
           Vectors      3.50k   17.7ms    0.0%  5.05μs   11.1MiB    0.0%  3.26KiB
           Bounds       3.50k   2.43ms    0.0%   695ns     0.00B    0.0%    0.00B
       DiffZonotope...  2.33k    16.2s   13.5%  6.95ms   2.33GiB    3.9%  1.02MiB
         Zonotope_D...  4.66k    4.99s    4.2%  1.07ms   1.53GiB    2.5%   345KiB
     Compute Split        583    4.54s    3.8%  7.79ms   8.56GiB   14.2%  15.0MiB
     Property Check       583    113ms    0.1%   193μs    117MiB    0.2%   206KiB
 Initialize                 1    593μs    0.0%   593μs   5.41MiB    0.0%  5.41MiB
 ────────────────────────────────────────────────────────────────────────────────
[VERYDIFF_TIMER] 120.050202518

[VERYDIFF_EXPERIMENT] NETWORK: /home/i57/steuber/NeuroDiff/repos/VeryDiffExperiments/src/../benchmarks/mnist-prune/specs/mnist_1_global_4.vnnlib
[VERYDIFF_EXPERIMENT] TIME: 120.511747885
