
[VERYDIFF_EXPERIMENT] Running on /home/i57/steuber/NeuroDiff/repos/VeryDiffExperiments/src/../benchmarks/mnist-prune/specs/mnist_63_local_24.vnnlib /home/i57/steuber/NeuroDiff/repos/VeryDiffExperiments/src/../benchmarks/mnist-prune/nets/mnist_relu_4_1024.onnx
Found input X
op: matmul, weight: (1024, 784), bias: nothing
op: bias, weight: nothing, bias: (1024,)
op: relu, weight: nothing, bias: nothing
op: matmul, weight: (1024, 1024), bias: nothing
op: bias, weight: nothing, bias: (1024,)
op: relu, weight: nothing, bias: nothing
op: matmul, weight: (1024, 1024), bias: nothing
op: bias, weight: nothing, bias: (1024,)
op: relu, weight: nothing, bias: nothing
op: matmul, weight: (10, 1024), bias: nothing
op: bias, weight: nothing, bias: (10,)
op: relu, weight: nothing, bias: nothing
op: matmul, weight: (10, 10), bias: nothing
op: bias, weight: nothing, bias: (10,)
Found input X
op: gemm, weight: (1024, 784), bias: (1024,)
op: relu, weight: nothing, bias: nothing
op: gemm, weight: (1024, 1024), bias: (1024,)
op: relu, weight: nothing, bias: nothing
op: gemm, weight: (1024, 1024), bias: (1024,)
op: relu, weight: nothing, bias: nothing
op: gemm, weight: (10, 1024), bias: (10,)
op: relu, weight: nothing, bias: nothing
op: gemm, weight: (10, 10), bias: (10,)
Distance: 915.6394868631054
Distance: 1298.7052820973968
Distance: 1296.587532894263
Distance: 6.054483317080667
Distance: 0.04942679278974538
Running with 1 threads
[Thread 1] Time to first task: 0.0s
Instable Generators: 507
Instable Generators: 920
Instable Generators: 1024
Instable Generators: 10
Zono Bounds:
[-190.28561707173526, -194.12956506261543, -214.04855070806434, -212.69765053721542, -203.9109272644471, -216.23644986574027, -193.1150066929982, -201.97160562147243, -207.15624780208464, -215.6488053447667]
[189.82003144459657, 193.71380701559173, 213.8025331794015, 212.46595918868863, 203.7667029287596, 215.7330780945059, 192.5732753796611, 201.08437605231032, 207.29118950043915, 215.40020222431943]
[Thread 1] Processed 100 zonotopes (Work Done: 0.0%; Expected Zonos: Inf)


TIMEOUT REACHED
UNKNOWN
[Thread 1] Total splits: 128
Processed 128 zonotopes (Work Done: 0.0%); Generated 256 (0.944013448296875s/loop)
[Thread 1] Finished in 120.83s
 ────────────────────────────────────────────────────────────────────────────────
                                        Time                    Allocations      
                               ───────────────────────   ────────────────────────
       Tot / % measured:             121s / 100.0%           41.8GiB / 100.0%    

 Section               ncalls     time    %tot     avg     alloc    %tot      avg
 ────────────────────────────────────────────────────────────────────────────────
 Verify                     1     121s  100.0%    121s   41.8GiB   99.9%  41.8GiB
   Zonotope Loop            1     121s  100.0%    121s   41.8GiB   99.9%  41.8GiB
     Zonotope Propa...    128     120s   99.5%   940ms   41.4GiB   99.1%   331MiB
       DiffZonotope...    640    66.0s   54.6%   103ms   8.96GiB   21.4%  14.3MiB
         Zonotope_D...  1.28k    22.1s   18.3%  17.3ms   3.65GiB    8.7%  2.92MiB
       DiffZonotope...    512    54.3s   44.9%   106ms   32.5GiB   77.7%  64.9MiB
         Zonotope_R...  1.02k    16.6s   13.8%  16.2ms   20.3GiB   48.6%  20.3MiB
           Allocation   1.02k    8.49s    7.0%  8.29ms   8.12GiB   19.4%  8.12MiB
           Column M...  1.02k    4.65s    3.8%  4.54ms   8.12GiB   19.4%  8.12MiB
           Influenc...  1.02k    2.08s    1.7%  2.03ms   4.01GiB    9.6%  4.01MiB
             Multiply   1.02k    2.01s    1.7%  1.96ms   3.71GiB    8.9%  3.71MiB
             Alloca...  1.02k   43.1ms    0.0%  42.1μs    304MiB    0.7%   304KiB
             Set Ma...  1.02k   19.1ms    0.0%  18.7μs     0.00B    0.0%    0.00B
           Set Matrix   1.02k    1.40s    1.2%  1.36ms   14.8MiB    0.0%  14.8KiB
           Vectors      1.02k   24.7ms    0.0%  24.1μs   34.0MiB    0.1%  34.0KiB
           Bounds       1.02k    687μs    0.0%   671ns     0.00B    0.0%    0.00B
     Property Check       128    468ms    0.4%  3.65ms   65.0MiB    0.2%   520KiB
     Compute Split        128   68.8ms    0.1%   538μs    177MiB    0.4%  1.39MiB
 Initialize                 1   14.1ms    0.0%  14.1ms   22.4MiB    0.1%  22.4MiB
 ────────────────────────────────────────────────────────────────────────────────
[VERYDIFF_TIMER] 120.927121131

[VERYDIFF_EXPERIMENT] NETWORK: /home/i57/steuber/NeuroDiff/repos/VeryDiffExperiments/src/../benchmarks/mnist-prune/specs/mnist_63_local_24.vnnlib
[VERYDIFF_EXPERIMENT] TIME: 121.248127985
