
[VERYDIFF_EXPERIMENT] Running on /home/i57/steuber/NeuroDiff/repos/VeryDiffExperiments/src/../benchmarks/mnist-prune/specs/mnist_33_global_4.vnnlib /home/i57/steuber/NeuroDiff/repos/VeryDiffExperiments/src/../benchmarks/mnist-prune/nets/mnist_relu_3_100.onnx
Loading /home/i57/steuber/NeuroDiff/repos/VeryDiffExperiments/src/../benchmarks/mnist-prune/nets/mnist_relu_3_100.onnx and /home/i57/steuber/NeuroDiff/repos/VeryDiffExperiments/src/../benchmarks/mnist-prune/nets_pruned/mnist_relu_3_100_0.77-old.onnx
INPUT SHAPE: 784
UNKNOWN
TIMEOUT
Refined: 41 | Refine Limit: 27 | Wrong: 0 | Right: 23 | Total: 23 | Total Zonos Considered: 64 | Expected 45488493838 (5.056223686348206e-08%)

time: 120.211965879

[VERYDIFF_TIMER] 120.239271004

[VERYDIFF_EXPERIMENT] NETWORK: /home/i57/steuber/NeuroDiff/repos/VeryDiffExperiments/src/../benchmarks/mnist-prune/specs/mnist_33_global_4.vnnlib
[VERYDIFF_EXPERIMENT] TIME: 120.527092072
