
[VERYDIFF_EXPERIMENT] Running on /home/i57/steuber/NeuroDiff/repos/VeryDiffExperiments/src/../benchmarks/mnist-prune/specs/mnist_20_local_18.vnnlib /home/i57/steuber/NeuroDiff/repos/VeryDiffExperiments/src/../benchmarks/mnist-prune/nets/mnist_relu_4_1024.onnx
Found input X
op: matmul, weight: (1024, 784), bias: nothing
op: bias, weight: nothing, bias: (1024,)
op: relu, weight: nothing, bias: nothing
op: matmul, weight: (1024, 1024), bias: nothing
op: bias, weight: nothing, bias: (1024,)
op: relu, weight: nothing, bias: nothing
op: matmul, weight: (1024, 1024), bias: nothing
op: bias, weight: nothing, bias: (1024,)
op: relu, weight: nothing, bias: nothing
op: matmul, weight: (10, 1024), bias: nothing
op: bias, weight: nothing, bias: (10,)
op: relu, weight: nothing, bias: nothing
op: matmul, weight: (10, 10), bias: nothing
op: bias, weight: nothing, bias: (10,)
Found input X
op: gemm, weight: (1024, 784), bias: (1024,)
op: relu, weight: nothing, bias: nothing
op: gemm, weight: (1024, 1024), bias: (1024,)
op: relu, weight: nothing, bias: nothing
op: gemm, weight: (1024, 1024), bias: (1024,)
op: relu, weight: nothing, bias: nothing
op: gemm, weight: (10, 1024), bias: (10,)
op: relu, weight: nothing, bias: nothing
op: gemm, weight: (10, 10), bias: (10,)
Distance: 915.6394868631054
Distance: 1298.7052820973968
Distance: 1296.587532894263
Distance: 6.054483317080667
Distance: 0.04942679278974538
Running with 1 threads
[Thread 1] Time to first task: 0.0s
Instable Generators: 370
Instable Generators: 666
Instable Generators: 1024
Instable Generators: 10
Zono Bounds:
[-95.23089381768575, -96.34331454739693, -106.26561973274545, -106.10992412753812, -101.5828419934727, -107.81429275608393, -95.9457206911145, -100.40637859486266, -102.9555671922471, -107.21837779123463]
[95.20863410281622, 96.21557447641361, 106.00756613095302, 105.65758979638103, 101.52937895961821, 107.65920967600802, 95.95591986996948, 99.99318227727728, 102.67265680272915, 107.11056499088507]
[Thread 1] Processed 100 zonotopes (Work Done: 0.0%; Expected Zonos: Inf)


TIMEOUT REACHED
UNKNOWN
[Thread 1] Total splits: 159
Processed 159 zonotopes (Work Done: 0.0%); Generated 318 (0.7564312000754717s/loop)
[Thread 1] Finished in 120.27s
 ────────────────────────────────────────────────────────────────────────────────
                                        Time                    Allocations      
                               ───────────────────────   ────────────────────────
       Tot / % measured:             120s / 100.0%           36.3GiB / 100.0%    

 Section               ncalls     time    %tot     avg     alloc    %tot      avg
 ────────────────────────────────────────────────────────────────────────────────
 Verify                     1     120s  100.0%    120s   36.3GiB   99.9%  36.3GiB
   Zonotope Loop            1     120s  100.0%    120s   36.3GiB   99.9%  36.3GiB
     Zonotope Propa...    159     120s   99.4%   752ms   35.9GiB   99.0%   231MiB
       DiffZonotope...    636    63.9s   53.1%   100ms   28.6GiB   78.7%  46.0MiB
         Zonotope_R...  1.27k    40.1s   33.4%  31.5ms   17.5GiB   48.3%  14.1MiB
           Allocation   1.27k    30.9s   25.7%  24.3ms   7.32GiB   20.2%  5.89MiB
           Column M...  1.27k    6.47s    5.4%  5.08ms   7.32GiB   20.2%  5.89MiB
           Influenc...  1.27k    1.62s    1.3%  1.27ms   2.84GiB    7.8%  2.29MiB
             Multiply   1.27k    1.56s    1.3%  1.23ms   2.63GiB    7.3%  2.12MiB
             Alloca...  1.27k   34.1ms    0.0%  26.8μs    211MiB    0.6%   170KiB
             Set Ma...  1.27k   14.6ms    0.0%  11.5μs     0.00B    0.0%    0.00B
           Set Matrix   1.27k    1.14s    0.9%   893μs   14.7MiB    0.0%  11.8KiB
           Vectors      1.27k   38.8ms    0.0%  30.5μs   42.2MiB    0.1%  34.0KiB
           Bounds       1.27k    863μs    0.0%   678ns     0.00B    0.0%    0.00B
       DiffZonotope...    795    55.7s   46.3%  70.1ms   7.36GiB   20.3%  9.48MiB
         Zonotope_D...  1.59k    18.9s   15.7%  11.9ms   3.01GiB    8.3%  1.94MiB
     Property Check       159    582ms    0.5%  3.66ms   68.0MiB    0.2%   438KiB
     Compute Split        159   55.6ms    0.0%   350μs    145MiB    0.4%   931KiB
 Initialize                 1   18.9ms    0.0%  18.9ms   22.4MiB    0.1%  22.4MiB
 ────────────────────────────────────────────────────────────────────────────────
[VERYDIFF_TIMER] 120.371861735

[VERYDIFF_EXPERIMENT] NETWORK: /home/i57/steuber/NeuroDiff/repos/VeryDiffExperiments/src/../benchmarks/mnist-prune/specs/mnist_20_local_18.vnnlib
[VERYDIFF_EXPERIMENT] TIME: 120.621983452
