
[VERYDIFF_EXPERIMENT] Running on /home/i57/steuber/NeuroDiff/repos/VeryDiffExperiments/src/../benchmarks/mnist-prune/specs/mnist_20_global_5.vnnlib /home/i57/steuber/NeuroDiff/repos/VeryDiffExperiments/src/../benchmarks/mnist-prune/nets/mnist_relu_2_512.onnx
Found input X
op: matmul, weight: (512, 784), bias: nothing
op: bias, weight: nothing, bias: (512,)
op: relu, weight: nothing, bias: nothing
op: matmul, weight: (512, 512), bias: nothing
op: bias, weight: nothing, bias: (512,)
op: relu, weight: nothing, bias: nothing
op: matmul, weight: (10, 512), bias: nothing
op: bias, weight: nothing, bias: (10,)
Found input X
op: gemm, weight: (512, 784), bias: (512,)
op: relu, weight: nothing, bias: nothing
op: gemm, weight: (512, 512), bias: (512,)
op: relu, weight: nothing, bias: nothing
op: gemm, weight: (10, 512), bias: (10,)
Distance: 973.3044369037136
Distance: 481.63499746812613
Distance: 8.744412635378467
Running with 1 threads
[Thread 1] Time to first task: 0.01s
Instable Generators: 130
Instable Generators: 377
Zono Bounds:
[-12.906276309796159, -12.662092661079125, -11.121556462717173, -12.071495523262207, -12.210047781250163, -11.253009016460936, -12.26673429759221, -11.72981124764602, -10.166481357465182, -9.717329860407075]
[17.28034318968811, 17.328924397239042, 15.072263347556152, 15.191094033622516, 15.488761628353553, 14.018467848353978, 16.656012321095062, 15.178004087618438, 12.278828328745275, 11.961720570922337]
[Thread 1] Processed 100 zonotopes (Work Done: 0.0%; Expected Zonos: Inf)
[Thread 1] Processed 200 zonotopes (Work Done: 0.0%; Expected Zonos: Inf)


TIMEOUT REACHED
UNKNOWN
[Thread 1] Total splits: 271
Processed 271 zonotopes (Work Done: 0.0%); Generated 542 (0.44379430653874535s/loop)
[Thread 1] Finished in 120.27s
 ────────────────────────────────────────────────────────────────────────────────
                                        Time                    Allocations      
                               ───────────────────────   ────────────────────────
       Tot / % measured:             120s / 100.0%           45.0GiB / 100.0%    

 Section               ncalls     time    %tot     avg     alloc    %tot      avg
 ────────────────────────────────────────────────────────────────────────────────
 Verify                     1     120s  100.0%    120s   45.0GiB  100.0%  45.0GiB
   Zonotope Loop            1     120s  100.0%    120s   45.0GiB  100.0%  45.0GiB
     Zonotope Propa...    271    83.9s   69.8%   310ms   34.2GiB   76.0%   129MiB
       DiffZonotope...    542    43.6s   36.3%  80.4ms   28.6GiB   63.5%  54.0MiB
         Zonotope_R...  1.08k    41.1s   34.2%  37.9ms   24.9GiB   55.2%  23.5MiB
           Influenc...  1.08k    21.5s   17.9%  19.9ms   15.7GiB   34.9%  14.9MiB
             Multiply   1.08k    14.2s   11.8%  13.1ms   8.76GiB   19.5%  8.27MiB
             Alloca...  1.08k    6.36s    5.3%  5.87ms   6.97GiB   15.5%  6.58MiB
             Set Ma...  1.08k    923ms    0.8%   851μs     0.00B    0.0%    0.00B
           Column M...  1.08k    15.4s   12.8%  14.2ms   4.55GiB   10.1%  4.30MiB
           Allocation   1.08k    3.55s    3.0%  3.28ms   4.55GiB   10.1%  4.30MiB
           Set Matrix   1.08k    626ms    0.5%   577μs   7.22MiB    0.0%  6.82KiB
           Vectors      1.08k   23.5ms    0.0%  21.7μs   26.4MiB    0.1%  25.0KiB
           Bounds       1.08k    770μs    0.0%   710ns     0.00B    0.0%    0.00B
       DiffZonotope...    813    40.3s   33.5%  49.6ms   5.64GiB   12.5%  7.11MiB
         Zonotope_D...  1.63k    24.6s   20.4%  15.1ms   3.57GiB    7.9%  2.25MiB
     Compute Split        271    24.3s   20.2%  89.5ms   5.43GiB   12.1%  20.5MiB
     Property Check       271    244ms    0.2%   902μs   83.3MiB    0.2%   315KiB
 Initialize                 1   2.16ms    0.0%  2.16ms   9.84MiB    0.0%  9.84MiB
 ────────────────────────────────────────────────────────────────────────────────
[VERYDIFF_TIMER] 120.304476541

[VERYDIFF_EXPERIMENT] NETWORK: /home/i57/steuber/NeuroDiff/repos/VeryDiffExperiments/src/../benchmarks/mnist-prune/specs/mnist_20_global_5.vnnlib
[VERYDIFF_EXPERIMENT] TIME: 120.699509995
