
[VERYDIFF_EXPERIMENT] Running on /home/i57/steuber/NeuroDiff/repos/VeryDiffExperiments/src/../benchmarks/mnist-prune/specs/mnist_43_local_21.vnnlib /home/i57/steuber/NeuroDiff/repos/VeryDiffExperiments/src/../benchmarks/mnist-prune/nets/mnist_relu_3_100.onnx
Parsing /home/i57/steuber/NeuroDiff/repos/VeryDiffExperiments/src/../benchmarks/mnist-prune/nets/mnist_relu_3_100.onnx...
Found input X
op: matmul, weight: (100, 784), bias: nothing
op: bias, weight: nothing, bias: (100,)
op: relu, weight: nothing, bias: nothing
op: matmul, weight: (100, 100), bias: nothing
op: bias, weight: nothing, bias: (100,)
op: relu, weight: nothing, bias: nothing
op: matmul, weight: (10, 100), bias: nothing
op: bias, weight: nothing, bias: (10,)
op: relu, weight: nothing, bias: nothing
op: matmul, weight: (10, 10), bias: nothing
op: bias, weight: nothing, bias: (10,)
Parsing /home/i57/steuber/NeuroDiff/repos/VeryDiffExperiments/src/../benchmarks/mnist-prune/nets_pruned/mnist_relu_3_100_0.79_adam_1_stepsize-old.onnx...
Found input X
op: gemm, weight: (100, 784), bias: (100,)
op: relu, weight: nothing, bias: nothing
op: gemm, weight: (100, 100), bias: (100,)
op: relu, weight: nothing, bias: nothing
op: gemm, weight: (10, 100), bias: (10,)
op: relu, weight: nothing, bias: nothing
op: gemm, weight: (10, 10), bias: (10,)
Distance: 368.62397500800625
Distance: 47.56803950402309
Distance: 2.8977568827249343
Distance: 0.01885471428334995
Running with 1 threads
[Thread 1] Time to first task: 0.0s
Instable Generators: 49
Instable Generators: 68
Instable Generators: 8
Zono Bounds:
[-2.0530740950387694, -2.2406044549357635, -2.344433144218995, -2.129945503510487, -2.485513824732265, -2.4470706538839395, -2.4921931676701545, -2.5370203195358, -2.056911383141542, -0.0033067015783797846]
[2.0043555169124607, 2.258628096296628, 2.148397752047599, 1.9892426248125412, 2.4847748183983738, 2.39152206314168, 2.488063731054342, 2.530929807051406, 1.8627981383185996, 0.0020276611451318025]
[Thread 1] Processed 100 zonotopes (Work Done: 0.0%; Expected Zonos: Inf)
[Thread 1] Processed 200 zonotopes (Work Done: 0.0%; Expected Zonos: Inf)
[Thread 1] Processed 300 zonotopes (Work Done: 0.0%; Expected Zonos: Inf)
[Thread 1] Processed 400 zonotopes (Work Done: 0.0%; Expected Zonos: Inf)
[Thread 1] Processed 500 zonotopes (Work Done: 0.0%; Expected Zonos: Inf)
[Thread 1] Processed 600 zonotopes (Work Done: 0.0%; Expected Zonos: Inf)
[Thread 1] Processed 700 zonotopes (Work Done: 0.0%; Expected Zonos: Inf)
[Thread 1] Processed 800 zonotopes (Work Done: 0.0%; Expected Zonos: Inf)
[Thread 1] Processed 900 zonotopes (Work Done: 0.0%; Expected Zonos: Inf)
[Thread 1] Processed 1000 zonotopes (Work Done: 0.0%; Expected Zonos: Inf)
[Thread 1] Processed 1100 zonotopes (Work Done: 0.0%; Expected Zonos: Inf)
[Thread 1] Processed 1200 zonotopes (Work Done: 0.0%; Expected Zonos: Inf)
[Thread 1] Processed 1300 zonotopes (Work Done: 0.0%; Expected Zonos: Inf)
[Thread 1] Processed 1400 zonotopes (Work Done: 0.0%; Expected Zonos: Inf)
[Thread 1] Processed 1500 zonotopes (Work Done: 0.0%; Expected Zonos: Inf)
[Thread 1] Processed 1600 zonotopes (Work Done: 0.0%; Expected Zonos: Inf)
[Thread 1] Processed 1700 zonotopes (Work Done: 0.0%; Expected Zonos: Inf)
[Thread 1] Processed 1800 zonotopes (Work Done: 0.0%; Expected Zonos: Inf)
[Thread 1] Processed 1900 zonotopes (Work Done: 0.0%; Expected Zonos: Inf)
[Thread 1] Processed 2000 zonotopes (Work Done: 0.0%; Expected Zonos: Inf)
[Thread 1] Processed 2100 zonotopes (Work Done: 0.0%; Expected Zonos: Inf)
[Thread 1] Processed 2200 zonotopes (Work Done: 0.0%; Expected Zonos: Inf)
[Thread 1] Processed 2300 zonotopes (Work Done: 0.0%; Expected Zonos: Inf)
[Thread 1] Processed 2400 zonotopes (Work Done: 0.0%; Expected Zonos: Inf)
[Thread 1] Processed 2500 zonotopes (Work Done: 0.0%; Expected Zonos: Inf)
[Thread 1] Processed 2600 zonotopes (Work Done: 0.0%; Expected Zonos: Inf)
[Thread 1] Processed 2700 zonotopes (Work Done: 0.0%; Expected Zonos: Inf)
[Thread 1] Processed 2800 zonotopes (Work Done: 0.0%; Expected Zonos: Inf)
[Thread 1] Processed 2900 zonotopes (Work Done: 0.0%; Expected Zonos: Inf)
[Thread 1] Processed 3000 zonotopes (Work Done: 0.0%; Expected Zonos: Inf)
[Thread 1] Processed 3100 zonotopes (Work Done: 0.0%; Expected Zonos: Inf)
[Thread 1] Processed 3200 zonotopes (Work Done: 0.0%; Expected Zonos: Inf)
[Thread 1] Processed 3300 zonotopes (Work Done: 0.0%; Expected Zonos: Inf)


TIMEOUT REACHED
UNKNOWN
[Thread 1] Total splits: 3335
Processed 3335 zonotopes (Work Done: 0.0%); Generated 6670 (0.035990068815892055s/loop)
[Thread 1] Finished in 120.03s
 ────────────────────────────────────────────────────────────────────────────────
                                        Time                    Allocations      
                               ───────────────────────   ────────────────────────
       Tot / % measured:             120s / 100.0%           55.3GiB / 100.0%    

 Section               ncalls     time    %tot     avg     alloc    %tot      avg
 ────────────────────────────────────────────────────────────────────────────────
 Verify                     1     120s  100.0%    120s   55.3GiB  100.0%  55.3GiB
   Zonotope Loop            1     120s  100.0%    120s   55.3GiB  100.0%  55.3GiB
     Property Check     3.33k     112s   93.5%  33.6ms   46.5GiB   84.2%  14.3MiB
     Zonotope Propa...  3.33k    6.74s    5.6%  2.02ms   5.24GiB    9.5%  1.61MiB
       DiffZonotope...  13.3k    4.25s    3.5%   319μs   1.11GiB    2.0%  87.0KiB
         Zonotope_D...  26.7k    1.63s    1.4%  61.0μs    562MiB    1.0%  21.6KiB
       DiffZonotope...  10.0k    2.46s    2.0%   245μs   4.13GiB    7.5%   433KiB
         Zonotope_R...  20.0k    1.53s    1.3%  76.5μs   2.72GiB    4.9%   143KiB
           Influenc...  20.0k    585ms    0.5%  29.2μs    853MiB    1.5%  43.7KiB
             Multiply   20.0k    428ms    0.4%  21.4μs    546MiB    1.0%  28.0KiB
             Alloca...  20.0k    121ms    0.1%  6.02μs    307MiB    0.5%  15.7KiB
             Set Ma...  20.0k   23.7ms    0.0%  1.18μs     0.00B    0.0%    0.00B
           Column M...  20.0k    425ms    0.4%  21.2μs    927MiB    1.6%  47.4KiB
           Allocation   20.0k    318ms    0.3%  15.9μs    925MiB    1.6%  47.4KiB
           Set Matrix   20.0k    107ms    0.1%  5.35μs   20.8MiB    0.0%  1.06KiB
           Vectors      20.0k   66.5ms    0.1%  3.32μs   63.6MiB    0.1%  3.26KiB
           Bounds       20.0k   5.55ms    0.0%   277ns     0.00B    0.0%    0.00B
     Compute Split      3.33k    389ms    0.3%   117μs    686MiB    1.2%   211KiB
 Initialize                 1    313μs    0.0%   313μs    858KiB    0.0%   858KiB
 ────────────────────────────────────────────────────────────────────────────────
[VERYDIFF_TIMER] 120.063736676

[VERYDIFF_EXPERIMENT] NETWORK: /home/i57/steuber/NeuroDiff/repos/VeryDiffExperiments/src/../benchmarks/mnist-prune/specs/mnist_43_local_21.vnnlib
[VERYDIFF_EXPERIMENT] TIME: 120.372146553
