
[VERYDIFF_EXPERIMENT] Running on /home/i57/steuber/NeuroDiff/repos/VeryDiffExperiments/src/../benchmarks/mnist-prune/specs/mnist_33_global_5.vnnlib /home/i57/steuber/NeuroDiff/repos/VeryDiffExperiments/src/../benchmarks/mnist-prune/nets/mnist_relu_3_100.onnx
Loading /home/i57/steuber/NeuroDiff/repos/VeryDiffExperiments/src/../benchmarks/mnist-prune/nets/mnist_relu_3_100.onnx and /home/i57/steuber/NeuroDiff/repos/VeryDiffExperiments/src/../benchmarks/mnist-prune/nets_pruned/mnist_relu_3_100_0.79_adam_1_stepsize-old.onnx
INPUT SHAPE: 784
UNKNOWN
TIMEOUT
Refined: 32 | Refine Limit: 27 | Wrong: 0 | Right: 15 | Total: 15 | Total Zonos Considered: 47 | Expected 1647646675923 (9.103893583008083e-10%)

time: 120.302248695

[VERYDIFF_TIMER] 120.32962437

[VERYDIFF_EXPERIMENT] NETWORK: /home/i57/steuber/NeuroDiff/repos/VeryDiffExperiments/src/../benchmarks/mnist-prune/specs/mnist_33_global_5.vnnlib
[VERYDIFF_EXPERIMENT] TIME: 120.619034336
