
[VERYDIFF_EXPERIMENT] Running on /home/i57/steuber/NeuroDiff/repos/VeryDiffExperiments/src/../benchmarks/mnist-prune/specs/mnist_1_global_3.vnnlib /home/i57/steuber/NeuroDiff/repos/VeryDiffExperiments/src/../benchmarks/mnist-prune/nets/mnist_relu_3_100.onnx
Found input X
op: matmul, weight: (100, 784), bias: nothing
op: bias, weight: nothing, bias: (100,)
op: relu, weight: nothing, bias: nothing
op: matmul, weight: (100, 100), bias: nothing
op: bias, weight: nothing, bias: (100,)
op: relu, weight: nothing, bias: nothing
op: matmul, weight: (10, 100), bias: nothing
op: bias, weight: nothing, bias: (10,)
op: relu, weight: nothing, bias: nothing
op: matmul, weight: (10, 10), bias: nothing
op: bias, weight: nothing, bias: (10,)
Found input X
op: gemm, weight: (100, 784), bias: (100,)
op: relu, weight: nothing, bias: nothing
op: gemm, weight: (100, 100), bias: (100,)
op: relu, weight: nothing, bias: nothing
op: gemm, weight: (10, 100), bias: (10,)
op: relu, weight: nothing, bias: nothing
op: gemm, weight: (10, 10), bias: (10,)
Distance: 368.62397500800625
Distance: 47.56803950402309
Distance: 2.8977568827249343
Distance: 0.01885471428334995
Running with 1 threads
[Thread 1] Time to first task: 0.0s
Instable Generators: 19
Instable Generators: 17
Instable Generators: 3
Zono Bounds:
[-0.42207884979613775, -0.2766024308113252, -0.26838403031338554, -0.36800895049849575, -0.00016495864650012713, -0.48247718396740147, -0.3673286572105086, 0.00027912137688704654, -0.3447629769289586, -0.001217411303369291]
[0.4196083725004449, 0.2539245946265559, 0.35344006456580535, 0.22239587581265047, 0.0005061477472318055, 0.413642840680412, 0.36628138558665074, 0.0017307916508526046, 0.2654740644937121, 9.72326143866435e-5]
[Thread 1] Processed 100 zonotopes (Work Done: 0.0%; Expected Zonos: Inf)
[Thread 1] Processed 200 zonotopes (Work Done: 0.0%; Expected Zonos: Inf)
[Thread 1] Processed 300 zonotopes (Work Done: 0.0%; Expected Zonos: Inf)
[Thread 1] Processed 400 zonotopes (Work Done: 0.0%; Expected Zonos: Inf)
[Thread 1] Processed 500 zonotopes (Work Done: 0.0%; Expected Zonos: Inf)


TIMEOUT REACHED
UNKNOWN
[Thread 1] Total splits: 589
Processed 589 zonotopes (Work Done: 0.0%); Generated 1178 (0.20407865382003396s/loop)
[Thread 1] Finished in 120.2s
 ────────────────────────────────────────────────────────────────────────────────
                                        Time                    Allocations      
                               ───────────────────────   ────────────────────────
       Tot / % measured:             120s / 100.0%           60.2GiB / 100.0%    

 Section               ncalls     time    %tot     avg     alloc    %tot      avg
 ────────────────────────────────────────────────────────────────────────────────
 Verify                     1     120s  100.0%    120s   60.2GiB  100.0%  60.2GiB
   Zonotope Loop            1     120s  100.0%    120s   60.2GiB  100.0%  60.2GiB
     Zonotope Propa...    589    42.2s   35.1%  71.6ms   40.1GiB   66.6%  69.7MiB
       DiffZonotope...  1.77k    32.0s   26.6%  18.1ms   37.8GiB   62.7%  21.9MiB
         Zonotope_R...  3.53k    31.4s   26.1%  8.88ms   36.9GiB   61.3%  10.7MiB
           Influenc...  3.53k    30.6s   25.5%  8.66ms   33.9GiB   56.3%  9.82MiB
             Multiply   3.53k    27.3s   22.7%  7.73ms   17.1GiB   28.4%  4.95MiB
             Set Ma...  3.53k    2.41s    2.0%   683μs     0.00B    0.0%    0.00B
             Alloca...  3.53k    855ms    0.7%   242μs   16.8GiB   27.9%  4.87MiB
           Column M...  3.53k    484ms    0.4%   137μs   1.50GiB    2.5%   444KiB
           Set Matrix   3.53k    185ms    0.2%  52.3μs   2.06MiB    0.0%     612B
           Allocation   3.53k   75.6ms    0.1%  21.4μs   1.50GiB    2.5%   444KiB
           Vectors      3.53k   17.5ms    0.0%  4.95μs   11.2MiB    0.0%  3.26KiB
           Bounds       3.53k   2.53ms    0.0%   715ns     0.00B    0.0%    0.00B
       DiffZonotope...  2.36k    10.2s    8.5%  4.34ms   2.33GiB    3.9%  1.01MiB
         Zonotope_D...  4.71k    4.95s    4.1%  1.05ms   1.54GiB    2.6%   343KiB
     Compute Split        589    39.3s   32.7%  66.8ms   8.56GiB   14.2%  14.9MiB
     Property Check       589    115ms    0.1%   195μs    118MiB    0.2%   204KiB
 Initialize                 1    518μs    0.0%   518μs   5.41MiB    0.0%  5.41MiB
 ────────────────────────────────────────────────────────────────────────────────
[VERYDIFF_TIMER] 120.235251498

[VERYDIFF_EXPERIMENT] NETWORK: /home/i57/steuber/NeuroDiff/repos/VeryDiffExperiments/src/../benchmarks/mnist-prune/specs/mnist_1_global_3.vnnlib
[VERYDIFF_EXPERIMENT] TIME: 120.695294697
