
[VERYDIFF_EXPERIMENT] Running on /home/i57/steuber/NeuroDiff/repos/VeryDiffExperiments/src/../benchmarks/mnist-prune/specs/mnist_35_global_4.vnnlib /home/i57/steuber/NeuroDiff/repos/VeryDiffExperiments/src/../benchmarks/mnist-prune/nets/mnist_relu_2_512.onnx
/home/i57/steuber/NeuroDiff/repos/VeryDiffExperiments/src/../benchmarks/mnist-prune/nets/mnist_relu_2_512.onnx
/home/i57/steuber/NeuroDiff/repos/VeryDiffExperiments/src/../benchmarks/mnist-prune/nets_pruned/mnist_relu_2_512_pruned5.onnx
[[0.         0.01568628]
 [0.         0.01568628]
 [0.         0.01568628]
 ...
 [0.         0.01568628]
 [0.         0.01568628]
 [0.         0.01568628]]
top
120
False
512
512
512
512
### Vars ###
### Constraints ###
A_pi_3_0 = 0 --> (A_x_2_0 + 0.0001) <= A_top_3_0
A_pi_3_1 = 0 --> (A_x_2_1 + 0.0001) <= A_top_3_0
A_pi_3_2 = 0 --> (A_x_2_2 + 0.0001) <= A_top_3_0
A_pi_3_3 = 0 --> (A_x_2_3 + 0.0001) <= A_top_3_0
A_pi_3_4 = 0 --> (A_x_2_4 + 0.0001) <= A_top_3_0
A_pi_3_5 = 0 --> (A_x_2_5 + 0.0001) <= A_top_3_0
A_pi_3_6 = 0 --> (A_x_2_6 + 0.0001) <= A_top_3_0
A_pi_3_7 = 0 --> (A_x_2_7 + 0.0001) <= A_top_3_0
A_pi_3_8 = 0 --> (A_x_2_8 + 0.0001) <= A_top_3_0
A_pi_3_9 = 0 --> (A_x_2_9 + 0.0001) <= A_top_3_0
Set parameter TimeLimit to value 120
Set parameter Threads to value 1
Gurobi Optimizer version 10.0.0 build v10.0.0rc2 (linux64)

CPU model: Intel(R) Core(TM) i5-6500 CPU @ 3.20GHz, instruction set [SSE2|AVX|AVX2]
Thread count: 4 physical cores, 4 logical processors, using up to 1 threads

Optimize a model with 14522 rows, 7012 columns and 1321876 nonzeros
Model fingerprint: 0xed2d3b1b
Variable types: 4934 continuous, 2078 integer (2078 binary)
Coefficient statistics:
  Matrix range     [1e-07, 2e+06]
  Objective range  [1e+00, 1e+00]
  Bounds range     [4e-03, 1e+00]
  RHS range        [1e-04, 2e+06]
Warning: Model contains large matrix coefficient range
         Consider reformulating model or setting NumericFocus parameter
         to avoid numerical issues.
Presolve removed 8384 rows and 2438 columns
Presolve time: 2.38s
Presolved: 6138 rows, 4574 columns, 606965 nonzeros
Variable types: 3416 continuous, 1158 integer (1158 binary)

Root relaxation: objective 5.009364e+02, 2559 iterations, 0.74 seconds (1.56 work units)

    Nodes    |    Current Node    |     Objective Bounds      |     Work
 Expl Unexpl |  Obj  Depth IntInf | Incumbent    BestBd   Gap | It/Node Time

     0     0  500.93636    0  370          -  500.93636      -     -    4s
     0     0  498.60000    0  341          -  498.60000      -     -    7s
     0     0  498.59999    0  351          -  498.59999      -     -    7s
     0     0  498.59999    0  357          -  498.59999      -     -    7s
     0     0  498.59999    0  359          -  498.59999      -     -    7s
     0     0  498.59999    0  360          -  498.59999      -     -    7s
     0     0  497.93711    0  362          -  497.93711      -     -    8s
     0     0  497.93711    0  364          -  497.93711      -     -    8s
     0     0  497.93711    0  364          -  497.93711      -     -    8s
     0     0  497.43617    0  366          -  497.43617      -     -    8s
     0     0  497.00834    0  368          -  497.00834      -     -    8s
     0     0  496.63259    0  364          -  496.63259      -     -    8s
     0     0  496.44635    0  362          -  496.44635      -     -    8s
     0     0  496.44635    0  362          -  496.44635      -     -    8s
     0     0  496.32093    0  362          -  496.32093      -     -    8s
     0     0  496.17468    0  363          -  496.17468      -     -    8s
     0     0  490.94982    0  384          -  490.94982      -     -    9s
     0     0  489.64126    0  385          -  489.64126      -     -    9s
     0     0  489.50174    0  385          -  489.50174      -     -   10s
     0     0  489.48293    0  384          -  489.48293      -     -   10s
     0     0  456.03210    0  272          -  456.03210      -     -   13s
     0     0  456.02913    0  271          -  456.02913      -     -   13s
     0     0  452.35439    0  283          -  452.35439      -     -   14s
     0     0  413.33837    0  269          -  413.33837      -     -   14s
     0     0  413.30633    0  269          -  413.30633      -     -   14s
     0     0  413.08118    0  269          -  413.08118      -     -   15s
     0     0  412.95158    0  265          -  412.95158      -     -   15s
     0     0  412.93664    0  265          -  412.93664      -     -   15s
     0     0  412.93652    0  265          -  412.93652      -     -   15s
     0     0  361.03542    0  294          -  361.03542      -     -   19s
     0     0  358.92359    0  299          -  358.92359      -     -   19s
     0     0  356.16081    0  300          -  356.16081      -     -   19s
     0     0  355.23586    0  301          -  355.23586      -     -   20s
     0     0  354.54310    0  300          -  354.54310      -     -   20s
     0     0  354.40442    0  299          -  354.40442      -     -   20s
     0     0  354.34583    0  300          -  354.34583      -     -   20s
     0     0  354.34309    0  300          -  354.34309      -     -   20s
     0     0  296.33749    0  396          -  296.33749      -     -   26s
     0     0  296.26010    0  499          -  296.26010      -     -   26s
     0     0  296.22743    0  497          -  296.22743      -     -   26s
     0     0  294.64558    0  500          -  294.64558      -     -   27s
     0     0  293.42266    0  492          -  293.42266      -     -   28s
     0     0  293.31819    0  492          -  293.31819      -     -   28s
     0     0  293.27172    0  495          -  293.27172      -     -   28s
     0     0  285.85629    0  480          -  285.85629      -     -   31s
     0     0  284.75470    0  477          -  284.75470      -     -   32s
     0     0  284.36400    0  473          -  284.36400      -     -   32s
     0     0  283.97044    0  480          -  283.97044      -     -   32s
     0     0  282.88321    0  477          -  282.88321      -     -   32s
     0     0  282.86140    0  475          -  282.86140      -     -   33s
     0     0  270.11007    0  456          -  270.11007      -     -   36s
     0     0  269.78753    0  476          -  269.78753      -     -   36s
     0     0  269.66411    0  483          -  269.66411      -     -   36s
     0     0  269.64617    0  484          -  269.64617      -     -   36s
     0     0  262.93157    0  465          -  262.93157      -     -   39s
     0     0  262.80671    0  466          -  262.80671      -     -   39s
     0     0  262.59333    0  465          -  262.59333      -     -   42s
     0     0  262.59333    0  465          -  262.59333      -     -   46s
H    0     0                      -0.0000000  262.59333      -     -   53s
H    0     0                       0.0000000  262.59333      -     -   54s
     0     0  238.32306    0  383    0.00000  238.32306      -     -   68s
     0     0  234.88674    0  552    0.00000  234.88674      -     -   72s
     0     0  234.35409    0  540    0.00000  234.35409      -     -   72s
     0     0  234.26159    0  538    0.00000  234.26159      -     -   72s
     0     0  233.50683    0  540    0.00000  233.50683      -     -   73s
     0     0  232.49032    0  551    0.00000  232.49032      -     -   73s
     0     0  231.82094    0  549    0.00000  231.82094      -     -   73s
     0     0  231.16429    0  541    0.00000  231.16429      -     -   73s
     0     0  229.56476    0  555    0.00000  229.56476      -     -   73s
     0     0  229.23044    0  558    0.00000  229.23044      -     -   74s
     0     0  229.13657    0  570    0.00000  229.13657      -     -   74s
     0     0  229.13263    0  571    0.00000  229.13263      -     -   74s
     0     0  227.59059    0  566    0.00000  227.59059      -     -   77s
     0     0  227.17868    0  559    0.00000  227.17868      -     -   79s
     0     0  226.78154    0  565    0.00000  226.78154      -     -   79s
     0     0  226.58139    0  563    0.00000  226.58139      -     -   80s
     0     0  226.57586    0  562    0.00000  226.57586      -     -   80s
     0     0  225.63351    0  548    0.00000  225.63351      -     -   86s
     0     0  224.93033    0  555    0.00000  224.93033      -     -   88s
     0     0  224.65531    0  565    0.00000  224.65531      -     -   89s
     0     0  224.57041    0  569    0.00000  224.57041      -     -   89s
     0     0  224.55788    0  571    0.00000  224.55788      -     -   89s
     0     0  224.55711    0  571    0.00000  224.55711      -     -   90s
     0     0  224.22244    0  569    0.00000  224.22244      -     -   97s
     0     0  223.98943    0  566    0.00000  223.98943      -     -   98s
     0     0  223.92335    0  567    0.00000  223.92335      -     -   99s
     0     0  223.85321    0  570    0.00000  223.85321      -     -  100s
     0     0  223.84820    0  568    0.00000  223.84820      -     -  100s
     0     0  223.69027    0  566    0.00000  223.69027      -     -  103s
     0     0  223.39632    0  571    0.00000  223.39632      -     -  105s
     0     0  223.36878    0  569    0.00000  223.36878      -     -  106s
     0     0  223.36751    0  570    0.00000  223.36751      -     -  106s
     0     0  223.21531    0  567    0.00000  223.21531      -     -  110s
H    0     0                       0.0000000  223.21531      -     -  111s
     0     0  223.04419    0  568    0.00000  223.04419      -     -  112s
     0     0  222.99293    0  568    0.00000  222.99293      -     -  113s
     0     0  222.98739    0  569    0.00000  222.98739      -     -  114s
     0     0  222.82374    0  565    0.00000  222.82374      -     -  118s
     0     0          -    0         0.00000  222.82374      -     -  120s

Cutting planes:
  Gomory: 178
  Implied bound: 1
  MIR: 211
  Flow cover: 36
  RLT: 122

Explored 1 nodes (31955 simplex iterations) in 120.01 seconds (141.89 work units)
Thread count was 1 (of 4 available processors)

Solution count 2: 7.58249e-10 -5.82077e-11 

Time limit reached
Best objective 7.582485750390e-10, best bound 2.228237410586e+02, gap -


TIMEOUT
time: 151.964010988

[VERYDIFF_TIMER] 151.990568173

[VERYDIFF_EXPERIMENT] Running on /home/i57/steuber/NeuroDiff/repos/VeryDiffExperiments/src/../benchmarks/mnist-prune/specs/mnist_35_global_4.vnnlib /home/i57/steuber/NeuroDiff/repos/VeryDiffExperiments/src/../benchmarks/mnist-prune/nets/mnist_relu_3_100.onnx
/home/i57/steuber/NeuroDiff/repos/VeryDiffExperiments/src/../benchmarks/mnist-prune/nets/mnist_relu_3_100.onnx
/home/i57/steuber/NeuroDiff/repos/VeryDiffExperiments/src/../benchmarks/mnist-prune/nets_pruned/mnist_relu_3_100_pruned5.onnx
[[0.         0.01568628]
 [0.         0.01568628]
 [0.         0.01568628]
 ...
 [0.         0.01568628]
 [0.         0.01568628]
 [0.         0.01568628]]
top
120
False
100
100
10
100
100
10
### Vars ###
### Constraints ###
A_pi_4_0 = 0 --> (A_x_3_0 + 0.0001) <= A_top_4_0
A_pi_4_1 = 0 --> (A_x_3_1 + 0.0001) <= A_top_4_0
A_pi_4_2 = 0 --> (A_x_3_2 + 0.0001) <= A_top_4_0
A_pi_4_3 = 0 --> (A_x_3_3 + 0.0001) <= A_top_4_0
A_pi_4_4 = 0 --> (A_x_3_4 + 0.0001) <= A_top_4_0
A_pi_4_5 = 0 --> (A_x_3_5 + 0.0001) <= A_top_4_0
A_pi_4_6 = 0 --> (A_x_3_6 + 0.0001) <= A_top_4_0
A_pi_4_7 = 0 --> (A_x_3_7 + 0.0001) <= A_top_4_0
A_pi_4_8 = 0 --> (A_x_3_8 + 0.0001) <= A_top_4_0
A_pi_4_9 = 0 --> (A_x_3_9 + 0.0001) <= A_top_4_0
Set parameter TimeLimit to value 120
Set parameter Threads to value 1
Gurobi Optimizer version 10.0.0 build v10.0.0rc2 (linux64)

CPU model: Intel(R) Core(TM) i5-6500 CPU @ 3.20GHz, instruction set [SSE2|AVX|AVX2]
Thread count: 4 physical cores, 4 logical processors, using up to 1 threads

Optimize a model with 3126 rows, 2128 columns and 179801 nonzeros
Model fingerprint: 0xf64c574b
Variable types: 1678 continuous, 450 integer (450 binary)
Coefficient statistics:
  Matrix range     [1e-06, 2e+06]
  Objective range  [1e+00, 1e+00]
  Bounds range     [4e-03, 1e+00]
  RHS range        [1e-04, 2e+06]
Warning: Model contains large matrix coefficient range
         Consider reformulating model or setting NumericFocus parameter
         to avoid numerical issues.
Presolve removed 1606 rows and 476 columns
Presolve time: 0.54s
Presolved: 1520 rows, 1652 columns, 93946 nonzeros
Variable types: 1379 continuous, 273 integer (273 binary)

Root relaxation: objective 2.376228e+01, 520 iterations, 0.03 seconds (0.05 work units)

    Nodes    |    Current Node    |     Objective Bounds      |     Work
 Expl Unexpl |  Obj  Depth IntInf | Incumbent    BestBd   Gap | It/Node Time

     0     0   23.76228    0   60          -   23.76228      -     -    0s
     0     0   22.16965    0   64          -   22.16965      -     -    0s
     0     0   22.14024    0   64          -   22.14024      -     -    0s
     0     0   18.80340    0   67          -   18.80340      -     -    1s
     0     0   18.75770    0   67          -   18.75770      -     -    1s
     0     0   18.75713    0   67          -   18.75713      -     -    1s
     0     0   17.59118    0   53          -   17.59118      -     -    1s
     0     0   17.57230    0   52          -   17.57230      -     -    1s
     0     0   17.57230    0   52          -   17.57230      -     -    1s
     0     0   16.83051    0   52          -   16.83051      -     -    1s
     0     0   16.67649    0   45          -   16.67649      -     -    1s
     0     0   16.67188    0   45          -   16.67188      -     -    1s
     0     0   16.67119    0   43          -   16.67119      -     -    1s
     0     0   15.95709    0   61          -   15.95709      -     -    2s
     0     0   15.91288    0   62          -   15.91288      -     -    2s
     0     0   15.81682    0   61          -   15.81682      -     -    2s
     0     0   15.79631    0   58          -   15.79631      -     -    2s
     0     0   15.79530    0   59          -   15.79530      -     -    2s
     0     0   14.38200    0   59          -   14.38200      -     -    2s
     0     0   14.29381    0   59          -   14.29381      -     -    2s
     0     0   14.25577    0   57          -   14.25577      -     -    2s
     0     0   14.24902    0   58          -   14.24902      -     -    2s
     0     0   14.24774    0   58          -   14.24774      -     -    2s
     0     0   13.95917    0   56          -   13.95917      -     -    2s
     0     0   13.48062    0   54          -   13.48062      -     -    2s
     0     0   13.47983    0   55          -   13.47983      -     -    2s
     0     0   12.96389    0   54          -   12.96389      -     -    2s
     0     0   12.96164    0   55          -   12.96164      -     -    3s
     0     0   12.93700    0   53          -   12.93700      -     -    3s
     0     0   12.93567    0   54          -   12.93567      -     -    3s
     0     0   12.83745    0   54          -   12.83745      -     -    3s
     0     0   12.83668    0   57          -   12.83668      -     -    3s
     0     0   12.76549    0   54          -   12.76549      -     -    3s
     0     0   12.76449    0   55          -   12.76449      -     -    3s
     0     0   12.75989    0   59          -   12.75989      -     -    3s
     0     0   12.75989    0   47          -   12.75989      -     -    4s
H    0     0                       0.0000000   12.75989      -     -    5s
     0     2   12.75898    0   47    0.00000   12.75898      -     -    5s
   511   326    8.34310   34   47    0.00000    9.45590      -  20.1   10s
   519   331    9.04606   38   82    0.00000    9.45590      -  19.8   15s
   530   340    8.73601   33  105    0.00000    9.45590      -  21.6   21s

Cutting planes:
  Gomory: 9
  Implied bound: 2
  MIR: 30
  Flow cover: 9
  RLT: 23

Explored 664 nodes (25957 simplex iterations) in 24.01 seconds (32.01 work units)
Thread count was 1 (of 4 available processors)

Solution count 1: 4.65661e-10 
No other solutions better than 4.65661e-10

Optimal solution found (tolerance 1.00e-04)
Best objective 4.656612873077e-10, best bound 4.656612873077e-10, gap 0.0000%


100
100
10
100
100
10
UNKNOWN
time: 29.899202074

[VERYDIFF_TIMER] 29.931002626

[VERYDIFF_EXPERIMENT] Running on /home/i57/steuber/NeuroDiff/repos/VeryDiffExperiments/src/../benchmarks/mnist-prune/specs/mnist_35_global_4.vnnlib /home/i57/steuber/NeuroDiff/repos/VeryDiffExperiments/src/../benchmarks/mnist-prune/nets/mnist_relu_4_1024.onnx
/home/i57/steuber/NeuroDiff/repos/VeryDiffExperiments/src/../benchmarks/mnist-prune/nets/mnist_relu_4_1024.onnx
/home/i57/steuber/NeuroDiff/repos/VeryDiffExperiments/src/../benchmarks/mnist-prune/nets_pruned/mnist_relu_4_1024_pruned5.onnx
[[0.         0.01568628]
 [0.         0.01568628]
 [0.         0.01568628]
 ...
 [0.         0.01568628]
 [0.         0.01568628]
 [0.         0.01568628]]
top
120
False
1024
1024
1024
10
1024
1024
1024
10
### Vars ###
### Constraints ###
A_pi_5_0 = 0 --> (A_x_4_0 + 0.0001) <= A_top_5_0
A_pi_5_1 = 0 --> (A_x_4_1 + 0.0001) <= A_top_5_0
A_pi_5_2 = 0 --> (A_x_4_2 + 0.0001) <= A_top_5_0
A_pi_5_3 = 0 --> (A_x_4_3 + 0.0001) <= A_top_5_0
A_pi_5_4 = 0 --> (A_x_4_4 + 0.0001) <= A_top_5_0
A_pi_5_5 = 0 --> (A_x_4_5 + 0.0001) <= A_top_5_0
A_pi_5_6 = 0 --> (A_x_4_6 + 0.0001) <= A_top_5_0
A_pi_5_7 = 0 --> (A_x_4_7 + 0.0001) <= A_top_5_0
A_pi_5_8 = 0 --> (A_x_4_8 + 0.0001) <= A_top_5_0
A_pi_5_9 = 0 --> (A_x_4_9 + 0.0001) <= A_top_5_0
Set parameter TimeLimit to value 120
Set parameter Threads to value 1
Gurobi Optimizer version 10.0.0 build v10.0.0rc2 (linux64)

CPU model: Intel(R) Core(TM) i5-6500 CPU @ 3.20GHz, instruction set [SSE2|AVX|AVX2]
Thread count: 4 physical cores, 4 logical processors, using up to 1 threads

Optimize a model with 43334 rows, 19360 columns and 5656845 nonzeros
Model fingerprint: 0xd7af7494
Variable types: 13166 continuous, 6194 integer (6194 binary)
Coefficient statistics:
  Matrix range     [2e-08, 2e+06]
  Objective range  [1e+00, 1e+00]
  Bounds range     [4e-03, 1e+00]
  RHS range        [1e-07, 2e+06]
Warning: Model contains large matrix coefficient range
         Consider reformulating model or setting NumericFocus parameter
         to avoid numerical issues.
Presolve removed 18952 rows and 4039 columns (presolve time = 5s) ...
Presolve removed 19577 rows and 4039 columns (presolve time = 10s) ...
Presolve removed 19577 rows and 4039 columns (presolve time = 15s) ...
Presolve removed 19577 rows and 4039 columns
Presolve time: 18.35s
Presolved: 23757 rows, 15321 columns, 4372038 nonzeros
Variable types: 10712 continuous, 4609 integer (4609 binary)

Root simplex log...

Iteration    Objective       Primal Inf.    Dual Inf.      Time
       0    1.5468633e+04   4.847807e+03   0.000000e+00     33s
    3685    1.6723130e+03   4.642444e+03   0.000000e+00     35s
    4835    1.6722745e+03   2.424867e+03   0.000000e+00     40s
    5885    1.6722624e+03   5.708067e+03   0.000000e+00     45s
    6825    1.6722557e+03   3.707489e+03   0.000000e+00     50s
    7925    1.6722485e+03   3.935353e+04   0.000000e+00     56s
    8705    1.6722440e+03   3.092729e+03   0.000000e+00     60s
    9635    1.6722354e+03   2.112779e+03   0.000000e+00     65s
   10415    1.6722295e+03   9.494675e+04   0.000000e+00     70s
   11385    1.6722225e+03   3.354322e+03   0.000000e+00     75s
   12575    1.6722134e+03   3.753283e+03   0.000000e+00     80s
   13665    1.6722065e+03   1.521672e+03   0.000000e+00     85s
   15175    1.6722006e+03   1.204891e+03   0.000000e+00     90s
   16570    1.6722066e+03   0.000000e+00   0.000000e+00     95s

Root relaxation: objective 1.672207e+03, 16570 iterations, 65.13 seconds (170.33 work units)

    Nodes    |    Current Node    |     Objective Bounds      |     Work
 Expl Unexpl |  Obj  Depth IntInf | Incumbent    BestBd   Gap | It/Node Time

     0     0 1672.20663    0 1235          - 1672.20663      -     -  120s

Explored 1 nodes (26794 simplex iterations) in 120.09 seconds (243.81 work units)
Thread count was 1 (of 4 available processors)

Solution count 0

Time limit reached
Best objective -, best bound 1.672206631188e+03, gap -


TIMEOUT
time: 262.866839137

[VERYDIFF_TIMER] 262.892422304

[VERYDIFF_EXPERIMENT] NETWORK: /home/i57/steuber/NeuroDiff/repos/VeryDiffExperiments/src/../benchmarks/mnist-prune/specs/mnist_35_global_4.vnnlib
[VERYDIFF_EXPERIMENT] TIME: 445.721035007
