
[VERYDIFF_EXPERIMENT] Running on /home/i57/steuber/NeuroDiff/repos/VeryDiffExperiments/src/../benchmarks/mnist-prune/specs/mnist_13_global_3.vnnlib /home/i57/steuber/NeuroDiff/repos/VeryDiffExperiments/src/../benchmarks/mnist-prune/nets/mnist_relu_4_1024.onnx
Found input X
op: matmul, weight: (1024, 784), bias: nothing
op: bias, weight: nothing, bias: (1024,)
op: relu, weight: nothing, bias: nothing
op: matmul, weight: (1024, 1024), bias: nothing
op: bias, weight: nothing, bias: (1024,)
op: relu, weight: nothing, bias: nothing
op: matmul, weight: (1024, 1024), bias: nothing
op: bias, weight: nothing, bias: (1024,)
op: relu, weight: nothing, bias: nothing
op: matmul, weight: (10, 1024), bias: nothing
op: bias, weight: nothing, bias: (10,)
op: relu, weight: nothing, bias: nothing
op: matmul, weight: (10, 10), bias: nothing
op: bias, weight: nothing, bias: (10,)
Found input X
op: gemm, weight: (1024, 784), bias: (1024,)
op: relu, weight: nothing, bias: nothing
op: gemm, weight: (1024, 1024), bias: (1024,)
op: relu, weight: nothing, bias: nothing
op: gemm, weight: (1024, 1024), bias: (1024,)
op: relu, weight: nothing, bias: nothing
op: gemm, weight: (10, 1024), bias: (10,)
op: relu, weight: nothing, bias: nothing
op: gemm, weight: (10, 10), bias: (10,)
Distance: 915.6394868631054
Distance: 1298.7052820973968
Distance: 1296.587532894263
Distance: 6.054483317080667
Distance: 0.04942679278974538
Running with 1 threads
[Thread 1] Time to first task: 0.01s
Instable Generators: 243
Instable Generators: 350
Instable Generators: 644
Instable Generators: 7
Zono Bounds:
[-19.933409155100243, -0.4579610440545546, -23.998675488935877, -24.72479186265266, -0.004175619860853519, -24.780022911942734, -21.69957365124913, -22.182560474585003, -23.40799299200624, -24.01619372132788]
[21.485720171735103, 0.4663939549069058, 23.936370034694786, 24.395597206947166, 0.004291450914331909, 24.26810239258869, 21.756287047662216, 22.034927455584068, 23.011778369721416, 23.794312600428817]


TIMEOUT REACHED
UNKNOWN
[Thread 1] Total splits: 66
Processed 66 zonotopes (Work Done: 0.0%); Generated 132 (1.8421389731212123s/loop)
[Thread 1] Finished in 121.58s
 ────────────────────────────────────────────────────────────────────────────────
                                        Time                    Allocations      
                               ───────────────────────   ────────────────────────
       Tot / % measured:             122s / 100.0%           33.7GiB / 100.0%    

 Section               ncalls     time    %tot     avg     alloc    %tot      avg
 ────────────────────────────────────────────────────────────────────────────────
 Verify                     1     122s  100.0%    122s   33.6GiB   99.9%  33.6GiB
   Zonotope Loop            1     122s  100.0%    122s   33.6GiB   99.9%  33.6GiB
     Zonotope Propa...     66     119s   97.7%   1.80s   30.4GiB   90.4%   472MiB
       DiffZonotope...    264    66.5s   54.7%   252ms   24.7GiB   73.3%  95.8MiB
         Zonotope_R...    528    51.3s   42.2%  97.2ms   20.3GiB   60.2%  39.3MiB
           Influenc...    528    38.3s   31.5%  72.5ms   11.3GiB   33.7%  22.0MiB
             Multiply     528    27.2s   22.3%  51.4ms   6.38GiB   18.9%  12.4MiB
             Alloca...    528    10.3s    8.5%  19.5ms   4.96GiB   14.7%  9.62MiB
             Set Ma...    528    779ms    0.6%  1.47ms     0.00B    0.0%    0.00B
           Column M...    528    9.88s    8.1%  18.7ms   4.46GiB   13.3%  8.65MiB
           Allocation     528    2.39s    2.0%  4.53ms   4.46GiB   13.3%  8.65MiB
           Set Matrix     528    775ms    0.6%  1.47ms   4.36MiB    0.0%  8.46KiB
           Vectors        528   14.3ms    0.0%  27.1μs   17.5MiB    0.1%  34.0KiB
           Bounds         528    411μs    0.0%   779ns     0.00B    0.0%    0.00B
       DiffZonotope...    330    52.3s   43.0%   158ms   5.73GiB   17.0%  17.8MiB
         Zonotope_D...    660    26.2s   21.6%  39.7ms   3.25GiB    9.6%  5.04MiB
     Compute Split         66    1.76s    1.4%  26.6ms   1.90GiB    5.6%  29.4MiB
     Property Check        66    751ms    0.6%  11.4ms   36.3MiB    0.1%   563KiB
 Initialize                 1   15.3ms    0.0%  15.3ms   27.0MiB    0.1%  27.0MiB
 ────────────────────────────────────────────────────────────────────────────────
[VERYDIFF_TIMER] 121.676033456

[VERYDIFF_EXPERIMENT] NETWORK: /home/i57/steuber/NeuroDiff/repos/VeryDiffExperiments/src/../benchmarks/mnist-prune/specs/mnist_13_global_3.vnnlib
[VERYDIFF_EXPERIMENT] TIME: 122.031224668
