
[VERYDIFF_EXPERIMENT] Running on /home/i57/steuber/NeuroDiff/repos/VeryDiffExperiments/src/../benchmarks/mnist-prune/specs/mnist_73_global_5.vnnlib /home/i57/steuber/NeuroDiff/repos/VeryDiffExperiments/src/../benchmarks/mnist-prune/nets/mnist_relu_3_100.onnx
Found input X
op: matmul, weight: (100, 784), bias: nothing
op: bias, weight: nothing, bias: (100,)
op: relu, weight: nothing, bias: nothing
op: matmul, weight: (100, 100), bias: nothing
op: bias, weight: nothing, bias: (100,)
op: relu, weight: nothing, bias: nothing
op: matmul, weight: (10, 100), bias: nothing
op: bias, weight: nothing, bias: (10,)
op: relu, weight: nothing, bias: nothing
op: matmul, weight: (10, 10), bias: nothing
op: bias, weight: nothing, bias: (10,)
Found input X
op: gemm, weight: (100, 784), bias: (100,)
op: relu, weight: nothing, bias: nothing
op: gemm, weight: (100, 100), bias: (100,)
op: relu, weight: nothing, bias: nothing
op: gemm, weight: (10, 100), bias: (10,)
op: relu, weight: nothing, bias: nothing
op: gemm, weight: (10, 10), bias: (10,)
Distance: 1958.4889029213523
Distance: 144.28197153992141
Distance: 22.063573056613677
Distance: 0.8412832540489035
Running with 1 threads
[Thread 1] Time to first task: 0.0s
Instable Generators: 32
Instable Generators: 37
Instable Generators: 5
Zono Bounds:
[-0.02650152491625695, -4.394328638715139, -4.383807004852014, -4.883215785476649, -4.834762231706195, -0.03088442231982494, -0.01152832143554106, -4.772813906254445, -3.8898890807620736, -4.4687401081845675]
[-0.013057040887886097, 4.625163650569027, 4.4001651350274384, 4.553456011954575, 5.092447173398247, -0.010901065060940428, -0.0005674244750170461, 5.032966997383959, 4.1483009408528355, 4.522678165072355]
[Thread 1] Processed 100 zonotopes (Work Done: 0.0%; Expected Zonos: Inf)
[Thread 1] Processed 200 zonotopes (Work Done: 0.0%; Expected Zonos: Inf)
[Thread 1] Processed 300 zonotopes (Work Done: 0.0%; Expected Zonos: Inf)
[Thread 1] Processed 400 zonotopes (Work Done: 0.0%; Expected Zonos: Inf)
[Thread 1] Processed 500 zonotopes (Work Done: 0.0%; Expected Zonos: Inf)


TIMEOUT REACHED
UNKNOWN
[Thread 1] Total splits: 576
Processed 576 zonotopes (Work Done: 0.0%); Generated 1152 (0.20880467353645832s/loop)
[Thread 1] Finished in 120.27s
 ────────────────────────────────────────────────────────────────────────────────
                                        Time                    Allocations      
                               ───────────────────────   ────────────────────────
       Tot / % measured:             120s / 100.0%           60.8GiB / 100.0%    

 Section               ncalls     time    %tot     avg     alloc    %tot      avg
 ────────────────────────────────────────────────────────────────────────────────
 Verify                     1     120s  100.0%    120s   60.8GiB  100.0%  60.8GiB
   Zonotope Loop            1     120s  100.0%    120s   60.8GiB  100.0%  60.8GiB
     Zonotope Propa...    576    90.0s   74.8%   156ms   40.9GiB   67.2%  72.7MiB
       DiffZonotope...  1.73k    79.8s   66.4%  46.2ms   38.5GiB   63.4%  22.8MiB
         Zonotope_R...  3.46k    79.3s   65.9%  22.9ms   37.6GiB   61.9%  11.2MiB
           Influenc...  3.46k    72.7s   60.4%  21.0ms   34.6GiB   56.9%  10.3MiB
             Multiply   3.46k    39.7s   33.0%  11.5ms   17.6GiB   28.9%  5.21MiB
             Alloca...  3.46k    30.5s   25.4%  8.84ms   17.0GiB   28.0%  5.05MiB
             Set Ma...  3.46k    2.47s    2.1%   713μs     0.00B    0.0%    0.00B
           Column M...  3.46k    6.31s    5.2%  1.83ms   1.51GiB    2.5%   458KiB
           Set Matrix   3.46k    189ms    0.2%  54.6μs   3.06MiB    0.0%     927B
           Allocation   3.46k   81.8ms    0.1%  23.7μs   1.51GiB    2.5%   458KiB
           Vectors      3.46k   17.9ms    0.0%  5.17μs   11.0MiB    0.0%  3.26KiB
           Bounds       3.46k   2.47ms    0.0%   714ns     0.00B    0.0%    0.00B
       DiffZonotope...  2.30k    10.1s    8.4%  4.38ms   2.33GiB    3.8%  1.03MiB
         Zonotope_D...  4.61k    4.89s    4.1%  1.06ms   1.53GiB    2.5%   347KiB
     Compute Split        576    27.5s   22.9%  47.8ms   8.63GiB   14.2%  15.3MiB
     Property Check       576    636ms    0.5%  1.10ms   65.7MiB    0.1%   117KiB
 Initialize                 1    620μs    0.0%   620μs   5.41MiB    0.0%  5.41MiB
 ────────────────────────────────────────────────────────────────────────────────
[VERYDIFF_TIMER] 120.307026061

[VERYDIFF_EXPERIMENT] NETWORK: /home/i57/steuber/NeuroDiff/repos/VeryDiffExperiments/src/../benchmarks/mnist-prune/specs/mnist_73_global_5.vnnlib
[VERYDIFF_EXPERIMENT] TIME: 120.772764311
