
[VERYDIFF_EXPERIMENT] Running on /home/i57/steuber/NeuroDiff/repos/VeryDiffExperiments/src/../benchmarks/mnist-prune/specs/mnist_86_local_15.vnnlib /home/i57/steuber/NeuroDiff/repos/VeryDiffExperiments/src/../benchmarks/mnist-prune/nets/mnist_relu_3_100.onnx
Loading /home/i57/steuber/NeuroDiff/repos/VeryDiffExperiments/src/../benchmarks/mnist-prune/nets/mnist_relu_3_100.onnx and /home/i57/steuber/NeuroDiff/repos/VeryDiffExperiments/src/../benchmarks/mnist-prune/nets_pruned/mnist_relu_3_100_0.77-old.onnx
INPUT SHAPE: 784
Refined: 73 | Refine Limit: 10 | Wrong: 0 | Right: 112 | Total: 112 | Total Zonos Considered: 185 | Expected 2901 (3.8607376766632195%)Refined: 157 | Refine Limit: 13 | Wrong: 0 | Right: 283 | Total: 283 | Total Zonos Considered: 440 | Expected 4892 (5.784955028618152%)Refined: 235 | Refine Limit: 21 | Wrong: 0 | Right: 420 | Total: 420 | Total Zonos Considered: 655 | Expected 4757 (8.82909396678579%)Refined: 314 | Refine Limit: 14 | Wrong: 0 | Right: 574 | Total: 574 | Total Zonos Considered: 888 | Expected 6417 (8.94498987065607%)Refined: 403 | Refine Limit: 24 | Wrong: 0 | Right: 742 | Total: 742 | Total Zonos Considered: 1145 | Expected 8287 (8.95378303366719%)Refined: 500 | Refine Limit: 25 | Wrong: 0 | Right: 927 | Total: 927 | Total Zonos Considered: 1427 | Expected 10354 (8.953061618698088%)Refined: 569 | Refine Limit: 13 | Wrong: 0 | Right: 1072 | Total: 1072 | Total Zonos Considered: 1641 | Expected 9584 (11.185308848080133%)Refined: 643 | Refine Limit: 16 | Wrong: 0 | Right: 1205 | Total: 1205 | Total Zonos Considered: 1848 | Expected 10773 (11.185370834493641%)Refined: 738 | Refine Limit: 35 | Wrong: 0 | Right: 1354 | Total: 1354 | Total Zonos Considered: 2092 | Expected 12105 (11.185460553490294%)Refined: 821 | Refine Limit: 25 | Wrong: 0 | Right: 1522 | Total: 1522 | Total Zonos Considered: 2343 | Expected 13607 (11.185419269493643%)Refined: 907 | Refine Limit: 22 | Wrong: 0 | Right: 1691 | Total: 1691 | Total Zonos Considered: 2598 | Expected 15118 (11.18534197645191%)Refined: 983 | Refine Limit: 25 | Wrong: 0 | Right: 1826 | Total: 1826 | Total Zonos Considered: 2809 | Expected 16325 (11.185298621745789%)Refined: 1062 | Refine Limit: 26 | Wrong: 0 | Right: 1979 | Total: 1979 | Total Zonos Considered: 3041 | Expected 17692 (11.185846710377572%)Refined: 1148 | Refine Limit: 35 | Wrong: 0 | Right: 2129 | Total: 2129 | Total Zonos Considered: 3277 | Expected 19033 (11.185835128461093%)Refined: 1229 | Refine Limit: 16 | Wrong: 0 | Right: 2308 | Total: 2308 | Total Zonos Considered: 3537 | Expected 20634 (11.185422118832994%)Refined: 1320 | Refine Limit: 26 | Wrong: 0 | Right: 2465 | Total: 2465 | Total Zonos Considered: 3785 | Expected 22037 (11.185733085265689%)Refined: 1411 | Refine Limit: 39 | Wrong: 0 | Right: 2613 | Total: 2613 | Total Zonos Considered: 4024 | Expected 23360 (11.185787671232877%)Refined: 1489 | Refine Limit: 32 | Wrong: 0 | Right: 2769 | Total: 2769 | Total Zonos Considered: 4258 | Expected 24755 (11.18561906685518%)Refined: 1576 | Refine Limit: 39 | Wrong: 0 | Right: 2913 | Total: 2913 | Total Zonos Considered: 4489 | Expected 26043 (11.185347310217717%)Refined: 1681 | Refine Limit: 37 | Wrong: 0 | Right: 3107 | Total: 3107 | Total Zonos Considered: 4788 | Expected 27777 (11.185513194369442%)Refined: 1773 | Refine Limit: 40 | Wrong: 0 | Right: 3265 | Total: 3265 | Total Zonos Considered: 5038 | Expected 29189 (11.185720648189386%)Refined: 1852 | Refine Limit: 34 | Wrong: 0 | Right: 3418 | Total: 3418 | Total Zonos Considered: 5270 | Expected 30557 (11.185653041856202%)Refined: 1926 | Refine Limit: 23 | Wrong: 0 | Right: 3567 | Total: 3567 | Total Zonos Considered: 5493 | Expected 31889 (11.18567531123585%)Refined: 2010 | Refine Limit: 22 | Wrong: 0 | Right: 3738 | Total: 3738 | Total Zonos Considered: 5748 | Expected 33418 (11.185588604943444%)Refined: 2099 | Refine Limit: 35 | Wrong: 0 | Right: 3888 | Total: 3888 | Total Zonos Considered: 5987 | Expected 34759 (11.185592220719814%)Refined: 2214 | Refine Limit: 39 | Wrong: 0 | Right: 4105 | Total: 4105 | Total Zonos Considered: 6319 | Expected 36699 (11.185590888035096%)Refined: 2320 | Refine Limit: 36 | Wrong: 0 | Right: 4307 | Total: 4307 | Total Zonos Considered: 6627 | Expected 38505 (11.185560316841968%)Refined: 2418 | Refine Limit: 33 | Wrong: 0 | Right: 4501 | Total: 4501 | Total Zonos Considered: 6919 | Expected 40240 (11.185387673956262%)Refined: 2523 | Refine Limit: 42 | Wrong: 0 | Right: 4700 | Total: 4700 | Total Zonos Considered: 7223 | Expected 42019 (11.185416121278468%)Refined: 2617 | Refine Limit: 31 | Wrong: 0 | Right: 4895 | Total: 4895 | Total Zonos Considered: 7512 | Expected 43762 (11.185503404780404%)Refined: 2702 | Refine Limit: 34 | Wrong: 0 | Right: 5061 | Total: 5061 | Total Zonos Considered: 7763 | Expected 45246 (11.185519161914865%)Refined: 2783 | Refine Limit: 35 | Wrong: 0 | Right: 5208 | Total: 5208 | Total Zonos Considered: 7991 | Expected 46560 (11.18556701030928%)Refined: 2859 | Refine Limit: 24 | Wrong: 0 | Right: 5362 | Total: 5362 | Total Zonos Considered: 8221 | Expected 47937 (11.185514320879488%)Refined: 2973 | Refine Limit: 41 | Wrong: 0 | Right: 5574 | Total: 5574 | Total Zonos Considered: 8547 | Expected 49832 (11.185583560764167%)Refined: 3091 | Refine Limit: 30 | Wrong: 0 | Right: 5818 | Total: 5818 | Total Zonos Considered: 8909 | Expected 52014 (11.185450071134696%)Refined: 3204 | Refine Limit: 50 | Wrong: 0 | Right: 6009 | Total: 6009 | Total Zonos Considered: 9213 | Expected 53721 (11.185569888870274%)Refined: 3311 | Refine Limit: 44 | Wrong: 0 | Right: 6223 | Total: 6223 | Total Zonos Considered: 9534 | Expected 55635 (11.185404871034422%)UNKNOWN
TIMEOUT
Refined: 3373 | Refine Limit: 40 | Wrong: 0 | Right: 6345 | Total: 6345 | Total Zonos Considered: 9718 | Expected 56725 (11.185544292639928%)

time: 120.166870779

[VERYDIFF_TIMER] 120.205643762

[VERYDIFF_EXPERIMENT] NETWORK: /home/i57/steuber/NeuroDiff/repos/VeryDiffExperiments/src/../benchmarks/mnist-prune/specs/mnist_86_local_15.vnnlib
[VERYDIFF_EXPERIMENT] TIME: 120.496734342
