
[VERYDIFF_EXPERIMENT] Running on /home/i57/steuber/NeuroDiff/repos/VeryDiffExperiments/src/../benchmarks/mnist-prune/specs/mnist_74_global_3.vnnlib /home/i57/steuber/NeuroDiff/repos/VeryDiffExperiments/src/../benchmarks/mnist-prune/nets/mnist_relu_3_100.onnx
Parsing /home/i57/steuber/NeuroDiff/repos/VeryDiffExperiments/src/../benchmarks/mnist-prune/nets/mnist_relu_3_100.onnx...
Found input X
op: matmul, weight: (100, 784), bias: nothing
op: bias, weight: nothing, bias: (100,)
op: relu, weight: nothing, bias: nothing
op: matmul, weight: (100, 100), bias: nothing
op: bias, weight: nothing, bias: (100,)
op: relu, weight: nothing, bias: nothing
op: matmul, weight: (10, 100), bias: nothing
op: bias, weight: nothing, bias: (10,)
op: relu, weight: nothing, bias: nothing
op: matmul, weight: (10, 10), bias: nothing
op: bias, weight: nothing, bias: (10,)
Parsing /home/i57/steuber/NeuroDiff/repos/VeryDiffExperiments/src/../benchmarks/mnist-prune/nets_pruned/mnist_relu_3_100_0.79_adam_1_stepsize-old.onnx...
Found input X
op: gemm, weight: (100, 784), bias: (100,)
op: relu, weight: nothing, bias: nothing
op: gemm, weight: (100, 100), bias: (100,)
op: relu, weight: nothing, bias: nothing
op: gemm, weight: (10, 100), bias: (10,)
op: relu, weight: nothing, bias: nothing
op: gemm, weight: (10, 10), bias: (10,)
Distance: 368.62397500800625
Distance: 47.56803950402309
Distance: 2.8977568827249343
Distance: 0.01885471428334995
Running with 1 threads
[Thread 1] Time to first task: 0.0s
Instable Generators: 20
Instable Generators: 25
Instable Generators: 3
Zono Bounds:
[-3.756958514787351e-5, -0.28733941663372026, -0.0005043387548334965, -0.00023746195857512315, -0.3656250980785494, -0.01151791626147346, -0.00037836244059970866, -0.38046510943777534, -0.34254829309149687, -0.3146569240982443]
[0.00010616350475907302, 0.36489552318560264, 0.00020899648346422252, 0.00013011040920922153, 0.4403306707523626, 0.011493919863515736, -0.00010997389201385503, 0.3189089895562144, 0.266703071158732, 0.28687407292983413]
[Thread 1] Total splits: 0
Processed 1 zonotopes (Work Done: 100.0%); Generated 0 (0.411642028s/loop)
[Thread 1] Finished in 0.41s
 ────────────────────────────────────────────────────────────────────────────────
                                        Time                    Allocations      
                               ───────────────────────   ────────────────────────
       Tot / % measured:            412ms / 100.0%            146MiB / 100.0%    

 Section               ncalls     time    %tot     avg     alloc    %tot      avg
 ────────────────────────────────────────────────────────────────────────────────
 Verify                     1    412ms   99.9%   412ms    140MiB   96.3%   140MiB
   Zonotope Loop            1    412ms   99.9%   412ms    140MiB   96.3%   140MiB
     Property Check         1    354ms   85.8%   354ms   50.0MiB   34.3%  50.0MiB
     Zonotope Propa...      1   54.5ms   13.2%  54.5ms   70.5MiB   48.3%  70.5MiB
       DiffZonotope...      3   31.0ms    7.5%  10.3ms   66.4MiB   45.5%  22.1MiB
         Zonotope_R...      6   30.2ms    7.3%  5.03ms   64.9MiB   44.5%  10.8MiB
           Influenc...      6   29.0ms    7.0%  4.83ms   59.7MiB   40.9%  9.94MiB
             Multiply       6   20.3ms    4.9%  3.39ms   30.1MiB   20.7%  5.02MiB
             Alloca...      6   4.51ms    1.1%   752μs   29.5MiB   20.2%  4.92MiB
             Set Ma...      6   4.06ms    1.0%   677μs     0.00B    0.0%    0.00B
           Column M...      6    755μs    0.2%   126μs   2.62MiB    1.8%   447KiB
           Set Matrix       6    315μs    0.1%  52.4μs   4.12KiB    0.0%     704B
           Allocation       6    127μs    0.0%  21.1μs   2.62MiB    1.8%   447KiB
           Vectors          6   29.5μs    0.0%  4.92μs   19.5KiB    0.0%  3.26KiB
           Bounds           6   4.32μs    0.0%   720ns     0.00B    0.0%    0.00B
       DiffZonotope...      4   23.4ms    5.7%  5.86ms   4.07MiB    2.8%  1.02MiB
         Zonotope_D...      8   8.84ms    2.1%  1.10ms   2.69MiB    1.8%   344KiB
 Initialize                 1    538μs    0.1%   538μs   5.41MiB    3.7%  5.41MiB
 ────────────────────────────────────────────────────────────────────────────────
[VERYDIFF_TIMER] 0.441632188

[VERYDIFF_EXPERIMENT] NETWORK: /home/i57/steuber/NeuroDiff/repos/VeryDiffExperiments/src/../benchmarks/mnist-prune/specs/mnist_74_global_3.vnnlib
[VERYDIFF_EXPERIMENT] TIME: 0.74744935
