
[VERYDIFF_EXPERIMENT] Running on /home/i57/steuber/NeuroDiff/repos/VeryDiffExperiments/src/../benchmarks/mnist-prune/specs/mnist_1_global_5.vnnlib /home/i57/steuber/NeuroDiff/repos/VeryDiffExperiments/src/../benchmarks/mnist-prune/nets/mnist_relu_3_100.onnx
Parsing /home/i57/steuber/NeuroDiff/repos/VeryDiffExperiments/src/../benchmarks/mnist-prune/nets/mnist_relu_3_100.onnx...
Found input X
op: matmul, weight: (100, 784), bias: nothing
op: bias, weight: nothing, bias: (100,)
op: relu, weight: nothing, bias: nothing
op: matmul, weight: (100, 100), bias: nothing
op: bias, weight: nothing, bias: (100,)
op: relu, weight: nothing, bias: nothing
op: matmul, weight: (10, 100), bias: nothing
op: bias, weight: nothing, bias: (10,)
op: relu, weight: nothing, bias: nothing
op: matmul, weight: (10, 10), bias: nothing
op: bias, weight: nothing, bias: (10,)
Parsing /home/i57/steuber/NeuroDiff/repos/VeryDiffExperiments/src/../benchmarks/mnist-prune/nets_pruned/mnist_relu_3_100_0.77-old.onnx...
Found input X
op: gemm, weight: (100, 784), bias: (100,)
op: relu, weight: nothing, bias: nothing
op: gemm, weight: (100, 100), bias: (100,)
op: relu, weight: nothing, bias: nothing
op: gemm, weight: (10, 100), bias: (10,)
op: relu, weight: nothing, bias: nothing
op: gemm, weight: (10, 10), bias: (10,)
Distance: 1958.4889029213523
Distance: 144.28197153992141
Distance: 22.063573056613677
Distance: 0.8412832540489035
Running with 1 threads
[Thread 1] Time to first task: 0.0s
Instable Generators: 29
Instable Generators: 32
Instable Generators: 4
Zono Bounds:
[-4.643833727968463, -3.4736310590688353, -4.945890393655155, -3.338415989532421, -0.03073624835503754, -5.5546422459966855, -4.403465313594035, -0.002953748069544149, -4.239187773624237, -0.007419410549162752]
[4.652742244879464, 2.670120745278414, 3.4928026597319675, 4.153831729450445, -0.013192121716160504, 5.18758591956929, 4.419394370999452, 0.020394377888697794, 4.357137247951562, 0.006465622097827879]
[Thread 1] Total splits: 0
Processed 1 zonotopes (Work Done: 100.0%); Generated 0 (0.132600672s/loop)
[Thread 1] Finished in 0.13s
 ────────────────────────────────────────────────────────────────────────────────
                                        Time                    Allocations      
                               ───────────────────────   ────────────────────────
       Tot / % measured:            133ms / 100.0%            153MiB / 100.0%    

 Section               ncalls     time    %tot     avg     alloc    %tot      avg
 ────────────────────────────────────────────────────────────────────────────────
 Verify                     1    133ms   99.6%   133ms    147MiB   96.5%   147MiB
   Zonotope Loop            1    133ms   99.6%   133ms    147MiB   96.5%   147MiB
     Property Check         1   79.3ms   59.5%  79.3ms   55.5MiB   36.3%  55.5MiB
     Zonotope Propa...      1   49.9ms   37.5%  49.9ms   71.8MiB   47.0%  71.8MiB
       DiffZonotope...      3   25.3ms   19.0%  8.44ms   67.7MiB   44.3%  22.6MiB
         Zonotope_R...      6   24.3ms   18.2%  4.05ms   66.1MiB   43.3%  11.0MiB
           Influenc...      6   23.0ms   17.3%  3.84ms   60.8MiB   39.8%  10.1MiB
             Multiply       6   17.5ms   13.2%  2.92ms   30.8MiB   20.2%  5.13MiB
             Set Ma...      6   4.15ms    3.1%   691μs     0.00B    0.0%    0.00B
             Alloca...      6   1.30ms    1.0%   217μs   30.0MiB   19.6%  5.00MiB
           Column M...      6    787μs    0.6%   131μs   2.66MiB    1.7%   454KiB
           Set Matrix       6    310μs    0.2%  51.6μs   4.92KiB    0.0%     840B
           Allocation       6    128μs    0.1%  21.3μs   2.66MiB    1.7%   454KiB
           Vectors          6   29.3μs    0.0%  4.88μs   19.5KiB    0.0%  3.26KiB
           Bounds           6   3.03μs    0.0%   505ns     0.00B    0.0%    0.00B
       DiffZonotope...      4   24.5ms   18.4%  6.14ms   4.12MiB    2.7%  1.03MiB
         Zonotope_D...      8   9.20ms    6.9%  1.15ms   2.70MiB    1.8%   346KiB
 Initialize                 1    536μs    0.4%   536μs   5.41MiB    3.5%  5.41MiB
 ────────────────────────────────────────────────────────────────────────────────
[VERYDIFF_TIMER] 0.159220929

[VERYDIFF_EXPERIMENT] NETWORK: /home/i57/steuber/NeuroDiff/repos/VeryDiffExperiments/src/../benchmarks/mnist-prune/specs/mnist_1_global_5.vnnlib
[VERYDIFF_EXPERIMENT] TIME: 0.462183223
