
[VERYDIFF_EXPERIMENT] Running on /home/i57/steuber/NeuroDiff/repos/VeryDiffExperiments/src/../benchmarks/mnist-prune/specs/mnist_3_local_18.vnnlib /home/i57/steuber/NeuroDiff/repos/VeryDiffExperiments/src/../benchmarks/mnist-prune/nets/mnist_relu_3_100.onnx
Parsing /home/i57/steuber/NeuroDiff/repos/VeryDiffExperiments/src/../benchmarks/mnist-prune/nets/mnist_relu_3_100.onnx...
Found input X
op: matmul, weight: (100, 784), bias: nothing
op: bias, weight: nothing, bias: (100,)
op: relu, weight: nothing, bias: nothing
op: matmul, weight: (100, 100), bias: nothing
op: bias, weight: nothing, bias: (100,)
op: relu, weight: nothing, bias: nothing
op: matmul, weight: (10, 100), bias: nothing
op: bias, weight: nothing, bias: (10,)
op: relu, weight: nothing, bias: nothing
op: matmul, weight: (10, 10), bias: nothing
op: bias, weight: nothing, bias: (10,)
Parsing /home/i57/steuber/NeuroDiff/repos/VeryDiffExperiments/src/../benchmarks/mnist-prune/nets_pruned/mnist_relu_3_100_0.77-old.onnx...
Found input X
op: gemm, weight: (100, 784), bias: (100,)
op: relu, weight: nothing, bias: nothing
op: gemm, weight: (100, 100), bias: (100,)
op: relu, weight: nothing, bias: nothing
op: gemm, weight: (10, 100), bias: (10,)
op: relu, weight: nothing, bias: nothing
op: gemm, weight: (10, 10), bias: (10,)
Distance: 1958.4889029213523
Distance: 144.28197153992141
Distance: 22.063573056613677
Distance: 0.8412832540489035
Running with 1 threads
[Thread 1] Time to first task: 0.0s
Instable Generators: 23
Instable Generators: 38
Instable Generators: 6
Zono Bounds:
[-3.9164464517923565, -3.392963663664337, -2.8647051669123993, -3.7983828166056846, -0.008242947723905318, -4.142903829636419, -3.6625093579164445, -3.4145076807437325, 0.003262984544984948, -2.973043287906188]
[3.5665317945667643, 3.379880286601566, 2.6727619857522864, 3.6598539187485484, 0.0139275907425164, 4.117240726583722, 3.7871623352555894, 3.6665782729632794, 0.026514945620650786, 3.0110391325184076]
[Thread 1] Total splits: 0
Processed 1 zonotopes (Work Done: 100.0%); Generated 0 (0.045688728s/loop)
[Thread 1] Finished in 0.05s
 ────────────────────────────────────────────────────────────────────────────────
                                        Time                    Allocations      
                               ───────────────────────   ────────────────────────
       Tot / % measured:           46.1ms / 100.0%           15.2MiB / 100.0%    

 Section               ncalls     time    %tot     avg     alloc    %tot      avg
 ────────────────────────────────────────────────────────────────────────────────
 Verify                     1   45.7ms   99.3%  45.7ms   14.4MiB   94.6%  14.4MiB
   Zonotope Loop            1   45.7ms   99.2%  45.7ms   14.4MiB   94.6%  14.4MiB
     Property Check         1   44.0ms   95.6%  44.0ms   12.4MiB   81.4%  12.4MiB
     Zonotope Propa...      1   1.51ms    3.3%  1.51ms   1.17MiB    7.7%  1.17MiB
       DiffZonotope...      4   1.03ms    2.2%   258μs    252KiB    1.6%  63.1KiB
         Zonotope_D...      8    460μs    1.0%  57.6μs    131KiB    0.8%  16.3KiB
       DiffZonotope...      3    465μs    1.0%   155μs    941KiB    6.1%   314KiB
         Zonotope_R...      6    219μs    0.5%  36.5μs    606KiB    3.9%   101KiB
           Influenc...      6   80.7μs    0.2%  13.4μs    164KiB    1.1%  27.3KiB
             Multiply       6   55.1μs    0.1%  9.18μs    102KiB    0.7%  17.0KiB
             Alloca...      6   13.2μs    0.0%  2.21μs   59.6KiB    0.4%  9.94KiB
             Set Ma...      6   6.01μs    0.0%  1.00μs     0.00B    0.0%    0.00B
           Column M...      6   69.4μs    0.2%  11.6μs    207KiB    1.3%  34.4KiB
           Set Matrix       6   24.9μs    0.1%  4.15μs   5.11KiB    0.0%     872B
           Vectors          6   19.2μs    0.0%  3.20μs   19.5KiB    0.1%  3.26KiB
           Allocation       6   14.2μs    0.0%  2.37μs    206KiB    1.3%  34.3KiB
           Bounds           6   2.10μs    0.0%   350ns     0.00B    0.0%    0.00B
 Initialize                 1    328μs    0.7%   328μs    839KiB    5.4%   839KiB
 ────────────────────────────────────────────────────────────────────────────────
[VERYDIFF_TIMER] 0.071927704

[VERYDIFF_EXPERIMENT] NETWORK: /home/i57/steuber/NeuroDiff/repos/VeryDiffExperiments/src/../benchmarks/mnist-prune/specs/mnist_3_local_18.vnnlib
[VERYDIFF_EXPERIMENT] TIME: 0.377126276
