
[VERYDIFF_EXPERIMENT] Running on /home/i57/steuber/NeuroDiff/repos/VeryDiffExperiments/src/../benchmarks/mnist-prune/specs/mnist_92_global_3.vnnlib /home/i57/steuber/NeuroDiff/repos/VeryDiffExperiments/src/../benchmarks/mnist-prune/nets/mnist_relu_2_512.onnx
Found input X
op: matmul, weight: (512, 784), bias: nothing
op: bias, weight: nothing, bias: (512,)
op: relu, weight: nothing, bias: nothing
op: matmul, weight: (512, 512), bias: nothing
op: bias, weight: nothing, bias: (512,)
op: relu, weight: nothing, bias: nothing
op: matmul, weight: (10, 512), bias: nothing
op: bias, weight: nothing, bias: (10,)
Found input X
op: gemm, weight: (512, 784), bias: (512,)
op: relu, weight: nothing, bias: nothing
op: gemm, weight: (512, 512), bias: (512,)
op: relu, weight: nothing, bias: nothing
op: gemm, weight: (10, 512), bias: (10,)
Distance: 973.3044369037136
Distance: 481.63499746812613
Distance: 8.744412635378467
Running with 1 threads
[Thread 1] Time to first task: 0.01s
Instable Generators: 139
Instable Generators: 307
Zono Bounds:
[-8.162451719578273, -8.332278388226692, -7.174993378113478, -8.043053176228367, -8.492320809907948, -7.32371590911831, -7.965368160045163, -7.523417002684915, -7.4243225299986655, -7.001866513140689]
[9.789817261357692, 9.96739993277779, 8.603098958490289, 9.24848317392812, 10.72325813880029, 8.302871049658057, 9.578595111455758, 9.722344536671145, 7.964356887533906, 8.697334367574058]
[Thread 1] Processed 100 zonotopes (Work Done: 0.0%; Expected Zonos: Inf)
[Thread 1] Processed 200 zonotopes (Work Done: 0.0%; Expected Zonos: Inf)


TIMEOUT REACHED
UNKNOWN
[Thread 1] Total splits: 280
Processed 280 zonotopes (Work Done: 0.0%); Generated 560 (0.4303337299892857s/loop)
[Thread 1] Finished in 120.49s
 ────────────────────────────────────────────────────────────────────────────────
                                        Time                    Allocations      
                               ───────────────────────   ────────────────────────
       Tot / % measured:             120s / 100.0%           45.4GiB / 100.0%    

 Section               ncalls     time    %tot     avg     alloc    %tot      avg
 ────────────────────────────────────────────────────────────────────────────────
 Verify                     1     120s  100.0%    120s   45.4GiB  100.0%  45.4GiB
   Zonotope Loop            1     120s  100.0%    120s   45.4GiB  100.0%  45.4GiB
     Zonotope Propa...    280    88.6s   73.6%   317ms   34.5GiB   75.9%   126MiB
       DiffZonotope...    560    44.5s   36.9%  79.4ms   28.6GiB   63.0%  52.3MiB
         Zonotope_R...  1.12k    28.6s   23.8%  25.6ms   24.9GiB   54.9%  22.8MiB
           Influenc...  1.12k    22.5s   18.7%  20.1ms   15.7GiB   34.6%  14.4MiB
             Multiply   1.12k    14.2s   11.8%  12.7ms   8.67GiB   19.1%  7.92MiB
             Alloca...  1.12k    7.34s    6.1%  6.55ms   7.04GiB   15.5%  6.44MiB
             Set Ma...  1.12k    941ms    0.8%   840μs     0.00B    0.0%    0.00B
           Column M...  1.12k    5.13s    4.3%  4.58ms   4.60GiB   10.1%  4.20MiB
           Set Matrix   1.12k    610ms    0.5%   545μs   6.65MiB    0.0%  6.08KiB
           Allocation   1.12k    398ms    0.3%   355μs   4.60GiB   10.1%  4.20MiB
           Vectors      1.12k   22.3ms    0.0%  19.9μs   27.3MiB    0.1%  25.0KiB
           Bounds       1.12k    879μs    0.0%   785ns     0.00B    0.0%    0.00B
       DiffZonotope...    840    44.2s   36.7%  52.6ms   5.88GiB   13.0%  7.17MiB
         Zonotope_D...  1.68k    27.8s   23.1%  16.5ms   3.71GiB    8.2%  2.26MiB
     Compute Split        280    16.5s   13.7%  59.0ms   5.41GiB   11.9%  19.8MiB
     Property Check       280    868ms    0.7%  3.10ms   66.5MiB    0.1%   243KiB
 Initialize                 1   2.21ms    0.0%  2.21ms   9.84MiB    0.0%  9.84MiB
 ────────────────────────────────────────────────────────────────────────────────
[VERYDIFF_TIMER] 120.534548328

[VERYDIFF_EXPERIMENT] NETWORK: /home/i57/steuber/NeuroDiff/repos/VeryDiffExperiments/src/../benchmarks/mnist-prune/specs/mnist_92_global_3.vnnlib
[VERYDIFF_EXPERIMENT] TIME: 120.928392465
