
[VERYDIFF_EXPERIMENT] Running on /home/i57/steuber/NeuroDiff/repos/VeryDiffExperiments/src/../benchmarks/mnist-prune/specs/mnist_71_global_3.vnnlib /home/i57/steuber/NeuroDiff/repos/VeryDiffExperiments/src/../benchmarks/mnist-prune/nets/mnist_relu_3_100.onnx
Loading /home/i57/steuber/NeuroDiff/repos/VeryDiffExperiments/src/../benchmarks/mnist-prune/nets/mnist_relu_3_100.onnx and /home/i57/steuber/NeuroDiff/repos/VeryDiffExperiments/src/../benchmarks/mnist-prune/nets_pruned/mnist_relu_3_100_0.79_adam_1_stepsize-old.onnx
INPUT SHAPE: 784
UNKNOWN
TIMEOUT
Refined: 52 | Refine Limit: 18 | Wrong: 0 | Right: 60 | Total: 60 | Total Zonos Considered: 112 | Expected 502453601 (1.1941401132479892e-05%)

time: 120.55541273

[VERYDIFF_TIMER] 120.583283429

[VERYDIFF_EXPERIMENT] NETWORK: /home/i57/steuber/NeuroDiff/repos/VeryDiffExperiments/src/../benchmarks/mnist-prune/specs/mnist_71_global_3.vnnlib
[VERYDIFF_EXPERIMENT] TIME: 120.810546502
