
[VERYDIFF_EXPERIMENT] Running on /home/i57/steuber/NeuroDiff/repos/VeryDiffExperiments/src/../benchmarks/mnist-prune/specs/mnist_40_global_3.vnnlib /home/i57/steuber/NeuroDiff/repos/VeryDiffExperiments/src/../benchmarks/mnist-prune/nets/mnist_relu_2_512.onnx
Found input X
op: matmul, weight: (512, 784), bias: nothing
op: bias, weight: nothing, bias: (512,)
op: relu, weight: nothing, bias: nothing
op: matmul, weight: (512, 512), bias: nothing
op: bias, weight: nothing, bias: (512,)
op: relu, weight: nothing, bias: nothing
op: matmul, weight: (10, 512), bias: nothing
op: bias, weight: nothing, bias: (10,)
Found input X
op: matmul, weight: (512, 784), bias: nothing
op: bias, weight: nothing, bias: (512,)
op: relu, weight: nothing, bias: nothing
op: matmul, weight: (512, 512), bias: nothing
op: bias, weight: nothing, bias: (512,)
op: relu, weight: nothing, bias: nothing
op: matmul, weight: (10, 512), bias: nothing
op: bias, weight: nothing, bias: (10,)
Distance: 1085.5985166831802
Distance: 1719.8468985003963
Distance: 31.228482716001736
Running with 1 threads
[Thread 1] Time to first task: 0.01s
Zono Bounds:
[0.0, 0.0, 0.0, 0.0, 0.0, 0.0, 0.0, 0.0, 0.0, 0.0, 0.0, 0.0, 0.0, 0.0, 0.0, 0.0, 0.0, 0.0, 0.0, 0.0, 0.0, 0.0, 0.0, 0.0, 0.0, 0.0, 0.0, 0.0, 0.0, 0.0, 0.0, 0.0, 0.0, 0.0, 0.0, 0.0, 0.0, 0.0, 0.0, 0.0, 0.0, 0.0, 0.0, 0.0, 0.0, 0.0, 0.0, 0.0, 0.0, 0.0, 0.0, 0.0, 0.0, 0.0, 0.0, 0.0, 0.0, 0.0, 0.0, 0.0, 0.0, 0.0, 0.0, 0.0, 0.0, 0.0, 0.0, 0.0, 0.0, 0.0, 0.0, 0.0, 0.0, 0.0, 0.0, 0.0, 0.0, 0.0, 0.0, 0.0, 0.0, 0.0, 0.0, 0.0, 0.0, 0.0, 0.0, 0.0, 0.0, 0.0, 0.0, 0.0, 0.0, 0.0, 0.0, 0.0, 0.0, 0.0, 0.0, 0.0, 0.0, 0.0, 0.0, 0.0, 0.0, 0.0, 0.0, 0.0, 0.0, 0.0, 0.0, 0.0, 0.0, 0.0, 0.0, 0.0, 0.0, 0.0, 0.0, 0.0, 0.0, 0.0, 0.0, 0.0, 0.0, 0.0, 0.0, 0.0, 0.0, 0.0, 0.0, 0.0, 0.0, 0.0, 0.0, 0.0, 0.0, 0.0, 0.0, 0.0, 0.0, 0.0, 0.0, 0.0, 0.0, 0.0, 0.0, 0.0, 0.0, 0.0, 0.0, 0.0, 0.0, 0.0, 0.0, 0.0, 0.0, 0.0, 0.0, 0.0, 0.0, 0.0, 0.0, 0.0, 0.0, 0.0, 0.0, 0.0, 0.0, 0.0, 0.0, 0.0, 0.0, 0.0, 0.0, 0.0, 0.0, 0.0, 0.0, 0.0, 0.0, 0.0, 0.0, 0.0, 0.0, 0.0, 0.0, 0.0, 0.0, 0.0, 0.0, 0.0, 0.0, 0.0, 0.0, 0.0, 0.0, 0.0, 0.0, 0.0, 0.0, 0.0, 0.0, 0.0, 0.0, 0.0, 0.0, 0.0, 0.0, 0.0, 0.0, 0.0, 0.0, 0.0, 0.0, 0.0, 0.0, 0.0, 0.0, 0.0, 0.0, 0.0, 0.0, 0.0, 0.0, 0.0, 0.0, 0.0, 0.0, 0.0, 0.0, 0.0, 0.0, 0.0, 0.0, 0.0, 0.0, 0.0, 0.0, 0.0, 0.0, 0.0, 0.0, 0.0, 0.0, 0.0, 0.0, 0.0, 0.0, 0.0, 0.0, 0.0, 0.0, 0.0, 0.0, 0.0, 0.0, 0.0, 0.0, 0.0, 0.0, 0.0, 0.0, 0.0, 0.0, 0.0, 0.0, 0.0, 0.0, 0.0, 0.0, 0.0, 0.0, 0.0, 0.0, 0.0, 0.0, 0.0, 0.0, 0.0, 0.0, 0.0, 0.0, 0.0, 0.0, 0.0, 0.0, 0.0, 0.0, 0.0, 0.0, 0.0, 0.0, 0.0, 0.0, 0.0, 0.0, 0.0, 0.0, 0.0, 0.0, 0.0, 0.0, 0.0, 0.0, 0.0, 0.0, 0.0, 0.0, 0.0, 0.0, 0.0, 0.0, 0.0, 0.0, 0.0, 0.0, 0.0, 0.0, 0.0, 0.0, 0.0, 0.0, 0.0, 0.0, 0.0, 0.0, 0.0, 0.0, 0.0, 0.0, 0.0, 0.0, 0.0, 0.0, 0.0, 0.0, 0.0, 0.0, 0.0, 0.0, 0.0, 0.0, 0.0, 0.0, 0.0, 0.0, 0.0, 0.0, 0.0, 0.0, 0.0, 0.0, 0.0, 0.0, 0.0, 0.0, 0.0, 0.0, 0.0, 0.0, 0.0, 0.0, 0.0, 0.0, 0.0, 0.0, 0.0, 0.0, 0.0, 0.0, 0.0, 0.0, 0.0, 0.0, 0.0, 0.0, 0.0, 0.0, 0.0, 0.0, 0.0, 0.0, 0.0, 0.0, 0.0, 0.0, 0.0, 0.0, 0.0, 0.0, 0.0, 0.0, 0.0, 0.0, 0.0, 0.0, 0.0, 0.0, 0.0, 0.0, 0.0, 0.0, 0.0, 0.0, 0.0, 0.0, 0.0, 0.0, 0.0, 0.0, 0.0, 0.0, 0.0, 0.0, 0.0, 0.0, 0.0, 0.0, 0.0, 0.0, 0.0, 0.0, 0.0, 0.0, 0.0, 0.0, 0.0, 0.0, 0.0, 0.0, 0.0, 0.0, 0.0, 0.0, 0.0, 0.0, 0.0, 0.0, 0.0, 0.0, 0.0, 0.0, 0.0, 0.0, 0.0, 0.0, 0.0, 0.0, 0.0, 0.0, 0.0, 0.0, 0.0, 0.0, 0.0, 0.0, 0.0, 0.0, 0.0, 0.0, 0.0, 0.0, 0.0, 0.0, 0.0, 0.0, 0.0, 0.0, 0.0, 0.0, 0.0, 0.0, 0.0, 0.0, 0.0, 0.0, 0.0, 0.0, 0.0, 0.0, 0.0, 0.0, 0.0, 0.0, 0.0, 0.0, 0.0, 0.0, 0.0, 0.0, 0.0, 0.0, 0.0, 0.0, 0.0, 0.0, 0.0, 0.0, 0.0, 0.0, 0.0, 0.0, 0.0, 0.0, 0.0, 0.0, 0.0, 0.0, 0.0, 0.0, 0.0, 0.0, 0.0, 0.0, 0.0, 0.0, 0.0, 0.0, 0.0, 0.0, 0.0, 0.0, 0.0, 0.0, 0.0, 0.0, 0.0, 0.0, 0.0, 0.0, 0.0, 0.0, 0.0, 0.0, 0.0, 0.0, 0.0, 0.0, 0.0, 0.0, 0.0, 0.0, 0.0, 0.0, 0.0, 0.0, 0.0, 0.0, 0.0, 0.0, 0.0, 0.0, 0.0, 0.0, 0.0, 0.0, 0.0, 0.0, 0.0, 0.0, 0.0, 0.0, 0.0, 0.0, 0.0, 0.0, 0.0, 0.0, 0.0, 0.0, 0.0, 0.0, 0.0, 0.0, 0.0, 0.0, 0.0, 0.0, 0.0, 0.0, 0.0, 0.0, 0.0, 0.0, 0.0, 0.0, 0.0, 0.0, 0.0, 0.0, 0.0, 0.0, 0.0, 0.0, 0.0, 0.0, 0.0, 0.0, 0.0, 0.0, 0.0, 0.0, 0.0, 0.0, 0.0, 0.0, 0.0, 0.0, 0.0, 0.0, 0.0, 0.0, 0.0, 0.0, 0.0, 0.0, 0.0, 0.0, 0.0, 0.0, 0.0, 0.0, 0.0, 0.0, 0.0, 0.0, 0.0, 0.0, 0.0, 0.0, 0.0, 0.0, 0.0, 0.0, 0.0, 0.0, 0.0, 0.0, 0.0, 0.0, 0.0, 0.0, 0.0, 0.0, 0.0, 0.0, 0.0, 0.0, 0.0, 0.0, 0.0, 0.0, 0.0, 0.0, 0.0, 0.0, 0.0, 0.0, 0.0, 0.0, 0.0, 0.0, 0.0, 0.0, 0.0, 0.0, 0.0, 0.0, 0.0, 0.0, 0.0, 0.0, 0.0, 0.0, 0.0, 0.0, 0.0, 0.0, 0.0, 0.0, 0.0, 0.0, 0.0, 0.0, 0.0, 0.0, 0.0, 0.0, 0.0, 0.0, 0.0, 0.0, 0.0, 0.0, 0.0, 0.0, 0.0, 0.0, 0.0, 0.0, 0.0, 0.0, 0.0, 0.0, 0.0, 0.0, 0.0, 0.0, 0.0, 0.0, 0.0, 0.0, 0.0, 0.0, 0.0, 0.0, 0.0, 0.0, 0.0, 0.0, 0.0, 0.0, 0.0, 0.0, 0.0, 0.0, 0.0, 0.0, 0.0, 0.0, 0.0, 0.0, 0.0, 0.0, 0.0, 0.0, 0.0, 0.0, 0.0, 0.0, 0.0, 0.0, 0.0, 0.0, 0.0, 0.0, 0.0, 0.0, 0.0, 0.0, 0.0, 0.0, 0.0, 0.0, 0.0, 0.0, 0.0, 0.0, 0.0, 0.0, 0.0, 0.0, 0.0, 0.0, 0.0, 0.0, 0.0, 0.0, 0.0, 0.0, 0.0, 0.0, 0.0, 0.0, 0.0, 0.0, 0.0, 0.0, 0.0, 0.0, 0.0, 0.0, 0.0]
[0.0, 0.0, 0.0, 0.0, 0.0, 0.0, 0.0, 0.0, 0.0, 0.0, 0.0, 0.0, 0.0, 0.0, 0.0, 0.0, 0.0, 0.0, 0.0, 0.0, 0.0, 0.0, 0.0, 0.0, 0.0, 0.0, 0.0, 0.0, 0.0, 0.0, 0.0, 0.0, 0.0, 0.0, 0.0, 0.0, 0.0, 0.0, 0.0, 0.0, 0.0, 0.0, 0.0, 0.0, 0.0, 0.0, 0.0, 0.0, 0.0, 0.0, 0.0, 0.0, 0.0, 0.0, 0.0, 0.0, 0.0, 0.0, 0.0, 0.0, 0.0, 0.0, 0.0, 0.0, 0.0, 0.0, 0.0, 0.0, 0.0, 0.0, 0.0, 0.0, 0.0, 0.0, 0.0, 0.0, 0.0, 0.0, 0.0, 0.0, 0.0, 0.0, 0.0, 0.0, 0.0, 0.0, 0.0, 0.0, 0.0, 0.0, 0.0, 0.0, 0.0, 0.0, 0.0, 0.0, 0.0, 0.0, 0.0, 0.0, 0.0, 0.0, 0.0, 0.0, 0.0, 0.0, 0.0, 0.0, 0.0, 0.0, 0.0, 0.0, 0.0, 0.0, 0.0, 0.0, 0.0, 0.0, 0.0, 0.0, 0.0, 0.0, 0.0, 0.0, 0.0, 0.0, 0.0, 0.0, 0.0, 0.0, 0.0, 0.0, 0.0, 0.0, 0.0, 0.0, 0.0, 0.0, 0.0, 0.0, 0.0, 0.0, 0.0, 0.0, 0.0, 0.0, 0.0, 0.0, 0.0, 0.0, 0.0, 0.0, 0.0, 0.0, 0.0, 0.0, 0.0, 0.0, 0.0, 0.0, 0.0, 0.0, 0.0, 0.0, 0.0, 0.0, 0.0, 0.0, 0.0, 0.0, 0.0, 0.0, 0.0, 0.0, 0.0, 0.0, 0.0, 0.0, 0.0, 0.0, 0.0, 0.0, 0.0, 0.0, 0.0, 0.0, 0.0, 0.0, 0.0, 0.0, 0.0, 0.0, 0.0, 0.0, 0.0, 0.0, 0.0, 0.0, 0.0, 0.0, 0.0, 0.0, 0.0, 0.0, 0.0, 0.0, 0.0, 0.0, 0.0, 0.0, 0.0, 0.0, 0.0, 0.0, 0.0, 0.0, 0.0, 0.0, 0.0, 0.0, 0.0, 0.0, 0.0, 0.0, 0.0, 0.0, 0.0, 0.0, 0.0, 0.0, 0.0, 0.0, 0.0, 0.0, 0.0, 0.0, 0.0, 0.0, 0.0, 0.0, 0.0, 0.0, 0.0, 0.0, 0.0, 0.0, 0.0, 0.0, 0.0, 0.0, 0.0, 0.0, 0.0, 0.0, 0.0, 0.0, 0.0, 0.0, 0.0, 0.0, 0.0, 0.0, 0.0, 0.0, 0.0, 0.0, 0.0, 0.0, 0.0, 0.0, 0.0, 0.0, 0.0, 0.0, 0.0, 0.0, 0.0, 0.0, 0.0, 0.0, 0.0, 0.0, 0.0, 0.0, 0.0, 0.0, 0.0, 0.0, 0.0, 0.0, 0.0, 0.0, 0.0, 0.0, 0.0, 0.0, 0.0, 0.0, 0.0, 0.0, 0.0, 0.0, 0.0, 0.0, 0.0, 0.0, 0.0, 0.0, 0.0, 0.0, 0.0, 0.0, 0.0, 0.0, 0.0, 0.0, 0.0, 0.0, 0.0, 0.0, 0.0, 0.0, 0.0, 0.0, 0.0, 0.0, 0.0, 0.0, 0.0, 0.0, 0.0, 0.0, 0.0, 0.0, 0.0, 0.0, 0.0, 0.0, 0.0, 0.0, 0.0, 0.0, 0.0, 0.0, 0.0, 0.0, 0.0, 0.0, 0.0, 0.0, 0.0, 0.0, 0.0, 0.0, 0.0, 0.0, 0.0, 0.0, 0.0, 0.0, 0.0, 0.0, 0.0, 0.0, 0.0, 0.0, 0.0, 0.0, 0.0, 0.0, 0.0, 0.0, 0.0, 0.0, 0.0, 0.0, 0.0, 0.0, 0.0, 0.0, 0.0, 0.0, 0.0, 0.0, 0.0, 0.0, 0.0, 0.0, 0.0, 0.0, 0.0, 0.0, 0.0, 0.0, 0.0, 0.0, 0.0, 0.0, 0.0, 0.0, 0.0, 0.0, 0.0, 0.0, 0.0, 0.0, 0.0, 0.0, 0.0, 0.0, 0.0, 0.0, 0.0, 0.0, 0.0, 0.0, 0.0, 0.0, 0.0, 0.0, 0.0, 0.0, 0.0, 0.0, 0.0, 0.0, 0.0, 0.0, 0.0, 0.0, 0.0, 0.0, 0.0, 0.0, 0.0, 0.0, 0.0, 0.0, 0.0, 0.0, 0.0, 0.0, 0.0, 0.0, 0.0, 0.0, 0.0, 0.0, 0.0, 0.0, 0.0, 0.0, 0.0, 0.0, 0.0, 0.0, 0.0, 0.0, 0.0, 0.0, 0.0, 0.0, 0.0, 0.0, 0.0, 0.0, 0.0, 0.0, 0.0, 0.0, 0.0, 0.0, 0.0, 0.0, 0.0, 0.0, 0.0, 0.0, 0.0, 0.0, 0.0, 0.0, 0.0, 0.0, 0.0, 0.0, 0.0, 0.0, 0.0, 0.0, 0.0, 0.0, 0.0, 0.0, 0.0, 0.0, 0.0, 0.0, 0.0, 0.0, 0.0, 0.0, 0.0, 0.0, 0.0, 0.0, 0.0, 0.0, 0.0, 0.0, 0.0, 0.0, 0.0, 0.0, 0.0, 0.0, 0.0, 0.0, 0.0, 0.0, 0.0, 0.0, 0.0, 0.0, 0.0, 0.0, 0.0, 0.0, 0.0, 0.0, 0.0, 0.0, 0.0, 0.0, 0.0, 0.0, 0.0, 0.0, 0.0, 0.0, 0.0, 0.0, 0.0, 0.0, 0.0, 0.0, 0.0, 0.0, 0.0, 0.0, 0.0, 0.0, 0.0, 0.0, 0.0, 0.0, 0.0, 0.0, 0.0, 0.0, 0.0, 0.0, 0.0, 0.0, 0.0, 0.0, 0.0, 0.0, 0.0, 0.0, 0.0, 0.0, 0.0, 0.0, 0.0, 0.0, 0.0, 0.0, 0.0, 0.0, 0.0, 0.0, 0.0, 0.0, 0.0, 0.0, 0.0, 0.0, 0.0, 0.0, 0.0, 0.0, 0.0, 0.0, 0.0, 0.0, 0.0, 0.0, 0.0, 0.0, 0.0, 0.0, 0.0, 0.0, 0.0, 0.0, 0.0, 0.0, 0.0, 0.0, 0.0, 0.0, 0.0, 0.0, 0.0, 0.0, 0.0, 0.0, 0.0, 0.0, 0.0, 0.0, 0.0, 0.0, 0.0, 0.0, 0.0, 0.0, 0.0, 0.0, 0.0, 0.0, 0.0, 0.0, 0.0, 0.0, 0.0, 0.0, 0.0, 0.0, 0.0, 0.0, 0.0, 0.0, 0.0, 0.0, 0.0, 0.0, 0.0, 0.0, 0.0, 0.0, 0.0, 0.0, 0.0, 0.0, 0.0, 0.0, 0.0, 0.0, 0.0, 0.0, 0.0, 0.0, 0.0, 0.0, 0.0, 0.0, 0.0, 0.0, 0.0, 0.0, 0.0, 0.0, 0.0, 0.0, 0.0, 0.0, 0.0, 0.0, 0.0, 0.0, 0.0, 0.0, 0.0, 0.0, 0.0, 0.0, 0.0, 0.0, 0.0, 0.0, 0.0, 0.0, 0.0, 0.0, 0.0, 0.0, 0.0, 0.0, 0.0, 0.0, 0.0, 0.0, 0.0, 0.0, 0.0, 0.0, 0.0, 0.0, 0.0, 0.0, 0.0, 0.0, 0.0, 0.0, 0.0, 0.0, 0.0, 0.0, 0.0, 0.0, 0.0, 0.0, 0.0, 0.0, 0.0, 0.0, 0.0, 0.0, 0.0, 0.0, 0.0, 0.0, 0.0, 0.0, 0.0, 0.0, 0.0, 0.0, 0.0, 0.0, 0.0, 0.0, 0.0, 0.0, 0.0, 0.0, 0.0, 0.0, 0.0, 0.0, 0.0, 0.0, 0.0, 0.0, 0.0, 0.0, 0.0, 0.0, 0.0, 0.0, 0.0, 0.0, 0.0, 0.0, 0.0, 0.0, 0.0, 0.0, 0.0, 0.0, 0.0, 0.0, 0.0, 0.0, 0.0, 0.0, 0.0, 0.0, 0.0, 0.0, 0.0, 0.0]

Found counterexample: ([0.005882355, 0.005882355, 0.005882355, 0.005882355, 0.005882355, 0.005882355, 0.005882355, 0.005882355, 0.005882355, 0.005882355, 0.005882355, 0.005882355, 0.005882355, 0.005882355, 0.005882355, 0.005882355, 0.005882355, 0.005882355, 0.005882355, 0.005882355, 0.005882355, 0.005882355, 0.005882355, 0.005882355, 0.005882355, 0.005882355, 0.005882355, 0.005882355, 0.005882355, 0.005882355, 0.005882355, 0.005882355, 0.005882355, 0.005882355, 0.005882355, 0.005882355, 0.005882355, 0.005882355, 0.005882355, 0.005882355, 0.005882355, 0.005882355, 0.005882355, 0.005882355, 0.005882355, 0.005882355, 0.005882355, 0.005882355, 0.005882355, 0.005882355, 0.005882355, 0.005882355, 0.005882355, 0.005882355, 0.005882355, 0.005882355, 0.005882355, 0.005882355, 0.005882355, 0.005882355, 0.005882355, 0.005882355, 0.005882355, 0.005882355, 0.005882355, 0.005882355, 0.005882355, 0.005882355, 0.005882355, 0.005882355, 0.005882355, 0.005882355, 0.005882355, 0.005882355, 0.005882355, 0.005882355, 0.005882355, 0.005882355, 0.005882355, 0.005882355, 0.005882355, 0.005882355, 0.005882355, 0.005882355, 0.005882355, 0.005882355, 0.005882355, 0.005882355, 0.005882355, 0.005882355, 0.005882355, 0.005882355, 0.005882355, 0.005882355, 0.005882355, 0.005882355, 0.005882355, 0.005882355, 0.005882355, 0.005882355, 0.005882355, 0.005882355, 0.005882355, 0.005882355, 0.005882355, 0.005882355, 0.005882355, 0.005882355, 0.005882355, 0.005882355, 0.005882355, 0.005882355, 0.005882355, 0.005882355, 0.005882355, 0.005882355, 0.005882355, 0.005882355, 0.005882355, 0.005882355, 0.005882355, 0.005882355, 0.005882355, 0.005882355, 0.005882355, 0.631372575, 0.12156863, 0.005882355, 0.005882355, 0.005882355, 0.005882355, 0.005882355, 0.005882355, 0.005882355, 0.005882355, 0.005882355, 0.005882355, 0.005882355, 0.005882355, 0.005882355, 0.005882355, 0.005882355, 0.005882355, 0.005882355, 0.005882355, 0.005882355, 0.005882355, 0.005882355, 0.005882355, 0.005882355, 0.005882355, 0.005882355, 0.005882355, 0.850980405, 0.5921568850000001, 0.005882355, 0.005882355, 0.005882355, 0.005882355, 0.005882355, 0.005882355, 0.005882355, 0.005882355, 0.005882355, 0.005882355, 0.005882355, 0.005882355, 0.005882355, 0.005882355, 0.005882355, 0.005882355, 0.005882355, 0.005882355, 0.005882355, 0.005882355, 0.005882355, 0.005882355, 0.005882355, 0.005882355, 0.005882355, 0.005882355, 0.521568655, 0.9058823549999999, 0.005882355, 0.005882355, 0.005882355, 0.005882355, 0.005882355, 0.005882355, 0.005882355, 0.005882355, 0.005882355, 0.005882355, 0.005882355, 0.005882355, 0.005882355, 0.005882355, 0.005882355, 0.005882355, 0.005882355, 0.005882355, 0.005882355, 0.005882355, 0.005882355, 0.005882355, 0.005882355, 0.005882355, 0.005882355, 0.005882355, 0.305882365, 0.9058823549999999, 0.005882355, 0.005882355, 0.005882355, 0.005882355, 0.005882355, 0.005882355, 0.005882355, 0.005882355, 0.005882355, 0.005882355, 0.005882355, 0.005882355, 0.005882355, 0.005882355, 0.005882355, 0.005882355, 0.005882355, 0.005882355, 0.005882355, 0.005882355, 0.005882355, 0.005882355, 0.005882355, 0.005882355, 0.005882355, 0.005882355, 0.258823535, 0.9176470649999999, 0.035294115, 0.005882355, 0.005882355, 0.005882355, 0.005882355, 0.005882355, 0.005882355, 0.005882355, 0.005882355, 0.005882355, 0.005882355, 0.005882355, 0.005882355, 0.005882355, 0.005882355, 0.005882355, 0.005882355, 0.005882355, 0.005882355, 0.005882355, 0.005882355, 0.005882355, 0.005882355, 0.005882355, 0.005882355, 0.005882355, 0.005882355, 0.992156865, 0.211764705, 0.005882355, 0.005882355, 0.005882355, 0.005882355, 0.005882355, 0.005882355, 0.005882355, 0.005882355, 0.005882355, 0.005882355, 0.005882355, 0.005882355, 0.005882355, 0.005882355, 0.005882355, 0.005882355, 0.005882355, 0.005882355, 0.005882355, 0.005882355, 0.005882355, 0.005882355, 0.005882355, 0.005882355, 0.005882355, 0.005882355, 0.992156865, 0.211764705, 0.005882355, 0.005882355, 0.005882355, 0.005882355, 0.005882355, 0.005882355, 0.005882355, 0.005882355, 0.005882355, 0.005882355, 0.005882355, 0.005882355, 0.005882355, 0.005882355, 0.005882355, 0.005882355, 0.005882355, 0.005882355, 0.005882355, 0.005882355, 0.005882355, 0.005882355, 0.005882355, 0.005882355, 0.005882355, 0.005882355, 0.992156865, 0.211764705, 0.005882355, 0.005882355, 0.005882355, 0.005882355, 0.005882355, 0.005882355, 0.005882355, 0.005882355, 0.005882355, 0.005882355, 0.005882355, 0.005882355, 0.005882355, 0.005882355, 0.005882355, 0.005882355, 0.005882355, 0.005882355, 0.005882355, 0.005882355, 0.005882355, 0.005882355, 0.005882355, 0.005882355, 0.005882355, 0.005882355, 0.992156865, 0.364705895, 0.005882355, 0.005882355, 0.005882355, 0.005882355, 0.005882355, 0.005882355, 0.005882355, 0.005882355, 0.005882355, 0.005882355, 0.005882355, 0.005882355, 0.005882355, 0.005882355, 0.005882355, 0.005882355, 0.005882355, 0.005882355, 0.005882355, 0.005882355, 0.005882355, 0.005882355, 0.005882355, 0.005882355, 0.005882355, 0.005882355, 0.992156865, 0.32941177499999996, 0.005882355, 0.005882355, 0.005882355, 0.005882355, 0.005882355, 0.005882355, 0.005882355, 0.005882355, 0.005882355, 0.005882355, 0.005882355, 0.005882355, 0.005882355, 0.005882355, 0.005882355, 0.005882355, 0.005882355, 0.005882355, 0.005882355, 0.005882355, 0.005882355, 0.005882355, 0.005882355, 0.005882355, 0.005882355, 0.12156863, 0.994117645, 0.301960795, 0.005882355, 0.005882355, 0.005882355, 0.005882355, 0.005882355, 0.005882355, 0.005882355, 0.005882355, 0.005882355, 0.005882355, 0.005882355, 0.005882355, 0.005882355, 0.005882355, 0.005882355, 0.005882355, 0.005882355, 0.005882355, 0.005882355, 0.005882355, 0.005882355, 0.005882355, 0.005882355, 0.005882355, 0.005882355, 0.305882365, 0.992156865, 0.211764705, 0.005882355, 0.005882355, 0.005882355, 0.005882355, 0.005882355, 0.005882355, 0.005882355, 0.005882355, 0.005882355, 0.005882355, 0.005882355, 0.005882355, 0.005882355, 0.005882355, 0.005882355, 0.005882355, 0.005882355, 0.005882355, 0.005882355, 0.005882355, 0.005882355, 0.005882355, 0.005882355, 0.005882355, 0.005882355, 0.305882365, 0.913725495, 0.027450984999999997, 0.005882355, 0.005882355, 0.005882355, 0.005882355, 0.005882355, 0.005882355, 0.005882355, 0.005882355, 0.005882355, 0.005882355, 0.005882355, 0.005882355, 0.005882355, 0.005882355, 0.005882355, 0.005882355, 0.005882355, 0.005882355, 0.005882355, 0.005882355, 0.005882355, 0.005882355, 0.005882355, 0.005882355, 0.005882355, 0.5019608, 0.9058823549999999, 0.005882355, 0.005882355, 0.005882355, 0.005882355, 0.005882355, 0.005882355, 0.005882355, 0.005882355, 0.005882355, 0.005882355, 0.005882355, 0.005882355, 0.005882355, 0.005882355, 0.005882355, 0.005882355, 0.005882355, 0.005882355, 0.005882355, 0.005882355, 0.005882355, 0.005882355, 0.005882355, 0.005882355, 0.005882355, 0.005882355, 0.647058845, 0.9058823549999999, 0.005882355, 0.005882355, 0.005882355, 0.005882355, 0.005882355, 0.005882355, 0.005882355, 0.005882355, 0.005882355, 0.005882355, 0.005882355, 0.005882355, 0.005882355, 0.005882355, 0.005882355, 0.005882355, 0.005882355, 0.005882355, 0.005882355, 0.005882355, 0.005882355, 0.005882355, 0.005882355, 0.005882355, 0.005882355, 0.005882355, 0.9058823549999999, 0.831372555, 0.005882355, 0.005882355, 0.005882355, 0.005882355, 0.005882355, 0.005882355, 0.005882355, 0.005882355, 0.005882355, 0.005882355, 0.005882355, 0.005882355, 0.005882355, 0.005882355, 0.005882355, 0.005882355, 0.005882355, 0.005882355, 0.005882355, 0.005882355, 0.005882355, 0.005882355, 0.005882355, 0.005882355, 0.005882355, 0.005882355, 0.9058823549999999, 0.5921568850000001, 0.005882355, 0.005882355, 0.005882355, 0.005882355, 0.005882355, 0.005882355, 0.005882355, 0.005882355, 0.005882355, 0.005882355, 0.005882355, 0.005882355, 0.005882355, 0.005882355, 0.005882355, 0.005882355, 0.005882355, 0.005882355, 0.005882355, 0.005882355, 0.005882355, 0.005882355, 0.005882355, 0.005882355, 0.005882355, 0.027450984999999997, 0.913725495, 0.305882365, 0.005882355, 0.005882355, 0.005882355, 0.005882355, 0.005882355, 0.005882355, 0.005882355, 0.005882355, 0.005882355, 0.005882355, 0.005882355, 0.005882355, 0.005882355, 0.005882355, 0.005882355, 0.005882355, 0.005882355, 0.005882355, 0.005882355, 0.005882355, 0.005882355, 0.005882355, 0.005882355, 0.005882355, 0.005882355, 0.211764705, 0.99019608, 0.149019615, 0.005882355, 0.005882355, 0.005882355, 0.005882355, 0.005882355, 0.005882355, 0.005882355, 0.005882355, 0.005882355, 0.005882355, 0.005882355, 0.005882355, 0.005882355, 0.005882355, 0.005882355, 0.005882355, 0.005882355, 0.005882355, 0.005882355, 0.005882355, 0.005882355, 0.005882355, 0.005882355, 0.005882355, 0.005882355, 0.396078435, 0.99019608, 0.005882355, 0.005882355, 0.005882355, 0.005882355, 0.005882355, 0.005882355, 0.005882355, 0.005882355, 0.005882355, 0.005882355, 0.005882355, 0.005882355, 0.005882355, 0.005882355, 0.005882355, 0.005882355, 0.005882355, 0.005882355, 0.005882355, 0.005882355, 0.005882355, 0.005882355, 0.005882355, 0.005882355, 0.005882355, 0.005882355, 0.005882355, 0.005882355, 0.005882355, 0.005882355, 0.005882355, 0.005882355, 0.005882355, 0.005882355, 0.005882355, 0.005882355, 0.005882355, 0.005882355, 0.005882355, 0.005882355, 0.005882355, 0.005882355, 0.005882355, 0.005882355, 0.005882355, 0.005882355, 0.005882355, 0.005882355, 0.005882355, 0.005882355, 0.005882355, 0.005882355, 0.005882355, 0.005882355, 0.005882355, 0.005882355, 0.005882355, 0.005882355, 0.005882355, 0.005882355, 0.005882355, 0.005882355, 0.005882355, 0.005882355, 0.005882355, 0.005882355, 0.005882355, 0.005882355, 0.005882355, 0.005882355, 0.005882355, 0.005882355, 0.005882355, 0.005882355, 0.005882355, 0.005882355, 0.005882355, 0.005882355, 0.005882355, 0.005882355, 0.005882355, 0.005882355, 0.005882355, 0.005882355, 0.005882355, 0.005882355, 0.005882355, 0.005882355, 0.005882355, 0.005882355, 0.005882355, 0.005882355, 0.005882355, 0.005882355, 0.005882355, 0.005882355, 0.005882355, 0.005882355, 0.005882355, 0.005882355, 0.005882355, 0.005882355, 0.005882355, 0.005882355, 0.005882355, 0.005882355, 0.005882355, 0.005882355, 0.005882355, 0.005882355, 0.005882355, 0.005882355, 0.005882355, 0.005882355, 0.005882355, 0.005882355, 0.005882355, 0.005882355, 0.005882355, 0.005882355, 0.005882355, 0.005882355, 0.005882355, 0.005882355, 0.005882355, 0.005882355], ([-53.63812333198809, 10.293457994287891, -30.70545880537856, -41.497252421547536, -37.39955852888423, -37.24159683202409, -32.617328563081095, -27.259137687594908, -25.9384429528389, -39.026130695846675], [-52.266918644236114, 7.778817323061682, -29.71578507111652, -37.829290717418424, -36.720543343811954, -34.54966715791264, -31.329473777006502, -26.362393682829204, -25.175107017973243, -37.32372559621891], 3.6679617041291124))
[Thread 1] Total splits: 0
Processed 1 zonotopes (Work Done: 0.0%); Generated 0 (0.200735151s/loop)
[Thread 1] Finished in 0.2s
 ────────────────────────────────────────────────────────────────────────────────
                                        Time                    Allocations      
                               ───────────────────────   ────────────────────────
       Tot / % measured:            203ms / 100.0%            141MiB / 100.0%    

 Section               ncalls     time    %tot     avg     alloc    %tot      avg
 ────────────────────────────────────────────────────────────────────────────────
 Verify                     1    201ms   98.9%   201ms    132MiB   93.0%   132MiB
   Zonotope Loop            1    201ms   98.9%   201ms    132MiB   93.0%   132MiB
     Zonotope Propa...      1    188ms   92.7%   188ms    110MiB   77.9%   110MiB
       DiffZonotope...      2    133ms   65.4%  66.4ms   96.3MiB   68.1%  48.1MiB
         Zonotope_R...      4    132ms   65.0%  33.0ms   96.2MiB   68.0%  24.1MiB
           Allocation       4   65.1ms   32.1%  16.3ms   17.6MiB   12.4%  4.40MiB
           Influenc...      4   55.7ms   27.5%  13.9ms   60.9MiB   43.1%  15.2MiB
             Multiply       4   45.9ms   22.6%  11.5ms   34.0MiB   24.0%  8.49MiB
             Alloca...      4   6.35ms    3.1%  1.59ms   26.9MiB   19.0%  6.73MiB
             Set Ma...      4   3.47ms    1.7%   867μs     0.00B    0.0%    0.00B
           Column M...      4   8.51ms    4.2%  2.13ms   17.6MiB   12.4%  4.40MiB
           Set Matrix       4   2.37ms    1.2%   592μs   28.0KiB    0.0%  7.01KiB
           Vectors          4   79.4μs    0.0%  19.8μs    100KiB    0.1%  25.0KiB
           Bounds           4   2.82μs    0.0%   704ns     0.00B    0.0%    0.00B
       DiffZonotope...      3   55.3ms   27.2%  18.4ms   13.8MiB    9.8%  4.61MiB
         Zonotope_D...      6   55.3ms   27.2%  9.22ms   13.8MiB    9.8%  2.30MiB
     Property Check         1   1.68ms    0.8%  1.68ms    367KiB    0.3%   367KiB
 Initialize                 1   2.19ms    1.1%  2.19ms   9.84MiB    7.0%  9.84MiB
 ────────────────────────────────────────────────────────────────────────────────
[VERYDIFF_TIMER] 0.289210127

[VERYDIFF_EXPERIMENT] Running on /home/i57/steuber/NeuroDiff/repos/VeryDiffExperiments/src/../benchmarks/mnist-prune/specs/mnist_40_global_3.vnnlib /home/i57/steuber/NeuroDiff/repos/VeryDiffExperiments/src/../benchmarks/mnist-prune/nets/mnist_relu_3_100.onnx
Found input X
op: matmul, weight: (100, 784), bias: nothing
op: bias, weight: nothing, bias: (100,)
op: relu, weight: nothing, bias: nothing
op: matmul, weight: (100, 100), bias: nothing
op: bias, weight: nothing, bias: (100,)
op: relu, weight: nothing, bias: nothing
op: matmul, weight: (10, 100), bias: nothing
op: bias, weight: nothing, bias: (10,)
op: relu, weight: nothing, bias: nothing
op: matmul, weight: (10, 10), bias: nothing
op: bias, weight: nothing, bias: (10,)
Found input X
op: matmul, weight: (100, 784), bias: nothing
op: bias, weight: nothing, bias: (100,)
op: relu, weight: nothing, bias: nothing
op: matmul, weight: (100, 100), bias: nothing
op: bias, weight: nothing, bias: (100,)
op: relu, weight: nothing, bias: nothing
op: matmul, weight: (10, 100), bias: nothing
op: bias, weight: nothing, bias: (10,)
op: relu, weight: nothing, bias: nothing
op: matmul, weight: (10, 10), bias: nothing
op: bias, weight: nothing, bias: (10,)
Distance: 296.6600370998244
Distance: 77.24290861755458
Distance: 5.7170369567975285
Distance: 0.0
Running with 1 threads
[Thread 1] Time to first task: 0.0s
Zono Bounds:
[0.0, 0.0, 0.0, 0.0, 0.0, 0.0, 0.0, 0.0, 0.0, 0.0, 0.0, 0.0, 0.0, 0.0, 0.0, 0.0, 0.0, 0.0, 0.0, 0.0, 0.0, 0.0, 0.0, 0.0, 0.0, 0.0, 0.0, 0.0, 0.0, 0.0, 0.0, 0.0, 0.0, 0.0, 0.0, 0.0, 0.0, 0.0, 0.0, 0.0, 0.0, 0.0, 0.0, 0.0, 0.0, 0.0, 0.0, 0.0, 0.0, 0.0, 0.0, 0.0, 0.0, 0.0, 0.0, 0.0, 0.0, 0.0, 0.0, 0.0, 0.0, 0.0, 0.0, 0.0, 0.0, 0.0, 0.0, 0.0, 0.0, 0.0, 0.0, 0.0, 0.0, 0.0, 0.0, 0.0, 0.0, 0.0, 0.0, 0.0, 0.0, 0.0, 0.0, 0.0, 0.0, 0.0, 0.0, 0.0, 0.0, 0.0, 0.0, 0.0, 0.0, 0.0, 0.0, 0.0, 0.0, 0.0, 0.0, 0.0, 0.0, 0.0, 0.0, 0.0, 0.0, 0.0, 0.0, 0.0, 0.0, 0.0, 0.0, 0.0, 0.0, 0.0, 0.0, 0.0, 0.0, 0.0, 0.0, 0.0, 0.0, 0.0, 0.0, 0.0, 0.0, 0.0, 0.0, 0.0, 0.0, 0.0, 0.0, 0.0, 0.0, 0.0, 0.0, 0.0, 0.0, 0.0, 0.0, 0.0, 0.0, 0.0, 0.0, 0.0, 0.0, 0.0, 0.0, 0.0, 0.0, 0.0, 0.0, 0.0, 0.0, 0.0, 0.0, 0.0, 0.0, 0.0, 0.0, 0.0, 0.0, 0.0, 0.0, 0.0, 0.0, 0.0, 0.0, 0.0, 0.0, 0.0, 0.0, 0.0, 0.0, 0.0, 0.0, 0.0, 0.0, 0.0, 0.0, 0.0, 0.0, 0.0, 0.0, 0.0, 0.0, 0.0, 0.0, 0.0, 0.0, 0.0, 0.0, 0.0, 0.0, 0.0, 0.0, 0.0, 0.0, 0.0, 0.0, 0.0, 0.0, 0.0, 0.0, 0.0, 0.0, 0.0, 0.0, 0.0, 0.0, 0.0, 0.0, 0.0, 0.0, 0.0, 0.0, 0.0, 0.0, 0.0, 0.0, 0.0, 0.0, 0.0, 0.0, 0.0, 0.0, 0.0, 0.0, 0.0, 0.0, 0.0, 0.0, 0.0, 0.0, 0.0, 0.0, 0.0, 0.0, 0.0, 0.0, 0.0, 0.0, 0.0, 0.0, 0.0, 0.0, 0.0, 0.0, 0.0, 0.0, 0.0, 0.0, 0.0, 0.0, 0.0, 0.0, 0.0, 0.0, 0.0, 0.0, 0.0, 0.0, 0.0, 0.0, 0.0, 0.0, 0.0, 0.0, 0.0, 0.0, 0.0, 0.0, 0.0, 0.0, 0.0, 0.0, 0.0, 0.0, 0.0, 0.0, 0.0, 0.0, 0.0, 0.0, 0.0, 0.0, 0.0, 0.0, 0.0, 0.0, 0.0, 0.0, 0.0, 0.0, 0.0, 0.0, 0.0, 0.0, 0.0, 0.0, 0.0, 0.0, 0.0, 0.0, 0.0, 0.0, 0.0, 0.0, 0.0, 0.0, 0.0, 0.0, 0.0, 0.0, 0.0, 0.0, 0.0, 0.0, 0.0, 0.0, 0.0, 0.0, 0.0, 0.0, 0.0, 0.0, 0.0, 0.0, 0.0, 0.0, 0.0, 0.0, 0.0, 0.0, 0.0, 0.0, 0.0, 0.0, 0.0, 0.0, 0.0, 0.0, 0.0, 0.0, 0.0, 0.0, 0.0, 0.0, 0.0, 0.0, 0.0, 0.0, 0.0, 0.0, 0.0, 0.0, 0.0, 0.0, 0.0, 0.0, 0.0, 0.0, 0.0, 0.0, 0.0, 0.0, 0.0, 0.0, 0.0, 0.0, 0.0, 0.0, 0.0, 0.0, 0.0, 0.0, 0.0, 0.0, 0.0, 0.0, 0.0, 0.0, 0.0, 0.0, 0.0, 0.0, 0.0, 0.0, 0.0, 0.0, 0.0, 0.0, 0.0, 0.0, 0.0, 0.0, 0.0, 0.0, 0.0, 0.0, 0.0, 0.0, 0.0, 0.0, 0.0, 0.0, 0.0, 0.0, 0.0, 0.0, 0.0, 0.0, 0.0, 0.0, 0.0, 0.0, 0.0, 0.0, 0.0, 0.0, 0.0, 0.0, 0.0, 0.0, 0.0, 0.0, 0.0, 0.0, 0.0, 0.0, 0.0, 0.0, 0.0, 0.0, 0.0, 0.0, 0.0, 0.0, 0.0, 0.0, 0.0, 0.0, 0.0, 0.0, 0.0, 0.0, 0.0, 0.0, 0.0, 0.0, 0.0, 0.0, 0.0, 0.0, 0.0, 0.0, 0.0, 0.0, 0.0, 0.0, 0.0, 0.0, 0.0, 0.0, 0.0, 0.0, 0.0, 0.0, 0.0, 0.0, 0.0, 0.0, 0.0, 0.0, 0.0, 0.0, 0.0, 0.0, 0.0, 0.0, 0.0, 0.0, 0.0, 0.0, 0.0, 0.0, 0.0, 0.0, 0.0, 0.0, 0.0, 0.0, 0.0, 0.0, 0.0, 0.0, 0.0, 0.0, 0.0, 0.0, 0.0, 0.0, 0.0, 0.0, 0.0, 0.0, 0.0, 0.0, 0.0, 0.0, 0.0, 0.0, 0.0, 0.0, 0.0, 0.0, 0.0, 0.0, 0.0, 0.0, 0.0, 0.0, 0.0, 0.0, 0.0, 0.0, 0.0, 0.0, 0.0, 0.0, 0.0, 0.0, 0.0, 0.0, 0.0, 0.0, 0.0, 0.0, 0.0, 0.0, 0.0, 0.0, 0.0, 0.0, 0.0, 0.0, 0.0, 0.0, 0.0, 0.0, 0.0, 0.0, 0.0, 0.0, 0.0, 0.0, 0.0, 0.0, 0.0, 0.0, 0.0, 0.0, 0.0, 0.0, 0.0, 0.0, 0.0, 0.0, 0.0, 0.0, 0.0, 0.0, 0.0, 0.0, 0.0, 0.0, 0.0, 0.0, 0.0, 0.0, 0.0, 0.0, 0.0, 0.0, 0.0, 0.0, 0.0, 0.0, 0.0, 0.0, 0.0, 0.0, 0.0, 0.0, 0.0, 0.0, 0.0, 0.0, 0.0, 0.0, 0.0, 0.0, 0.0, 0.0, 0.0, 0.0, 0.0, 0.0, 0.0, 0.0, 0.0, 0.0, 0.0, 0.0, 0.0, 0.0, 0.0, 0.0, 0.0, 0.0, 0.0, 0.0, 0.0, 0.0, 0.0, 0.0, 0.0, 0.0, 0.0, 0.0, 0.0, 0.0, 0.0, 0.0, 0.0, 0.0, 0.0, 0.0, 0.0, 0.0, 0.0, 0.0, 0.0, 0.0, 0.0, 0.0, 0.0, 0.0, 0.0, 0.0, 0.0, 0.0, 0.0, 0.0, 0.0, 0.0, 0.0, 0.0, 0.0, 0.0, 0.0, 0.0, 0.0, 0.0, 0.0, 0.0, 0.0, 0.0, 0.0, 0.0, 0.0, 0.0, 0.0, 0.0, 0.0, 0.0, 0.0, 0.0, 0.0, 0.0, 0.0, 0.0, 0.0, 0.0, 0.0, 0.0, 0.0, 0.0, 0.0, 0.0, 0.0, 0.0, 0.0, 0.0, 0.0, 0.0, 0.0, 0.0, 0.0, 0.0, 0.0, 0.0, 0.0, 0.0, 0.0, 0.0, 0.0, 0.0, 0.0, 0.0, 0.0, 0.0, 0.0, 0.0, 0.0, 0.0, 0.0, 0.0, 0.0, 0.0, 0.0, 0.0, 0.0, 0.0, 0.0, 0.0, 0.0, 0.0, 0.0, 0.0, 0.0, 0.0, 0.0, 0.0, 0.0, 0.0, 0.0, 0.0, 0.0, 0.0, 0.0, 0.0, 0.0, 0.0, 0.0, 0.0, 0.0, 0.0, 0.0, 0.0, 0.0, 0.0, 0.0, 0.0, 0.0, 0.0, 0.0, 0.0, 0.0, 0.0, 0.0, 0.0, 0.0, 0.0, 0.0, 0.0, 0.0, 0.0, 0.0, 0.0, 0.0, 0.0, 0.0, 0.0, 0.0, 0.0, 0.0, 0.0, 0.0, 0.0, 0.0, 0.0, 0.0, 0.0, 0.0]
[0.0, 0.0, 0.0, 0.0, 0.0, 0.0, 0.0, 0.0, 0.0, 0.0, 0.0, 0.0, 0.0, 0.0, 0.0, 0.0, 0.0, 0.0, 0.0, 0.0, 0.0, 0.0, 0.0, 0.0, 0.0, 0.0, 0.0, 0.0, 0.0, 0.0, 0.0, 0.0, 0.0, 0.0, 0.0, 0.0, 0.0, 0.0, 0.0, 0.0, 0.0, 0.0, 0.0, 0.0, 0.0, 0.0, 0.0, 0.0, 0.0, 0.0, 0.0, 0.0, 0.0, 0.0, 0.0, 0.0, 0.0, 0.0, 0.0, 0.0, 0.0, 0.0, 0.0, 0.0, 0.0, 0.0, 0.0, 0.0, 0.0, 0.0, 0.0, 0.0, 0.0, 0.0, 0.0, 0.0, 0.0, 0.0, 0.0, 0.0, 0.0, 0.0, 0.0, 0.0, 0.0, 0.0, 0.0, 0.0, 0.0, 0.0, 0.0, 0.0, 0.0, 0.0, 0.0, 0.0, 0.0, 0.0, 0.0, 0.0, 0.0, 0.0, 0.0, 0.0, 0.0, 0.0, 0.0, 0.0, 0.0, 0.0, 0.0, 0.0, 0.0, 0.0, 0.0, 0.0, 0.0, 0.0, 0.0, 0.0, 0.0, 0.0, 0.0, 0.0, 0.0, 0.0, 0.0, 0.0, 0.0, 0.0, 0.0, 0.0, 0.0, 0.0, 0.0, 0.0, 0.0, 0.0, 0.0, 0.0, 0.0, 0.0, 0.0, 0.0, 0.0, 0.0, 0.0, 0.0, 0.0, 0.0, 0.0, 0.0, 0.0, 0.0, 0.0, 0.0, 0.0, 0.0, 0.0, 0.0, 0.0, 0.0, 0.0, 0.0, 0.0, 0.0, 0.0, 0.0, 0.0, 0.0, 0.0, 0.0, 0.0, 0.0, 0.0, 0.0, 0.0, 0.0, 0.0, 0.0, 0.0, 0.0, 0.0, 0.0, 0.0, 0.0, 0.0, 0.0, 0.0, 0.0, 0.0, 0.0, 0.0, 0.0, 0.0, 0.0, 0.0, 0.0, 0.0, 0.0, 0.0, 0.0, 0.0, 0.0, 0.0, 0.0, 0.0, 0.0, 0.0, 0.0, 0.0, 0.0, 0.0, 0.0, 0.0, 0.0, 0.0, 0.0, 0.0, 0.0, 0.0, 0.0, 0.0, 0.0, 0.0, 0.0, 0.0, 0.0, 0.0, 0.0, 0.0, 0.0, 0.0, 0.0, 0.0, 0.0, 0.0, 0.0, 0.0, 0.0, 0.0, 0.0, 0.0, 0.0, 0.0, 0.0, 0.0, 0.0, 0.0, 0.0, 0.0, 0.0, 0.0, 0.0, 0.0, 0.0, 0.0, 0.0, 0.0, 0.0, 0.0, 0.0, 0.0, 0.0, 0.0, 0.0, 0.0, 0.0, 0.0, 0.0, 0.0, 0.0, 0.0, 0.0, 0.0, 0.0, 0.0, 0.0, 0.0, 0.0, 0.0, 0.0, 0.0, 0.0, 0.0, 0.0, 0.0, 0.0, 0.0, 0.0, 0.0, 0.0, 0.0, 0.0, 0.0, 0.0, 0.0, 0.0, 0.0, 0.0, 0.0, 0.0, 0.0, 0.0, 0.0, 0.0, 0.0, 0.0, 0.0, 0.0, 0.0, 0.0, 0.0, 0.0, 0.0, 0.0, 0.0, 0.0, 0.0, 0.0, 0.0, 0.0, 0.0, 0.0, 0.0, 0.0, 0.0, 0.0, 0.0, 0.0, 0.0, 0.0, 0.0, 0.0, 0.0, 0.0, 0.0, 0.0, 0.0, 0.0, 0.0, 0.0, 0.0, 0.0, 0.0, 0.0, 0.0, 0.0, 0.0, 0.0, 0.0, 0.0, 0.0, 0.0, 0.0, 0.0, 0.0, 0.0, 0.0, 0.0, 0.0, 0.0, 0.0, 0.0, 0.0, 0.0, 0.0, 0.0, 0.0, 0.0, 0.0, 0.0, 0.0, 0.0, 0.0, 0.0, 0.0, 0.0, 0.0, 0.0, 0.0, 0.0, 0.0, 0.0, 0.0, 0.0, 0.0, 0.0, 0.0, 0.0, 0.0, 0.0, 0.0, 0.0, 0.0, 0.0, 0.0, 0.0, 0.0, 0.0, 0.0, 0.0, 0.0, 0.0, 0.0, 0.0, 0.0, 0.0, 0.0, 0.0, 0.0, 0.0, 0.0, 0.0, 0.0, 0.0, 0.0, 0.0, 0.0, 0.0, 0.0, 0.0, 0.0, 0.0, 0.0, 0.0, 0.0, 0.0, 0.0, 0.0, 0.0, 0.0, 0.0, 0.0, 0.0, 0.0, 0.0, 0.0, 0.0, 0.0, 0.0, 0.0, 0.0, 0.0, 0.0, 0.0, 0.0, 0.0, 0.0, 0.0, 0.0, 0.0, 0.0, 0.0, 0.0, 0.0, 0.0, 0.0, 0.0, 0.0, 0.0, 0.0, 0.0, 0.0, 0.0, 0.0, 0.0, 0.0, 0.0, 0.0, 0.0, 0.0, 0.0, 0.0, 0.0, 0.0, 0.0, 0.0, 0.0, 0.0, 0.0, 0.0, 0.0, 0.0, 0.0, 0.0, 0.0, 0.0, 0.0, 0.0, 0.0, 0.0, 0.0, 0.0, 0.0, 0.0, 0.0, 0.0, 0.0, 0.0, 0.0, 0.0, 0.0, 0.0, 0.0, 0.0, 0.0, 0.0, 0.0, 0.0, 0.0, 0.0, 0.0, 0.0, 0.0, 0.0, 0.0, 0.0, 0.0, 0.0, 0.0, 0.0, 0.0, 0.0, 0.0, 0.0, 0.0, 0.0, 0.0, 0.0, 0.0, 0.0, 0.0, 0.0, 0.0, 0.0, 0.0, 0.0, 0.0, 0.0, 0.0, 0.0, 0.0, 0.0, 0.0, 0.0, 0.0, 0.0, 0.0, 0.0, 0.0, 0.0, 0.0, 0.0, 0.0, 0.0, 0.0, 0.0, 0.0, 0.0, 0.0, 0.0, 0.0, 0.0, 0.0, 0.0, 0.0, 0.0, 0.0, 0.0, 0.0, 0.0, 0.0, 0.0, 0.0, 0.0, 0.0, 0.0, 0.0, 0.0, 0.0, 0.0, 0.0, 0.0, 0.0, 0.0, 0.0, 0.0, 0.0, 0.0, 0.0, 0.0, 0.0, 0.0, 0.0, 0.0, 0.0, 0.0, 0.0, 0.0, 0.0, 0.0, 0.0, 0.0, 0.0, 0.0, 0.0, 0.0, 0.0, 0.0, 0.0, 0.0, 0.0, 0.0, 0.0, 0.0, 0.0, 0.0, 0.0, 0.0, 0.0, 0.0, 0.0, 0.0, 0.0, 0.0, 0.0, 0.0, 0.0, 0.0, 0.0, 0.0, 0.0, 0.0, 0.0, 0.0, 0.0, 0.0, 0.0, 0.0, 0.0, 0.0, 0.0, 0.0, 0.0, 0.0, 0.0, 0.0, 0.0, 0.0, 0.0, 0.0, 0.0, 0.0, 0.0, 0.0, 0.0, 0.0, 0.0, 0.0, 0.0, 0.0, 0.0, 0.0, 0.0, 0.0, 0.0, 0.0, 0.0, 0.0, 0.0, 0.0, 0.0, 0.0, 0.0, 0.0, 0.0, 0.0, 0.0, 0.0, 0.0, 0.0, 0.0, 0.0, 0.0, 0.0, 0.0, 0.0, 0.0, 0.0, 0.0, 0.0, 0.0, 0.0, 0.0, 0.0, 0.0, 0.0, 0.0, 0.0, 0.0, 0.0, 0.0, 0.0, 0.0, 0.0, 0.0, 0.0, 0.0, 0.0, 0.0, 0.0, 0.0, 0.0, 0.0, 0.0, 0.0, 0.0, 0.0, 0.0, 0.0, 0.0, 0.0, 0.0, 0.0, 0.0, 0.0, 0.0, 0.0, 0.0, 0.0, 0.0, 0.0, 0.0, 0.0, 0.0, 0.0, 0.0, 0.0, 0.0, 0.0, 0.0, 0.0, 0.0, 0.0, 0.0, 0.0, 0.0, 0.0, 0.0, 0.0, 0.0, 0.0, 0.0, 0.0, 0.0, 0.0, 0.0, 0.0, 0.0, 0.0, 0.0, 0.0, 0.0, 0.0, 0.0, 0.0, 0.0, 0.0, 0.0, 0.0, 0.0, 0.0, 0.0, 0.0, 0.0, 0.0, 0.0, 0.0, 0.0, 0.0, 0.0, 0.0, 0.0]
[Thread 1] Processed 100 zonotopes (Work Done: 0.0%; Expected Zonos: Inf)
[Thread 1] Processed 200 zonotopes (Work Done: 0.0%; Expected Zonos: Inf)
[Thread 1] Processed 300 zonotopes (Work Done: 0.0%; Expected Zonos: Inf)
[Thread 1] Processed 400 zonotopes (Work Done: 0.0%; Expected Zonos: Inf)
[Thread 1] Processed 500 zonotopes (Work Done: 0.0%; Expected Zonos: Inf)


TIMEOUT REACHED
UNKNOWN
[Thread 1] Total splits: 596
Processed 596 zonotopes (Work Done: 0.0%); Generated 1192 (0.2016116280872483s/loop)
[Thread 1] Finished in 120.16s
 ────────────────────────────────────────────────────────────────────────────────
                                        Time                    Allocations      
                               ───────────────────────   ────────────────────────
       Tot / % measured:             120s / 100.0%           62.0GiB / 100.0%    

 Section               ncalls     time    %tot     avg     alloc    %tot      avg
 ────────────────────────────────────────────────────────────────────────────────
 Verify                     1     120s  100.0%    120s   62.0GiB  100.0%  62.0GiB
   Zonotope Loop            1     120s  100.0%    120s   62.0GiB  100.0%  62.0GiB
     Zonotope Propa...    596    78.5s   65.4%   132ms   41.2GiB   66.5%  70.8MiB
       DiffZonotope...  1.79k    73.0s   60.8%  40.9ms   39.6GiB   63.9%  22.7MiB
         Zonotope_R...  3.58k    73.0s   60.7%  20.4ms   39.6GiB   63.9%  11.3MiB
           Influenc...  3.58k    68.0s   56.6%  19.0ms   36.4GiB   58.8%  10.4MiB
             Multiply   3.58k    40.3s   33.6%  11.3ms   18.5GiB   29.9%  5.31MiB
             Alloca...  3.58k    25.0s   20.8%  6.98ms   17.9GiB   28.9%  5.12MiB
             Set Ma...  3.58k    2.67s    2.2%   747μs     0.00B    0.0%    0.00B
           Column M...  3.58k    4.66s    3.9%  1.30ms   1.58GiB    2.6%   464KiB
           Set Matrix   3.58k    204ms    0.2%  57.2μs   3.60MiB    0.0%  1.03KiB
           Allocation   3.58k   99.2ms    0.1%  27.7μs   1.58GiB    2.6%   463KiB
           Vectors      3.58k   18.4ms    0.0%  5.13μs   11.4MiB    0.0%  3.26KiB
           Bounds       3.58k   1.95ms    0.0%   546ns     0.00B    0.0%    0.00B
       DiffZonotope...  2.38k    5.48s    4.6%  2.30ms   1.59GiB    2.6%   698KiB
         Zonotope_D...  4.77k    5.48s    4.6%  1.15ms   1.59GiB    2.6%   349KiB
     Compute Split        596    27.4s   22.8%  46.0ms   9.04GiB   14.6%  15.5MiB
     Property Check       596    134ms    0.1%   225μs    124MiB    0.2%   213KiB
 Initialize                 1    516μs    0.0%   516μs   5.41MiB    0.0%  5.41MiB
 ────────────────────────────────────────────────────────────────────────────────
[VERYDIFF_TIMER] 120.190584033

[VERYDIFF_EXPERIMENT] Running on /home/i57/steuber/NeuroDiff/repos/VeryDiffExperiments/src/../benchmarks/mnist-prune/specs/mnist_40_global_3.vnnlib /home/i57/steuber/NeuroDiff/repos/VeryDiffExperiments/src/../benchmarks/mnist-prune/nets/mnist_relu_4_1024.onnx
Found input X
op: matmul, weight: (1024, 784), bias: nothing
op: bias, weight: nothing, bias: (1024,)
op: relu, weight: nothing, bias: nothing
op: matmul, weight: (1024, 1024), bias: nothing
op: bias, weight: nothing, bias: (1024,)
op: relu, weight: nothing, bias: nothing
op: matmul, weight: (1024, 1024), bias: nothing
op: bias, weight: nothing, bias: (1024,)
op: relu, weight: nothing, bias: nothing
op: matmul, weight: (10, 1024), bias: nothing
op: bias, weight: nothing, bias: (10,)
op: relu, weight: nothing, bias: nothing
op: matmul, weight: (10, 10), bias: nothing
op: bias, weight: nothing, bias: (10,)
Found input X
op: matmul, weight: (1024, 784), bias: nothing
op: bias, weight: nothing, bias: (1024,)
op: relu, weight: nothing, bias: nothing
op: matmul, weight: (1024, 1024), bias: nothing
op: bias, weight: nothing, bias: (1024,)
op: relu, weight: nothing, bias: nothing
op: matmul, weight: (1024, 1024), bias: nothing
op: bias, weight: nothing, bias: (1024,)
op: relu, weight: nothing, bias: nothing
op: matmul, weight: (10, 1024), bias: nothing
op: bias, weight: nothing, bias: (10,)
op: relu, weight: nothing, bias: nothing
op: matmul, weight: (10, 10), bias: nothing
op: bias, weight: nothing, bias: (10,)
Distance: 1266.8815759184893
Distance: 2876.6944248261216
Distance: 2831.8843567411013
Distance: 34.033756025192815
Distance: 0.0
Running with 1 threads
[Thread 1] Time to first task: 0.01s
Zono Bounds:
[0.0, 0.0, 0.0, 0.0, 0.0, 0.0, 0.0, 0.0, 0.0, 0.0, 0.0, 0.0, 0.0, 0.0, 0.0, 0.0, 0.0, 0.0, 0.0, 0.0, 0.0, 0.0, 0.0, 0.0, 0.0, 0.0, 0.0, 0.0, 0.0, 0.0, 0.0, 0.0, 0.0, 0.0, 0.0, 0.0, 0.0, 0.0, 0.0, 0.0, 0.0, 0.0, 0.0, 0.0, 0.0, 0.0, 0.0, 0.0, 0.0, 0.0, 0.0, 0.0, 0.0, 0.0, 0.0, 0.0, 0.0, 0.0, 0.0, 0.0, 0.0, 0.0, 0.0, 0.0, 0.0, 0.0, 0.0, 0.0, 0.0, 0.0, 0.0, 0.0, 0.0, 0.0, 0.0, 0.0, 0.0, 0.0, 0.0, 0.0, 0.0, 0.0, 0.0, 0.0, 0.0, 0.0, 0.0, 0.0, 0.0, 0.0, 0.0, 0.0, 0.0, 0.0, 0.0, 0.0, 0.0, 0.0, 0.0, 0.0, 0.0, 0.0, 0.0, 0.0, 0.0, 0.0, 0.0, 0.0, 0.0, 0.0, 0.0, 0.0, 0.0, 0.0, 0.0, 0.0, 0.0, 0.0, 0.0, 0.0, 0.0, 0.0, 0.0, 0.0, 0.0, 0.0, 0.0, 0.0, 0.0, 0.0, 0.0, 0.0, 0.0, 0.0, 0.0, 0.0, 0.0, 0.0, 0.0, 0.0, 0.0, 0.0, 0.0, 0.0, 0.0, 0.0, 0.0, 0.0, 0.0, 0.0, 0.0, 0.0, 0.0, 0.0, 0.0, 0.0, 0.0, 0.0, 0.0, 0.0, 0.0, 0.0, 0.0, 0.0, 0.0, 0.0, 0.0, 0.0, 0.0, 0.0, 0.0, 0.0, 0.0, 0.0, 0.0, 0.0, 0.0, 0.0, 0.0, 0.0, 0.0, 0.0, 0.0, 0.0, 0.0, 0.0, 0.0, 0.0, 0.0, 0.0, 0.0, 0.0, 0.0, 0.0, 0.0, 0.0, 0.0, 0.0, 0.0, 0.0, 0.0, 0.0, 0.0, 0.0, 0.0, 0.0, 0.0, 0.0, 0.0, 0.0, 0.0, 0.0, 0.0, 0.0, 0.0, 0.0, 0.0, 0.0, 0.0, 0.0, 0.0, 0.0, 0.0, 0.0, 0.0, 0.0, 0.0, 0.0, 0.0, 0.0, 0.0, 0.0, 0.0, 0.0, 0.0, 0.0, 0.0, 0.0, 0.0, 0.0, 0.0, 0.0, 0.0, 0.0, 0.0, 0.0, 0.0, 0.0, 0.0, 0.0, 0.0, 0.0, 0.0, 0.0, 0.0, 0.0, 0.0, 0.0, 0.0, 0.0, 0.0, 0.0, 0.0, 0.0, 0.0, 0.0, 0.0, 0.0, 0.0, 0.0, 0.0, 0.0, 0.0, 0.0, 0.0, 0.0, 0.0, 0.0, 0.0, 0.0, 0.0, 0.0, 0.0, 0.0, 0.0, 0.0, 0.0, 0.0, 0.0, 0.0, 0.0, 0.0, 0.0, 0.0, 0.0, 0.0, 0.0, 0.0, 0.0, 0.0, 0.0, 0.0, 0.0, 0.0, 0.0, 0.0, 0.0, 0.0, 0.0, 0.0, 0.0, 0.0, 0.0, 0.0, 0.0, 0.0, 0.0, 0.0, 0.0, 0.0, 0.0, 0.0, 0.0, 0.0, 0.0, 0.0, 0.0, 0.0, 0.0, 0.0, 0.0, 0.0, 0.0, 0.0, 0.0, 0.0, 0.0, 0.0, 0.0, 0.0, 0.0, 0.0, 0.0, 0.0, 0.0, 0.0, 0.0, 0.0, 0.0, 0.0, 0.0, 0.0, 0.0, 0.0, 0.0, 0.0, 0.0, 0.0, 0.0, 0.0, 0.0, 0.0, 0.0, 0.0, 0.0, 0.0, 0.0, 0.0, 0.0, 0.0, 0.0, 0.0, 0.0, 0.0, 0.0, 0.0, 0.0, 0.0, 0.0, 0.0, 0.0, 0.0, 0.0, 0.0, 0.0, 0.0, 0.0, 0.0, 0.0, 0.0, 0.0, 0.0, 0.0, 0.0, 0.0, 0.0, 0.0, 0.0, 0.0, 0.0, 0.0, 0.0, 0.0, 0.0, 0.0, 0.0, 0.0, 0.0, 0.0, 0.0, 0.0, 0.0, 0.0, 0.0, 0.0, 0.0, 0.0, 0.0, 0.0, 0.0, 0.0, 0.0, 0.0, 0.0, 0.0, 0.0, 0.0, 0.0, 0.0, 0.0, 0.0, 0.0, 0.0, 0.0, 0.0, 0.0, 0.0, 0.0, 0.0, 0.0, 0.0, 0.0, 0.0, 0.0, 0.0, 0.0, 0.0, 0.0, 0.0, 0.0, 0.0, 0.0, 0.0, 0.0, 0.0, 0.0, 0.0, 0.0, 0.0, 0.0, 0.0, 0.0, 0.0, 0.0, 0.0, 0.0, 0.0, 0.0, 0.0, 0.0, 0.0, 0.0, 0.0, 0.0, 0.0, 0.0, 0.0, 0.0, 0.0, 0.0, 0.0, 0.0, 0.0, 0.0, 0.0, 0.0, 0.0, 0.0, 0.0, 0.0, 0.0, 0.0, 0.0, 0.0, 0.0, 0.0, 0.0, 0.0, 0.0, 0.0, 0.0, 0.0, 0.0, 0.0, 0.0, 0.0, 0.0, 0.0, 0.0, 0.0, 0.0, 0.0, 0.0, 0.0, 0.0, 0.0, 0.0, 0.0, 0.0, 0.0, 0.0, 0.0, 0.0, 0.0, 0.0, 0.0, 0.0, 0.0, 0.0, 0.0, 0.0, 0.0, 0.0, 0.0, 0.0, 0.0, 0.0, 0.0, 0.0, 0.0, 0.0, 0.0, 0.0, 0.0, 0.0, 0.0, 0.0, 0.0, 0.0, 0.0, 0.0, 0.0, 0.0, 0.0, 0.0, 0.0, 0.0, 0.0, 0.0, 0.0, 0.0, 0.0, 0.0, 0.0, 0.0, 0.0, 0.0, 0.0, 0.0, 0.0, 0.0, 0.0, 0.0, 0.0, 0.0, 0.0, 0.0, 0.0, 0.0, 0.0, 0.0, 0.0, 0.0, 0.0, 0.0, 0.0, 0.0, 0.0, 0.0, 0.0, 0.0, 0.0, 0.0, 0.0, 0.0, 0.0, 0.0, 0.0, 0.0, 0.0, 0.0, 0.0, 0.0, 0.0, 0.0, 0.0, 0.0, 0.0, 0.0, 0.0, 0.0, 0.0, 0.0, 0.0, 0.0, 0.0, 0.0, 0.0, 0.0, 0.0, 0.0, 0.0, 0.0, 0.0, 0.0, 0.0, 0.0, 0.0, 0.0, 0.0, 0.0, 0.0, 0.0, 0.0, 0.0, 0.0, 0.0, 0.0, 0.0, 0.0, 0.0, 0.0, 0.0, 0.0, 0.0, 0.0, 0.0, 0.0, 0.0, 0.0, 0.0, 0.0, 0.0, 0.0, 0.0, 0.0, 0.0, 0.0, 0.0, 0.0, 0.0, 0.0, 0.0, 0.0, 0.0, 0.0, 0.0, 0.0, 0.0, 0.0, 0.0, 0.0, 0.0, 0.0, 0.0, 0.0, 0.0, 0.0, 0.0, 0.0, 0.0, 0.0, 0.0, 0.0, 0.0, 0.0, 0.0, 0.0, 0.0, 0.0, 0.0, 0.0, 0.0, 0.0, 0.0, 0.0, 0.0, 0.0, 0.0, 0.0, 0.0, 0.0, 0.0, 0.0, 0.0, 0.0, 0.0, 0.0, 0.0, 0.0, 0.0, 0.0, 0.0, 0.0, 0.0, 0.0, 0.0, 0.0, 0.0, 0.0, 0.0, 0.0, 0.0, 0.0, 0.0, 0.0, 0.0, 0.0, 0.0, 0.0, 0.0, 0.0, 0.0, 0.0, 0.0, 0.0, 0.0, 0.0, 0.0, 0.0, 0.0, 0.0, 0.0, 0.0, 0.0, 0.0, 0.0, 0.0, 0.0, 0.0, 0.0, 0.0, 0.0, 0.0, 0.0, 0.0, 0.0, 0.0, 0.0, 0.0, 0.0, 0.0, 0.0, 0.0, 0.0, 0.0, 0.0, 0.0, 0.0, 0.0, 0.0, 0.0, 0.0, 0.0, 0.0, 0.0, 0.0, 0.0, 0.0, 0.0, 0.0, 0.0, 0.0, 0.0]
[0.0, 0.0, 0.0, 0.0, 0.0, 0.0, 0.0, 0.0, 0.0, 0.0, 0.0, 0.0, 0.0, 0.0, 0.0, 0.0, 0.0, 0.0, 0.0, 0.0, 0.0, 0.0, 0.0, 0.0, 0.0, 0.0, 0.0, 0.0, 0.0, 0.0, 0.0, 0.0, 0.0, 0.0, 0.0, 0.0, 0.0, 0.0, 0.0, 0.0, 0.0, 0.0, 0.0, 0.0, 0.0, 0.0, 0.0, 0.0, 0.0, 0.0, 0.0, 0.0, 0.0, 0.0, 0.0, 0.0, 0.0, 0.0, 0.0, 0.0, 0.0, 0.0, 0.0, 0.0, 0.0, 0.0, 0.0, 0.0, 0.0, 0.0, 0.0, 0.0, 0.0, 0.0, 0.0, 0.0, 0.0, 0.0, 0.0, 0.0, 0.0, 0.0, 0.0, 0.0, 0.0, 0.0, 0.0, 0.0, 0.0, 0.0, 0.0, 0.0, 0.0, 0.0, 0.0, 0.0, 0.0, 0.0, 0.0, 0.0, 0.0, 0.0, 0.0, 0.0, 0.0, 0.0, 0.0, 0.0, 0.0, 0.0, 0.0, 0.0, 0.0, 0.0, 0.0, 0.0, 0.0, 0.0, 0.0, 0.0, 0.0, 0.0, 0.0, 0.0, 0.0, 0.0, 0.0, 0.0, 0.0, 0.0, 0.0, 0.0, 0.0, 0.0, 0.0, 0.0, 0.0, 0.0, 0.0, 0.0, 0.0, 0.0, 0.0, 0.0, 0.0, 0.0, 0.0, 0.0, 0.0, 0.0, 0.0, 0.0, 0.0, 0.0, 0.0, 0.0, 0.0, 0.0, 0.0, 0.0, 0.0, 0.0, 0.0, 0.0, 0.0, 0.0, 0.0, 0.0, 0.0, 0.0, 0.0, 0.0, 0.0, 0.0, 0.0, 0.0, 0.0, 0.0, 0.0, 0.0, 0.0, 0.0, 0.0, 0.0, 0.0, 0.0, 0.0, 0.0, 0.0, 0.0, 0.0, 0.0, 0.0, 0.0, 0.0, 0.0, 0.0, 0.0, 0.0, 0.0, 0.0, 0.0, 0.0, 0.0, 0.0, 0.0, 0.0, 0.0, 0.0, 0.0, 0.0, 0.0, 0.0, 0.0, 0.0, 0.0, 0.0, 0.0, 0.0, 0.0, 0.0, 0.0, 0.0, 0.0, 0.0, 0.0, 0.0, 0.0, 0.0, 0.0, 0.0, 0.0, 0.0, 0.0, 0.0, 0.0, 0.0, 0.0, 0.0, 0.0, 0.0, 0.0, 0.0, 0.0, 0.0, 0.0, 0.0, 0.0, 0.0, 0.0, 0.0, 0.0, 0.0, 0.0, 0.0, 0.0, 0.0, 0.0, 0.0, 0.0, 0.0, 0.0, 0.0, 0.0, 0.0, 0.0, 0.0, 0.0, 0.0, 0.0, 0.0, 0.0, 0.0, 0.0, 0.0, 0.0, 0.0, 0.0, 0.0, 0.0, 0.0, 0.0, 0.0, 0.0, 0.0, 0.0, 0.0, 0.0, 0.0, 0.0, 0.0, 0.0, 0.0, 0.0, 0.0, 0.0, 0.0, 0.0, 0.0, 0.0, 0.0, 0.0, 0.0, 0.0, 0.0, 0.0, 0.0, 0.0, 0.0, 0.0, 0.0, 0.0, 0.0, 0.0, 0.0, 0.0, 0.0, 0.0, 0.0, 0.0, 0.0, 0.0, 0.0, 0.0, 0.0, 0.0, 0.0, 0.0, 0.0, 0.0, 0.0, 0.0, 0.0, 0.0, 0.0, 0.0, 0.0, 0.0, 0.0, 0.0, 0.0, 0.0, 0.0, 0.0, 0.0, 0.0, 0.0, 0.0, 0.0, 0.0, 0.0, 0.0, 0.0, 0.0, 0.0, 0.0, 0.0, 0.0, 0.0, 0.0, 0.0, 0.0, 0.0, 0.0, 0.0, 0.0, 0.0, 0.0, 0.0, 0.0, 0.0, 0.0, 0.0, 0.0, 0.0, 0.0, 0.0, 0.0, 0.0, 0.0, 0.0, 0.0, 0.0, 0.0, 0.0, 0.0, 0.0, 0.0, 0.0, 0.0, 0.0, 0.0, 0.0, 0.0, 0.0, 0.0, 0.0, 0.0, 0.0, 0.0, 0.0, 0.0, 0.0, 0.0, 0.0, 0.0, 0.0, 0.0, 0.0, 0.0, 0.0, 0.0, 0.0, 0.0, 0.0, 0.0, 0.0, 0.0, 0.0, 0.0, 0.0, 0.0, 0.0, 0.0, 0.0, 0.0, 0.0, 0.0, 0.0, 0.0, 0.0, 0.0, 0.0, 0.0, 0.0, 0.0, 0.0, 0.0, 0.0, 0.0, 0.0, 0.0, 0.0, 0.0, 0.0, 0.0, 0.0, 0.0, 0.0, 0.0, 0.0, 0.0, 0.0, 0.0, 0.0, 0.0, 0.0, 0.0, 0.0, 0.0, 0.0, 0.0, 0.0, 0.0, 0.0, 0.0, 0.0, 0.0, 0.0, 0.0, 0.0, 0.0, 0.0, 0.0, 0.0, 0.0, 0.0, 0.0, 0.0, 0.0, 0.0, 0.0, 0.0, 0.0, 0.0, 0.0, 0.0, 0.0, 0.0, 0.0, 0.0, 0.0, 0.0, 0.0, 0.0, 0.0, 0.0, 0.0, 0.0, 0.0, 0.0, 0.0, 0.0, 0.0, 0.0, 0.0, 0.0, 0.0, 0.0, 0.0, 0.0, 0.0, 0.0, 0.0, 0.0, 0.0, 0.0, 0.0, 0.0, 0.0, 0.0, 0.0, 0.0, 0.0, 0.0, 0.0, 0.0, 0.0, 0.0, 0.0, 0.0, 0.0, 0.0, 0.0, 0.0, 0.0, 0.0, 0.0, 0.0, 0.0, 0.0, 0.0, 0.0, 0.0, 0.0, 0.0, 0.0, 0.0, 0.0, 0.0, 0.0, 0.0, 0.0, 0.0, 0.0, 0.0, 0.0, 0.0, 0.0, 0.0, 0.0, 0.0, 0.0, 0.0, 0.0, 0.0, 0.0, 0.0, 0.0, 0.0, 0.0, 0.0, 0.0, 0.0, 0.0, 0.0, 0.0, 0.0, 0.0, 0.0, 0.0, 0.0, 0.0, 0.0, 0.0, 0.0, 0.0, 0.0, 0.0, 0.0, 0.0, 0.0, 0.0, 0.0, 0.0, 0.0, 0.0, 0.0, 0.0, 0.0, 0.0, 0.0, 0.0, 0.0, 0.0, 0.0, 0.0, 0.0, 0.0, 0.0, 0.0, 0.0, 0.0, 0.0, 0.0, 0.0, 0.0, 0.0, 0.0, 0.0, 0.0, 0.0, 0.0, 0.0, 0.0, 0.0, 0.0, 0.0, 0.0, 0.0, 0.0, 0.0, 0.0, 0.0, 0.0, 0.0, 0.0, 0.0, 0.0, 0.0, 0.0, 0.0, 0.0, 0.0, 0.0, 0.0, 0.0, 0.0, 0.0, 0.0, 0.0, 0.0, 0.0, 0.0, 0.0, 0.0, 0.0, 0.0, 0.0, 0.0, 0.0, 0.0, 0.0, 0.0, 0.0, 0.0, 0.0, 0.0, 0.0, 0.0, 0.0, 0.0, 0.0, 0.0, 0.0, 0.0, 0.0, 0.0, 0.0, 0.0, 0.0, 0.0, 0.0, 0.0, 0.0, 0.0, 0.0, 0.0, 0.0, 0.0, 0.0, 0.0, 0.0, 0.0, 0.0, 0.0, 0.0, 0.0, 0.0, 0.0, 0.0, 0.0, 0.0, 0.0, 0.0, 0.0, 0.0, 0.0, 0.0, 0.0, 0.0, 0.0, 0.0, 0.0, 0.0, 0.0, 0.0, 0.0, 0.0, 0.0, 0.0, 0.0, 0.0, 0.0, 0.0, 0.0, 0.0, 0.0, 0.0, 0.0, 0.0, 0.0, 0.0, 0.0, 0.0, 0.0, 0.0, 0.0, 0.0, 0.0, 0.0, 0.0, 0.0, 0.0, 0.0, 0.0, 0.0, 0.0, 0.0, 0.0, 0.0, 0.0, 0.0, 0.0, 0.0, 0.0, 0.0, 0.0, 0.0, 0.0, 0.0, 0.0, 0.0, 0.0, 0.0, 0.0, 0.0, 0.0, 0.0, 0.0, 0.0, 0.0, 0.0, 0.0, 0.0, 0.0, 0.0, 0.0, 0.0, 0.0, 0.0, 0.0, 0.0, 0.0]

Found counterexample: ([0.005882355, 0.005882355, 0.005882355, 0.005882355, 0.005882355, 0.005882355, 0.005882355, 0.005882355, 0.005882355, 0.005882355, 0.005882355, 0.005882355, 0.005882355, 0.005882355, 0.005882355, 0.005882355, 0.005882355, 0.005882355, 0.005882355, 0.005882355, 0.005882355, 0.005882355, 0.005882355, 0.005882355, 0.005882355, 0.005882355, 0.005882355, 0.005882355, 0.005882355, 0.005882355, 0.005882355, 0.005882355, 0.005882355, 0.005882355, 0.005882355, 0.005882355, 0.005882355, 0.005882355, 0.005882355, 0.005882355, 0.005882355, 0.005882355, 0.005882355, 0.005882355, 0.005882355, 0.005882355, 0.005882355, 0.005882355, 0.005882355, 0.005882355, 0.005882355, 0.005882355, 0.005882355, 0.005882355, 0.005882355, 0.005882355, 0.005882355, 0.005882355, 0.005882355, 0.005882355, 0.005882355, 0.005882355, 0.005882355, 0.005882355, 0.005882355, 0.005882355, 0.005882355, 0.005882355, 0.005882355, 0.005882355, 0.005882355, 0.005882355, 0.005882355, 0.005882355, 0.005882355, 0.005882355, 0.005882355, 0.005882355, 0.005882355, 0.005882355, 0.005882355, 0.005882355, 0.005882355, 0.005882355, 0.005882355, 0.005882355, 0.005882355, 0.005882355, 0.005882355, 0.005882355, 0.005882355, 0.005882355, 0.005882355, 0.005882355, 0.005882355, 0.005882355, 0.005882355, 0.005882355, 0.005882355, 0.005882355, 0.005882355, 0.005882355, 0.005882355, 0.005882355, 0.005882355, 0.005882355, 0.005882355, 0.005882355, 0.005882355, 0.005882355, 0.005882355, 0.005882355, 0.005882355, 0.005882355, 0.005882355, 0.005882355, 0.005882355, 0.005882355, 0.005882355, 0.005882355, 0.005882355, 0.005882355, 0.005882355, 0.005882355, 0.005882355, 0.631372575, 0.12156863, 0.005882355, 0.005882355, 0.005882355, 0.005882355, 0.005882355, 0.005882355, 0.005882355, 0.005882355, 0.005882355, 0.005882355, 0.005882355, 0.005882355, 0.005882355, 0.005882355, 0.005882355, 0.005882355, 0.005882355, 0.005882355, 0.005882355, 0.005882355, 0.005882355, 0.005882355, 0.005882355, 0.005882355, 0.005882355, 0.005882355, 0.850980405, 0.5921568850000001, 0.005882355, 0.005882355, 0.005882355, 0.005882355, 0.005882355, 0.005882355, 0.005882355, 0.005882355, 0.005882355, 0.005882355, 0.005882355, 0.005882355, 0.005882355, 0.005882355, 0.005882355, 0.005882355, 0.005882355, 0.005882355, 0.005882355, 0.005882355, 0.005882355, 0.005882355, 0.005882355, 0.005882355, 0.005882355, 0.005882355, 0.521568655, 0.9058823549999999, 0.005882355, 0.005882355, 0.005882355, 0.005882355, 0.005882355, 0.005882355, 0.005882355, 0.005882355, 0.005882355, 0.005882355, 0.005882355, 0.005882355, 0.005882355, 0.005882355, 0.005882355, 0.005882355, 0.005882355, 0.005882355, 0.005882355, 0.005882355, 0.005882355, 0.005882355, 0.005882355, 0.005882355, 0.005882355, 0.005882355, 0.305882365, 0.9058823549999999, 0.005882355, 0.005882355, 0.005882355, 0.005882355, 0.005882355, 0.005882355, 0.005882355, 0.005882355, 0.005882355, 0.005882355, 0.005882355, 0.005882355, 0.005882355, 0.005882355, 0.005882355, 0.005882355, 0.005882355, 0.005882355, 0.005882355, 0.005882355, 0.005882355, 0.005882355, 0.005882355, 0.005882355, 0.005882355, 0.005882355, 0.258823535, 0.9176470649999999, 0.035294115, 0.005882355, 0.005882355, 0.005882355, 0.005882355, 0.005882355, 0.005882355, 0.005882355, 0.005882355, 0.005882355, 0.005882355, 0.005882355, 0.005882355, 0.005882355, 0.005882355, 0.005882355, 0.005882355, 0.005882355, 0.005882355, 0.005882355, 0.005882355, 0.005882355, 0.005882355, 0.005882355, 0.005882355, 0.005882355, 0.005882355, 0.992156865, 0.211764705, 0.005882355, 0.005882355, 0.005882355, 0.005882355, 0.005882355, 0.005882355, 0.005882355, 0.005882355, 0.005882355, 0.005882355, 0.005882355, 0.005882355, 0.005882355, 0.005882355, 0.005882355, 0.005882355, 0.005882355, 0.005882355, 0.005882355, 0.005882355, 0.005882355, 0.005882355, 0.005882355, 0.005882355, 0.005882355, 0.005882355, 0.992156865, 0.211764705, 0.005882355, 0.005882355, 0.005882355, 0.005882355, 0.005882355, 0.005882355, 0.005882355, 0.005882355, 0.005882355, 0.005882355, 0.005882355, 0.005882355, 0.005882355, 0.005882355, 0.005882355, 0.005882355, 0.005882355, 0.005882355, 0.005882355, 0.005882355, 0.005882355, 0.005882355, 0.005882355, 0.005882355, 0.005882355, 0.005882355, 0.992156865, 0.211764705, 0.005882355, 0.005882355, 0.005882355, 0.005882355, 0.005882355, 0.005882355, 0.005882355, 0.005882355, 0.005882355, 0.005882355, 0.005882355, 0.005882355, 0.005882355, 0.005882355, 0.005882355, 0.005882355, 0.005882355, 0.005882355, 0.005882355, 0.005882355, 0.005882355, 0.005882355, 0.005882355, 0.005882355, 0.005882355, 0.005882355, 0.992156865, 0.364705895, 0.005882355, 0.005882355, 0.005882355, 0.005882355, 0.005882355, 0.005882355, 0.005882355, 0.005882355, 0.005882355, 0.005882355, 0.005882355, 0.005882355, 0.005882355, 0.005882355, 0.005882355, 0.005882355, 0.005882355, 0.005882355, 0.005882355, 0.005882355, 0.005882355, 0.005882355, 0.005882355, 0.005882355, 0.005882355, 0.005882355, 0.992156865, 0.32941177499999996, 0.005882355, 0.005882355, 0.005882355, 0.005882355, 0.005882355, 0.005882355, 0.005882355, 0.005882355, 0.005882355, 0.005882355, 0.005882355, 0.005882355, 0.005882355, 0.005882355, 0.005882355, 0.005882355, 0.005882355, 0.005882355, 0.005882355, 0.005882355, 0.005882355, 0.005882355, 0.005882355, 0.005882355, 0.005882355, 0.12156863, 0.994117645, 0.301960795, 0.005882355, 0.005882355, 0.005882355, 0.005882355, 0.005882355, 0.005882355, 0.005882355, 0.005882355, 0.005882355, 0.005882355, 0.005882355, 0.005882355, 0.005882355, 0.005882355, 0.005882355, 0.005882355, 0.005882355, 0.005882355, 0.005882355, 0.005882355, 0.005882355, 0.005882355, 0.005882355, 0.005882355, 0.005882355, 0.305882365, 0.992156865, 0.211764705, 0.005882355, 0.005882355, 0.005882355, 0.005882355, 0.005882355, 0.005882355, 0.005882355, 0.005882355, 0.005882355, 0.005882355, 0.005882355, 0.005882355, 0.005882355, 0.005882355, 0.005882355, 0.005882355, 0.005882355, 0.005882355, 0.005882355, 0.005882355, 0.005882355, 0.005882355, 0.005882355, 0.005882355, 0.005882355, 0.305882365, 0.913725495, 0.027450984999999997, 0.005882355, 0.005882355, 0.005882355, 0.005882355, 0.005882355, 0.005882355, 0.005882355, 0.005882355, 0.005882355, 0.005882355, 0.005882355, 0.005882355, 0.005882355, 0.005882355, 0.005882355, 0.005882355, 0.005882355, 0.005882355, 0.005882355, 0.005882355, 0.005882355, 0.005882355, 0.005882355, 0.005882355, 0.005882355, 0.5019608, 0.9058823549999999, 0.005882355, 0.005882355, 0.005882355, 0.005882355, 0.005882355, 0.005882355, 0.005882355, 0.005882355, 0.005882355, 0.005882355, 0.005882355, 0.005882355, 0.005882355, 0.005882355, 0.005882355, 0.005882355, 0.005882355, 0.005882355, 0.005882355, 0.005882355, 0.005882355, 0.005882355, 0.005882355, 0.005882355, 0.005882355, 0.005882355, 0.647058845, 0.9058823549999999, 0.005882355, 0.005882355, 0.005882355, 0.005882355, 0.005882355, 0.005882355, 0.005882355, 0.005882355, 0.005882355, 0.005882355, 0.005882355, 0.005882355, 0.005882355, 0.005882355, 0.005882355, 0.005882355, 0.005882355, 0.005882355, 0.005882355, 0.005882355, 0.005882355, 0.005882355, 0.005882355, 0.005882355, 0.005882355, 0.005882355, 0.9058823549999999, 0.831372555, 0.005882355, 0.005882355, 0.005882355, 0.005882355, 0.005882355, 0.005882355, 0.005882355, 0.005882355, 0.005882355, 0.005882355, 0.005882355, 0.005882355, 0.005882355, 0.005882355, 0.005882355, 0.005882355, 0.005882355, 0.005882355, 0.005882355, 0.005882355, 0.005882355, 0.005882355, 0.005882355, 0.005882355, 0.005882355, 0.005882355, 0.9058823549999999, 0.5921568850000001, 0.005882355, 0.005882355, 0.005882355, 0.005882355, 0.005882355, 0.005882355, 0.005882355, 0.005882355, 0.005882355, 0.005882355, 0.005882355, 0.005882355, 0.005882355, 0.005882355, 0.005882355, 0.005882355, 0.005882355, 0.005882355, 0.005882355, 0.005882355, 0.005882355, 0.005882355, 0.005882355, 0.005882355, 0.005882355, 0.027450984999999997, 0.913725495, 0.305882365, 0.005882355, 0.005882355, 0.005882355, 0.005882355, 0.005882355, 0.005882355, 0.005882355, 0.005882355, 0.005882355, 0.005882355, 0.005882355, 0.005882355, 0.005882355, 0.005882355, 0.005882355, 0.005882355, 0.005882355, 0.005882355, 0.005882355, 0.005882355, 0.005882355, 0.005882355, 0.005882355, 0.005882355, 0.005882355, 0.211764705, 0.99019608, 0.149019615, 0.005882355, 0.005882355, 0.005882355, 0.005882355, 0.005882355, 0.005882355, 0.005882355, 0.005882355, 0.005882355, 0.005882355, 0.005882355, 0.005882355, 0.005882355, 0.005882355, 0.005882355, 0.005882355, 0.005882355, 0.005882355, 0.005882355, 0.005882355, 0.005882355, 0.005882355, 0.005882355, 0.005882355, 0.005882355, 0.396078435, 0.99019608, 0.005882355, 0.005882355, 0.005882355, 0.005882355, 0.005882355, 0.005882355, 0.005882355, 0.005882355, 0.005882355, 0.005882355, 0.005882355, 0.005882355, 0.005882355, 0.005882355, 0.005882355, 0.005882355, 0.005882355, 0.005882355, 0.005882355, 0.005882355, 0.005882355, 0.005882355, 0.005882355, 0.005882355, 0.005882355, 0.005882355, 0.005882355, 0.005882355, 0.005882355, 0.005882355, 0.005882355, 0.005882355, 0.005882355, 0.005882355, 0.005882355, 0.005882355, 0.005882355, 0.005882355, 0.005882355, 0.005882355, 0.005882355, 0.005882355, 0.005882355, 0.005882355, 0.005882355, 0.005882355, 0.005882355, 0.005882355, 0.005882355, 0.005882355, 0.005882355, 0.005882355, 0.005882355, 0.005882355, 0.005882355, 0.005882355, 0.005882355, 0.005882355, 0.005882355, 0.005882355, 0.005882355, 0.005882355, 0.005882355, 0.005882355, 0.005882355, 0.005882355, 0.005882355, 0.005882355, 0.005882355, 0.005882355, 0.005882355, 0.005882355, 0.005882355, 0.005882355, 0.005882355, 0.005882355, 0.005882355, 0.005882355, 0.005882355, 0.005882355, 0.005882355, 0.005882355, 0.005882355, 0.005882355, 0.005882355, 0.005882355, 0.005882355, 0.005882355, 0.005882355, 0.005882355, 0.005882355, 0.005882355, 0.005882355, 0.005882355, 0.005882355, 0.005882355, 0.005882355, 0.005882355, 0.005882355, 0.005882355, 0.005882355, 0.005882355, 0.005882355, 0.005882355, 0.005882355, 0.005882355, 0.005882355, 0.005882355, 0.005882355, 0.005882355, 0.005882355, 0.005882355, 0.005882355, 0.005882355, 0.005882355, 0.005882355, 0.005882355, 0.005882355, 0.005882355, 0.005882355, 0.005882355, 0.005882355, 0.005882355, 0.005882355, 0.005882355, 0.005882355], ([0.0, 19.13172773128096, 0.0, 0.0, 1.1647017454975617, 0.0, 0.0, 4.535914831851789, 1.0830932327321745, 0.0], [0.0, 15.730342836730083, 0.23555050685004364, 0.0, 0.4651819626761679, 0.0, 0.0, 3.4077653028560206, 0.9000153051395773, 0.0], 3.401384894550878))
[Thread 1] Total splits: 0
Processed 1 zonotopes (Work Done: 0.0%); Generated 0 (1.755741183s/loop)
[Thread 1] Finished in 1.76s
 ────────────────────────────────────────────────────────────────────────────────
                                        Time                    Allocations      
                               ───────────────────────   ────────────────────────
       Tot / % measured:            1.78s / 100.0%            567MiB / 100.0%    

 Section               ncalls     time    %tot     avg     alloc    %tot      avg
 ────────────────────────────────────────────────────────────────────────────────
 Verify                     1    1.76s   98.7%   1.76s    540MiB   95.2%   540MiB
   Zonotope Loop            1    1.76s   98.7%   1.76s    540MiB   95.2%   540MiB
     Zonotope Propa...      1    1.73s   97.4%   1.73s    518MiB   91.4%   518MiB
       DiffZonotope...      4    1.04s   58.7%   261ms    456MiB   80.4%   114MiB
         Zonotope_R...      8    1.04s   58.4%   130ms    456MiB   80.4%  56.9MiB
           Influenc...      8    812ms   45.7%   101ms    264MiB   46.6%  33.1MiB
             Multiply       8    740ms   41.6%  92.4ms    156MiB   27.6%  19.6MiB
             Alloca...      8   54.9ms    3.1%  6.87ms    108MiB   19.0%  13.5MiB
             Set Ma...      8   17.4ms    1.0%  2.18ms     0.00B    0.0%    0.00B
           Column M...      8    117ms    6.6%  14.6ms   95.4MiB   16.8%  11.9MiB
           Allocation       8   92.7ms    5.2%  11.6ms   95.4MiB   16.8%  11.9MiB
           Set Matrix       8   16.8ms    0.9%  2.10ms    111KiB    0.0%  13.9KiB
           Vectors          8    244μs    0.0%  30.5μs    272KiB    0.0%  34.0KiB
           Bounds           8   6.30μs    0.0%   788ns     0.00B    0.0%    0.00B
       DiffZonotope...      5    689ms   38.8%   138ms   62.3MiB   11.0%  12.5MiB
         Zonotope_D...     10    689ms   38.8%  68.9ms   62.3MiB   11.0%  6.23MiB
     Property Check         1   7.37ms    0.4%  7.37ms    820KiB    0.1%   820KiB
 Initialize                 1   22.8ms    1.3%  22.8ms   27.0MiB    4.8%  27.0MiB
 ────────────────────────────────────────────────────────────────────────────────
[VERYDIFF_TIMER] 1.865735798

[VERYDIFF_EXPERIMENT] NETWORK: /home/i57/steuber/NeuroDiff/repos/VeryDiffExperiments/src/../benchmarks/mnist-prune/specs/mnist_40_global_3.vnnlib
[VERYDIFF_EXPERIMENT] TIME: 123.405632456
