
[VERYDIFF_EXPERIMENT] Running on /home/i57/steuber/NeuroDiff/repos/VeryDiffExperiments/src/../benchmarks/mnist-prune/specs/mnist_83_global_3.vnnlib /home/i57/steuber/NeuroDiff/repos/VeryDiffExperiments/src/../benchmarks/mnist-prune/nets/mnist_relu_2_512.onnx
Loading /home/i57/steuber/NeuroDiff/repos/VeryDiffExperiments/src/../benchmarks/mnist-prune/nets/mnist_relu_2_512.onnx and /home/i57/steuber/NeuroDiff/repos/VeryDiffExperiments/src/../benchmarks/mnist-prune/nets_pruned/mnist_relu_2_512_0.79-old.onnx
INPUT SHAPE: 784
UNKNOWN
TIMEOUT
Refined: 23 | Refine Limit: 19 | Wrong: 0 | Right: 2 | Total: 2 | Total Zonos Considered: 25 | Expected 1048575 (0.00019073504518036383%)

time: 121.020701114

[VERYDIFF_TIMER] 121.044376245

[VERYDIFF_EXPERIMENT] NETWORK: /home/i57/steuber/NeuroDiff/repos/VeryDiffExperiments/src/../benchmarks/mnist-prune/specs/mnist_83_global_3.vnnlib
[VERYDIFF_EXPERIMENT] TIME: 121.33075214
