
[VERYDIFF_EXPERIMENT] Running on /home/i57/steuber/NeuroDiff/repos/VeryDiffExperiments/src/../benchmarks/mnist-prune/specs/mnist_0_global_4.vnnlib /home/i57/steuber/NeuroDiff/repos/VeryDiffExperiments/src/../benchmarks/mnist-prune/nets/mnist_relu_2_512.onnx
Parsing /home/i57/steuber/NeuroDiff/repos/VeryDiffExperiments/src/../benchmarks/mnist-prune/nets/mnist_relu_2_512.onnx...
Found input X
op: matmul, weight: (512, 784), bias: nothing
op: bias, weight: nothing, bias: (512,)
op: relu, weight: nothing, bias: nothing
op: matmul, weight: (512, 512), bias: nothing
op: bias, weight: nothing, bias: (512,)
op: relu, weight: nothing, bias: nothing
op: matmul, weight: (10, 512), bias: nothing
op: bias, weight: nothing, bias: (10,)
Parsing /home/i57/steuber/NeuroDiff/repos/VeryDiffExperiments/src/../benchmarks/mnist-prune/nets_pruned/mnist_relu_2_512_pruned5.onnx...
Found input X
op: matmul, weight: (512, 784), bias: nothing
op: bias, weight: nothing, bias: (512,)
op: relu, weight: nothing, bias: nothing
op: matmul, weight: (512, 512), bias: nothing
op: bias, weight: nothing, bias: (512,)
op: relu, weight: nothing, bias: nothing
op: matmul, weight: (10, 512), bias: nothing
op: bias, weight: nothing, bias: (10,)
Distance: 1085.5985166831802
Distance: 1719.8468985003963
Distance: 31.228482716001736
Running with 1 threads
[Thread 1] Time to first task: 0.02s
Instable Generators: 137
Instable Generators: 213
Zono Bounds:
[-13.683942060439094, -9.479316081812328, -10.059077637821968, -10.325566657491102, -12.815054342575845, -15.423902896320978, -15.370212309151064, -2.0793989078076507, -10.233446155165936, -9.689659420135253]
[5.792250449925949, 11.118412358572314, 5.659360595275876, 6.803257310984442, 5.75870921647892, 0.8962638630936786, 4.265381455034382, 13.521090617091982, 5.292272933582806, 5.847985143972891]
[Thread 1] Total splits: 0
Processed 1 zonotopes (Work Done: 100.0%); Generated 0 (0.72897102s/loop)
[Thread 1] Finished in 0.73s
 ────────────────────────────────────────────────────────────────────────────────
                                        Time                    Allocations      
                               ───────────────────────   ────────────────────────
       Tot / % measured:            731ms / 100.0%            254MiB / 100.0%    

 Section               ncalls     time    %tot     avg     alloc    %tot      avg
 ────────────────────────────────────────────────────────────────────────────────
 Verify                     1    729ms   99.7%   729ms    244MiB   96.1%   244MiB
   Zonotope Loop            1    729ms   99.7%   729ms    244MiB   96.1%   244MiB
     Property Check         1    447ms   61.1%   447ms    103MiB   40.5%   103MiB
     Zonotope Propa...      1    262ms   35.8%   262ms    121MiB   47.8%   121MiB
       DiffZonotope...      2    146ms   20.0%  73.1ms    100MiB   39.3%  49.8MiB
         Zonotope_R...      4    129ms   17.7%  32.4ms   87.0MiB   34.3%  21.7MiB
           Influenc...      4    116ms   15.9%  29.0ms   54.5MiB   21.5%  13.6MiB
             Multiply       4    101ms   13.8%  25.3ms   29.6MiB   11.7%  7.41MiB
             Alloca...      4   11.5ms    1.6%  2.87ms   24.8MiB    9.8%  6.20MiB
             Set Ma...      4   3.26ms    0.4%   814μs     0.00B    0.0%    0.00B
           Column M...      4   8.57ms    1.2%  2.14ms   16.2MiB    6.4%  4.05MiB
           Allocation       4   2.62ms    0.4%   655μs   16.2MiB    6.4%  4.05MiB
           Set Matrix       4   2.08ms    0.3%   519μs   20.6KiB    0.0%  5.14KiB
           Vectors          4   90.8μs    0.0%  22.7μs    100KiB    0.0%  25.0KiB
           Bounds           4   2.87μs    0.0%   716ns     0.00B    0.0%    0.00B
       DiffZonotope...      3    115ms   15.8%  38.5ms   21.5MiB    8.5%  7.16MiB
         Zonotope_D...      6   57.0ms    7.8%  9.51ms   13.6MiB    5.3%  2.26MiB
 Initialize                 1   2.48ms    0.3%  2.48ms   9.84MiB    3.9%  9.84MiB
 ────────────────────────────────────────────────────────────────────────────────
[VERYDIFF_TIMER] 0.762697236

[VERYDIFF_EXPERIMENT] Running on /home/i57/steuber/NeuroDiff/repos/VeryDiffExperiments/src/../benchmarks/mnist-prune/specs/mnist_0_global_4.vnnlib /home/i57/steuber/NeuroDiff/repos/VeryDiffExperiments/src/../benchmarks/mnist-prune/nets/mnist_relu_3_100.onnx
Parsing /home/i57/steuber/NeuroDiff/repos/VeryDiffExperiments/src/../benchmarks/mnist-prune/nets/mnist_relu_3_100.onnx...
Found input X
op: matmul, weight: (100, 784), bias: nothing
op: bias, weight: nothing, bias: (100,)
op: relu, weight: nothing, bias: nothing
op: matmul, weight: (100, 100), bias: nothing
op: bias, weight: nothing, bias: (100,)
op: relu, weight: nothing, bias: nothing
op: matmul, weight: (10, 100), bias: nothing
op: bias, weight: nothing, bias: (10,)
op: relu, weight: nothing, bias: nothing
op: matmul, weight: (10, 10), bias: nothing
op: bias, weight: nothing, bias: (10,)
Parsing /home/i57/steuber/NeuroDiff/repos/VeryDiffExperiments/src/../benchmarks/mnist-prune/nets_pruned/mnist_relu_3_100_pruned5.onnx...
Found input X
op: matmul, weight: (100, 784), bias: nothing
op: bias, weight: nothing, bias: (100,)
op: relu, weight: nothing, bias: nothing
op: matmul, weight: (100, 100), bias: nothing
op: bias, weight: nothing, bias: (100,)
op: relu, weight: nothing, bias: nothing
op: matmul, weight: (10, 100), bias: nothing
op: bias, weight: nothing, bias: (10,)
op: relu, weight: nothing, bias: nothing
op: matmul, weight: (10, 10), bias: nothing
op: bias, weight: nothing, bias: (10,)
Distance: 296.6600370998244
Distance: 77.24290861755458
Distance: 5.7170369567975285
Distance: 0.0
Running with 1 threads
[Thread 1] Time to first task: 0.0s
Instable Generators: 32
Instable Generators: 30
Instable Generators: 2
Zono Bounds:
[0.0, -0.5281302268449009, -0.5269873870151965, -0.0373182700119668, 0.0, -1.3173724167217598, 0.0, 0.25060374180963896, -0.0527959362585919, -0.2259500591600222]
[0.0, 0.5281302268449009, 0.3131722048646138, 0.8672682801386227, 0.0, 0.33192423430503465, 0.0, 1.3553612427475141, 0.05351659598899959, 0.6719861126536205]
[Thread 1] Total splits: 0
Processed 1 zonotopes (Work Done: 100.0%); Generated 0 (0.168463169s/loop)
[Thread 1] Finished in 0.17s
 ────────────────────────────────────────────────────────────────────────────────
                                        Time                    Allocations      
                               ───────────────────────   ────────────────────────
       Tot / % measured:            169ms / 100.0%            150MiB / 100.0%    

 Section               ncalls     time    %tot     avg     alloc    %tot      avg
 ────────────────────────────────────────────────────────────────────────────────
 Verify                     1    168ms   99.7%   168ms    145MiB   96.4%   145MiB
   Zonotope Loop            1    168ms   99.7%   168ms    145MiB   96.4%   145MiB
     Property Check         1   97.6ms   57.7%  97.6ms   53.1MiB   35.3%  53.1MiB
     Zonotope Propa...      1   67.6ms   40.0%  67.6ms   72.0MiB   47.9%  72.0MiB
       DiffZonotope...      3   45.8ms   27.1%  15.3ms   67.9MiB   45.1%  22.6MiB
         Zonotope_R...      6   44.7ms   26.4%  7.44ms   66.3MiB   44.1%  11.1MiB
           Influenc...      6   43.5ms   25.7%  7.24ms   60.9MiB   40.5%  10.2MiB
             Multiply       6   25.4ms   15.0%  4.24ms   30.9MiB   20.5%  5.15MiB
             Alloca...      6   14.0ms    8.3%  2.33ms   30.1MiB   20.0%  5.01MiB
             Set Ma...      6   4.03ms    2.4%   672μs     0.00B    0.0%    0.00B
           Column M...      6    708μs    0.4%   118μs   2.67MiB    1.8%   456KiB
           Set Matrix       6    301μs    0.2%  50.1μs   4.92KiB    0.0%     840B
           Allocation       6    132μs    0.1%  22.0μs   2.67MiB    1.8%   456KiB
           Vectors          6   28.8μs    0.0%  4.80μs   19.5KiB    0.0%  3.26KiB
           Bounds           6   4.00μs    0.0%   666ns     0.00B    0.0%    0.00B
       DiffZonotope...      4   21.7ms   12.9%  5.44ms   4.13MiB    2.7%  1.03MiB
         Zonotope_D...      8   8.59ms    5.1%  1.07ms   2.71MiB    1.8%   347KiB
 Initialize                 1    529μs    0.3%   529μs   5.41MiB    3.6%  5.41MiB
 ────────────────────────────────────────────────────────────────────────────────
[VERYDIFF_TIMER] 0.193990841

[VERYDIFF_EXPERIMENT] NETWORK: /home/i57/steuber/NeuroDiff/repos/VeryDiffExperiments/src/../benchmarks/mnist-prune/specs/mnist_0_global_4.vnnlib
[VERYDIFF_EXPERIMENT] TIME: 1.58001361
