
[VERYDIFF_EXPERIMENT] Running on /home/i57/steuber/NeuroDiff/repos/VeryDiffExperiments/src/../benchmarks/mnist-prune/specs/mnist_52_global_3.vnnlib /home/i57/steuber/NeuroDiff/repos/VeryDiffExperiments/src/../benchmarks/mnist-prune/nets/mnist_relu_2_512.onnx
Found input X
op: matmul, weight: (512, 784), bias: nothing
op: bias, weight: nothing, bias: (512,)
op: relu, weight: nothing, bias: nothing
op: matmul, weight: (512, 512), bias: nothing
op: bias, weight: nothing, bias: (512,)
op: relu, weight: nothing, bias: nothing
op: matmul, weight: (10, 512), bias: nothing
op: bias, weight: nothing, bias: (10,)
Found input X
op: matmul, weight: (512, 784), bias: nothing
op: bias, weight: nothing, bias: (512,)
op: relu, weight: nothing, bias: nothing
op: matmul, weight: (512, 512), bias: nothing
op: bias, weight: nothing, bias: (512,)
op: relu, weight: nothing, bias: nothing
op: matmul, weight: (10, 512), bias: nothing
op: bias, weight: nothing, bias: (10,)
Distance: 1085.5985166831802
Distance: 1719.8468985003963
Distance: 31.228482716001736
Running with 1 threads
[Thread 1] Time to first task: 0.01s
Zono Bounds:
[0.0, 0.0, 0.0, 0.0, 0.0, 0.0, 0.0, 0.0, 0.0, 0.0, 0.0, 0.0, 0.0, 0.0, 0.0, 0.0, 0.0, 0.0, 0.0, 0.0, 0.0, 0.0, 0.0, 0.0, 0.0, 0.0, 0.0, 0.0, 0.0, 0.0, 0.0, 0.0, 0.0, 0.0, 0.0, 0.0, 0.0, 0.0, 0.0, 0.0, 0.0, 0.0, 0.0, 0.0, 0.0, 0.0, 0.0, 0.0, 0.0, 0.0, 0.0, 0.0, 0.0, 0.0, 0.0, 0.0, 0.0, 0.0, 0.0, 0.0, 0.0, 0.0, 0.0, 0.0, 0.0, 0.0, 0.0, 0.0, 0.0, 0.0, 0.0, 0.0, 0.0, 0.0, 0.0, 0.0, 0.0, 0.0, 0.0, 0.0, 0.0, 0.0, 0.0, 0.0, 0.0, 0.0, 0.0, 0.0, 0.0, 0.0, 0.0, 0.0, 0.0, 0.0, 0.0, 0.0, 0.0, 0.0, 0.0, 0.0, 0.0, 0.0, 0.0, 0.0, 0.0, 0.0, 0.0, 0.0, 0.0, 0.0, 0.0, 0.0, 0.0, 0.0, 0.0, 0.0, 0.0, 0.0, 0.0, 0.0, 0.0, 0.0, 0.0, 0.0, 0.0, 0.0, 0.0, 0.0, 0.0, 0.0, 0.0, 0.0, 0.0, 0.0, 0.0, 0.0, 0.0, 0.0, 0.0, 0.0, 0.0, 0.0, 0.0, 0.0, 0.0, 0.0, 0.0, 0.0, 0.0, 0.0, 0.0, 0.0, 0.0, 0.0, 0.0, 0.0, 0.0, 0.0, 0.0, 0.0, 0.0, 0.0, 0.0, 0.0, 0.0, 0.0, 0.0, 0.0, 0.0, 0.0, 0.0, 0.0, 0.0, 0.0, 0.0, 0.0, 0.0, 0.0, 0.0, 0.0, 0.0, 0.0, 0.0, 0.0, 0.0, 0.0, 0.0, 0.0, 0.0, 0.0, 0.0, 0.0, 0.0, 0.0, 0.0, 0.0, 0.0, 0.0, 0.0, 0.0, 0.0, 0.0, 0.0, 0.0, 0.0, 0.0, 0.0, 0.0, 0.0, 0.0, 0.0, 0.0, 0.0, 0.0, 0.0, 0.0, 0.0, 0.0, 0.0, 0.0, 0.0, 0.0, 0.0, 0.0, 0.0, 0.0, 0.0, 0.0, 0.0, 0.0, 0.0, 0.0, 0.0, 0.0, 0.0, 0.0, 0.0, 0.0, 0.0, 0.0, 0.0, 0.0, 0.0, 0.0, 0.0, 0.0, 0.0, 0.0, 0.0, 0.0, 0.0, 0.0, 0.0, 0.0, 0.0, 0.0, 0.0, 0.0, 0.0, 0.0, 0.0, 0.0, 0.0, 0.0, 0.0, 0.0, 0.0, 0.0, 0.0, 0.0, 0.0, 0.0, 0.0, 0.0, 0.0, 0.0, 0.0, 0.0, 0.0, 0.0, 0.0, 0.0, 0.0, 0.0, 0.0, 0.0, 0.0, 0.0, 0.0, 0.0, 0.0, 0.0, 0.0, 0.0, 0.0, 0.0, 0.0, 0.0, 0.0, 0.0, 0.0, 0.0, 0.0, 0.0, 0.0, 0.0, 0.0, 0.0, 0.0, 0.0, 0.0, 0.0, 0.0, 0.0, 0.0, 0.0, 0.0, 0.0, 0.0, 0.0, 0.0, 0.0, 0.0, 0.0, 0.0, 0.0, 0.0, 0.0, 0.0, 0.0, 0.0, 0.0, 0.0, 0.0, 0.0, 0.0, 0.0, 0.0, 0.0, 0.0, 0.0, 0.0, 0.0, 0.0, 0.0, 0.0, 0.0, 0.0, 0.0, 0.0, 0.0, 0.0, 0.0, 0.0, 0.0, 0.0, 0.0, 0.0, 0.0, 0.0, 0.0, 0.0, 0.0, 0.0, 0.0, 0.0, 0.0, 0.0, 0.0, 0.0, 0.0, 0.0, 0.0, 0.0, 0.0, 0.0, 0.0, 0.0, 0.0, 0.0, 0.0, 0.0, 0.0, 0.0, 0.0, 0.0, 0.0, 0.0, 0.0, 0.0, 0.0, 0.0, 0.0, 0.0, 0.0, 0.0, 0.0, 0.0, 0.0, 0.0, 0.0, 0.0, 0.0, 0.0, 0.0, 0.0, 0.0, 0.0, 0.0, 0.0, 0.0, 0.0, 0.0, 0.0, 0.0, 0.0, 0.0, 0.0, 0.0, 0.0, 0.0, 0.0, 0.0, 0.0, 0.0, 0.0, 0.0, 0.0, 0.0, 0.0, 0.0, 0.0, 0.0, 0.0, 0.0, 0.0, 0.0, 0.0, 0.0, 0.0, 0.0, 0.0, 0.0, 0.0, 0.0, 0.0, 0.0, 0.0, 0.0, 0.0, 0.0, 0.0, 0.0, 0.0, 0.0, 0.0, 0.0, 0.0, 0.0, 0.0, 0.0, 0.0, 0.0, 0.0, 0.0, 0.0, 0.0, 0.0, 0.0, 0.0, 0.0, 0.0, 0.0, 0.0, 0.0, 0.0, 0.0, 0.0, 0.0, 0.0, 0.0, 0.0, 0.0, 0.0, 0.0, 0.0, 0.0, 0.0, 0.0, 0.0, 0.0, 0.0, 0.0, 0.0, 0.0, 0.0, 0.0, 0.0, 0.0, 0.0, 0.0, 0.0, 0.0, 0.0, 0.0, 0.0, 0.0, 0.0, 0.0, 0.0, 0.0, 0.0, 0.0, 0.0, 0.0, 0.0, 0.0, 0.0, 0.0, 0.0, 0.0, 0.0, 0.0, 0.0, 0.0, 0.0, 0.0, 0.0, 0.0, 0.0, 0.0, 0.0, 0.0, 0.0, 0.0, 0.0, 0.0, 0.0, 0.0, 0.0, 0.0, 0.0, 0.0, 0.0, 0.0, 0.0, 0.0, 0.0, 0.0, 0.0, 0.0, 0.0, 0.0, 0.0, 0.0, 0.0, 0.0, 0.0, 0.0, 0.0, 0.0, 0.0, 0.0, 0.0, 0.0, 0.0, 0.0, 0.0, 0.0, 0.0, 0.0, 0.0, 0.0, 0.0, 0.0, 0.0, 0.0, 0.0, 0.0, 0.0, 0.0, 0.0, 0.0, 0.0, 0.0, 0.0, 0.0, 0.0, 0.0, 0.0, 0.0, 0.0, 0.0, 0.0, 0.0, 0.0, 0.0, 0.0, 0.0, 0.0, 0.0, 0.0, 0.0, 0.0, 0.0, 0.0, 0.0, 0.0, 0.0, 0.0, 0.0, 0.0, 0.0, 0.0, 0.0, 0.0, 0.0, 0.0, 0.0, 0.0, 0.0, 0.0, 0.0, 0.0, 0.0, 0.0, 0.0, 0.0, 0.0, 0.0, 0.0, 0.0, 0.0, 0.0, 0.0, 0.0, 0.0, 0.0, 0.0, 0.0, 0.0, 0.0, 0.0, 0.0, 0.0, 0.0, 0.0, 0.0, 0.0, 0.0, 0.0, 0.0, 0.0, 0.0, 0.0, 0.0, 0.0, 0.0, 0.0, 0.0, 0.0, 0.0, 0.0, 0.0, 0.0, 0.0, 0.0, 0.0, 0.0, 0.0, 0.0, 0.0, 0.0, 0.0, 0.0, 0.0, 0.0, 0.0, 0.0, 0.0, 0.0, 0.0, 0.0, 0.0, 0.0, 0.0, 0.0, 0.0, 0.0, 0.0, 0.0, 0.0, 0.0, 0.0, 0.0, 0.0, 0.0, 0.0, 0.0, 0.0, 0.0, 0.0, 0.0, 0.0, 0.0, 0.0, 0.0, 0.0, 0.0, 0.0, 0.0, 0.0, 0.0, 0.0, 0.0, 0.0, 0.0, 0.0, 0.0, 0.0, 0.0, 0.0, 0.0, 0.0, 0.0, 0.0, 0.0, 0.0, 0.0, 0.0, 0.0, 0.0, 0.0, 0.0, 0.0, 0.0, 0.0, 0.0, 0.0, 0.0, 0.0, 0.0, 0.0, 0.0, 0.0, 0.0, 0.0, 0.0, 0.0, 0.0, 0.0, 0.0, 0.0, 0.0, 0.0, 0.0, 0.0, 0.0, 0.0, 0.0, 0.0, 0.0, 0.0, 0.0, 0.0, 0.0, 0.0, 0.0, 0.0, 0.0, 0.0, 0.0, 0.0, 0.0, 0.0, 0.0, 0.0, 0.0, 0.0, 0.0, 0.0, 0.0, 0.0, 0.0]
[0.0, 0.0, 0.0, 0.0, 0.0, 0.0, 0.0, 0.0, 0.0, 0.0, 0.0, 0.0, 0.0, 0.0, 0.0, 0.0, 0.0, 0.0, 0.0, 0.0, 0.0, 0.0, 0.0, 0.0, 0.0, 0.0, 0.0, 0.0, 0.0, 0.0, 0.0, 0.0, 0.0, 0.0, 0.0, 0.0, 0.0, 0.0, 0.0, 0.0, 0.0, 0.0, 0.0, 0.0, 0.0, 0.0, 0.0, 0.0, 0.0, 0.0, 0.0, 0.0, 0.0, 0.0, 0.0, 0.0, 0.0, 0.0, 0.0, 0.0, 0.0, 0.0, 0.0, 0.0, 0.0, 0.0, 0.0, 0.0, 0.0, 0.0, 0.0, 0.0, 0.0, 0.0, 0.0, 0.0, 0.0, 0.0, 0.0, 0.0, 0.0, 0.0, 0.0, 0.0, 0.0, 0.0, 0.0, 0.0, 0.0, 0.0, 0.0, 0.0, 0.0, 0.0, 0.0, 0.0, 0.0, 0.0, 0.0, 0.0, 0.0, 0.0, 0.0, 0.0, 0.0, 0.0, 0.0, 0.0, 0.0, 0.0, 0.0, 0.0, 0.0, 0.0, 0.0, 0.0, 0.0, 0.0, 0.0, 0.0, 0.0, 0.0, 0.0, 0.0, 0.0, 0.0, 0.0, 0.0, 0.0, 0.0, 0.0, 0.0, 0.0, 0.0, 0.0, 0.0, 0.0, 0.0, 0.0, 0.0, 0.0, 0.0, 0.0, 0.0, 0.0, 0.0, 0.0, 0.0, 0.0, 0.0, 0.0, 0.0, 0.0, 0.0, 0.0, 0.0, 0.0, 0.0, 0.0, 0.0, 0.0, 0.0, 0.0, 0.0, 0.0, 0.0, 0.0, 0.0, 0.0, 0.0, 0.0, 0.0, 0.0, 0.0, 0.0, 0.0, 0.0, 0.0, 0.0, 0.0, 0.0, 0.0, 0.0, 0.0, 0.0, 0.0, 0.0, 0.0, 0.0, 0.0, 0.0, 0.0, 0.0, 0.0, 0.0, 0.0, 0.0, 0.0, 0.0, 0.0, 0.0, 0.0, 0.0, 0.0, 0.0, 0.0, 0.0, 0.0, 0.0, 0.0, 0.0, 0.0, 0.0, 0.0, 0.0, 0.0, 0.0, 0.0, 0.0, 0.0, 0.0, 0.0, 0.0, 0.0, 0.0, 0.0, 0.0, 0.0, 0.0, 0.0, 0.0, 0.0, 0.0, 0.0, 0.0, 0.0, 0.0, 0.0, 0.0, 0.0, 0.0, 0.0, 0.0, 0.0, 0.0, 0.0, 0.0, 0.0, 0.0, 0.0, 0.0, 0.0, 0.0, 0.0, 0.0, 0.0, 0.0, 0.0, 0.0, 0.0, 0.0, 0.0, 0.0, 0.0, 0.0, 0.0, 0.0, 0.0, 0.0, 0.0, 0.0, 0.0, 0.0, 0.0, 0.0, 0.0, 0.0, 0.0, 0.0, 0.0, 0.0, 0.0, 0.0, 0.0, 0.0, 0.0, 0.0, 0.0, 0.0, 0.0, 0.0, 0.0, 0.0, 0.0, 0.0, 0.0, 0.0, 0.0, 0.0, 0.0, 0.0, 0.0, 0.0, 0.0, 0.0, 0.0, 0.0, 0.0, 0.0, 0.0, 0.0, 0.0, 0.0, 0.0, 0.0, 0.0, 0.0, 0.0, 0.0, 0.0, 0.0, 0.0, 0.0, 0.0, 0.0, 0.0, 0.0, 0.0, 0.0, 0.0, 0.0, 0.0, 0.0, 0.0, 0.0, 0.0, 0.0, 0.0, 0.0, 0.0, 0.0, 0.0, 0.0, 0.0, 0.0, 0.0, 0.0, 0.0, 0.0, 0.0, 0.0, 0.0, 0.0, 0.0, 0.0, 0.0, 0.0, 0.0, 0.0, 0.0, 0.0, 0.0, 0.0, 0.0, 0.0, 0.0, 0.0, 0.0, 0.0, 0.0, 0.0, 0.0, 0.0, 0.0, 0.0, 0.0, 0.0, 0.0, 0.0, 0.0, 0.0, 0.0, 0.0, 0.0, 0.0, 0.0, 0.0, 0.0, 0.0, 0.0, 0.0, 0.0, 0.0, 0.0, 0.0, 0.0, 0.0, 0.0, 0.0, 0.0, 0.0, 0.0, 0.0, 0.0, 0.0, 0.0, 0.0, 0.0, 0.0, 0.0, 0.0, 0.0, 0.0, 0.0, 0.0, 0.0, 0.0, 0.0, 0.0, 0.0, 0.0, 0.0, 0.0, 0.0, 0.0, 0.0, 0.0, 0.0, 0.0, 0.0, 0.0, 0.0, 0.0, 0.0, 0.0, 0.0, 0.0, 0.0, 0.0, 0.0, 0.0, 0.0, 0.0, 0.0, 0.0, 0.0, 0.0, 0.0, 0.0, 0.0, 0.0, 0.0, 0.0, 0.0, 0.0, 0.0, 0.0, 0.0, 0.0, 0.0, 0.0, 0.0, 0.0, 0.0, 0.0, 0.0, 0.0, 0.0, 0.0, 0.0, 0.0, 0.0, 0.0, 0.0, 0.0, 0.0, 0.0, 0.0, 0.0, 0.0, 0.0, 0.0, 0.0, 0.0, 0.0, 0.0, 0.0, 0.0, 0.0, 0.0, 0.0, 0.0, 0.0, 0.0, 0.0, 0.0, 0.0, 0.0, 0.0, 0.0, 0.0, 0.0, 0.0, 0.0, 0.0, 0.0, 0.0, 0.0, 0.0, 0.0, 0.0, 0.0, 0.0, 0.0, 0.0, 0.0, 0.0, 0.0, 0.0, 0.0, 0.0, 0.0, 0.0, 0.0, 0.0, 0.0, 0.0, 0.0, 0.0, 0.0, 0.0, 0.0, 0.0, 0.0, 0.0, 0.0, 0.0, 0.0, 0.0, 0.0, 0.0, 0.0, 0.0, 0.0, 0.0, 0.0, 0.0, 0.0, 0.0, 0.0, 0.0, 0.0, 0.0, 0.0, 0.0, 0.0, 0.0, 0.0, 0.0, 0.0, 0.0, 0.0, 0.0, 0.0, 0.0, 0.0, 0.0, 0.0, 0.0, 0.0, 0.0, 0.0, 0.0, 0.0, 0.0, 0.0, 0.0, 0.0, 0.0, 0.0, 0.0, 0.0, 0.0, 0.0, 0.0, 0.0, 0.0, 0.0, 0.0, 0.0, 0.0, 0.0, 0.0, 0.0, 0.0, 0.0, 0.0, 0.0, 0.0, 0.0, 0.0, 0.0, 0.0, 0.0, 0.0, 0.0, 0.0, 0.0, 0.0, 0.0, 0.0, 0.0, 0.0, 0.0, 0.0, 0.0, 0.0, 0.0, 0.0, 0.0, 0.0, 0.0, 0.0, 0.0, 0.0, 0.0, 0.0, 0.0, 0.0, 0.0, 0.0, 0.0, 0.0, 0.0, 0.0, 0.0, 0.0, 0.0, 0.0, 0.0, 0.0, 0.0, 0.0, 0.0, 0.0, 0.0, 0.0, 0.0, 0.0, 0.0, 0.0, 0.0, 0.0, 0.0, 0.0, 0.0, 0.0, 0.0, 0.0, 0.0, 0.0, 0.0, 0.0, 0.0, 0.0, 0.0, 0.0, 0.0, 0.0, 0.0, 0.0, 0.0, 0.0, 0.0, 0.0, 0.0, 0.0, 0.0, 0.0, 0.0, 0.0, 0.0, 0.0, 0.0, 0.0, 0.0, 0.0, 0.0, 0.0, 0.0, 0.0, 0.0, 0.0, 0.0, 0.0, 0.0, 0.0, 0.0, 0.0, 0.0, 0.0, 0.0, 0.0, 0.0, 0.0, 0.0, 0.0, 0.0, 0.0, 0.0, 0.0, 0.0, 0.0, 0.0, 0.0, 0.0, 0.0, 0.0, 0.0, 0.0, 0.0, 0.0, 0.0, 0.0, 0.0, 0.0, 0.0, 0.0, 0.0, 0.0, 0.0, 0.0, 0.0, 0.0, 0.0, 0.0, 0.0, 0.0, 0.0, 0.0, 0.0, 0.0, 0.0, 0.0, 0.0, 0.0, 0.0, 0.0, 0.0, 0.0, 0.0, 0.0, 0.0, 0.0, 0.0, 0.0, 0.0, 0.0, 0.0, 0.0, 0.0, 0.0, 0.0, 0.0, 0.0, 0.0, 0.0, 0.0, 0.0, 0.0, 0.0, 0.0, 0.0, 0.0, 0.0, 0.0, 0.0, 0.0, 0.0, 0.0, 0.0, 0.0, 0.0, 0.0]

Found counterexample: ([0.005882355, 0.005882355, 0.005882355, 0.005882355, 0.005882355, 0.005882355, 0.005882355, 0.005882355, 0.005882355, 0.005882355, 0.005882355, 0.005882355, 0.005882355, 0.005882355, 0.005882355, 0.005882355, 0.005882355, 0.005882355, 0.005882355, 0.005882355, 0.005882355, 0.005882355, 0.005882355, 0.005882355, 0.005882355, 0.005882355, 0.005882355, 0.005882355, 0.005882355, 0.005882355, 0.005882355, 0.005882355, 0.005882355, 0.005882355, 0.005882355, 0.005882355, 0.005882355, 0.005882355, 0.005882355, 0.005882355, 0.005882355, 0.005882355, 0.005882355, 0.005882355, 0.005882355, 0.005882355, 0.005882355, 0.005882355, 0.005882355, 0.005882355, 0.005882355, 0.005882355, 0.005882355, 0.005882355, 0.005882355, 0.005882355, 0.005882355, 0.005882355, 0.005882355, 0.005882355, 0.005882355, 0.005882355, 0.005882355, 0.005882355, 0.005882355, 0.005882355, 0.005882355, 0.005882355, 0.005882355, 0.005882355, 0.005882355, 0.005882355, 0.005882355, 0.005882355, 0.005882355, 0.005882355, 0.005882355, 0.005882355, 0.005882355, 0.005882355, 0.005882355, 0.005882355, 0.005882355, 0.005882355, 0.005882355, 0.005882355, 0.005882355, 0.005882355, 0.005882355, 0.005882355, 0.005882355, 0.005882355, 0.005882355, 0.005882355, 0.005882355, 0.005882355, 0.005882355, 0.005882355, 0.005882355, 0.005882355, 0.005882355, 0.005882355, 0.005882355, 0.005882355, 0.005882355, 0.005882355, 0.005882355, 0.005882355, 0.005882355, 0.005882355, 0.005882355, 0.005882355, 0.005882355, 0.005882355, 0.005882355, 0.005882355, 0.005882355, 0.005882355, 0.005882355, 0.005882355, 0.005882355, 0.005882355, 0.005882355, 0.005882355, 0.005882355, 0.005882355, 0.005882355, 0.005882355, 0.005882355, 0.005882355, 0.005882355, 0.005882355, 0.005882355, 0.005882355, 0.005882355, 0.005882355, 0.005882355, 0.005882355, 0.005882355, 0.005882355, 0.005882355, 0.005882355, 0.005882355, 0.005882355, 0.005882355, 0.005882355, 0.005882355, 0.005882355, 0.005882355, 0.005882355, 0.005882355, 0.005882355, 0.005882355, 0.005882355, 0.005882355, 0.005882355, 0.005882355, 0.005882355, 0.005882355, 0.005882355, 0.005882355, 0.005882355, 0.005882355, 0.035294115, 0.301960795, 0.196078435, 0.005882355, 0.005882355, 0.005882355, 0.005882355, 0.005882355, 0.005882355, 0.005882355, 0.005882355, 0.005882355, 0.005882355, 0.005882355, 0.005882355, 0.005882355, 0.005882355, 0.005882355, 0.005882355, 0.005882355, 0.005882355, 0.005882355, 0.005882355, 0.00980392, 0.24705883, 0.466666665, 0.670588255, 0.9490196150000001, 0.9529411750000001, 0.7921568750000001, 0.384313735, 0.005882355, 0.005882355, 0.005882355, 0.005882355, 0.005882355, 0.005882355, 0.005882355, 0.005882355, 0.005882355, 0.005882355, 0.005882355, 0.005882355, 0.005882355, 0.005882355, 0.005882355, 0.192156865, 0.082352945, 0.005882355, 0.094117645, 0.466666665, 0.800000015, 0.992156865, 0.994117645, 0.8901960849999999, 0.5019608, 0.41960784500000003, 0.027450984999999997, 0.005882355, 0.005882355, 0.005882355, 0.005882355, 0.005882355, 0.005882355, 0.005882355, 0.005882355, 0.005882355, 0.005882355, 0.005882355, 0.005882355, 0.005882355, 0.005882355, 0.11764706, 0.7333333449999999, 0.992156865, 0.9098039250000001, 0.843137265, 0.9176470649999999, 0.992156865, 0.9450980449999999, 0.623529435, 0.290196095, 0.070588235, 0.005882355, 0.005882355, 0.005882355, 0.005882355, 0.005882355, 0.005882355, 0.005882355, 0.005882355, 0.005882355, 0.005882355, 0.005882355, 0.005882355, 0.005882355, 0.005882355, 0.005882355, 0.005882355, 0.070588235, 0.850980405, 0.992156865, 0.992156865, 0.992156865, 0.984313725, 0.866666675, 0.411764715, 0.13333334, 0.005882355, 0.005882355, 0.005882355, 0.005882355, 0.005882355, 0.005882355, 0.005882355, 0.005882355, 0.005882355, 0.005882355, 0.005882355, 0.005882355, 0.005882355, 0.005882355, 0.005882355, 0.005882355, 0.005882355, 0.005882355, 0.070588235, 0.78039217, 0.992156865, 0.992156865, 0.976470585, 0.6352941350000001, 0.258823535, 0.005882355, 0.005882355, 0.005882355, 0.005882355, 0.005882355, 0.005882355, 0.005882355, 0.005882355, 0.005882355, 0.005882355, 0.005882355, 0.005882355, 0.005882355, 0.005882355, 0.005882355, 0.005882355, 0.005882355, 0.005882355, 0.005882355, 0.005882355, 0.005882355, 0.7333333449999999, 0.992156865, 0.992156865, 0.768627465, 0.12156863, 0.005882355, 0.005882355, 0.005882355, 0.005882355, 0.005882355, 0.005882355, 0.005882355, 0.005882355, 0.005882355, 0.005882355, 0.005882355, 0.005882355, 0.005882355, 0.005882355, 0.005882355, 0.005882355, 0.005882355, 0.005882355, 0.005882355, 0.005882355, 0.005882355, 0.005882355, 0.223529415, 0.941176475, 0.992156865, 0.639215705, 0.00980392, 0.005882355, 0.005882355, 0.005882355, 0.005882355, 0.005882355, 0.005882355, 0.005882355, 0.005882355, 0.005882355, 0.005882355, 0.005882355, 0.005882355, 0.005882355, 0.005882355, 0.005882355, 0.005882355, 0.005882355, 0.005882355, 0.005882355, 0.005882355, 0.005882355, 0.005882355, 0.005882355, 0.870588245, 0.992156865, 0.631372575, 0.019607845, 0.005882355, 0.005882355, 0.005882355, 0.005882355, 0.005882355, 0.005882355, 0.005882355, 0.005882355, 0.005882355, 0.005882355, 0.005882355, 0.005882355, 0.005882355, 0.005882355, 0.005882355, 0.005882355, 0.005882355, 0.005882355, 0.005882355, 0.005882355, 0.005882355, 0.005882355, 0.005882355, 0.13333334, 0.9490196150000001, 0.972549025, 0.298039225, 0.13333334, 0.41960784500000003, 0.525490225, 0.854901965, 0.694117665, 0.364705895, 0.101960785, 0.005882355, 0.005882355, 0.005882355, 0.005882355, 0.005882355, 0.005882355, 0.005882355, 0.005882355, 0.005882355, 0.005882355, 0.005882355, 0.005882355, 0.005882355, 0.005882355, 0.005882355, 0.005882355, 0.005882355, 0.458823535, 0.992156865, 0.972549025, 0.9450980449999999, 0.9529411750000001, 0.992156865, 0.9215686350000001, 0.8745098149999999, 0.941176475, 0.992156865, 0.925490205, 0.400000005, 0.005882355, 0.005882355, 0.005882355, 0.005882355, 0.005882355, 0.005882355, 0.005882355, 0.005882355, 0.005882355, 0.005882355, 0.005882355, 0.005882355, 0.005882355, 0.005882355, 0.005882355, 0.005882355, 0.7764706050000001, 0.992156865, 0.992156865, 0.7882353049999999, 0.5647059050000001, 0.227450985, 0.086274515, 0.005882355, 0.12156863, 0.5568627749999999, 0.980392155, 0.913725495, 0.40784314499999996, 0.005882355, 0.005882355, 0.005882355, 0.005882355, 0.005882355, 0.005882355, 0.005882355, 0.005882355, 0.005882355, 0.005882355, 0.005882355, 0.005882355, 0.005882355, 0.005882355, 0.005882355, 0.070588235, 0.5921568850000001, 0.333333345, 0.05882353, 0.005882355, 0.005882355, 0.005882355, 0.005882355, 0.005882355, 0.005882355, 0.517647085, 0.992156865, 0.686274525, 0.00784314, 0.005882355, 0.005882355, 0.005882355, 0.005882355, 0.005882355, 0.005882355, 0.005882355, 0.005882355, 0.005882355, 0.005882355, 0.005882355, 0.005882355, 0.005882355, 0.005882355, 0.005882355, 0.005882355, 0.005882355, 0.005882355, 0.005882355, 0.005882355, 0.005882355, 0.005882355, 0.005882355, 0.005882355, 0.42352941499999996, 0.992156865, 0.992156865, 0.035294115, 0.005882355, 0.005882355, 0.005882355, 0.005882355, 0.005882355, 0.005882355, 0.005882355, 0.005882355, 0.005882355, 0.005882355, 0.005882355, 0.005882355, 0.005882355, 0.005882355, 0.005882355, 0.005882355, 0.005882355, 0.005882355, 0.005882355, 0.005882355, 0.005882355, 0.005882355, 0.005882355, 0.12941176999999998, 0.819607855, 0.992156865, 0.690196095, 0.00784314, 0.005882355, 0.005882355, 0.005882355, 0.005882355, 0.005882355, 0.005882355, 0.005882355, 0.005882355, 0.005882355, 0.005882355, 0.005882355, 0.005882355, 0.005882355, 0.005882355, 0.005882355, 0.005882355, 0.005882355, 0.005882355, 0.005882355, 0.005882355, 0.005882355, 0.005882355, 0.2509804, 0.8941176550000001, 0.992156865, 0.913725495, 0.176470595, 0.005882355, 0.005882355, 0.005882355, 0.005882355, 0.005882355, 0.005882355, 0.005882355, 0.005882355, 0.005882355, 0.005882355, 0.005882355, 0.005882355, 0.005882355, 0.005882355, 0.005882355, 0.005882355, 0.005882355, 0.005882355, 0.005882355, 0.005882355, 0.054901965, 0.384313735, 0.713725505, 0.980392155, 0.992156865, 0.9058823549999999, 0.30980393500000003, 0.005882355, 0.005882355, 0.005882355, 0.005882355, 0.005882355, 0.005882355, 0.005882355, 0.005882355, 0.005882355, 0.005882355, 0.005882355, 0.005882355, 0.005882355, 0.005882355, 0.005882355, 0.109803925, 0.105882355, 0.105882355, 0.40392157500000003, 0.458823535, 0.5921568850000001, 0.870588245, 0.992156865, 0.992156865, 0.941176475, 0.5568627749999999, 0.109803925, 0.005882355, 0.005882355, 0.005882355, 0.005882355, 0.005882355, 0.005882355, 0.005882355, 0.005882355, 0.005882355, 0.005882355, 0.005882355, 0.005882355, 0.005882355, 0.005882355, 0.005882355, 0.005882355, 0.9490196150000001, 0.976470585, 0.980392155, 0.99019608, 0.968627455, 0.9607843149999999, 0.9450980449999999, 0.7215686450000001, 0.392156865, 0.11764706, 0.005882355, 0.005882355, 0.005882355, 0.005882355, 0.005882355, 0.005882355, 0.005882355, 0.005882355, 0.005882355, 0.005882355, 0.005882355, 0.005882355, 0.005882355, 0.005882355, 0.005882355, 0.005882355, 0.005882355, 0.005882355, 0.005882355, 0.180392165, 0.192156865, 0.25490197, 0.13333334, 0.078431375, 0.005882355, 0.005882355, 0.005882355, 0.005882355, 0.005882355, 0.005882355, 0.005882355, 0.005882355, 0.005882355, 0.005882355, 0.005882355, 0.005882355, 0.005882355, 0.005882355, 0.005882355, 0.005882355, 0.005882355, 0.005882355, 0.005882355, 0.005882355, 0.005882355, 0.005882355, 0.005882355, 0.005882355, 0.005882355, 0.005882355, 0.005882355, 0.005882355, 0.005882355, 0.005882355, 0.005882355, 0.005882355, 0.005882355, 0.005882355, 0.005882355, 0.005882355, 0.005882355, 0.005882355, 0.005882355, 0.005882355, 0.005882355, 0.005882355, 0.005882355, 0.005882355, 0.005882355, 0.005882355, 0.005882355, 0.005882355, 0.005882355, 0.005882355, 0.005882355, 0.005882355, 0.005882355, 0.005882355, 0.005882355, 0.005882355, 0.005882355, 0.005882355, 0.005882355, 0.005882355, 0.005882355, 0.005882355, 0.005882355, 0.005882355, 0.005882355, 0.005882355, 0.005882355, 0.005882355, 0.005882355, 0.005882355, 0.005882355, 0.005882355, 0.005882355, 0.005882355, 0.005882355, 0.005882355, 0.005882355, 0.005882355, 0.005882355, 0.005882355, 0.005882355, 0.005882355, 0.005882355, 0.005882355, 0.005882355, 0.005882355, 0.005882355, 0.005882355, 0.005882355, 0.005882355, 0.005882355, 0.005882355, 0.005882355, 0.005882355, 0.005882355, 0.005882355, 0.005882355, 0.005882355, 0.005882355, 0.005882355], ([-66.6497253313038, -64.52805518684205, -60.58455613375861, -31.08495253951728, -63.71277394317684, 12.2741253619548, -47.86092031729821, -58.91969615477534, -49.20674909112436, -37.930282143622016], [-61.82841586884523, -58.021101504187016, -52.87742179718472, -30.10419080208559, -56.4095409792858, 10.305673369192531, -42.98543662629622, -53.22923150548249, -43.588892432966304, -32.7245706879398], 7.707134336573894))
[Thread 1] Total splits: 0
Processed 1 zonotopes (Work Done: 0.0%); Generated 0 (0.174743304s/loop)
[Thread 1] Finished in 0.17s
 ────────────────────────────────────────────────────────────────────────────────
                                        Time                    Allocations      
                               ───────────────────────   ────────────────────────
       Tot / % measured:            177ms / 100.0%            124MiB / 100.0%    

 Section               ncalls     time    %tot     avg     alloc    %tot      avg
 ────────────────────────────────────────────────────────────────────────────────
 Verify                     1    175ms   98.8%   175ms    114MiB   92.1%   114MiB
   Zonotope Loop            1    175ms   98.8%   175ms    114MiB   92.1%   114MiB
     Zonotope Propa...      1    162ms   91.8%   162ms   92.6MiB   74.8%  92.6MiB
       DiffZonotope...      2    111ms   63.0%  55.7ms   79.4MiB   64.1%  39.7MiB
         Zonotope_R...      4    111ms   62.5%  27.6ms   79.3MiB   64.1%  19.8MiB
           Influenc...      4   99.5ms   56.2%  24.9ms   49.2MiB   39.7%  12.3MiB
             Multiply       4   91.1ms   51.5%  22.8ms   26.3MiB   21.2%  6.56MiB
             Alloca...      4   5.48ms    3.1%  1.37ms   23.0MiB   18.5%  5.74MiB
             Set Ma...      4   2.86ms    1.6%   714μs     0.00B    0.0%    0.00B
           Column M...      4   6.47ms    3.7%  1.62ms   15.0MiB   12.1%  3.75MiB
           Allocation       4   2.69ms    1.5%   672μs   15.0MiB   12.1%  3.75MiB
           Set Matrix       4   1.77ms    1.0%   443μs   15.6KiB    0.0%  3.90KiB
           Vectors          4   75.3μs    0.0%  18.8μs    100KiB    0.1%  25.0KiB
           Bounds           4   2.59μs    0.0%   648ns     0.00B    0.0%    0.00B
       DiffZonotope...      3   50.9ms   28.8%  17.0ms   13.2MiB   10.6%  4.39MiB
         Zonotope_D...      6   50.9ms   28.8%  8.48ms   13.2MiB   10.6%  2.20MiB
     Property Check         1   1.69ms    1.0%  1.69ms    327KiB    0.3%   327KiB
 Initialize                 1   2.12ms    1.2%  2.12ms   9.84MiB    7.9%  9.84MiB
 ────────────────────────────────────────────────────────────────────────────────
[VERYDIFF_TIMER] 0.225412854

[VERYDIFF_EXPERIMENT] Running on /home/i57/steuber/NeuroDiff/repos/VeryDiffExperiments/src/../benchmarks/mnist-prune/specs/mnist_52_global_3.vnnlib /home/i57/steuber/NeuroDiff/repos/VeryDiffExperiments/src/../benchmarks/mnist-prune/nets/mnist_relu_3_100.onnx
Found input X
op: matmul, weight: (100, 784), bias: nothing
op: bias, weight: nothing, bias: (100,)
op: relu, weight: nothing, bias: nothing
op: matmul, weight: (100, 100), bias: nothing
op: bias, weight: nothing, bias: (100,)
op: relu, weight: nothing, bias: nothing
op: matmul, weight: (10, 100), bias: nothing
op: bias, weight: nothing, bias: (10,)
op: relu, weight: nothing, bias: nothing
op: matmul, weight: (10, 10), bias: nothing
op: bias, weight: nothing, bias: (10,)
Found input X
op: matmul, weight: (100, 784), bias: nothing
op: bias, weight: nothing, bias: (100,)
op: relu, weight: nothing, bias: nothing
op: matmul, weight: (100, 100), bias: nothing
op: bias, weight: nothing, bias: (100,)
op: relu, weight: nothing, bias: nothing
op: matmul, weight: (10, 100), bias: nothing
op: bias, weight: nothing, bias: (10,)
op: relu, weight: nothing, bias: nothing
op: matmul, weight: (10, 10), bias: nothing
op: bias, weight: nothing, bias: (10,)
Distance: 296.6600370998244
Distance: 77.24290861755458
Distance: 5.7170369567975285
Distance: 0.0
Running with 1 threads
[Thread 1] Time to first task: 0.0s
Zono Bounds:
[0.0, 0.0, 0.0, 0.0, 0.0, 0.0, 0.0, 0.0, 0.0, 0.0, 0.0, 0.0, 0.0, 0.0, 0.0, 0.0, 0.0, 0.0, 0.0, 0.0, 0.0, 0.0, 0.0, 0.0, 0.0, 0.0, 0.0, 0.0, 0.0, 0.0, 0.0, 0.0, 0.0, 0.0, 0.0, 0.0, 0.0, 0.0, 0.0, 0.0, 0.0, 0.0, 0.0, 0.0, 0.0, 0.0, 0.0, 0.0, 0.0, 0.0, 0.0, 0.0, 0.0, 0.0, 0.0, 0.0, 0.0, 0.0, 0.0, 0.0, 0.0, 0.0, 0.0, 0.0, 0.0, 0.0, 0.0, 0.0, 0.0, 0.0, 0.0, 0.0, 0.0, 0.0, 0.0, 0.0, 0.0, 0.0, 0.0, 0.0, 0.0, 0.0, 0.0, 0.0, 0.0, 0.0, 0.0, 0.0, 0.0, 0.0, 0.0, 0.0, 0.0, 0.0, 0.0, 0.0, 0.0, 0.0, 0.0, 0.0, 0.0, 0.0, 0.0, 0.0, 0.0, 0.0, 0.0, 0.0, 0.0, 0.0, 0.0, 0.0, 0.0, 0.0, 0.0, 0.0, 0.0, 0.0, 0.0, 0.0, 0.0, 0.0, 0.0, 0.0, 0.0, 0.0, 0.0, 0.0, 0.0, 0.0, 0.0, 0.0, 0.0, 0.0, 0.0, 0.0, 0.0, 0.0, 0.0, 0.0, 0.0, 0.0, 0.0, 0.0, 0.0, 0.0, 0.0, 0.0, 0.0, 0.0, 0.0, 0.0, 0.0, 0.0, 0.0, 0.0, 0.0, 0.0, 0.0, 0.0, 0.0, 0.0, 0.0, 0.0, 0.0, 0.0, 0.0, 0.0, 0.0, 0.0, 0.0, 0.0, 0.0, 0.0, 0.0, 0.0, 0.0, 0.0, 0.0, 0.0, 0.0, 0.0, 0.0, 0.0, 0.0, 0.0, 0.0, 0.0, 0.0, 0.0, 0.0, 0.0, 0.0, 0.0, 0.0, 0.0, 0.0, 0.0, 0.0, 0.0, 0.0, 0.0, 0.0, 0.0, 0.0, 0.0, 0.0, 0.0, 0.0, 0.0, 0.0, 0.0, 0.0, 0.0, 0.0, 0.0, 0.0, 0.0, 0.0, 0.0, 0.0, 0.0, 0.0, 0.0, 0.0, 0.0, 0.0, 0.0, 0.0, 0.0, 0.0, 0.0, 0.0, 0.0, 0.0, 0.0, 0.0, 0.0, 0.0, 0.0, 0.0, 0.0, 0.0, 0.0, 0.0, 0.0, 0.0, 0.0, 0.0, 0.0, 0.0, 0.0, 0.0, 0.0, 0.0, 0.0, 0.0, 0.0, 0.0, 0.0, 0.0, 0.0, 0.0, 0.0, 0.0, 0.0, 0.0, 0.0, 0.0, 0.0, 0.0, 0.0, 0.0, 0.0, 0.0, 0.0, 0.0, 0.0, 0.0, 0.0, 0.0, 0.0, 0.0, 0.0, 0.0, 0.0, 0.0, 0.0, 0.0, 0.0, 0.0, 0.0, 0.0, 0.0, 0.0, 0.0, 0.0, 0.0, 0.0, 0.0, 0.0, 0.0, 0.0, 0.0, 0.0, 0.0, 0.0, 0.0, 0.0, 0.0, 0.0, 0.0, 0.0, 0.0, 0.0, 0.0, 0.0, 0.0, 0.0, 0.0, 0.0, 0.0, 0.0, 0.0, 0.0, 0.0, 0.0, 0.0, 0.0, 0.0, 0.0, 0.0, 0.0, 0.0, 0.0, 0.0, 0.0, 0.0, 0.0, 0.0, 0.0, 0.0, 0.0, 0.0, 0.0, 0.0, 0.0, 0.0, 0.0, 0.0, 0.0, 0.0, 0.0, 0.0, 0.0, 0.0, 0.0, 0.0, 0.0, 0.0, 0.0, 0.0, 0.0, 0.0, 0.0, 0.0, 0.0, 0.0, 0.0, 0.0, 0.0, 0.0, 0.0, 0.0, 0.0, 0.0, 0.0, 0.0, 0.0, 0.0, 0.0, 0.0, 0.0, 0.0, 0.0, 0.0, 0.0, 0.0, 0.0, 0.0, 0.0, 0.0, 0.0, 0.0, 0.0, 0.0, 0.0, 0.0, 0.0, 0.0, 0.0, 0.0, 0.0, 0.0, 0.0, 0.0, 0.0, 0.0, 0.0, 0.0, 0.0, 0.0, 0.0, 0.0, 0.0, 0.0, 0.0, 0.0, 0.0, 0.0, 0.0, 0.0, 0.0, 0.0, 0.0, 0.0, 0.0, 0.0, 0.0, 0.0, 0.0, 0.0, 0.0, 0.0, 0.0, 0.0, 0.0, 0.0, 0.0, 0.0, 0.0, 0.0, 0.0, 0.0, 0.0, 0.0, 0.0, 0.0, 0.0, 0.0, 0.0, 0.0, 0.0, 0.0, 0.0, 0.0, 0.0, 0.0, 0.0, 0.0, 0.0, 0.0, 0.0, 0.0, 0.0, 0.0, 0.0, 0.0, 0.0, 0.0, 0.0, 0.0, 0.0, 0.0, 0.0, 0.0, 0.0, 0.0, 0.0, 0.0, 0.0, 0.0, 0.0, 0.0, 0.0, 0.0, 0.0, 0.0, 0.0, 0.0, 0.0, 0.0, 0.0, 0.0, 0.0, 0.0, 0.0, 0.0, 0.0, 0.0, 0.0, 0.0, 0.0, 0.0, 0.0, 0.0, 0.0, 0.0, 0.0, 0.0, 0.0, 0.0, 0.0, 0.0, 0.0, 0.0, 0.0, 0.0, 0.0, 0.0, 0.0, 0.0, 0.0, 0.0, 0.0, 0.0, 0.0, 0.0, 0.0, 0.0, 0.0, 0.0, 0.0, 0.0, 0.0, 0.0, 0.0, 0.0, 0.0, 0.0, 0.0, 0.0, 0.0, 0.0, 0.0, 0.0, 0.0, 0.0, 0.0, 0.0, 0.0, 0.0, 0.0, 0.0, 0.0, 0.0, 0.0, 0.0, 0.0, 0.0, 0.0, 0.0, 0.0, 0.0, 0.0, 0.0, 0.0, 0.0, 0.0, 0.0, 0.0, 0.0, 0.0, 0.0, 0.0, 0.0, 0.0, 0.0, 0.0, 0.0, 0.0, 0.0, 0.0, 0.0, 0.0, 0.0, 0.0, 0.0, 0.0, 0.0, 0.0, 0.0, 0.0, 0.0, 0.0, 0.0, 0.0, 0.0, 0.0, 0.0, 0.0, 0.0, 0.0, 0.0, 0.0, 0.0, 0.0, 0.0, 0.0, 0.0, 0.0, 0.0, 0.0, 0.0, 0.0, 0.0, 0.0, 0.0, 0.0, 0.0, 0.0, 0.0, 0.0, 0.0, 0.0, 0.0, 0.0, 0.0, 0.0, 0.0, 0.0, 0.0, 0.0, 0.0, 0.0, 0.0, 0.0, 0.0, 0.0, 0.0, 0.0, 0.0, 0.0, 0.0, 0.0, 0.0, 0.0, 0.0, 0.0, 0.0, 0.0, 0.0, 0.0, 0.0, 0.0, 0.0, 0.0, 0.0, 0.0, 0.0, 0.0, 0.0, 0.0, 0.0, 0.0, 0.0, 0.0, 0.0, 0.0, 0.0, 0.0, 0.0, 0.0, 0.0, 0.0, 0.0, 0.0, 0.0, 0.0, 0.0, 0.0, 0.0, 0.0, 0.0, 0.0, 0.0, 0.0, 0.0, 0.0, 0.0, 0.0, 0.0, 0.0, 0.0, 0.0, 0.0, 0.0, 0.0, 0.0, 0.0, 0.0, 0.0, 0.0, 0.0, 0.0, 0.0, 0.0, 0.0, 0.0, 0.0, 0.0, 0.0, 0.0, 0.0, 0.0, 0.0, 0.0, 0.0, 0.0, 0.0, 0.0, 0.0, 0.0, 0.0, 0.0, 0.0, 0.0, 0.0, 0.0, 0.0, 0.0, 0.0, 0.0, 0.0, 0.0, 0.0, 0.0, 0.0, 0.0, 0.0, 0.0, 0.0, 0.0, 0.0, 0.0, 0.0, 0.0, 0.0, 0.0, 0.0, 0.0, 0.0, 0.0, 0.0, 0.0, 0.0, 0.0, 0.0, 0.0, 0.0, 0.0, 0.0, 0.0, 0.0, 0.0, 0.0, 0.0, 0.0, 0.0, 0.0, 0.0, 0.0, 0.0, 0.0, 0.0, 0.0, 0.0, 0.0, 0.0, 0.0, 0.0, 0.0, 0.0, 0.0]
[0.0, 0.0, 0.0, 0.0, 0.0, 0.0, 0.0, 0.0, 0.0, 0.0, 0.0, 0.0, 0.0, 0.0, 0.0, 0.0, 0.0, 0.0, 0.0, 0.0, 0.0, 0.0, 0.0, 0.0, 0.0, 0.0, 0.0, 0.0, 0.0, 0.0, 0.0, 0.0, 0.0, 0.0, 0.0, 0.0, 0.0, 0.0, 0.0, 0.0, 0.0, 0.0, 0.0, 0.0, 0.0, 0.0, 0.0, 0.0, 0.0, 0.0, 0.0, 0.0, 0.0, 0.0, 0.0, 0.0, 0.0, 0.0, 0.0, 0.0, 0.0, 0.0, 0.0, 0.0, 0.0, 0.0, 0.0, 0.0, 0.0, 0.0, 0.0, 0.0, 0.0, 0.0, 0.0, 0.0, 0.0, 0.0, 0.0, 0.0, 0.0, 0.0, 0.0, 0.0, 0.0, 0.0, 0.0, 0.0, 0.0, 0.0, 0.0, 0.0, 0.0, 0.0, 0.0, 0.0, 0.0, 0.0, 0.0, 0.0, 0.0, 0.0, 0.0, 0.0, 0.0, 0.0, 0.0, 0.0, 0.0, 0.0, 0.0, 0.0, 0.0, 0.0, 0.0, 0.0, 0.0, 0.0, 0.0, 0.0, 0.0, 0.0, 0.0, 0.0, 0.0, 0.0, 0.0, 0.0, 0.0, 0.0, 0.0, 0.0, 0.0, 0.0, 0.0, 0.0, 0.0, 0.0, 0.0, 0.0, 0.0, 0.0, 0.0, 0.0, 0.0, 0.0, 0.0, 0.0, 0.0, 0.0, 0.0, 0.0, 0.0, 0.0, 0.0, 0.0, 0.0, 0.0, 0.0, 0.0, 0.0, 0.0, 0.0, 0.0, 0.0, 0.0, 0.0, 0.0, 0.0, 0.0, 0.0, 0.0, 0.0, 0.0, 0.0, 0.0, 0.0, 0.0, 0.0, 0.0, 0.0, 0.0, 0.0, 0.0, 0.0, 0.0, 0.0, 0.0, 0.0, 0.0, 0.0, 0.0, 0.0, 0.0, 0.0, 0.0, 0.0, 0.0, 0.0, 0.0, 0.0, 0.0, 0.0, 0.0, 0.0, 0.0, 0.0, 0.0, 0.0, 0.0, 0.0, 0.0, 0.0, 0.0, 0.0, 0.0, 0.0, 0.0, 0.0, 0.0, 0.0, 0.0, 0.0, 0.0, 0.0, 0.0, 0.0, 0.0, 0.0, 0.0, 0.0, 0.0, 0.0, 0.0, 0.0, 0.0, 0.0, 0.0, 0.0, 0.0, 0.0, 0.0, 0.0, 0.0, 0.0, 0.0, 0.0, 0.0, 0.0, 0.0, 0.0, 0.0, 0.0, 0.0, 0.0, 0.0, 0.0, 0.0, 0.0, 0.0, 0.0, 0.0, 0.0, 0.0, 0.0, 0.0, 0.0, 0.0, 0.0, 0.0, 0.0, 0.0, 0.0, 0.0, 0.0, 0.0, 0.0, 0.0, 0.0, 0.0, 0.0, 0.0, 0.0, 0.0, 0.0, 0.0, 0.0, 0.0, 0.0, 0.0, 0.0, 0.0, 0.0, 0.0, 0.0, 0.0, 0.0, 0.0, 0.0, 0.0, 0.0, 0.0, 0.0, 0.0, 0.0, 0.0, 0.0, 0.0, 0.0, 0.0, 0.0, 0.0, 0.0, 0.0, 0.0, 0.0, 0.0, 0.0, 0.0, 0.0, 0.0, 0.0, 0.0, 0.0, 0.0, 0.0, 0.0, 0.0, 0.0, 0.0, 0.0, 0.0, 0.0, 0.0, 0.0, 0.0, 0.0, 0.0, 0.0, 0.0, 0.0, 0.0, 0.0, 0.0, 0.0, 0.0, 0.0, 0.0, 0.0, 0.0, 0.0, 0.0, 0.0, 0.0, 0.0, 0.0, 0.0, 0.0, 0.0, 0.0, 0.0, 0.0, 0.0, 0.0, 0.0, 0.0, 0.0, 0.0, 0.0, 0.0, 0.0, 0.0, 0.0, 0.0, 0.0, 0.0, 0.0, 0.0, 0.0, 0.0, 0.0, 0.0, 0.0, 0.0, 0.0, 0.0, 0.0, 0.0, 0.0, 0.0, 0.0, 0.0, 0.0, 0.0, 0.0, 0.0, 0.0, 0.0, 0.0, 0.0, 0.0, 0.0, 0.0, 0.0, 0.0, 0.0, 0.0, 0.0, 0.0, 0.0, 0.0, 0.0, 0.0, 0.0, 0.0, 0.0, 0.0, 0.0, 0.0, 0.0, 0.0, 0.0, 0.0, 0.0, 0.0, 0.0, 0.0, 0.0, 0.0, 0.0, 0.0, 0.0, 0.0, 0.0, 0.0, 0.0, 0.0, 0.0, 0.0, 0.0, 0.0, 0.0, 0.0, 0.0, 0.0, 0.0, 0.0, 0.0, 0.0, 0.0, 0.0, 0.0, 0.0, 0.0, 0.0, 0.0, 0.0, 0.0, 0.0, 0.0, 0.0, 0.0, 0.0, 0.0, 0.0, 0.0, 0.0, 0.0, 0.0, 0.0, 0.0, 0.0, 0.0, 0.0, 0.0, 0.0, 0.0, 0.0, 0.0, 0.0, 0.0, 0.0, 0.0, 0.0, 0.0, 0.0, 0.0, 0.0, 0.0, 0.0, 0.0, 0.0, 0.0, 0.0, 0.0, 0.0, 0.0, 0.0, 0.0, 0.0, 0.0, 0.0, 0.0, 0.0, 0.0, 0.0, 0.0, 0.0, 0.0, 0.0, 0.0, 0.0, 0.0, 0.0, 0.0, 0.0, 0.0, 0.0, 0.0, 0.0, 0.0, 0.0, 0.0, 0.0, 0.0, 0.0, 0.0, 0.0, 0.0, 0.0, 0.0, 0.0, 0.0, 0.0, 0.0, 0.0, 0.0, 0.0, 0.0, 0.0, 0.0, 0.0, 0.0, 0.0, 0.0, 0.0, 0.0, 0.0, 0.0, 0.0, 0.0, 0.0, 0.0, 0.0, 0.0, 0.0, 0.0, 0.0, 0.0, 0.0, 0.0, 0.0, 0.0, 0.0, 0.0, 0.0, 0.0, 0.0, 0.0, 0.0, 0.0, 0.0, 0.0, 0.0, 0.0, 0.0, 0.0, 0.0, 0.0, 0.0, 0.0, 0.0, 0.0, 0.0, 0.0, 0.0, 0.0, 0.0, 0.0, 0.0, 0.0, 0.0, 0.0, 0.0, 0.0, 0.0, 0.0, 0.0, 0.0, 0.0, 0.0, 0.0, 0.0, 0.0, 0.0, 0.0, 0.0, 0.0, 0.0, 0.0, 0.0, 0.0, 0.0, 0.0, 0.0, 0.0, 0.0, 0.0, 0.0, 0.0, 0.0, 0.0, 0.0, 0.0, 0.0, 0.0, 0.0, 0.0, 0.0, 0.0, 0.0, 0.0, 0.0, 0.0, 0.0, 0.0, 0.0, 0.0, 0.0, 0.0, 0.0, 0.0, 0.0, 0.0, 0.0, 0.0, 0.0, 0.0, 0.0, 0.0, 0.0, 0.0, 0.0, 0.0, 0.0, 0.0, 0.0, 0.0, 0.0, 0.0, 0.0, 0.0, 0.0, 0.0, 0.0, 0.0, 0.0, 0.0, 0.0, 0.0, 0.0, 0.0, 0.0, 0.0, 0.0, 0.0, 0.0, 0.0, 0.0, 0.0, 0.0, 0.0, 0.0, 0.0, 0.0, 0.0, 0.0, 0.0, 0.0, 0.0, 0.0, 0.0, 0.0, 0.0, 0.0, 0.0, 0.0, 0.0, 0.0, 0.0, 0.0, 0.0, 0.0, 0.0, 0.0, 0.0, 0.0, 0.0, 0.0, 0.0, 0.0, 0.0, 0.0, 0.0, 0.0, 0.0, 0.0, 0.0, 0.0, 0.0, 0.0, 0.0, 0.0, 0.0, 0.0, 0.0, 0.0, 0.0, 0.0, 0.0, 0.0, 0.0, 0.0, 0.0, 0.0, 0.0, 0.0, 0.0, 0.0, 0.0, 0.0, 0.0, 0.0, 0.0, 0.0, 0.0, 0.0, 0.0, 0.0, 0.0, 0.0, 0.0, 0.0, 0.0, 0.0, 0.0, 0.0, 0.0, 0.0, 0.0, 0.0, 0.0, 0.0, 0.0, 0.0, 0.0, 0.0, 0.0, 0.0, 0.0, 0.0, 0.0, 0.0, 0.0, 0.0, 0.0, 0.0, 0.0, 0.0, 0.0, 0.0, 0.0, 0.0, 0.0]

Found counterexample: ([0.005882355, 0.005882355, 0.005882355, 0.005882355, 0.005882355, 0.005882355, 0.005882355, 0.005882355, 0.005882355, 0.005882355, 0.005882355, 0.005882355, 0.005882355, 0.005882355, 0.005882355, 0.005882355, 0.005882355, 0.005882355, 0.005882355, 0.005882355, 0.005882355, 0.005882355, 0.005882355, 0.005882355, 0.005882355, 0.005882355, 0.005882355, 0.005882355, 0.005882355, 0.005882355, 0.005882355, 0.005882355, 0.005882355, 0.005882355, 0.005882355, 0.005882355, 0.005882355, 0.005882355, 0.005882355, 0.005882355, 0.005882355, 0.005882355, 0.005882355, 0.005882355, 0.005882355, 0.005882355, 0.005882355, 0.005882355, 0.005882355, 0.005882355, 0.005882355, 0.005882355, 0.005882355, 0.005882355, 0.005882355, 0.005882355, 0.005882355, 0.005882355, 0.005882355, 0.005882355, 0.005882355, 0.005882355, 0.005882355, 0.005882355, 0.005882355, 0.005882355, 0.005882355, 0.005882355, 0.005882355, 0.005882355, 0.005882355, 0.005882355, 0.005882355, 0.005882355, 0.005882355, 0.005882355, 0.005882355, 0.005882355, 0.005882355, 0.005882355, 0.005882355, 0.005882355, 0.005882355, 0.005882355, 0.005882355, 0.005882355, 0.005882355, 0.005882355, 0.005882355, 0.005882355, 0.005882355, 0.005882355, 0.005882355, 0.005882355, 0.005882355, 0.005882355, 0.005882355, 0.005882355, 0.005882355, 0.005882355, 0.005882355, 0.005882355, 0.005882355, 0.005882355, 0.005882355, 0.005882355, 0.005882355, 0.005882355, 0.005882355, 0.005882355, 0.005882355, 0.005882355, 0.005882355, 0.005882355, 0.005882355, 0.005882355, 0.005882355, 0.005882355, 0.005882355, 0.005882355, 0.005882355, 0.005882355, 0.005882355, 0.005882355, 0.005882355, 0.005882355, 0.005882355, 0.005882355, 0.005882355, 0.005882355, 0.005882355, 0.005882355, 0.005882355, 0.005882355, 0.005882355, 0.005882355, 0.005882355, 0.005882355, 0.005882355, 0.005882355, 0.005882355, 0.005882355, 0.005882355, 0.005882355, 0.005882355, 0.005882355, 0.005882355, 0.005882355, 0.005882355, 0.005882355, 0.005882355, 0.005882355, 0.005882355, 0.005882355, 0.005882355, 0.005882355, 0.005882355, 0.005882355, 0.005882355, 0.005882355, 0.005882355, 0.005882355, 0.005882355, 0.035294115, 0.301960795, 0.196078435, 0.005882355, 0.005882355, 0.005882355, 0.005882355, 0.005882355, 0.005882355, 0.005882355, 0.005882355, 0.005882355, 0.005882355, 0.005882355, 0.005882355, 0.005882355, 0.005882355, 0.005882355, 0.005882355, 0.005882355, 0.005882355, 0.005882355, 0.005882355, 0.00980392, 0.24705883, 0.466666665, 0.670588255, 0.9490196150000001, 0.9529411750000001, 0.7921568750000001, 0.384313735, 0.005882355, 0.005882355, 0.005882355, 0.005882355, 0.005882355, 0.005882355, 0.005882355, 0.005882355, 0.005882355, 0.005882355, 0.005882355, 0.005882355, 0.005882355, 0.005882355, 0.005882355, 0.192156865, 0.082352945, 0.005882355, 0.094117645, 0.466666665, 0.800000015, 0.992156865, 0.994117645, 0.8901960849999999, 0.5019608, 0.41960784500000003, 0.027450984999999997, 0.005882355, 0.005882355, 0.005882355, 0.005882355, 0.005882355, 0.005882355, 0.005882355, 0.005882355, 0.005882355, 0.005882355, 0.005882355, 0.005882355, 0.005882355, 0.005882355, 0.11764706, 0.7333333449999999, 0.992156865, 0.9098039250000001, 0.843137265, 0.9176470649999999, 0.992156865, 0.9450980449999999, 0.623529435, 0.290196095, 0.070588235, 0.005882355, 0.005882355, 0.005882355, 0.005882355, 0.005882355, 0.005882355, 0.005882355, 0.005882355, 0.005882355, 0.005882355, 0.005882355, 0.005882355, 0.005882355, 0.005882355, 0.005882355, 0.005882355, 0.070588235, 0.850980405, 0.992156865, 0.992156865, 0.992156865, 0.984313725, 0.866666675, 0.411764715, 0.13333334, 0.005882355, 0.005882355, 0.005882355, 0.005882355, 0.005882355, 0.005882355, 0.005882355, 0.005882355, 0.005882355, 0.005882355, 0.005882355, 0.005882355, 0.005882355, 0.005882355, 0.005882355, 0.005882355, 0.005882355, 0.005882355, 0.070588235, 0.78039217, 0.992156865, 0.992156865, 0.976470585, 0.6352941350000001, 0.258823535, 0.005882355, 0.005882355, 0.005882355, 0.005882355, 0.005882355, 0.005882355, 0.005882355, 0.005882355, 0.005882355, 0.005882355, 0.005882355, 0.005882355, 0.005882355, 0.005882355, 0.005882355, 0.005882355, 0.005882355, 0.005882355, 0.005882355, 0.005882355, 0.005882355, 0.7333333449999999, 0.992156865, 0.992156865, 0.768627465, 0.12156863, 0.005882355, 0.005882355, 0.005882355, 0.005882355, 0.005882355, 0.005882355, 0.005882355, 0.005882355, 0.005882355, 0.005882355, 0.005882355, 0.005882355, 0.005882355, 0.005882355, 0.005882355, 0.005882355, 0.005882355, 0.005882355, 0.005882355, 0.005882355, 0.005882355, 0.005882355, 0.223529415, 0.941176475, 0.992156865, 0.639215705, 0.00980392, 0.005882355, 0.005882355, 0.005882355, 0.005882355, 0.005882355, 0.005882355, 0.005882355, 0.005882355, 0.005882355, 0.005882355, 0.005882355, 0.005882355, 0.005882355, 0.005882355, 0.005882355, 0.005882355, 0.005882355, 0.005882355, 0.005882355, 0.005882355, 0.005882355, 0.005882355, 0.005882355, 0.870588245, 0.992156865, 0.631372575, 0.019607845, 0.005882355, 0.005882355, 0.005882355, 0.005882355, 0.005882355, 0.005882355, 0.005882355, 0.005882355, 0.005882355, 0.005882355, 0.005882355, 0.005882355, 0.005882355, 0.005882355, 0.005882355, 0.005882355, 0.005882355, 0.005882355, 0.005882355, 0.005882355, 0.005882355, 0.005882355, 0.005882355, 0.13333334, 0.9490196150000001, 0.972549025, 0.298039225, 0.13333334, 0.41960784500000003, 0.525490225, 0.854901965, 0.694117665, 0.364705895, 0.101960785, 0.005882355, 0.005882355, 0.005882355, 0.005882355, 0.005882355, 0.005882355, 0.005882355, 0.005882355, 0.005882355, 0.005882355, 0.005882355, 0.005882355, 0.005882355, 0.005882355, 0.005882355, 0.005882355, 0.005882355, 0.458823535, 0.992156865, 0.972549025, 0.9450980449999999, 0.9529411750000001, 0.992156865, 0.9215686350000001, 0.8745098149999999, 0.941176475, 0.992156865, 0.925490205, 0.400000005, 0.005882355, 0.005882355, 0.005882355, 0.005882355, 0.005882355, 0.005882355, 0.005882355, 0.005882355, 0.005882355, 0.005882355, 0.005882355, 0.005882355, 0.005882355, 0.005882355, 0.005882355, 0.005882355, 0.7764706050000001, 0.992156865, 0.992156865, 0.7882353049999999, 0.5647059050000001, 0.227450985, 0.086274515, 0.005882355, 0.12156863, 0.5568627749999999, 0.980392155, 0.913725495, 0.40784314499999996, 0.005882355, 0.005882355, 0.005882355, 0.005882355, 0.005882355, 0.005882355, 0.005882355, 0.005882355, 0.005882355, 0.005882355, 0.005882355, 0.005882355, 0.005882355, 0.005882355, 0.005882355, 0.070588235, 0.5921568850000001, 0.333333345, 0.05882353, 0.005882355, 0.005882355, 0.005882355, 0.005882355, 0.005882355, 0.005882355, 0.517647085, 0.992156865, 0.686274525, 0.00784314, 0.005882355, 0.005882355, 0.005882355, 0.005882355, 0.005882355, 0.005882355, 0.005882355, 0.005882355, 0.005882355, 0.005882355, 0.005882355, 0.005882355, 0.005882355, 0.005882355, 0.005882355, 0.005882355, 0.005882355, 0.005882355, 0.005882355, 0.005882355, 0.005882355, 0.005882355, 0.005882355, 0.005882355, 0.42352941499999996, 0.992156865, 0.992156865, 0.035294115, 0.005882355, 0.005882355, 0.005882355, 0.005882355, 0.005882355, 0.005882355, 0.005882355, 0.005882355, 0.005882355, 0.005882355, 0.005882355, 0.005882355, 0.005882355, 0.005882355, 0.005882355, 0.005882355, 0.005882355, 0.005882355, 0.005882355, 0.005882355, 0.005882355, 0.005882355, 0.005882355, 0.12941176999999998, 0.819607855, 0.992156865, 0.690196095, 0.00784314, 0.005882355, 0.005882355, 0.005882355, 0.005882355, 0.005882355, 0.005882355, 0.005882355, 0.005882355, 0.005882355, 0.005882355, 0.005882355, 0.005882355, 0.005882355, 0.005882355, 0.005882355, 0.005882355, 0.005882355, 0.005882355, 0.005882355, 0.005882355, 0.005882355, 0.005882355, 0.2509804, 0.8941176550000001, 0.992156865, 0.913725495, 0.176470595, 0.005882355, 0.005882355, 0.005882355, 0.005882355, 0.005882355, 0.005882355, 0.005882355, 0.005882355, 0.005882355, 0.005882355, 0.005882355, 0.005882355, 0.005882355, 0.005882355, 0.005882355, 0.005882355, 0.005882355, 0.005882355, 0.005882355, 0.005882355, 0.054901965, 0.384313735, 0.713725505, 0.980392155, 0.992156865, 0.9058823549999999, 0.30980393500000003, 0.005882355, 0.005882355, 0.005882355, 0.005882355, 0.005882355, 0.005882355, 0.005882355, 0.005882355, 0.005882355, 0.005882355, 0.005882355, 0.005882355, 0.005882355, 0.005882355, 0.005882355, 0.109803925, 0.105882355, 0.105882355, 0.40392157500000003, 0.458823535, 0.5921568850000001, 0.870588245, 0.992156865, 0.992156865, 0.941176475, 0.5568627749999999, 0.109803925, 0.005882355, 0.005882355, 0.005882355, 0.005882355, 0.005882355, 0.005882355, 0.005882355, 0.005882355, 0.005882355, 0.005882355, 0.005882355, 0.005882355, 0.005882355, 0.005882355, 0.005882355, 0.005882355, 0.9490196150000001, 0.976470585, 0.980392155, 0.99019608, 0.968627455, 0.9607843149999999, 0.9450980449999999, 0.7215686450000001, 0.392156865, 0.11764706, 0.005882355, 0.005882355, 0.005882355, 0.005882355, 0.005882355, 0.005882355, 0.005882355, 0.005882355, 0.005882355, 0.005882355, 0.005882355, 0.005882355, 0.005882355, 0.005882355, 0.005882355, 0.005882355, 0.005882355, 0.005882355, 0.005882355, 0.180392165, 0.192156865, 0.25490197, 0.13333334, 0.078431375, 0.005882355, 0.005882355, 0.005882355, 0.005882355, 0.005882355, 0.005882355, 0.005882355, 0.005882355, 0.005882355, 0.005882355, 0.005882355, 0.005882355, 0.005882355, 0.005882355, 0.005882355, 0.005882355, 0.005882355, 0.005882355, 0.005882355, 0.005882355, 0.005882355, 0.005882355, 0.005882355, 0.005882355, 0.005882355, 0.005882355, 0.005882355, 0.005882355, 0.005882355, 0.005882355, 0.005882355, 0.005882355, 0.005882355, 0.005882355, 0.005882355, 0.005882355, 0.005882355, 0.005882355, 0.005882355, 0.005882355, 0.005882355, 0.005882355, 0.005882355, 0.005882355, 0.005882355, 0.005882355, 0.005882355, 0.005882355, 0.005882355, 0.005882355, 0.005882355, 0.005882355, 0.005882355, 0.005882355, 0.005882355, 0.005882355, 0.005882355, 0.005882355, 0.005882355, 0.005882355, 0.005882355, 0.005882355, 0.005882355, 0.005882355, 0.005882355, 0.005882355, 0.005882355, 0.005882355, 0.005882355, 0.005882355, 0.005882355, 0.005882355, 0.005882355, 0.005882355, 0.005882355, 0.005882355, 0.005882355, 0.005882355, 0.005882355, 0.005882355, 0.005882355, 0.005882355, 0.005882355, 0.005882355, 0.005882355, 0.005882355, 0.005882355, 0.005882355, 0.005882355, 0.005882355, 0.005882355, 0.005882355, 0.005882355, 0.005882355, 0.005882355, 0.005882355, 0.005882355, 0.005882355, 0.005882355, 0.005882355], ([0.7866000265348005, 0.0, 0.0, 0.8840885950333028, 0.0, 11.489568343608902, 0.0, 0.0, 0.0, 0.9389554341218647], [1.7103094595312596, 0.0, 0.0, 0.47803036721389386, 0.0, 8.41554095975806, 0.0, 0.0, 0.0, 0.6780213838525263], 3.074027383850842))
[Thread 1] Total splits: 0
Processed 1 zonotopes (Work Done: 0.0%); Generated 0 (0.064219509s/loop)
[Thread 1] Finished in 0.06s
 ────────────────────────────────────────────────────────────────────────────────
                                        Time                    Allocations      
                               ───────────────────────   ────────────────────────
       Tot / % measured:           64.8ms / 100.0%           95.8MiB / 100.0%    

 Section               ncalls     time    %tot     avg     alloc    %tot      avg
 ────────────────────────────────────────────────────────────────────────────────
 Verify                     1   64.2ms   99.2%  64.2ms   90.4MiB   94.3%  90.4MiB
   Zonotope Loop            1   64.2ms   99.2%  64.2ms   90.4MiB   94.3%  90.4MiB
     Zonotope Propa...      1   58.8ms   90.8%  58.8ms   69.1MiB   72.1%  69.1MiB
       DiffZonotope...      3   45.6ms   70.5%  15.2ms   66.4MiB   69.3%  22.1MiB
         Zonotope_R...      6   45.5ms   70.3%  7.59ms   66.3MiB   69.3%  11.1MiB
           Influenc...      6   44.3ms   68.5%  7.39ms   61.0MiB   63.7%  10.2MiB
             Multiply       6   26.0ms   40.1%  4.33ms   30.9MiB   32.3%  5.15MiB
             Alloca...      6   14.2ms   22.0%  2.37ms   30.1MiB   31.4%  5.01MiB
             Set Ma...      6   4.13ms    6.4%   688μs     0.00B    0.0%    0.00B
           Column M...      6    723μs    1.1%   120μs   2.66MiB    2.8%   455KiB
           Set Matrix       6    287μs    0.4%  47.9μs   5.11KiB    0.0%     872B
           Allocation       6    130μs    0.2%  21.6μs   2.66MiB    2.8%   455KiB
           Vectors          6   28.5μs    0.0%  4.75μs   19.5KiB    0.0%  3.26KiB
           Bounds           6   3.09μs    0.0%   515ns     0.00B    0.0%    0.00B
       DiffZonotope...      4   13.1ms   20.2%  3.28ms   2.71MiB    2.8%   693KiB
         Zonotope_D...      8   13.1ms   20.2%  1.64ms   2.71MiB    2.8%   346KiB
     Property Check         1    288μs    0.4%   288μs    221KiB    0.2%   221KiB
 Initialize                 1    512μs    0.8%   512μs   5.41MiB    5.7%  5.41MiB
 ────────────────────────────────────────────────────────────────────────────────
[VERYDIFF_TIMER] 0.092978316

[VERYDIFF_EXPERIMENT] Running on /home/i57/steuber/NeuroDiff/repos/VeryDiffExperiments/src/../benchmarks/mnist-prune/specs/mnist_52_global_3.vnnlib /home/i57/steuber/NeuroDiff/repos/VeryDiffExperiments/src/../benchmarks/mnist-prune/nets/mnist_relu_4_1024.onnx
Found input X
op: matmul, weight: (1024, 784), bias: nothing
op: bias, weight: nothing, bias: (1024,)
op: relu, weight: nothing, bias: nothing
op: matmul, weight: (1024, 1024), bias: nothing
op: bias, weight: nothing, bias: (1024,)
op: relu, weight: nothing, bias: nothing
op: matmul, weight: (1024, 1024), bias: nothing
op: bias, weight: nothing, bias: (1024,)
op: relu, weight: nothing, bias: nothing
op: matmul, weight: (10, 1024), bias: nothing
op: bias, weight: nothing, bias: (10,)
op: relu, weight: nothing, bias: nothing
op: matmul, weight: (10, 10), bias: nothing
op: bias, weight: nothing, bias: (10,)
Found input X
op: matmul, weight: (1024, 784), bias: nothing
op: bias, weight: nothing, bias: (1024,)
op: relu, weight: nothing, bias: nothing
op: matmul, weight: (1024, 1024), bias: nothing
op: bias, weight: nothing, bias: (1024,)
op: relu, weight: nothing, bias: nothing
op: matmul, weight: (1024, 1024), bias: nothing
op: bias, weight: nothing, bias: (1024,)
op: relu, weight: nothing, bias: nothing
op: matmul, weight: (10, 1024), bias: nothing
op: bias, weight: nothing, bias: (10,)
op: relu, weight: nothing, bias: nothing
op: matmul, weight: (10, 10), bias: nothing
op: bias, weight: nothing, bias: (10,)
Distance: 1266.8815759184893
Distance: 2876.6944248261216
Distance: 2831.8843567411013
Distance: 34.033756025192815
Distance: 0.0
Running with 1 threads
[Thread 1] Time to first task: 0.01s
Zono Bounds:
[0.0, 0.0, 0.0, 0.0, 0.0, 0.0, 0.0, 0.0, 0.0, 0.0, 0.0, 0.0, 0.0, 0.0, 0.0, 0.0, 0.0, 0.0, 0.0, 0.0, 0.0, 0.0, 0.0, 0.0, 0.0, 0.0, 0.0, 0.0, 0.0, 0.0, 0.0, 0.0, 0.0, 0.0, 0.0, 0.0, 0.0, 0.0, 0.0, 0.0, 0.0, 0.0, 0.0, 0.0, 0.0, 0.0, 0.0, 0.0, 0.0, 0.0, 0.0, 0.0, 0.0, 0.0, 0.0, 0.0, 0.0, 0.0, 0.0, 0.0, 0.0, 0.0, 0.0, 0.0, 0.0, 0.0, 0.0, 0.0, 0.0, 0.0, 0.0, 0.0, 0.0, 0.0, 0.0, 0.0, 0.0, 0.0, 0.0, 0.0, 0.0, 0.0, 0.0, 0.0, 0.0, 0.0, 0.0, 0.0, 0.0, 0.0, 0.0, 0.0, 0.0, 0.0, 0.0, 0.0, 0.0, 0.0, 0.0, 0.0, 0.0, 0.0, 0.0, 0.0, 0.0, 0.0, 0.0, 0.0, 0.0, 0.0, 0.0, 0.0, 0.0, 0.0, 0.0, 0.0, 0.0, 0.0, 0.0, 0.0, 0.0, 0.0, 0.0, 0.0, 0.0, 0.0, 0.0, 0.0, 0.0, 0.0, 0.0, 0.0, 0.0, 0.0, 0.0, 0.0, 0.0, 0.0, 0.0, 0.0, 0.0, 0.0, 0.0, 0.0, 0.0, 0.0, 0.0, 0.0, 0.0, 0.0, 0.0, 0.0, 0.0, 0.0, 0.0, 0.0, 0.0, 0.0, 0.0, 0.0, 0.0, 0.0, 0.0, 0.0, 0.0, 0.0, 0.0, 0.0, 0.0, 0.0, 0.0, 0.0, 0.0, 0.0, 0.0, 0.0, 0.0, 0.0, 0.0, 0.0, 0.0, 0.0, 0.0, 0.0, 0.0, 0.0, 0.0, 0.0, 0.0, 0.0, 0.0, 0.0, 0.0, 0.0, 0.0, 0.0, 0.0, 0.0, 0.0, 0.0, 0.0, 0.0, 0.0, 0.0, 0.0, 0.0, 0.0, 0.0, 0.0, 0.0, 0.0, 0.0, 0.0, 0.0, 0.0, 0.0, 0.0, 0.0, 0.0, 0.0, 0.0, 0.0, 0.0, 0.0, 0.0, 0.0, 0.0, 0.0, 0.0, 0.0, 0.0, 0.0, 0.0, 0.0, 0.0, 0.0, 0.0, 0.0, 0.0, 0.0, 0.0, 0.0, 0.0, 0.0, 0.0, 0.0, 0.0, 0.0, 0.0, 0.0, 0.0, 0.0, 0.0, 0.0, 0.0, 0.0, 0.0, 0.0, 0.0, 0.0, 0.0, 0.0, 0.0, 0.0, 0.0, 0.0, 0.0, 0.0, 0.0, 0.0, 0.0, 0.0, 0.0, 0.0, 0.0, 0.0, 0.0, 0.0, 0.0, 0.0, 0.0, 0.0, 0.0, 0.0, 0.0, 0.0, 0.0, 0.0, 0.0, 0.0, 0.0, 0.0, 0.0, 0.0, 0.0, 0.0, 0.0, 0.0, 0.0, 0.0, 0.0, 0.0, 0.0, 0.0, 0.0, 0.0, 0.0, 0.0, 0.0, 0.0, 0.0, 0.0, 0.0, 0.0, 0.0, 0.0, 0.0, 0.0, 0.0, 0.0, 0.0, 0.0, 0.0, 0.0, 0.0, 0.0, 0.0, 0.0, 0.0, 0.0, 0.0, 0.0, 0.0, 0.0, 0.0, 0.0, 0.0, 0.0, 0.0, 0.0, 0.0, 0.0, 0.0, 0.0, 0.0, 0.0, 0.0, 0.0, 0.0, 0.0, 0.0, 0.0, 0.0, 0.0, 0.0, 0.0, 0.0, 0.0, 0.0, 0.0, 0.0, 0.0, 0.0, 0.0, 0.0, 0.0, 0.0, 0.0, 0.0, 0.0, 0.0, 0.0, 0.0, 0.0, 0.0, 0.0, 0.0, 0.0, 0.0, 0.0, 0.0, 0.0, 0.0, 0.0, 0.0, 0.0, 0.0, 0.0, 0.0, 0.0, 0.0, 0.0, 0.0, 0.0, 0.0, 0.0, 0.0, 0.0, 0.0, 0.0, 0.0, 0.0, 0.0, 0.0, 0.0, 0.0, 0.0, 0.0, 0.0, 0.0, 0.0, 0.0, 0.0, 0.0, 0.0, 0.0, 0.0, 0.0, 0.0, 0.0, 0.0, 0.0, 0.0, 0.0, 0.0, 0.0, 0.0, 0.0, 0.0, 0.0, 0.0, 0.0, 0.0, 0.0, 0.0, 0.0, 0.0, 0.0, 0.0, 0.0, 0.0, 0.0, 0.0, 0.0, 0.0, 0.0, 0.0, 0.0, 0.0, 0.0, 0.0, 0.0, 0.0, 0.0, 0.0, 0.0, 0.0, 0.0, 0.0, 0.0, 0.0, 0.0, 0.0, 0.0, 0.0, 0.0, 0.0, 0.0, 0.0, 0.0, 0.0, 0.0, 0.0, 0.0, 0.0, 0.0, 0.0, 0.0, 0.0, 0.0, 0.0, 0.0, 0.0, 0.0, 0.0, 0.0, 0.0, 0.0, 0.0, 0.0, 0.0, 0.0, 0.0, 0.0, 0.0, 0.0, 0.0, 0.0, 0.0, 0.0, 0.0, 0.0, 0.0, 0.0, 0.0, 0.0, 0.0, 0.0, 0.0, 0.0, 0.0, 0.0, 0.0, 0.0, 0.0, 0.0, 0.0, 0.0, 0.0, 0.0, 0.0, 0.0, 0.0, 0.0, 0.0, 0.0, 0.0, 0.0, 0.0, 0.0, 0.0, 0.0, 0.0, 0.0, 0.0, 0.0, 0.0, 0.0, 0.0, 0.0, 0.0, 0.0, 0.0, 0.0, 0.0, 0.0, 0.0, 0.0, 0.0, 0.0, 0.0, 0.0, 0.0, 0.0, 0.0, 0.0, 0.0, 0.0, 0.0, 0.0, 0.0, 0.0, 0.0, 0.0, 0.0, 0.0, 0.0, 0.0, 0.0, 0.0, 0.0, 0.0, 0.0, 0.0, 0.0, 0.0, 0.0, 0.0, 0.0, 0.0, 0.0, 0.0, 0.0, 0.0, 0.0, 0.0, 0.0, 0.0, 0.0, 0.0, 0.0, 0.0, 0.0, 0.0, 0.0, 0.0, 0.0, 0.0, 0.0, 0.0, 0.0, 0.0, 0.0, 0.0, 0.0, 0.0, 0.0, 0.0, 0.0, 0.0, 0.0, 0.0, 0.0, 0.0, 0.0, 0.0, 0.0, 0.0, 0.0, 0.0, 0.0, 0.0, 0.0, 0.0, 0.0, 0.0, 0.0, 0.0, 0.0, 0.0, 0.0, 0.0, 0.0, 0.0, 0.0, 0.0, 0.0, 0.0, 0.0, 0.0, 0.0, 0.0, 0.0, 0.0, 0.0, 0.0, 0.0, 0.0, 0.0, 0.0, 0.0, 0.0, 0.0, 0.0, 0.0, 0.0, 0.0, 0.0, 0.0, 0.0, 0.0, 0.0, 0.0, 0.0, 0.0, 0.0, 0.0, 0.0, 0.0, 0.0, 0.0, 0.0, 0.0, 0.0, 0.0, 0.0, 0.0, 0.0, 0.0, 0.0, 0.0, 0.0, 0.0, 0.0, 0.0, 0.0, 0.0, 0.0, 0.0, 0.0, 0.0, 0.0, 0.0, 0.0, 0.0, 0.0, 0.0, 0.0, 0.0, 0.0, 0.0, 0.0, 0.0, 0.0, 0.0, 0.0, 0.0, 0.0, 0.0, 0.0, 0.0, 0.0, 0.0, 0.0, 0.0, 0.0, 0.0, 0.0, 0.0, 0.0, 0.0, 0.0, 0.0, 0.0, 0.0, 0.0, 0.0, 0.0, 0.0, 0.0, 0.0, 0.0, 0.0, 0.0, 0.0, 0.0, 0.0, 0.0, 0.0, 0.0, 0.0, 0.0, 0.0, 0.0, 0.0, 0.0, 0.0, 0.0, 0.0, 0.0, 0.0, 0.0, 0.0, 0.0, 0.0, 0.0, 0.0, 0.0, 0.0, 0.0, 0.0, 0.0, 0.0, 0.0, 0.0, 0.0, 0.0, 0.0, 0.0, 0.0, 0.0, 0.0, 0.0, 0.0, 0.0, 0.0, 0.0, 0.0, 0.0, 0.0, 0.0, 0.0, 0.0, 0.0]
[0.0, 0.0, 0.0, 0.0, 0.0, 0.0, 0.0, 0.0, 0.0, 0.0, 0.0, 0.0, 0.0, 0.0, 0.0, 0.0, 0.0, 0.0, 0.0, 0.0, 0.0, 0.0, 0.0, 0.0, 0.0, 0.0, 0.0, 0.0, 0.0, 0.0, 0.0, 0.0, 0.0, 0.0, 0.0, 0.0, 0.0, 0.0, 0.0, 0.0, 0.0, 0.0, 0.0, 0.0, 0.0, 0.0, 0.0, 0.0, 0.0, 0.0, 0.0, 0.0, 0.0, 0.0, 0.0, 0.0, 0.0, 0.0, 0.0, 0.0, 0.0, 0.0, 0.0, 0.0, 0.0, 0.0, 0.0, 0.0, 0.0, 0.0, 0.0, 0.0, 0.0, 0.0, 0.0, 0.0, 0.0, 0.0, 0.0, 0.0, 0.0, 0.0, 0.0, 0.0, 0.0, 0.0, 0.0, 0.0, 0.0, 0.0, 0.0, 0.0, 0.0, 0.0, 0.0, 0.0, 0.0, 0.0, 0.0, 0.0, 0.0, 0.0, 0.0, 0.0, 0.0, 0.0, 0.0, 0.0, 0.0, 0.0, 0.0, 0.0, 0.0, 0.0, 0.0, 0.0, 0.0, 0.0, 0.0, 0.0, 0.0, 0.0, 0.0, 0.0, 0.0, 0.0, 0.0, 0.0, 0.0, 0.0, 0.0, 0.0, 0.0, 0.0, 0.0, 0.0, 0.0, 0.0, 0.0, 0.0, 0.0, 0.0, 0.0, 0.0, 0.0, 0.0, 0.0, 0.0, 0.0, 0.0, 0.0, 0.0, 0.0, 0.0, 0.0, 0.0, 0.0, 0.0, 0.0, 0.0, 0.0, 0.0, 0.0, 0.0, 0.0, 0.0, 0.0, 0.0, 0.0, 0.0, 0.0, 0.0, 0.0, 0.0, 0.0, 0.0, 0.0, 0.0, 0.0, 0.0, 0.0, 0.0, 0.0, 0.0, 0.0, 0.0, 0.0, 0.0, 0.0, 0.0, 0.0, 0.0, 0.0, 0.0, 0.0, 0.0, 0.0, 0.0, 0.0, 0.0, 0.0, 0.0, 0.0, 0.0, 0.0, 0.0, 0.0, 0.0, 0.0, 0.0, 0.0, 0.0, 0.0, 0.0, 0.0, 0.0, 0.0, 0.0, 0.0, 0.0, 0.0, 0.0, 0.0, 0.0, 0.0, 0.0, 0.0, 0.0, 0.0, 0.0, 0.0, 0.0, 0.0, 0.0, 0.0, 0.0, 0.0, 0.0, 0.0, 0.0, 0.0, 0.0, 0.0, 0.0, 0.0, 0.0, 0.0, 0.0, 0.0, 0.0, 0.0, 0.0, 0.0, 0.0, 0.0, 0.0, 0.0, 0.0, 0.0, 0.0, 0.0, 0.0, 0.0, 0.0, 0.0, 0.0, 0.0, 0.0, 0.0, 0.0, 0.0, 0.0, 0.0, 0.0, 0.0, 0.0, 0.0, 0.0, 0.0, 0.0, 0.0, 0.0, 0.0, 0.0, 0.0, 0.0, 0.0, 0.0, 0.0, 0.0, 0.0, 0.0, 0.0, 0.0, 0.0, 0.0, 0.0, 0.0, 0.0, 0.0, 0.0, 0.0, 0.0, 0.0, 0.0, 0.0, 0.0, 0.0, 0.0, 0.0, 0.0, 0.0, 0.0, 0.0, 0.0, 0.0, 0.0, 0.0, 0.0, 0.0, 0.0, 0.0, 0.0, 0.0, 0.0, 0.0, 0.0, 0.0, 0.0, 0.0, 0.0, 0.0, 0.0, 0.0, 0.0, 0.0, 0.0, 0.0, 0.0, 0.0, 0.0, 0.0, 0.0, 0.0, 0.0, 0.0, 0.0, 0.0, 0.0, 0.0, 0.0, 0.0, 0.0, 0.0, 0.0, 0.0, 0.0, 0.0, 0.0, 0.0, 0.0, 0.0, 0.0, 0.0, 0.0, 0.0, 0.0, 0.0, 0.0, 0.0, 0.0, 0.0, 0.0, 0.0, 0.0, 0.0, 0.0, 0.0, 0.0, 0.0, 0.0, 0.0, 0.0, 0.0, 0.0, 0.0, 0.0, 0.0, 0.0, 0.0, 0.0, 0.0, 0.0, 0.0, 0.0, 0.0, 0.0, 0.0, 0.0, 0.0, 0.0, 0.0, 0.0, 0.0, 0.0, 0.0, 0.0, 0.0, 0.0, 0.0, 0.0, 0.0, 0.0, 0.0, 0.0, 0.0, 0.0, 0.0, 0.0, 0.0, 0.0, 0.0, 0.0, 0.0, 0.0, 0.0, 0.0, 0.0, 0.0, 0.0, 0.0, 0.0, 0.0, 0.0, 0.0, 0.0, 0.0, 0.0, 0.0, 0.0, 0.0, 0.0, 0.0, 0.0, 0.0, 0.0, 0.0, 0.0, 0.0, 0.0, 0.0, 0.0, 0.0, 0.0, 0.0, 0.0, 0.0, 0.0, 0.0, 0.0, 0.0, 0.0, 0.0, 0.0, 0.0, 0.0, 0.0, 0.0, 0.0, 0.0, 0.0, 0.0, 0.0, 0.0, 0.0, 0.0, 0.0, 0.0, 0.0, 0.0, 0.0, 0.0, 0.0, 0.0, 0.0, 0.0, 0.0, 0.0, 0.0, 0.0, 0.0, 0.0, 0.0, 0.0, 0.0, 0.0, 0.0, 0.0, 0.0, 0.0, 0.0, 0.0, 0.0, 0.0, 0.0, 0.0, 0.0, 0.0, 0.0, 0.0, 0.0, 0.0, 0.0, 0.0, 0.0, 0.0, 0.0, 0.0, 0.0, 0.0, 0.0, 0.0, 0.0, 0.0, 0.0, 0.0, 0.0, 0.0, 0.0, 0.0, 0.0, 0.0, 0.0, 0.0, 0.0, 0.0, 0.0, 0.0, 0.0, 0.0, 0.0, 0.0, 0.0, 0.0, 0.0, 0.0, 0.0, 0.0, 0.0, 0.0, 0.0, 0.0, 0.0, 0.0, 0.0, 0.0, 0.0, 0.0, 0.0, 0.0, 0.0, 0.0, 0.0, 0.0, 0.0, 0.0, 0.0, 0.0, 0.0, 0.0, 0.0, 0.0, 0.0, 0.0, 0.0, 0.0, 0.0, 0.0, 0.0, 0.0, 0.0, 0.0, 0.0, 0.0, 0.0, 0.0, 0.0, 0.0, 0.0, 0.0, 0.0, 0.0, 0.0, 0.0, 0.0, 0.0, 0.0, 0.0, 0.0, 0.0, 0.0, 0.0, 0.0, 0.0, 0.0, 0.0, 0.0, 0.0, 0.0, 0.0, 0.0, 0.0, 0.0, 0.0, 0.0, 0.0, 0.0, 0.0, 0.0, 0.0, 0.0, 0.0, 0.0, 0.0, 0.0, 0.0, 0.0, 0.0, 0.0, 0.0, 0.0, 0.0, 0.0, 0.0, 0.0, 0.0, 0.0, 0.0, 0.0, 0.0, 0.0, 0.0, 0.0, 0.0, 0.0, 0.0, 0.0, 0.0, 0.0, 0.0, 0.0, 0.0, 0.0, 0.0, 0.0, 0.0, 0.0, 0.0, 0.0, 0.0, 0.0, 0.0, 0.0, 0.0, 0.0, 0.0, 0.0, 0.0, 0.0, 0.0, 0.0, 0.0, 0.0, 0.0, 0.0, 0.0, 0.0, 0.0, 0.0, 0.0, 0.0, 0.0, 0.0, 0.0, 0.0, 0.0, 0.0, 0.0, 0.0, 0.0, 0.0, 0.0, 0.0, 0.0, 0.0, 0.0, 0.0, 0.0, 0.0, 0.0, 0.0, 0.0, 0.0, 0.0, 0.0, 0.0, 0.0, 0.0, 0.0, 0.0, 0.0, 0.0, 0.0, 0.0, 0.0, 0.0, 0.0, 0.0, 0.0, 0.0, 0.0, 0.0, 0.0, 0.0, 0.0, 0.0, 0.0, 0.0, 0.0, 0.0, 0.0, 0.0, 0.0, 0.0, 0.0, 0.0, 0.0, 0.0, 0.0, 0.0, 0.0, 0.0, 0.0, 0.0, 0.0, 0.0, 0.0, 0.0, 0.0, 0.0, 0.0, 0.0, 0.0, 0.0, 0.0, 0.0, 0.0, 0.0, 0.0, 0.0, 0.0, 0.0, 0.0, 0.0, 0.0, 0.0, 0.0, 0.0, 0.0, 0.0, 0.0, 0.0, 0.0, 0.0, 0.0, 0.0, 0.0, 0.0, 0.0, 0.0, 0.0, 0.0, 0.0, 0.0]

Found counterexample: ([0.005882355, 0.005882355, 0.005882355, 0.005882355, 0.005882355, 0.005882355, 0.005882355, 0.005882355, 0.005882355, 0.005882355, 0.005882355, 0.005882355, 0.005882355, 0.005882355, 0.005882355, 0.005882355, 0.005882355, 0.005882355, 0.005882355, 0.005882355, 0.005882355, 0.005882355, 0.005882355, 0.005882355, 0.005882355, 0.005882355, 0.005882355, 0.005882355, 0.005882355, 0.005882355, 0.005882355, 0.005882355, 0.005882355, 0.005882355, 0.005882355, 0.005882355, 0.005882355, 0.005882355, 0.005882355, 0.005882355, 0.005882355, 0.005882355, 0.005882355, 0.005882355, 0.005882355, 0.005882355, 0.005882355, 0.005882355, 0.005882355, 0.005882355, 0.005882355, 0.005882355, 0.005882355, 0.005882355, 0.005882355, 0.005882355, 0.005882355, 0.005882355, 0.005882355, 0.005882355, 0.005882355, 0.005882355, 0.005882355, 0.005882355, 0.005882355, 0.005882355, 0.005882355, 0.005882355, 0.005882355, 0.005882355, 0.005882355, 0.005882355, 0.005882355, 0.005882355, 0.005882355, 0.005882355, 0.005882355, 0.005882355, 0.005882355, 0.005882355, 0.005882355, 0.005882355, 0.005882355, 0.005882355, 0.005882355, 0.005882355, 0.005882355, 0.005882355, 0.005882355, 0.005882355, 0.005882355, 0.005882355, 0.005882355, 0.005882355, 0.005882355, 0.005882355, 0.005882355, 0.005882355, 0.005882355, 0.005882355, 0.005882355, 0.005882355, 0.005882355, 0.005882355, 0.005882355, 0.005882355, 0.005882355, 0.005882355, 0.005882355, 0.005882355, 0.005882355, 0.005882355, 0.005882355, 0.005882355, 0.005882355, 0.005882355, 0.005882355, 0.005882355, 0.005882355, 0.005882355, 0.005882355, 0.005882355, 0.005882355, 0.005882355, 0.005882355, 0.005882355, 0.005882355, 0.005882355, 0.005882355, 0.005882355, 0.005882355, 0.005882355, 0.005882355, 0.005882355, 0.005882355, 0.005882355, 0.005882355, 0.005882355, 0.005882355, 0.005882355, 0.005882355, 0.005882355, 0.005882355, 0.005882355, 0.005882355, 0.005882355, 0.005882355, 0.005882355, 0.005882355, 0.005882355, 0.005882355, 0.005882355, 0.005882355, 0.005882355, 0.005882355, 0.005882355, 0.005882355, 0.005882355, 0.005882355, 0.005882355, 0.005882355, 0.005882355, 0.005882355, 0.035294115, 0.301960795, 0.196078435, 0.005882355, 0.005882355, 0.005882355, 0.005882355, 0.005882355, 0.005882355, 0.005882355, 0.005882355, 0.005882355, 0.005882355, 0.005882355, 0.005882355, 0.005882355, 0.005882355, 0.005882355, 0.005882355, 0.005882355, 0.005882355, 0.005882355, 0.005882355, 0.00980392, 0.24705883, 0.466666665, 0.670588255, 0.9490196150000001, 0.9529411750000001, 0.7921568750000001, 0.384313735, 0.005882355, 0.005882355, 0.005882355, 0.005882355, 0.005882355, 0.005882355, 0.005882355, 0.005882355, 0.005882355, 0.005882355, 0.005882355, 0.005882355, 0.005882355, 0.005882355, 0.005882355, 0.192156865, 0.082352945, 0.005882355, 0.094117645, 0.466666665, 0.800000015, 0.992156865, 0.994117645, 0.8901960849999999, 0.5019608, 0.41960784500000003, 0.027450984999999997, 0.005882355, 0.005882355, 0.005882355, 0.005882355, 0.005882355, 0.005882355, 0.005882355, 0.005882355, 0.005882355, 0.005882355, 0.005882355, 0.005882355, 0.005882355, 0.005882355, 0.11764706, 0.7333333449999999, 0.992156865, 0.9098039250000001, 0.843137265, 0.9176470649999999, 0.992156865, 0.9450980449999999, 0.623529435, 0.290196095, 0.070588235, 0.005882355, 0.005882355, 0.005882355, 0.005882355, 0.005882355, 0.005882355, 0.005882355, 0.005882355, 0.005882355, 0.005882355, 0.005882355, 0.005882355, 0.005882355, 0.005882355, 0.005882355, 0.005882355, 0.070588235, 0.850980405, 0.992156865, 0.992156865, 0.992156865, 0.984313725, 0.866666675, 0.411764715, 0.13333334, 0.005882355, 0.005882355, 0.005882355, 0.005882355, 0.005882355, 0.005882355, 0.005882355, 0.005882355, 0.005882355, 0.005882355, 0.005882355, 0.005882355, 0.005882355, 0.005882355, 0.005882355, 0.005882355, 0.005882355, 0.005882355, 0.070588235, 0.78039217, 0.992156865, 0.992156865, 0.976470585, 0.6352941350000001, 0.258823535, 0.005882355, 0.005882355, 0.005882355, 0.005882355, 0.005882355, 0.005882355, 0.005882355, 0.005882355, 0.005882355, 0.005882355, 0.005882355, 0.005882355, 0.005882355, 0.005882355, 0.005882355, 0.005882355, 0.005882355, 0.005882355, 0.005882355, 0.005882355, 0.005882355, 0.7333333449999999, 0.992156865, 0.992156865, 0.768627465, 0.12156863, 0.005882355, 0.005882355, 0.005882355, 0.005882355, 0.005882355, 0.005882355, 0.005882355, 0.005882355, 0.005882355, 0.005882355, 0.005882355, 0.005882355, 0.005882355, 0.005882355, 0.005882355, 0.005882355, 0.005882355, 0.005882355, 0.005882355, 0.005882355, 0.005882355, 0.005882355, 0.223529415, 0.941176475, 0.992156865, 0.639215705, 0.00980392, 0.005882355, 0.005882355, 0.005882355, 0.005882355, 0.005882355, 0.005882355, 0.005882355, 0.005882355, 0.005882355, 0.005882355, 0.005882355, 0.005882355, 0.005882355, 0.005882355, 0.005882355, 0.005882355, 0.005882355, 0.005882355, 0.005882355, 0.005882355, 0.005882355, 0.005882355, 0.005882355, 0.870588245, 0.992156865, 0.631372575, 0.019607845, 0.005882355, 0.005882355, 0.005882355, 0.005882355, 0.005882355, 0.005882355, 0.005882355, 0.005882355, 0.005882355, 0.005882355, 0.005882355, 0.005882355, 0.005882355, 0.005882355, 0.005882355, 0.005882355, 0.005882355, 0.005882355, 0.005882355, 0.005882355, 0.005882355, 0.005882355, 0.005882355, 0.13333334, 0.9490196150000001, 0.972549025, 0.298039225, 0.13333334, 0.41960784500000003, 0.525490225, 0.854901965, 0.694117665, 0.364705895, 0.101960785, 0.005882355, 0.005882355, 0.005882355, 0.005882355, 0.005882355, 0.005882355, 0.005882355, 0.005882355, 0.005882355, 0.005882355, 0.005882355, 0.005882355, 0.005882355, 0.005882355, 0.005882355, 0.005882355, 0.005882355, 0.458823535, 0.992156865, 0.972549025, 0.9450980449999999, 0.9529411750000001, 0.992156865, 0.9215686350000001, 0.8745098149999999, 0.941176475, 0.992156865, 0.925490205, 0.400000005, 0.005882355, 0.005882355, 0.005882355, 0.005882355, 0.005882355, 0.005882355, 0.005882355, 0.005882355, 0.005882355, 0.005882355, 0.005882355, 0.005882355, 0.005882355, 0.005882355, 0.005882355, 0.005882355, 0.7764706050000001, 0.992156865, 0.992156865, 0.7882353049999999, 0.5647059050000001, 0.227450985, 0.086274515, 0.005882355, 0.12156863, 0.5568627749999999, 0.980392155, 0.913725495, 0.40784314499999996, 0.005882355, 0.005882355, 0.005882355, 0.005882355, 0.005882355, 0.005882355, 0.005882355, 0.005882355, 0.005882355, 0.005882355, 0.005882355, 0.005882355, 0.005882355, 0.005882355, 0.005882355, 0.070588235, 0.5921568850000001, 0.333333345, 0.05882353, 0.005882355, 0.005882355, 0.005882355, 0.005882355, 0.005882355, 0.005882355, 0.517647085, 0.992156865, 0.686274525, 0.00784314, 0.005882355, 0.005882355, 0.005882355, 0.005882355, 0.005882355, 0.005882355, 0.005882355, 0.005882355, 0.005882355, 0.005882355, 0.005882355, 0.005882355, 0.005882355, 0.005882355, 0.005882355, 0.005882355, 0.005882355, 0.005882355, 0.005882355, 0.005882355, 0.005882355, 0.005882355, 0.005882355, 0.005882355, 0.42352941499999996, 0.992156865, 0.992156865, 0.035294115, 0.005882355, 0.005882355, 0.005882355, 0.005882355, 0.005882355, 0.005882355, 0.005882355, 0.005882355, 0.005882355, 0.005882355, 0.005882355, 0.005882355, 0.005882355, 0.005882355, 0.005882355, 0.005882355, 0.005882355, 0.005882355, 0.005882355, 0.005882355, 0.005882355, 0.005882355, 0.005882355, 0.12941176999999998, 0.819607855, 0.992156865, 0.690196095, 0.00784314, 0.005882355, 0.005882355, 0.005882355, 0.005882355, 0.005882355, 0.005882355, 0.005882355, 0.005882355, 0.005882355, 0.005882355, 0.005882355, 0.005882355, 0.005882355, 0.005882355, 0.005882355, 0.005882355, 0.005882355, 0.005882355, 0.005882355, 0.005882355, 0.005882355, 0.005882355, 0.2509804, 0.8941176550000001, 0.992156865, 0.913725495, 0.176470595, 0.005882355, 0.005882355, 0.005882355, 0.005882355, 0.005882355, 0.005882355, 0.005882355, 0.005882355, 0.005882355, 0.005882355, 0.005882355, 0.005882355, 0.005882355, 0.005882355, 0.005882355, 0.005882355, 0.005882355, 0.005882355, 0.005882355, 0.005882355, 0.054901965, 0.384313735, 0.713725505, 0.980392155, 0.992156865, 0.9058823549999999, 0.30980393500000003, 0.005882355, 0.005882355, 0.005882355, 0.005882355, 0.005882355, 0.005882355, 0.005882355, 0.005882355, 0.005882355, 0.005882355, 0.005882355, 0.005882355, 0.005882355, 0.005882355, 0.005882355, 0.109803925, 0.105882355, 0.105882355, 0.40392157500000003, 0.458823535, 0.5921568850000001, 0.870588245, 0.992156865, 0.992156865, 0.941176475, 0.5568627749999999, 0.109803925, 0.005882355, 0.005882355, 0.005882355, 0.005882355, 0.005882355, 0.005882355, 0.005882355, 0.005882355, 0.005882355, 0.005882355, 0.005882355, 0.005882355, 0.005882355, 0.005882355, 0.005882355, 0.005882355, 0.9490196150000001, 0.976470585, 0.980392155, 0.99019608, 0.968627455, 0.9607843149999999, 0.9450980449999999, 0.7215686450000001, 0.392156865, 0.11764706, 0.005882355, 0.005882355, 0.005882355, 0.005882355, 0.005882355, 0.005882355, 0.005882355, 0.005882355, 0.005882355, 0.005882355, 0.005882355, 0.005882355, 0.005882355, 0.005882355, 0.005882355, 0.005882355, 0.005882355, 0.005882355, 0.005882355, 0.180392165, 0.192156865, 0.25490197, 0.13333334, 0.078431375, 0.005882355, 0.005882355, 0.005882355, 0.005882355, 0.005882355, 0.005882355, 0.005882355, 0.005882355, 0.005882355, 0.005882355, 0.005882355, 0.005882355, 0.005882355, 0.005882355, 0.005882355, 0.005882355, 0.005882355, 0.005882355, 0.005882355, 0.005882355, 0.005882355, 0.005882355, 0.005882355, 0.005882355, 0.005882355, 0.005882355, 0.005882355, 0.005882355, 0.005882355, 0.005882355, 0.005882355, 0.005882355, 0.005882355, 0.005882355, 0.005882355, 0.005882355, 0.005882355, 0.005882355, 0.005882355, 0.005882355, 0.005882355, 0.005882355, 0.005882355, 0.005882355, 0.005882355, 0.005882355, 0.005882355, 0.005882355, 0.005882355, 0.005882355, 0.005882355, 0.005882355, 0.005882355, 0.005882355, 0.005882355, 0.005882355, 0.005882355, 0.005882355, 0.005882355, 0.005882355, 0.005882355, 0.005882355, 0.005882355, 0.005882355, 0.005882355, 0.005882355, 0.005882355, 0.005882355, 0.005882355, 0.005882355, 0.005882355, 0.005882355, 0.005882355, 0.005882355, 0.005882355, 0.005882355, 0.005882355, 0.005882355, 0.005882355, 0.005882355, 0.005882355, 0.005882355, 0.005882355, 0.005882355, 0.005882355, 0.005882355, 0.005882355, 0.005882355, 0.005882355, 0.005882355, 0.005882355, 0.005882355, 0.005882355, 0.005882355, 0.005882355, 0.005882355, 0.005882355, 0.005882355, 0.005882355, 0.005882355], ([0.0, 0.0, 0.0, 7.505971343915021, 0.0, 24.333513501002678, 0.0, 0.0, 0.0, 7.500427930757266], [0.0, 0.0, 0.0, 6.273160519531394, 0.0, 23.683720229880173, 0.0, 0.0, 0.0, 5.534885869342017], 1.965542061415249))
[Thread 1] Total splits: 0
Processed 1 zonotopes (Work Done: 0.0%); Generated 0 (1.239048698s/loop)
[Thread 1] Finished in 1.24s
 ────────────────────────────────────────────────────────────────────────────────
                                        Time                    Allocations      
                               ───────────────────────   ────────────────────────
       Tot / % measured:            1.26s / 100.0%            452MiB / 100.0%    

 Section               ncalls     time    %tot     avg     alloc    %tot      avg
 ────────────────────────────────────────────────────────────────────────────────
 Verify                     1    1.24s   98.3%   1.24s    425MiB   94.0%   425MiB
   Zonotope Loop            1    1.24s   98.3%   1.24s    425MiB   94.0%   425MiB
     Zonotope Propa...      1    1.22s   96.4%   1.22s    403MiB   89.2%   403MiB
       DiffZonotope...      4    765ms   60.7%   191ms    351MiB   77.6%  87.8MiB
         Zonotope_R...      8    761ms   60.4%  95.1ms    351MiB   77.6%  43.9MiB
           Influenc...      8    447ms   35.5%  55.9ms    199MiB   44.1%  24.9MiB
             Multiply       8    411ms   32.6%  51.4ms    114MiB   25.2%  14.3MiB
             Alloca...      8   23.2ms    1.8%  2.90ms   85.2MiB   18.8%  10.7MiB
             Set Ma...      8   12.9ms    1.0%  1.61ms     0.00B    0.0%    0.00B
           Allocation       8    263ms   20.9%  32.9ms   75.6MiB   16.7%  9.45MiB
           Column M...      8   37.0ms    2.9%  4.62ms   75.6MiB   16.7%  9.45MiB
           Set Matrix       8   13.5ms    1.1%  1.69ms   80.9KiB    0.0%  10.1KiB
           Vectors          8    239μs    0.0%  29.9μs    272KiB    0.1%  34.0KiB
           Bounds           8   5.42μs    0.0%   677ns     0.00B    0.0%    0.00B
       DiffZonotope...      5    450ms   35.7%  90.0ms   52.3MiB   11.6%  10.5MiB
         Zonotope_D...     10    450ms   35.7%  45.0ms   52.3MiB   11.6%  5.23MiB
     Property Check         1   8.38ms    0.7%  8.38ms    720KiB    0.2%   720KiB
 Initialize                 1   21.2ms    1.7%  21.2ms   27.0MiB    6.0%  27.0MiB
 ────────────────────────────────────────────────────────────────────────────────
[VERYDIFF_TIMER] 1.347825827

[VERYDIFF_EXPERIMENT] NETWORK: /home/i57/steuber/NeuroDiff/repos/VeryDiffExperiments/src/../benchmarks/mnist-prune/specs/mnist_52_global_3.vnnlib
[VERYDIFF_EXPERIMENT] TIME: 2.529797149
