
[VERYDIFF_EXPERIMENT] Running on /home/i57/steuber/NeuroDiff/repos/VeryDiffExperiments/src/../benchmarks/mnist-prune/specs/mnist_72_global_4.vnnlib /home/i57/steuber/NeuroDiff/repos/VeryDiffExperiments/src/../benchmarks/mnist-prune/nets/mnist_relu_2_512.onnx
Parsing /home/i57/steuber/NeuroDiff/repos/VeryDiffExperiments/src/../benchmarks/mnist-prune/nets/mnist_relu_2_512.onnx...
Found input X
op: matmul, weight: (512, 784), bias: nothing
op: bias, weight: nothing, bias: (512,)
op: relu, weight: nothing, bias: nothing
op: matmul, weight: (512, 512), bias: nothing
op: bias, weight: nothing, bias: (512,)
op: relu, weight: nothing, bias: nothing
op: matmul, weight: (10, 512), bias: nothing
op: bias, weight: nothing, bias: (10,)
Parsing /home/i57/steuber/NeuroDiff/repos/VeryDiffExperiments/src/../benchmarks/mnist-prune/nets_pruned/mnist_relu_2_512_0.79-old.onnx...
Found input X
op: gemm, weight: (512, 784), bias: (512,)
op: relu, weight: nothing, bias: nothing
op: gemm, weight: (512, 512), bias: (512,)
op: relu, weight: nothing, bias: nothing
op: gemm, weight: (10, 512), bias: (10,)
Distance: 973.3044369037136
Distance: 481.63499746812613
Distance: 8.744412635378467
Running with 1 threads
[Thread 1] Time to first task: 0.01s
Instable Generators: 123
Instable Generators: 141
Zono Bounds:
[-5.384759686389199, -6.879797041575838, -4.75326442999055, -5.880850828472812, -7.200256567092252, -6.513520003723956, -6.282562115794185, -7.048545999321296, -5.937390757623329, -5.616942764806772]
[8.796419943344528, 8.102459047463329, 6.50555051767727, 6.932989025543946, 8.012155760067689, 5.74342883831754, 6.701877522658986, 6.15518339322596, 6.703424209228266, 7.326515280625201]
[Thread 1] Total splits: 0
Processed 1 zonotopes (Work Done: 100.0%); Generated 0 (0.629956237s/loop)
[Thread 1] Finished in 0.63s
 ────────────────────────────────────────────────────────────────────────────────
                                        Time                    Allocations      
                               ───────────────────────   ────────────────────────
       Tot / % measured:            632ms / 100.0%            218MiB / 100.0%    

 Section               ncalls     time    %tot     avg     alloc    %tot      avg
 ────────────────────────────────────────────────────────────────────────────────
 Verify                     1    630ms   99.7%   630ms    208MiB   95.5%   208MiB
   Zonotope Loop            1    630ms   99.6%   630ms    208MiB   95.5%   208MiB
     Property Check         1    410ms   64.8%   410ms   75.3MiB   34.6%  75.3MiB
     Zonotope Propa...      1    210ms   33.2%   210ms    113MiB   51.8%   113MiB
       DiffZonotope...      2    105ms   16.7%  52.6ms   91.7MiB   42.1%  45.8MiB
         Zonotope_R...      4   99.1ms   15.7%  24.8ms   80.6MiB   37.0%  20.2MiB
           Allocation       4   61.2ms    9.7%  15.3ms   15.2MiB    7.0%  3.81MiB
           Influenc...      4   30.6ms    4.8%  7.65ms   50.0MiB   23.0%  12.5MiB
             Multiply       4   25.1ms    4.0%  6.27ms   26.7MiB   12.3%  6.68MiB
             Set Ma...      4   3.09ms    0.5%   773μs     0.00B    0.0%    0.00B
             Alloca...      4   2.38ms    0.4%   594μs   23.3MiB   10.7%  5.83MiB
           Column M...      4   5.39ms    0.9%  1.35ms   15.2MiB    7.0%  3.81MiB
           Set Matrix       4   1.86ms    0.3%   464μs   15.5KiB    0.0%  3.87KiB
           Vectors          4   86.9μs    0.0%  21.7μs    100KiB    0.0%  25.0KiB
           Bounds           4   2.56μs    0.0%   640ns     0.00B    0.0%    0.00B
       DiffZonotope...      3    105ms   16.6%  35.0ms   21.1MiB    9.7%  7.03MiB
         Zonotope_D...      6   49.3ms    7.8%  8.22ms   13.4MiB    6.1%  2.23MiB
 Initialize                 1   2.19ms    0.3%  2.19ms   9.84MiB    4.5%  9.84MiB
 ────────────────────────────────────────────────────────────────────────────────
[VERYDIFF_TIMER] 0.664252895

[VERYDIFF_EXPERIMENT] NETWORK: /home/i57/steuber/NeuroDiff/repos/VeryDiffExperiments/src/../benchmarks/mnist-prune/specs/mnist_72_global_4.vnnlib
[VERYDIFF_EXPERIMENT] TIME: 0.968229283
