
[VERYDIFF_EXPERIMENT] Running on /home/i57/steuber/NeuroDiff/repos/VeryDiffExperiments/src/../benchmarks/mnist-prune/specs/mnist_11_local_18.vnnlib /home/i57/steuber/NeuroDiff/repos/VeryDiffExperiments/src/../benchmarks/mnist-prune/nets/mnist_relu_3_100.onnx
Total difference: 419.1098
Average difference: 0.0047
Initial output delta:
[-1.095547 -1.103476 -1.477096 -1.202035 -1.383189 -1.125991 -1.348310 -1.230483 -1.161157 -1.172586 ]
[1.321028 1.106902 1.105983 1.192292 1.352143 1.425974 1.453509 1.316298 1.118829 1.336750 ]

No adv!
time: 1.536569 


numSplits: 5
setenv(`timeout -k 5 120 ../NeuroDiff/DiffNN-Code/delta_network_test 411 /home/i57/steuber/NeuroDiff/repos/VeryDiffExperiments/src/../benchmarks/mnist-prune/nets/mnist_relu_3_100.nnet /home/i57/steuber/NeuroDiff/repos/VeryDiffExperiments/src/../benchmarks/mnist-prune/nets_pruned/mnist_relu_3_100_0.79_adam_1_stepsize.nnet 1.0 -x 18`,["OMP_NUM_THREADS=1"])
[VERYDIFF_TIMER] 1.58472993

[VERYDIFF_EXPERIMENT] NETWORK: /home/i57/steuber/NeuroDiff/repos/VeryDiffExperiments/src/../benchmarks/mnist-prune/specs/mnist_11_local_18.vnnlib
[VERYDIFF_EXPERIMENT] TIME: 1.935227131
