
[VERYDIFF_EXPERIMENT] Running on /home/i57/steuber/NeuroDiff/repos/VeryDiffExperiments/src/../benchmarks/mnist-prune/specs/mnist_85_global_4.vnnlib /home/i57/steuber/NeuroDiff/repos/VeryDiffExperiments/src/../benchmarks/mnist-prune/nets/mnist_relu_2_512.onnx
Found input X
op: matmul, weight: (512, 784), bias: nothing
op: bias, weight: nothing, bias: (512,)
op: relu, weight: nothing, bias: nothing
op: matmul, weight: (512, 512), bias: nothing
op: bias, weight: nothing, bias: (512,)
op: relu, weight: nothing, bias: nothing
op: matmul, weight: (10, 512), bias: nothing
op: bias, weight: nothing, bias: (10,)
Found input X
op: gemm, weight: (512, 784), bias: (512,)
op: relu, weight: nothing, bias: nothing
op: gemm, weight: (512, 512), bias: (512,)
op: relu, weight: nothing, bias: nothing
op: gemm, weight: (10, 512), bias: (10,)
Distance: 973.3044369037136
Distance: 481.63499746812613
Distance: 8.744412635378467
Running with 1 threads
[Thread 1] Time to first task: 0.01s
Instable Generators: 101
Instable Generators: 139
Zono Bounds:
[-5.412465821125543, -4.217825581430429, -4.81182226600042, -4.641079266817121, -4.284315276754849, -4.197088616109414, -4.424524804293769, -5.127831097181552, -4.164020279063073, -4.284798983519915]
[8.103343486175568, 5.843747842250515, 6.334028098785036, 6.440553272728907, 4.96233607729516, 5.680491557564573, 6.524537030394571, 6.635643984824421, 5.882996599531043, 6.430118759102037]
[Thread 1] Processed 100 zonotopes (Work Done: 0.0%; Expected Zonos: Inf)
[Thread 1] Processed 200 zonotopes (Work Done: 0.0%; Expected Zonos: Inf)
[Thread 1] Processed 300 zonotopes (Work Done: 0.0%; Expected Zonos: Inf)


TIMEOUT REACHED
UNKNOWN
[Thread 1] Total splits: 307
Processed 307 zonotopes (Work Done: 0.0%); Generated 614 (0.3914324028013029s/loop)
[Thread 1] Finished in 120.17s
 ────────────────────────────────────────────────────────────────────────────────
                                        Time                    Allocations      
                               ───────────────────────   ────────────────────────
       Tot / % measured:             120s / 100.0%           44.2GiB / 100.0%    

 Section               ncalls     time    %tot     avg     alloc    %tot      avg
 ────────────────────────────────────────────────────────────────────────────────
 Verify                     1     120s  100.0%    120s   44.2GiB  100.0%  44.2GiB
   Zonotope Loop            1     120s  100.0%    120s   44.2GiB  100.0%  44.2GiB
     Zonotope Propa...    307    94.9s   79.0%   309ms   32.9GiB   74.5%   110MiB
       DiffZonotope...    921    50.8s   42.3%  55.2ms   6.20GiB   14.0%  6.89MiB
         Zonotope_D...  1.84k    33.2s   27.6%  18.0ms   3.97GiB    9.0%  2.21MiB
       DiffZonotope...    614    44.1s   36.7%  71.8ms   26.7GiB   60.5%  44.6MiB
         Zonotope_R...  1.23k    37.5s   31.2%  30.6ms   23.6GiB   53.4%  19.7MiB
           Influenc...  1.23k    32.8s   27.3%  26.7ms   14.6GiB   33.1%  12.2MiB
             Multiply   1.23k    28.1s   23.3%  22.8ms   7.77GiB   17.6%  6.48MiB
             Alloca...  1.23k    3.82s    3.2%  3.11ms   6.84GiB   15.5%  5.71MiB
             Set Ma...  1.23k    914ms    0.8%   744μs     0.00B    0.0%    0.00B
           Column M...  1.23k    3.80s    3.2%  3.10ms   4.47GiB   10.1%  3.73MiB
           Set Matrix   1.23k    547ms    0.5%   445μs   4.34MiB    0.0%  3.62KiB
           Allocation   1.23k    346ms    0.3%   282μs   4.47GiB   10.1%  3.73MiB
           Vectors      1.23k   23.3ms    0.0%  19.0μs   29.9MiB    0.1%  25.0KiB
           Bounds       1.23k    919μs    0.0%   748ns     0.00B    0.0%    0.00B
     Compute Split        307    20.9s   17.4%  68.0ms   5.19GiB   11.8%  17.3MiB
     Property Check       307    948ms    0.8%  3.09ms   70.9MiB    0.2%   237KiB
 Initialize                 1   2.22ms    0.0%  2.22ms   9.84MiB    0.0%  9.84MiB
 ────────────────────────────────────────────────────────────────────────────────
[VERYDIFF_TIMER] 120.227167545

[VERYDIFF_EXPERIMENT] NETWORK: /home/i57/steuber/NeuroDiff/repos/VeryDiffExperiments/src/../benchmarks/mnist-prune/specs/mnist_85_global_4.vnnlib
[VERYDIFF_EXPERIMENT] TIME: 120.628158368
