
[VERYDIFF_EXPERIMENT] Running on /home/i57/steuber/NeuroDiff/repos/VeryDiffExperiments/src/../benchmarks/mnist-prune/specs/mnist_73_local_18.vnnlib /home/i57/steuber/NeuroDiff/repos/VeryDiffExperiments/src/../benchmarks/mnist-prune/nets/mnist_relu_2_512.onnx
Loading /home/i57/steuber/NeuroDiff/repos/VeryDiffExperiments/src/../benchmarks/mnist-prune/nets/mnist_relu_2_512.onnx and /home/i57/steuber/NeuroDiff/repos/VeryDiffExperiments/src/../benchmarks/mnist-prune/nets_pruned/mnist_relu_2_512_pruned5.onnx
INPUT SHAPE: 784
Refined: 6 | Refine Limit: 2 | Wrong: 0 | Right: 2 | Total: 2 | Total Zonos Considered: 8 | Expected 51 (3.9215686274509802%)Refined: 14 | Refine Limit: 13 | Wrong: 0 | Right: 5 | Total: 5 | Total Zonos Considered: 19 | Expected 127 (3.937007874015748%)Refined: 21 | Refine Limit: 17 | Wrong: 0 | Right: 10 | Total: 10 | Total Zonos Considered: 31 | Expected 255 (3.9215686274509802%)Refined: 21 | Refine Limit: 8 | Wrong: 0 | Right: 28 | Total: 28 | Total Zonos Considered: 49 | Expected 714 (3.9215686274509802%)Refined: 28 | Refine Limit: 12 | Wrong: 0 | Right: 32 | Total: 32 | Total Zonos Considered: 60 | Expected 816 (3.9215686274509802%)Refined: 34 | Refine Limit: 14 | Wrong: 0 | Right: 43 | Total: 43 | Total Zonos Considered: 77 | Expected 1096 (3.923357664233577%)Refined: 36 | Refine Limit: 6 | Wrong: 0 | Right: 56 | Total: 56 | Total Zonos Considered: 92 | Expected 1419 (3.9464411557434813%)Refined: 43 | Refine Limit: 13 | Wrong: 0 | Right: 58 | Total: 58 | Total Zonos Considered: 101 | Expected 1469 (3.9482641252552755%)Refined: 52 | Refine Limit: 19 | Wrong: 0 | Right: 61 | Total: 61 | Total Zonos Considered: 113 | Expected 1545 (3.9482200647249193%)Refined: 57 | Refine Limit: 23 | Wrong: 0 | Right: 73 | Total: 73 | Total Zonos Considered: 130 | Expected 1849 (3.9480800432666308%)Refined: 62 | Refine Limit: 22 | Wrong: 0 | Right: 85 | Total: 85 | Total Zonos Considered: 147 | Expected 2153 (3.9479795633999073%)Refined: 67 | Refine Limit: 18 | Wrong: 0 | Right: 100 | Total: 100 | Total Zonos Considered: 167 | Expected 2534 (3.946329913180742%)Refined: 73 | Refine Limit: 23 | Wrong: 0 | Right: 106 | Total: 106 | Total Zonos Considered: 179 | Expected 2686 (3.9463886820551006%)Refined: 76 | Refine Limit: 14 | Wrong: 0 | Right: 123 | Total: 123 | Total Zonos Considered: 199 | Expected 3116 (3.9473684210526314%)Refined: 84 | Refine Limit: 23 | Wrong: 0 | Right: 127 | Total: 127 | Total Zonos Considered: 211 | Expected 3218 (3.946550652579242%)Refined: 89 | Refine Limit: 23 | Wrong: 0 | Right: 138 | Total: 138 | Total Zonos Considered: 227 | Expected 3496 (3.9473684210526314%)Refined: 95 | Refine Limit: 28 | Wrong: 0 | Right: 145 | Total: 145 | Total Zonos Considered: 240 | Expected 3674 (3.9466521502449647%)Refined: 98 | Refine Limit: 16 | Wrong: 0 | Right: 166 | Total: 166 | Total Zonos Considered: 264 | Expected 4206 (3.946742748454589%)Refined: 103 | Refine Limit: 17 | Wrong: 0 | Right: 175 | Total: 175 | Total Zonos Considered: 278 | Expected 4434 (3.946774921064502%)Refined: 110 | Refine Limit: 21 | Wrong: 0 | Right: 184 | Total: 184 | Total Zonos Considered: 294 | Expected 4662 (3.9468039468039464%)Refined: 115 | Refine Limit: 14 | Wrong: 0 | Right: 199 | Total: 199 | Total Zonos Considered: 314 | Expected 5042 (3.946846489488298%)Refined: 120 | Refine Limit: 14 | Wrong: 0 | Right: 208 | Total: 208 | Total Zonos Considered: 328 | Expected 5270 (3.9468690702087286%)Refined: 127 | Refine Limit: 24 | Wrong: 0 | Right: 213 | Total: 213 | Total Zonos Considered: 340 | Expected 5397 (3.9466370205669814%)Refined: 133 | Refine Limit: 24 | Wrong: 0 | Right: 224 | Total: 224 | Total Zonos Considered: 357 | Expected 5676 (3.9464411557434813%)Refined: 136 | Refine Limit: 14 | Wrong: 0 | Right: 245 | Total: 245 | Total Zonos Considered: 381 | Expected 6208 (3.946520618556701%)Refined: 141 | Refine Limit: 14 | Wrong: 0 | Right: 254 | Total: 254 | Total Zonos Considered: 395 | Expected 6436 (3.946550652579242%)Refined: 145 | Refine Limit: 13 | Wrong: 0 | Right: 267 | Total: 267 | Total Zonos Considered: 412 | Expected 6765 (3.9467849223946785%)Refined: 154 | Refine Limit: 22 | Wrong: 0 | Right: 271 | Total: 271 | Total Zonos Considered: 425 | Expected 6867 (3.946410368428717%)Refined: 154 | Refine Limit: 8 | Wrong: 0 | Right: 296 | Total: 296 | Total Zonos Considered: 450 | Expected 7497 (3.948245965052688%)Refined: 162 | Refine Limit: 14 | Wrong: 0 | Right: 298 | Total: 298 | Total Zonos Considered: 460 | Expected 7546 (3.9491121123774184%)Refined: 169 | Refine Limit: 21 | Wrong: 0 | Right: 302 | Total: 302 | Total Zonos Considered: 471 | Expected 7648 (3.948744769874477%)Refined: 175 | Refine Limit: 23 | Wrong: 0 | Right: 314 | Total: 314 | Total Zonos Considered: 489 | Expected 7951 (3.949188781285373%)Refined: 180 | Refine Limit: 17 | Wrong: 0 | Right: 330 | Total: 330 | Total Zonos Considered: 510 | Expected 8357 (3.9487854493239203%)Refined: 185 | Refine Limit: 18 | Wrong: 0 | Right: 342 | Total: 342 | Total Zonos Considered: 527 | Expected 8661 (3.9487357118115693%)Refined: 193 | Refine Limit: 19 | Wrong: 0 | Right: 347 | Total: 347 | Total Zonos Considered: 540 | Expected 8787 (3.9490155912142937%)Refined: 199 | Refine Limit: 23 | Wrong: 0 | Right: 358 | Total: 358 | Total Zonos Considered: 557 | Expected 9066 (3.9488197661592763%)Refined: 204 | Refine Limit: 23 | Wrong: 0 | Right: 372 | Total: 372 | Total Zonos Considered: 576 | Expected 9420 (3.949044585987261%)Refined: 210 | Refine Limit: 27 | Wrong: 0 | Right: 378 | Total: 378 | Total Zonos Considered: 588 | Expected 9572 (3.949017969076473%)Refined: 212 | Refine Limit: 14 | Wrong: 0 | Right: 402 | Total: 402 | Total Zonos Considered: 614 | Expected 10180 (3.948919449901768%)UNKNOWN
TIMEOUT
Refined: 216 | Refine Limit: 14 | Wrong: 0 | Right: 404 | Total: 404 | Total Zonos Considered: 620 | Expected 10231 (3.94878311015541%)

time: 121.716899527

[VERYDIFF_TIMER] 121.741159228

[VERYDIFF_EXPERIMENT] Running on /home/i57/steuber/NeuroDiff/repos/VeryDiffExperiments/src/../benchmarks/mnist-prune/specs/mnist_73_local_18.vnnlib /home/i57/steuber/NeuroDiff/repos/VeryDiffExperiments/src/../benchmarks/mnist-prune/nets/mnist_relu_3_100.onnx
Loading /home/i57/steuber/NeuroDiff/repos/VeryDiffExperiments/src/../benchmarks/mnist-prune/nets/mnist_relu_3_100.onnx and /home/i57/steuber/NeuroDiff/repos/VeryDiffExperiments/src/../benchmarks/mnist-prune/nets_pruned/mnist_relu_3_100_pruned5.onnx
INPUT SHAPE: 784
Skipping 0 row

[NEQUIV] 0

[0.         0.05273295 0.         0.17772768 2.08060929 0.
 0.         8.29572953 0.76707235 8.21009931]
[0.         0.         0.         0.         2.14886213 0.
 0.         7.70550021 0.50089066 8.05442989]
NETWORKS NOT EQUIVALENT
Refined: 0 | Refine Limit: -1 | Wrong: 0 | Right: 1 | Total: 1 | Total Zonos Considered: 1 | Expected 2 (50.0%)

time: 0.345838836

[VERYDIFF_TIMER] 0.377663744

[VERYDIFF_EXPERIMENT] NETWORK: /home/i57/steuber/NeuroDiff/repos/VeryDiffExperiments/src/../benchmarks/mnist-prune/specs/mnist_73_local_18.vnnlib
[VERYDIFF_EXPERIMENT] TIME: 122.687015416
