
[VERYDIFF_EXPERIMENT] Running on /home/i57/steuber/NeuroDiff/repos/VeryDiffExperiments/src/../benchmarks/mnist-prune/specs/mnist_1_local_24.vnnlib /home/i57/steuber/NeuroDiff/repos/VeryDiffExperiments/src/../benchmarks/mnist-prune/nets/mnist_relu_3_100.onnx
Found input X
op: matmul, weight: (100, 784), bias: nothing
op: bias, weight: nothing, bias: (100,)
op: relu, weight: nothing, bias: nothing
op: matmul, weight: (100, 100), bias: nothing
op: bias, weight: nothing, bias: (100,)
op: relu, weight: nothing, bias: nothing
op: matmul, weight: (10, 100), bias: nothing
op: bias, weight: nothing, bias: (10,)
op: relu, weight: nothing, bias: nothing
op: matmul, weight: (10, 10), bias: nothing
op: bias, weight: nothing, bias: (10,)
Found input X
op: gemm, weight: (100, 784), bias: (100,)
op: relu, weight: nothing, bias: nothing
op: gemm, weight: (100, 100), bias: (100,)
op: relu, weight: nothing, bias: nothing
op: gemm, weight: (10, 100), bias: (10,)
op: relu, weight: nothing, bias: nothing
op: gemm, weight: (10, 10), bias: (10,)
Distance: 368.62397500800625
Distance: 47.56803950402309
Distance: 2.8977568827249343
Distance: 0.01885471428334995
Running with 1 threads
[Thread 1] Time to first task: 0.0s
Instable Generators: 38
Instable Generators: 41
Instable Generators: 6
Zono Bounds:
[-1.5022214169565962, -1.0600438839931272, -1.419742360056201, -1.429459868479235, -0.0016850483888717488, -1.8676581554598033, -1.559980006303649, -0.0017220775619531262, -1.432154617370073, -0.0034726689679314966]
[1.497616333625581, 1.00415413210874, 1.4944826708390295, 1.3640223360094497, 0.001311968783914405, 1.7951469507079265, 1.464252163444805, 0.004178549172245267, 1.3586542536295383, 0.0014710332355833736]
[Thread 1] Processed 100 zonotopes (Work Done: 0.0%; Expected Zonos: Inf)
[Thread 1] Processed 200 zonotopes (Work Done: 0.0%; Expected Zonos: Inf)
[Thread 1] Processed 300 zonotopes (Work Done: 0.78125%; Expected Zonos: 38400.0)
[Thread 1] Processed 400 zonotopes (Work Done: 1.75781%; Expected Zonos: 22755.555555555555)
[Thread 1] Processed 500 zonotopes (Work Done: 4.78516%; Expected Zonos: 10448.979591836734)
[Thread 1] Processed 600 zonotopes (Work Done: 9.57031%; Expected Zonos: 6269.3877551020405)
[Thread 1] Processed 700 zonotopes (Work Done: 16.30859%; Expected Zonos: 4292.215568862275)
[Thread 1] Processed 800 zonotopes (Work Done: 24.26758%; Expected Zonos: 3296.579476861167)
[Thread 1] Processed 900 zonotopes (Work Done: 36.52344%; Expected Zonos: 2464.1711229946523)
[Thread 1] Processed 1000 zonotopes (Work Done: 47.36328%; Expected Zonos: 2111.340206185567)
[Thread 1] Processed 1100 zonotopes (Work Done: 59.61914%; Expected Zonos: 1845.045045045045)
[Thread 1] Processed 1200 zonotopes (Work Done: 71.38672%; Expected Zonos: 1680.984952120383)
[Thread 1] Processed 1300 zonotopes (Work Done: 82.42188%; Expected Zonos: 1577.2511848341233)
[Thread 1] Processed 1400 zonotopes (Work Done: 91.60156%; Expected Zonos: 1528.358208955224)
[Thread 1] Total splits: 741
Processed 1483 zonotopes (Work Done: 100.0%); Generated 1482 (0.001977855675657451s/loop)
[Thread 1] Finished in 2.93s
 ────────────────────────────────────────────────────────────────────────────────
                                        Time                    Allocations      
                               ───────────────────────   ────────────────────────
       Tot / % measured:            2.93s / 100.0%           3.53GiB / 100.0%    

 Section               ncalls     time    %tot     avg     alloc    %tot      avg
 ────────────────────────────────────────────────────────────────────────────────
 Verify                     1    2.93s  100.0%   2.93s   3.53GiB  100.0%  3.53GiB
   Zonotope Loop            1    2.93s  100.0%   2.93s   3.53GiB  100.0%  3.53GiB
     Zonotope Propa...  1.48k    2.28s   77.6%  1.53ms   2.01GiB   57.0%  1.39MiB
       DiffZonotope...  5.93k    1.35s   46.0%   228μs    454MiB   12.6%  78.4KiB
         Zonotope_D...  11.9k    606ms   20.6%  51.1μs    236MiB    6.5%  20.4KiB
       DiffZonotope...  4.45k    917ms   31.2%   206μs   1.57GiB   44.4%   370KiB
         Zonotope_R...  8.90k    582ms   19.8%  65.4μs   1.05GiB   29.7%   123KiB
           Allocation   8.90k    270ms    9.2%  30.4μs    350MiB    9.7%  40.3KiB
           Influenc...  8.90k    131ms    4.5%  14.7μs    336MiB    9.3%  38.6KiB
             Multiply   8.90k   95.0ms    3.2%  10.7μs    205MiB    5.7%  23.6KiB
             Alloca...  8.90k   21.8ms    0.7%  2.45μs    131MiB    3.6%  15.0KiB
             Set Ma...  8.90k   9.53ms    0.3%  1.07μs     0.00B    0.0%    0.00B
           Column M...  8.90k    117ms    4.0%  13.2μs    351MiB    9.7%  40.4KiB
           Set Matrix   8.90k   33.5ms    1.1%  3.76μs   7.53MiB    0.2%     888B
           Vectors      8.90k   21.0ms    0.7%  2.36μs   28.3MiB    0.8%  3.26KiB
           Bounds       8.90k   1.82ms    0.1%   204ns     0.00B    0.0%    0.00B
     Property Check     1.48k    103ms    3.5%  69.4μs   48.6MiB    1.3%  33.6KiB
     Compute Split        741   42.3ms    1.4%  57.0μs    159MiB    4.4%   220KiB
 Initialize                 1    337μs    0.0%   337μs    876KiB    0.0%   876KiB
 ────────────────────────────────────────────────────────────────────────────────
[VERYDIFF_TIMER] 2.962889612

[VERYDIFF_EXPERIMENT] NETWORK: /home/i57/steuber/NeuroDiff/repos/VeryDiffExperiments/src/../benchmarks/mnist-prune/specs/mnist_1_local_24.vnnlib
[VERYDIFF_EXPERIMENT] TIME: 3.265498019
