
[VERYDIFF_EXPERIMENT] Running on /home/i57/steuber/NeuroDiff/repos/VeryDiffExperiments/src/../benchmarks/mnist-prune/specs/mnist_60_global_3.vnnlib /home/i57/steuber/NeuroDiff/repos/VeryDiffExperiments/src/../benchmarks/mnist-prune/nets/mnist_relu_4_1024.onnx
Found input X
op: matmul, weight: (1024, 784), bias: nothing
op: bias, weight: nothing, bias: (1024,)
op: relu, weight: nothing, bias: nothing
op: matmul, weight: (1024, 1024), bias: nothing
op: bias, weight: nothing, bias: (1024,)
op: relu, weight: nothing, bias: nothing
op: matmul, weight: (1024, 1024), bias: nothing
op: bias, weight: nothing, bias: (1024,)
op: relu, weight: nothing, bias: nothing
op: matmul, weight: (10, 1024), bias: nothing
op: bias, weight: nothing, bias: (10,)
op: relu, weight: nothing, bias: nothing
op: matmul, weight: (10, 10), bias: nothing
op: bias, weight: nothing, bias: (10,)
Found input X
op: gemm, weight: (1024, 784), bias: (1024,)
op: relu, weight: nothing, bias: nothing
op: gemm, weight: (1024, 1024), bias: (1024,)
op: relu, weight: nothing, bias: nothing
op: gemm, weight: (1024, 1024), bias: (1024,)
op: relu, weight: nothing, bias: nothing
op: gemm, weight: (10, 1024), bias: (10,)
op: relu, weight: nothing, bias: nothing
op: gemm, weight: (10, 10), bias: (10,)
Distance: 915.6394868631054
Distance: 1298.7052820973968
Distance: 1296.587532894263
Distance: 6.054483317080667
Distance: 0.04942679278974538
Running with 1 threads
[Thread 1] Time to first task: 0.0s
Instable Generators: 215
Instable Generators: 274
Instable Generators: 427
Instable Generators: 5
Zono Bounds:
[-11.363576743764266, -11.253736481972313, -12.75321455208738, -13.083255699663058, -0.007754103748934893, -13.511822394655937, -0.003986284439287028, -11.35643562270896, -0.00040991130343068834, -12.819941423150597]
[11.096781836705627, 11.187814589559869, 12.739264999213786, 12.869121971789633, -0.003958036933425297, 13.494416641403646, 0.004881072446194557, 11.54575134245608, 0.014266388726178397, 12.731400323336755]


TIMEOUT REACHED
UNKNOWN
[Thread 1] Total splits: 70
Processed 70 zonotopes (Work Done: 0.0%); Generated 140 (1.736490391442857s/loop)
[Thread 1] Finished in 121.55s
 ────────────────────────────────────────────────────────────────────────────────
                                        Time                    Allocations      
                               ───────────────────────   ────────────────────────
       Tot / % measured:             122s / 100.0%           31.6GiB / 100.0%    

 Section               ncalls     time    %tot     avg     alloc    %tot      avg
 ────────────────────────────────────────────────────────────────────────────────
 Verify                     1     122s  100.0%    122s   31.6GiB   99.9%  31.6GiB
   Zonotope Loop            1     122s  100.0%    122s   31.6GiB   99.9%  31.6GiB
     Zonotope Propa...     70     103s   84.5%   1.47s   28.5GiB   90.0%   416MiB
       DiffZonotope...    350    58.5s   48.1%   167ms   5.72GiB   18.1%  16.7MiB
         Zonotope_D...    700    34.5s   28.4%  49.3ms   3.30GiB   10.5%  4.83MiB
       DiffZonotope...    280    44.2s   36.3%   158ms   22.7GiB   71.9%  83.1MiB
         Zonotope_R...    560    32.7s   26.9%  58.4ms   18.8GiB   59.4%  34.4MiB
           Influenc...    560    28.9s   23.8%  51.7ms   10.3GiB   32.5%  18.8MiB
             Alloca...    560    16.9s   13.9%  30.3ms   4.62GiB   14.6%  8.45MiB
             Multiply     560    11.3s    9.3%  20.1ms   5.65GiB   17.9%  10.3MiB
             Set Ma...    560    718ms    0.6%  1.28ms     0.00B    0.0%    0.00B
           Column M...    560    2.76s    2.3%  4.92ms   4.25GiB   13.4%  7.77MiB
           Set Matrix     560    716ms    0.6%  1.28ms   3.58MiB    0.0%  6.55KiB
           Allocation     560    286ms    0.2%   510μs   4.25GiB   13.4%  7.77MiB
           Vectors        560   16.7ms    0.0%  29.9μs   18.6MiB    0.1%  34.0KiB
           Bounds         560    411μs    0.0%   734ns     0.00B    0.0%    0.00B
     Compute Split         70    18.1s   14.9%   259ms   1.74GiB    5.5%  25.4MiB
     Property Check        70    498ms    0.4%  7.11ms   32.6MiB    0.1%   476KiB
 Initialize                 1   14.5ms    0.0%  14.5ms   27.0MiB    0.1%  27.0MiB
 ────────────────────────────────────────────────────────────────────────────────
[VERYDIFF_TIMER] 121.647309758

[VERYDIFF_EXPERIMENT] NETWORK: /home/i57/steuber/NeuroDiff/repos/VeryDiffExperiments/src/../benchmarks/mnist-prune/specs/mnist_60_global_3.vnnlib
[VERYDIFF_EXPERIMENT] TIME: 121.992260087
