
[VERYDIFF_EXPERIMENT] Running on /home/i57/steuber/NeuroDiff/repos/VeryDiffExperiments/src/../benchmarks/mnist-prune/specs/mnist_94_global_5.vnnlib /home/i57/steuber/NeuroDiff/repos/VeryDiffExperiments/src/../benchmarks/mnist-prune/nets/mnist_relu_2_512.onnx
Found input X
op: matmul, weight: (512, 784), bias: nothing
op: bias, weight: nothing, bias: (512,)
op: relu, weight: nothing, bias: nothing
op: matmul, weight: (512, 512), bias: nothing
op: bias, weight: nothing, bias: (512,)
op: relu, weight: nothing, bias: nothing
op: matmul, weight: (10, 512), bias: nothing
op: bias, weight: nothing, bias: (10,)
Found input X
op: matmul, weight: (512, 784), bias: nothing
op: bias, weight: nothing, bias: (512,)
op: relu, weight: nothing, bias: nothing
op: matmul, weight: (512, 512), bias: nothing
op: bias, weight: nothing, bias: (512,)
op: relu, weight: nothing, bias: nothing
op: matmul, weight: (10, 512), bias: nothing
op: bias, weight: nothing, bias: (10,)
Distance: 1085.5985166831802
Distance: 1719.8468985003963
Distance: 31.228482716001736
Running with 1 threads
[Thread 1] Time to first task: 0.02s
Instable Generators: 127
Instable Generators: 284
Zono Bounds:
[-9.455568418171943, -4.800154773498515, -6.67842934792701, -7.640044338752689, -8.10793738944179, -8.056696651464064, -8.309272356103719, -8.406107407961361, -2.9846276787902877, -6.443467301270995]
[9.437641610354468, 13.257067620218631, 7.841172825008308, 8.140086913630746, 7.377870554056874, 5.683842025453932, 6.30156641972556, 8.288996182654028, 9.71241047249995, 7.2164190248226925]

Found counterexample: ([0.01960784, 0.0, 0.0, 0.01960784, 0.0, 0.01960784, 0.01960784, 0.01960784, 0.01960784, 0.01960784, 0.0, 0.0, 0.0, 0.01960784, 0.0, 0.01960784, 0.0, 0.01960784, 0.01960784, 0.01960784, 0.0, 0.0, 0.0, 0.0, 0.0, 0.01960784, 0.0, 0.0, 0.01960784, 0.0, 0.01960784, 0.0, 0.0, 0.01960784, 0.0, 0.01960784, 0.0, 0.01960784, 0.01960784, 0.01960784, 0.01960784, 0.01960784, 0.0, 0.0, 0.01960784, 0.01960784, 0.01960784, 0.01960784, 0.01960784, 0.01960784, 0.01960784, 0.0, 0.0, 0.0, 0.01960784, 0.0, 0.0, 0.0, 0.01960784, 0.0, 0.01960784, 0.01960784, 0.01960784, 0.01960784, 0.01960784, 0.01960784, 0.01960784, 0.01960784, 0.01960784, 0.0, 0.0, 0.01960784, 0.0, 0.01960784, 0.01960784, 0.01960784, 0.01960784, 0.01960784, 0.01960784, 0.01960784, 0.01960784, 0.01960784, 0.0, 0.0, 0.0, 0.01960784, 0.0, 0.0, 0.01960784, 0.01960784, 0.01960784, 0.01960784, 0.01960784, 0.01960784, 0.01960784, 0.01960784, 0.01960784, 0.01960784, 0.01960784, 0.01960784, 0.0, 0.0, 0.0, 0.01960784, 0.01960784, 0.01960784, 0.01960784, 0.01960784, 0.01960784, 0.01960784, 0.01960784, 0.0, 0.01960784, 0.0, 0.0, 0.0, 0.0, 0.0, 0.01960784, 0.0, 0.0, 0.01960784, 0.01960784, 0.34117648, 0.97254902, 0.97254902, 0.97254902, 0.01960784, 0.01960784, 0.01960784, 0.01960784, 0.01960784, 0.01960784, 0.01960784, 0.0, 0.0, 0.01960784, 0.01960784, 0.01960784, 0.01960784, 0.01960784, 0.0, 0.0, 0.0, 0.0, 0.0, 0.01960784, 0.01960784, 0.01960784, 0.01960784, 0.01960784, 0.7647059, 0.9999999999999999, 0.9999999999999999, 0.9999999999999999, 0.0, 0.0, 0.01960784, 0.01960784, 0.01960784, 0.01960784, 0.01960784, 0.0, 0.01960784, 0.01960784, 0.01960784, 0.01960784, 0.01960784, 0.01960784, 0.01960784, 0.01960784, 0.01960784, 0.01960784, 0.01960784, 0.01960784, 0.01960784, 0.01960784, 0.01960784, 0.01960784, 0.7647059, 0.9999999999999999, 0.96470588, 0.96470588, 0.01960784, 0.01960784, 0.01960784, 0.01960784, 0.01960784, 0.01960784, 0.01960784, 0.01960784, 0.01960784, 0.01960784, 0.01960784, 0.01960784, 0.01960784, 0.01960784, 0.01960784, 0.01960784, 0.0, 0.01960784, 0.01960784, 0.01960784, 0.0, 0.01960784, 0.01960784, 0.01960784, 0.7647059, 0.96470588, 0.96470588, 0.96470588, 0.0, 0.0, 0.01960784, 0.01960784, 0.01960784, 0.01960784, 0.01960784, 0.01960784, 0.01960784, 0.01960784, 0.01960784, 0.01960784, 0.0, 0.01960784, 0.0, 0.01960784, 0.01960784, 0.0, 0.01960784, 0.0, 0.0, 0.01960784, 0.01960784, 0.0, 0.7647059, 0.96470588, 0.96470588, 0.96470588, 0.0, 0.0, 0.01960784, 0.01960784, 0.01960784, 0.01960784, 0.01960784, 0.0, 0.01960784, 0.01960784, 0.01960784, 0.01960784, 0.01960784, 0.01960784, 0.0, 0.01960784, 0.0, 0.01960784, 0.0, 0.0, 0.0, 0.0, 0.01960784, 0.0, 0.72941178, 0.97254902, 0.97254902, 0.97254902, 0.74509805, 0.11372549, 0.01960784, 0.01960784, 0.01960784, 0.01960784, 0.01960784, 0.0, 0.0, 0.01960784, 0.0, 0.01960784, 0.0, 0.01960784, 0.0, 0.01960784, 0.01960784, 0.01960784, 0.01960784, 0.0, 0.0, 0.01960784, 0.01960784, 0.0, 0.72549021, 0.96470588, 0.96470588, 0.96470588, 0.97254902, 0.26274511, 0.01960784, 0.01960784, 0.01960784, 0.01960784, 0.01960784, 0.0, 0.0, 0.01960784, 0.0, 0.0, 0.0, 0.0, 0.0, 0.0, 0.01960784, 0.0, 0.0, 0.01960784, 0.01960784, 0.01960784, 0.01960784, 0.01960784, 0.7647059, 0.9999999999999999, 0.96470588, 0.96470588, 1.0, 0.57254905, 0.01960784, 0.01960784, 0.01960784, 0.01960784, 0.0, 0.0, 0.0, 0.01960784, 0.0, 0.01960784, 0.0, 0.0, 0.01960784, 0.0, 0.01960784, 0.01960784, 0.01960784, 0.01960784, 0.01960784, 0.01960784, 0.01960784, 0.01960784, 0.21960784000000003, 0.9999999999999999, 0.96470588, 0.9999999999999999, 0.97254902, 0.88235295, 0.01960784, 0.01960784, 0.01960784, 0.01960784, 0.01960784, 0.0, 0.01960784, 0.01960784, 0.0, 0.0, 0.0, 0.0, 0.0, 0.0, 0.01960784, 0.0, 0.01960784, 0.01960784, 0.0, 0.01960784, 0.01960784, 0.01960784, 0.14509804999999998, 0.9999999999999999, 0.9999999999999999, 0.96470588, 1.0, 0.84313726, 0.0, 0.01960784, 0.01960784, 0.01960784, 0.01960784, 0.01960784, 0.01960784, 0.01960784, 0.0, 0.0, 0.01960784, 0.01960784, 0.0, 0.0, 0.0, 0.0, 0.01960784, 0.01960784, 0.01960784, 0.01960784, 0.01960784, 0.01960784, 0.06666667, 0.7019608, 1.0, 0.97254902, 1.0, 0.84705883, 0.01960784, 0.01960784, 0.01960784, 0.01960784, 0.01960784, 0.01960784, 0.0, 0.0, 0.01960784, 0.0, 0.01960784, 0.0, 0.01960784, 0.0, 0.01960784, 0.01960784, 0.01960784, 0.01960784, 0.01960784, 0.01960784, 0.01960784, 0.01960784, 0.14509804999999998, 0.9999999999999999, 0.96470588, 0.96470588, 1.0, 0.88235295, 0.01960784, 0.01960784, 0.01960784, 0.01960784, 0.0, 0.01960784, 0.01960784, 0.01960784, 0.01960784, 0.0, 0.0, 0.01960784, 0.0, 0.0, 0.01960784, 0.01960784, 0.01960784, 0.01960784, 0.01960784, 0.01960784, 0.0, 0.01960784, 0.14509804999999998, 0.9999999999999999, 0.96470588, 0.96470588, 1.0, 0.84313726, 0.01960784, 0.01960784, 0.01960784, 0.01960784, 0.01960784, 0.01960784, 0.01960784, 0.0, 0.01960784, 0.0, 0.0, 0.0, 0.01960784, 0.0, 0.01960784, 0.01960784, 0.01960784, 0.01960784, 0.01960784, 0.0, 0.01960784, 0.01960784, 0.14509804999999998, 0.9999999999999999, 0.96470588, 0.96470588, 0.97254902, 0.88235295, 0.01960784, 0.01960784, 0.01960784, 0.01960784, 0.0, 0.0, 0.01960784, 0.01960784, 0.01960784, 0.01960784, 0.0, 0.0, 0.01960784, 0.01960784, 0.0, 0.01960784, 0.01960784, 0.0, 0.0, 0.01960784, 0.0, 0.01960784, 0.14509804999999998, 0.9999999999999999, 0.9999999999999999, 0.96470588, 0.97254902, 0.84313726, 0.01960784, 0.0, 0.01960784, 0.01960784, 0.0, 0.0, 0.0, 0.01960784, 0.0, 0.0, 0.0, 0.0, 0.0, 0.0, 0.0, 0.0, 0.0, 0.0, 0.0, 0.0, 0.0, 0.01960784, 0.09803922, 0.8274509900000001, 0.97254902, 0.97254902, 0.98039216, 1.0, 0.5137255199999999, 0.01960784, 0.01960784, 0.0, 0.01960784, 0.01960784, 0.0, 0.01960784, 0.0, 0.01960784, 0.0, 0.01960784, 0.01960784, 0.0, 0.0, 0.0, 0.0, 0.0, 0.0, 0.01960784, 0.0, 0.01960784, 0.01960784, 0.14509804999999998, 0.87843138, 0.96470588, 0.97254902, 0.96470588, 0.47450981, 0.0, 0.01960784, 0.0, 0.01960784, 0.01960784, 0.01960784, 0.0, 0.0, 0.01960784, 0.01960784, 0.01960784, 0.0, 0.0, 0.01960784, 0.01960784, 0.01960784, 0.0, 0.0, 0.0, 0.0, 0.0, 0.0, 0.0, 0.8862745200000001, 0.9999999999999999, 0.97254902, 0.96470588, 0.7568627600000001, 0.35294119, 0.0, 0.0, 0.01960784, 0.01960784, 0.01960784, 0.0, 0.0, 0.0, 0.0, 0.0, 0.0, 0.01960784, 0.01960784, 0.0, 0.0, 0.0, 0.0, 0.0, 0.0, 0.0, 0.0, 0.01960784, 0.7294117800000001, 0.84705883, 1.0, 0.96470588, 0.96470588, 0.71764708, 0.0, 0.0, 0.0, 0.01960784, 0.01960784, 0.0, 0.0, 0.0, 0.0, 0.01960784, 0.0, 0.0, 0.01960784, 0.01960784, 0.0, 0.0, 0.01960784, 0.0, 0.0, 0.0, 0.0, 0.0, 0.11372549, 0.15686274999999997, 0.58039218, 0.96470588, 0.96470588, 0.32941177, 0.0, 0.0, 0.01960784, 0.01960784, 0.01960784, 0.01960784, 0.01960784, 0.0, 0.01960784, 0.01960784, 0.0, 0.01960784, 0.0, 0.01960784, 0.0, 0.0, 0.0, 0.0, 0.0, 0.0, 0.0, 0.01960784, 0.01960784, 0.01960784, 0.0, 0.01960784, 0.0, 0.0, 0.01960784, 0.01960784, 0.01960784, 0.01960784, 0.01960784, 0.0, 0.0, 0.0, 0.01960784, 0.0, 0.01960784, 0.0, 0.01960784, 0.01960784, 0.01960784, 0.0, 0.01960784, 0.0, 0.01960784, 0.01960784, 0.01960784, 0.01960784, 0.01960784, 0.01960784, 0.01960784, 0.01960784, 0.01960784, 0.01960784, 0.01960784, 0.01960784, 0.01960784, 0.01960784, 0.01960784, 0.01960784, 0.01960784, 0.01960784, 0.01960784, 0.01960784, 0.0, 0.0, 0.0, 0.01960784, 0.01960784, 0.01960784, 0.01960784, 0.01960784, 0.0, 0.01960784, 0.01960784, 0.01960784, 0.01960784, 0.01960784, 0.01960784, 0.01960784, 0.01960784, 0.01960784, 0.01960784, 0.01960784, 0.01960784, 0.01960784, 0.01960784, 0.01960784, 0.01960784, 0.01960784, 0.0, 0.0, 0.0, 0.0, 0.01960784, 0.0, 0.01960784, 0.01960784, 0.01960784, 0.01960784, 0.01960784, 0.01960784, 0.01960784, 0.01960784, 0.0, 0.01960784, 0.01960784, 0.01960784, 0.0, 0.01960784, 0.01960784, 0.01960784, 0.01960784, 0.0, 0.0, 0.01960784, 0.01960784, 0.0, 0.0], ([-81.68849027406316, 8.896916150569623, -50.74841495495647, -65.53722272799251, -33.93427022721189, -60.201275528928726, -50.047759491860745, -48.28150809602605, -36.71419133287168, -50.40865727608634], [-80.45704268548839, 7.273454820259947, -50.0777312036065, -64.58721814028686, -32.10083395772374, -57.8823840626898, -48.01641308801733, -47.027209503436644, -38.77526848453748, -49.44019055729376], 2.3294309566361306))
[Thread 1] Total splits: 0
Processed 1 zonotopes (Work Done: 0.0%); Generated 0 (0.535024785s/loop)
[Thread 1] Finished in 0.54s
 ────────────────────────────────────────────────────────────────────────────────
                                        Time                    Allocations      
                               ───────────────────────   ────────────────────────
       Tot / % measured:            537ms / 100.0%            154MiB / 100.0%    

 Section               ncalls     time    %tot     avg     alloc    %tot      avg
 ────────────────────────────────────────────────────────────────────────────────
 Verify                     1    535ms   99.6%   535ms    145MiB   93.6%   145MiB
   Zonotope Loop            1    535ms   99.6%   535ms    145MiB   93.6%   145MiB
     Zonotope Propa...      1    508ms   94.5%   508ms    124MiB   80.3%   124MiB
       DiffZonotope...      2    392ms   73.0%   196ms    103MiB   66.5%  51.3MiB
         Zonotope_R...      4    138ms   25.8%  34.6ms   89.5MiB   58.0%  22.4MiB
           Influenc...      4    120ms   22.4%  30.1ms   56.3MiB   36.4%  14.1MiB
             Multiply       4    105ms   19.6%  26.3ms   30.9MiB   20.0%  7.73MiB
             Alloca...      4   11.6ms    2.2%  2.91ms   25.3MiB   16.4%  6.33MiB
             Set Ma...      4   3.35ms    0.6%   837μs     0.00B    0.0%    0.00B
           Column M...      4   10.3ms    1.9%  2.58ms   16.5MiB   10.7%  4.14MiB
           Allocation       4   5.53ms    1.0%  1.38ms   16.5MiB   10.7%  4.14MiB
           Set Matrix       4   2.15ms    0.4%   539μs   23.3KiB    0.0%  5.82KiB
           Vectors          4   92.0μs    0.0%  23.0μs    100KiB    0.1%  25.0KiB
           Bounds           4   2.63μs    0.0%   657ns     0.00B    0.0%    0.00B
       DiffZonotope...      3    116ms   21.6%  38.6ms   21.3MiB   13.8%  7.10MiB
         Zonotope_D...      6   57.2ms   10.6%  9.53ms   13.5MiB    8.7%  2.25MiB
     Property Check         1   2.68ms    0.5%  2.68ms    224KiB    0.1%   224KiB
 Initialize                 1   2.29ms    0.4%  2.29ms   9.84MiB    6.4%  9.84MiB
 ────────────────────────────────────────────────────────────────────────────────
[VERYDIFF_TIMER] 0.56881584

[VERYDIFF_EXPERIMENT] Running on /home/i57/steuber/NeuroDiff/repos/VeryDiffExperiments/src/../benchmarks/mnist-prune/specs/mnist_94_global_5.vnnlib /home/i57/steuber/NeuroDiff/repos/VeryDiffExperiments/src/../benchmarks/mnist-prune/nets/mnist_relu_3_100.onnx
Found input X
op: matmul, weight: (100, 784), bias: nothing
op: bias, weight: nothing, bias: (100,)
op: relu, weight: nothing, bias: nothing
op: matmul, weight: (100, 100), bias: nothing
op: bias, weight: nothing, bias: (100,)
op: relu, weight: nothing, bias: nothing
op: matmul, weight: (10, 100), bias: nothing
op: bias, weight: nothing, bias: (10,)
op: relu, weight: nothing, bias: nothing
op: matmul, weight: (10, 10), bias: nothing
op: bias, weight: nothing, bias: (10,)
Found input X
op: matmul, weight: (100, 784), bias: nothing
op: bias, weight: nothing, bias: (100,)
op: relu, weight: nothing, bias: nothing
op: matmul, weight: (100, 100), bias: nothing
op: bias, weight: nothing, bias: (100,)
op: relu, weight: nothing, bias: nothing
op: matmul, weight: (10, 100), bias: nothing
op: bias, weight: nothing, bias: (10,)
op: relu, weight: nothing, bias: nothing
op: matmul, weight: (10, 10), bias: nothing
op: bias, weight: nothing, bias: (10,)
Distance: 296.6600370998244
Distance: 77.24290861755458
Distance: 5.7170369567975285
Distance: 0.0
Running with 1 threads
[Thread 1] Time to first task: 0.0s
Instable Generators: 34
Instable Generators: 43
Instable Generators: 8
Zono Bounds:
[0.0, -0.23576518079618003, -0.49421233489560745, -0.6468826135476617, -0.5436291306320105, -0.7147906661371273, -0.5847451459876183, -0.7497780885725104, -0.42277756617174833, -0.3769871896987297]
[0.0, 0.3255022260233228, 0.49421233489560745, 0.6468826135476617, 0.31833973698872, 0.11244272202296002, 0.19805539689428828, 0.7497780885725104, 0.42277756617174833, 0.3769871896987297]
[Thread 1] Total splits: 0
Processed 1 zonotopes (Work Done: 100.0%); Generated 0 (0.065866685s/loop)
[Thread 1] Finished in 0.07s
 ────────────────────────────────────────────────────────────────────────────────
                                        Time                    Allocations      
                               ───────────────────────   ────────────────────────
       Tot / % measured:           66.5ms / 100.0%           98.7MiB / 100.0%    

 Section               ncalls     time    %tot     avg     alloc    %tot      avg
 ────────────────────────────────────────────────────────────────────────────────
 Verify                     1   65.9ms   99.1%  65.9ms   93.3MiB   94.5%  93.3MiB
   Zonotope Loop            1   65.9ms   99.1%  65.9ms   93.3MiB   94.5%  93.3MiB
     Zonotope Propa...      1   62.6ms   94.1%  62.6ms   73.4MiB   74.3%  73.4MiB
       DiffZonotope...      3   41.2ms   61.9%  13.7ms   69.2MiB   70.1%  23.1MiB
         Zonotope_R...      6   40.3ms   60.6%  6.71ms   67.6MiB   68.5%  11.3MiB
           Influenc...      6   39.0ms   58.7%  6.50ms   62.2MiB   63.0%  10.4MiB
             Multiply       6   25.3ms   38.1%  4.22ms   31.6MiB   32.0%  5.27MiB
             Alloca...      6   9.53ms   14.3%  1.59ms   30.5MiB   30.9%  5.09MiB
             Set Ma...      6   4.14ms    6.2%   690μs     0.00B    0.0%    0.00B
           Column M...      6    757μs    1.1%   126μs   2.70MiB    2.7%   461KiB
           Set Matrix       6    296μs    0.4%  49.3μs   6.05KiB    0.0%  1.01KiB
           Allocation       6    144μs    0.2%  24.1μs   2.70MiB    2.7%   461KiB
           Vectors          6   40.7μs    0.1%  6.78μs   19.5KiB    0.0%  3.26KiB
           Bounds           6   3.80μs    0.0%   634ns     0.00B    0.0%    0.00B
       DiffZonotope...      4   21.4ms   32.2%  5.35ms   4.16MiB    4.2%  1.04MiB
         Zonotope_D...      8   8.44ms   12.7%  1.05ms   2.72MiB    2.8%   348KiB
     Property Check         1   9.47μs    0.0%  9.47μs   1.23KiB    0.0%  1.23KiB
 Initialize                 1    590μs    0.9%   590μs   5.41MiB    5.5%  5.41MiB
 ────────────────────────────────────────────────────────────────────────────────
[VERYDIFF_TIMER] 0.091682105

[VERYDIFF_EXPERIMENT] Running on /home/i57/steuber/NeuroDiff/repos/VeryDiffExperiments/src/../benchmarks/mnist-prune/specs/mnist_94_global_5.vnnlib /home/i57/steuber/NeuroDiff/repos/VeryDiffExperiments/src/../benchmarks/mnist-prune/nets/mnist_relu_4_1024.onnx
Found input X
op: matmul, weight: (1024, 784), bias: nothing
op: bias, weight: nothing, bias: (1024,)
op: relu, weight: nothing, bias: nothing
op: matmul, weight: (1024, 1024), bias: nothing
op: bias, weight: nothing, bias: (1024,)
op: relu, weight: nothing, bias: nothing
op: matmul, weight: (1024, 1024), bias: nothing
op: bias, weight: nothing, bias: (1024,)
op: relu, weight: nothing, bias: nothing
op: matmul, weight: (10, 1024), bias: nothing
op: bias, weight: nothing, bias: (10,)
op: relu, weight: nothing, bias: nothing
op: matmul, weight: (10, 10), bias: nothing
op: bias, weight: nothing, bias: (10,)
Found input X
op: matmul, weight: (1024, 784), bias: nothing
op: bias, weight: nothing, bias: (1024,)
op: relu, weight: nothing, bias: nothing
op: matmul, weight: (1024, 1024), bias: nothing
op: bias, weight: nothing, bias: (1024,)
op: relu, weight: nothing, bias: nothing
op: matmul, weight: (1024, 1024), bias: nothing
op: bias, weight: nothing, bias: (1024,)
op: relu, weight: nothing, bias: nothing
op: matmul, weight: (10, 1024), bias: nothing
op: bias, weight: nothing, bias: (10,)
op: relu, weight: nothing, bias: nothing
op: matmul, weight: (10, 10), bias: nothing
op: bias, weight: nothing, bias: (10,)
Distance: 1266.8815759184893
Distance: 2876.6944248261216
Distance: 2831.8843567411013
Distance: 34.033756025192815
Distance: 0.0
Running with 1 threads
[Thread 1] Time to first task: 0.01s
Instable Generators: 358
Instable Generators: 640
Instable Generators: 973
Instable Generators: 10
Zono Bounds:
[-68.71244893475826, -72.25652140421818, -77.62932031381251, -75.84915362082764, -74.6648161947137, -79.6275253865868, -69.29414156703581, -73.20402395451094, -74.08452246597393, -76.95010846070024]
[66.5833333708642, 72.25652140421818, 74.7308317753658, 75.84915362082764, 74.6648161947137, 74.2011108922265, 67.89777252068177, 73.20402395451094, 74.08452246597393, 76.09420870504108]

Found counterexample: ([0.01960784, 0.0, 0.01960784, 0.01960784, 0.01960784, 0.01960784, 0.0, 0.01960784, 0.01960784, 0.01960784, 0.01960784, 0.0, 0.01960784, 0.0, 0.0, 0.0, 0.01960784, 0.0, 0.01960784, 0.0, 0.01960784, 0.0, 0.01960784, 0.0, 0.01960784, 0.01960784, 0.01960784, 0.01960784, 0.01960784, 0.01960784, 0.0, 0.0, 0.01960784, 0.01960784, 0.0, 0.0, 0.01960784, 0.0, 0.0, 0.0, 0.01960784, 0.01960784, 0.01960784, 0.0, 0.01960784, 0.0, 0.01960784, 0.0, 0.01960784, 0.0, 0.0, 0.0, 0.0, 0.01960784, 0.01960784, 0.0, 0.01960784, 0.01960784, 0.0, 0.0, 0.01960784, 0.01960784, 0.01960784, 0.01960784, 0.01960784, 0.0, 0.01960784, 0.01960784, 0.01960784, 0.0, 0.01960784, 0.01960784, 0.0, 0.0, 0.01960784, 0.0, 0.01960784, 0.01960784, 0.01960784, 0.0, 0.01960784, 0.0, 0.01960784, 0.01960784, 0.01960784, 0.01960784, 0.01960784, 0.0, 0.0, 0.01960784, 0.0, 0.01960784, 0.01960784, 0.01960784, 0.01960784, 0.01960784, 0.01960784, 0.0, 0.0, 0.01960784, 0.01960784, 0.0, 0.0, 0.0, 0.0, 0.0, 0.01960784, 0.01960784, 0.0, 0.0, 0.01960784, 0.0, 0.01960784, 0.01960784, 0.0, 0.01960784, 0.01960784, 0.01960784, 0.0, 0.01960784, 0.01960784, 0.01960784, 0.01960784, 0.38039216, 1.0, 1.0, 0.97254902, 0.0, 0.0, 0.0, 0.0, 0.0, 0.0, 0.0, 0.0, 0.0, 0.01960784, 0.0, 0.01960784, 0.01960784, 0.01960784, 0.01960784, 0.01960784, 0.01960784, 0.0, 0.01960784, 0.01960784, 0.01960784, 0.01960784, 0.01960784, 0.0, 0.72549021, 0.9999999999999999, 0.9999999999999999, 0.9999999999999999, 0.01960784, 0.0, 0.0, 0.01960784, 0.0, 0.0, 0.0, 0.0, 0.0, 0.0, 0.0, 0.01960784, 0.01960784, 0.0, 0.01960784, 0.01960784, 0.01960784, 0.0, 0.0, 0.01960784, 0.01960784, 0.0, 0.01960784, 0.01960784, 0.7647059, 0.9999999999999999, 0.96470588, 0.96470588, 0.01960784, 0.01960784, 0.0, 0.0, 0.0, 0.0, 0.0, 0.0, 0.0, 0.0, 0.0, 0.0, 0.0, 0.0, 0.01960784, 0.01960784, 0.01960784, 0.0, 0.01960784, 0.01960784, 0.01960784, 0.01960784, 0.01960784, 0.0, 0.72549021, 0.96470588, 0.9999999999999999, 0.96470588, 0.01960784, 0.0, 0.0, 0.0, 0.0, 0.0, 0.0, 0.0, 0.0, 0.0, 0.0, 0.01960784, 0.0, 0.0, 0.01960784, 0.0, 0.01960784, 0.01960784, 0.01960784, 0.01960784, 0.01960784, 0.01960784, 0.01960784, 0.01960784, 0.72549021, 0.96470588, 0.96470588, 0.9999999999999999, 0.01960784, 0.01960784, 0.01960784, 0.0, 0.0, 0.0, 0.0, 0.0, 0.0, 0.0, 0.0, 0.01960784, 0.01960784, 0.01960784, 0.01960784, 0.0, 0.01960784, 0.01960784, 0.01960784, 0.0, 0.01960784, 0.0, 0.0, 0.01960784, 0.72941178, 0.97254902, 1.0, 1.0, 0.78431374, 0.11372549, 0.01960784, 0.0, 0.0, 0.0, 0.0, 0.0, 0.0, 0.0, 0.0, 0.01960784, 0.0, 0.01960784, 0.01960784, 0.01960784, 0.01960784, 0.0, 0.01960784, 0.01960784, 0.0, 0.0, 0.0, 0.0, 0.7647059, 0.96470588, 0.9999999999999999, 0.9999999999999999, 1.0, 0.26274511, 0.01960784, 0.0, 0.0, 0.0, 0.0, 0.0, 0.0, 0.0, 0.0, 0.01960784, 0.01960784, 0.0, 0.0, 0.01960784, 0.0, 0.0, 0.01960784, 0.0, 0.01960784, 0.01960784, 0.01960784, 0.01960784, 0.7647059, 0.96470588, 0.96470588, 0.9999999999999999, 1.0, 0.53333336, 0.0, 0.0, 0.01960784, 0.01960784, 0.0, 0.0, 0.0, 0.0, 0.0, 0.0, 0.01960784, 0.01960784, 0.0, 0.0, 0.01960784, 0.01960784, 0.0, 0.0, 0.01960784, 0.01960784, 0.01960784, 0.01960784, 0.18039216, 0.96470588, 0.96470588, 0.9999999999999999, 1.0, 0.88235295, 0.01960784, 0.0, 0.01960784, 0.01960784, 0.01960784, 0.01960784, 0.01960784, 0.01960784, 0.01960784, 0.01960784, 0.01960784, 0.0, 0.01960784, 0.01960784, 0.0, 0.01960784, 0.0, 0.01960784, 0.0, 0.01960784, 0.0, 0.01960784, 0.10588235, 0.96470588, 0.9999999999999999, 0.96470588, 1.0, 0.88235295, 0.01960784, 0.01960784, 0.01960784, 0.01960784, 0.01960784, 0.01960784, 0.01960784, 0.01960784, 0.0, 0.0, 0.01960784, 0.01960784, 0.01960784, 0.01960784, 0.01960784, 0.01960784, 0.0, 0.01960784, 0.0, 0.0, 0.01960784, 0.0, 0.02745098, 0.66274512, 1.0, 0.97254902, 1.0, 0.8862745200000001, 0.01960784, 0.01960784, 0.01960784, 0.01960784, 0.01960784, 0.01960784, 0.01960784, 0.01960784, 0.01960784, 0.01960784, 0.01960784, 0.0, 0.01960784, 0.0, 0.01960784, 0.01960784, 0.0, 0.01960784, 0.0, 0.0, 0.0, 0.0, 0.14509804999999998, 0.96470588, 0.9999999999999999, 0.9999999999999999, 1.0, 0.88235295, 0.01960784, 0.0, 0.01960784, 0.0, 0.01960784, 0.01960784, 0.0, 0.01960784, 0.01960784, 0.0, 0.0, 0.01960784, 0.0, 0.01960784, 0.01960784, 0.01960784, 0.0, 0.01960784, 0.01960784, 0.01960784, 0.01960784, 0.01960784, 0.14509804999999998, 0.9999999999999999, 0.9999999999999999, 0.9999999999999999, 1.0, 0.88235295, 0.0, 0.0, 0.0, 0.0, 0.01960784, 0.01960784, 0.01960784, 0.01960784, 0.01960784, 0.01960784, 0.01960784, 0.01960784, 0.01960784, 0.0, 0.01960784, 0.0, 0.0, 0.0, 0.01960784, 0.01960784, 0.01960784, 0.01960784, 0.14509804999999998, 0.9999999999999999, 0.9999999999999999, 0.9999999999999999, 0.97254902, 0.84313726, 0.0, 0.0, 0.0, 0.0, 0.01960784, 0.01960784, 0.01960784, 0.01960784, 0.01960784, 0.0, 0.0, 0.01960784, 0.0, 0.01960784, 0.0, 0.0, 0.0, 0.0, 0.0, 0.0, 0.0, 0.01960784, 0.10588235, 0.9999999999999999, 0.9999999999999999, 0.9999999999999999, 0.97254902, 0.84313726, 0.0, 0.0, 0.0, 0.0, 0.01960784, 0.01960784, 0.01960784, 0.01960784, 0.01960784, 0.0, 0.01960784, 0.01960784, 0.01960784, 0.01960784, 0.01960784, 0.0, 0.0, 0.0, 0.0, 0.0, 0.0, 0.0, 0.05882353, 0.78823531, 1.0, 1.0, 0.98039216, 0.97254902, 0.47450981, 0.0, 0.01960784, 0.0, 0.01960784, 0.0, 0.0, 0.0, 0.01960784, 0.01960784, 0.0, 0.01960784, 0.0, 0.01960784, 0.01960784, 0.0, 0.0, 0.0, 0.0, 0.0, 0.0, 0.0, 0.0, 0.10588235, 0.87843138, 0.96470588, 0.97254902, 0.96470588, 0.47450981, 0.0, 0.0, 0.01960784, 0.01960784, 0.0, 0.01960784, 0.0, 0.0, 0.01960784, 0.0, 0.0, 0.0, 0.01960784, 0.01960784, 0.01960784, 0.0, 0.0, 0.0, 0.0, 0.0, 0.0, 0.0, 0.0, 0.84705883, 0.96470588, 0.97254902, 0.96470588, 0.71764708, 0.35294119, 0.01960784, 0.0, 0.01960784, 0.01960784, 0.0, 0.01960784, 0.0, 0.01960784, 0.0, 0.01960784, 0.01960784, 0.01960784, 0.01960784, 0.01960784, 0.01960784, 0.0, 0.0, 0.0, 0.0, 0.0, 0.0, 0.0, 0.6901961, 0.80784315, 0.97254902, 0.96470588, 0.96470588, 0.7568627600000001, 0.01960784, 0.01960784, 0.01960784, 0.01960784, 0.0, 0.0, 0.01960784, 0.0, 0.01960784, 0.01960784, 0.01960784, 0.01960784, 0.0, 0.0, 0.0, 0.0, 0.0, 0.0, 0.0, 0.0, 0.0, 0.0, 0.11372549, 0.15686274999999997, 0.58039218, 0.96470588, 0.9999999999999999, 0.36862746, 0.01960784, 0.01960784, 0.01960784, 0.01960784, 0.01960784, 0.01960784, 0.01960784, 0.01960784, 0.01960784, 0.01960784, 0.01960784, 0.0, 0.0, 0.0, 0.01960784, 0.0, 0.0, 0.0, 0.0, 0.0, 0.01960784, 0.0, 0.0, 0.0, 0.01960784, 0.01960784, 0.01960784, 0.01960784, 0.01960784, 0.0, 0.01960784, 0.01960784, 0.0, 0.01960784, 0.0, 0.01960784, 0.01960784, 0.01960784, 0.0, 0.01960784, 0.0, 0.01960784, 0.0, 0.01960784, 0.01960784, 0.01960784, 0.0, 0.01960784, 0.0, 0.0, 0.0, 0.01960784, 0.01960784, 0.0, 0.0, 0.0, 0.0, 0.0, 0.0, 0.0, 0.01960784, 0.0, 0.01960784, 0.01960784, 0.01960784, 0.0, 0.0, 0.01960784, 0.0, 0.0, 0.0, 0.0, 0.01960784, 0.01960784, 0.01960784, 0.0, 0.0, 0.01960784, 0.01960784, 0.01960784, 0.01960784, 0.0, 0.0, 0.01960784, 0.01960784, 0.01960784, 0.0, 0.01960784, 0.01960784, 0.01960784, 0.01960784, 0.0, 0.01960784, 0.0, 0.0, 0.0, 0.01960784, 0.01960784, 0.01960784, 0.01960784, 0.01960784, 0.01960784, 0.0, 0.0, 0.01960784, 0.01960784, 0.01960784, 0.0, 0.0, 0.0, 0.01960784, 0.01960784, 0.01960784, 0.01960784, 0.01960784, 0.0, 0.0, 0.0, 0.01960784, 0.0, 0.01960784], ([0.0, 29.981207164992313, 0.0, 0.0, 9.223695469709586, 0.0, 0.0, 4.430787691119944, 0.0, 0.0], [0.0, 23.737307731106615, 0.0, 0.0, 6.2747217989811235, 0.0, 0.0, 2.631029021531961, 0.0, 0.0], 6.243899433885698))
[Thread 1] Total splits: 0
Processed 1 zonotopes (Work Done: 0.0%); Generated 0 (2.255187044s/loop)
[Thread 1] Finished in 2.26s
 ────────────────────────────────────────────────────────────────────────────────
                                        Time                    Allocations      
                               ───────────────────────   ────────────────────────
       Tot / % measured:            2.28s / 100.0%            692MiB / 100.0%    

 Section               ncalls     time    %tot     avg     alloc    %tot      avg
 ────────────────────────────────────────────────────────────────────────────────
 Verify                     1    2.26s   99.0%   2.26s    665MiB   96.1%   665MiB
   Zonotope Loop            1    2.26s   99.0%   2.26s    665MiB   96.1%   665MiB
     Zonotope Propa...      1    2.23s   98.0%   2.23s    644MiB   93.1%   644MiB
       DiffZonotope...      4    1.34s   59.0%   336ms    533MiB   77.0%   133MiB
         Zonotope_R...      8    999ms   43.9%   125ms    432MiB   62.5%  54.0MiB
           Influenc...      8    678ms   29.8%  84.8ms    250MiB   36.2%  31.3MiB
             Multiply       8    390ms   17.1%  48.8ms    147MiB   21.3%  18.4MiB
             Alloca...      8    272ms   11.9%  33.9ms    103MiB   14.9%  12.9MiB
             Set Ma...      8   16.3ms    0.7%  2.03ms     0.00B    0.0%    0.00B
           Column M...      8    289ms   12.7%  36.2ms   90.8MiB   13.1%  11.4MiB
           Set Matrix       8   16.1ms    0.7%  2.01ms    105KiB    0.0%  13.2KiB
           Allocation       8   15.5ms    0.7%  1.94ms   90.8MiB   13.1%  11.4MiB
           Vectors          8    307μs    0.0%  38.4μs    272KiB    0.0%  34.0KiB
           Bounds           8   4.70μs    0.0%   588ns     0.00B    0.0%    0.00B
       DiffZonotope...      5    889ms   39.0%   178ms    112MiB   16.1%  22.3MiB
         Zonotope_D...     10    405ms   17.8%  40.5ms   59.6MiB    8.6%  5.96MiB
     Property Check         1   11.2ms    0.5%  11.2ms    569KiB    0.1%   569KiB
 Initialize                 1   22.2ms    1.0%  22.2ms   27.0MiB    3.9%  27.0MiB
 ────────────────────────────────────────────────────────────────────────────────
[VERYDIFF_TIMER] 2.369180454

[VERYDIFF_EXPERIMENT] NETWORK: /home/i57/steuber/NeuroDiff/repos/VeryDiffExperiments/src/../benchmarks/mnist-prune/specs/mnist_94_global_5.vnnlib
[VERYDIFF_EXPERIMENT] TIME: 3.962718309
