
[VERYDIFF_EXPERIMENT] Running on /home/i57/steuber/NeuroDiff/repos/VeryDiffExperiments/src/../benchmarks/mnist-prune/specs/mnist_85_local_15.vnnlib /home/i57/steuber/NeuroDiff/repos/VeryDiffExperiments/src/../benchmarks/mnist-prune/nets/mnist_relu_3_100.onnx
Found input X
op: matmul, weight: (100, 784), bias: nothing
op: bias, weight: nothing, bias: (100,)
op: relu, weight: nothing, bias: nothing
op: matmul, weight: (100, 100), bias: nothing
op: bias, weight: nothing, bias: (100,)
op: relu, weight: nothing, bias: nothing
op: matmul, weight: (10, 100), bias: nothing
op: bias, weight: nothing, bias: (10,)
op: relu, weight: nothing, bias: nothing
op: matmul, weight: (10, 10), bias: nothing
op: bias, weight: nothing, bias: (10,)
Found input X
op: gemm, weight: (100, 784), bias: (100,)
op: relu, weight: nothing, bias: nothing
op: gemm, weight: (100, 100), bias: (100,)
op: relu, weight: nothing, bias: nothing
op: gemm, weight: (10, 100), bias: (10,)
op: relu, weight: nothing, bias: nothing
op: gemm, weight: (10, 10), bias: (10,)
Distance: 1958.4889029213523
Distance: 144.28197153992141
Distance: 22.063573056613677
Distance: 0.8412832540489035
Running with 1 threads
[Thread 1] Time to first task: 0.0s
Instable Generators: 18
Instable Generators: 22
Instable Generators: 4
Zono Bounds:
[-0.01213408250219249, 0.0049474637151107675, -2.026907809643398, -0.057958013445569175, -1.6539652137257652, -2.032707926968416, 9.952688129650361e-5, -1.7961052333280927, -1.9830881041182764, -1.7504239715697476]
[-0.005535558458684791, 0.014900449271647142, 1.6528311833931675, 0.06439929783070858, 2.57874038985355, 2.114275285659402, 0.010464993958178218, 2.0226600237722674, 1.9025080001716257, 1.8172376488322775]
[Thread 1] Processed 100 zonotopes (Work Done: 0.0%; Expected Zonos: Inf)
[Thread 1] Processed 200 zonotopes (Work Done: 0.0%; Expected Zonos: Inf)
[Thread 1] Processed 300 zonotopes (Work Done: 0.0%; Expected Zonos: Inf)
[Thread 1] Processed 400 zonotopes (Work Done: 0.0%; Expected Zonos: Inf)
[Thread 1] Processed 500 zonotopes (Work Done: 0.0%; Expected Zonos: Inf)
[Thread 1] Processed 600 zonotopes (Work Done: 0.0%; Expected Zonos: Inf)
[Thread 1] Processed 700 zonotopes (Work Done: 0.0%; Expected Zonos: Inf)
[Thread 1] Processed 800 zonotopes (Work Done: 0.0%; Expected Zonos: Inf)
[Thread 1] Processed 900 zonotopes (Work Done: 0.0%; Expected Zonos: Inf)
[Thread 1] Processed 1000 zonotopes (Work Done: 0.0%; Expected Zonos: Inf)
[Thread 1] Processed 1100 zonotopes (Work Done: 0.0%; Expected Zonos: Inf)
[Thread 1] Processed 1200 zonotopes (Work Done: 0.0%; Expected Zonos: Inf)
[Thread 1] Processed 1300 zonotopes (Work Done: 0.0%; Expected Zonos: Inf)
[Thread 1] Processed 1400 zonotopes (Work Done: 0.0%; Expected Zonos: Inf)
[Thread 1] Processed 1500 zonotopes (Work Done: 0.0%; Expected Zonos: Inf)
[Thread 1] Processed 1600 zonotopes (Work Done: 0.0%; Expected Zonos: Inf)
[Thread 1] Processed 1700 zonotopes (Work Done: 0.0%; Expected Zonos: Inf)
[Thread 1] Processed 1800 zonotopes (Work Done: 0.0%; Expected Zonos: Inf)
[Thread 1] Processed 1900 zonotopes (Work Done: 0.0%; Expected Zonos: Inf)
[Thread 1] Processed 2000 zonotopes (Work Done: 0.0%; Expected Zonos: Inf)
[Thread 1] Processed 2100 zonotopes (Work Done: 0.0%; Expected Zonos: Inf)
[Thread 1] Processed 2200 zonotopes (Work Done: 0.0%; Expected Zonos: Inf)
[Thread 1] Processed 2300 zonotopes (Work Done: 0.0%; Expected Zonos: Inf)
[Thread 1] Processed 2400 zonotopes (Work Done: 0.0%; Expected Zonos: Inf)
[Thread 1] Processed 2500 zonotopes (Work Done: 0.0%; Expected Zonos: Inf)
[Thread 1] Processed 2600 zonotopes (Work Done: 0.0%; Expected Zonos: Inf)
[Thread 1] Processed 2700 zonotopes (Work Done: 0.0%; Expected Zonos: Inf)
[Thread 1] Processed 2800 zonotopes (Work Done: 0.0%; Expected Zonos: Inf)
[Thread 1] Processed 2900 zonotopes (Work Done: 0.0%; Expected Zonos: Inf)
[Thread 1] Processed 3000 zonotopes (Work Done: 0.0%; Expected Zonos: Inf)
[Thread 1] Processed 3100 zonotopes (Work Done: 0.0%; Expected Zonos: Inf)
[Thread 1] Processed 3200 zonotopes (Work Done: 0.0%; Expected Zonos: Inf)
[Thread 1] Processed 3300 zonotopes (Work Done: 0.0%; Expected Zonos: Inf)
[Thread 1] Processed 3400 zonotopes (Work Done: 0.0%; Expected Zonos: Inf)
[Thread 1] Processed 3500 zonotopes (Work Done: 0.0%; Expected Zonos: Inf)
[Thread 1] Processed 3600 zonotopes (Work Done: 0.0%; Expected Zonos: Inf)
[Thread 1] Processed 3700 zonotopes (Work Done: 0.0%; Expected Zonos: Inf)
[Thread 1] Processed 3800 zonotopes (Work Done: 0.0%; Expected Zonos: Inf)
[Thread 1] Processed 3900 zonotopes (Work Done: 0.0%; Expected Zonos: Inf)
[Thread 1] Processed 4000 zonotopes (Work Done: 0.0%; Expected Zonos: Inf)
[Thread 1] Processed 4100 zonotopes (Work Done: 0.0%; Expected Zonos: Inf)
[Thread 1] Processed 4200 zonotopes (Work Done: 0.0%; Expected Zonos: Inf)
[Thread 1] Processed 4300 zonotopes (Work Done: 0.0%; Expected Zonos: Inf)
[Thread 1] Processed 4400 zonotopes (Work Done: 0.0%; Expected Zonos: Inf)
[Thread 1] Processed 4500 zonotopes (Work Done: 0.0%; Expected Zonos: Inf)
[Thread 1] Processed 4600 zonotopes (Work Done: 0.0%; Expected Zonos: Inf)
[Thread 1] Processed 4700 zonotopes (Work Done: 0.0%; Expected Zonos: Inf)
[Thread 1] Processed 4800 zonotopes (Work Done: 0.0%; Expected Zonos: Inf)
[Thread 1] Processed 4900 zonotopes (Work Done: 0.0%; Expected Zonos: Inf)
[Thread 1] Processed 5000 zonotopes (Work Done: 0.0%; Expected Zonos: Inf)
[Thread 1] Processed 5100 zonotopes (Work Done: 0.0%; Expected Zonos: Inf)
[Thread 1] Processed 5200 zonotopes (Work Done: 0.0%; Expected Zonos: Inf)
[Thread 1] Processed 5300 zonotopes (Work Done: 0.0%; Expected Zonos: Inf)
[Thread 1] Processed 5400 zonotopes (Work Done: 0.0%; Expected Zonos: Inf)
[Thread 1] Processed 5500 zonotopes (Work Done: 0.0%; Expected Zonos: Inf)
[Thread 1] Processed 5600 zonotopes (Work Done: 0.0%; Expected Zonos: Inf)
[Thread 1] Processed 5700 zonotopes (Work Done: 0.0%; Expected Zonos: Inf)
[Thread 1] Processed 5800 zonotopes (Work Done: 0.0%; Expected Zonos: Inf)
[Thread 1] Processed 5900 zonotopes (Work Done: 0.0%; Expected Zonos: Inf)
[Thread 1] Processed 6000 zonotopes (Work Done: 0.0%; Expected Zonos: Inf)
[Thread 1] Processed 6100 zonotopes (Work Done: 0.0%; Expected Zonos: Inf)
[Thread 1] Processed 6200 zonotopes (Work Done: 0.0%; Expected Zonos: Inf)
[Thread 1] Processed 6300 zonotopes (Work Done: 0.0%; Expected Zonos: Inf)
[Thread 1] Processed 6400 zonotopes (Work Done: 0.0%; Expected Zonos: Inf)
[Thread 1] Processed 6500 zonotopes (Work Done: 0.0%; Expected Zonos: Inf)
[Thread 1] Processed 6600 zonotopes (Work Done: 0.0%; Expected Zonos: Inf)
[Thread 1] Processed 6700 zonotopes (Work Done: 0.0%; Expected Zonos: Inf)
[Thread 1] Processed 6800 zonotopes (Work Done: 0.0%; Expected Zonos: Inf)
[Thread 1] Processed 6900 zonotopes (Work Done: 0.0%; Expected Zonos: Inf)
[Thread 1] Processed 7000 zonotopes (Work Done: 0.0%; Expected Zonos: Inf)
[Thread 1] Processed 7100 zonotopes (Work Done: 0.0%; Expected Zonos: Inf)
[Thread 1] Processed 7200 zonotopes (Work Done: 0.0%; Expected Zonos: Inf)
[Thread 1] Processed 7300 zonotopes (Work Done: 0.0%; Expected Zonos: Inf)
[Thread 1] Processed 7400 zonotopes (Work Done: 0.0%; Expected Zonos: Inf)
[Thread 1] Processed 7500 zonotopes (Work Done: 0.0%; Expected Zonos: Inf)
[Thread 1] Processed 7600 zonotopes (Work Done: 0.0%; Expected Zonos: Inf)
[Thread 1] Processed 7700 zonotopes (Work Done: 0.0%; Expected Zonos: Inf)
[Thread 1] Processed 7800 zonotopes (Work Done: 0.0%; Expected Zonos: Inf)
[Thread 1] Processed 7900 zonotopes (Work Done: 0.0%; Expected Zonos: Inf)
[Thread 1] Processed 8000 zonotopes (Work Done: 0.0%; Expected Zonos: Inf)
[Thread 1] Processed 8100 zonotopes (Work Done: 0.0%; Expected Zonos: Inf)
[Thread 1] Processed 8200 zonotopes (Work Done: 0.0%; Expected Zonos: Inf)
[Thread 1] Processed 8300 zonotopes (Work Done: 0.0%; Expected Zonos: Inf)
[Thread 1] Processed 8400 zonotopes (Work Done: 0.0%; Expected Zonos: Inf)
[Thread 1] Processed 8500 zonotopes (Work Done: 0.0%; Expected Zonos: Inf)
[Thread 1] Processed 8600 zonotopes (Work Done: 0.0%; Expected Zonos: Inf)
[Thread 1] Processed 8700 zonotopes (Work Done: 0.0%; Expected Zonos: Inf)
[Thread 1] Processed 8800 zonotopes (Work Done: 0.0%; Expected Zonos: Inf)
[Thread 1] Processed 8900 zonotopes (Work Done: 0.0%; Expected Zonos: Inf)
[Thread 1] Processed 9000 zonotopes (Work Done: 0.0%; Expected Zonos: Inf)
[Thread 1] Processed 9100 zonotopes (Work Done: 0.0%; Expected Zonos: Inf)
[Thread 1] Processed 9200 zonotopes (Work Done: 0.0%; Expected Zonos: Inf)
[Thread 1] Processed 9300 zonotopes (Work Done: 0.0%; Expected Zonos: Inf)
[Thread 1] Processed 9400 zonotopes (Work Done: 0.0%; Expected Zonos: Inf)
[Thread 1] Processed 9500 zonotopes (Work Done: 0.0%; Expected Zonos: Inf)
[Thread 1] Processed 9600 zonotopes (Work Done: 0.0%; Expected Zonos: Inf)
[Thread 1] Processed 9700 zonotopes (Work Done: 0.0%; Expected Zonos: Inf)
[Thread 1] Processed 9800 zonotopes (Work Done: 0.0%; Expected Zonos: Inf)
[Thread 1] Processed 9900 zonotopes (Work Done: 0.0%; Expected Zonos: Inf)
[Thread 1] Processed 10000 zonotopes (Work Done: 0.0%; Expected Zonos: Inf)
[Thread 1] Processed 10100 zonotopes (Work Done: 0.0%; Expected Zonos: Inf)
[Thread 1] Processed 10200 zonotopes (Work Done: 0.0%; Expected Zonos: Inf)
[Thread 1] Processed 10300 zonotopes (Work Done: 0.0%; Expected Zonos: Inf)
[Thread 1] Processed 10400 zonotopes (Work Done: 0.0%; Expected Zonos: Inf)
[Thread 1] Processed 10500 zonotopes (Work Done: 0.0%; Expected Zonos: Inf)
[Thread 1] Processed 10600 zonotopes (Work Done: 0.0%; Expected Zonos: Inf)
[Thread 1] Processed 10700 zonotopes (Work Done: 0.0%; Expected Zonos: Inf)
[Thread 1] Processed 10800 zonotopes (Work Done: 0.0%; Expected Zonos: Inf)
[Thread 1] Processed 10900 zonotopes (Work Done: 0.0%; Expected Zonos: Inf)
[Thread 1] Processed 11000 zonotopes (Work Done: 0.0%; Expected Zonos: Inf)
[Thread 1] Processed 11100 zonotopes (Work Done: 0.0%; Expected Zonos: Inf)
[Thread 1] Processed 11200 zonotopes (Work Done: 0.0%; Expected Zonos: Inf)
[Thread 1] Processed 11300 zonotopes (Work Done: 0.0%; Expected Zonos: Inf)
[Thread 1] Processed 11400 zonotopes (Work Done: 0.0%; Expected Zonos: Inf)
[Thread 1] Processed 11500 zonotopes (Work Done: 0.0%; Expected Zonos: Inf)
[Thread 1] Processed 11600 zonotopes (Work Done: 0.0%; Expected Zonos: Inf)
[Thread 1] Processed 11700 zonotopes (Work Done: 0.0%; Expected Zonos: Inf)
[Thread 1] Processed 11800 zonotopes (Work Done: 0.0%; Expected Zonos: Inf)
[Thread 1] Processed 11900 zonotopes (Work Done: 0.0%; Expected Zonos: Inf)
[Thread 1] Processed 12000 zonotopes (Work Done: 0.0%; Expected Zonos: Inf)
[Thread 1] Processed 12100 zonotopes (Work Done: 0.0%; Expected Zonos: Inf)
[Thread 1] Processed 12200 zonotopes (Work Done: 0.0%; Expected Zonos: Inf)
[Thread 1] Processed 12300 zonotopes (Work Done: 0.0%; Expected Zonos: Inf)
[Thread 1] Processed 12400 zonotopes (Work Done: 0.0%; Expected Zonos: Inf)
[Thread 1] Processed 12500 zonotopes (Work Done: 0.0%; Expected Zonos: Inf)
[Thread 1] Processed 12600 zonotopes (Work Done: 0.0%; Expected Zonos: Inf)
[Thread 1] Processed 12700 zonotopes (Work Done: 0.0%; Expected Zonos: Inf)
[Thread 1] Processed 12800 zonotopes (Work Done: 0.0%; Expected Zonos: Inf)
[Thread 1] Processed 12900 zonotopes (Work Done: 0.0%; Expected Zonos: Inf)
[Thread 1] Processed 13000 zonotopes (Work Done: 0.0%; Expected Zonos: Inf)
[Thread 1] Processed 13100 zonotopes (Work Done: 0.0%; Expected Zonos: Inf)
[Thread 1] Processed 13200 zonotopes (Work Done: 0.0%; Expected Zonos: Inf)
[Thread 1] Processed 13300 zonotopes (Work Done: 0.0%; Expected Zonos: Inf)
[Thread 1] Processed 13400 zonotopes (Work Done: 0.0%; Expected Zonos: Inf)
[Thread 1] Processed 13500 zonotopes (Work Done: 0.0%; Expected Zonos: Inf)
[Thread 1] Processed 13600 zonotopes (Work Done: 0.0%; Expected Zonos: Inf)
[Thread 1] Processed 13700 zonotopes (Work Done: 0.0%; Expected Zonos: Inf)
[Thread 1] Processed 13800 zonotopes (Work Done: 0.0%; Expected Zonos: Inf)
[Thread 1] Processed 13900 zonotopes (Work Done: 0.0%; Expected Zonos: Inf)
[Thread 1] Processed 14000 zonotopes (Work Done: 0.0%; Expected Zonos: Inf)
[Thread 1] Processed 14100 zonotopes (Work Done: 0.0%; Expected Zonos: Inf)
[Thread 1] Processed 14200 zonotopes (Work Done: 0.0%; Expected Zonos: Inf)
[Thread 1] Processed 14300 zonotopes (Work Done: 0.0%; Expected Zonos: Inf)
[Thread 1] Processed 14400 zonotopes (Work Done: 0.0%; Expected Zonos: Inf)
[Thread 1] Processed 14500 zonotopes (Work Done: 0.0%; Expected Zonos: Inf)
[Thread 1] Processed 14600 zonotopes (Work Done: 0.0%; Expected Zonos: Inf)
[Thread 1] Processed 14700 zonotopes (Work Done: 0.0%; Expected Zonos: Inf)
[Thread 1] Processed 14800 zonotopes (Work Done: 0.0%; Expected Zonos: Inf)
[Thread 1] Processed 14900 zonotopes (Work Done: 0.0%; Expected Zonos: Inf)
[Thread 1] Processed 15000 zonotopes (Work Done: 0.01221%; Expected Zonos: 1.2288e8)
[Thread 1] Processed 15100 zonotopes (Work Done: 0.01221%; Expected Zonos: 1.236992e8)
[Thread 1] Processed 15200 zonotopes (Work Done: 0.01221%; Expected Zonos: 1.245184e8)
[Thread 1] Processed 15300 zonotopes (Work Done: 0.01221%; Expected Zonos: 1.253376e8)
[Thread 1] Processed 15400 zonotopes (Work Done: 0.01221%; Expected Zonos: 1.261568e8)
[Thread 1] Processed 15500 zonotopes (Work Done: 0.01221%; Expected Zonos: 1.26976e8)
[Thread 1] Processed 15600 zonotopes (Work Done: 0.01221%; Expected Zonos: 1.277952e8)
[Thread 1] Processed 15700 zonotopes (Work Done: 0.01221%; Expected Zonos: 1.286144e8)
[Thread 1] Processed 15800 zonotopes (Work Done: 0.01221%; Expected Zonos: 1.294336e8)
[Thread 1] Processed 15900 zonotopes (Work Done: 0.01221%; Expected Zonos: 1.302528e8)
[Thread 1] Processed 16000 zonotopes (Work Done: 0.01221%; Expected Zonos: 1.31072e8)
[Thread 1] Processed 16100 zonotopes (Work Done: 0.01221%; Expected Zonos: 1.318912e8)
[Thread 1] Processed 16200 zonotopes (Work Done: 0.01221%; Expected Zonos: 1.327104e8)
[Thread 1] Processed 16300 zonotopes (Work Done: 0.01221%; Expected Zonos: 1.335296e8)
[Thread 1] Processed 16400 zonotopes (Work Done: 0.01221%; Expected Zonos: 1.343488e8)
[Thread 1] Processed 16500 zonotopes (Work Done: 0.01221%; Expected Zonos: 1.35168e8)
[Thread 1] Processed 16600 zonotopes (Work Done: 0.01221%; Expected Zonos: 1.359872e8)
[Thread 1] Processed 16700 zonotopes (Work Done: 0.01373%; Expected Zonos: 1.216056888888889e8)
[Thread 1] Processed 16800 zonotopes (Work Done: 0.01373%; Expected Zonos: 1.2233386666666667e8)
[Thread 1] Processed 16900 zonotopes (Work Done: 0.01373%; Expected Zonos: 1.2306204444444445e8)
[Thread 1] Processed 17000 zonotopes (Work Done: 0.01373%; Expected Zonos: 1.2379022222222222e8)
[Thread 1] Processed 17100 zonotopes (Work Done: 0.01373%; Expected Zonos: 1.245184e8)
[Thread 1] Processed 17200 zonotopes (Work Done: 0.01373%; Expected Zonos: 1.2524657777777778e8)
[Thread 1] Processed 17300 zonotopes (Work Done: 0.01373%; Expected Zonos: 1.2597475555555555e8)
[Thread 1] Processed 17400 zonotopes (Work Done: 0.01373%; Expected Zonos: 1.2670293333333333e8)
[Thread 1] Processed 17500 zonotopes (Work Done: 0.01373%; Expected Zonos: 1.274311111111111e8)
[Thread 1] Processed 17600 zonotopes (Work Done: 0.01373%; Expected Zonos: 1.281592888888889e8)
[Thread 1] Processed 17700 zonotopes (Work Done: 0.01373%; Expected Zonos: 1.2888746666666667e8)
[Thread 1] Processed 17800 zonotopes (Work Done: 0.01373%; Expected Zonos: 1.2961564444444445e8)
[Thread 1] Processed 17900 zonotopes (Work Done: 0.01373%; Expected Zonos: 1.3034382222222222e8)
[Thread 1] Processed 18000 zonotopes (Work Done: 0.01373%; Expected Zonos: 1.31072e8)
[Thread 1] Processed 18100 zonotopes (Work Done: 0.01373%; Expected Zonos: 1.3180017777777778e8)
[Thread 1] Processed 18200 zonotopes (Work Done: 0.01373%; Expected Zonos: 1.3252835555555555e8)
[Thread 1] Processed 18300 zonotopes (Work Done: 0.01373%; Expected Zonos: 1.3325653333333333e8)
[Thread 1] Processed 18400 zonotopes (Work Done: 0.01373%; Expected Zonos: 1.339847111111111e8)
[Thread 1] Processed 18500 zonotopes (Work Done: 0.01373%; Expected Zonos: 1.347128888888889e8)
[Thread 1] Processed 18600 zonotopes (Work Done: 0.01373%; Expected Zonos: 1.3544106666666666e8)
[Thread 1] Processed 18700 zonotopes (Work Done: 0.01373%; Expected Zonos: 1.3616924444444445e8)
[Thread 1] Processed 18800 zonotopes (Work Done: 0.01373%; Expected Zonos: 1.368974222222222e8)
[Thread 1] Processed 18900 zonotopes (Work Done: 0.01373%; Expected Zonos: 1.376256e8)
[Thread 1] Processed 19000 zonotopes (Work Done: 0.01373%; Expected Zonos: 1.383537777777778e8)
[Thread 1] Processed 19100 zonotopes (Work Done: 0.01373%; Expected Zonos: 1.3908195555555555e8)
[Thread 1] Processed 19200 zonotopes (Work Done: 0.01373%; Expected Zonos: 1.3981013333333334e8)
[Thread 1] Processed 19300 zonotopes (Work Done: 0.01373%; Expected Zonos: 1.405383111111111e8)
[Thread 1] Processed 19400 zonotopes (Work Done: 0.01373%; Expected Zonos: 1.412664888888889e8)
[Thread 1] Processed 19500 zonotopes (Work Done: 0.01373%; Expected Zonos: 1.4199466666666666e8)
[Thread 1] Processed 19600 zonotopes (Work Done: 0.01373%; Expected Zonos: 1.4272284444444445e8)
[Thread 1] Processed 19700 zonotopes (Work Done: 0.01373%; Expected Zonos: 1.434510222222222e8)
[Thread 1] Processed 19800 zonotopes (Work Done: 0.01373%; Expected Zonos: 1.441792e8)
[Thread 1] Processed 19900 zonotopes (Work Done: 0.01373%; Expected Zonos: 1.449073777777778e8)
[Thread 1] Processed 20000 zonotopes (Work Done: 0.01373%; Expected Zonos: 1.4563555555555555e8)
[Thread 1] Processed 20100 zonotopes (Work Done: 0.01373%; Expected Zonos: 1.4636373333333334e8)
[Thread 1] Processed 20200 zonotopes (Work Done: 0.01373%; Expected Zonos: 1.470919111111111e8)
[Thread 1] Processed 20300 zonotopes (Work Done: 0.01678%; Expected Zonos: 1.209437090909091e8)
[Thread 1] Processed 20400 zonotopes (Work Done: 0.01678%; Expected Zonos: 1.215394909090909e8)
[Thread 1] Processed 20500 zonotopes (Work Done: 0.01678%; Expected Zonos: 1.2213527272727273e8)
[Thread 1] Processed 20600 zonotopes (Work Done: 0.01678%; Expected Zonos: 1.2273105454545455e8)
[Thread 1] Processed 20700 zonotopes (Work Done: 0.01678%; Expected Zonos: 1.2332683636363636e8)
[Thread 1] Processed 20800 zonotopes (Work Done: 0.01678%; Expected Zonos: 1.2392261818181819e8)
[Thread 1] Processed 20900 zonotopes (Work Done: 0.01678%; Expected Zonos: 1.245184e8)
[Thread 1] Processed 21000 zonotopes (Work Done: 0.01678%; Expected Zonos: 1.2511418181818181e8)
[Thread 1] Processed 21100 zonotopes (Work Done: 0.01678%; Expected Zonos: 1.2570996363636364e8)
[Thread 1] Processed 21200 zonotopes (Work Done: 0.01755%; Expected Zonos: 1.2081419130434783e8)
[Thread 1] Processed 21300 zonotopes (Work Done: 0.01755%; Expected Zonos: 1.2138406956521739e8)
[Thread 1] Processed 21400 zonotopes (Work Done: 0.01755%; Expected Zonos: 1.2195394782608695e8)
[Thread 1] Processed 21500 zonotopes (Work Done: 0.01755%; Expected Zonos: 1.2252382608695652e8)
[Thread 1] Processed 21600 zonotopes (Work Done: 0.01755%; Expected Zonos: 1.230937043478261e8)
[Thread 1] Processed 21700 zonotopes (Work Done: 0.01755%; Expected Zonos: 1.2366358260869566e8)
[Thread 1] Processed 21800 zonotopes (Work Done: 0.01755%; Expected Zonos: 1.2423346086956522e8)
[Thread 1] Processed 21900 zonotopes (Work Done: 0.01755%; Expected Zonos: 1.2480333913043478e8)
[Thread 1] Processed 22000 zonotopes (Work Done: 0.01755%; Expected Zonos: 1.2537321739130434e8)
[Thread 1] Processed 22100 zonotopes (Work Done: 0.01755%; Expected Zonos: 1.259430956521739e8)
[Thread 1] Processed 22200 zonotopes (Work Done: 0.01755%; Expected Zonos: 1.2651297391304348e8)
[Thread 1] Processed 22300 zonotopes (Work Done: 0.01755%; Expected Zonos: 1.2708285217391305e8)
[Thread 1] Processed 22400 zonotopes (Work Done: 0.01755%; Expected Zonos: 1.2765273043478261e8)
[Thread 1] Processed 22500 zonotopes (Work Done: 0.01755%; Expected Zonos: 1.2822260869565217e8)
[Thread 1] Processed 22600 zonotopes (Work Done: 0.01755%; Expected Zonos: 1.2879248695652173e8)
[Thread 1] Processed 22700 zonotopes (Work Done: 0.01755%; Expected Zonos: 1.293623652173913e8)
[Thread 1] Processed 22800 zonotopes (Work Done: 0.01755%; Expected Zonos: 1.2993224347826087e8)
[Thread 1] Processed 22900 zonotopes (Work Done: 0.01755%; Expected Zonos: 1.3050212173913044e8)
[Thread 1] Processed 23000 zonotopes (Work Done: 0.01755%; Expected Zonos: 1.31072e8)
[Thread 1] Processed 23100 zonotopes (Work Done: 0.01755%; Expected Zonos: 1.3164187826086956e8)
[Thread 1] Processed 23200 zonotopes (Work Done: 0.01755%; Expected Zonos: 1.3221175652173913e8)
[Thread 1] Processed 23300 zonotopes (Work Done: 0.01755%; Expected Zonos: 1.327816347826087e8)
[Thread 1] Processed 23400 zonotopes (Work Done: 0.01755%; Expected Zonos: 1.3335151304347827e8)
[Thread 1] Processed 23500 zonotopes (Work Done: 0.01755%; Expected Zonos: 1.3392139130434783e8)
[Thread 1] Processed 23600 zonotopes (Work Done: 0.01755%; Expected Zonos: 1.344912695652174e8)
[Thread 1] Processed 23700 zonotopes (Work Done: 0.01755%; Expected Zonos: 1.3506114782608697e8)
[Thread 1] Processed 23800 zonotopes (Work Done: 0.01793%; Expected Zonos: 1.3274525957446809e8)
[Thread 1] Processed 23900 zonotopes (Work Done: 0.01793%; Expected Zonos: 1.3330301276595744e8)
[Thread 1] Processed 24000 zonotopes (Work Done: 0.01793%; Expected Zonos: 1.3386076595744681e8)
[Thread 1] Processed 24100 zonotopes (Work Done: 0.01793%; Expected Zonos: 1.3441851914893618e8)
[Thread 1] Processed 24200 zonotopes (Work Done: 0.01793%; Expected Zonos: 1.3497627234042552e8)
[Thread 1] Processed 24300 zonotopes (Work Done: 0.01793%; Expected Zonos: 1.355340255319149e8)
[Thread 1] Processed 24400 zonotopes (Work Done: 0.01793%; Expected Zonos: 1.3609177872340426e8)
[Thread 1] Processed 24500 zonotopes (Work Done: 0.01793%; Expected Zonos: 1.3664953191489363e8)
[Thread 1] Processed 24600 zonotopes (Work Done: 0.01793%; Expected Zonos: 1.3720728510638297e8)
[Thread 1] Processed 24700 zonotopes (Work Done: 0.01793%; Expected Zonos: 1.3776503829787233e8)
[Thread 1] Processed 24800 zonotopes (Work Done: 0.01793%; Expected Zonos: 1.383227914893617e8)
[Thread 1] Processed 24900 zonotopes (Work Done: 0.01793%; Expected Zonos: 1.3888054468085107e8)
[Thread 1] Processed 25000 zonotopes (Work Done: 0.02098%; Expected Zonos: 1.1915636363636364e8)
[Thread 1] Processed 25100 zonotopes (Work Done: 0.02098%; Expected Zonos: 1.196329890909091e8)
[Thread 1] Processed 25200 zonotopes (Work Done: 0.02098%; Expected Zonos: 1.2010961454545455e8)
[Thread 1] Processed 25300 zonotopes (Work Done: 0.02098%; Expected Zonos: 1.2058624e8)
[Thread 1] Processed 25400 zonotopes (Work Done: 0.02098%; Expected Zonos: 1.2106286545454545e8)
[Thread 1] Processed 25500 zonotopes (Work Done: 0.02098%; Expected Zonos: 1.215394909090909e8)
[Thread 1] Processed 25600 zonotopes (Work Done: 0.02098%; Expected Zonos: 1.2201611636363636e8)
[Thread 1] Processed 25700 zonotopes (Work Done: 0.02708%; Expected Zonos: 9.488874366197184e7)
[Thread 1] Processed 25800 zonotopes (Work Done: 0.02708%; Expected Zonos: 9.525796056338029e7)
[Thread 1] Processed 25900 zonotopes (Work Done: 0.02708%; Expected Zonos: 9.562717746478873e7)
[Thread 1] Processed 26000 zonotopes (Work Done: 0.02708%; Expected Zonos: 9.599639436619718e7)
[Thread 1] Processed 26100 zonotopes (Work Done: 0.03319%; Expected Zonos: 7.86432e7)
[Thread 1] Processed 26200 zonotopes (Work Done: 0.03319%; Expected Zonos: 7.894451494252874e7)
[Thread 1] Processed 26300 zonotopes (Work Done: 0.03319%; Expected Zonos: 7.924582988505746e7)
[Thread 1] Processed 26400 zonotopes (Work Done: 0.03319%; Expected Zonos: 7.95471448275862e7)
[Thread 1] Processed 26500 zonotopes (Work Done: 0.03319%; Expected Zonos: 7.984845977011494e7)
[Thread 1] Processed 26600 zonotopes (Work Done: 0.03319%; Expected Zonos: 8.014977471264368e7)
[Thread 1] Processed 26700 zonotopes (Work Done: 0.03319%; Expected Zonos: 8.045108965517241e7)
[Thread 1] Processed 26800 zonotopes (Work Done: 0.03319%; Expected Zonos: 8.075240459770115e7)
[Thread 1] Processed 26900 zonotopes (Work Done: 0.03319%; Expected Zonos: 8.105371954022989e7)
[Thread 1] Processed 27000 zonotopes (Work Done: 0.03624%; Expected Zonos: 7.450408421052632e7)
[Thread 1] Processed 27100 zonotopes (Work Done: 0.03624%; Expected Zonos: 7.478002526315789e7)
[Thread 1] Processed 27200 zonotopes (Work Done: 0.03624%; Expected Zonos: 7.505596631578948e7)
[Thread 1] Processed 27300 zonotopes (Work Done: 0.03624%; Expected Zonos: 7.533190736842105e7)
[Thread 1] Processed 27400 zonotopes (Work Done: 0.03624%; Expected Zonos: 7.560784842105263e7)
[Thread 1] Processed 27500 zonotopes (Work Done: 0.03624%; Expected Zonos: 7.58837894736842e7)
[Thread 1] Processed 27600 zonotopes (Work Done: 0.037%; Expected Zonos: 7.458942680412371e7)
[Thread 1] Processed 27700 zonotopes (Work Done: 0.037%; Expected Zonos: 7.485967835051547e7)
[Thread 1] Processed 27800 zonotopes (Work Done: 0.037%; Expected Zonos: 7.512992989690721e7)
[Thread 1] Processed 27900 zonotopes (Work Done: 0.037%; Expected Zonos: 7.540018144329897e7)
[Thread 1] Processed 28000 zonotopes (Work Done: 0.037%; Expected Zonos: 7.567043298969072e7)
[Thread 1] Processed 28100 zonotopes (Work Done: 0.037%; Expected Zonos: 7.594068453608248e7)
[Thread 1] Processed 28200 zonotopes (Work Done: 0.037%; Expected Zonos: 7.621093608247423e7)
[Thread 1] Processed 28300 zonotopes (Work Done: 0.037%; Expected Zonos: 7.648118762886597e7)
[Thread 1] Processed 28400 zonotopes (Work Done: 0.03777%; Expected Zonos: 7.520090505050506e7)
[Thread 1] Processed 28500 zonotopes (Work Done: 0.03777%; Expected Zonos: 7.546569696969697e7)
[Thread 1] Processed 28600 zonotopes (Work Done: 0.03777%; Expected Zonos: 7.57304888888889e7)
[Thread 1] Processed 28700 zonotopes (Work Done: 0.03777%; Expected Zonos: 7.59952808080808e7)
[Thread 1] Processed 28800 zonotopes (Work Done: 0.03777%; Expected Zonos: 7.626007272727273e7)
[Thread 1] Processed 28900 zonotopes (Work Done: 0.03777%; Expected Zonos: 7.652486464646465e7)
[Thread 1] Processed 29000 zonotopes (Work Done: 0.03777%; Expected Zonos: 7.678965656565657e7)
[Thread 1] Processed 29100 zonotopes (Work Done: 0.03777%; Expected Zonos: 7.705444848484848e7)
[Thread 1] Processed 29200 zonotopes (Work Done: 0.03777%; Expected Zonos: 7.731924040404041e7)
[Thread 1] Processed 29300 zonotopes (Work Done: 0.03777%; Expected Zonos: 7.758403232323232e7)
[Thread 1] Processed 29400 zonotopes (Work Done: 0.03777%; Expected Zonos: 7.784882424242425e7)
[Thread 1] Processed 29500 zonotopes (Work Done: 0.03853%; Expected Zonos: 7.656681188118812e7)
[Thread 1] Processed 29600 zonotopes (Work Done: 0.03853%; Expected Zonos: 7.68263603960396e7)
[Thread 1] Processed 29700 zonotopes (Work Done: 0.03853%; Expected Zonos: 7.708590891089109e7)
[Thread 1] Processed 29800 zonotopes (Work Done: 0.03853%; Expected Zonos: 7.734545742574258e7)
[Thread 1] Processed 29900 zonotopes (Work Done: 0.03853%; Expected Zonos: 7.760500594059406e7)
[Thread 1] Processed 30000 zonotopes (Work Done: 0.03853%; Expected Zonos: 7.786455445544554e7)
[Thread 1] Processed 30100 zonotopes (Work Done: 0.03853%; Expected Zonos: 7.812410297029702e7)
[Thread 1] Processed 30200 zonotopes (Work Done: 0.05074%; Expected Zonos: 5.9524427067669176e7)
[Thread 1] Processed 30300 zonotopes (Work Done: 0.05074%; Expected Zonos: 5.9721527819548875e7)
[Thread 1] Processed 30400 zonotopes (Work Done: 0.05074%; Expected Zonos: 5.9918628571428575e7)
[Thread 1] Processed 30500 zonotopes (Work Done: 0.05074%; Expected Zonos: 6.0115729323308274e7)
[Thread 1] Processed 30600 zonotopes (Work Done: 0.05074%; Expected Zonos: 6.0312830075187966e7)
[Thread 1] Processed 30700 zonotopes (Work Done: 0.05074%; Expected Zonos: 6.0509930827067666e7)
[Thread 1] Processed 30800 zonotopes (Work Done: 0.05074%; Expected Zonos: 6.0707031578947365e7)
[Thread 1] Processed 30900 zonotopes (Work Done: 0.05074%; Expected Zonos: 6.0904132330827065e7)
[Thread 1] Processed 31000 zonotopes (Work Done: 0.05074%; Expected Zonos: 6.1101233082706764e7)
[Thread 1] Processed 31100 zonotopes (Work Done: 0.0515%; Expected Zonos: 6.039021037037037e7)
[Thread 1] Processed 31200 zonotopes (Work Done: 0.05455%; Expected Zonos: 5.719505454545455e7)
[Thread 1] Processed 31300 zonotopes (Work Done: 0.05455%; Expected Zonos: 5.737837202797203e7)
[Thread 1] Processed 31400 zonotopes (Work Done: 0.05455%; Expected Zonos: 5.756168951048951e7)
[Thread 1] Processed 31500 zonotopes (Work Done: 0.05455%; Expected Zonos: 5.774500699300699e7)
[Thread 1] Processed 31600 zonotopes (Work Done: 0.05455%; Expected Zonos: 5.792832447552448e7)
[Thread 1] Processed 31700 zonotopes (Work Done: 0.05455%; Expected Zonos: 5.811164195804196e7)
[Thread 1] Processed 31800 zonotopes (Work Done: 0.05455%; Expected Zonos: 5.829495944055944e7)
[Thread 1] Processed 31900 zonotopes (Work Done: 0.05455%; Expected Zonos: 5.847827692307692e7)
[Thread 1] Processed 32000 zonotopes (Work Done: 0.05455%; Expected Zonos: 5.866159440559441e7)
[Thread 1] Processed 32100 zonotopes (Work Done: 0.07896%; Expected Zonos: 4.0651315942028984e7)
[Thread 1] Processed 32200 zonotopes (Work Done: 0.07896%; Expected Zonos: 4.077795555555555e7)
[Thread 1] Processed 32300 zonotopes (Work Done: 0.07896%; Expected Zonos: 4.090459516908213e7)
[Thread 1] Processed 32400 zonotopes (Work Done: 0.07896%; Expected Zonos: 4.1031234782608695e7)
[Thread 1] Processed 32500 zonotopes (Work Done: 0.07896%; Expected Zonos: 4.115787439613526e7)
[Thread 1] Processed 32600 zonotopes (Work Done: 0.07896%; Expected Zonos: 4.128451400966184e7)
[Thread 1] Processed 32700 zonotopes (Work Done: 0.07896%; Expected Zonos: 4.1411153623188406e7)
[Thread 1] Processed 32800 zonotopes (Work Done: 0.07896%; Expected Zonos: 4.1537793236714974e7)
[Thread 1] Processed 32900 zonotopes (Work Done: 0.07896%; Expected Zonos: 4.166443285024155e7)
[Thread 1] Processed 33000 zonotopes (Work Done: 0.07896%; Expected Zonos: 4.179107246376812e7)
[Thread 1] Processed 33100 zonotopes (Work Done: 0.08507%; Expected Zonos: 3.891016322869955e7)
[Thread 1] Processed 33200 zonotopes (Work Done: 0.08507%; Expected Zonos: 3.902771659192825e7)
[Thread 1] Processed 33300 zonotopes (Work Done: 0.08507%; Expected Zonos: 3.914526995515695e7)
[Thread 1] Processed 33400 zonotopes (Work Done: 0.08507%; Expected Zonos: 3.926282331838565e7)
[Thread 1] Processed 33500 zonotopes (Work Done: 0.08583%; Expected Zonos: 3.903032888888889e7)
[Thread 1] Processed 33600 zonotopes (Work Done: 0.08583%; Expected Zonos: 3.9146837333333336e7)
[Thread 1] Processed 33700 zonotopes (Work Done: 0.08583%; Expected Zonos: 3.9263345777777776e7)
[Thread 1] Processed 33800 zonotopes (Work Done: 0.08583%; Expected Zonos: 3.9379854222222224e7)
[Thread 1] Processed 33900 zonotopes (Work Done: 0.08583%; Expected Zonos: 3.9496362666666664e7)
[Thread 1] Processed 34000 zonotopes (Work Done: 0.09804%; Expected Zonos: 3.468052918287938e7)
[Thread 1] Processed 34100 zonotopes (Work Done: 0.09804%; Expected Zonos: 3.478253073929961e7)
[Thread 1] Processed 34200 zonotopes (Work Done: 0.09804%; Expected Zonos: 3.488453229571985e7)
[Thread 1] Processed 34300 zonotopes (Work Done: 0.09804%; Expected Zonos: 3.498653385214008e7)
[Thread 1] Processed 34400 zonotopes (Work Done: 0.10033%; Expected Zonos: 3.428803650190114e7)
[Thread 1] Processed 34500 zonotopes (Work Done: 0.10033%; Expected Zonos: 3.438771102661597e7)
[Thread 1] Processed 34600 zonotopes (Work Done: 0.10643%; Expected Zonos: 3.2509614336917564e7)
[Thread 1] Processed 34700 zonotopes (Work Done: 0.11864%; Expected Zonos: 2.924886430868167e7)
[Thread 1] Processed 34800 zonotopes (Work Done: 0.11864%; Expected Zonos: 2.9333154983922828e7)
[Thread 1] Processed 34900 zonotopes (Work Done: 0.11864%; Expected Zonos: 2.9417445659163985e7)
[Thread 1] Processed 35000 zonotopes (Work Done: 0.11864%; Expected Zonos: 2.9501736334405147e7)
[Thread 1] Processed 35100 zonotopes (Work Done: 0.11864%; Expected Zonos: 2.9586027009646304e7)
[Thread 1] Processed 35200 zonotopes (Work Done: 0.1194%; Expected Zonos: 2.9480730990415335e7)
[Thread 1] Processed 35300 zonotopes (Work Done: 0.1194%; Expected Zonos: 2.9564483067092653e7)
[Thread 1] Processed 35400 zonotopes (Work Done: 0.1194%; Expected Zonos: 2.964823514376997e7)
[Thread 1] Processed 35500 zonotopes (Work Done: 0.1194%; Expected Zonos: 2.9731987220447283e7)
[Thread 1] Processed 35600 zonotopes (Work Done: 0.1194%; Expected Zonos: 2.9815739297124602e7)
[Thread 1] Processed 35700 zonotopes (Work Done: 0.13161%; Expected Zonos: 2.7126205217391305e7)
[Thread 1] Processed 35800 zonotopes (Work Done: 0.13161%; Expected Zonos: 2.7202188985507246e7)
[Thread 1] Processed 35900 zonotopes (Work Done: 0.13161%; Expected Zonos: 2.7278172753623188e7)
[Thread 1] Processed 36000 zonotopes (Work Done: 0.13199%; Expected Zonos: 2.7275098265895955e7)
[Thread 1] Processed 36100 zonotopes (Work Done: 0.13809%; Expected Zonos: 2.614198453038674e7)
[Thread 1] Processed 36200 zonotopes (Work Done: 0.13962%; Expected Zonos: 2.5927903825136613e7)
[Thread 1] Processed 36300 zonotopes (Work Done: 0.13962%; Expected Zonos: 2.599952786885246e7)
[Thread 1] Processed 36400 zonotopes (Work Done: 0.13962%; Expected Zonos: 2.6071151912568305e7)
[Thread 1] Processed 36500 zonotopes (Work Done: 0.14572%; Expected Zonos: 2.504779057591623e7)
[Thread 1] Processed 36600 zonotopes (Work Done: 0.14572%; Expected Zonos: 2.5116414659685865e7)
[Thread 1] Processed 36700 zonotopes (Work Done: 0.14572%; Expected Zonos: 2.5185038743455496e7)
[Thread 1] Processed 36800 zonotopes (Work Done: 0.14572%; Expected Zonos: 2.525366282722513e7)
[Thread 1] Processed 36900 zonotopes (Work Done: 0.15793%; Expected Zonos: 2.3365008695652176e7)
[Thread 1] Processed 37000 zonotopes (Work Done: 0.15793%; Expected Zonos: 2.342832850241546e7)
[Thread 1] Processed 37100 zonotopes (Work Done: 0.15793%; Expected Zonos: 2.3491648309178744e7)
[Thread 1] Processed 37200 zonotopes (Work Done: 0.15793%; Expected Zonos: 2.3554968115942027e7)
[Thread 1] Processed 37300 zonotopes (Work Done: 0.15869%; Expected Zonos: 2.350473846153846e7)
[Thread 1] Processed 37400 zonotopes (Work Done: 0.15869%; Expected Zonos: 2.3567753846153848e7)
[Thread 1] Processed 37500 zonotopes (Work Done: 0.15869%; Expected Zonos: 2.3630769230769232e7)
[Thread 1] Processed 37600 zonotopes (Work Done: 0.15869%; Expected Zonos: 2.3693784615384616e7)
[Thread 1] Processed 37700 zonotopes (Work Done: 0.15869%; Expected Zonos: 2.37568e7)
[Thread 1] Processed 37800 zonotopes (Work Done: 0.15869%; Expected Zonos: 2.3819815384615384e7)
[Thread 1] Processed 37900 zonotopes (Work Done: 0.15869%; Expected Zonos: 2.3882830769230768e7)
[Thread 1] Processed 38000 zonotopes (Work Done: 0.15869%; Expected Zonos: 2.3945846153846152e7)
[Thread 1] Processed 38100 zonotopes (Work Done: 0.15869%; Expected Zonos: 2.400886153846154e7)
[Thread 1] Processed 38200 zonotopes (Work Done: 0.15869%; Expected Zonos: 2.4071876923076924e7)
[Thread 1] Processed 38300 zonotopes (Work Done: 0.15945%; Expected Zonos: 2.4019414354066987e7)
[Thread 1] Processed 38400 zonotopes (Work Done: 0.15945%; Expected Zonos: 2.408212822966507e7)
[Thread 1] Processed 38500 zonotopes (Work Done: 0.15945%; Expected Zonos: 2.414484210526316e7)
[Thread 1] Processed 38600 zonotopes (Work Done: 0.16251%; Expected Zonos: 2.3752953990610328e7)
[Thread 1] Processed 38700 zonotopes (Work Done: 0.16251%; Expected Zonos: 2.381449014084507e7)
[Thread 1] Processed 38800 zonotopes (Work Done: 0.16556%; Expected Zonos: 2.3435915207373273e7)
[Thread 1] Processed 38900 zonotopes (Work Done: 0.16556%; Expected Zonos: 2.3496317050691243e7)
[Thread 1] Processed 39000 zonotopes (Work Done: 0.16632%; Expected Zonos: 2.3448660550458714e7)
[Thread 1] Processed 39100 zonotopes (Work Done: 0.16632%; Expected Zonos: 2.3508785321100917e7)
[Thread 1] Processed 39200 zonotopes (Work Done: 0.16708%; Expected Zonos: 2.3461289497716896e7)
[Thread 1] Processed 39300 zonotopes (Work Done: 0.16708%; Expected Zonos: 2.3521139726027396e7)
[Thread 1] Processed 39400 zonotopes (Work Done: 0.16708%; Expected Zonos: 2.35809899543379e7)
[Thread 1] Processed 39500 zonotopes (Work Done: 0.16708%; Expected Zonos: 2.36408401826484e7)
[Thread 1] Processed 39600 zonotopes (Work Done: 0.16708%; Expected Zonos: 2.3700690410958905e7)
[Thread 1] Processed 39700 zonotopes (Work Done: 0.16708%; Expected Zonos: 2.3760540639269408e7)
[Thread 1] Processed 39800 zonotopes (Work Done: 0.16708%; Expected Zonos: 2.3820390867579907e7)
[Thread 1] Processed 39900 zonotopes (Work Done: 0.16708%; Expected Zonos: 2.388024109589041e7)
[Thread 1] Processed 40000 zonotopes (Work Done: 0.17014%; Expected Zonos: 2.351067264573991e7)
[Thread 1] Processed 40100 zonotopes (Work Done: 0.17014%; Expected Zonos: 2.356944932735426e7)
[Thread 1] Processed 40200 zonotopes (Work Done: 0.17014%; Expected Zonos: 2.362822600896861e7)
[Thread 1] Processed 40300 zonotopes (Work Done: 0.17014%; Expected Zonos: 2.368700269058296e7)
[Thread 1] Processed 40400 zonotopes (Work Done: 0.17014%; Expected Zonos: 2.3745779372197308e7)
[Thread 1] Processed 40500 zonotopes (Work Done: 0.1709%; Expected Zonos: 2.3698285714285713e7)
[Thread 1] Processed 40600 zonotopes (Work Done: 0.1709%; Expected Zonos: 2.37568e7)
[Thread 1] Processed 40700 zonotopes (Work Done: 0.1709%; Expected Zonos: 2.3815314285714287e7)
[Thread 1] Processed 40800 zonotopes (Work Done: 0.1709%; Expected Zonos: 2.387382857142857e7)
[Thread 1] Processed 40900 zonotopes (Work Done: 0.17242%; Expected Zonos: 2.372055221238938e7)
[Thread 1] Processed 41000 zonotopes (Work Done: 0.17242%; Expected Zonos: 2.3778548672566373e7)
[Thread 1] Processed 41100 zonotopes (Work Done: 0.17242%; Expected Zonos: 2.3836545132743362e7)
[Thread 1] Processed 41200 zonotopes (Work Done: 0.17242%; Expected Zonos: 2.3894541592920355e7)
[Thread 1] Processed 41300 zonotopes (Work Done: 0.17242%; Expected Zonos: 2.3952538053097345e7)
[Thread 1] Processed 41400 zonotopes (Work Done: 0.17242%; Expected Zonos: 2.4010534513274338e7)
[Thread 1] Processed 41500 zonotopes (Work Done: 0.17929%; Expected Zonos: 2.314675744680851e7)
[Thread 1] Processed 41600 zonotopes (Work Done: 0.17929%; Expected Zonos: 2.320253276595745e7)
[Thread 1] Processed 41700 zonotopes (Work Done: 0.17929%; Expected Zonos: 2.3258308085106384e7)
[Thread 1] Processed 41800 zonotopes (Work Done: 0.18234%; Expected Zonos: 2.2923889539748956e7)
[Thread 1] Processed 41900 zonotopes (Work Done: 0.18234%; Expected Zonos: 2.2978731380753137e7)
[Thread 1] Processed 42000 zonotopes (Work Done: 0.18234%; Expected Zonos: 2.3033573221757323e7)
[Thread 1] Processed 42100 zonotopes (Work Done: 0.18234%; Expected Zonos: 2.3088415062761508e7)
[Thread 1] Processed 42200 zonotopes (Work Done: 0.18234%; Expected Zonos: 2.314325690376569e7)
[Thread 1] Processed 42300 zonotopes (Work Done: 0.18234%; Expected Zonos: 2.3198098744769875e7)
[Thread 1] Processed 42400 zonotopes (Work Done: 0.18234%; Expected Zonos: 2.325294058577406e7)
[Thread 1] Processed 42500 zonotopes (Work Done: 0.18234%; Expected Zonos: 2.3307782426778242e7)
[Thread 1] Processed 42600 zonotopes (Work Done: 0.18234%; Expected Zonos: 2.3362624267782427e7)
[Thread 1] Processed 42700 zonotopes (Work Done: 0.18387%; Expected Zonos: 2.3223130290456433e7)
[Thread 1] Processed 42800 zonotopes (Work Done: 0.18539%; Expected Zonos: 2.3085932510288067e7)
[Thread 1] Processed 42900 zonotopes (Work Done: 0.18692%; Expected Zonos: 2.295097469387755e7)
[Thread 1] Processed 43000 zonotopes (Work Done: 0.18692%; Expected Zonos: 2.3004473469387755e7)
[Thread 1] Processed 43100 zonotopes (Work Done: 0.18768%; Expected Zonos: 2.2964240650406506e7)
[Thread 1] Processed 43200 zonotopes (Work Done: 0.18768%; Expected Zonos: 2.3017521951219514e7)
[Thread 1] Processed 43300 zonotopes (Work Done: 0.18921%; Expected Zonos: 2.2884748387096774e7)
[Thread 1] Processed 43400 zonotopes (Work Done: 0.18921%; Expected Zonos: 2.29376e7)
[Thread 1] Processed 43500 zonotopes (Work Done: 0.18921%; Expected Zonos: 2.2990451612903226e7)
[Thread 1] Processed 43600 zonotopes (Work Done: 0.19073%; Expected Zonos: 2.28589568e7)
[Thread 1] Processed 43700 zonotopes (Work Done: 0.21515%; Expected Zonos: 2.0311512056737587e7)
[Thread 1] Processed 43800 zonotopes (Work Done: 0.21591%; Expected Zonos: 2.028605512367491e7)
[Thread 1] Processed 43900 zonotopes (Work Done: 0.21591%; Expected Zonos: 2.03323703180212e7)
[Thread 1] Processed 44000 zonotopes (Work Done: 0.21591%; Expected Zonos: 2.037868551236749e7)
[Thread 1] Processed 44100 zonotopes (Work Done: 0.21591%; Expected Zonos: 2.042500070671378e7)
[Thread 1] Processed 44200 zonotopes (Work Done: 0.21667%; Expected Zonos: 2.03992338028169e7)
[Thread 1] Processed 44300 zonotopes (Work Done: 0.21667%; Expected Zonos: 2.044538591549296e7)
[Thread 1] Processed 44400 zonotopes (Work Done: 0.21667%; Expected Zonos: 2.0491538028169014e7)
[Thread 1] Processed 44500 zonotopes (Work Done: 0.21667%; Expected Zonos: 2.053769014084507e7)
[Thread 1] Processed 44600 zonotopes (Work Done: 0.21667%; Expected Zonos: 2.0583842253521126e7)
[Thread 1] Processed 44700 zonotopes (Work Done: 0.21667%; Expected Zonos: 2.0629994366197184e7)
[Thread 1] Processed 44800 zonotopes (Work Done: 0.21667%; Expected Zonos: 2.0676146478873238e7)
[Thread 1] Processed 44900 zonotopes (Work Done: 0.2182%; Expected Zonos: 2.057738741258741e7)
[Thread 1] Processed 45000 zonotopes (Work Done: 0.2182%; Expected Zonos: 2.0623216783216782e7)
[Thread 1] Processed 45100 zonotopes (Work Done: 0.2182%; Expected Zonos: 2.0669046153846152e7)
[Thread 1] Processed 45200 zonotopes (Work Done: 0.23041%; Expected Zonos: 1.961739867549669e7)
[Thread 1] Processed 45300 zonotopes (Work Done: 0.23041%; Expected Zonos: 1.96608e7)
[Thread 1] Processed 45400 zonotopes (Work Done: 0.23041%; Expected Zonos: 1.970420132450331e7)
[Thread 1] Processed 45500 zonotopes (Work Done: 0.23041%; Expected Zonos: 1.9747602649006624e7)
[Thread 1] Processed 45600 zonotopes (Work Done: 0.23041%; Expected Zonos: 1.9791003973509934e7)
[Thread 1] Processed 45700 zonotopes (Work Done: 0.23041%; Expected Zonos: 1.9834405298013244e7)
[Thread 1] Processed 45800 zonotopes (Work Done: 0.23041%; Expected Zonos: 1.9877806622516558e7)
[Thread 1] Processed 45900 zonotopes (Work Done: 0.23117%; Expected Zonos: 1.9855461386138614e7)
[Thread 1] Processed 46000 zonotopes (Work Done: 0.23193%; Expected Zonos: 1.9833263157894738e7)
[Thread 1] Processed 46100 zonotopes (Work Done: 0.2449%; Expected Zonos: 1.8823735825545173e7)
[Thread 1] Processed 46200 zonotopes (Work Done: 0.24796%; Expected Zonos: 1.8632388923076924e7)
[Thread 1] Processed 46300 zonotopes (Work Done: 0.24834%; Expected Zonos: 1.86440356374808e7)
[Thread 1] Processed 46400 zonotopes (Work Done: 0.24834%; Expected Zonos: 1.8684303533026114e7)
[Thread 1] Processed 46500 zonotopes (Work Done: 0.24834%; Expected Zonos: 1.872457142857143e7)
[Thread 1] Processed 46600 zonotopes (Work Done: 0.2491%; Expected Zonos: 1.8707366615620214e7)
[Thread 1] Processed 46700 zonotopes (Work Done: 0.2491%; Expected Zonos: 1.874751117917305e7)
[Thread 1] Processed 46800 zonotopes (Work Done: 0.2491%; Expected Zonos: 1.878765574272588e7)
[Thread 1] Processed 46900 zonotopes (Work Done: 0.2491%; Expected Zonos: 1.8827800306278713e7)
[Thread 1] Processed 47000 zonotopes (Work Done: 0.2491%; Expected Zonos: 1.8867944869831547e7)
[Thread 1] Processed 47100 zonotopes (Work Done: 0.2492%; Expected Zonos: 1.8900853272101033e7)
[Thread 1] Processed 47200 zonotopes (Work Done: 0.2492%; Expected Zonos: 1.8940982472254112e7)
[Thread 1] Processed 47300 zonotopes (Work Done: 0.24996%; Expected Zonos: 1.8923176192293018e7)
[Thread 1] Processed 47400 zonotopes (Work Done: 0.24996%; Expected Zonos: 1.8963182907287296e7)
[Thread 1] Processed 47500 zonotopes (Work Done: 0.24996%; Expected Zonos: 1.9003189622281574e7)
[Thread 1] Processed 47600 zonotopes (Work Done: 0.26255%; Expected Zonos: 1.8130118997457318e7)
[Thread 1] Processed 47700 zonotopes (Work Done: 0.26255%; Expected Zonos: 1.8168207482746094e7)
[Thread 1] Processed 47800 zonotopes (Work Done: 0.26255%; Expected Zonos: 1.820629596803487e7)
[Thread 1] Processed 47900 zonotopes (Work Done: 0.26255%; Expected Zonos: 1.8244384453323647e7)
[Thread 1] Processed 48000 zonotopes (Work Done: 0.26255%; Expected Zonos: 1.8282472938612424e7)
[Thread 1] Processed 48100 zonotopes (Work Done: 0.2656%; Expected Zonos: 1.8110055870736085e7)
[Thread 1] Processed 48200 zonotopes (Work Done: 0.2656%; Expected Zonos: 1.814770671454219e7)
[Thread 1] Processed 48300 zonotopes (Work Done: 0.2656%; Expected Zonos: 1.8185357558348294e7)
[Thread 1] Processed 48400 zonotopes (Work Done: 0.2656%; Expected Zonos: 1.8223008402154397e7)
[Thread 1] Processed 48500 zonotopes (Work Done: 0.2656%; Expected Zonos: 1.8260659245960504e7)
[Thread 1] Processed 48600 zonotopes (Work Done: 0.2656%; Expected Zonos: 1.8298310089766607e7)
[Thread 1] Processed 48700 zonotopes (Work Done: 0.2656%; Expected Zonos: 1.833596093357271e7)
[Thread 1] Processed 48800 zonotopes (Work Done: 0.2656%; Expected Zonos: 1.8373611777378816e7)
[Thread 1] Processed 48900 zonotopes (Work Done: 0.26636%; Expected Zonos: 1.835852717508056e7)
[Thread 1] Processed 49000 zonotopes (Work Done: 0.26789%; Expected Zonos: 1.8291286578853685e7)
[Thread 1] Processed 49100 zonotopes (Work Done: 0.27781%; Expected Zonos: 1.7674247030552696e7)
[Thread 1] Processed 49200 zonotopes (Work Done: 0.27933%; Expected Zonos: 1.761349921474906e7)
[Thread 1] Processed 49300 zonotopes (Work Done: 0.28276%; Expected Zonos: 1.7435007352445193e7)
[Thread 1] Processed 49400 zonotopes (Work Done: 0.28276%; Expected Zonos: 1.7470372478920743e7)
[Thread 1] Processed 49500 zonotopes (Work Done: 0.28276%; Expected Zonos: 1.750573760539629e7)
[Thread 1] Processed 49600 zonotopes (Work Done: 0.28276%; Expected Zonos: 1.754110273187184e7)
[Thread 1] Processed 49700 zonotopes (Work Done: 0.28276%; Expected Zonos: 1.7576467858347386e7)
[Thread 1] Processed 49800 zonotopes (Work Done: 0.29497%; Expected Zonos: 1.6882988942774005e7)
[Thread 1] Processed 49900 zonotopes (Work Done: 0.29573%; Expected Zonos: 1.687324811351177e7)
[Thread 1] Processed 50000 zonotopes (Work Done: 0.2965%; Expected Zonos: 1.6863557413959473e7)
[Thread 1] Processed 50100 zonotopes (Work Done: 0.2965%; Expected Zonos: 1.6897284528787393e7)
[Thread 1] Processed 50200 zonotopes (Work Done: 0.29802%; Expected Zonos: 1.6844324864e7)
[Thread 1] Processed 50300 zonotopes (Work Done: 0.29802%; Expected Zonos: 1.6877879296e7)
[Thread 1] Processed 50400 zonotopes (Work Done: 0.29879%; Expected Zonos: 1.686825100542611e7)
[Thread 1] Processed 50500 zonotopes (Work Done: 0.29879%; Expected Zonos: 1.6901719757421e7)
[Thread 1] Processed 50600 zonotopes (Work Done: 0.30031%; Expected Zonos: 1.6849141187678628e7)
[Thread 1] Processed 50700 zonotopes (Work Done: 0.30107%; Expected Zonos: 1.683965891669306e7)
[Thread 1] Processed 50800 zonotopes (Work Done: 0.30107%; Expected Zonos: 1.687287323408299e7)
[Thread 1] Processed 50900 zonotopes (Work Done: 0.3026%; Expected Zonos: 1.6820837819098644e7)
[Thread 1] Processed 51000 zonotopes (Work Done: 0.30336%; Expected Zonos: 1.6811498270983968e7)
[Thread 1] Processed 51100 zonotopes (Work Done: 0.30413%; Expected Zonos: 1.6802205581687048e7)
[Thread 1] Processed 51200 zonotopes (Work Done: 0.30413%; Expected Zonos: 1.683508661022264e7)
[Thread 1] Processed 51300 zonotopes (Work Done: 0.30413%; Expected Zonos: 1.686796763875823e7)
[Thread 1] Processed 51400 zonotopes (Work Done: 0.30489%; Expected Zonos: 1.6858556897091024e7)
[Thread 1] Processed 51500 zonotopes (Work Done: 0.30489%; Expected Zonos: 1.689135564591805e7)
[Thread 1] Processed 51600 zonotopes (Work Done: 0.30489%; Expected Zonos: 1.6924154394745074e7)
[Thread 1] Processed 51700 zonotopes (Work Done: 0.30527%; Expected Zonos: 1.693576357388316e7)
[Thread 1] Processed 51800 zonotopes (Work Done: 0.30527%; Expected Zonos: 1.6968521337082162e7)
[Thread 1] Processed 51900 zonotopes (Work Done: 0.30565%; Expected Zonos: 1.698006065522621e7)
[Thread 1] Processed 52000 zonotopes (Work Done: 0.30565%; Expected Zonos: 1.7012777535101403e7)
[Thread 1] Processed 52100 zonotopes (Work Done: 0.30565%; Expected Zonos: 1.70454944149766e7)
[Thread 1] Processed 52200 zonotopes (Work Done: 0.30565%; Expected Zonos: 1.7078211294851795e7)
[Thread 1] Processed 52300 zonotopes (Work Done: 0.30565%; Expected Zonos: 1.711092817472699e7)
[Thread 1] Processed 52400 zonotopes (Work Done: 0.30718%; Expected Zonos: 1.7058485687674634e7)
[Thread 1] Processed 52500 zonotopes (Work Done: 0.30718%; Expected Zonos: 1.7091040049674015e7)
[Thread 1] Processed 52600 zonotopes (Work Done: 0.30718%; Expected Zonos: 1.7123594411673393e7)
[Thread 1] Processed 52700 zonotopes (Work Done: 0.31404%; Expected Zonos: 1.678103710901913e7)
[Thread 1] Processed 52800 zonotopes (Work Done: 0.31404%; Expected Zonos: 1.681287968417856e7)
[Thread 1] Processed 52900 zonotopes (Work Done: 0.3171%; Expected Zonos: 1.6682607639097745e7)
[Thread 1] Processed 53000 zonotopes (Work Done: 0.3171%; Expected Zonos: 1.6714143759398496e7)
[Thread 1] Processed 53100 zonotopes (Work Done: 0.3171%; Expected Zonos: 1.6745679879699249e7)
[Thread 1] Processed 53200 zonotopes (Work Done: 0.3171%; Expected Zonos: 1.6777216e7)


TIMEOUT REACHED
UNKNOWN
[Thread 1] Total splits: 53187
Processed 53281 zonotopes (Work Done: 0.3%); Generated 106374 (0.0022522386577954615s/loop)
[Thread 1] Finished in 120.0s
 ────────────────────────────────────────────────────────────────────────────────
                                        Time                    Allocations      
                               ───────────────────────   ────────────────────────
       Tot / % measured:             120s / 100.0%           81.4GiB / 100.0%    

 Section               ncalls     time    %tot     avg     alloc    %tot      avg
 ────────────────────────────────────────────────────────────────────────────────
 Verify                     1     120s  100.0%    120s   81.4GiB  100.0%  81.4GiB
   Zonotope Loop            1     120s  100.0%    120s   81.4GiB  100.0%  81.4GiB
     Zonotope Propa...  53.3k    78.9s   65.8%  1.48ms   30.9GiB   37.9%   608KiB
       DiffZonotope...   213k    48.8s   40.7%   229μs   7.45GiB    9.1%  36.7KiB
         Zonotope_D...   426k    23.1s   19.3%  54.3μs   4.26GiB    5.2%  10.5KiB
       DiffZonotope...   160k    29.8s   24.8%   187μs   23.4GiB   28.7%   154KiB
         Zonotope_R...   320k    17.2s   14.4%  53.9μs   14.1GiB   17.4%  46.4KiB
           Influenc...   320k    5.02s    4.2%  15.7μs   2.83GiB    3.5%  9.27KiB
             Multiply    320k    4.16s    3.5%  13.0μs   1.64GiB    2.0%  5.39KiB
             Alloca...   320k    537ms    0.4%  1.68μs   1.18GiB    1.5%  3.89KiB
             Set Ma...   320k    159ms    0.1%   497ns     0.00B    0.0%    0.00B
           Allocation    320k    4.34s    3.6%  13.6μs   5.06GiB    6.2%  16.6KiB
           Column M...   320k    3.69s    3.1%  11.6μs   5.11GiB    6.3%  16.7KiB
           Vectors       320k    1.54s    1.3%  4.82μs   0.99GiB    1.2%  3.26KiB
           Set Matrix    320k    820ms    0.7%  2.56μs    145MiB    0.2%     476B
           Bounds        320k   67.6ms    0.1%   212ns     0.00B    0.0%    0.00B
     Property Check     53.3k    6.97s    5.8%   131μs   3.24GiB    4.0%  63.9KiB
     Compute Split      53.2k    5.64s    4.7%   106μs   6.35GiB    7.8%   125KiB
 Initialize                 1    333μs    0.0%   333μs    821KiB    0.0%   821KiB
 ────────────────────────────────────────────────────────────────────────────────
[VERYDIFF_TIMER] 120.033051483

[VERYDIFF_EXPERIMENT] NETWORK: /home/i57/steuber/NeuroDiff/repos/VeryDiffExperiments/src/../benchmarks/mnist-prune/specs/mnist_85_local_15.vnnlib
[VERYDIFF_EXPERIMENT] TIME: 120.727551261
