
[VERYDIFF_EXPERIMENT] Running on /home/i57/steuber/NeuroDiff/repos/VeryDiffExperiments/src/../benchmarks/mnist-prune/specs/mnist_75_local_24.vnnlib /home/i57/steuber/NeuroDiff/repos/VeryDiffExperiments/src/../benchmarks/mnist-prune/nets/mnist_relu_4_1024.onnx
Found input X
op: matmul, weight: (1024, 784), bias: nothing
op: bias, weight: nothing, bias: (1024,)
op: relu, weight: nothing, bias: nothing
op: matmul, weight: (1024, 1024), bias: nothing
op: bias, weight: nothing, bias: (1024,)
op: relu, weight: nothing, bias: nothing
op: matmul, weight: (1024, 1024), bias: nothing
op: bias, weight: nothing, bias: (1024,)
op: relu, weight: nothing, bias: nothing
op: matmul, weight: (10, 1024), bias: nothing
op: bias, weight: nothing, bias: (10,)
op: relu, weight: nothing, bias: nothing
op: matmul, weight: (10, 10), bias: nothing
op: bias, weight: nothing, bias: (10,)
Found input X
op: gemm, weight: (1024, 784), bias: (1024,)
op: relu, weight: nothing, bias: nothing
op: gemm, weight: (1024, 1024), bias: (1024,)
op: relu, weight: nothing, bias: nothing
op: gemm, weight: (1024, 1024), bias: (1024,)
op: relu, weight: nothing, bias: nothing
op: gemm, weight: (10, 1024), bias: (10,)
op: relu, weight: nothing, bias: nothing
op: gemm, weight: (10, 10), bias: (10,)
Distance: 915.6394868631054
Distance: 1298.7052820973968
Distance: 1296.587532894263
Distance: 6.054483317080667
Distance: 0.04942679278974538
Running with 1 threads
[Thread 1] Time to first task: 0.0s
Instable Generators: 477
Instable Generators: 865
Instable Generators: 1024
Instable Generators: 10
Zono Bounds:
[-164.84340886538368, -168.28045423912823, -185.66236844260365, -184.14929343201243, -177.5406272841968, -187.5773060543639, -167.18059102807274, -175.04163608582425, -179.44392083637132, -186.7958143717718]
[164.79786955002035, 167.71500356806206, 184.93664489240714, 183.26028447283613, 177.4339855700122, 186.95399477091533, 167.1789857139646, 174.49195824700146, 179.5467142735386, 186.61547748949536]
[Thread 1] Processed 100 zonotopes (Work Done: 0.0%; Expected Zonos: Inf)


TIMEOUT REACHED
UNKNOWN
[Thread 1] Total splits: 131
Processed 131 zonotopes (Work Done: 0.0%); Generated 262 (0.9215614772519084s/loop)
[Thread 1] Finished in 120.72s
 ────────────────────────────────────────────────────────────────────────────────
                                        Time                    Allocations      
                               ───────────────────────   ────────────────────────
       Tot / % measured:             121s / 100.0%           40.7GiB / 100.0%    

 Section               ncalls     time    %tot     avg     alloc    %tot      avg
 ────────────────────────────────────────────────────────────────────────────────
 Verify                     1     121s  100.0%    121s   40.7GiB   99.9%  40.7GiB
   Zonotope Loop            1     121s  100.0%    121s   40.7GiB   99.9%  40.7GiB
     Zonotope Propa...    131     119s   98.8%   910ms   40.4GiB   99.1%   315MiB
       DiffZonotope...    655    63.7s   52.7%  97.2ms   8.68GiB   21.3%  13.6MiB
         Zonotope_D...  1.31k    21.6s   17.9%  16.5ms   3.54GiB    8.7%  2.77MiB
       DiffZonotope...    524    55.6s   46.0%   106ms   31.7GiB   77.8%  61.9MiB
         Zonotope_R...  1.05k    16.4s   13.5%  15.6ms   19.8GiB   48.6%  19.3MiB
           Allocation   1.05k    8.95s    7.4%  8.54ms   7.95GiB   19.5%  7.77MiB
           Column M...  1.05k    4.03s    3.3%  3.85ms   7.95GiB   19.5%  7.77MiB
           Influenc...  1.05k    1.99s    1.6%  1.89ms   3.82GiB    9.4%  3.74MiB
             Multiply   1.05k    1.92s    1.6%  1.83ms   3.53GiB    8.7%  3.45MiB
             Alloca...  1.05k   45.6ms    0.0%  43.5μs    299MiB    0.7%   292KiB
             Set Ma...  1.05k   18.9ms    0.0%  18.1μs     0.00B    0.0%    0.00B
           Set Matrix   1.05k    1.36s    1.1%  1.30ms   14.7MiB    0.0%  14.3KiB
           Vectors      1.05k   26.5ms    0.0%  25.3μs   34.8MiB    0.1%  34.0KiB
           Bounds       1.05k    647μs    0.0%   617ns     0.00B    0.0%    0.00B
     Property Check       131    1.40s    1.2%  10.7ms   70.6MiB    0.2%   552KiB
     Compute Split        131   78.6ms    0.1%   600μs    176MiB    0.4%  1.34MiB
 Initialize                 1   15.1ms    0.0%  15.1ms   22.4MiB    0.1%  22.4MiB
 ────────────────────────────────────────────────────────────────────────────────
[VERYDIFF_TIMER] 120.819182279

[VERYDIFF_EXPERIMENT] NETWORK: /home/i57/steuber/NeuroDiff/repos/VeryDiffExperiments/src/../benchmarks/mnist-prune/specs/mnist_75_local_24.vnnlib
[VERYDIFF_EXPERIMENT] TIME: 121.145158802
