
[VERYDIFF_EXPERIMENT] Running on /home/i57/steuber/NeuroDiff/repos/VeryDiffExperiments/src/../benchmarks/mnist-prune/specs/mnist_8_global_4.vnnlib /home/i57/steuber/NeuroDiff/repos/VeryDiffExperiments/src/../benchmarks/mnist-prune/nets/mnist_relu_3_100.onnx
Total difference: 419.1098
Average difference: 0.0047
Initial output delta:
[-0.909723 -0.822302 -1.066706 -0.110969 -0.879673 -1.025064 -1.040050 -0.002983 -0.875129 -0.869234 ]
[0.773087 0.923297 0.909232 0.003178 1.056175 1.007949 0.894585 0.004126 0.834179 1.018846 ]

No adv!
time: 0.406820 


numSplits: 1
setenv(`timeout -k 5 120 ../NeuroDiff/DiffNN-Code/delta_network_test 408 /home/i57/steuber/NeuroDiff/repos/VeryDiffExperiments/src/../benchmarks/mnist-prune/nets/mnist_relu_3_100.nnet /home/i57/steuber/NeuroDiff/repos/VeryDiffExperiments/src/../benchmarks/mnist-prune/nets_pruned/mnist_relu_3_100_0.79_adam_1_stepsize.nnet 1.0 -p 4`,["OMP_NUM_THREADS=1"])
[VERYDIFF_TIMER] 0.45420111

[VERYDIFF_EXPERIMENT] NETWORK: /home/i57/steuber/NeuroDiff/repos/VeryDiffExperiments/src/../benchmarks/mnist-prune/specs/mnist_8_global_4.vnnlib
[VERYDIFF_EXPERIMENT] TIME: 0.805843571
