
[VERYDIFF_EXPERIMENT] Running on /home/i57/steuber/NeuroDiff/repos/VeryDiffExperiments/src/../benchmarks/mnist-prune/specs/mnist_38_local_24.vnnlib /home/i57/steuber/NeuroDiff/repos/VeryDiffExperiments/src/../benchmarks/mnist-prune/nets/mnist_relu_4_1024.onnx
Found input X
op: matmul, weight: (1024, 784), bias: nothing
op: bias, weight: nothing, bias: (1024,)
op: relu, weight: nothing, bias: nothing
op: matmul, weight: (1024, 1024), bias: nothing
op: bias, weight: nothing, bias: (1024,)
op: relu, weight: nothing, bias: nothing
op: matmul, weight: (1024, 1024), bias: nothing
op: bias, weight: nothing, bias: (1024,)
op: relu, weight: nothing, bias: nothing
op: matmul, weight: (10, 1024), bias: nothing
op: bias, weight: nothing, bias: (10,)
op: relu, weight: nothing, bias: nothing
op: matmul, weight: (10, 10), bias: nothing
op: bias, weight: nothing, bias: (10,)
Found input X
op: gemm, weight: (1024, 784), bias: (1024,)
op: relu, weight: nothing, bias: nothing
op: gemm, weight: (1024, 1024), bias: (1024,)
op: relu, weight: nothing, bias: nothing
op: gemm, weight: (1024, 1024), bias: (1024,)
op: relu, weight: nothing, bias: nothing
op: gemm, weight: (10, 1024), bias: (10,)
op: relu, weight: nothing, bias: nothing
op: gemm, weight: (10, 10), bias: (10,)
Distance: 915.6394868631054
Distance: 1298.7052820973968
Distance: 1296.587532894263
Distance: 6.054483317080667
Distance: 0.04942679278974538
Running with 1 threads
[Thread 1] Time to first task: 0.0s
Instable Generators: 554
Instable Generators: 987
Instable Generators: 1024
Instable Generators: 10
Zono Bounds:
[-207.52607495929814, -211.90172587854465, -233.58997070512982, -231.84052898732958, -222.45874002533938, -235.8312346664834, -210.62814661795423, -220.0573108587598, -225.47403266871763, -234.79102946574034]
[207.21567568603464, 211.47779833361483, 232.80860384414467, 231.5572268448485, 222.34710715116844, 235.44262664272105, 210.5199527137975, 219.2784766152441, 225.62150563551089, 234.48650547567337]


TIMEOUT REACHED
UNKNOWN
[Thread 1] Total splits: 89
Processed 89 zonotopes (Work Done: 0.0%); Generated 178 (1.350084870483146s/loop)
[Thread 1] Finished in 120.16s
 ────────────────────────────────────────────────────────────────────────────────
                                        Time                    Allocations      
                               ───────────────────────   ────────────────────────
       Tot / % measured:             120s / 100.0%           31.8GiB / 100.0%    

 Section               ncalls     time    %tot     avg     alloc    %tot      avg
 ────────────────────────────────────────────────────────────────────────────────
 Verify                     1     120s  100.0%    120s   31.8GiB   99.9%  31.8GiB
   Zonotope Loop            1     120s  100.0%    120s   31.8GiB   99.9%  31.8GiB
     Zonotope Propa...     89     119s   99.1%   1.34s   31.5GiB   99.1%   362MiB
       DiffZonotope...    445    77.0s   64.0%   173ms   6.92GiB   21.8%  15.9MiB
         Zonotope_D...    890    23.4s   19.5%  26.3ms   2.81GiB    8.8%  3.23MiB
       DiffZonotope...    356    42.2s   35.1%   119ms   24.6GiB   77.4%  70.7MiB
         Zonotope_R...    712    29.2s   24.3%  41.0ms   15.4GiB   48.5%  22.2MiB
           Column M...    712    17.7s   14.7%  24.9ms   6.12GiB   19.2%  8.79MiB
           Allocation     712    8.52s    7.1%  12.0ms   6.12GiB   19.2%  8.79MiB
           Influenc...    712    1.87s    1.6%  2.63ms   3.14GiB    9.9%  4.52MiB
             Multiply     712    1.84s    1.5%  2.58ms   2.92GiB    9.2%  4.20MiB
             Alloca...    712   22.4ms    0.0%  31.5μs    227MiB    0.7%   327KiB
             Set Ma...    712   14.8ms    0.0%  20.8μs     0.00B    0.0%    0.00B
           Set Matrix     712    1.07s    0.9%  1.50ms   10.9MiB    0.0%  15.7KiB
           Vectors        712   18.2ms    0.0%  25.6μs   23.6MiB    0.1%  34.0KiB
           Bounds         712    461μs    0.0%   648ns     0.00B    0.0%    0.00B
     Property Check        89    943ms    0.8%  10.6ms   48.6MiB    0.1%   559KiB
     Compute Split         89   61.0ms    0.1%   685μs    130MiB    0.4%  1.46MiB
 Initialize                 1   14.7ms    0.0%  14.7ms   22.4MiB    0.1%  22.4MiB
 ────────────────────────────────────────────────────────────────────────────────
[VERYDIFF_TIMER] 120.273371436

[VERYDIFF_EXPERIMENT] NETWORK: /home/i57/steuber/NeuroDiff/repos/VeryDiffExperiments/src/../benchmarks/mnist-prune/specs/mnist_38_local_24.vnnlib
[VERYDIFF_EXPERIMENT] TIME: 120.531140083
