
[VERYDIFF_EXPERIMENT] Running on /home/i57/steuber/NeuroDiff/repos/VeryDiffExperiments/src/../benchmarks/mnist-prune/specs/mnist_63_global_3.vnnlib /home/i57/steuber/NeuroDiff/repos/VeryDiffExperiments/src/../benchmarks/mnist-prune/nets/mnist_relu_3_100.onnx
Loading /home/i57/steuber/NeuroDiff/repos/VeryDiffExperiments/src/../benchmarks/mnist-prune/nets/mnist_relu_3_100.onnx and /home/i57/steuber/NeuroDiff/repos/VeryDiffExperiments/src/../benchmarks/mnist-prune/nets_pruned/mnist_relu_3_100_0.77-old.onnx
INPUT SHAPE: 784
Skipping 0 row
Skipping 0 row
Skipping 0 row
Skipping 0 row
Skipping 0 row
Skipping 0 row
Skipping 0 row
Skipping 0 row
Skipping 0 row
Skipping 0 row
Skipping 0 row
Skipping 0 row
Skipping 0 row
Skipping 0 row
Skipping 0 row
Skipping 0 row
Skipping 0 row
Skipping 0 row
Skipping 0 row
Skipping 0 row
Skipping 0 row
Skipping 0 row
Skipping 0 row
Skipping 0 row
Skipping 0 row
Skipping 0 row
Skipping 0 row
Skipping 0 row
Skipping 0 row
Skipping 0 row
Skipping 0 row
Skipping 0 row
Skipping 0 row
Skipping 0 row
Skipping 0 row
Skipping 0 row
Skipping 0 row
Skipping 0 row
Skipping 0 row
Skipping 0 row
Skipping 0 row
Skipping 0 row
Skipping 0 row
Skipping 0 row
Skipping 0 row
Skipping 0 row
Skipping 0 row
Skipping 0 row
Skipping 0 row
Skipping 0 row
Skipping 0 row
Skipping 0 row
Skipping 0 row
Skipping 0 row
Skipping 0 row
Skipping 0 row
Skipping 0 row
Skipping 0 row
Skipping 0 row
Skipping 0 row
Skipping 0 row
Skipping 0 row
Skipping 0 row
Skipping 0 row
Skipping 0 row
Skipping 0 row
Skipping 0 row
Skipping 0 row
Skipping 0 row
Skipping 0 row
Skipping 0 row
Skipping 0 row
Skipping 0 row
Skipping 0 row
Skipping 0 row
Skipping 0 row
Skipping 0 row
Skipping 0 row
Skipping 0 row
Skipping 0 row
Skipping 0 row
Skipping 0 row
Skipping 0 row
Skipping 0 row
Skipping 0 row
Skipping 0 row
Skipping 0 row
Skipping 0 row
Skipping 0 row
Skipping 0 row
Skipping 0 row
Skipping 0 row
Skipping 0 row
Skipping 0 row
Skipping 0 row
Skipping 0 row
Skipping 0 row
Skipping 0 row
Skipping 0 row
Skipping 0 row
Skipping 0 row
Skipping 0 row
Skipping 0 row
Skipping 0 row
Skipping 0 row
Skipping 0 row
Skipping 0 row
Skipping 0 row
Skipping 0 row
Skipping 0 row
Skipping 0 row
Skipping 0 row
Skipping 0 row
Skipping 0 row
Skipping 0 row
Skipping 0 row
Skipping 0 row
Skipping 0 row
Skipping 0 row
Skipping 0 row
Skipping 0 row
Skipping 0 row
Skipping 0 row
Skipping 0 row
Skipping 0 row
Skipping 0 row
Skipping 0 row
Skipping 0 row
Skipping 0 row
Skipping 0 row
Skipping 0 row
Skipping 0 row
Skipping 0 row
Skipping 0 row
Skipping 0 row
Skipping 0 row
Skipping 0 row
Skipping 0 row
Skipping 0 row
Skipping 0 row
Skipping 0 row
Skipping 0 row
Skipping 0 row
Skipping 0 row
Skipping 0 row
Skipping 0 row
Skipping 0 row
Skipping 0 row
Skipping 0 row
Skipping 0 row
Skipping 0 row
Skipping 0 row
Skipping 0 row
Skipping 0 row
Skipping 0 row
Skipping 0 row
Skipping 0 row
Skipping 0 row
Skipping 0 row
Skipping 0 row
Skipping 0 row
Skipping 0 row
Skipping 0 row
Skipping 0 row
Skipping 0 row
Skipping 0 row
Skipping 0 row
Skipping 0 row
Skipping 0 row
Skipping 0 row
Skipping 0 row
Skipping 0 row
Skipping 0 row
Skipping 0 row
Skipping 0 row
Skipping 0 row
Skipping 0 row
Skipping 0 row
Skipping 0 row
Skipping 0 row
Skipping 0 row
Skipping 0 row
Skipping 0 row
Skipping 0 row
Skipping 0 row
Skipping 0 row
Skipping 0 row
Skipping 0 row
Skipping 0 row
Skipping 0 row
Skipping 0 row
Skipping 0 row
Skipping 0 row
Skipping 0 row
Skipping 0 row
Skipping 0 row
Skipping 0 row
Skipping 0 row
Skipping 0 row
Skipping 0 row
Skipping 0 row
Skipping 0 row
Skipping 0 row
Skipping 0 row
Skipping 0 row
Skipping 0 row
Skipping 0 row
Skipping 0 row
Skipping 0 row
Skipping 0 row
Skipping 0 row
Skipping 0 row
Skipping 0 row
Skipping 0 row
Skipping 0 row
Skipping 0 row
Skipping 0 row
Skipping 0 row
Skipping 0 row
Skipping 0 row
Skipping 0 row
Skipping 0 row
Skipping 0 row
Skipping 0 row
Skipping 0 row
Skipping 0 row
Skipping 0 row
Skipping 0 row
Skipping 0 row
Skipping 0 row
Skipping 0 row
Skipping 0 row
Skipping 0 row
Skipping 0 row
Skipping 0 row
Skipping 0 row
Skipping 0 row
Skipping 0 row
Skipping 0 row
Skipping 0 row
Skipping 0 row
Skipping 0 row
Skipping 0 row
Skipping 0 row
Skipping 0 row
Skipping 0 row
Skipping 0 row
Skipping 0 row
Skipping 0 row
Skipping 0 row
Skipping 0 row
Skipping 0 row
Skipping 0 row
Skipping 0 row
Skipping 0 row
Skipping 0 row
Skipping 0 row
Skipping 0 row
Skipping 0 row
Skipping 0 row
Skipping 0 row
Skipping 0 row
Skipping 0 row
Skipping 0 row
Skipping 0 row
Skipping 0 row
Skipping 0 row
Skipping 0 row
Skipping 0 row
Skipping 0 row
Skipping 0 row
Skipping 0 row
Skipping 0 row
Skipping 0 row
Skipping 0 row
Skipping 0 row
Skipping 0 row
Skipping 0 row
Skipping 0 row
Skipping 0 row
Skipping 0 row
Skipping 0 row
Skipping 0 row
Skipping 0 row
Skipping 0 row
Skipping 0 row
Skipping 0 row
Skipping 0 row
Skipping 0 row
Skipping 0 row
Skipping 0 row
Skipping 0 row
Skipping 0 row
Skipping 0 row
Skipping 0 row
Skipping 0 row
Skipping 0 row
Skipping 0 row
Skipping 0 row
Skipping 0 row
Skipping 0 row
Skipping 0 row
Skipping 0 row
Skipping 0 row
Skipping 0 row
Skipping 0 row
Skipping 0 row
Skipping 0 row
Skipping 0 row
Skipping 0 row
Skipping 0 row
Skipping 0 row
Skipping 0 row
Skipping 0 row
Skipping 0 row
Skipping 0 row
Skipping 0 row
Skipping 0 row
Skipping 0 row
Skipping 0 row
Skipping 0 row
Skipping 0 row
Skipping 0 row
Skipping 0 row
Skipping 0 row
Skipping 0 row
Skipping 0 row
Skipping 0 row
Skipping 0 row
Skipping 0 row
Skipping 0 row
Skipping 0 row
Skipping 0 row
Skipping 0 row
Skipping 0 row
Skipping 0 row
Skipping 0 row
Skipping 0 row
Skipping 0 row
Skipping 0 row
Skipping 0 row
Skipping 0 row
Skipping 0 row
Skipping 0 row
Skipping 0 row
Skipping 0 row
Skipping 0 row
Skipping 0 row
Skipping 0 row
Skipping 0 row
Skipping 0 row
Skipping 0 row
Skipping 0 row
Skipping 0 row
Skipping 0 row
Skipping 0 row
Skipping 0 row
Skipping 0 row
Skipping 0 row
Skipping 0 row
Skipping 0 row
Skipping 0 row
Skipping 0 row
Skipping 0 row
Skipping 0 row
Skipping 0 row
Skipping 0 row
Skipping 0 row
Skipping 0 row
Skipping 0 row
Skipping 0 row
Skipping 0 row
Skipping 0 row
Skipping 0 row
Skipping 0 row
Skipping 0 row
Skipping 0 row
Skipping 0 row
Skipping 0 row
Skipping 0 row
Skipping 0 row
Skipping 0 row
Skipping 0 row
Skipping 0 row
Skipping 0 row
Skipping 0 row
Skipping 0 row
Skipping 0 row
Skipping 0 row
Skipping 0 row
Skipping 0 row
Skipping 0 row
Skipping 0 row
Skipping 0 row
Skipping 0 row
Skipping 0 row
Skipping 0 row
Skipping 0 row
Skipping 0 row
Skipping 0 row
Skipping 0 row
Skipping 0 row
Skipping 0 row
Skipping 0 row
Skipping 0 row
Skipping 0 row
Skipping 0 row
Skipping 0 row
Skipping 0 row
Skipping 0 row
Skipping 0 row
Skipping 0 row
Skipping 0 row
Skipping 0 row
Skipping 0 row
Skipping 0 row
Skipping 0 row
Skipping 0 row
Skipping 0 row
Skipping 0 row
Skipping 0 row
Skipping 0 row
UNKNOWN
TIMEOUT
Refined: 24 | Refine Limit: 20 | Wrong: 0 | Right: 17 | Total: 17 | Total Zonos Considered: 41 | Expected 535 (3.177570093457944%)

time: 120.67235363

[VERYDIFF_TIMER] 120.696242024

[VERYDIFF_EXPERIMENT] NETWORK: /home/i57/steuber/NeuroDiff/repos/VeryDiffExperiments/src/../benchmarks/mnist-prune/specs/mnist_63_global_3.vnnlib
[VERYDIFF_EXPERIMENT] TIME: 120.984569658
