
[VERYDIFF_EXPERIMENT] Running on /home/i57/steuber/NeuroDiff/repos/VeryDiffExperiments/src/../benchmarks/mnist-prune/specs/mnist_72_global_3.vnnlib /home/i57/steuber/NeuroDiff/repos/VeryDiffExperiments/src/../benchmarks/mnist-prune/nets/mnist_relu_3_100.onnx
Found input X
op: matmul, weight: (100, 784), bias: nothing
op: bias, weight: nothing, bias: (100,)
op: relu, weight: nothing, bias: nothing
op: matmul, weight: (100, 100), bias: nothing
op: bias, weight: nothing, bias: (100,)
op: relu, weight: nothing, bias: nothing
op: matmul, weight: (10, 100), bias: nothing
op: bias, weight: nothing, bias: (10,)
op: relu, weight: nothing, bias: nothing
op: matmul, weight: (10, 10), bias: nothing
op: bias, weight: nothing, bias: (10,)
Found input X
op: gemm, weight: (100, 784), bias: (100,)
op: relu, weight: nothing, bias: nothing
op: gemm, weight: (100, 100), bias: (100,)
op: relu, weight: nothing, bias: nothing
op: gemm, weight: (10, 100), bias: (10,)
op: relu, weight: nothing, bias: nothing
op: gemm, weight: (10, 10), bias: (10,)
Distance: 368.62397500800625
Distance: 47.56803950402309
Distance: 2.8977568827249343
Distance: 0.01885471428334995
Running with 1 threads
[Thread 1] Time to first task: 0.0s
Instable Generators: 19
Instable Generators: 13
Instable Generators: 3
Zono Bounds:
[-0.23297775289563113, -0.24132322747721727, -0.32936483860226734, -0.30785350959153074, -0.00038994836729842403, -0.25571478722875357, -0.0002517350951915211, 0.0015816339501385584, -0.23877063976049118, 0.00015813400991481532]
[0.2540401061551083, 0.19856680686954728, 0.3359416110590801, 0.25781852478511275, 0.00020950648358492545, 0.2534983094819187, -2.6122181040110425e-6, 0.0028415499259149455, 0.2355522658927533, 0.0010668663998333592]
[Thread 1] Total splits: 0
Processed 1 zonotopes (Work Done: 100.0%); Generated 0 (0.051466279s/loop)
[Thread 1] Finished in 0.05s
 ────────────────────────────────────────────────────────────────────────────────
                                        Time                    Allocations      
                               ───────────────────────   ────────────────────────
       Tot / % measured:           52.0ms / 100.0%           95.0MiB / 100.0%    

 Section               ncalls     time    %tot     avg     alloc    %tot      avg
 ────────────────────────────────────────────────────────────────────────────────
 Verify                     1   51.5ms   99.0%  51.5ms   89.6MiB   94.3%  89.6MiB
   Zonotope Loop            1   51.5ms   98.9%  51.5ms   89.6MiB   94.3%  89.6MiB
     Zonotope Propa...      1   48.2ms   92.6%  48.2ms   69.7MiB   73.3%  69.7MiB
       DiffZonotope...      4   24.3ms   46.6%  6.06ms   4.06MiB    4.3%  1.02MiB
         Zonotope_D...      8   9.03ms   17.4%  1.13ms   2.68MiB    2.8%   343KiB
       DiffZonotope...      3   23.9ms   46.0%  7.97ms   65.6MiB   69.0%  21.9MiB
         Zonotope_R...      6   23.0ms   44.1%  3.83ms   64.1MiB   67.5%  10.7MiB
           Influenc...      6   21.7ms   41.7%  3.62ms   58.9MiB   62.0%  9.82MiB
             Multiply       6   16.4ms   31.5%  2.74ms   29.7MiB   31.2%  4.94MiB
             Set Ma...      6   3.94ms    7.6%   656μs     0.00B    0.0%    0.00B
             Alloca...      6   1.32ms    2.5%   221μs   29.2MiB   30.7%  4.87MiB
           Column M...      6    771μs    1.5%   128μs   2.60MiB    2.7%   444KiB
           Set Matrix       6    301μs    0.6%  50.1μs   3.52KiB    0.0%     600B
           Allocation       6    124μs    0.2%  20.6μs   2.60MiB    2.7%   444KiB
           Vectors          6   28.4μs    0.1%  4.74μs   19.5KiB    0.0%  3.26KiB
           Bounds           6   4.26μs    0.0%   710ns     0.00B    0.0%    0.00B
     Property Check         1   10.5μs    0.0%  10.5μs   1.23KiB    0.0%  1.23KiB
 Initialize                 1    542μs    1.0%   542μs   5.41MiB    5.7%  5.41MiB
 ────────────────────────────────────────────────────────────────────────────────
[VERYDIFF_TIMER] 0.081295619

[VERYDIFF_EXPERIMENT] NETWORK: /home/i57/steuber/NeuroDiff/repos/VeryDiffExperiments/src/../benchmarks/mnist-prune/specs/mnist_72_global_3.vnnlib
[VERYDIFF_EXPERIMENT] TIME: 0.383984404
