
[VERYDIFF_EXPERIMENT] Running on /home/i57/steuber/NeuroDiff/repos/VeryDiffExperiments/src/../benchmarks/mnist-prune/specs/mnist_95_global_5.vnnlib /home/i57/steuber/NeuroDiff/repos/VeryDiffExperiments/src/../benchmarks/mnist-prune/nets/mnist_relu_3_100.onnx
Found input X
op: matmul, weight: (100, 784), bias: nothing
op: bias, weight: nothing, bias: (100,)
op: relu, weight: nothing, bias: nothing
op: matmul, weight: (100, 100), bias: nothing
op: bias, weight: nothing, bias: (100,)
op: relu, weight: nothing, bias: nothing
op: matmul, weight: (10, 100), bias: nothing
op: bias, weight: nothing, bias: (10,)
op: relu, weight: nothing, bias: nothing
op: matmul, weight: (10, 10), bias: nothing
op: bias, weight: nothing, bias: (10,)
Found input X
op: gemm, weight: (100, 784), bias: (100,)
op: relu, weight: nothing, bias: nothing
op: gemm, weight: (100, 100), bias: (100,)
op: relu, weight: nothing, bias: nothing
op: gemm, weight: (10, 100), bias: (10,)
op: relu, weight: nothing, bias: nothing
op: gemm, weight: (10, 10), bias: (10,)
Distance: 1623.4465197373434
Distance: 201.62056963066925
Distance: 13.962962507051998
Distance: 0.183768135302671
Running with 1 threads
[Thread 1] Time to first task: 0.0s
Instable Generators: 18
Instable Generators: 38
Instable Generators: 7
Zono Bounds:
[-0.005317903057058548, -2.8852512342554855, -3.0480088028469097, -2.2831720291234583, -3.033452242040028, -0.1609241095946272, -3.1875157399740472, -2.9215698511993753, -2.5701908459127347, -3.1220345948437354]
[0.0038726897169883787, 2.87838006575163, 2.823050430058999, 2.2869464066087715, 3.0157444315868625, 0.1671390373571863, 3.1603698473714315, 2.2855081738595167, 2.552020134522256, 2.912456015613061]
[Thread 1] Processed 100 zonotopes (Work Done: 0.0%; Expected Zonos: Inf)
[Thread 1] Processed 200 zonotopes (Work Done: 0.0%; Expected Zonos: Inf)
[Thread 1] Processed 300 zonotopes (Work Done: 0.0%; Expected Zonos: Inf)
[Thread 1] Processed 400 zonotopes (Work Done: 0.0%; Expected Zonos: Inf)
[Thread 1] Processed 500 zonotopes (Work Done: 0.0%; Expected Zonos: Inf)


TIMEOUT REACHED
UNKNOWN
[Thread 1] Total splits: 575
Processed 575 zonotopes (Work Done: 0.0%); Generated 1150 (0.20884902488695653s/loop)
[Thread 1] Finished in 120.09s
 ────────────────────────────────────────────────────────────────────────────────
                                        Time                    Allocations      
                               ───────────────────────   ────────────────────────
       Tot / % measured:             120s / 100.0%           60.1GiB / 100.0%    

 Section               ncalls     time    %tot     avg     alloc    %tot      avg
 ────────────────────────────────────────────────────────────────────────────────
 Verify                     1     120s  100.0%    120s   60.1GiB  100.0%  60.1GiB
   Zonotope Loop            1     120s  100.0%    120s   60.1GiB  100.0%  60.1GiB
     Zonotope Propa...    575    67.1s   55.9%   117ms   40.2GiB   66.9%  71.7MiB
       DiffZonotope...  1.73k    57.1s   47.5%  33.1ms   38.0GiB   63.1%  22.5MiB
         Zonotope_R...  3.45k    50.3s   41.9%  14.6ms   37.0GiB   61.6%  11.0MiB
           Influenc...  3.45k    49.5s   41.2%  14.4ms   34.1GiB   56.7%  10.1MiB
             Alloca...  3.45k    24.9s   20.8%  7.23ms   16.8GiB   27.9%  4.99MiB
             Multiply   3.45k    22.1s   18.4%  6.41ms   17.3GiB   28.7%  5.12MiB
             Set Ma...  3.45k    2.45s    2.0%   709μs     0.00B    0.0%    0.00B
           Column M...  3.45k    475ms    0.4%   138μs   1.49GiB    2.5%   452KiB
           Set Matrix   3.45k    188ms    0.2%  54.4μs   2.82MiB    0.0%     856B
           Allocation   3.45k   81.2ms    0.1%  23.5μs   1.49GiB    2.5%   452KiB
           Vectors      3.45k   17.5ms    0.0%  5.09μs   11.0MiB    0.0%  3.26KiB
           Bounds       3.45k   2.48ms    0.0%   720ns     0.00B    0.0%    0.00B
       DiffZonotope...  2.30k    10.1s    8.4%  4.38ms   2.29GiB    3.8%  1.02MiB
         Zonotope_D...  4.60k    4.88s    4.1%  1.06ms   1.51GiB    2.5%   344KiB
     Compute Split        575    27.4s   22.8%  47.6ms   8.56GiB   14.2%  15.2MiB
     Property Check       575    114ms    0.1%   198μs    117MiB    0.2%   209KiB
 Initialize                 1    531μs    0.0%   531μs   5.41MiB    0.0%  5.41MiB
 ────────────────────────────────────────────────────────────────────────────────
[VERYDIFF_TIMER] 120.131806327

[VERYDIFF_EXPERIMENT] NETWORK: /home/i57/steuber/NeuroDiff/repos/VeryDiffExperiments/src/../benchmarks/mnist-prune/specs/mnist_95_global_5.vnnlib
[VERYDIFF_EXPERIMENT] TIME: 120.602280585
