
[VERYDIFF_EXPERIMENT] Running on /home/i57/steuber/NeuroDiff/repos/VeryDiffExperiments/src/../benchmarks/mnist-prune/specs/mnist_87_global_6.vnnlib /home/i57/steuber/NeuroDiff/repos/VeryDiffExperiments/src/../benchmarks/mnist-prune/nets/mnist_relu_3_100.onnx
Found input X
op: matmul, weight: (100, 784), bias: nothing
op: bias, weight: nothing, bias: (100,)
op: relu, weight: nothing, bias: nothing
op: matmul, weight: (100, 100), bias: nothing
op: bias, weight: nothing, bias: (100,)
op: relu, weight: nothing, bias: nothing
op: matmul, weight: (10, 100), bias: nothing
op: bias, weight: nothing, bias: (10,)
op: relu, weight: nothing, bias: nothing
op: matmul, weight: (10, 10), bias: nothing
op: bias, weight: nothing, bias: (10,)
Found input X
op: gemm, weight: (100, 784), bias: (100,)
op: relu, weight: nothing, bias: nothing
op: gemm, weight: (100, 100), bias: (100,)
op: relu, weight: nothing, bias: nothing
op: gemm, weight: (10, 100), bias: (10,)
op: relu, weight: nothing, bias: nothing
op: gemm, weight: (10, 10), bias: (10,)
Distance: 1623.4465197373434
Distance: 201.62056963066925
Distance: 13.962962507051998
Distance: 0.183768135302671
Running with 1 threads
[Thread 1] Time to first task: 0.0s
Instable Generators: 29
Instable Generators: 48
Instable Generators: 8
Zono Bounds:
[-0.005650150032918397, -5.451630765106511, -5.729256942923613, -4.722034176365798, -6.268471331754483, -6.421586645131666, -5.724378850232557, -5.460615600910008, -4.243684654412642, -5.279099302898622]
[0.002755409343340796, 4.647005235316964, 5.634771656369035, 5.892831828838987, 5.022160796777094, 6.358611319155915, 5.72015239778021, 4.930225765554545, 4.088461525411216, 5.259179935618828]
[Thread 1] Processed 100 zonotopes (Work Done: 0.0%; Expected Zonos: Inf)
[Thread 1] Processed 200 zonotopes (Work Done: 0.0%; Expected Zonos: Inf)
[Thread 1] Processed 300 zonotopes (Work Done: 0.0%; Expected Zonos: Inf)
[Thread 1] Processed 400 zonotopes (Work Done: 0.0%; Expected Zonos: Inf)
[Thread 1] Processed 500 zonotopes (Work Done: 0.0%; Expected Zonos: Inf)


TIMEOUT REACHED
UNKNOWN
[Thread 1] Total splits: 576
Processed 576 zonotopes (Work Done: 0.0%); Generated 1152 (0.20882427613715276s/loop)
[Thread 1] Finished in 120.28s
 ────────────────────────────────────────────────────────────────────────────────
                                        Time                    Allocations      
                               ───────────────────────   ────────────────────────
       Tot / % measured:             120s / 100.0%           61.3GiB / 100.0%    

 Section               ncalls     time    %tot     avg     alloc    %tot      avg
 ────────────────────────────────────────────────────────────────────────────────
 Verify                     1     120s  100.0%    120s   61.3GiB  100.0%  61.3GiB
   Zonotope Loop            1     120s  100.0%    120s   61.3GiB  100.0%  61.3GiB
     Zonotope Propa...    576    90.3s   75.0%   157ms   41.3GiB   67.3%  73.4MiB
       DiffZonotope...  1.73k    80.2s   66.7%  46.4ms   39.0GiB   63.5%  23.1MiB
         Zonotope_R...  3.46k    79.5s   66.1%  23.0ms   38.0GiB   62.0%  11.3MiB
           Influenc...  3.46k    72.9s   60.6%  21.1ms   35.0GiB   57.0%  10.4MiB
             Multiply   3.46k    39.9s   33.2%  11.5ms   17.8GiB   29.0%  5.27MiB
             Alloca...  3.46k    30.5s   25.3%  8.82ms   17.2GiB   28.0%  5.09MiB
             Set Ma...  3.46k    2.49s    2.1%   720μs     0.00B    0.0%    0.00B
           Column M...  3.46k    6.31s    5.2%  1.83ms   1.52GiB    2.5%   461KiB
           Set Matrix   3.46k    190ms    0.2%  54.9μs   3.45MiB    0.0%  1.02KiB
           Allocation   3.46k   91.8ms    0.1%  26.6μs   1.52GiB    2.5%   460KiB
           Vectors      3.46k   17.7ms    0.0%  5.13μs   11.0MiB    0.0%  3.26KiB
           Bounds       3.46k   2.45ms    0.0%   709ns     0.00B    0.0%    0.00B
       DiffZonotope...  2.30k    10.0s    8.3%  4.36ms   2.33GiB    3.8%  1.04MiB
         Zonotope_D...  4.61k    4.85s    4.0%  1.05ms   1.53GiB    2.5%   347KiB
     Compute Split        576    27.8s   23.1%  48.2ms   8.72GiB   14.2%  15.5MiB
     Property Check       576    113ms    0.1%   195μs    119MiB    0.2%   212KiB
 Initialize                 1    545μs    0.0%   545μs   5.41MiB    0.0%  5.41MiB
 ────────────────────────────────────────────────────────────────────────────────
[VERYDIFF_TIMER] 120.312237691

[VERYDIFF_EXPERIMENT] NETWORK: /home/i57/steuber/NeuroDiff/repos/VeryDiffExperiments/src/../benchmarks/mnist-prune/specs/mnist_87_global_6.vnnlib
[VERYDIFF_EXPERIMENT] TIME: 120.77788732
