
[VERYDIFF_EXPERIMENT] Running on /home/i57/steuber/NeuroDiff/repos/VeryDiffExperiments/src/../benchmarks/mnist-prune/specs/mnist_27_global_6.vnnlib /home/i57/steuber/NeuroDiff/repos/VeryDiffExperiments/src/../benchmarks/mnist-prune/nets/mnist_relu_3_100.onnx
Found input X
op: matmul, weight: (100, 784), bias: nothing
op: bias, weight: nothing, bias: (100,)
op: relu, weight: nothing, bias: nothing
op: matmul, weight: (100, 100), bias: nothing
op: bias, weight: nothing, bias: (100,)
op: relu, weight: nothing, bias: nothing
op: matmul, weight: (10, 100), bias: nothing
op: bias, weight: nothing, bias: (10,)
op: relu, weight: nothing, bias: nothing
op: matmul, weight: (10, 10), bias: nothing
op: bias, weight: nothing, bias: (10,)
Found input X
op: gemm, weight: (100, 784), bias: (100,)
op: relu, weight: nothing, bias: nothing
op: gemm, weight: (100, 100), bias: (100,)
op: relu, weight: nothing, bias: nothing
op: gemm, weight: (10, 100), bias: (10,)
op: relu, weight: nothing, bias: nothing
op: gemm, weight: (10, 10), bias: (10,)
Distance: 1623.4465197373434
Distance: 201.62056963066925
Distance: 13.962962507051998
Distance: 0.183768135302671
Running with 1 threads
[Thread 1] Time to first task: 0.0s
Instable Generators: 37
Instable Generators: 58
Instable Generators: 7
Zono Bounds:
[-6.426784247992434, -0.6029327585229046, -7.44950499810528, -0.012657975842864247, -6.4171179343304505, -7.31592662970345, -7.533039310344043, -7.168522973753389, -6.298858435016225, -6.62219571761791]
[6.1590425611133375, 0.6501595810559347, 7.385121444516968, 0.03043519489411737, 7.719703633758257, 6.155580366159865, 6.958889907982315, 7.135238884935636, 5.909579695344398, 6.298647164706198]
[Thread 1] Processed 100 zonotopes (Work Done: 0.0%; Expected Zonos: Inf)
[Thread 1] Processed 200 zonotopes (Work Done: 0.0%; Expected Zonos: Inf)
[Thread 1] Processed 300 zonotopes (Work Done: 0.0%; Expected Zonos: Inf)
[Thread 1] Processed 400 zonotopes (Work Done: 0.0%; Expected Zonos: Inf)
[Thread 1] Processed 500 zonotopes (Work Done: 0.0%; Expected Zonos: Inf)


TIMEOUT REACHED
UNKNOWN
[Thread 1] Total splits: 574
Processed 574 zonotopes (Work Done: 0.0%); Generated 1148 (0.20919062970731708s/loop)
[Thread 1] Finished in 120.08s
 ────────────────────────────────────────────────────────────────────────────────
                                        Time                    Allocations      
                               ───────────────────────   ────────────────────────
       Tot / % measured:             120s / 100.0%           62.0GiB / 100.0%    

 Section               ncalls     time    %tot     avg     alloc    %tot      avg
 ────────────────────────────────────────────────────────────────────────────────
 Verify                     1     120s  100.0%    120s   62.0GiB  100.0%  62.0GiB
   Zonotope Loop            1     120s  100.0%    120s   62.0GiB  100.0%  62.0GiB
     Zonotope Propa...    574    72.6s   60.4%   126ms   41.9GiB   67.6%  74.7MiB
       DiffZonotope...  1.72k    62.6s   52.1%  36.4ms   39.5GiB   63.8%  23.5MiB
         Zonotope_R...  3.44k    61.9s   51.6%  18.0ms   38.6GiB   62.3%  11.5MiB
           Influenc...  3.44k    54.2s   45.1%  15.7ms   35.5GiB   57.3%  10.6MiB
             Alloca...  3.44k    26.2s   21.8%  7.60ms   17.4GiB   28.1%  5.17MiB
             Multiply   3.44k    25.5s   21.2%  7.40ms   18.1GiB   29.2%  5.39MiB
             Set Ma...  3.44k    2.50s    2.1%   725μs     0.00B    0.0%    0.00B
           Allocation   3.44k    7.09s    5.9%  2.06ms   1.53GiB    2.5%   467KiB
           Column M...  3.44k    463ms    0.4%   135μs   1.53GiB    2.5%   467KiB
           Set Matrix   3.44k    192ms    0.2%  55.7μs   3.84MiB    0.0%  1.14KiB
           Vectors      3.44k   17.6ms    0.0%  5.12μs   10.9MiB    0.0%  3.26KiB
           Bounds       3.44k   2.42ms    0.0%   702ns     0.00B    0.0%    0.00B
       DiffZonotope...  2.30k    10.0s    8.3%  4.34ms   2.34GiB    3.8%  1.05MiB
         Zonotope_D...  4.59k    4.81s    4.0%  1.05ms   1.53GiB    2.5%   349KiB
     Compute Split        574    31.7s   26.4%  55.2ms   8.79GiB   14.2%  15.7MiB
     Property Check       574    113ms    0.1%   196μs    120MiB    0.2%   215KiB
 Initialize                 1    550μs    0.0%   550μs   5.41MiB    0.0%  5.41MiB
 ────────────────────────────────────────────────────────────────────────────────
[VERYDIFF_TIMER] 120.106346598

[VERYDIFF_EXPERIMENT] NETWORK: /home/i57/steuber/NeuroDiff/repos/VeryDiffExperiments/src/../benchmarks/mnist-prune/specs/mnist_27_global_6.vnnlib
[VERYDIFF_EXPERIMENT] TIME: 120.564219636
