
[VERYDIFF_EXPERIMENT] Running on /home/i57/steuber/NeuroDiff/repos/VeryDiffExperiments/src/../benchmarks/mnist-prune/specs/mnist_25_local_24.vnnlib /home/i57/steuber/NeuroDiff/repos/VeryDiffExperiments/src/../benchmarks/mnist-prune/nets/mnist_relu_2_512.onnx
Found input X
op: matmul, weight: (512, 784), bias: nothing
op: bias, weight: nothing, bias: (512,)
op: relu, weight: nothing, bias: nothing
op: matmul, weight: (512, 512), bias: nothing
op: bias, weight: nothing, bias: (512,)
op: relu, weight: nothing, bias: nothing
op: matmul, weight: (10, 512), bias: nothing
op: bias, weight: nothing, bias: (10,)
Found input X
op: gemm, weight: (512, 784), bias: (512,)
op: relu, weight: nothing, bias: nothing
op: gemm, weight: (512, 512), bias: (512,)
op: relu, weight: nothing, bias: nothing
op: gemm, weight: (10, 512), bias: (10,)
Distance: 973.3044369037136
Distance: 481.63499746812613
Distance: 8.744412635378467
Running with 1 threads
[Thread 1] Time to first task: 0.0s
Instable Generators: 104
Instable Generators: 207
Zono Bounds:
[-8.49002315192334, -9.80752925446711, -8.603501233568323, -9.596881329367251, -9.060369328313506, -8.981063614150726, -8.361939729409904, -9.19125353385204, -7.965444556594245, -7.44378589046301]
[10.869626825494725, 11.942181124789833, 9.597183440909351, 12.037288901127289, 12.008026785258487, 9.411245540197092, 10.742438696371366, 10.90001040851323, 10.533437344891757, 10.340505625031556]

Found counterexample: ([0.0, 0.0, 0.0, 0.0, 0.0, 0.0, 0.0, 0.0, 0.0, 0.0, 0.0, 0.0, 0.0, 0.0, 0.0, 0.0, 0.0, 0.0, 0.0, 0.0, 0.0, 0.0, 0.0, 0.0, 0.0, 0.0, 0.0, 0.0, 0.0, 0.0, 0.0, 0.0, 0.0, 0.0, 0.0, 0.0, 0.0, 0.0, 0.0, 0.0, 0.0, 0.0, 0.0, 0.0, 0.0, 0.0, 0.0, 0.0, 0.0, 0.0, 0.0, 0.0, 0.0, 0.0, 0.0, 0.0, 0.0, 0.0, 0.0, 0.0, 0.0, 0.0, 0.0, 0.0, 0.0, 0.0, 0.0, 0.0, 0.0, 0.0, 0.0, 0.0, 0.0, 0.0, 0.0, 0.0, 0.0, 0.0, 0.0, 0.0, 0.0, 0.0, 0.0, 0.0, 0.0, 0.0, 0.0, 0.0, 0.0, 0.0, 0.0, 0.0, 0.0, 0.0, 0.0, 0.0, 0.0, 0.0, 0.0, 0.0, 0.0, 0.0, 0.0, 0.0, 0.0, 0.0, 0.0, 0.0, 0.0, 0.0, 0.0, 0.0, 0.0, 0.0, 0.0, 0.0, 0.0, 0.0, 0.0, 0.0, 0.0, 0.0, 0.0, 0.0, 0.0, 0.01176471, 0.3137255, 0.7647059, 0.33333334, 0.3137255, 0.3137255, 0.3137255, 0.5, 0.0, 0.0, 0.0, 0.0, 0.0, 0.0, 0.0, 0.0, 0.0, 0.0, 0.0, 0.0, 0.0, 0.0, 0.0, 0.0, 0.0, 0.0, 0.0, 0.0, 0.03529412, 0.99215686, 0.99215686, 0.99215686, 0.99215686, 0.99215686, 0.99215686, 0.59607846, 0.0, 0.0, 0.0, 0.0, 0.0, 0.0, 0.0, 0.0, 0.0, 0.0, 0.0, 0.0, 0.0, 0.0, 0.0, 0.0, 0.04313726, 0.24313726, 0.21960784, 0.0, 0.03529412, 0.99215686, 0.99215686, 0.99215686, 0.99215686, 0.99215686, 0.99215686, 0.98431373, 0.92941177, 0.22352941, 0.0, 0.0, 0.0, 0.0, 0.0, 0.0, 0.0, 0.0, 0.0, 0.0, 0.0, 0.0, 0.0, 0.0, 0.5529412, 0.99215686, 0.94509804, 0.32549021, 0.01568628, 0.63137257, 0.99215686, 0.99215686, 0.99215686, 0.99215686, 0.99215686, 0.99215686, 0.99215686, 0.23529412, 0.0, 0.0, 0.0, 0.0, 0.0, 0.0, 0.0, 0.0, 0.0, 0.0, 0.0, 1.0, 0.04313726, 0.5529412, 0.97254902, 0.99215686, 0.99215686, 0.57647061, 0.0, 0.28627452, 0.81960785, 0.98823529, 0.99215686, 0.99215686, 0.99215686, 0.99215686, 0.99215686, 0.83137256, 0.0, 0.0, 0.0, 0.0, 0.0, 0.0, 0.0, 0.0, 0.0, 0.5, 0.0, 1.0, 0.57647061, 0.99215686, 0.99215686, 0.99215686, 0.99215686, 0.78039217, 0.13333334, 0.0, 0.0, 0.627451, 0.99215686, 0.55686277, 0.76078433, 0.99215686, 0.99215686, 0.95686275, 0.3019608, 0.0, 0.0, 0.0, 0.0, 0.0, 0.0, 0.0, 0.0, 0.0, 0.03529412, 0.53333336, 0.98039216, 0.99215686, 0.99215686, 0.99215686, 0.99215686, 0.99215686, 0.27058825, 0.0, 0.0, 0.05882353, 0.20392157, 0.01960784, 0.0, 0.78823531, 0.99215686, 0.99215686, 0.61176473, 0.0, 0.0, 0.0, 0.0, 0.0, 0.0, 0.0, 0.0, 0.0, 0.3137255, 0.99215686, 0.99215686, 0.99215686, 0.99215686, 0.99215686, 0.99215686, 0.81960785, 0.16078432, 0.0, 0.0, 0.0, 0.0, 0.0, 0.0, 0.14117648, 1.0, 0.99215686, 0.76862746, 0.12941177, 0.0, 0.0, 0.0, 0.0, 0.0, 0.0, 0.0, 0.0, 0.33725491, 0.99215686, 0.99215686, 0.99215686, 0.99215686, 0.0, 0.91764706, 0.16078432, 0.0, 0.0, 0.0, 0.0, 0.0, 0.0, 0.0, 0.16470589, 0.99215686, 0.99215686, 0.99215686, 0.30588236, 0.0, 0.0, 0.0, 0.0, 0.0, 0.0, 0.0, 0.0, 0.99607843, 0.99215686, 0.99215686, 0.99215686, 0.99215686, 0.99215686, 0.64705884, 0.0, 0.0, 0.0, 0.0, 0.0, 0.0, 0.0, 0.0, 0.82745099, 0.99215686, 0.99215686, 0.99215686, 0.30588236, 0.0, 0.0, 0.0, 0.0, 0.0, 0.0, 0.0, 0.0, 0.99607843, 0.99215686, 0.99215686, 0.99215686, 0.99215686, 0.67450982, 0.07058824, 0.0, 0.0, 0.0, 0.0, 0.0, 0.0, 0.0, 0.0, 0.82745099, 0.99215686, 0.99215686, 0.99215686, 0.30588236, 0.0, 0.0, 0.0, 0.0, 0.0, 0.0, 0.0, 0.0, 0.99607843, 0.99215686, 0.99215686, 0.99215686, 0.82352942, 0.01568628, 0.0, 0.0, 0.0, 0.0, 0.0, 0.0, 0.16470589, 0.89803922, 0.96470588, 0.98823529, 0.99215686, 0.99215686, 0.62352943, 0.01176471, 0.0, 0.0, 0.0, 0.0, 0.0, 0.0, 0.0, 0.0, 0.99607843, 0.99215686, 0.99215686, 0.99215686, 0.81960785, 1.0, 0.0, 0.0, 0.0, 0.0, 0.3882353, 0.58431375, 0.82352942, 0.99215686, 0.99215686, 0.99215686, 0.99215686, 0.94901961, 0.25490198, 0.0, 0.0, 0.0, 0.0, 0.0, 0.0, 0.0, 0.0, 0.0, 1.0, 0.99215686, 0.99215686, 0.99215686, 0.85490197, 0.20784314, 0.20784314, 0.20784314, 0.70588237, 0.89411765, 0.95686275, 0.99215686, 0.99215686, 0.99215686, 0.99215686, 0.99215686, 0.99215686, 0.3019608, 0.0, 0.0, 0.0, 0.0, 0.0, 0.0, 0.0, 0.0, 0.0, 0.0, 0.63921571, 0.99215686, 0.99215686, 0.99215686, 0.99215686, 0.99215686, 0.99215686, 0.99215686, 0.99215686, 0.99215686, 0.99215686, 0.99215686, 0.99215686, 0.99215686, 0.99215686, 0.99215686, 0.75686276, 0.11372549, 0.0, 0.0, 0.0, 0.0, 0.0, 0.0, 0.0, 0.0, 0.0, 0.0, 0.3137255, 0.99215686, 0.99215686, 0.99215686, 0.99215686, 0.99215686, 0.99215686, 0.99215686, 0.99215686, 0.99215686, 0.99215686, 0.99215686, 0.99215686, 0.99215686, 0.91764706, 0.75686276, 0.09411765, 0.0, 1.0, 0.0, 0.0, 0.0, 0.0, 0.0, 0.0, 0.0, 0.0, 0.0, 0.17254902, 0.82352942, 0.99215686, 0.99215686, 0.99215686, 0.99215686, 0.99215686, 0.99215686, 0.99215686, 0.99215686, 0.99215686, 0.99215686, 1.0, 0.89803922, 0.26274511, 0.0, 0.0, 0.0, 0.0, 0.0, 0.0, 1.0, 0.0, 0.0, 0.0, 0.0, 0.0, 0.0, 0.0, 0.14901961, 0.89411765, 0.99215686, 0.99215686, 0.99215686, 0.99215686, 0.99215686, 0.99215686, 0.99215686, 0.99215686, 0.97254902, 0.92156863, 0.25490198, 0.0, 0.0, 0.0, 0.0, 0.0, 0.0, 0.0, 0.0, 0.0, 0.0, 0.0, 0.0, 0.0, 0.0, 0.0, 0.0, 0.15294118, 0.82352942, 0.99215686, 0.99215686, 0.99215686, 0.99215686, 0.99215686, 0.99215686, 0.74117649, 0.44705883, 0.0, 0.0, 0.0, 0.0, 0.0, 0.0, 0.0, 0.0, 0.0, 0.0, 0.0, 0.0, 0.0, 0.0, 0.0, 0.0, 0.0, 0.0, 0.0, 0.16862746, 0.42352942, 0.99215686, 0.99215686, 0.7019608, 0.30588236, 0.30588236, 0.10588235, 0.0, 0.0, 0.0, 0.0, 0.0, 0.5, 0.0, 0.0, 0.0, 0.0, 0.0, 0.0, 0.0, 0.0, 0.0, 0.0, 0.0, 0.0, 0.0, 0.0, 0.0, 0.0, 0.0, 0.0, 0.0, 0.0, 0.0, 0.0, 0.0, 0.0, 0.0, 0.0, 0.0, 0.0, 0.0, 0.0, 0.0, 0.0, 0.0, 0.0, 0.0, 0.0, 0.0, 0.0, 0.0, 0.0, 0.0, 0.0, 0.0, 0.0, 0.0, 0.0, 0.0, 0.0, 0.0, 0.0, 0.0, 0.0, 0.0, 0.0, 0.0, 0.0, 0.0, 0.0, 0.0, 0.0, 0.0, 0.0, 0.0, 0.0, 0.0, 0.0, 0.0, 0.0, 0.0, 0.0, 0.0, 0.0, 0.0, 0.0, 0.0, 0.0, 0.0, 0.0, 0.0, 0.0, 0.0, 0.0, 0.0, 0.0, 0.0, 0.0, 0.0, 0.0, 0.0, 0.0, 0.0, 0.0, 0.0, 0.0, 0.0, 1.0, 0.0, 0.0, 0.0, 0.0, 0.0, 0.0, 0.0, 0.0, 0.0, 0.0, 0.0, 0.0, 0.0, 0.0, 0.0, 0.0, 0.0, 0.0, 0.0, 0.0, 0.0, 0.0], ([8.400045710644239, -144.91893065376294, -59.38238601188761, -98.28097119950506, -62.78918311480375, -111.46727781130835, -63.11731772332024, -92.06089874783602, -88.86788470570626, -47.47697174406072], [7.981230220260212, -144.44750349992086, -59.15977493614776, -97.87606747718814, -62.16987370486872, -110.7425631392549, -63.163836843944516, -91.04399427884042, -88.4917088967686, -47.190462063171985], 1.0169044689956053))
[Thread 1] Total splits: 71
Processed 72 zonotopes (Work Done: 0.0%); Generated 142 (0.020460105972222222s/loop)
[Thread 1] Finished in 1.47s
 ────────────────────────────────────────────────────────────────────────────────
                                        Time                    Allocations      
                               ───────────────────────   ────────────────────────
       Tot / % measured:            1.48s / 100.0%           1.14GiB / 100.0%    

 Section               ncalls     time    %tot     avg     alloc    %tot      avg
 ────────────────────────────────────────────────────────────────────────────────
 Verify                     1    1.47s   99.9%   1.47s   1.14GiB   99.5%  1.14GiB
   Zonotope Loop            1    1.47s   99.9%   1.47s   1.14GiB   99.5%  1.14GiB
     Zonotope Propa...     72    1.29s   87.2%  17.9ms   1.04GiB   90.8%  14.8MiB
       DiffZonotope...    216    1.06s   72.1%  4.92ms    187MiB   16.0%   888KiB
         Zonotope_D...    432    422ms   28.6%   978μs   87.3MiB    7.4%   207KiB
       DiffZonotope...    144    221ms   15.0%  1.54ms    877MiB   74.8%  6.09MiB
         Zonotope_R...    288    126ms    8.5%   436μs    527MiB   45.0%  1.83MiB
           Column M...    288   64.9ms    4.4%   225μs    235MiB   20.1%   836KiB
           Influenc...    288   21.8ms    1.5%  75.6μs   48.4MiB    4.1%   172KiB
             Multiply     288   18.9ms    1.3%  65.5μs   37.4MiB    3.2%   133KiB
             Alloca...    288   2.00ms    0.1%  6.96μs   11.0MiB    0.9%  39.2KiB
             Set Ma...    288    587μs    0.0%  2.04μs     0.00B    0.0%    0.00B
           Allocation     288   19.5ms    1.3%  67.7μs    235MiB   20.1%   836KiB
           Set Matrix     288   14.0ms    0.9%  48.5μs   1.14MiB    0.1%  4.07KiB
           Vectors        288   4.79ms    0.3%  16.6μs   7.02MiB    0.6%  25.0KiB
           Bounds         288    143μs    0.0%   495ns     0.00B    0.0%    0.00B
     Property Check        72    169ms   11.4%  2.34ms   13.8MiB    1.2%   197KiB
     Compute Split         71   7.92ms    0.5%   112μs   22.6MiB    1.9%   326KiB
 Initialize                 1   1.94ms    0.1%  1.94ms   5.28MiB    0.5%  5.28MiB
 ────────────────────────────────────────────────────────────────────────────────
[VERYDIFF_TIMER] 1.505759407

[VERYDIFF_EXPERIMENT] NETWORK: /home/i57/steuber/NeuroDiff/repos/VeryDiffExperiments/src/../benchmarks/mnist-prune/specs/mnist_25_local_24.vnnlib
[VERYDIFF_EXPERIMENT] TIME: 1.80890086
