[VERYDIFF_EXPERIMENT] Sigma: 0.1
Parsing new_benchmarks/lhc/nets/4_20-0.1.onnx...
Found input X
WARNING: Operation Softmax is not supported
WE ARE IGNORING THIS OPERATION -- IF YOU DO NOT KNOW WHAT YOU ARE DOING THIS MAY BE UNSOUND!
op: gemm, weight: (20, 16), bias: (20,)
op: relu, weight: nothing, bias: nothing
op: gemm, weight: (20, 20), bias: (20,)
op: relu, weight: nothing, bias: nothing
op: gemm, weight: (20, 20), bias: (20,)
op: relu, weight: nothing, bias: nothing
op: gemm, weight: (20, 20), bias: (20,)
op: relu, weight: nothing, bias: nothing
op: gemm, weight: (5, 20), bias: (5,)
Parsing new_benchmarks/lhc/nets_pruned/4_20-0.1-0.5.onnx...
Found input X
WARNING: Operation Softmax is not supported
WE ARE IGNORING THIS OPERATION -- IF YOU DO NOT KNOW WHAT YOU ARE DOING THIS MAY BE UNSOUND!
op: gemm, weight: (20, 16), bias: (20,)
op: relu, weight: nothing, bias: nothing
op: gemm, weight: (20, 20), bias: (20,)
op: relu, weight: nothing, bias: nothing
op: gemm, weight: (20, 20), bias: (20,)
op: relu, weight: nothing, bias: nothing
op: gemm, weight: (20, 20), bias: (20,)
op: relu, weight: nothing, bias: nothing
op: gemm, weight: (5, 20), bias: (5,)
Distance: 70.85694174759556
Distance: 99.73083349841181
Distance: 87.91278296138626
Distance: 67.87556776427664
Distance: 1.888792011886835
Running with 1 threads
[Thread 1] Time to first task: 0.0s
Zono Bounds:
[0.0, 0.0, 0.0, 0.0, 0.0, 0.0, 0.0, 0.0, 0.0, 0.0, 0.0, 0.0, 0.0, 0.0, 0.0, 0.0]
[0.0, 0.0, 0.0, 0.0, 0.0, 0.0, 0.0, 0.0, 0.0, 0.0, 0.0, 0.0, 0.0, 0.0, 0.0, 0.0]
[TOP-1] did not find required confidence yet.
[TOP-1] required confidence (0.9999999935969275≥0.99) is feasible for index 2
Found cex
N1 Probability: 0.9963534259203118 >= 0.99

Found counterexample: ([0.0, 0.0, 0.0, 0.05, 0.0, 0.0, 0.0, 0.0, 0.0, 0.0, 0.0, 0.0, 0.0, 0.0, -0.05, 0.0], (3, 2))
[Thread 1] Total splits: 3
Processed 4 zonotopes (Work Done: 0.0%); Generated 6 (0.00582734775s/loop)
[Thread 1] Finished in 0.02s
 ────────────────────────────────────────────────────────────────────────────────
                                        Time                    Allocations      
                               ───────────────────────   ────────────────────────
       Tot / % measured:           23.4ms / 100.0%           5.92MiB / 100.0%    

 Section               ncalls     time    %tot     avg     alloc    %tot      avg
 ────────────────────────────────────────────────────────────────────────────────
 Verify                     1   23.3ms   99.9%  23.3ms   5.89MiB   99.6%  5.89MiB
   Zonotope Loop            1   23.3ms   99.8%  23.3ms   5.89MiB   99.6%  5.89MiB
     Property Check         4   22.6ms   96.7%  5.65ms   4.71MiB   79.7%  1.18MiB
     Zonotope Propa...      4    561μs    2.4%   140μs   1.03MiB   17.5%   265KiB
       DiffZonotope...     16    426μs    1.8%  26.6μs    876KiB   14.5%  54.7KiB
         Zonotope_R...     32    381μs    1.6%  11.9μs    838KiB   13.8%  26.2KiB
           Influenc...     32    162μs    0.7%  5.05μs    395KiB    6.5%  12.3KiB
             Multiply      32    109μs    0.5%  3.39μs    240KiB    4.0%  7.51KiB
             Alloca...     32   27.3μs    0.1%   853ns    152KiB    2.5%  4.77KiB
             Set Ma...     32   10.4μs    0.0%   326ns     0.00B    0.0%    0.00B
           Column M...     32   71.4μs    0.3%  2.23μs    194KiB    3.2%  6.06KiB
           Set Matrix      32   41.1μs    0.2%  1.28μs   15.1KiB    0.2%     484B
           Allocation      32   38.6μs    0.2%  1.21μs    190KiB    3.1%  5.94KiB
           Vectors         32   38.3μs    0.2%  1.20μs   38.0KiB    0.6%  1.19KiB
           Bounds          32   6.02μs    0.0%   188ns     0.00B    0.0%    0.00B
       DiffZonotope...     20    107μs    0.5%  5.33μs    181KiB    3.0%  9.03KiB
         Zonotope_D...     40    100μs    0.4%  2.51μs    179KiB    2.9%  4.47KiB
     Compute Split          3   77.0μs    0.3%  25.7μs   78.0KiB    1.3%  26.0KiB
 Initialize                 1   34.5μs    0.1%  34.5μs   22.4KiB    0.4%  22.4KiB
 ────────────────────────────────────────────────────────────────────────────────[VERYDIFF_TIMER] 0.024889617
[VERYDIFF_EXPERIMENT] Sigma: 0.5
Parsing new_benchmarks/lhc/nets/4_20-0.1.onnx...
Found input X
WARNING: Operation Softmax is not supported
WE ARE IGNORING THIS OPERATION -- IF YOU DO NOT KNOW WHAT YOU ARE DOING THIS MAY BE UNSOUND!
op: gemm, weight: (20, 16), bias: (20,)
op: relu, weight: nothing, bias: nothing
op: gemm, weight: (20, 20), bias: (20,)
op: relu, weight: nothing, bias: nothing
op: gemm, weight: (20, 20), bias: (20,)
op: relu, weight: nothing, bias: nothing
op: gemm, weight: (20, 20), bias: (20,)
op: relu, weight: nothing, bias: nothing
op: gemm, weight: (5, 20), bias: (5,)
Parsing new_benchmarks/lhc/nets_pruned/4_20-0.1-0.5.onnx...
Found input X
WARNING: Operation Softmax is not supported
WE ARE IGNORING THIS OPERATION -- IF YOU DO NOT KNOW WHAT YOU ARE DOING THIS MAY BE UNSOUND!
op: gemm, weight: (20, 16), bias: (20,)
op: relu, weight: nothing, bias: nothing
op: gemm, weight: (20, 20), bias: (20,)
op: relu, weight: nothing, bias: nothing
op: gemm, weight: (20, 20), bias: (20,)
op: relu, weight: nothing, bias: nothing
op: gemm, weight: (20, 20), bias: (20,)
op: relu, weight: nothing, bias: nothing
op: gemm, weight: (5, 20), bias: (5,)
Distance: 70.85694174759556
Distance: 99.73083349841181
Distance: 87.91278296138626
Distance: 67.87556776427664
Distance: 1.888792011886835
Running with 1 threads
[Thread 1] Time to first task: 0.0s
Zono Bounds:
[0.0, 0.0, 0.0, 0.0, 0.0, 0.0, 0.0, 0.0, 0.0, 0.0, 0.0, 0.0, 0.0, 0.0, 0.0, 0.0]
[0.0, 0.0, 0.0, 0.0, 0.0, 0.0, 0.0, 0.0, 0.0, 0.0, 0.0, 0.0, 0.0, 0.0, 0.0, 0.0]
[TOP-1] did not find required confidence yet.
Found cex
N1: 1.0 (vs. 1.0804573108455083e-20)
N2: 0.5100348655538152
N1 Probability: 1.0 >= 0.99

Found counterexample: ([0.5, 0.5, -0.5, -0.5, -0.5, -0.5, 0.5, -0.5, -0.5, 0.5, 0.5, 0.5, 0.5, -0.5, 0.5, 0.5], (1, 3))
[Thread 1] Total splits: 0
Processed 1 zonotopes (Work Done: 0.0%); Generated 0 (0.001899021s/loop)
[Thread 1] Finished in 0.0s
 ────────────────────────────────────────────────────────────────────────────────
                                        Time                    Allocations      
                               ───────────────────────   ────────────────────────
       Tot / % measured:           1.95ms /  99.8%            798KiB /  99.8%    

 Section               ncalls     time    %tot     avg     alloc    %tot      avg
 ────────────────────────────────────────────────────────────────────────────────
 Verify                     1   1.91ms   98.2%  1.91ms    774KiB   97.2%   774KiB
   Zonotope Loop            1   1.90ms   97.5%  1.90ms    770KiB   96.7%   770KiB
     Property Check         1   1.68ms   86.4%  1.68ms    351KiB   44.1%   351KiB
     Zonotope Propa...      1    168μs    8.6%   168μs    381KiB   47.8%   381KiB
       DiffZonotope...      4    132μs    6.8%  33.1μs    318KiB   40.0%  79.5KiB
         Zonotope_R...      8    121μs    6.2%  15.1μs    308KiB   38.7%  38.5KiB
           Influenc...      8   48.9μs    2.5%  6.12μs    152KiB   19.1%  19.0KiB
             Multiply       8   34.9μs    1.8%  4.36μs   95.7KiB   12.0%  12.0KiB
             Alloca...      8   6.69μs    0.3%   836ns   54.4KiB    6.8%  6.80KiB
             Set Ma...      8   3.09μs    0.2%   386ns     0.00B    0.0%    0.00B
           Column M...      8   22.1μs    1.1%  2.76μs   69.0KiB    8.7%  8.63KiB
           Allocation       8   21.5μs    1.1%  2.68μs   67.8KiB    8.5%  8.47KiB
           Set Matrix       8   11.7μs    0.6%  1.47μs   4.89KiB    0.6%     626B
           Vectors          8   8.90μs    0.5%  1.11μs   9.50KiB    1.2%  1.19KiB
           Bounds           8   1.30μs    0.1%   163ns     0.00B    0.0%    0.00B
       DiffZonotope...      5   30.3μs    1.6%  6.05μs   60.5KiB    7.6%  12.1KiB
         Zonotope_D...     10   28.6μs    1.5%  2.86μs   59.5KiB    7.5%  5.95KiB
 Initialize                 1   34.6μs    1.8%  34.6μs   22.4KiB    2.8%  22.4KiB
 ────────────────────────────────────────────────────────────────────────────────[VERYDIFF_TIMER] 0.003659522
[VERYDIFF_EXPERIMENT] Sigma: 1.0
Parsing new_benchmarks/lhc/nets/4_20-0.1.onnx...
Found input X
WARNING: Operation Softmax is not supported
WE ARE IGNORING THIS OPERATION -- IF YOU DO NOT KNOW WHAT YOU ARE DOING THIS MAY BE UNSOUND!
op: gemm, weight: (20, 16), bias: (20,)
op: relu, weight: nothing, bias: nothing
op: gemm, weight: (20, 20), bias: (20,)
op: relu, weight: nothing, bias: nothing
op: gemm, weight: (20, 20), bias: (20,)
op: relu, weight: nothing, bias: nothing
op: gemm, weight: (20, 20), bias: (20,)
op: relu, weight: nothing, bias: nothing
op: gemm, weight: (5, 20), bias: (5,)
Parsing new_benchmarks/lhc/nets_pruned/4_20-0.1-0.5.onnx...
Found input X
WARNING: Operation Softmax is not supported
WE ARE IGNORING THIS OPERATION -- IF YOU DO NOT KNOW WHAT YOU ARE DOING THIS MAY BE UNSOUND!
op: gemm, weight: (20, 16), bias: (20,)
op: relu, weight: nothing, bias: nothing
op: gemm, weight: (20, 20), bias: (20,)
op: relu, weight: nothing, bias: nothing
op: gemm, weight: (20, 20), bias: (20,)
op: relu, weight: nothing, bias: nothing
op: gemm, weight: (20, 20), bias: (20,)
op: relu, weight: nothing, bias: nothing
op: gemm, weight: (5, 20), bias: (5,)
Distance: 70.85694174759556
Distance: 99.73083349841181
Distance: 87.91278296138626
Distance: 67.87556776427664
Distance: 1.888792011886835
Running with 1 threads
[Thread 1] Time to first task: 0.0s
Zono Bounds:
[0.0, 0.0, 0.0, 0.0, 0.0, 0.0, 0.0, 0.0, 0.0, 0.0, 0.0, 0.0, 0.0, 0.0, 0.0, 0.0]
[0.0, 0.0, 0.0, 0.0, 0.0, 0.0, 0.0, 0.0, 0.0, 0.0, 0.0, 0.0, 0.0, 0.0, 0.0, 0.0]
[TOP-1] did not find required confidence yet.
Found cex
N1: 1.0 (vs. 5.95334994569629e-67)
N2: 0.6852987918419416
N1 Probability: 1.0 >= 0.99

Found counterexample: ([1.0, 1.0, -1.0, -1.0, -1.0, -1.0, 1.0, -1.0, 1.0, 1.0, 1.0, -1.0, 1.0, -1.0, 1.0, 1.0], (1, 2))
[Thread 1] Total splits: 0
Processed 1 zonotopes (Work Done: 0.0%); Generated 0 (0.001858995s/loop)
[Thread 1] Finished in 0.0s
 ────────────────────────────────────────────────────────────────────────────────
                                        Time                    Allocations      
                               ───────────────────────   ────────────────────────
       Tot / % measured:           1.91ms /  99.8%            799KiB /  99.8%    

 Section               ncalls     time    %tot     avg     alloc    %tot      avg
 ────────────────────────────────────────────────────────────────────────────────
 Verify                     1   1.87ms   98.4%  1.87ms    775KiB   97.2%   775KiB
   Zonotope Loop            1   1.86ms   97.6%  1.86ms    771KiB   96.7%   771KiB
     Property Check         1   1.65ms   86.4%  1.65ms    352KiB   44.1%   352KiB
     Zonotope Propa...      1    168μs    8.8%   168μs    382KiB   47.8%   382KiB
       DiffZonotope...      4    130μs    6.8%  32.5μs    319KiB   40.0%  79.8KiB
         Zonotope_R...      8    119μs    6.2%  14.9μs    309KiB   38.8%  38.6KiB
           Influenc...      8   48.3μs    2.5%  6.04μs    153KiB   19.2%  19.1KiB
             Multiply       8   34.4μs    1.8%  4.30μs   96.2KiB   12.1%  12.0KiB
             Alloca...      8   6.56μs    0.3%   820ns   54.5KiB    6.8%  6.81KiB
             Set Ma...      8   3.04μs    0.2%   380ns     0.00B    0.0%    0.00B
           Column M...      8   22.6μs    1.2%  2.83μs   69.2KiB    8.7%  8.65KiB
           Allocation       8   18.8μs    1.0%  2.35μs   67.9KiB    8.5%  8.48KiB
           Set Matrix       8   11.5μs    0.6%  1.44μs   4.94KiB    0.6%     632B
           Vectors          8   9.32μs    0.5%  1.17μs   9.50KiB    1.2%  1.19KiB
           Bounds           8   1.31μs    0.1%   164ns     0.00B    0.0%    0.00B
       DiffZonotope...      5   31.2μs    1.6%  6.25μs   60.5KiB    7.6%  12.1KiB
         Zonotope_D...     10   29.6μs    1.6%  2.96μs   59.5KiB    7.5%  5.95KiB
 Initialize                 1   30.8μs    1.6%  30.8μs   22.4KiB    2.8%  22.4KiB
 ────────────────────────────────────────────────────────────────────────────────[VERYDIFF_TIMER] 0.003232306
[VERYDIFF_EXPERIMENT] Sigma: 2.0
Parsing new_benchmarks/lhc/nets/4_20-0.1.onnx...
Found input X
WARNING: Operation Softmax is not supported
WE ARE IGNORING THIS OPERATION -- IF YOU DO NOT KNOW WHAT YOU ARE DOING THIS MAY BE UNSOUND!
op: gemm, weight: (20, 16), bias: (20,)
op: relu, weight: nothing, bias: nothing
op: gemm, weight: (20, 20), bias: (20,)
op: relu, weight: nothing, bias: nothing
op: gemm, weight: (20, 20), bias: (20,)
op: relu, weight: nothing, bias: nothing
op: gemm, weight: (20, 20), bias: (20,)
op: relu, weight: nothing, bias: nothing
op: gemm, weight: (5, 20), bias: (5,)
Parsing new_benchmarks/lhc/nets_pruned/4_20-0.1-0.5.onnx...
Found input X
WARNING: Operation Softmax is not supported
WE ARE IGNORING THIS OPERATION -- IF YOU DO NOT KNOW WHAT YOU ARE DOING THIS MAY BE UNSOUND!
op: gemm, weight: (20, 16), bias: (20,)
op: relu, weight: nothing, bias: nothing
op: gemm, weight: (20, 20), bias: (20,)
op: relu, weight: nothing, bias: nothing
op: gemm, weight: (20, 20), bias: (20,)
op: relu, weight: nothing, bias: nothing
op: gemm, weight: (20, 20), bias: (20,)
op: relu, weight: nothing, bias: nothing
op: gemm, weight: (5, 20), bias: (5,)
Distance: 70.85694174759556
Distance: 99.73083349841181
Distance: 87.91278296138626
Distance: 67.87556776427664
Distance: 1.888792011886835
Running with 1 threads
[Thread 1] Time to first task: 0.0s
Zono Bounds:
[0.0, 0.0, 0.0, 0.0, 0.0, 0.0, 0.0, 0.0, 0.0, 0.0, 0.0, 0.0, 0.0, 0.0, 0.0, 0.0]
[0.0, 0.0, 0.0, 0.0, 0.0, 0.0, 0.0, 0.0, 0.0, 0.0, 0.0, 0.0, 0.0, 0.0, 0.0, 0.0]
[TOP-1] did not find required confidence yet.
Found cex
N1: 1.0 (vs. 1.1756913078554632e-122)
N2: 0.793423108784478
N1 Probability: 1.0 >= 0.99

Found counterexample: ([2.0, 2.0, -2.0, -2.0, -2.0, -2.0, 2.0, -2.0, 2.0, -2.0, 2.0, -2.0, 2.0, -2.0, 2.0, 2.0], (1, 2))
[Thread 1] Total splits: 0
Processed 1 zonotopes (Work Done: 0.0%); Generated 0 (0.001835605s/loop)
[Thread 1] Finished in 0.0s
 ────────────────────────────────────────────────────────────────────────────────
                                        Time                    Allocations      
                               ───────────────────────   ────────────────────────
       Tot / % measured:           1.88ms /  99.8%            799KiB /  99.8%    

 Section               ncalls     time    %tot     avg     alloc    %tot      avg
 ────────────────────────────────────────────────────────────────────────────────
 Verify                     1   1.85ms   98.4%  1.85ms    775KiB   97.2%   775KiB
   Zonotope Loop            1   1.84ms   97.6%  1.84ms    771KiB   96.7%   771KiB
     Property Check         1   1.62ms   86.3%  1.62ms    352KiB   44.1%   352KiB
     Zonotope Propa...      1    168μs    8.9%   168μs    382KiB   47.8%   382KiB
       DiffZonotope...      4    129μs    6.9%  32.2μs    319KiB   40.0%  79.8KiB
         Zonotope_R...      8    118μs    6.3%  14.8μs    309KiB   38.8%  38.6KiB
           Influenc...      8   49.6μs    2.6%  6.21μs    153KiB   19.2%  19.1KiB
             Multiply       8   35.4μs    1.9%  4.43μs   96.2KiB   12.1%  12.0KiB
             Alloca...      8   6.87μs    0.4%   858ns   54.5KiB    6.8%  6.81KiB
             Set Ma...      8   3.05μs    0.2%   381ns     0.00B    0.0%    0.00B
           Column M...      8   21.8μs    1.2%  2.73μs   69.2KiB    8.7%  8.65KiB
           Allocation       8   17.2μs    0.9%  2.14μs   67.9KiB    8.5%  8.48KiB
           Set Matrix       8   11.4μs    0.6%  1.43μs   4.94KiB    0.6%     632B
           Vectors          8   9.26μs    0.5%  1.16μs   9.50KiB    1.2%  1.19KiB
           Bounds           8   1.41μs    0.1%   176ns     0.00B    0.0%    0.00B
       DiffZonotope...      5   32.6μs    1.7%  6.52μs   60.5KiB    7.6%  12.1KiB
         Zonotope_D...     10   30.9μs    1.6%  3.09μs   59.5KiB    7.5%  5.95KiB
 Initialize                 1   30.0μs    1.6%  30.0μs   22.4KiB    2.8%  22.4KiB
 ────────────────────────────────────────────────────────────────────────────────[VERYDIFF_TIMER] 0.00328144
[VERYDIFF_EXPERIMENT] Sigma: 3.0
Parsing new_benchmarks/lhc/nets/4_20-0.1.onnx...
Found input X
WARNING: Operation Softmax is not supported
WE ARE IGNORING THIS OPERATION -- IF YOU DO NOT KNOW WHAT YOU ARE DOING THIS MAY BE UNSOUND!
op: gemm, weight: (20, 16), bias: (20,)
op: relu, weight: nothing, bias: nothing
op: gemm, weight: (20, 20), bias: (20,)
op: relu, weight: nothing, bias: nothing
op: gemm, weight: (20, 20), bias: (20,)
op: relu, weight: nothing, bias: nothing
op: gemm, weight: (20, 20), bias: (20,)
op: relu, weight: nothing, bias: nothing
op: gemm, weight: (5, 20), bias: (5,)
Parsing new_benchmarks/lhc/nets_pruned/4_20-0.1-0.5.onnx...
Found input X
WARNING: Operation Softmax is not supported
WE ARE IGNORING THIS OPERATION -- IF YOU DO NOT KNOW WHAT YOU ARE DOING THIS MAY BE UNSOUND!
op: gemm, weight: (20, 16), bias: (20,)
op: relu, weight: nothing, bias: nothing
op: gemm, weight: (20, 20), bias: (20,)
op: relu, weight: nothing, bias: nothing
op: gemm, weight: (20, 20), bias: (20,)
op: relu, weight: nothing, bias: nothing
op: gemm, weight: (20, 20), bias: (20,)
op: relu, weight: nothing, bias: nothing
op: gemm, weight: (5, 20), bias: (5,)
Distance: 70.85694174759556
Distance: 99.73083349841181
Distance: 87.91278296138626
Distance: 67.87556776427664
Distance: 1.888792011886835
Running with 1 threads
[Thread 1] Time to first task: 0.0s
Zono Bounds:
[0.0, 0.0, 0.0, 0.0, 0.0, 0.0, 0.0, 0.0, 0.0, 0.0, 0.0, 0.0, 0.0, 0.0, 0.0, 0.0]
[0.0, 0.0, 0.0, 0.0, 0.0, 0.0, 0.0, 0.0, 0.0, 0.0, 0.0, 0.0, 0.0, 0.0, 0.0, 0.0]
[TOP-1] required confidence (0.9996232025112445≥0.99) is feasible for index 1
Found cex
N1: 1.0 (vs. 1.2929665881735328e-186)
N2: 0.9920520408664206
N1 Probability: 1.0 >= 0.99

Found counterexample: ([3.0, 3.0, -3.0, -3.0, -3.0, -3.0, 3.0, -3.0, 3.0, -3.0, 3.0, -3.0, 3.0, -3.0, 3.0, 3.0], (1, 2))
[Thread 1] Total splits: 0
Processed 1 zonotopes (Work Done: 0.0%); Generated 0 (0.001918463s/loop)
[Thread 1] Finished in 0.0s
 ────────────────────────────────────────────────────────────────────────────────
                                        Time                    Allocations      
                               ───────────────────────   ────────────────────────
       Tot / % measured:           1.97ms /  99.8%            800KiB /  99.8%    

 Section               ncalls     time    %tot     avg     alloc    %tot      avg
 ────────────────────────────────────────────────────────────────────────────────
 Verify                     1   1.93ms   98.4%  1.93ms    776KiB   97.2%   776KiB
   Zonotope Loop            1   1.92ms   97.6%  1.92ms    773KiB   96.7%   773KiB
     Property Check         1   1.64ms   83.3%  1.64ms    353KiB   44.2%   353KiB
     Zonotope Propa...      1    223μs   11.3%   223μs    382KiB   47.8%   382KiB
       DiffZonotope...      4    185μs    9.4%  46.3μs    319KiB   39.9%  79.8KiB
         Zonotope_R...      8    174μs    8.9%  21.8μs    309KiB   38.7%  38.6KiB
           Influenc...      8    102μs    5.2%  12.8μs    153KiB   19.1%  19.1KiB
             Multiply       8   87.5μs    4.4%  10.9μs   96.2KiB   12.0%  12.0KiB
             Alloca...      8   7.03μs    0.4%   878ns   54.5KiB    6.8%  6.81KiB
             Set Ma...      8   3.04μs    0.2%   381ns     0.00B    0.0%    0.00B
           Column M...      8   22.8μs    1.2%  2.85μs   69.2KiB    8.7%  8.65KiB
           Allocation       8   19.4μs    1.0%  2.42μs   67.9KiB    8.5%  8.48KiB
           Set Matrix       8   12.0μs    0.6%  1.50μs   4.94KiB    0.6%     632B
           Vectors          8   9.14μs    0.5%  1.14μs   9.50KiB    1.2%  1.19KiB
           Bounds           8   1.48μs    0.1%   185ns     0.00B    0.0%    0.00B
       DiffZonotope...      5   31.3μs    1.6%  6.27μs   60.5KiB    7.6%  12.1KiB
         Zonotope_D...     10   29.7μs    1.5%  2.97μs   59.5KiB    7.4%  5.95KiB
 Initialize                 1   32.0μs    1.6%  32.0μs   22.4KiB    2.8%  22.4KiB
 ────────────────────────────────────────────────────────────────────────────────[VERYDIFF_TIMER] 0.003288425
