
[VERYDIFF_EXPERIMENT] Running on /home/i57/steuber/NeuroDiff/repos/VeryDiffExperiments/src/../benchmarks/mnist-prune/specs/mnist_70_local_21.vnnlib /home/i57/steuber/NeuroDiff/repos/VeryDiffExperiments/src/../benchmarks/mnist-prune/nets/mnist_relu_3_100.onnx
Parsing /home/i57/steuber/NeuroDiff/repos/VeryDiffExperiments/src/../benchmarks/mnist-prune/nets/mnist_relu_3_100.onnx...
Found input X
op: matmul, weight: (100, 784), bias: nothing
op: bias, weight: nothing, bias: (100,)
op: relu, weight: nothing, bias: nothing
op: matmul, weight: (100, 100), bias: nothing
op: bias, weight: nothing, bias: (100,)
op: relu, weight: nothing, bias: nothing
op: matmul, weight: (10, 100), bias: nothing
op: bias, weight: nothing, bias: (10,)
op: relu, weight: nothing, bias: nothing
op: matmul, weight: (10, 10), bias: nothing
op: bias, weight: nothing, bias: (10,)
Parsing /home/i57/steuber/NeuroDiff/repos/VeryDiffExperiments/src/../benchmarks/mnist-prune/nets_pruned/mnist_relu_3_100_0.79_adam_1_stepsize-old.onnx...
Found input X
op: gemm, weight: (100, 784), bias: (100,)
op: relu, weight: nothing, bias: nothing
op: gemm, weight: (100, 100), bias: (100,)
op: relu, weight: nothing, bias: nothing
op: gemm, weight: (10, 100), bias: (10,)
op: relu, weight: nothing, bias: nothing
op: gemm, weight: (10, 10), bias: (10,)
Distance: 368.62397500800625
Distance: 47.56803950402309
Distance: 2.8977568827249343
Distance: 0.01885471428334995
Running with 1 threads
[Thread 1] Time to first task: 0.0s
Instable Generators: 36
Instable Generators: 49
Instable Generators: 6
Zono Bounds:
[-1.2465070619042047, -1.3769750369293023, -1.3696590070644885, -1.3685127459122208, -0.0007283199978852603, -1.6661910103427533, -0.00012088126730990304, -1.2940449286719151, -1.302377693319236, -1.5281027870908073]
[1.247058304428756, 1.2691759202233095, 1.219151982944394, 1.2790632835245415, 0.0009440187681707572, 1.5650697337264483, 0.0007576171572218072, 1.4105773787306701, 1.2915305670707096, 1.5207470776128043]
[Thread 1] Total splits: 0
Processed 1 zonotopes (Work Done: 100.0%); Generated 0 (0.029108319s/loop)
[Thread 1] Finished in 0.03s
 ────────────────────────────────────────────────────────────────────────────────
                                        Time                    Allocations      
                               ───────────────────────   ────────────────────────
       Tot / % measured:           29.4ms / 100.0%           16.8MiB / 100.0%    

 Section               ncalls     time    %tot     avg     alloc    %tot      avg
 ────────────────────────────────────────────────────────────────────────────────
 Verify                     1   29.1ms   99.0%  29.1ms   16.0MiB   95.0%  16.0MiB
   Zonotope Loop            1   29.1ms   98.9%  29.1ms   16.0MiB   95.0%  16.0MiB
     Property Check         1   27.2ms   92.5%  27.2ms   13.5MiB   80.6%  13.5MiB
     Zonotope Propa...      1   1.77ms    6.0%  1.77ms   1.55MiB    9.2%  1.55MiB
       DiffZonotope...      4   1.19ms    4.0%   297μs    330KiB    1.9%  82.5KiB
         Zonotope_D...      8    523μs    1.8%  65.4μs    165KiB    1.0%  20.6KiB
       DiffZonotope...      3    577μs    2.0%   192μs   1.22MiB    7.3%   417KiB
         Zonotope_R...      6    290μs    1.0%  48.3μs    826KiB    4.8%   138KiB
           Influenc...      6    107μs    0.4%  17.8μs    251KiB    1.5%  41.9KiB
             Multiply       6   73.7μs    0.3%  12.3μs    159KiB    0.9%  26.5KiB
             Alloca...      6   19.3μs    0.1%  3.22μs   90.4KiB    0.5%  15.1KiB
             Set Ma...      6   8.15μs    0.0%  1.36μs     0.00B    0.0%    0.00B
           Column M...      6   81.4μs    0.3%  13.6μs    272KiB    1.6%  45.4KiB
           Allocation       6   37.7μs    0.1%  6.28μs    272KiB    1.6%  45.3KiB
           Set Matrix       6   33.7μs    0.1%  5.62μs   6.09KiB    0.0%  1.02KiB
           Vectors          6   19.6μs    0.1%  3.26μs   19.5KiB    0.1%  3.26KiB
           Bounds           6   1.91μs    0.0%   318ns     0.00B    0.0%    0.00B
 Initialize                 1    306μs    1.0%   306μs    858KiB    5.0%   858KiB
 ────────────────────────────────────────────────────────────────────────────────
[VERYDIFF_TIMER] 0.05523116

[VERYDIFF_EXPERIMENT] NETWORK: /home/i57/steuber/NeuroDiff/repos/VeryDiffExperiments/src/../benchmarks/mnist-prune/specs/mnist_70_local_21.vnnlib
[VERYDIFF_EXPERIMENT] TIME: 0.358916421
