
[VERYDIFF_EXPERIMENT] Running on /home/i57/steuber/NeuroDiff/repos/VeryDiffExperiments/src/../benchmarks/mnist-prune/specs/mnist_93_local_21.vnnlib /home/i57/steuber/NeuroDiff/repos/VeryDiffExperiments/src/../benchmarks/mnist-prune/nets/mnist_relu_2_512.onnx
Loading /home/i57/steuber/NeuroDiff/repos/VeryDiffExperiments/src/../benchmarks/mnist-prune/nets/mnist_relu_2_512.onnx and /home/i57/steuber/NeuroDiff/repos/VeryDiffExperiments/src/../benchmarks/mnist-prune/nets_pruned/mnist_relu_2_512_0.79-old.onnx
INPUT SHAPE: 784
Refined: 4 | Refine Limit: 3 | Wrong: 0 | Right: 2 | Total: 2 | Total Zonos Considered: 6 | Expected 60 (3.3333333333333335%)Refined: 10 | Refine Limit: 9 | Wrong: 0 | Right: 4 | Total: 4 | Total Zonos Considered: 14 | Expected 118 (3.389830508474576%)Refined: 19 | Refine Limit: 16 | Wrong: 0 | Right: 7 | Total: 7 | Total Zonos Considered: 26 | Expected 207 (3.3816425120772946%)Refined: 22 | Refine Limit: 15 | Wrong: 0 | Right: 20 | Total: 20 | Total Zonos Considered: 42 | Expected 593 (3.372681281618887%)Refined: 29 | Refine Limit: 22 | Wrong: 0 | Right: 25 | Total: 25 | Total Zonos Considered: 54 | Expected 742 (3.3692722371967654%)Refined: 35 | Refine Limit: 21 | Wrong: 0 | Right: 35 | Total: 35 | Total Zonos Considered: 70 | Expected 1038 (3.371868978805395%)Refined: 43 | Refine Limit: 27 | Wrong: 0 | Right: 43 | Total: 43 | Total Zonos Considered: 86 | Expected 1276 (3.369905956112853%)Refined: 49 | Refine Limit: 30 | Wrong: 0 | Right: 53 | Total: 53 | Total Zonos Considered: 102 | Expected 1573 (3.3693579148124604%)Refined: 55 | Refine Limit: 29 | Wrong: 0 | Right: 66 | Total: 66 | Total Zonos Considered: 121 | Expected 1958 (3.3707865168539324%)Refined: 59 | Refine Limit: 26 | Wrong: 0 | Right: 79 | Total: 79 | Total Zonos Considered: 138 | Expected 2344 (3.370307167235495%)Refined: 66 | Refine Limit: 30 | Wrong: 0 | Right: 85 | Total: 85 | Total Zonos Considered: 151 | Expected 2522 (3.3703409992069786%)Refined: 69 | Refine Limit: 22 | Wrong: 0 | Right: 104 | Total: 104 | Total Zonos Considered: 173 | Expected 3086 (3.3700583279325986%)Refined: 77 | Refine Limit: 26 | Wrong: 0 | Right: 109 | Total: 109 | Total Zonos Considered: 186 | Expected 3235 (3.3693972179289022%)Refined: 83 | Refine Limit: 26 | Wrong: 0 | Right: 120 | Total: 120 | Total Zonos Considered: 203 | Expected 3561 (3.369839932603201%)Refined: 88 | Refine Limit: 29 | Wrong: 0 | Right: 131 | Total: 131 | Total Zonos Considered: 219 | Expected 3888 (3.369341563786008%)Refined: 93 | Refine Limit: 27 | Wrong: 0 | Right: 141 | Total: 141 | Total Zonos Considered: 234 | Expected 4184 (3.369980879541109%)Refined: 97 | Refine Limit: 25 | Wrong: 0 | Right: 154 | Total: 154 | Total Zonos Considered: 251 | Expected 4570 (3.3698030634573306%)Refined: 102 | Refine Limit: 26 | Wrong: 0 | Right: 162 | Total: 162 | Total Zonos Considered: 264 | Expected 4808 (3.369384359400998%)Refined: 107 | Refine Limit: 20 | Wrong: 0 | Right: 177 | Total: 177 | Total Zonos Considered: 284 | Expected 5253 (3.3695031410622502%)Refined: 112 | Refine Limit: 20 | Wrong: 0 | Right: 188 | Total: 188 | Total Zonos Considered: 300 | Expected 5579 (3.369779530381789%)Refined: 117 | Refine Limit: 17 | Wrong: 0 | Right: 198 | Total: 198 | Total Zonos Considered: 315 | Expected 5876 (3.369639210347175%)Refined: 124 | Refine Limit: 24 | Wrong: 0 | Right: 201 | Total: 201 | Total Zonos Considered: 325 | Expected 5965 (3.3696563285834027%)Refined: 133 | Refine Limit: 34 | Wrong: 0 | Right: 205 | Total: 205 | Total Zonos Considered: 338 | Expected 6084 (3.369493754109139%)Refined: 136 | Refine Limit: 30 | Wrong: 0 | Right: 220 | Total: 220 | Total Zonos Considered: 356 | Expected 6529 (3.369581865523051%)Refined: 141 | Refine Limit: 30 | Wrong: 0 | Right: 229 | Total: 229 | Total Zonos Considered: 370 | Expected 6796 (3.36962919364332%)Refined: 150 | Refine Limit: 39 | Wrong: 0 | Right: 233 | Total: 233 | Total Zonos Considered: 383 | Expected 6915 (3.3694866232827185%)Refined: 152 | Refine Limit: 35 | Wrong: 0 | Right: 247 | Total: 247 | Total Zonos Considered: 399 | Expected 7331 (3.369253853498841%)Refined: 154 | Refine Limit: 27 | Wrong: 0 | Right: 264 | Total: 264 | Total Zonos Considered: 418 | Expected 7835 (3.369495851946394%)Refined: 160 | Refine Limit: 29 | Wrong: 0 | Right: 273 | Total: 273 | Total Zonos Considered: 433 | Expected 8102 (3.369538385583806%)Refined: 167 | Refine Limit: 30 | Wrong: 0 | Right: 279 | Total: 279 | Total Zonos Considered: 446 | Expected 8280 (3.369565217391304%)Refined: 168 | Refine Limit: 23 | Wrong: 0 | Right: 294 | Total: 294 | Total Zonos Considered: 462 | Expected 8726 (3.369241347696539%)Refined: 177 | Refine Limit: 30 | Wrong: 0 | Right: 297 | Total: 297 | Total Zonos Considered: 474 | Expected 8815 (3.3692569483834376%)Refined: 184 | Refine Limit: 39 | Wrong: 0 | Right: 302 | Total: 302 | Total Zonos Considered: 486 | Expected 8963 (3.369407564431552%)Refined: 187 | Refine Limit: 35 | Wrong: 0 | Right: 314 | Total: 314 | Total Zonos Considered: 501 | Expected 9319 (3.369460242515291%)UNKNOWN
TIMEOUT
Refined: 191 | Refine Limit: 29 | Wrong: 0 | Right: 329 | Total: 329 | Total Zonos Considered: 520 | Expected 9764 (3.3695206882425235%)

time: 120.988007804

[VERYDIFF_TIMER] 121.015524936

[VERYDIFF_EXPERIMENT] NETWORK: /home/i57/steuber/NeuroDiff/repos/VeryDiffExperiments/src/../benchmarks/mnist-prune/specs/mnist_93_local_21.vnnlib
[VERYDIFF_EXPERIMENT] TIME: 121.305844492
