
[VERYDIFF_EXPERIMENT] Running on /home/i57/steuber/NeuroDiff/repos/VeryDiffExperiments/src/../benchmarks/mnist-prune/specs/mnist_67_global_4.vnnlib /home/i57/steuber/NeuroDiff/repos/VeryDiffExperiments/src/../benchmarks/mnist-prune/nets/mnist_relu_4_1024.onnx
Parsing /home/i57/steuber/NeuroDiff/repos/VeryDiffExperiments/src/../benchmarks/mnist-prune/nets/mnist_relu_4_1024.onnx...
Found input X
op: matmul, weight: (1024, 784), bias: nothing
op: bias, weight: nothing, bias: (1024,)
op: relu, weight: nothing, bias: nothing
op: matmul, weight: (1024, 1024), bias: nothing
op: bias, weight: nothing, bias: (1024,)
op: relu, weight: nothing, bias: nothing
op: matmul, weight: (1024, 1024), bias: nothing
op: bias, weight: nothing, bias: (1024,)
op: relu, weight: nothing, bias: nothing
op: matmul, weight: (10, 1024), bias: nothing
op: bias, weight: nothing, bias: (10,)
op: relu, weight: nothing, bias: nothing
op: matmul, weight: (10, 10), bias: nothing
op: bias, weight: nothing, bias: (10,)
Parsing /home/i57/steuber/NeuroDiff/repos/VeryDiffExperiments/src/../benchmarks/mnist-prune/nets_pruned/mnist_relu_4_1024_0.79-old.onnx...
Found input X
op: gemm, weight: (1024, 784), bias: (1024,)
op: relu, weight: nothing, bias: nothing
op: gemm, weight: (1024, 1024), bias: (1024,)
op: relu, weight: nothing, bias: nothing
op: gemm, weight: (1024, 1024), bias: (1024,)
op: relu, weight: nothing, bias: nothing
op: gemm, weight: (10, 1024), bias: (10,)
op: relu, weight: nothing, bias: nothing
op: gemm, weight: (10, 10), bias: (10,)
Distance: 915.6394868631054
Distance: 1298.7052820973968
Distance: 1296.587532894263
Distance: 6.054483317080667
Distance: 0.04942679278974538
Running with 1 threads
[Thread 1] Time to first task: 0.01s
Instable Generators: 318
Instable Generators: 615
Instable Generators: 1022
Instable Generators: 10
Zono Bounds:
[-65.81017219473732, -67.24850583706787, -73.72111828000496, -73.43596932231401, -70.22457309326181, -74.51644041365934, -66.87707035124676, -69.43019957120718, -71.3781276666634, -74.41584911162816]
[65.67640370275832, 66.82482791082656, 73.68179736724815, 73.40503831905636, 70.15757320664635, 74.49145122457905, 66.55929399932818, 69.19335044546473, 71.16275702118273, 74.35610022593441]


TIMEOUT REACHED
UNKNOWN
[Thread 1] Total splits: 30
Processed 30 zonotopes (Work Done: 0.0%); Generated 60 (4.089262085233333s/loop)
[Thread 1] Finished in 122.68s
 ────────────────────────────────────────────────────────────────────────────────
                                        Time                    Allocations      
                               ───────────────────────   ────────────────────────
       Tot / % measured:             123s / 100.0%           30.6GiB / 100.0%    

 Section               ncalls     time    %tot     avg     alloc    %tot      avg
 ────────────────────────────────────────────────────────────────────────────────
 Verify                     1     123s  100.0%    123s   30.6GiB   99.9%  30.6GiB
   Zonotope Loop            1     123s  100.0%    123s   30.6GiB   99.9%  30.6GiB
     Zonotope Propa...     30    61.0s   49.7%   2.03s   18.0GiB   58.8%   615MiB
       DiffZonotope...    120    31.0s   25.3%   258ms   14.9GiB   48.7%   127MiB
         Zonotope_R...    240    25.8s   21.0%   108ms   12.1GiB   39.6%  51.8MiB
           Influenc...    240    17.3s   14.1%  72.2ms   7.02GiB   22.9%  29.9MiB
             Multiply     240    14.5s   11.8%  60.6ms   4.11GiB   13.4%  17.5MiB
             Alloca...    240    2.33s    1.9%  9.70ms   2.91GiB    9.5%  12.4MiB
             Set Ma...    240    458ms    0.4%  1.91ms     0.00B    0.0%    0.00B
           Allocation     240    6.72s    5.5%  28.0ms   2.55GiB    8.3%  10.9MiB
           Column M...    240    1.30s    1.1%  5.42ms   2.55GiB    8.3%  10.9MiB
           Set Matrix     240    467ms    0.4%  1.95ms   2.97MiB    0.0%  12.7KiB
           Vectors        240   6.80ms    0.0%  28.3μs   7.96MiB    0.0%  34.0KiB
           Bounds         240    179μs    0.0%   745ns     0.00B    0.0%    0.00B
       DiffZonotope...    150    30.0s   24.5%   200ms   3.10GiB   10.1%  21.2MiB
         Zonotope_D...    300    16.4s   13.4%  54.8ms   1.67GiB    5.5%  5.72MiB
     Property Check        30    60.4s   49.2%   2.01s   10.9GiB   35.5%   372MiB
     Compute Split         30    1.16s    0.9%  38.6ms   1.12GiB    3.6%  38.2MiB
 Initialize                 1   23.6ms    0.0%  23.6ms   27.0MiB    0.1%  27.0MiB
 ────────────────────────────────────────────────────────────────────────────────
[VERYDIFF_TIMER] 122.787390615

[VERYDIFF_EXPERIMENT] NETWORK: /home/i57/steuber/NeuroDiff/repos/VeryDiffExperiments/src/../benchmarks/mnist-prune/specs/mnist_67_global_4.vnnlib
[VERYDIFF_EXPERIMENT] TIME: 123.117104834
