[runlim] version:		2.0.0rc12
[runlim] host:			i57pool5
[runlim] time limit:		311040000 seconds
[runlim] real time limit:	120 seconds
[runlim] space limit:		15563 MB
[runlim] argv[0]:		/home/i57/steuber/.local/bin/Marabou
[runlim] argv[1]:		./mnist-prune/nets/product_mnist_relu_3_100_mnist_relu_3_100_pruned5_eps.onnx
[runlim] argv[2]:		./mnist-prune/specs/product_mnist_63_local_21_eps_1.0.vnnlib
[runlim] start:			Fri Oct  4 00:45:26 2024
[runlim] child:			641845
Network: ./mnist-prune/nets/product_mnist_relu_3_100_mnist_relu_3_100_pruned5_eps.onnx
Property: ./mnist-prune/specs/product_mnist_63_local_21_eps_1.0.vnnlib

Engine::processInputQuery: Input query (before preprocessing): 450 equations, 1654 variables
Engine::processInputQuery: Input query (after preprocessing): 830 equations, 1925 variables

Input bounds:
	x0: [ -0.0000,  -0.0000] [FIXED]
	x1: [ -0.0000,  -0.0000] [FIXED]
	x2: [ -0.0000,  -0.0000] [FIXED]
	x3: [ -0.0000,  -0.0000] [FIXED]
	x4: [ -0.0000,  -0.0000] [FIXED]
	x5: [ -0.0000,  -0.0000] [FIXED]
	x6: [ -0.0000,  -0.0000] [FIXED]
	x7: [ -0.0000,  -0.0000] [FIXED]
	x8: [ -0.0000,  -0.0000] [FIXED]
	x9: [ -0.0000,  -0.0000] [FIXED]
	x10: [ -0.0000,  -0.0000] [FIXED]
	x11: [ -0.0000,  -0.0000] [FIXED]
	x12: [ -0.0000,  -0.0000] [FIXED]
	x13: [ -0.0000,  -0.0000] [FIXED]
	x14: [ -0.0000,  -0.0000] [FIXED]
	x15: [ -0.0000,  -0.0000] [FIXED]
	x16: [ -0.0000,  -0.0000] [FIXED]
	x17: [ -0.0000,  -0.0000] [FIXED]
	x18: [ -0.0000,  -0.0000] [FIXED]
	x19: [ -0.0000,  -0.0000] [FIXED]
	x20: [ -0.0000,  -0.0000] [FIXED]
	x21: [ -0.0000,  -0.0000] [FIXED]
	x22: [ -0.0000,  -0.0000] [FIXED]
	x23: [ -0.0000,  -0.0000] [FIXED]
	x24: [ -0.0000,  -0.0000] [FIXED]
	x25: [ -0.0000,  -0.0000] [FIXED]
	x26: [ -0.0000,  -0.0000] [FIXED]
	x27: [ -0.0000,  -0.0000] [FIXED]
	x28: [ -0.0000,  -0.0000] [FIXED]
	x29: [ -0.0000,  -0.0000] [FIXED]
	x30: [ -0.0000,  -0.0000] [FIXED]
	x31: [ -0.0000,  -0.0000] [FIXED]
	x32: [ -0.0000,  -0.0000] [FIXED]
	x33: [ -0.0000,  -0.0000] [FIXED]
	x34: [ -0.0000,  -0.0000] [FIXED]
	x35: [ -0.0000,  -0.0000] [FIXED]
	x36: [ -0.0000,  -0.0000] [FIXED]
	x37: [ -0.0000,  -0.0000] [FIXED]
	x38: [ -0.0000,  -0.0000] [FIXED]
	x39: [ -0.0000,  -0.0000] [FIXED]
	x40: [ -0.0000,  -0.0000] [FIXED]
	x41: [ -0.0000,  -0.0000] [FIXED]
	x42: [ -0.0000,  -0.0000] [FIXED]
	x43: [ -0.0000,  -0.0000] [FIXED]
	x44: [ -0.0000,  -0.0000] [FIXED]
	x45: [ -0.0000,  -0.0000] [FIXED]
	x46: [ -0.0000,  -0.0000] [FIXED]
	x47: [ -0.0000,  -0.0000] [FIXED]
	x48: [ -0.0000,  -0.0000] [FIXED]
	x49: [ -0.0000,  -0.0000] [FIXED]
	x50: [ -0.0000,  -0.0000] [FIXED]
	x51: [ -0.0000,  -0.0000] [FIXED]
	x52: [ -0.0000,   1.0000] 
	x53: [ -0.0000,  -0.0000] [FIXED]
	x54: [ -0.0000,  -0.0000] [FIXED]
	x55: [ -0.0000,  -0.0000] [FIXED]
	x56: [ -0.0000,   1.0000] 
	x57: [ -0.0000,  -0.0000] [FIXED]
	x58: [ -0.0000,  -0.0000] [FIXED]
	x59: [ -0.0000,  -0.0000] [FIXED]
	x60: [ -0.0000,  -0.0000] [FIXED]
	x61: [ -0.0000,  -0.0000] [FIXED]
	x62: [ -0.0000,  -0.0000] [FIXED]
	x63: [ -0.0000,  -0.0000] [FIXED]
	x64: [ -0.0000,  -0.0000] [FIXED]
	x65: [ -0.0000,  -0.0000] [FIXED]
	x66: [ -0.0000,  -0.0000] [FIXED]
	x67: [ -0.0000,  -0.0000] [FIXED]
	x68: [ -0.0000,  -0.0000] [FIXED]
	x69: [ -0.0000,   1.0000] 
	x70: [ -0.0000,  -0.0000] [FIXED]
	x71: [ -0.0000,  -0.0000] [FIXED]
	x72: [ -0.0000,  -0.0000] [FIXED]
	x73: [ -0.0000,  -0.0000] [FIXED]
	x74: [ -0.0000,  -0.0000] [FIXED]
	x75: [ -0.0000,  -0.0000] [FIXED]
	x76: [ -0.0000,  -0.0000] [FIXED]
	x77: [ -0.0000,  -0.0000] [FIXED]
	x78: [ -0.0000,  -0.0000] [FIXED]
	x79: [ -0.0000,  -0.0000] [FIXED]
	x80: [ -0.0000,  -0.0000] [FIXED]
	x81: [ -0.0000,  -0.0000] [FIXED]
	x82: [ -0.0000,  -0.0000] [FIXED]
	x83: [ -0.0000,  -0.0000] [FIXED]
	x84: [ -0.0000,  -0.0000] [FIXED]
	x85: [ -0.0000,  -0.0000] [FIXED]
	x86: [ -0.0000,  -0.0000] [FIXED]
	x87: [ -0.0000,  -0.0000] [FIXED]
	x88: [ -0.0000,  -0.0000] [FIXED]
	x89: [ -0.0000,  -0.0000] [FIXED]
	x90: [ -0.0000,  -0.0000] [FIXED]
	x91: [ -0.0000,  -0.0000] [FIXED]
	x92: [ -0.0000,  -0.0000] [FIXED]
	x93: [ -0.0000,  -0.0000] [FIXED]
	x94: [ -0.0000,  -0.0000] [FIXED]
	x95: [  0.2157,   0.2157] [FIXED]
	x96: [  0.7529,   0.7529] [FIXED]
	x97: [  0.3412,   0.3412] [FIXED]
	x98: [  0.0431,   0.0431] [FIXED]
	x99: [ -0.0000,  -0.0000] [FIXED]
	x100: [ -0.0000,  -0.0000] [FIXED]
	x101: [ -0.0000,  -0.0000] [FIXED]
	x102: [ -0.0000,  -0.0000] [FIXED]
	x103: [ -0.0000,  -0.0000] [FIXED]
	x104: [ -0.0000,  -0.0000] [FIXED]
	x105: [ -0.0000,  -0.0000] [FIXED]
	x106: [ -0.0000,  -0.0000] [FIXED]
	x107: [ -0.0000,  -0.0000] [FIXED]
	x108: [ -0.0000,  -0.0000] [FIXED]
	x109: [ -0.0000,  -0.0000] [FIXED]
	x110: [ -0.0000,  -0.0000] [FIXED]
	x111: [ -0.0000,  -0.0000] [FIXED]
	x112: [ -0.0000,  -0.0000] [FIXED]
	x113: [ -0.0000,  -0.0000] [FIXED]
	x114: [ -0.0000,  -0.0000] [FIXED]
	x115: [ -0.0000,  -0.0000] [FIXED]
	x116: [ -0.0000,  -0.0000] [FIXED]
	x117: [ -0.0000,  -0.0000] [FIXED]
	x118: [ -0.0000,  -0.0000] [FIXED]
	x119: [ -0.0000,  -0.0000] [FIXED]
	x120: [ -0.0000,  -0.0000] [FIXED]
	x121: [ -0.0000,  -0.0000] [FIXED]
	x122: [ -0.0000,  -0.0000] [FIXED]
	x123: [  0.6627,   0.6627] [FIXED]
	x124: [  0.9882,   0.9882] [FIXED]
	x125: [  0.9922,   0.9922] [FIXED]
	x126: [  0.6667,   0.6667] [FIXED]
	x127: [  0.1686,   0.1686] [FIXED]
	x128: [ -0.0000,  -0.0000] [FIXED]
	x129: [ -0.0000,  -0.0000] [FIXED]
	x130: [ -0.0000,  -0.0000] [FIXED]
	x131: [ -0.0000,  -0.0000] [FIXED]
	x132: [ -0.0000,  -0.0000] [FIXED]
	x133: [ -0.0000,  -0.0000] [FIXED]
	x134: [ -0.0000,  -0.0000] [FIXED]
	x135: [ -0.0000,  -0.0000] [FIXED]
	x136: [ -0.0000,  -0.0000] [FIXED]
	x137: [ -0.0000,  -0.0000] [FIXED]
	x138: [ -0.0000,  -0.0000] [FIXED]
	x139: [ -0.0000,  -0.0000] [FIXED]
	x140: [ -0.0000,  -0.0000] [FIXED]
	x141: [ -0.0000,  -0.0000] [FIXED]
	x142: [ -0.0000,  -0.0000] [FIXED]
	x143: [ -0.0000,  -0.0000] [FIXED]
	x144: [ -0.0000,  -0.0000] [FIXED]
	x145: [ -0.0000,  -0.0000] [FIXED]
	x146: [ -0.0000,  -0.0000] [FIXED]
	x147: [ -0.0000,   1.0000] 
	x148: [ -0.0000,  -0.0000] [FIXED]
	x149: [ -0.0000,  -0.0000] [FIXED]
	x150: [ -0.0000,  -0.0000] [FIXED]
	x151: [  0.4353,   0.4353] [FIXED]
	x152: [  0.9765,   0.9765] [FIXED]
	x153: [  0.9922,   0.9922] [FIXED]
	x154: [  0.9882,   0.9882] [FIXED]
	x155: [  0.9137,   0.9137] [FIXED]
	x156: [  0.3961,   0.3961] [FIXED]
	x157: [  0.0157,   0.0157] [FIXED]
	x158: [ -0.0000,  -0.0000] [FIXED]
	x159: [ -0.0000,  -0.0000] [FIXED]
	x160: [ -0.0000,  -0.0000] [FIXED]
	x161: [ -0.0000,  -0.0000] [FIXED]
	x162: [ -0.0000,  -0.0000] [FIXED]
	x163: [ -0.0000,  -0.0000] [FIXED]
	x164: [ -0.0000,   1.0000] 
	x165: [ -0.0000,  -0.0000] [FIXED]
	x166: [ -0.0000,  -0.0000] [FIXED]
	x167: [ -0.0000,  -0.0000] [FIXED]
	x168: [ -0.0000,  -0.0000] [FIXED]
	x169: [ -0.0000,  -0.0000] [FIXED]
	x170: [ -0.0000,  -0.0000] [FIXED]
	x171: [ -0.0000,  -0.0000] [FIXED]
	x172: [ -0.0000,  -0.0000] [FIXED]
	x173: [ -0.0000,  -0.0000] [FIXED]
	x174: [ -0.0000,  -0.0000] [FIXED]
	x175: [ -0.0000,  -0.0000] [FIXED]
	x176: [ -0.0000,  -0.0000] [FIXED]
	x177: [ -0.0000,  -0.0000] [FIXED]
	x178: [ -0.0000,  -0.0000] [FIXED]
	x179: [ -0.0000,  -0.0000] [FIXED]
	x180: [  0.4510,   0.4510] [FIXED]
	x181: [  0.8902,   0.8902] [FIXED]
	x182: [  0.9882,   0.9882] [FIXED]
	x183: [ -0.0000,   1.0000] 
	x184: [  0.9882,   0.9882] [FIXED]
	x185: [  0.5412,   0.5412] [FIXED]
	x186: [  0.1059,   0.1059] [FIXED]
	x187: [ -0.0000,  -0.0000] [FIXED]
	x188: [ -0.0000,  -0.0000] [FIXED]
	x189: [ -0.0000,  -0.0000] [FIXED]
	x190: [ -0.0000,  -0.0000] [FIXED]
	x191: [ -0.0000,  -0.0000] [FIXED]
	x192: [ -0.0000,  -0.0000] [FIXED]
	x193: [ -0.0000,  -0.0000] [FIXED]
	x194: [ -0.0000,  -0.0000] [FIXED]
	x195: [ -0.0000,   1.0000] 
	x196: [ -0.0000,  -0.0000] [FIXED]
	x197: [ -0.0000,  -0.0000] [FIXED]
	x198: [ -0.0000,  -0.0000] [FIXED]
	x199: [ -0.0000,  -0.0000] [FIXED]
	x200: [ -0.0000,  -0.0000] [FIXED]
	x201: [ -0.0000,  -0.0000] [FIXED]
	x202: [ -0.0000,  -0.0000] [FIXED]
	x203: [ -0.0000,  -0.0000] [FIXED]
	x204: [ -0.0000,  -0.0000] [FIXED]
	x205: [ -0.0000,  -0.0000] [FIXED]
	x206: [ -0.0000,  -0.0000] [FIXED]
	x207: [ -0.0000,  -0.0000] [FIXED]
	x208: [ -0.0000,  -0.0000] [FIXED]
	x209: [  0.3412,   0.3412] [FIXED]
	x210: [  0.4392,   0.4392] [FIXED]
	x211: [  0.5765,   0.5765] [FIXED]
	x212: [  0.9882,   0.9882] [FIXED]
	x213: [  0.9882,   0.9882] [FIXED]
	x214: [  0.5882,   0.5882] [FIXED]
	x215: [ -0.0000,  -0.0000] [FIXED]
	x216: [ -0.0000,  -0.0000] [FIXED]
	x217: [ -0.0000,  -0.0000] [FIXED]
	x218: [ -0.0000,  -0.0000] [FIXED]
	x219: [ -0.0000,  -0.0000] [FIXED]
	x220: [ -0.0000,  -0.0000] [FIXED]
	x221: [ -0.0000,  -0.0000] [FIXED]
	x222: [ -0.0000,  -0.0000] [FIXED]
	x223: [ -0.0000,  -0.0000] [FIXED]
	x224: [ -0.0000,  -0.0000] [FIXED]
	x225: [ -0.0000,  -0.0000] [FIXED]
	x226: [ -0.0000,  -0.0000] [FIXED]
	x227: [ -0.0000,  -0.0000] [FIXED]
	x228: [ -0.0000,  -0.0000] [FIXED]
	x229: [ -0.0000,  -0.0000] [FIXED]
	x230: [ -0.0000,  -0.0000] [FIXED]
	x231: [ -0.0000,  -0.0000] [FIXED]
	x232: [ -0.0000,  -0.0000] [FIXED]
	x233: [ -0.0000,  -0.0000] [FIXED]
	x234: [ -0.0000,  -0.0000] [FIXED]
	x235: [ -0.0000,  -0.0000] [FIXED]
	x236: [ -0.0000,  -0.0000] [FIXED]
	x237: [ -0.0000,  -0.0000] [FIXED]
	x238: [ -0.0000,  -0.0000] [FIXED]
	x239: [  0.0353,   0.0353] [FIXED]
	x240: [  0.5176,   0.5176] [FIXED]
	x241: [  0.9686,   0.9686] [FIXED]
	x242: [  1.0000,   1.0000] [FIXED]
	x243: [  0.4902,   0.4902] [FIXED]
	x244: [ -0.0000,  -0.0000] [FIXED]
	x245: [ -0.0000,  -0.0000] [FIXED]
	x246: [ -0.0000,  -0.0000] [FIXED]
	x247: [ -0.0000,  -0.0000] [FIXED]
	x248: [ -0.0000,  -0.0000] [FIXED]
	x249: [ -0.0000,   1.0000] 
	x250: [ -0.0000,  -0.0000] [FIXED]
	x251: [ -0.0000,  -0.0000] [FIXED]
	x252: [ -0.0000,  -0.0000] [FIXED]
	x253: [ -0.0000,  -0.0000] [FIXED]
	x254: [ -0.0000,  -0.0000] [FIXED]
	x255: [ -0.0000,  -0.0000] [FIXED]
	x256: [ -0.0000,  -0.0000] [FIXED]
	x257: [ -0.0000,  -0.0000] [FIXED]
	x258: [ -0.0000,  -0.0000] [FIXED]
	x259: [ -0.0000,  -0.0000] [FIXED]
	x260: [ -0.0000,  -0.0000] [FIXED]
	x261: [ -0.0000,  -0.0000] [FIXED]
	x262: [ -0.0000,  -0.0000] [FIXED]
	x263: [ -0.0000,  -0.0000] [FIXED]
	x264: [ -0.0000,  -0.0000] [FIXED]
	x265: [ -0.0000,  -0.0000] [FIXED]
	x266: [ -0.0000,  -0.0000] [FIXED]
	x267: [ -0.0000,  -0.0000] [FIXED]
	x268: [ -0.0000,  -0.0000] [FIXED]
	x269: [  0.6902,   0.6902] [FIXED]
	x270: [  0.9922,   0.9922] [FIXED]
	x271: [  0.7686,   0.7686] [FIXED]
	x272: [ -0.0000,   1.0000] 
	x273: [ -0.0000,  -0.0000] [FIXED]
	x274: [ -0.0000,  -0.0000] [FIXED]
	x275: [ -0.0000,  -0.0000] [FIXED]
	x276: [ -0.0000,  -0.0000] [FIXED]
	x277: [ -0.0000,  -0.0000] [FIXED]
	x278: [ -0.0000,  -0.0000] [FIXED]
	x279: [ -0.0000,  -0.0000] [FIXED]
	x280: [ -0.0000,  -0.0000] [FIXED]
	x281: [ -0.0000,  -0.0000] [FIXED]
	x282: [ -0.0000,  -0.0000] [FIXED]
	x283: [ -0.0000,  -0.0000] [FIXED]
	x284: [ -0.0000,  -0.0000] [FIXED]
	x285: [ -0.0000,  -0.0000] [FIXED]
	x286: [ -0.0000,  -0.0000] [FIXED]
	x287: [ -0.0000,  -0.0000] [FIXED]
	x288: [ -0.0000,  -0.0000] [FIXED]
	x289: [ -0.0000,   1.0000] 
	x290: [ -0.0000,  -0.0000] [FIXED]
	x291: [ -0.0000,  -0.0000] [FIXED]
	x292: [ -0.0000,  -0.0000] [FIXED]
	x293: [ -0.0000,  -0.0000] [FIXED]
	x294: [ -0.0000,  -0.0000] [FIXED]
	x295: [ -0.0000,  -0.0000] [FIXED]
	x296: [ -0.0000,  -0.0000] [FIXED]
	x297: [  0.0353,   0.0353] [FIXED]
	x298: [  0.9922,   0.9922] [FIXED]
	x299: [  0.9882,   0.9882] [FIXED]
	x300: [  0.0824,   0.0824] [FIXED]
	x301: [ -0.0000,  -0.0000] [FIXED]
	x302: [ -0.0000,  -0.0000] [FIXED]
	x303: [ -0.0000,  -0.0000] [FIXED]
	x304: [ -0.0000,  -0.0000] [FIXED]
	x305: [ -0.0000,  -0.0000] [FIXED]
	x306: [ -0.0000,  -0.0000] [FIXED]
	x307: [ -0.0000,  -0.0000] [FIXED]
	x308: [ -0.0000,  -0.0000] [FIXED]
	x309: [ -0.0000,   1.0000] 
	x310: [ -0.0000,  -0.0000] [FIXED]
	x311: [ -0.0000,  -0.0000] [FIXED]
	x312: [ -0.0000,  -0.0000] [FIXED]
	x313: [ -0.0000,  -0.0000] [FIXED]
	x314: [ -0.0000,  -0.0000] [FIXED]
	x315: [ -0.0000,  -0.0000] [FIXED]
	x316: [ -0.0000,  -0.0000] [FIXED]
	x317: [ -0.0000,   1.0000] 
	x318: [ -0.0000,  -0.0000] [FIXED]
	x319: [ -0.0000,  -0.0000] [FIXED]
	x320: [ -0.0000,  -0.0000] [FIXED]
	x321: [ -0.0000,  -0.0000] [FIXED]
	x322: [ -0.0000,  -0.0000] [FIXED]
	x323: [ -0.0000,  -0.0000] [FIXED]
	x324: [ -0.0000,  -0.0000] [FIXED]
	x325: [  0.3843,   0.3843] [FIXED]
	x326: [  0.9922,   0.9922] [FIXED]
	x327: [  0.9882,   0.9882] [FIXED]
	x328: [  0.0824,   0.0824] [FIXED]
	x329: [ -0.0000,  -0.0000] [FIXED]
	x330: [ -0.0000,  -0.0000] [FIXED]
	x331: [ -0.0000,  -0.0000] [FIXED]
	x332: [ -0.0000,  -0.0000] [FIXED]
	x333: [ -0.0000,  -0.0000] [FIXED]
	x334: [ -0.0000,  -0.0000] [FIXED]
	x335: [ -0.0000,  -0.0000] [FIXED]
	x336: [ -0.0000,  -0.0000] [FIXED]
	x337: [ -0.0000,  -0.0000] [FIXED]
	x338: [ -0.0000,  -0.0000] [FIXED]
	x339: [ -0.0000,  -0.0000] [FIXED]
	x340: [ -0.0000,  -0.0000] [FIXED]
	x341: [ -0.0000,  -0.0000] [FIXED]
	x342: [ -0.0000,  -0.0000] [FIXED]
	x343: [ -0.0000,  -0.0000] [FIXED]
	x344: [ -0.0000,  -0.0000] [FIXED]
	x345: [ -0.0000,  -0.0000] [FIXED]
	x346: [ -0.0000,  -0.0000] [FIXED]
	x347: [ -0.0000,  -0.0000] [FIXED]
	x348: [ -0.0000,  -0.0000] [FIXED]
	x349: [ -0.0000,  -0.0000] [FIXED]
	x350: [ -0.0000,  -0.0000] [FIXED]
	x351: [  0.0353,   0.0353] [FIXED]
	x352: [  0.5176,   0.5176] [FIXED]
	x353: [  0.9647,   0.9647] [FIXED]
	x354: [  0.9922,   0.9922] [FIXED]
	x355: [  0.7137,   0.7137] [FIXED]
	x356: [  0.0157,   0.0157] [FIXED]
	x357: [ -0.0000,  -0.0000] [FIXED]
	x358: [ -0.0000,  -0.0000] [FIXED]
	x359: [ -0.0000,  -0.0000] [FIXED]
	x360: [ -0.0000,  -0.0000] [FIXED]
	x361: [ -0.0000,  -0.0000] [FIXED]
	x362: [ -0.0000,  -0.0000] [FIXED]
	x363: [ -0.0000,  -0.0000] [FIXED]
	x364: [ -0.0000,  -0.0000] [FIXED]
	x365: [ -0.0000,  -0.0000] [FIXED]
	x366: [ -0.0000,  -0.0000] [FIXED]
	x367: [ -0.0000,  -0.0000] [FIXED]
	x368: [ -0.0000,  -0.0000] [FIXED]
	x369: [ -0.0000,  -0.0000] [FIXED]
	x370: [ -0.0000,  -0.0000] [FIXED]
	x371: [ -0.0000,  -0.0000] [FIXED]
	x372: [ -0.0000,  -0.0000] [FIXED]
	x373: [  0.5725,   0.5725] [FIXED]
	x374: [  0.9922,   0.9922] [FIXED]
	x375: [  0.8902,   0.8902] [FIXED]
	x376: [  0.5804,   0.5804] [FIXED]
	x377: [  0.5137,   0.5137] [FIXED]
	x378: [  0.4824,   0.4824] [FIXED]
	x379: [  0.7882,   0.7882] [FIXED]
	x380: [  0.9922,   0.9922] [FIXED]
	x381: [  0.9922,   0.9922] [FIXED]
	x382: [  0.8314,   0.8314] [FIXED]
	x383: [  0.1059,   0.1059] [FIXED]
	x384: [ -0.0000,  -0.0000] [FIXED]
	x385: [ -0.0000,  -0.0000] [FIXED]
	x386: [ -0.0000,  -0.0000] [FIXED]
	x387: [ -0.0000,  -0.0000] [FIXED]
	x388: [ -0.0000,  -0.0000] [FIXED]
	x389: [ -0.0000,  -0.0000] [FIXED]
	x390: [ -0.0000,  -0.0000] [FIXED]
	x391: [ -0.0000,  -0.0000] [FIXED]
	x392: [ -0.0000,  -0.0000] [FIXED]
	x393: [ -0.0000,  -0.0000] [FIXED]
	x394: [ -0.0000,  -0.0000] [FIXED]
	x395: [ -0.0000,  -0.0000] [FIXED]
	x396: [ -0.0000,  -0.0000] [FIXED]
	x397: [ -0.0000,  -0.0000] [FIXED]
	x398: [ -0.0000,  -0.0000] [FIXED]
	x399: [ -0.0000,  -0.0000] [FIXED]
	x400: [ -0.0000,  -0.0000] [FIXED]
	x401: [  0.6078,   0.6078] [FIXED]
	x402: [  0.9882,   0.9882] [FIXED]
	x403: [  0.9882,   0.9882] [FIXED]
	x404: [  0.9882,   0.9882] [FIXED]
	x405: [  0.9922,   0.9922] [FIXED]
	x406: [  0.9882,   0.9882] [FIXED]
	x407: [  0.9882,   0.9882] [FIXED]
	x408: [  0.9059,   0.9059] [FIXED]
	x409: [ -0.0000,   1.0000] 
	x410: [  0.1059,   0.1059] [FIXED]
	x411: [ -0.0000,  -0.0000] [FIXED]
	x412: [ -0.0000,  -0.0000] [FIXED]
	x413: [ -0.0000,  -0.0000] [FIXED]
	x414: [ -0.0000,  -0.0000] [FIXED]
	x415: [ -0.0000,  -0.0000] [FIXED]
	x416: [ -0.0000,  -0.0000] [FIXED]
	x417: [ -0.0000,  -0.0000] [FIXED]
	x418: [ -0.0000,  -0.0000] [FIXED]
	x419: [ -0.0000,  -0.0000] [FIXED]
	x420: [ -0.0000,  -0.0000] [FIXED]
	x421: [ -0.0000,  -0.0000] [FIXED]
	x422: [ -0.0000,  -0.0000] [FIXED]
	x423: [ -0.0000,  -0.0000] [FIXED]
	x424: [ -0.0000,  -0.0000] [FIXED]
	x425: [ -0.0000,  -0.0000] [FIXED]
	x426: [ -0.0000,  -0.0000] [FIXED]
	x427: [ -0.0000,  -0.0000] [FIXED]
	x428: [ -0.0000,  -0.0000] [FIXED]
	x429: [  0.0275,   0.0275] [FIXED]
	x430: [  0.2902,   0.2902] [FIXED]
	x431: [  0.4941,   0.4941] [FIXED]
	x432: [  0.8392,   0.8392] [FIXED]
	x433: [  0.9255,   0.9255] [FIXED]
	x434: [  0.9882,   0.9882] [FIXED]
	x435: [  0.9882,   0.9882] [FIXED]
	x436: [  0.5686,   0.5686] [FIXED]
	x437: [ -0.0000,  -0.0000] [FIXED]
	x438: [ -0.0000,  -0.0000] [FIXED]
	x439: [ -0.0000,   1.0000] 
	x440: [ -0.0000,  -0.0000] [FIXED]
	x441: [ -0.0000,  -0.0000] [FIXED]
	x442: [ -0.0000,  -0.0000] [FIXED]
	x443: [ -0.0000,  -0.0000] [FIXED]
	x444: [ -0.0000,  -0.0000] [FIXED]
	x445: [ -0.0000,  -0.0000] [FIXED]
	x446: [ -0.0000,  -0.0000] [FIXED]
	x447: [ -0.0000,  -0.0000] [FIXED]
	x448: [ -0.0000,  -0.0000] [FIXED]
	x449: [ -0.0000,  -0.0000] [FIXED]
	x450: [ -0.0000,  -0.0000] [FIXED]
	x451: [ -0.0000,  -0.0000] [FIXED]
	x452: [ -0.0000,  -0.0000] [FIXED]
	x453: [ -0.0000,  -0.0000] [FIXED]
	x454: [ -0.0000,  -0.0000] [FIXED]
	x455: [ -0.0000,  -0.0000] [FIXED]
	x456: [ -0.0000,  -0.0000] [FIXED]
	x457: [ -0.0000,  -0.0000] [FIXED]
	x458: [ -0.0000,  -0.0000] [FIXED]
	x459: [ -0.0000,  -0.0000] [FIXED]
	x460: [ -0.0000,  -0.0000] [FIXED]
	x461: [  0.0549,   0.0549] [FIXED]
	x462: [  0.5490,   0.5490] [FIXED]
	x463: [  0.9882,   0.9882] [FIXED]
	x464: [  0.9059,   0.9059] [FIXED]
	x465: [  0.1098,   0.1098] [FIXED]
	x466: [ -0.0000,  -0.0000] [FIXED]
	x467: [ -0.0000,  -0.0000] [FIXED]
	x468: [ -0.0000,  -0.0000] [FIXED]
	x469: [ -0.0000,  -0.0000] [FIXED]
	x470: [ -0.0000,  -0.0000] [FIXED]
	x471: [ -0.0000,  -0.0000] [FIXED]
	x472: [ -0.0000,  -0.0000] [FIXED]
	x473: [ -0.0000,  -0.0000] [FIXED]
	x474: [ -0.0000,  -0.0000] [FIXED]
	x475: [ -0.0000,  -0.0000] [FIXED]
	x476: [ -0.0000,  -0.0000] [FIXED]
	x477: [ -0.0000,  -0.0000] [FIXED]
	x478: [ -0.0000,  -0.0000] [FIXED]
	x479: [ -0.0000,  -0.0000] [FIXED]
	x480: [ -0.0000,  -0.0000] [FIXED]
	x481: [ -0.0000,  -0.0000] [FIXED]
	x482: [ -0.0000,  -0.0000] [FIXED]
	x483: [ -0.0000,  -0.0000] [FIXED]
	x484: [ -0.0000,  -0.0000] [FIXED]
	x485: [ -0.0000,  -0.0000] [FIXED]
	x486: [ -0.0000,  -0.0000] [FIXED]
	x487: [ -0.0000,  -0.0000] [FIXED]
	x488: [ -0.0000,  -0.0000] [FIXED]
	x489: [ -0.0000,  -0.0000] [FIXED]
	x490: [  0.1961,   0.1961] [FIXED]
	x491: [  0.9569,   0.9569] [FIXED]
	x492: [  0.9882,   0.9882] [FIXED]
	x493: [  0.1647,   0.1647] [FIXED]
	x494: [ -0.0000,  -0.0000] [FIXED]
	x495: [ -0.0000,  -0.0000] [FIXED]
	x496: [ -0.0000,  -0.0000] [FIXED]
	x497: [ -0.0000,  -0.0000] [FIXED]
	x498: [ -0.0000,  -0.0000] [FIXED]
	x499: [ -0.0000,  -0.0000] [FIXED]
	x500: [ -0.0000,  -0.0000] [FIXED]
	x501: [ -0.0000,  -0.0000] [FIXED]
	x502: [ -0.0000,  -0.0000] [FIXED]
	x503: [ -0.0000,  -0.0000] [FIXED]
	x504: [ -0.0000,  -0.0000] [FIXED]
	x505: [ -0.0000,  -0.0000] [FIXED]
	x506: [ -0.0000,  -0.0000] [FIXED]
	x507: [ -0.0000,  -0.0000] [FIXED]
	x508: [ -0.0000,  -0.0000] [FIXED]
	x509: [ -0.0000,   1.0000] 
	x510: [ -0.0000,  -0.0000] [FIXED]
	x511: [  0.4863,   0.4863] [FIXED]
	x512: [  0.2431,   0.2431] [FIXED]
	x513: [ -0.0000,  -0.0000] [FIXED]
	x514: [ -0.0000,  -0.0000] [FIXED]
	x515: [ -0.0000,   1.0000] 
	x516: [ -0.0000,  -0.0000] [FIXED]
	x517: [ -0.0000,  -0.0000] [FIXED]
	x518: [  0.1961,   0.1961] [FIXED]
	x519: [  0.9608,   0.9608] [FIXED]
	x520: [  0.9922,   0.9922] [FIXED]
	x521: [  0.1647,   0.1647] [FIXED]
	x522: [ -0.0000,  -0.0000] [FIXED]
	x523: [ -0.0000,  -0.0000] [FIXED]
	x524: [ -0.0000,  -0.0000] [FIXED]
	x525: [ -0.0000,  -0.0000] [FIXED]
	x526: [ -0.0000,  -0.0000] [FIXED]
	x527: [ -0.0000,  -0.0000] [FIXED]
	x528: [ -0.0000,  -0.0000] [FIXED]
	x529: [ -0.0000,  -0.0000] [FIXED]
	x530: [ -0.0000,  -0.0000] [FIXED]
	x531: [ -0.0000,  -0.0000] [FIXED]
	x532: [ -0.0000,  -0.0000] [FIXED]
	x533: [ -0.0000,  -0.0000] [FIXED]
	x534: [ -0.0000,  -0.0000] [FIXED]
	x535: [ -0.0000,  -0.0000] [FIXED]
	x536: [ -0.0000,  -0.0000] [FIXED]
	x537: [ -0.0000,  -0.0000] [FIXED]
	x538: [ -0.0000,   1.0000] 
	x539: [  0.9490,   0.9490] [FIXED]
	x540: [  0.1059,   0.1059] [FIXED]
	x541: [ -0.0000,  -0.0000] [FIXED]
	x542: [ -0.0000,  -0.0000] [FIXED]
	x543: [ -0.0000,  -0.0000] [FIXED]
	x544: [  0.1412,   0.1412] [FIXED]
	x545: [  0.5725,   0.5725] [FIXED]
	x546: [  0.8275,   0.8275] [FIXED]
	x547: [  0.9882,   0.9882] [FIXED]
	x548: [  0.9882,   0.9882] [FIXED]
	x549: [  0.1647,   0.1647] [FIXED]
	x550: [ -0.0000,  -0.0000] [FIXED]
	x551: [ -0.0000,  -0.0000] [FIXED]
	x552: [ -0.0000,  -0.0000] [FIXED]
	x553: [ -0.0000,  -0.0000] [FIXED]
	x554: [ -0.0000,  -0.0000] [FIXED]
	x555: [ -0.0000,  -0.0000] [FIXED]
	x556: [ -0.0000,  -0.0000] [FIXED]
	x557: [ -0.0000,  -0.0000] [FIXED]
	x558: [ -0.0000,  -0.0000] [FIXED]
	x559: [ -0.0000,  -0.0000] [FIXED]
	x560: [ -0.0000,  -0.0000] [FIXED]
	x561: [ -0.0000,  -0.0000] [FIXED]
	x562: [ -0.0000,  -0.0000] [FIXED]
	x563: [ -0.0000,  -0.0000] [FIXED]
	x564: [ -0.0000,  -0.0000] [FIXED]
	x565: [  0.0078,   0.0078] [FIXED]
	x566: [  0.6902,   0.6902] [FIXED]
	x567: [  0.9882,   0.9882] [FIXED]
	x568: [  0.0863,   0.0863] [FIXED]
	x569: [  0.0863,   0.0863] [FIXED]
	x570: [  0.1216,   0.1216] [FIXED]
	x571: [  0.4980,   0.4980] [FIXED]
	x572: [  0.8745,   0.8745] [FIXED]
	x573: [  0.9922,   0.9922] [FIXED]
	x574: [  0.9882,   0.9882] [FIXED]
	x575: [  0.9490,   0.9490] [FIXED]
	x576: [  0.5255,   0.5255] [FIXED]
	x577: [  0.0157,   0.0157] [FIXED]
	x578: [ -0.0000,  -0.0000] [FIXED]
	x579: [ -0.0000,  -0.0000] [FIXED]
	x580: [ -0.0000,  -0.0000] [FIXED]
	x581: [ -0.0000,  -0.0000] [FIXED]
	x582: [ -0.0000,  -0.0000] [FIXED]
	x583: [ -0.0000,  -0.0000] [FIXED]
	x584: [ -0.0000,  -0.0000] [FIXED]
	x585: [ -0.0000,  -0.0000] [FIXED]
	x586: [ -0.0000,  -0.0000] [FIXED]
	x587: [ -0.0000,  -0.0000] [FIXED]
	x588: [ -0.0000,  -0.0000] [FIXED]
	x589: [ -0.0000,  -0.0000] [FIXED]
	x590: [ -0.0000,  -0.0000] [FIXED]
	x591: [ -0.0000,  -0.0000] [FIXED]
	x592: [ -0.0000,  -0.0000] [FIXED]
	x593: [  0.0863,   0.0863] [FIXED]
	x594: [  0.9882,   0.9882] [FIXED]
	x595: [  0.9882,   0.9882] [FIXED]
	x596: [  0.9922,   0.9922] [FIXED]
	x597: [  0.9882,   0.9882] [FIXED]
	x598: [  0.9882,   0.9882] [FIXED]
	x599: [  0.9882,   0.9882] [FIXED]
	x600: [  0.9882,   0.9882] [FIXED]
	x601: [  0.7451,   0.7451] [FIXED]
	x602: [  0.4314,   0.4314] [FIXED]
	x603: [  0.1647,   0.1647] [FIXED]
	x604: [ -0.0000,  -0.0000] [FIXED]
	x605: [ -0.0000,  -0.0000] [FIXED]
	x606: [ -0.0000,  -0.0000] [FIXED]
	x607: [ -0.0000,  -0.0000] [FIXED]
	x608: [ -0.0000,  -0.0000] [FIXED]
	x609: [ -0.0000,  -0.0000] [FIXED]
	x610: [ -0.0000,  -0.0000] [FIXED]
	x611: [ -0.0000,  -0.0000] [FIXED]
	x612: [ -0.0000,  -0.0000] [FIXED]
	x613: [ -0.0000,  -0.0000] [FIXED]
	x614: [ -0.0000,  -0.0000] [FIXED]
	x615: [ -0.0000,  -0.0000] [FIXED]
	x616: [ -0.0000,  -0.0000] [FIXED]
	x617: [ -0.0000,  -0.0000] [FIXED]
	x618: [ -0.0000,  -0.0000] [FIXED]
	x619: [ -0.0000,  -0.0000] [FIXED]
	x620: [ -0.0000,  -0.0000] [FIXED]
	x621: [ -0.0000,   1.0000] 
	x622: [  0.7137,   0.7137] [FIXED]
	x623: [  0.9882,   0.9882] [FIXED]
	x624: [  0.9922,   0.9922] [FIXED]
	x625: [  0.9882,   0.9882] [FIXED]
	x626: [  0.6078,   0.6078] [FIXED]
	x627: [  0.5765,   0.5765] [FIXED]
	x628: [  0.2314,   0.2314] [FIXED]
	x629: [ -0.0000,  -0.0000] [FIXED]
	x630: [ -0.0000,  -0.0000] [FIXED]
	x631: [ -0.0000,  -0.0000] [FIXED]
	x632: [ -0.0000,  -0.0000] [FIXED]
	x633: [ -0.0000,  -0.0000] [FIXED]
	x634: [ -0.0000,  -0.0000] [FIXED]
	x635: [ -0.0000,  -0.0000] [FIXED]
	x636: [ -0.0000,  -0.0000] [FIXED]
	x637: [ -0.0000,  -0.0000] [FIXED]
	x638: [ -0.0000,  -0.0000] [FIXED]
	x639: [ -0.0000,  -0.0000] [FIXED]
	x640: [ -0.0000,  -0.0000] [FIXED]
	x641: [ -0.0000,  -0.0000] [FIXED]
	x642: [ -0.0000,  -0.0000] [FIXED]
	x643: [ -0.0000,  -0.0000] [FIXED]
	x644: [ -0.0000,  -0.0000] [FIXED]
	x645: [ -0.0000,  -0.0000] [FIXED]
	x646: [ -0.0000,  -0.0000] [FIXED]
	x647: [ -0.0000,   1.0000] 
	x648: [ -0.0000,  -0.0000] [FIXED]
	x649: [ -0.0000,  -0.0000] [FIXED]
	x650: [ -0.0000,  -0.0000] [FIXED]
	x651: [ -0.0000,  -0.0000] [FIXED]
	x652: [ -0.0000,  -0.0000] [FIXED]
	x653: [ -0.0000,  -0.0000] [FIXED]
	x654: [ -0.0000,  -0.0000] [FIXED]
	x655: [ -0.0000,  -0.0000] [FIXED]
	x656: [ -0.0000,  -0.0000] [FIXED]
	x657: [ -0.0000,  -0.0000] [FIXED]
	x658: [ -0.0000,  -0.0000] [FIXED]
	x659: [ -0.0000,  -0.0000] [FIXED]
	x660: [ -0.0000,  -0.0000] [FIXED]
	x661: [ -0.0000,  -0.0000] [FIXED]
	x662: [ -0.0000,  -0.0000] [FIXED]
	x663: [ -0.0000,  -0.0000] [FIXED]
	x664: [ -0.0000,  -0.0000] [FIXED]
	x665: [ -0.0000,  -0.0000] [FIXED]
	x666: [ -0.0000,  -0.0000] [FIXED]
	x667: [ -0.0000,  -0.0000] [FIXED]
	x668: [ -0.0000,  -0.0000] [FIXED]
	x669: [ -0.0000,  -0.0000] [FIXED]
	x670: [ -0.0000,  -0.0000] [FIXED]
	x671: [ -0.0000,  -0.0000] [FIXED]
	x672: [ -0.0000,  -0.0000] [FIXED]
	x673: [ -0.0000,  -0.0000] [FIXED]
	x674: [ -0.0000,  -0.0000] [FIXED]
	x675: [ -0.0000,  -0.0000] [FIXED]
	x676: [ -0.0000,  -0.0000] [FIXED]
	x677: [ -0.0000,  -0.0000] [FIXED]
	x678: [ -0.0000,  -0.0000] [FIXED]
	x679: [ -0.0000[runlim] sample:		10.21 time, 10.01 real, 145 MB, 1.03 load
,  -0.0000] [FIXED]
	x680: [ -0.0000,  -0.0000] [FIXED]
	x681: [ -0.0000,  -0.0000] [FIXED]
	x682: [ -0.0000,  -0.0000] [FIXED]
	x683: [ -0.0000,  -0.0000] [FIXED]
	x684: [ -0.0000,  -0.0000] [FIXED]
	x685: [ -0.0000,  -0.0000] [FIXED]
	x686: [ -0.0000,  -0.0000] [FIXED]
	x687: [ -0.0000,  -0.0000] [FIXED]
	x688: [ -0.0000,  -0.0000] [FIXED]
	x689: [ -0.0000,  -0.0000] [FIXED]
	x690: [ -0.0000,  -0.0000] [FIXED]
	x691: [ -0.0000,  -0.0000] [FIXED]
	x692: [ -0.0000,  -0.0000] [FIXED]
	x693: [ -0.0000,  -0.0000] [FIXED]
	x694: [ -0.0000,  -0.0000] [FIXED]
	x695: [ -0.0000,  -0.0000] [FIXED]
	x696: [ -0.0000,  -0.0000] [FIXED]
	x697: [ -0.0000,  -0.0000] [FIXED]
	x698: [ -0.0000,  -0.0000] [FIXED]
	x699: [ -0.0000,  -0.0000] [FIXED]
	x700: [ -0.0000,  -0.0000] [FIXED]
	x701: [ -0.0000,  -0.0000] [FIXED]
	x702: [ -0.0000,  -0.0000] [FIXED]
	x703: [ -0.0000,  -0.0000] [FIXED]
	x704: [ -0.0000,  -0.0000] [FIXED]
	x705: [ -0.0000,  -0.0000] [FIXED]
	x706: [ -0.0000,  -0.0000] [FIXED]
	x707: [ -0.0000,  -0.0000] [FIXED]
	x708: [ -0.0000,  -0.0000] [FIXED]
	x709: [ -0.0000,  -0.0000] [FIXED]
	x710: [ -0.0000,  -0.0000] [FIXED]
	x711: [ -0.0000,  -0.0000] [FIXED]
	x712: [ -0.0000,  -0.0000] [FIXED]
	x713: [ -0.0000,  -0.0000] [FIXED]
	x714: [ -0.0000,  -0.0000] [FIXED]
	x715: [ -0.0000,  -0.0000] [FIXED]
	x716: [ -0.0000,  -0.0000] [FIXED]
	x717: [ -0.0000,  -0.0000] [FIXED]
	x718: [ -0.0000,  -0.0000] [FIXED]
	x719: [ -0.0000,  -0.0000] [FIXED]
	x720: [ -0.0000,  -0.0000] [FIXED]
	x721: [ -0.0000,  -0.0000] [FIXED]
	x722: [ -0.0000,  -0.0000] [FIXED]
	x723: [ -0.0000,  -0.0000] [FIXED]
	x724: [ -0.0000,  -0.0000] [FIXED]
	x725: [ -0.0000,  -0.0000] [FIXED]
	x726: [ -0.0000,  -0.0000] [FIXED]
	x727: [ -0.0000,  -0.0000] [FIXED]
	x728: [ -0.0000,  -0.0000] [FIXED]
	x729: [ -0.0000,  -0.0000] [FIXED]
	x730: [ -0.0000,  -0.0000] [FIXED]
	x731: [ -0.0000,  -0.0000] [FIXED]
	x732: [ -0.0000,  -0.0000] [FIXED]
	x733: [ -0.0000,  -0.0000] [FIXED]
	x734: [ -0.0000,  -0.0000] [FIXED]
	x735: [ -0.0000,  -0.0000] [FIXED]
	x736: [ -0.0000,  -0.0000] [FIXED]
	x737: [ -0.0000,  -0.0000] [FIXED]
	x738: [ -0.0000,   1.0000] 
	x739: [ -0.0000,  -0.0000] [FIXED]
	x740: [ -0.0000,  -0.0000] [FIXED]
	x741: [ -0.0000,  -0.0000] [FIXED]
	x742: [ -0.0000,  -0.0000] [FIXED]
	x743: [ -0.0000,  -0.0000] [FIXED]
	x744: [ -0.0000,  -0.0000] [FIXED]
	x745: [ -0.0000,  -0.0000] [FIXED]
	x746: [ -0.0000,  -0.0000] [FIXED]
	x747: [ -0.0000,  -0.0000] [FIXED]
	x748: [ -0.0000,  -0.0000] [FIXED]
	x749: [ -0.0000,  -0.0000] [FIXED]
	x750: [ -0.0000,  -0.0000] [FIXED]
	x751: [ -0.0000,  -0.0000] [FIXED]
	x752: [ -0.0000,  -0.0000] [FIXED]
	x753: [ -0.0000,  -0.0000] [FIXED]
	x754: [ -0.0000,   1.0000] 
	x755: [ -0.0000,  -0.0000] [FIXED]
	x756: [ -0.0000,  -0.0000] [FIXED]
	x757: [ -0.0000,  -0.0000] [FIXED]
	x758: [ -0.0000,  -0.0000] [FIXED]
	x759: [ -0.0000,  -0.0000] [FIXED]
	x760: [ -0.0000,  -0.0000] [FIXED]
	x761: [ -0.0000,  -0.0000] [FIXED]
	x762: [ -0.0000,  -0.0000] [FIXED]
	x763: [ -0.0000,  -0.0000] [FIXED]
	x764: [ -0.0000,  -0.0000] [FIXED]
	x765: [ -0.0000,  -0.0000] [FIXED]
	x766: [ -0.0000,  -0.0000] [FIXED]
	x767: [ -0.0000,  -0.0000] [FIXED]
	x768: [ -0.0000,  -0.0000] [FIXED]
	x769: [ -0.0000,  -0.0000] [FIXED]
	x770: [ -0.0000,  -0.0000] [FIXED]
	x771: [ -0.0000,  -0.0000] [FIXED]
	x772: [ -0.0000,  -0.0000] [FIXED]
	x773: [ -0.0000,  -0.0000] [FIXED]
	x774: [ -0.0000,  -0.0000] [FIXED]
	x775: [ -0.0000,  -0.0000] [FIXED]
	x776: [ -0.0000,  -0.0000] [FIXED]
	x777: [ -0.0000,  -0.0000] [FIXED]
	x778: [ -0.0000,  -0.0000] [FIXED]
	x779: [ -0.0000,  -0.0000] [FIXED]
	x780: [ -0.0000,  -0.0000] [FIXED]
	x781: [ -0.0000,  -0.0000] [FIXED]
	x782: [ -0.0000,  -0.0000] [FIXED]
	x783: [ -0.0000,  -0.0000] [FIXED]

Branching heuristics set to PseudoImpact

Engine::solve: Initial statistics

00:45:33 Statistics update:
	--- Time Statistics ---
	Total time elapsed: 7080 milli (00:00:07)
		Main loop: 0 milli (00:00:00)
		Preprocessing time: 287 milli (00:00:00)
		Unknown: 6793 milli (00:00:06)
	Breakdown for main loop:
		[0.00%] Simplex steps: 0 milli
		[0.00%] Explicit-basis bound tightening: 0 milli
		[0.00%] Constraint-matrix bound tightening: 0 milli
		[0.00%] Degradation checking: 0 milli
		[0.00%] Precision restoration: 0 milli
		[0.00%] Statistics handling: 0 milli
		[0.00%] Constraint-fixing steps: 0 milli
		[0.00%] Valid case splits: 0 milli. Average per split: 0.00 milli
		[0.00%] Applying stored bound-tightening: 0 milli
		[0.00%] SMT core: 0 milli
		[0.00%] Symbolic Bound Tightening: 25 milli
		[0.00%] SoI-based local search: 0 milli
		[0.00%] SoI-based local search: 0 milli
		[0.00%] Unaccounted for: 0 milli
	--- Preprocessor Statistics ---
	Number of preprocessor bound-tightening loop iterations: 5
	Number of eliminated variables: 912
	Number of constraints removed due to variable elimination: 109
	Number of equations removed due to variable elimination: 0
	--- Engine Statistics ---
	Number of main loop iterations: 1
		0 iterations were simplex steps. Total time: 0 milli. Average: 0.00 milli.
		0 iterations were constraint-fixing steps. Total time: 0 milli. Average: 0.00 milli
	Number of active piecewise-linear constraints: 231 / 312
		Constraints disabled by valid splits: 81. By SMT-originated splits: 0
	Last reported degradation: 0.0000000000. Max degradation so far: 0.0000000000. Restorations so far: 0
	Number of simplex pivots we attempted to skip because of instability: 0.
	Unstable pivots performed anyway: 0
	--- Tableau Statistics ---
	Total number of pivots performed: 0
		Real pivots: 0. Degenerate: 0 (0.00%)
		Degenerate pivots by request (e.g., to fix a PL constraint): 0 (0.00%)
		Average time per pivot: 0.00 milli
	Total number of fake pivots performed: 0
	Total number of rows added: 0. Number of merged columns: 0
	Current tableau dimensions: M = 830, N = 2755
	--- SMT Core Statistics ---
	Total depth is 0. Total visited states: 1. Number of splits: 0. Number of pops: 0
	Max stack depth: 0
	--- Bound Tightening Statistics ---
	Number of tightened bounds: 0.
		Number of rows examined by row tightener: 0. Consequent tightenings: 0
		Number of explicit basis matrices examined by row tightener: 0. Consequent tightenings: 0
		Number of bound tightening rounds on the entire constraint matrix: 0. Consequent tightenings: 0
		Number of bound notifications sent to PL constraints: 1886. Tightenings proposed: 0
	--- Basis Factorization statistics ---
	Number of basis refactorizations: 2
	--- Projected Steepest Edge Statistics ---
	Number of iterations: 0.
	Number of resets to reference space: 1. Avg. iterations per reset: 0
	--- SBT ---
	Number of tightened bounds: 712
	--- SoI-based local search ---
	Number of proposed phase pattern update: 0. Number of accepted update: 0 [0.00%]
	Total time (% of local search time) updating SoI phase pattern : 0 milli [0.00%]
	Total time obtaining current assignment: 0 milli [0.00%]
	Total time getting SoI phase pattern : 0 milli [0.00%]
	--- Context dependent statistics ---
	Number of pushes / pops: 0 / 0
		[0.00%] Pre-Push hook: 0 milli
		[0.00%] Push : 0 milli
		[0.00%] Post-Pop hook: 0 milli
		[0.00%] Pop : 0 milli
		[0.00%] Total context-switching time: 0 milli
	--- Proof Certificate ---
	Number of certified leaves: 0
	Number of leaves to delegate: 0

---

00:45:42 Statistics update:
	--- Time Statistics ---
	Total time elapsed: 15314 milli (00:00:15)
		Main loop: 8069 milli (00:00:08)
		Preprocessing time: 287 milli (00:00:00)
		Unknown: 6957 milli (00:00:06)
	Breakdown for main loop:
		[63.56%] Simplex steps: 5128 milli
		[15.44%] Explicit-basis bound tightening: 1245 milli
		[0.00%] Constraint-matrix bound tightening: 0 milli
		[0.63%] Degradation checking: 51 milli
		[0.00%] Precision restoration: 0 milli
		[0.27%] Statistics handling: 22 milli
		[0.00%] Constraint-fixing steps: 0 milli
		[0.03%] Valid case splits: 2 milli. Average per split: 0.00 milli
		[0.04%] Applying stored bound-tightening: 3 milli
		[1.86%] SMT core: 150 milli
		[14.06%] Symbolic Bound Tightening: 1134 milli
		[55.21%] SoI-based local search: 4455 milli
		[0.00%] SoI-based local search: 0 milli
		[4.10%] Unaccounted for: 331 milli
	--- Prepro[runlim] sample:		20.21 time, 20.01 real, 153 MB, 1.02 load
[runlim] sample:		30.21 time, 30.01 real, 155 MB, 1.02 load
cessor Statistics ---
	Number of preprocessor bound-tightening loop iterations: 5
	Number of eliminated variables: 912
	Number of constraints removed due to variable elimination: 109
	Number of equations removed due to variable elimination: 0
	--- Engine Statistics ---
	Number of main loop iterations: 10000
		9877 iterations were simplex steps. Total time: 5128 milli. Average: 0.52 milli.
		0 iterations were constraint-fixing steps. Total time: 0 milli. Average: 0.00 milli
	Number of active piecewise-linear constraints: 211 / 312
		Constraints disabled by valid splits: 85. By SMT-originated splits: 16
	Last reported degradation: 0.0000000560. Max degradation so far: 0.0100353263. Restorations so far: 0
	Number of simplex pivots we attempted to skip because of instability: 86.
	Unstable pivots performed anyway: 7
	--- Tableau Statistics ---
	Total number of pivots performed: 8507
		Real pivots: 8496. Degenerate: 11 (0.13%)
		Degenerate pivots by request (e.g., to fix a PL constraint): 0 (0.00%)
		Average time per pivot: 0.17 milli
	Total number of fake pivots performed: 152
	Total number of rows added: 0. Number of merged columns: 0
	Current tableau dimensions: M = 830, N = 2755
	--- SMT Core Statistics ---
	Total depth is 16. Total visited states: 76. Number of splits: 44. Number of pops: 31
	Max stack depth: 25
	--- Bound Tightening Statistics ---
	Number of tightened bounds: 6063.
		Number of rows examined by row tightener: 8507. Consequent tightenings: 35
		Number of explicit basis matrices examined by row tightener: 18. Consequent tightenings: 164
		Number of bound tightening rounds on the entire constraint matrix: 0. Consequent tightenings: 0
		Number of bound notifications sent to PL constraints: 12900. Tightenings proposed: 0
	--- Basis Factorization statistics ---
	Number of basis refactorizations: 82
	--- Projected Steepest Edge Statistics ---
	Number of iterations: 8738.
	Number of resets to reference space: 44. Avg. iterations per reset: 198
	--- SBT ---
	Number of tightened bounds: 6775
	--- SoI-based local search ---
	Number of proposed phase pattern update: 562. Number of accepted update: 526 [93.59%]
	Total time (% of local search time) updating SoI phase pattern : 29617 milli [0.66%]
	Total time obtaining current assignment: 194469 milli [4.36%]
	Total time getting SoI phase pattern : 55882 milli [0.69%]
	--- Context dependent statistics ---
	Number of pushes / pops: 76 / 60
		[0.10%] Pre-Push hook: 8 milli
		[0.00%] Push : 0 milli
		[0.07%] Post-Pop hook: 5 milli
		[0.08%] Pop : 6 milli
		[0.26%] Total context-switching time: 20 milli
	--- Proof Certificate ---
	Number of certified leaves: 0
	Number of leaves to delegate: 0

00:45:52 Statistics update:
	--- Time Statistics ---
	Total time elapsed: 25626 milli (00:00:25)
		Main loop: 18543 milli (00:00:18)
		Preprocessing time: 287 milli (00:00:00)
		Unknown: 6795 milli (00:00:06)
	Breakdown for main loop:
		[56.10%] Simplex steps: 10402 milli
		[18.99%] Explicit-basis bound tightening: 3521 milli
		[0.00%] Constraint-matrix bound tightening: 0 milli
		[0.57%] Degradation checking: 105 milli
		[0.00%] Precision restoration: 0 milli
		[0.25%] Statistics handling: 45 milli
		[0.00%] Constraint-fixing steps: 0 milli
		[0.03%] Valid case splits: 5 milli. Average per split: 0.00 milli
		[0.04%] Applying stored bound-tightening: 8 milli
		[2.22%] SMT core: 411 milli
		[15.90%] Symbolic Bound Tightening: 2947 milli
		[46.08%] SoI-based local search: 8544 milli
		[0.00%] SoI-based local search: 0 milli
		[5.90%] Unaccounted for: 1094 milli
	--- Preprocessor Statistics ---
	Number of preprocessor bound-tightening loop iterations: 5
	Number of eliminated variables: 912
	Number of constraints removed due to variable elimination: 109
	Number of equations removed due to variable elimination: 0
	--- Engine Statistics ---
	Number of main loop iterations: 20000
		19699 iterations were simplex steps. Total time: 10402 milli. Average: 0.53 milli.
		0 iterations were constraint-fixing steps. Total time: 0 milli. Average: 0.00 milli
	Number of active piecewise-linear constraints: 203 / 312
		Constraints disabled by valid splits: 85. By SMT-originated splits: 24
	Last reported degradation: 0.0000000000. Max degradation so far: 0.0100353263. Restorations so far: 0
	Number of simplex pivots we attempted to skip because of instability: 87.
	Unstable pivots performed anyway: 7
	--- Tableau Statistics ---
	Total number of pivots performed: 16664
		Real pivots: 16642. Degenerate: 22 (0.13%)
		Degenerate pivots by request (e.g., to fix a PL constraint): 0 (0.00%)
		Average time per pivot: 0.17 milli
	Total number of fake pivots performed: 395
	Total number of rows added: 0. Number of merged columns: 0
	Current tableau dimensions: M = 830, N = 2755
	--- SMT Core Statistics ---
	Total depth is 24. Total visited states: 194. Number of splits: 106. Number of pops: 87
	Max stack depth: 31
	--- Bound Tightening Statistics ---
	Number of tightened bounds: 19138.
		Number of rows examined by row tightener: 16664. Consequent tightenings: 285
		Number of explicit basis matrices examined by row tightener: 51. Consequent tightenings: 496
		Number of bound tightening rounds on the entire constraint matrix: 0. Consequent tightenings: 0
		Number of bound notifications sent to PL constraints: 33017. Tightenings proposed: 0
	--- Basis Factorization statistics ---
	Number of basis refactorizations: 153
	--- Projected Steepest Edge Statistics ---
	Number of iterations: 17139.
	Number of resets to reference space: 103. Avg. iterations per reset: 166
	--- SBT ---
	Number of tightened bounds: 19850
	--- SoI-based local search ---
	Number of proposed phase pattern update: 1219. Number of accepted update: 1121 [91.96%]
	Total time (% of local search time) updating SoI phase pattern : 69712 milli [0.82%]
	Total time obtaining current assignment: 455118 milli [5.33%]
	Total time getting SoI phase pattern : 118731 milli [0.64%]
	--- Context dependent statistics ---
	Number of pushes / pops: 194 / 170
		[0.11%] Pre-Push hook: 19 milli
		[0.00%] Push : 0 milli
		[0.10%] Post-Pop hook: 18 milli
		[0.11%] Pop : 19 milli
		[0.31%] Total context-switching time: 57 milli
	--- Proof Certificate ---
	Number of certified leaves: 0
	Number of leaves to delegate: 0

00:46:03 Statistics update:
	--- Time Statistics ---
	Total time elapsed: 36800 milli (00:00:36)
		Main loop: 29710 milli (00:00:29)
		Preprocessing time: 287 milli (00:00:00)
		Unknown: 6802 milli (00:00:06)
	Breakdown for main loop:
		[52.50%] Simplex steps: 15597 milli
		[22.36%] Explicit-basis bound tightening: 6643 milli
		[0.00%] Constraint-matrix bound tightening: 0 milli
		[0.54%] Degradation checking: 159 milli
		[0.00%] Precision restoration: 0 milli
		[0.23%] Statistics handling: 68 milli
		[0.00%] Constraint-fixing steps: 0 milli
		[0.03%] Valid case splits: 9 milli. Average per split: 0.00 milli
		[0.04%] Applying stored bound-tightening: 12 milli
		[2.34%] SMT core: 695 milli
		[16.26%] Symbolic Bound Tightening: 4831 milli
		[40.00%] SoI-based local search: 11884 milli
		[0.00%] SoI-based local search: 0 milli
		[5.69%] Unaccounted for: 1690 milli
	--- Preprocessor Statistics ---
	Number of preprocessor bound-tightening loop iterations: 5
	Number of eliminated variables: 912
	Number of constraints removed due to variable elimination: 109
	Number of equations removed due to variable elimination: 0
	--- Engine Statistics ---
	Number of main loop iterations: 30000
		29523 iterations were simplex steps. Total time: 15597 milli. Average: 0.53 milli.
		0 iterations were constraint-fixing steps. Total time: 0 milli. Average: 0.00 milli
	Number of active piecewise-linear constraints: 202 / 312
		Constraints disabled by valid splits: 86. By SMT-originated splits: 24
	Last reported degradation: 0.0000000000. Max degradation so far: 0.0100353263. Restorations so far: 0
	Number of simplex pivots we attempted to skip because of instability: 90.
	Unstable pivots performed anyway: 7
	--- Tableau Statistics ---
	Total number of pivots performed: 24823
		Real pivots: 24792. Degenerate: 31 (0.12%)
		Degenerate pivots by request (e.g., to fix a PL constraint): 0 (0.00%)
		Averag[runlim] sample:		40.21 time, 40.01 real, 159 MB, 1.02 load
[runlim] sample:		50.21 time, 50.01 real, 159 MB, 1.01 load
e time per pivot: 0.17 milli
	Total number of fake pivots performed: 695
	Total number of rows added: 0. Number of merged columns: 0
	Current tableau dimensions: M = 830, N = 2755
	--- SMT Core Statistics ---
	Total depth is 24. Total visited states: 316. Number of splits: 168. Number of pops: 147
	Max stack depth: 31
	--- Bound Tightening Statistics ---
	Number of tightened bounds: 31239.
		Number of rows examined by row tightener: 24823. Consequent tightenings: 588
		Number of explicit basis matrices examined by row tightener: 95. Consequent tightenings: 1722
		Number of bound tightening rounds on the entire constraint matrix: 0. Consequent tightenings: 0
		Number of bound notifications sent to PL constraints: 53040. Tightenings proposed: 0
	--- Basis Factorization statistics ---
	Number of basis refactorizations: 224
	--- Projected Steepest Edge Statistics ---
	Number of iterations: 25601.
	Number of resets to reference space: 164. Avg. iterations per reset: 156
	--- SBT ---
	Number of tightened bounds: 31951
	--- SoI-based local search ---
	Number of proposed phase pattern update: 1848. Number of accepted update: 1688 [91.34%]
	Total time (% of local search time) updating SoI phase pattern : 110264 milli [0.93%]
	Total time obtaining current assignment: 708555 milli [5.96%]
	Total time getting SoI phase pattern : 180698 milli [0.61%]
	--- Context dependent statistics ---
	Number of pushes / pops: 316 / 292
		[0.11%] Pre-Push hook: 31 milli
		[0.00%] Push : 0 milli
		[0.10%] Post-Pop hook: 30 milli
		[0.12%] Pop : 34 milli
		[0.33%] Total context-switching time: 96 milli
	--- Proof Certificate ---
	Number of certified leaves: 0
	Number of leaves to delegate: 0

00:46:13 Statistics update:
	--- Time Statistics ---
	Total time elapsed: 47058 milli (00:00:47)
		Main loop: 39924 milli (00:00:39)
		Preprocessing time: 287 milli (00:00:00)
		Unknown: 6846 milli (00:00:06)
	Breakdown for main loop:
		[52.71%] Simplex steps: 21044 milli
		[21.76%] Explicit-basis bound tightening: 8687 milli
		[0.00%] Constraint-matrix bound tightening: 0 milli
		[0.54%] Degradation checking: 214 milli
		[0.00%] Precision restoration: 0 milli
		[0.23%] Statistics handling: 92 milli
		[0.00%] Constraint-fixing steps: 0 milli
		[0.03%] Valid case splits: 12 milli. Average per split: 0.00 milli
		[0.04%] Applying stored bound-tightening: 16 milli
		[2.48%] SMT core: 989 milli
		[16.59%] Symbolic Bound Tightening: 6621 milli
		[39.69%] SoI-based local search: 15846 milli
		[0.00%] SoI-based local search: 0 milli
		[5.62%] Unaccounted for: 2244 milli
	--- Preprocessor Statistics ---
	Number of preprocessor bound-tightening loop iterations: 5
	Number of eliminated variables: 912
	Number of constraints removed due to variable elimination: 109
	Number of equations removed due to variable elimination: 0
	--- Engine Statistics ---
	Number of main loop iterations: 40000
		39358 iterations were simplex steps. Total time: 21044 milli. Average: 0.53 milli.
		0 iterations were constraint-fixing steps. Total time: 0 milli. Average: 0.00 milli
	Number of active piecewise-linear constraints: 200 / 312
		Constraints disabled by valid splits: 88. By SMT-originated splits: 24
	Last reported degradation: 0.0000000000. Max degradation so far: 0.0100353263. Restorations so far: 0
	Number of simplex pivots we attempted to skip because of instability: 97.
	Unstable pivots performed anyway: 8
	--- Tableau Statistics ---
	Total number of pivots performed: 33008
		Real pivots: 32962. Degenerate: 46 (0.14%)
		Degenerate pivots by request (e.g., to fix a PL constraint): 0 (0.00%)
		Average time per pivot: 0.17 milli
	Total number of fake pivots performed: 969
	Total number of rows added: 0. Number of merged columns: 0
	Current tableau dimensions: M = 830, N = 2755
	--- SMT Core Statistics ---
	Total depth is 24. Total visited states: 443. Number of splits: 231. Number of pops: 211
	Max stack depth: 39
	--- Bound Tightening Statistics ---
	Number of tightened bounds: 40942.
		Number of rows examined by row tightener: 33008. Consequent tightenings: 912
		Number of explicit basis matrices examined by row tightener: 124. Consequent tightenings: 1964
		Number of bound tightening rounds on the entire constraint matrix: 0. Consequent tightenings: 0
		Number of bound notifications sent to PL constraints: 73592. Tightenings proposed: 0
	--- Basis Factorization statistics ---
	Number of basis refactorizations: 295
	--- Projected Steepest Edge Statistics ---
	Number of iterations: 34066.
	Number of resets to reference space: 228. Avg. iterations per reset: 149
	--- SBT ---
	Number of tightened bounds: 41654
	--- SoI-based local search ---
	Number of proposed phase pattern update: 2469. Number of accepted update: 2246 [90.97%]
	Total time (% of local search time) updating SoI phase pattern : 150120 milli [0.95%]
	Total time obtaining current assignment: 963270 milli [6.08%]
	Total time getting SoI phase pattern : 237811 milli [0.60%]
	--- Context dependent statistics ---
	Number of pushes / pops: 443 / 419
		[0.11%] Pre-Push hook: 43 milli
		[0.00%] Push : 0 milli
		[0.10%] Post-Pop hook: 41 milli
		[0.12%] Pop : 46 milli
		[0.33%] Total context-switching time: 132 milli
	--- Proof Certificate ---
	Number of certified leaves: 0
	Number of leaves to delegate: 0

00:46:24 Statistics update:
	--- Time Statistics ---
	Total time elapsed: 57841 milli (00:00:57)
		Main loop: 50729 milli (00:00:50)
		Preprocessing time: 287 milli (00:00:00)
		Unknown: 6823 milli (00:00:06)
	Breakdown for main loop:
		[52.67%] Simplex steps: 26721 milli
		[22.50%] Explicit-basis bound tightening: 11412 milli
		[0.00%] Constraint-matrix bound tightening: 0 milli
		[0.53%] Degradation checking: 269 milli
		[0.00%] Precision restoration: 0 milli
		[0.23%] Statistics handling: 117 milli
		[0.00%] Constraint-fixing steps: 0 milli
		[0.03%] Valid case splits: 15 milli. Average per split: 0.00 milli
		[0.04%] Applying stored bound-tightening: 21 milli
		[2.40%] SMT core: 1217 milli
		[15.96%] Symbolic Bound Tightening: 8096 milli
		[38.18%] SoI-based local search: 19369 milli
		[0.00%] SoI-based local search: 0 milli
		[5.63%] Unaccounted for: 2857 milli
	--- Preprocessor Statistics ---
	Number of preprocessor bound-tightening loop iterations: 5
	Number of eliminated variables: 912
	Number of constraints removed due to variable elimination: 109
	Number of equations removed due to variable elimination: 0
	--- Engine Statistics ---
	Number of main loop iterations: 50000
		49196 iterations were simplex steps. Total time: 26721 milli. Average: 0.54 milli.
		0 iterations were constraint-fixing steps. Total time: 0 milli. Average: 0.00 milli
	Number of active piecewise-linear constraints: 188 / 312
		Constraints disabled by valid splits: 86. By SMT-originated splits: 38
	Last reported degradation: 0.0000000000. Max degradation so far: 0.0100353263. Restorations so far: 0
	Number of simplex pivots we attempted to skip because of instability: 97.
	Unstable pivots performed anyway: 8
	--- Tableau Statistics ---
	Total number of pivots performed: 41354
		Real pivots: 41296. Degenerate: 58 (0.14%)
		Degenerate pivots by request (e.g., to fix a PL constraint): 0 (0.00%)
		Average time per pivot: 0.17 milli
	Total number of fake pivots performed: 1267
	Total number of rows added: 0. Number of merged columns: 0
	Current tableau dimensions: M = 830, N = 2755
	--- SMT Core Statistics ---
	Total depth is 38. Total visited states: 554. Number of splits: 293. Number of pops: 260
	Max stack depth: 39
	--- Bound Tightening Statistics ---
	Number of tightened bounds: 50874.
		Number of rows examined by row tightener: 41354. Consequent tightenings: 1156
		Number of explicit basis matrices examined by row tightener: 163. Consequent tightenings: 3230
		Number of bound tightening rounds on the entire constraint matrix: 0. Consequent tightenings: 0
		Number of bound notifications sent to PL constraints: 92897. Tightenings proposed: 0
	--- Basis Factorization statistics ---
	Number of basis refactorizations: 368
	--- Projected Steepest Edge Statistics ---
	Number of iterations: 42710.
	Number of resets to reference space: 279. Avg. iterations per reset: 153
	-[runlim] sample:		60.21 time, 60.01 real, 159 MB, 1.01 load
[runlim] sample:		70.20 time, 70.01 real, 164 MB, 1.01 load
[runlim] sample:		80.20 time, 80.01 real, 165 MB, 1.01 load
[runlim] sample:		90.20 time, 90.01 real, 165 MB, 1.01 load
-- SBT ---
	Number of tightened bounds: 51586
	--- SoI-based local search ---
	Number of proposed phase pattern update: 3007. Number of accepted update: 2721 [90.49%]
	Total time (% of local search time) updating SoI phase pattern : 189919 milli [0.98%]
	Total time obtaining current assignment: 1190762 milli [6.15%]
	Total time getting SoI phase pattern : 287841 milli [0.57%]
	--- Context dependent statistics ---
	Number of pushes / pops: 554 / 516
		[0.11%] Pre-Push hook: 54 milli
		[0.00%] Push : 0 milli
		[0.10%] Post-Pop hook: 50 milli
		[0.11%] Pop : 56 milli
		[0.32%] Total context-switching time: 161 milli
	--- Proof Certificate ---
	Number of certified leaves: 0
	Number of leaves to delegate: 0

00:46:37 Statistics update:
	--- Time Statistics ---
	Total time elapsed: 70218 milli (00:01:10)
		Main loop: 63037 milli (00:01:03)
		Preprocessing time: 287 milli (00:00:00)
		Unknown: 6893 milli (00:00:06)
	Breakdown for main loop:
		[52.30%] Simplex steps: 32971 milli
		[23.74%] Explicit-basis bound tightening: 14964 milli
		[0.00%] Constraint-matrix bound tightening: 0 milli
		[0.52%] Degradation checking: 325 milli
		[0.00%] Precision restoration: 0 milli
		[0.23%] Statistics handling: 144 milli
		[0.00%] Constraint-fixing steps: 0 milli
		[0.03%] Valid case splits: 18 milli. Average per split: 0.00 milli
		[0.04%] Applying stored bound-tightening: 25 milli
		[2.37%] SMT core: 1492 milli
		[15.40%] Symbolic Bound Tightening: 9710 milli
		[36.31%] SoI-based local search: 22885 milli
		[0.00%] SoI-based local search: 0 milli
		[5.37%] Unaccounted for: 3383 milli
	--- Preprocessor Statistics ---
	Number of preprocessor bound-tightening loop iterations: 5
	Number of eliminated variables: 912
	Number of constraints removed due to variable elimination: 109
	Number of equations removed due to variable elimination: 0
	--- Engine Statistics ---
	Number of main loop iterations: 60000
		59040 iterations were simplex steps. Total time: 32971 milli. Average: 0.56 milli.
		0 iterations were constraint-fixing steps. Total time: 0 milli. Average: 0.00 milli
	Number of active piecewise-linear constraints: 193 / 312
		Constraints disabled by valid splits: 86. By SMT-originated splits: 33
	Last reported degradation: 0.0000000010. Max degradation so far: 0.0100353263. Restorations so far: 0
	Number of simplex pivots we attempted to skip because of instability: 99.
	Unstable pivots performed anyway: 8
	--- Tableau Statistics ---
	Total number of pivots performed: 49776
		Real pivots: 49707. Degenerate: 69 (0.14%)
		Degenerate pivots by request (e.g., to fix a PL constraint): 0 (0.00%)
		Average time per pivot: 0.18 milli
	Total number of fake pivots performed: 1685
	Total number of rows added: 0. Number of merged columns: 0
	Current tableau dimensions: M = 830, N = 2755
	--- SMT Core Statistics ---
	Total depth is 33. Total visited states: 666. Number of splits: 346. Number of pops: 319
	Max stack depth: 49
	--- Bound Tightening Statistics ---
	Number of tightened bounds: 62378.
		Number of rows examined by row tightener: 49776. Consequent tightenings: 1875
		Number of explicit basis matrices examined by row tightener: 213. Consequent tightenings: 3927
		Number of bound tightening rounds on the entire constraint matrix: 0. Consequent tightenings: 0
		Number of bound notifications sent to PL constraints: 114470. Tightenings proposed: 0
	--- Basis Factorization statistics ---
	Number of basis refactorizations: 444
	--- Projected Steepest Edge Statistics ---
	Number of iterations: 51552.
	Number of resets to reference space: 340. Avg. iterations per reset: 151
	--- SBT ---
	Number of tightened bounds: 63090
	--- SoI-based local search ---
	Number of proposed phase pattern update: 3447. Number of accepted update: 3109 [90.19%]
	Total time (% of local search time) updating SoI phase pattern : 225195 milli [0.98%]
	Total time obtaining current assignment: 1382224 milli [6.04%]
	Total time getting SoI phase pattern : 326637 milli [0.52%]
	--- Context dependent statistics ---
	Number of pushes / pops: 666 / 633
		[0.10%] Pre-Push hook: 66 milli
		[0.00%] Push : 0 milli
		[0.10%] Post-Pop hook: 61 milli
		[0.11%] Pop : 68 milli
		[0.31%] Total context-switching time: 196 milli
	--- Proof Certificate ---
	Number of certified leaves: 0
	Number of leaves to delegate: 0

00:46:48 Statistics update:
	--- Time Statistics ---
	Total time elapsed: 81769 milli (00:01:21)
		Main loop: 74676 milli (00:01:14)
		Preprocessing time: 287 milli (00:00:00)
		Unknown: 6804 milli (00:00:06)
	Breakdown for main loop:
		[52.41%] Simplex steps: 39141 milli
		[23.25%] Explicit-basis bound tightening: 17359 milli
		[0.00%] Constraint-matrix bound tightening: 0 milli
		[0.51%] Degradation checking: 382 milli
		[0.00%] Precision restoration: 0 milli
		[0.23%] Statistics handling: 170 milli
		[0.00%] Constraint-fixing steps: 0 milli
		[0.03%] Valid case splits: 22 milli. Average per split: 0.00 milli
		[0.04%] Applying stored bound-tightening: 30 milli
		[2.38%] SMT core: 1779 milli
		[15.79%] Symbolic Bound Tightening: 11794 milli
		[36.54%] SoI-based local search: 27286 milli
		[0.00%] SoI-based local search: 0 milli
		[5.35%] Unaccounted for: 3994 milli
	--- Preprocessor Statistics ---
	Number of preprocessor bound-tightening loop iterations: 5
	Number of eliminated variables: 912
	Number of constraints removed due to variable elimination: 109
	Number of equations removed due to variable elimination: 0
	--- Engine Statistics ---
	Number of main loop iterations: 70000
		68865 iterations were simplex steps. Total time: 39141 milli. Average: 0.57 milli.
		0 iterations were constraint-fixing steps. Total time: 0 milli. Average: 0.00 milli
	Number of active piecewise-linear constraints: 184 / 312
		Constraints disabled by valid splits: 89. By SMT-originated splits: 39
	Last reported degradation: 0.0000000003. Max degradation so far: 0.0100353263. Restorations so far: 0
	Number of simplex pivots we attempted to skip because of instability: 99.
	Unstable pivots performed anyway: 8
	--- Tableau Statistics ---
	Total number of pivots performed: 58000
		Real pivots: 57921. Degenerate: 79 (0.14%)
		Degenerate pivots by request (e.g., to fix a PL constraint): 0 (0.00%)
		Average time per pivot: 0.19 milli
	Total number of fake pivots performed: 1991
	Total number of rows added: 0. Number of merged columns: 0
	Current tableau dimensions: M = 830, N = 2755
	--- SMT Core Statistics ---
	Total depth is 39. Total visited states: 791. Number of splits: 411. Number of pops: 379
	Max stack depth: 51
	--- Bound Tightening Statistics ---
	Number of tightened bounds: 76975.
		Number of rows examined by row tightener: 58000. Consequent tightenings: 1980
		Number of explicit basis matrices examined by row tightener: 245. Consequent tightenings: 4542
		Number of bound tightening rounds on the entire constraint matrix: 0. Consequent tightenings: 0
		Number of bound notifications sent to PL constraints: 139144. Tightenings proposed: 0
	--- Basis Factorization statistics ---
	Number of basis refactorizations: 517
	--- Projected Steepest Edge Statistics ---
	Number of iterations: 60082.
	Number of resets to reference space: 402. Avg. iterations per reset: 149
	--- SBT ---
	Number of tightened bounds: 77687
	--- SoI-based local search ---
	Number of proposed phase pattern update: 4022. Number of accepted update: 3619 [89.98%]
	Total time (% of local search time) updating SoI phase pattern : 266543 milli [0.98%]
	Total time obtaining current assignment: 1642887 milli [6.02%]
	Total time getting SoI phase pattern : 377869 milli [0.51%]
	--- Context dependent statistics ---
	Number of pushes / pops: 791 / 752
		[0.11%] Pre-Push hook: 79 milli
		[0.00%] Push : 0 milli
		[0.10%] Post-Pop hook: 75 milli
		[0.11%] Pop : 82 milli
		[0.32%] Total context-switching time: 236 milli
	--- Proof Certificate ---
	Number of certified leaves: 0
	Number of leaves to delegate: 0

00:47:00 Statistics update:
	--- Time Statistics ---
	Total time elapsed: 93483 milli (00:01:33)
		Main loop: 86379 milli (00:01:26)
		Preprocessing time: 287 milli (00:00:00)
		Unknown: 6816 milli (00:00:06)
	Breakdown for main loop:
		[52.30%] Simplex step[runlim] sample:		100.20 time, 100.01 real, 165 MB, 1.00 load
[runlim] sample:		110.20 time, 110.01 real, 165 MB, 1.08 load
s: 45178 milli
		[23.29%] Explicit-basis bound tightening: 20121 milli
		[0.00%] Constraint-matrix bound tightening: 0 milli
		[0.51%] Degradation checking: 438 milli
		[0.00%] Precision restoration: 0 milli
		[0.23%] Statistics handling: 197 milli
		[0.00%] Constraint-fixing steps: 0 milli
		[0.03%] Valid case splits: 26 milli. Average per split: 0.00 milli
		[0.04%] Applying stored bound-tightening: 34 milli
		[2.43%] SMT core: 2099 milli
		[15.90%] Symbolic Bound Tightening: 13737 milli
		[36.04%] SoI-based local search: 31127 milli
		[0.00%] SoI-based local search: 0 milli
		[5.26%] Unaccounted for: 4545 milli
	--- Preprocessor Statistics ---
	Number of preprocessor bound-tightening loop iterations: 5
	Number of eliminated variables: 912
	Number of constraints removed due to variable elimination: 109
	Number of equations removed due to variable elimination: 0
	--- Engine Statistics ---
	Number of main loop iterations: 80000
		78694 iterations were simplex steps. Total time: 45178 milli. Average: 0.57 milli.
		0 iterations were constraint-fixing steps. Total time: 0 milli. Average: 0.00 milli
	Number of active piecewise-linear constraints: 192 / 312
		Constraints disabled by valid splits: 89. By SMT-originated splits: 31
	Last reported degradation: 0.0000000000. Max degradation so far: 0.0100353263. Restorations so far: 0
	Number of simplex pivots we attempted to skip because of instability: 100.
	Unstable pivots performed anyway: 8
	--- Tableau Statistics ---
	Total number of pivots performed: 66234
		Real pivots: 66143. Degenerate: 91 (0.14%)
		Degenerate pivots by request (e.g., to fix a PL constraint): 0 (0.00%)
		Average time per pivot: 0.19 milli
	Total number of fake pivots performed: 2345
	Total number of rows added: 0. Number of merged columns: 0
	Current tableau dimensions: M = 830, N = 2755
	--- SMT Core Statistics ---
	Total depth is 31. Total visited states: 920. Number of splits: 472. Number of pops: 447
	Max stack depth: 51
	--- Bound Tightening Statistics ---
	Number of tightened bounds: 89744.
		Number of rows examined by row tightener: 66234. Consequent tightenings: 2134
		Number of explicit basis matrices examined by row tightener: 283. Consequent tightenings: 5159
		Number of bound tightening rounds on the entire constraint matrix: 0. Consequent tightenings: 0
		Number of bound notifications sent to PL constraints: 162266. Tightenings proposed: 0
	--- Basis Factorization statistics ---
	Number of basis refactorizations: 589
	--- Projected Steepest Edge Statistics ---
	Number of iterations: 68671.
	Number of resets to reference space: 470. Avg. iterations per reset: 146
	--- SBT ---
	Number of tightened bounds: 90456
	--- SoI-based local search ---
	Number of proposed phase pattern update: 4576. Number of accepted update: 4112 [89.86%]
	Total time (% of local search time) updating SoI phase pattern : 306885 milli [0.99%]
	Total time obtaining current assignment: 1886859 milli [6.06%]
	Total time getting SoI phase pattern : 429317 milli [0.50%]
	--- Context dependent statistics ---
	Number of pushes / pops: 920 / 889
		[0.11%] Pre-Push hook: 92 milli
		[0.00%] Push : 0 milli
		[0.10%] Post-Pop hook: 88 milli
		[0.11%] Pop : 96 milli
		[0.32%] Total context-switching time: 277 milli
	--- Proof Certificate ---
	Number of certified leaves: 0
	Number of leaves to delegate: 0

00:47:12 Statistics update:
	--- Time Statistics ---
	Total time elapsed: 105667 milli (00:01:45)
		Main loop: 98481 milli (00:01:38)
		Preprocessing time: 287 milli (00:00:00)
		Unknown: 6898 milli (00:00:06)
	Breakdown for main loop:
		[51.71%] Simplex steps: 50922 milli
		[24.12%] Explicit-basis bound tightening: 23749 milli
		[0.00%] Constraint-matrix bound tightening: 0 milli
		[0.50%] Degradation checking: 494 milli
		[0.00%] Precision restoration: 0 milli
		[0.23%] Statistics handling: 223 milli
		[0.00%] Constraint-fixing steps: 0 milli
		[0.03%] Valid case splits: 30 milli. Average per split: 0.00 milli
		[0.04%] Applying stored bound-tightening: 39 milli
		[2.42%] SMT core: 2387 milli
		[15.72%] Symbolic Bound Tightening: 15483 milli
		[34.71%] SoI-based local search: 34187 milli
		[0.00%] SoI-based local search: 0 milli
		[5.23%] Unaccounted for: 5150 milli
	--- Preprocessor Statistics ---
	Number of preprocessor bound-tightening loop iterations: 5
	Number of eliminated variables: 912
	Number of constraints removed due to variable elimination: 109
	Number of equations removed due to variable elimination: 0
	--- Engine Statistics ---
	Number of main loop iterations: 90000
		88544 iterations were simplex steps. Total time: 50922 milli. Average: 0.58 milli.
		0 iterations were constraint-fixing steps. Total time: 0 milli. Average: 0.00 milli
	Number of active piecewise-linear constraints: 198 / 312
		Constraints disabled by valid splits: 90. By SMT-originated splits: 24
	Last reported degradation: 0.0000000015. Max degradation so far: 0.0100353263. Restorations so far: 0
	Number of simplex pivots we attempted to skip because of instability: 107.
	Unstable pivots performed anyway: 10
	--- Tableau Statistics ---
	Total number of pivots performed: 74724
		Real pivots: 74623. Degenerate: 101 (0.14%)
		Degenerate pivots by request (e.g., to fix a PL constraint): 0 (0.00%)
		Average time per pivot: 0.19 milli
	Total number of fake pivots performed: 2646
	Total number of rows added: 0. Number of merged columns: 0
	Current tableau dimensions: M = 830, N = 2755
	--- SMT Core Statistics ---
	Total depth is 24. Total visited states: 1037. Number of splits: 527. Number of pops: 509
	Max stack depth: 51
	--- Bound Tightening Statistics ---
	Number of tightened bounds: 102624.
		Number of rows examined by row tightener: 74724. Consequent tightenings: 2673
		Number of explicit basis matrices examined by row tightener: 336. Consequent tightenings: 7338
		Number of bound tightening rounds on the entire constraint matrix: 0. Consequent tightenings: 0
		Number of bound notifications sent to PL constraints: 186710. Tightenings proposed: 0
	--- Basis Factorization statistics ---
	Number of basis refactorizations: 668
	--- Projected Steepest Edge Statistics ---
	Number of iterations: 77467.
	Number of resets to reference space: 534. Avg. iterations per reset: 145
	--- SBT ---
	Number of tightened bounds: 103336
	--- SoI-based local search ---
	Number of proposed phase pattern update: 5033. Number of accepted update: 4511 [89.63%]
	Total time (% of local search time) updating SoI phase pattern : 343055 milli [1.00%]
	Total time obtaining current assignment: 2086072 milli [6.10%]
	Total time getting SoI phase pattern : 471841 milli [0.48%]
	--- Context dependent statistics ---
	Number of pushes / pops: 1037 / 1013
		[0.11%] Pre-Push hook: 103 milli
		[0.00%] Push : 0 milli
		[0.10%] Post-Pop hook: 99 milli
		[0.11%] Pop : 109 milli
		[0.32%] Total context-switching time: 311 milli
	--- Proof Certificate ---
	Number of certified leaves: 0
	Number of leaves to delegate: 0

00:47:24 Statistics update:
	--- Time Statistics ---
	Total time elapsed: 117390 milli (00:01:57)
		Main loop: 110151 milli (00:01:50)
		Preprocessing time: 287 milli (00:00:00)
		Unknown: 6951 milli (00:00:06)
	Breakdown for main loop:
		[51.44%] Simplex steps: 56659 milli
		[24.41%] Explicit-basis bound tightening: 26888 milli
		[0.00%] Constraint-matrix bound tightening: 0 milli
		[0.50%] Degradation checking: 551 milli
		[0.00%] Precision restoration: 0 milli
		[0.23%] Statistics handling: 248 milli
		[0.00%] Constraint-fixing steps: 0 milli
		[0.03%] Valid case splits: 34 milli. Average per split: 0.00 milli
		[0.04%] Applying stored bound-tightening: 43 milli
		[2.41%] SMT core: 2652 milli
		[15.59%] Symbolic Bound Tightening: 17176 milli
		[34.13%] SoI-based local search: 37590 milli
		[0.00%] SoI-based local search: 0 milli
		[5.35%] Unaccounted for: 5896 milli
	--- Preprocessor Statistics ---
	Number of preprocessor bound-tightening loop iterations: 5
	Number of eliminated variables: 912
	Number of constraints removed due to variable elimination: 109
	Number of equations removed due to variable elimination: 0
	--- Engine Statistics ---
	Number of main loop iterations: 100000
		98392 itera[runlim] sample:		120.20 time, 120.01 real, 165 MB, 1.07 load
tions were simplex steps. Total time: 56659 milli. Average: 0.58 milli.
		0 iterations were constraint-fixing steps. Total time: 0 milli. Average: 0.00 milli
	Number of active piecewise-linear constraints: 204 / 312
		Constraints disabled by valid splits: 87. By SMT-originated splits: 21
	Last reported degradation: 0.0000000000. Max degradation so far: 0.0100353263. Restorations so far: 0
	Number of simplex pivots we attempted to skip because of instability: 108.
	Unstable pivots performed anyway: 10
	--- Tableau Statistics ---
	Total number of pivots performed: 83139
		Real pivots: 83032. Degenerate: 107 (0.13%)
		Degenerate pivots by request (e.g., to fix a PL constraint): 0 (0.00%)
		Average time per pivot: 0.19 milli
	Total number of fake pivots performed: 2962
	Total number of rows added: 0. Number of merged columns: 0
	Current tableau dimensions: M = 830, N = 2755
	--- SMT Core Statistics ---
	Total depth is 21. Total visited states: 1149. Number of splits: 582. Number of pops: 566
	Max stack depth: 51
	--- Bound Tightening Statistics ---
	Number of tightened bounds: 118808.
		Number of rows examined by row tightener: 83139. Consequent tightenings: 2968
		Number of explicit basis matrices examined by row tightener: 385. Consequent tightenings: 8897
		Number of bound tightening rounds on the entire constraint matrix: 0. Consequent tightenings: 0
		Number of bound notifications sent to PL constraints: 213375. Tightenings proposed: 0
	--- Basis Factorization statistics ---
	Number of basis refactorizations: 742
	--- Projected Steepest Edge Statistics ---
	Number of iterations: 86199.
	Number of resets to reference space: 592. Avg. iterations per reset: 145
	--- SBT ---
	Number of tightened bounds: 119520
	--- SoI-based local search ---
	Number of proposed phase pattern update: 5530. Number of accepted update: 4952 [89.55%]
	Total time (% of local search time) updating SoI phase pattern : 379197 milli [1.01%]
	Total time obtaining current assignment: 2296384 milli [6.11%]
	Total time getting SoI phase pattern : 518675 milli [0.47%]
	--- Context dependent statistics ---
	Number of pushes / pops: 1149 / 1128
		[0.10%] Pre-Push hook: 114 milli
		[0.00%] Push : 0 milli
		[0.10%] Post-Pop hook: 109 milli
		[0.11%] Pop : 121 milli
		[0.31%] Total context-switching time: 344 milli
	--- Proof Certificate ---
	Number of certified leaves: 0
	Number of leaves to delegate: 0


Engine: quitting due to external request...

Final statistics:

00:47:26 Statistics update:
	--- Time Statistics ---
	Total time elapsed: 120031 milli (00:02:00)
		Main loop: 112932 milli (00:01:52)
		Preprocessing time: 287 milli (00:00:00)
		Unknown: 6811 milli (00:00:06)
	Breakdown for main loop:
		[51.43%] Simplex steps: 58076 milli
		[24.21%] Explicit-basis bound tightening: 27337 milli
		[0.00%] Constraint-matrix bound tightening: 0 milli
		[0.50%] Degradation checking: 566 milli
		[0.00%] Precision restoration: 0 milli
		[0.23%] Statistics handling: 254 milli
		[0.00%] Constraint-fixing steps: 0 milli
		[0.03%] Valid case splits: 35 milli. Average per split: 0.00 milli
		[0.04%] Applying stored bound-tightening: 44 milli
		[2.42%] SMT core: 2734 milli
		[15.68%] Symbolic Bound Tightening: 17711 milli
		[34.29%] SoI-based local search: 38720 milli
		[0.00%] SoI-based local search: 0 milli
		[5.46%] Unaccounted for: 6171 milli
	--- Preprocessor Statistics ---
	Number of preprocessor bound-tightening loop iterations: 5
	Number of eliminated variables: 912
	Number of constraints removed due to variable elimination: 109
	Number of equations removed due to variable elimination: 0
	--- Engine Statistics ---
	Number of main loop iterations: 102535
		100879 iterations were simplex steps. Total time: 58076 milli. Average: 0.58 milli.
		0 iterations were constraint-fixing steps. Total time: 0 milli. Average: 0.00 milli
	Number of active piecewise-linear constraints: 197 / 312
		Constraints disabled by valid splits: 92. By SMT-originated splits: 23
	Last reported degradation: 0.0000000000. Max degradation so far: 0.0100353263. Restorations so far: 0
	Number of simplex pivots we attempted to skip because of instability: 111.
	Unstable pivots performed anyway: 10
	--- Tableau Statistics ---
	Total number of pivots performed: 85167
		Real pivots: 85060. Degenerate: 107 (0.13%)
		Degenerate pivots by request (e.g., to fix a PL constraint): 0 (0.00%)
		Average time per pivot: 0.19 milli
	Total number of fake pivots performed: 3036
	Total number of rows added: 0. Number of merged columns: 0
	Current tableau dimensions: M = 830, N = 2755
	--- SMT Core Statistics ---
	Total depth is 23. Total visited states: 1183. Number of splits: 599. Number of pops: 583
	Max stack depth: 51
	--- Bound Tightening Statistics ---
	Number of tightened bounds: 123635.
		Number of rows examined by row tightener: 85167. Consequent tightenings: 2980
		Number of explicit basis matrices examined by row tightener: 391. Consequent tightenings: 8953
		Number of bound tightening rounds on the entire constraint matrix: 0. Consequent tightenings: 0
		Number of bound notifications sent to PL constraints: 219949. Tightenings proposed: 0
	--- Basis Factorization statistics ---
	Number of basis refactorizations: 761
	--- Projected Steepest Edge Statistics ---
	Number of iterations: 88304.
	Number of resets to reference space: 609. Avg. iterations per reset: 144
	--- SBT ---
	Number of tightened bounds: 124347
	--- SoI-based local search ---
	Number of proposed phase pattern update: 5708. Number of accepted update: 5114 [89.59%]
	Total time (% of local search time) updating SoI phase pattern : 389810 milli [1.01%]
	Total time obtaining current assignment: 2370356 milli [6.12%]
	Total time getting SoI phase pattern : 535120 milli [0.47%]
	--- Context dependent statistics ---
	Number of pushes / pops: 1183 / 1160
		[0.10%] Pre-Push hook: 117 milli
		[0.00%] Push : 0 milli
		[0.10%] Post-Pop hook: 113 milli
		[0.11%] Pop : 124 milli
		[0.32%] Total context-switching time: 355 milli
	--- Proof Certificate ---
	Number of certified leaves: 0
	Number of leaves to delegate: 0
Unexpected exit code! (this should not happen)[runlim] end:			Fri Oct  4 00:47:27 2024
[runlim] status:		out of time
[runlim] result:		2
[runlim] children:		1
[runlim] processes:		2
[runlim] real:			121.11 seconds
[runlim] time:			120.20 seconds
[runlim] space:			165 MB
[runlim] load:			1.08 maximum
[runlim] samples:		1200

real	2m1,115s
user	2m1,278s
sys	0m3,395s
