
[VERYDIFF_EXPERIMENT] Running on /home/i57/steuber/NeuroDiff/repos/VeryDiffExperiments/src/../benchmarks/mnist-prune/specs/mnist_9_global_5.vnnlib /home/i57/steuber/NeuroDiff/repos/VeryDiffExperiments/src/../benchmarks/mnist-prune/nets/mnist_relu_2_512.onnx
Parsing /home/i57/steuber/NeuroDiff/repos/VeryDiffExperiments/src/../benchmarks/mnist-prune/nets/mnist_relu_2_512.onnx...
Found input X
op: matmul, weight: (512, 784), bias: nothing
op: bias, weight: nothing, bias: (512,)
op: relu, weight: nothing, bias: nothing
op: matmul, weight: (512, 512), bias: nothing
op: bias, weight: nothing, bias: (512,)
op: relu, weight: nothing, bias: nothing
op: matmul, weight: (10, 512), bias: nothing
op: bias, weight: nothing, bias: (10,)
Parsing /home/i57/steuber/NeuroDiff/repos/VeryDiffExperiments/src/../benchmarks/mnist-prune/nets_pruned/mnist_relu_2_512_pruned5.onnx...
Found input X
op: matmul, weight: (512, 784), bias: nothing
op: bias, weight: nothing, bias: (512,)
op: relu, weight: nothing, bias: nothing
op: matmul, weight: (512, 512), bias: nothing
op: bias, weight: nothing, bias: (512,)
op: relu, weight: nothing, bias: nothing
op: matmul, weight: (10, 512), bias: nothing
op: bias, weight: nothing, bias: (10,)
Distance: 1085.5985166831802
Distance: 1719.8468985003963
Distance: 31.228482716001736
Running with 1 threads
[Thread 1] Time to first task: 0.01s
Instable Generators: 137
Instable Generators: 250
Zono Bounds:
[-17.05686746676397, -13.055375831428407, -15.51684034570387, -11.551790117909627, -8.125036198025848, -15.29279271560266, -16.600267740413976, -9.287714732014006, -6.69420817113057, -4.387389770174293]
[6.695307112802388, 8.071010241680987, 4.3696004617103235, 7.068609038344027, 11.639664940763195, 2.4393842674512687, 4.7684168612571955, 8.300160450693362, 7.692879607440234, 11.833015077070316]
[Thread 1] Processed 100 zonotopes (Work Done: 0.0%; Expected Zonos: Inf)


TIMEOUT REACHED
UNKNOWN
[Thread 1] Total splits: 179
Processed 179 zonotopes (Work Done: 0.0%); Generated 358 (0.673982493178771s/loop)
[Thread 1] Finished in 120.64s
 ────────────────────────────────────────────────────────────────────────────────
                                        Time                    Allocations      
                               ───────────────────────   ────────────────────────
       Tot / % measured:             121s / 100.0%           46.8GiB / 100.0%    

 Section               ncalls     time    %tot     avg     alloc    %tot      avg
 ────────────────────────────────────────────────────────────────────────────────
 Verify                     1     121s  100.0%    121s   46.7GiB  100.0%  46.7GiB
   Zonotope Loop            1     121s  100.0%    121s   46.7GiB  100.0%  46.7GiB
     Property Check       179    89.1s   73.9%   498ms   18.4GiB   39.4%   105MiB
     Zonotope Propa...    179    29.0s   24.1%   162ms   21.5GiB   45.9%   123MiB
       DiffZonotope...    537    19.0s   15.7%  35.3ms   3.76GiB    8.0%  7.16MiB
         Zonotope_D...  1.07k    8.92s    7.4%  8.30ms   2.37GiB    5.1%  2.26MiB
       DiffZonotope...    358    10.1s    8.3%  28.1ms   17.7GiB   37.9%  50.7MiB
         Zonotope_R...    716    8.40s    7.0%  11.7ms   15.5GiB   33.1%  22.1MiB
           Influenc...    716    6.73s    5.6%  9.40ms   9.70GiB   20.7%  13.9MiB
             Multiply     716    5.91s    4.9%  8.25ms   5.31GiB   11.3%  7.59MiB
             Set Ma...    716    585ms    0.5%   816μs     0.00B    0.0%    0.00B
             Alloca...    716    237ms    0.2%   331μs   4.39GiB    9.4%  6.28MiB
           Column M...    716    1.01s    0.8%  1.40ms   2.87GiB    6.1%  4.10MiB
           Set Matrix     716    362ms    0.3%   506μs   3.82MiB    0.0%  5.46KiB
           Allocation     716    282ms    0.2%   394μs   2.87GiB    6.1%  4.10MiB
           Vectors        716   14.4ms    0.0%  20.2μs   17.5MiB    0.0%  25.0KiB
           Bounds         716    546μs    0.0%   762ns     0.00B    0.0%    0.00B
     Compute Split        179    1.49s    1.2%  8.32ms   3.35GiB    7.2%  19.2MiB
 Initialize                 1   2.25ms    0.0%  2.25ms   9.84MiB    0.0%  9.84MiB
 ────────────────────────────────────────────────────────────────────────────────
[VERYDIFF_TIMER] 120.680231123

[VERYDIFF_EXPERIMENT] Running on /home/i57/steuber/NeuroDiff/repos/VeryDiffExperiments/src/../benchmarks/mnist-prune/specs/mnist_9_global_5.vnnlib /home/i57/steuber/NeuroDiff/repos/VeryDiffExperiments/src/../benchmarks/mnist-prune/nets/mnist_relu_3_100.onnx
Parsing /home/i57/steuber/NeuroDiff/repos/VeryDiffExperiments/src/../benchmarks/mnist-prune/nets/mnist_relu_3_100.onnx...
Found input X
op: matmul, weight: (100, 784), bias: nothing
op: bias, weight: nothing, bias: (100,)
op: relu, weight: nothing, bias: nothing
op: matmul, weight: (100, 100), bias: nothing
op: bias, weight: nothing, bias: (100,)
op: relu, weight: nothing, bias: nothing
op: matmul, weight: (10, 100), bias: nothing
op: bias, weight: nothing, bias: (10,)
op: relu, weight: nothing, bias: nothing
op: matmul, weight: (10, 10), bias: nothing
op: bias, weight: nothing, bias: (10,)
Parsing /home/i57/steuber/NeuroDiff/repos/VeryDiffExperiments/src/../benchmarks/mnist-prune/nets_pruned/mnist_relu_3_100_pruned5.onnx...
Found input X
op: matmul, weight: (100, 784), bias: nothing
op: bias, weight: nothing, bias: (100,)
op: relu, weight: nothing, bias: nothing
op: matmul, weight: (100, 100), bias: nothing
op: bias, weight: nothing, bias: (100,)
op: relu, weight: nothing, bias: nothing
op: matmul, weight: (10, 100), bias: nothing
op: bias, weight: nothing, bias: (10,)
op: relu, weight: nothing, bias: nothing
op: matmul, weight: (10, 10), bias: nothing
op: bias, weight: nothing, bias: (10,)
Distance: 296.6600370998244
Distance: 77.24290861755458
Distance: 5.7170369567975285
Distance: 0.0
Running with 1 threads
[Thread 1] Time to first task: 0.0s
Instable Generators: 32
Instable Generators: 50
Instable Generators: 4
Zono Bounds:
[0.0, 0.0, -1.7598967548164766, -1.2505854886281473, -1.592074880285938, -0.21756264761422917, 0.0, -0.7093155712323097, -1.6458182051673773, -0.7481079313514722]
[0.0, 0.0, 0.8275024415503205, 1.2505854886281473, 1.4395940992223777, 0.22486048351943122, 0.0, 1.7286173438388115, 1.6458182051673773, 1.4387684460767078]
[Thread 1] Processed 100 zonotopes (Work Done: 0.0%; Expected Zonos: Inf)
[Thread 1] Processed 200 zonotopes (Work Done: 0.0%; Expected Zonos: Inf)
[Thread 1] Processed 300 zonotopes (Work Done: 0.0%; Expected Zonos: Inf)


TIMEOUT REACHED
UNKNOWN
[Thread 1] Total splits: 333
Processed 333 zonotopes (Work Done: 0.0%); Generated 666 (0.36124091955555554s/loop)
[Thread 1] Finished in 120.29s
 ────────────────────────────────────────────────────────────────────────────────
                                        Time                    Allocations      
                               ───────────────────────   ────────────────────────
       Tot / % measured:             120s / 100.0%           53.8GiB / 100.0%    

 Section               ncalls     time    %tot     avg     alloc    %tot      avg
 ────────────────────────────────────────────────────────────────────────────────
 Verify                     1     120s  100.0%    120s   53.7GiB  100.0%  53.7GiB
   Zonotope Loop            1     120s  100.0%    120s   53.7GiB  100.0%  53.7GiB
     Property Check       333    61.7s   51.3%   185ms   18.4GiB   34.2%  56.5MiB
     Zonotope Propa...    333    48.1s   40.0%   144ms   23.9GiB   44.4%  73.4MiB
       DiffZonotope...    999    42.5s   35.3%  42.6ms   22.5GiB   41.9%  23.1MiB
         Zonotope_R...  2.00k    42.1s   35.0%  21.1ms   22.0GiB   40.9%  11.3MiB
           Influenc...  2.00k    41.7s   34.7%  20.9ms   20.2GiB   37.6%  10.4MiB
             Alloca...  2.00k    34.0s   28.2%  17.0ms   9.93GiB   18.5%  5.09MiB
             Multiply   2.00k    6.28s    5.2%  3.14ms   10.3GiB   19.1%  5.27MiB
             Set Ma...  2.00k    1.43s    1.2%   716μs     0.00B    0.0%    0.00B
           Column M...  2.00k    255ms    0.2%   127μs    899MiB    1.6%   461KiB
           Set Matrix   2.00k    107ms    0.1%  53.5μs   1.92MiB    0.0%  0.98KiB
           Allocation   2.00k   47.4ms    0.0%  23.7μs    899MiB    1.6%   461KiB
           Vectors      2.00k   10.2ms    0.0%  5.10μs   6.35MiB    0.0%  3.26KiB
           Bounds       2.00k   1.29ms    0.0%   646ns     0.00B    0.0%    0.00B
       DiffZonotope...  1.33k    5.56s    4.6%  4.17ms   1.35GiB    2.5%  1.04MiB
         Zonotope_D...  2.66k    2.67s    2.2%  1.00ms    905MiB    1.6%   348KiB
     Compute Split        333    2.42s    2.0%  7.28ms   5.03GiB    9.4%  15.5MiB
 Initialize                 1    524μs    0.0%   524μs   5.41MiB    0.0%  5.41MiB
 ────────────────────────────────────────────────────────────────────────────────
[VERYDIFF_TIMER] 120.354143575

[VERYDIFF_EXPERIMENT] NETWORK: /home/i57/steuber/NeuroDiff/repos/VeryDiffExperiments/src/../benchmarks/mnist-prune/specs/mnist_9_global_5.vnnlib
[VERYDIFF_EXPERIMENT] TIME: 241.67773646
