
[VERYDIFF_EXPERIMENT] Running on /home/i57/steuber/NeuroDiff/repos/VeryDiffExperiments/src/../benchmarks/mnist-prune/specs/mnist_12_global_3.vnnlib /home/i57/steuber/NeuroDiff/repos/VeryDiffExperiments/src/../benchmarks/mnist-prune/nets/mnist_relu_2_512.onnx
Found input X
op: matmul, weight: (512, 784), bias: nothing
op: bias, weight: nothing, bias: (512,)
op: relu, weight: nothing, bias: nothing
op: matmul, weight: (512, 512), bias: nothing
op: bias, weight: nothing, bias: (512,)
op: relu, weight: nothing, bias: nothing
op: matmul, weight: (10, 512), bias: nothing
op: bias, weight: nothing, bias: (10,)
Found input X
op: matmul, weight: (512, 784), bias: nothing
op: bias, weight: nothing, bias: (512,)
op: relu, weight: nothing, bias: nothing
op: matmul, weight: (512, 512), bias: nothing
op: bias, weight: nothing, bias: (512,)
op: relu, weight: nothing, bias: nothing
op: matmul, weight: (10, 512), bias: nothing
op: bias, weight: nothing, bias: (10,)
Distance: 1085.5985166831802
Distance: 1719.8468985003963
Distance: 31.228482716001736
Running with 1 threads
[Thread 1] Time to first task: 0.01s
Instable Generators: 102
Instable Generators: 209
Zono Bounds:
[-14.931087945393497, -15.107755408298702, -12.805004985843599, -6.324441805800213, -8.932772174685965, -7.050096953930507, -14.034379439279384, -11.479708498840335, -6.729219312647172, -2.7620971876797245]
[1.7999864651423856, 1.3708850318143195, 0.4508953153619206, 5.662259693033868, 4.921145489663413, 4.42346993626457, 1.9763093565215923, 2.463522765210521, 4.405545745184466, 7.3580590092140685]

Found counterexample: ([0.01176471, 0.01176471, 0.01176471, 0.01176471, 0.0, 0.01176471, 0.01176471, 0.01176471, 0.01176471, 0.01176471, 0.0, 0.0, 0.01176471, 0.0, 0.01176471, 0.01176471, 0.01176471, 0.01176471, 0.0, 0.0, 0.0, 0.0, 0.0, 0.01176471, 0.0, 0.01176471, 0.0, 0.0, 0.01176471, 0.01176471, 0.01176471, 0.0, 0.0, 0.0, 0.01176471, 0.01176471, 0.01176471, 0.01176471, 0.01176471, 0.01176471, 0.01176471, 0.0, 0.01176471, 0.01176471, 0.01176471, 0.01176471, 0.01176471, 0.01176471, 0.01176471, 0.0, 0.01176471, 0.01176471, 0.01176471, 0.01176471, 0.0, 0.01176471, 0.01176471, 0.0, 0.0, 0.01176471, 0.01176471, 0.01176471, 0.01176471, 0.01176471, 0.01176471, 0.01176471, 0.01176471, 0.01176471, 0.01176471, 0.01176471, 0.01176471, 0.01176471, 0.01176471, 0.01176471, 0.01176471, 0.01176471, 0.01176471, 0.0, 0.0, 0.01176471, 0.01176471, 0.01176471, 0.0, 0.0, 0.0, 0.0, 0.01176471, 0.0, 0.01176471, 0.01176471, 0.01176471, 0.01176471, 0.01176471, 0.01176471, 0.01176471, 0.01176471, 0.01176471, 0.01176471, 0.01176471, 0.01176471, 0.01176471, 0.01176471, 0.01176471, 0.01176471, 0.01176471, 0.01176471, 0.0, 0.0, 0.01176471, 0.01176471, 0.01176471, 0.01176471, 0.01176471, 0.0, 0.0, 0.0, 0.01176471, 0.0, 0.01176471, 0.01176471, 0.01176471, 0.01176471, 0.01176471, 0.01176471, 0.01176471, 0.01176471, 0.01176471, 0.01176471, 0.01176471, 0.01176471, 0.01176471, 0.01176471, 0.01176471, 0.01176471, 0.0, 0.0, 0.0, 0.01176471, 0.01176471, 0.0, 0.01176471, 0.01176471, 0.0, 0.01176471, 0.01176471, 0.01176471, 0.01176471, 0.01176471, 0.01176471, 0.01176471, 0.0, 0.0, 0.01176471, 0.0, 0.0, 0.01176471, 0.01176471, 0.0, 0.0, 0.01176471, 0.01176471, 0.01176471, 0.01176471, 0.01176471, 0.01176471, 0.01176471, 0.01176471, 0.01176471, 0.01176471, 0.01176471, 0.01176471, 0.01176471, 0.01176471, 0.01176471, 0.01176471, 0.01176471, 0.0, 0.01176471, 0.01176471, 0.0, 0.0, 0.0, 0.0, 0.0, 0.0, 0.0, 0.0, 0.01176471, 0.0, 0.01176471, 0.01176471, 0.01176471, 0.01176471, 0.01176471, 0.01176471, 0.01176471, 0.01176471, 0.0, 0.0, 0.01176471, 0.01176471, 0.01176471, 0.0, 0.01176471, 0.01176471, 0.01176471, 0.01176471, 0.01176471, 0.18039216, 0.69411767, 0.98039216, 0.98823529, 0.98039216, 0.65098041, 0.12941177, 0.05490196, 0.30980393000000006, 0.04705882, 0.01176471, 0.01176471, 0.01176471, 0.01176471, 0.01176471, 0.0, 0.01176471, 0.01176471, 0.0, 0.01176471, 0.01176471, 0.01176471, 0.0, 0.01176471, 0.0, 0.01176471, 0.03137255, 0.25490198, 0.9058823600000001, 0.97647059, 0.97647059, 1.0, 0.97647059, 0.9999999999999999, 0.6156863, 0.75294119, 1.0, 0.37254903000000006, 0.01176471, 0.01176471, 0.01176471, 0.01176471, 0.01176471, 0.0, 0.01176471, 0.01176471, 0.01176471, 0.01176471, 0.01176471, 0.01176471, 0.0, 0.0, 0.0, 0.0, 0.20392157, 0.97647059, 0.9999999999999999, 0.87843138, 0.32156864000000007, 0.28235295, 0.28235295, 0.40392157000000006, 0.36470589, 0.93725491, 0.9803921600000001, 0.27450981999999996, 0.01176471, 0.01176471, 0.01176471, 0.01176471, 0.0, 0.0, 0.01176471, 0.01176471, 0.01176471, 0.01176471, 0.01176471, 0.01176471, 0.0, 0.0, 0.0, 0.18039215999999997, 0.9254902, 0.9999999999999999, 0.73725492, 0.20784313999999998, 0.0, 0.0, 0.01176471, 0.11372549, 0.8078431500000001, 0.9999999999999999, 0.5411764999999998, 0.01176471, 0.01176471, 0.0, 0.01176471, 0.0, 0.01176471, 0.0, 0.0, 0.01176471, 0.01176471, 0.01176471, 0.01176471, 0.01176471, 0.0, 0.0, 0.0, 0.64705884, 1.0, 0.7098039399999999, 0.13333334, 0.0, 0.0, 0.0, 0.0, 0.26274511, 0.9999999999999999, 0.97647059, 0.23529412, 0.0, 0.0, 0.0, 0.01176471, 0.01176471, 0.0, 0.01176471, 0.01176471, 0.01176471, 0.0, 0.01176471, 0.0, 0.01176471, 0.01176471, 0.01176471, 0.59607846, 1.0, 0.9607843200000001, 0.17647058999999998, 0.01176471, 0.0, 0.0, 0.0, 0.00784314, 0.73725492, 0.98039216, 0.73333335, 0.0, 0.0, 0.0, 0.0, 0.01176471, 0.01176471, 0.01176471, 0.01176471, 0.01176471, 0.01176471, 0.0, 0.01176471, 0.0, 0.01176471, 0.01176471, 0.01176471, 0.8235294200000001, 0.9999999999999999, 0.9137255, 0.01176471, 0.0, 0.0, 0.0, 0.00784314, 0.52156866, 0.97647059, 0.9999999999999999, 0.26274511, 0.0, 0.0, 0.01176471, 0.01176471, 0.01176471, 0.01176471, 0.01176471, 0.01176471, 0.01176471, 0.01176471, 0.01176471, 0.01176471, 0.01176471, 0.01176471, 0.01176471, 0.0, 0.8235294200000001, 0.9999999999999999, 0.9137255, 0.0, 0.0, 0.0, 0.11372549, 0.52941179, 0.97647059, 0.97647059, 0.87843138, 0.05098039, 0.0, 0.0, 0.01176471, 0.01176471, 0.01176471, 0.01176471, 0.01176471, 0.0, 0.01176471, 0.01176471, 0.01176471, 0.01176471, 0.01176471, 0.01176471, 0.01176471, 0.01176471, 0.65882355, 0.9999999999999999, 0.9882352899999999, 0.80000001, 0.80000001, 0.80000001, 0.88235295, 0.98039216, 0.97647059, 0.97647059, 0.6156863, 0.01176471, 0.0, 0.0, 0.01176471, 0.01176471, 0.01176471, 0.01176471, 0.01176471, 0.01176471, 0.01176471, 0.01176471, 0.01176471, 0.01176471, 0.01176471, 0.01176471, 0.01176471, 0.01176471, 0.04705882, 0.6901961, 0.98039216, 0.97647059, 0.97647059, 0.97647059, 0.9999999999999999, 0.30588235999999996, 0.67450982, 0.9999999999999999, 0.20784314, 0.01176471, 0.01176471, 0.01176471, 0.01176471, 0.01176471, 0.01176471, 0.01176471, 0.01176471, 0.01176471, 0.01176471, 0.0, 0.0, 0.01176471, 0.01176471, 0.01176471, 0.0, 0.0, 0.01176471, 0.01176471, 0.23921569, 0.44313726, 0.44313726, 0.27843139, 0.01176471, 0.57254905, 1.0, 0.8549019699999999, 0.09411765, 0.01176471, 0.01176471, 0.01176471, 0.01176471, 0.01176471, 0.01176471, 0.01176471, 0.01176471, 0.0, 0.0, 0.0, 0.0, 0.01176471, 0.01176471, 0.01176471, 0.01176471, 0.01176471, 0.01176471, 0.01176471, 0.01176471, 0.01176471, 0.01176471, 0.01176471, 0.01176471, 1.0, 0.9999999999999999, 0.62352943, 0.01176471, 0.01176471, 0.01176471, 0.01176471, 0.0, 0.01176471, 0.01176471, 0.01176471, 0.01176471, 0.01176471, 0.01176471, 0.01176471, 0.01176471, 0.01176471, 0.01176471, 0.01176471, 0.01176471, 0.0, 0.01176471, 0.0, 0.01176471, 0.01176471, 0.01176471, 0.01176471, 0.13725491, 1.0, 0.92941177, 0.20784313999999998, 0.01176471, 0.0, 0.01176471, 0.01176471, 0.01176471, 0.01176471, 0.01176471, 0.01176471, 0.01176471, 0.01176471, 0.0, 0.01176471, 0.01176471, 0.01176471, 0.01176471, 0.01176471, 0.01176471, 0.0, 0.01176471, 0.01176471, 0.01176471, 0.01176471, 0.01176471, 0.01176471, 0.60392159, 1.0, 0.63137257, 0.0, 0.01176471, 0.01176471, 0.0, 0.01176471, 0.01176471, 0.0, 0.0, 0.0, 0.01176471, 0.01176471, 0.0, 0.0, 0.01176471, 0.0, 0.01176471, 0.0, 0.01176471, 0.01176471, 0.01176471, 0.01176471, 0.01176471, 0.01176471, 0.01176471, 0.15686275, 0.92941177, 1.0, 0.34901962, 0.01176471, 0.01176471, 0.01176471, 0.01176471, 0.01176471, 0.01176471, 0.0, 0.0, 0.0, 0.01176471, 0.01176471, 0.0, 0.0, 0.0, 0.01176471, 0.01176471, 0.01176471, 0.01176471, 0.01176471, 0.01176471, 0.01176471, 0.01176471, 0.01176471, 0.01176471, 0.35294119, 0.98039216, 0.9999999999999999, 0.34117647999999995, 0.01176471, 0.01176471, 0.0, 0.0, 0.01176471, 0.01176471, 0.0, 0.0, 0.01176471, 0.01176471, 0.01176471, 0.01176471, 0.01176471, 0.01176471, 0.01176471, 0.01176471, 0.01176471, 0.01176471, 0.01176471, 0.01176471, 0.01176471, 0.01176471, 0.0, 0.01176471, 0.43529412, 0.97647059, 0.83137256, 0.01176471, 0.01176471, 0.01176471, 0.0, 0.0, 0.01176471, 0.01176471, 0.0, 0.0, 0.0, 0.01176471, 0.01176471, 0.0, 0.0, 0.0, 0.01176471, 0.0, 0.0, 0.0, 0.0, 0.0, 0.0, 0.0, 0.0, 0.0, 0.80000001, 0.97647059, 0.46666667000000006, 0.01176471, 0.01176471, 0.01176471, 0.0, 0.0, 0.01176471, 0.01176471, 0.0, 0.0, 0.01176471, 0.0, 0.01176471, 0.0, 0.01176471, 0.0, 0.0, 0.0, 0.0, 0.0, 0.0, 0.0, 0.0, 0.0, 0.0, 0.0, 0.63529414, 0.97647059, 0.44313726, 0.0, 0.0, 0.0, 0.0, 0.0, 0.0, 0.0, 0.0, 0.0, 0.01176471, 0.01176471, 0.01176471, 0.0, 0.01176471, 0.0, 0.0, 0.0, 0.0, 0.0, 0.0, 0.0, 0.0, 0.0, 0.0, 0.0, 0.35294119, 0.77254903, 0.23529412, 0.0, 0.0, 0.0, 0.0, 0.0, 0.0, 0.0, 0.0, 0.0, 0.01176471, 0.01176471, 0.01176471, 0.0, 0.01176471, 0.0, 0.0, 0.01176471, 0.01176471, 0.0, 0.01176471, 0.01176471, 0.01176471, 0.0, 0.0, 0.01176471, 0.0, 0.0, 0.0, 0.0, 0.0, 0.0, 0.0, 0.01176471, 0.0, 0.0, 0.01176471, 0.01176471, 0.01176471, 0.0, 0.0], ([-66.26074415284334, -51.248115218775844, -36.26706353003527, -27.55572162026603, -18.980645486478462, -30.790941709063095, -62.310984216244634, -32.410702401501716, -37.0874796874686, 3.308749955634182], [-59.037292852046825, -44.011649062055035, -29.744397350495785, -26.08165942470077, -16.15827357816373, -29.079465737918667, -56.28759631614651, -27.311437457870593, -35.474250099425184, 2.2736155128466407], 1.2287475295292154))
[Thread 1] Total splits: 0
Processed 1 zonotopes (Work Done: 0.0%); Generated 0 (0.242844729s/loop)
[Thread 1] Finished in 0.24s
 ────────────────────────────────────────────────────────────────────────────────
                                        Time                    Allocations      
                               ───────────────────────   ────────────────────────
       Tot / % measured:            245ms / 100.0%            146MiB / 100.0%    

 Section               ncalls     time    %tot     avg     alloc    %tot      avg
 ────────────────────────────────────────────────────────────────────────────────
 Verify                     1    243ms   99.1%   243ms    137MiB   93.3%   137MiB
   Zonotope Loop            1    243ms   99.1%   243ms    137MiB   93.3%   137MiB
     Zonotope Propa...      1    230ms   93.8%   230ms    116MiB   79.2%   116MiB
       DiffZonotope...      2    121ms   49.4%  60.5ms   95.2MiB   65.0%  47.6MiB
         Zonotope_R...      4    113ms   46.0%  28.2ms   83.5MiB   57.0%  20.9MiB
           Allocation       4   64.7ms   26.4%  16.2ms   15.6MiB   10.7%  3.91MiB
           Influenc...      4   40.4ms   16.5%  10.1ms   52.1MiB   35.6%  13.0MiB
             Multiply       4   31.6ms   12.9%  7.90ms   28.2MiB   19.3%  7.05MiB
             Alloca...      4   5.71ms    2.3%  1.43ms   23.9MiB   16.3%  5.98MiB
             Set Ma...      4   3.07ms    1.3%   767μs     0.00B    0.0%    0.00B
           Column M...      4   5.61ms    2.3%  1.40ms   15.6MiB   10.7%  3.91MiB
           Set Matrix       4   1.89ms    0.8%   472μs   19.1KiB    0.0%  4.77KiB
           Vectors          4   84.0μs    0.0%  21.0μs    100KiB    0.1%  25.0KiB
           Bounds           4   2.69μs    0.0%   672ns     0.00B    0.0%    0.00B
       DiffZonotope...      3    109ms   44.4%  36.2ms   20.8MiB   14.2%  6.92MiB
         Zonotope_D...      6   52.5ms   21.4%  8.75ms   13.3MiB    9.1%  2.21MiB
     Property Check         1   2.66ms    1.1%  2.66ms    221KiB    0.1%   221KiB
 Initialize                 1   2.17ms    0.9%  2.17ms   9.84MiB    6.7%  9.84MiB
 ────────────────────────────────────────────────────────────────────────────────
[VERYDIFF_TIMER] 0.278199423

[VERYDIFF_EXPERIMENT] Running on /home/i57/steuber/NeuroDiff/repos/VeryDiffExperiments/src/../benchmarks/mnist-prune/specs/mnist_12_global_3.vnnlib /home/i57/steuber/NeuroDiff/repos/VeryDiffExperiments/src/../benchmarks/mnist-prune/nets/mnist_relu_3_100.onnx
Found input X
op: matmul, weight: (100, 784), bias: nothing
op: bias, weight: nothing, bias: (100,)
op: relu, weight: nothing, bias: nothing
op: matmul, weight: (100, 100), bias: nothing
op: bias, weight: nothing, bias: (100,)
op: relu, weight: nothing, bias: nothing
op: matmul, weight: (10, 100), bias: nothing
op: bias, weight: nothing, bias: (10,)
op: relu, weight: nothing, bias: nothing
op: matmul, weight: (10, 10), bias: nothing
op: bias, weight: nothing, bias: (10,)
Found input X
op: matmul, weight: (100, 784), bias: nothing
op: bias, weight: nothing, bias: (100,)
op: relu, weight: nothing, bias: nothing
op: matmul, weight: (100, 100), bias: nothing
op: bias, weight: nothing, bias: (100,)
op: relu, weight: nothing, bias: nothing
op: matmul, weight: (10, 100), bias: nothing
op: bias, weight: nothing, bias: (10,)
op: relu, weight: nothing, bias: nothing
op: matmul, weight: (10, 10), bias: nothing
op: bias, weight: nothing, bias: (10,)
Distance: 296.6600370998244
Distance: 77.24290861755458
Distance: 5.7170369567975285
Distance: 0.0
Running with 1 threads
[Thread 1] Time to first task: 0.0s
Instable Generators: 22
Instable Generators: 40
Instable Generators: 4
Zono Bounds:
[0.0, 0.0, -0.2891467079753127, -0.7164399469015827, -0.9963855483236879, -1.7768549670812406, 0.0, -0.5435498565485958, -0.7492353412052176, -0.4688136982684054]
[0.0, 0.0, 0.25811705369540583, 0.7164399469015827, 0.5757939633451508, 1.7768549670812401, 0.0, 0.739965569605859, 0.7492353412052176, 0.8343629041599903]
[Thread 1] Total splits: 0
Processed 1 zonotopes (Work Done: 100.0%); Generated 0 (0.069885903s/loop)
[Thread 1] Finished in 0.07s
 ────────────────────────────────────────────────────────────────────────────────
                                        Time                    Allocations      
                               ───────────────────────   ────────────────────────
       Tot / % measured:           70.5ms / 100.0%           97.1MiB / 100.0%    

 Section               ncalls     time    %tot     avg     alloc    %tot      avg
 ────────────────────────────────────────────────────────────────────────────────
 Verify                     1   69.9ms   99.2%  69.9ms   91.7MiB   94.4%  91.7MiB
   Zonotope Loop            1   69.9ms   99.1%  69.9ms   91.6MiB   94.4%  91.6MiB
     Zonotope Propa...      1   66.6ms   94.5%  66.6ms   71.7MiB   73.9%  71.7MiB
       DiffZonotope...      3   45.4ms   64.4%  15.1ms   67.6MiB   69.6%  22.5MiB
         Zonotope_R...      6   44.2ms   62.7%  7.37ms   66.0MiB   68.0%  11.0MiB
           Influenc...      6   43.1ms   61.1%  7.18ms   60.7MiB   62.5%  10.1MiB
             Multiply       6   25.0ms   35.5%  4.17ms   30.7MiB   31.7%  5.12MiB
             Alloca...      6   14.0ms   19.9%  2.34ms   29.9MiB   30.8%  4.99MiB
             Set Ma...      6   4.01ms    5.7%   669μs     0.00B    0.0%    0.00B
           Column M...      6    672μs    1.0%   112μs   2.65MiB    2.7%   452KiB
           Set Matrix       6    280μs    0.4%  46.6μs   4.92KiB    0.0%     840B
           Allocation       6    128μs    0.2%  21.3μs   2.65MiB    2.7%   452KiB
           Vectors          6   29.3μs    0.0%  4.88μs   19.5KiB    0.0%  3.26KiB
           Bounds           6   3.71μs    0.0%   618ns     0.00B    0.0%    0.00B
       DiffZonotope...      4   21.2ms   30.1%  5.30ms   4.09MiB    4.2%  1.02MiB
         Zonotope_D...      8   8.34ms   11.8%  1.04ms   2.69MiB    2.8%   345KiB
     Property Check         1   8.13μs    0.0%  8.13μs      992B    0.0%     992B
 Initialize                 1    594μs    0.8%   594μs   5.41MiB    5.6%  5.41MiB
 ────────────────────────────────────────────────────────────────────────────────
[VERYDIFF_TIMER] 0.101445863

[VERYDIFF_EXPERIMENT] Running on /home/i57/steuber/NeuroDiff/repos/VeryDiffExperiments/src/../benchmarks/mnist-prune/specs/mnist_12_global_3.vnnlib /home/i57/steuber/NeuroDiff/repos/VeryDiffExperiments/src/../benchmarks/mnist-prune/nets/mnist_relu_4_1024.onnx
Found input X
op: matmul, weight: (1024, 784), bias: nothing
op: bias, weight: nothing, bias: (1024,)
op: relu, weight: nothing, bias: nothing
op: matmul, weight: (1024, 1024), bias: nothing
op: bias, weight: nothing, bias: (1024,)
op: relu, weight: nothing, bias: nothing
op: matmul, weight: (1024, 1024), bias: nothing
op: bias, weight: nothing, bias: (1024,)
op: relu, weight: nothing, bias: nothing
op: matmul, weight: (10, 1024), bias: nothing
op: bias, weight: nothing, bias: (10,)
op: relu, weight: nothing, bias: nothing
op: matmul, weight: (10, 10), bias: nothing
op: bias, weight: nothing, bias: (10,)
Found input X
op: matmul, weight: (1024, 784), bias: nothing
op: bias, weight: nothing, bias: (1024,)
op: relu, weight: nothing, bias: nothing
op: matmul, weight: (1024, 1024), bias: nothing
op: bias, weight: nothing, bias: (1024,)
op: relu, weight: nothing, bias: nothing
op: matmul, weight: (1024, 1024), bias: nothing
op: bias, weight: nothing, bias: (1024,)
op: relu, weight: nothing, bias: nothing
op: matmul, weight: (10, 1024), bias: nothing
op: bias, weight: nothing, bias: (10,)
op: relu, weight: nothing, bias: nothing
op: matmul, weight: (10, 10), bias: nothing
op: bias, weight: nothing, bias: (10,)
Distance: 1266.8815759184893
Distance: 2876.6944248261216
Distance: 2831.8843567411013
Distance: 34.033756025192815
Distance: 0.0
Running with 1 threads
[Thread 1] Time to first task: 0.01s
Instable Generators: 211
Instable Generators: 328
Instable Generators: 639
Instable Generators: 8
Zono Bounds:
[-16.816143742200858, -16.39143215834717, -20.533820250537932, -18.63692350060201, -18.702642214596708, -20.937767959012554, 0.0, -20.060234891068554, -18.289374403268603, -11.66534011336639]
[14.590113131277192, 16.39143215834717, 15.572471820518263, 18.636923500602002, 18.702642214596708, 16.264257495604973, 0.0, 20.060234891068554, 18.289374403268603, 23.700523614912463]

Found counterexample: ([0.0, 0.0, 0.0, 0.01176471, 0.0, 0.01176471, 0.0, 0.0, 0.01176471, 0.01176471, 0.01176471, 0.0, 0.0, 0.01176471, 0.01176471, 0.0, 0.0, 0.01176471, 0.01176471, 0.0, 0.0, 0.0, 0.0, 0.01176471, 0.0, 0.0, 0.0, 0.01176471, 0.0, 0.0, 0.0, 0.0, 0.01176471, 0.0, 0.0, 0.0, 0.0, 0.0, 0.01176471, 0.0, 0.0, 0.0, 0.0, 0.0, 0.0, 0.01176471, 0.0, 0.0, 0.0, 0.0, 0.0, 0.0, 0.01176471, 0.0, 0.01176471, 0.01176471, 0.0, 0.0, 0.0, 0.0, 0.0, 0.01176471, 0.0, 0.01176471, 0.0, 0.01176471, 0.0, 0.0, 0.01176471, 0.0, 0.01176471, 0.0, 0.0, 0.0, 0.01176471, 0.01176471, 0.01176471, 0.0, 0.0, 0.01176471, 0.0, 0.0, 0.01176471, 0.0, 0.0, 0.0, 0.0, 0.01176471, 0.0, 0.0, 0.01176471, 0.01176471, 0.01176471, 0.0, 0.01176471, 0.01176471, 0.01176471, 0.01176471, 0.01176471, 0.01176471, 0.01176471, 0.0, 0.0, 0.01176471, 0.0, 0.0, 0.0, 0.01176471, 0.01176471, 0.01176471, 0.0, 0.01176471, 0.01176471, 0.01176471, 0.01176471, 0.0, 0.0, 0.0, 0.0, 0.0, 0.01176471, 0.01176471, 0.01176471, 0.01176471, 0.01176471, 0.01176471, 0.01176471, 0.01176471, 0.01176471, 0.01176471, 0.01176471, 0.01176471, 0.01176471, 0.0, 0.0, 0.0, 0.0, 0.0, 0.0, 0.0, 0.0, 0.0, 0.01176471, 0.01176471, 0.0, 0.01176471, 0.01176471, 0.01176471, 0.01176471, 0.01176471, 0.01176471, 0.01176471, 0.01176471, 0.01176471, 0.01176471, 0.01176471, 0.01176471, 0.01176471, 0.0, 0.01176471, 0.01176471, 0.01176471, 0.01176471, 0.01176471, 0.0, 0.0, 0.0, 0.0, 0.0, 0.0, 0.0, 0.01176471, 0.01176471, 0.01176471, 0.01176471, 0.01176471, 0.01176471, 0.01176471, 0.01176471, 0.01176471, 0.01176471, 0.01176471, 0.01176471, 0.01176471, 0.0, 0.0, 0.0, 0.0, 0.0, 0.01176471, 0.01176471, 0.01176471, 0.01176471, 0.0, 0.0, 0.0, 0.01176471, 0.0, 0.01176471, 0.01176471, 0.01176471, 0.01176471, 0.01176471, 0.01176471, 0.01176471, 0.01176471, 0.0, 0.01176471, 0.20392157000000002, 0.69411767, 1.0, 0.98823529, 0.98039216, 0.65098041, 0.12941177, 0.03137255, 0.28627452, 0.04705882, 0.01176471, 0.0, 0.0, 0.0, 0.0, 0.0, 0.0, 0.0, 0.0, 0.0, 0.01176471, 0.01176471, 0.01176471, 0.01176471, 0.01176471, 0.01176471, 0.00784314, 0.25490198, 0.9058823600000001, 0.9999999999999999, 0.9999999999999999, 0.98039216, 0.97647059, 0.97647059, 0.6156863, 0.72941178, 1.0, 0.37254903000000006, 0.01176471, 0.01176471, 0.0, 0.0, 0.01176471, 0.0, 0.0, 0.01176471, 0.01176471, 0.0, 0.01176471, 0.01176471, 0.01176471, 0.01176471, 0.0, 0.0, 0.20392157, 0.97647059, 0.9999999999999999, 0.9019607899999998, 0.32156864000000007, 0.28235295, 0.28235295, 0.40392157000000006, 0.36470589, 0.93725491, 0.9803921600000001, 0.27450981999999996, 0.01176471, 0.01176471, 0.01176471, 0.01176471, 0.0, 0.0, 0.01176471, 0.0, 0.0, 0.01176471, 0.01176471, 0.01176471, 0.01176471, 0.01176471, 0.0, 0.15686275, 0.9254902, 0.9999999999999999, 0.73725492, 0.20784313999999998, 0.01176471, 0.01176471, 0.01176471, 0.11372549, 0.8078431500000001, 0.9999999999999999, 0.5411764999999998, 0.01176471, 0.01176471, 0.01176471, 0.01176471, 0.0, 0.0, 0.01176471, 0.0, 0.01176471, 0.0, 0.0, 0.01176471, 0.01176471, 0.01176471, 0.01176471, 0.0, 0.64705884, 1.0, 0.7098039399999999, 0.15686275000000002, 0.01176471, 0.01176471, 0.01176471, 0.0, 0.26274511, 0.9999999999999999, 0.9999999999999999, 0.25882354, 0.01176471, 0.0, 0.01176471, 0.01176471, 0.0, 0.0, 0.0, 0.0, 0.0, 0.0, 0.01176471, 0.01176471, 0.01176471, 0.01176471, 0.01176471, 0.6196078700000001, 0.98039216, 0.93725491, 0.17647058999999998, 0.01176471, 0.0, 0.0, 0.0, 0.03137255, 0.73725492, 0.98039216, 0.73333335, 0.0, 0.0, 0.0, 0.0, 0.01176471, 0.0, 0.01176471, 0.01176471, 0.0, 0.01176471, 0.0, 0.0, 0.0, 0.0, 0.01176471, 0.0, 0.80000001, 0.9999999999999999, 0.89019608, 0.0, 0.0, 0.0, 0.0, 0.00784314, 0.52156866, 0.97647059, 0.97647059, 0.23921569, 0.0, 0.0, 0.01176471, 0.01176471, 0.01176471, 0.0, 0.01176471, 0.0, 0.01176471, 0.01176471, 0.0, 0.01176471, 0.0, 0.01176471, 0.01176471, 0.0, 0.80000001, 0.97647059, 0.89019608, 0.0, 0.0, 0.0, 0.11372549, 0.52941179, 0.97647059, 0.97647059, 0.87843138, 0.05098039, 0.0, 0.01176471, 0.01176471, 0.01176471, 0.01176471, 0.01176471, 0.0, 0.01176471, 0.0, 0.01176471, 0.0, 0.0, 0.0, 0.01176471, 0.01176471, 0.0, 0.63529414, 0.97647059, 0.96470588, 0.80000001, 0.80000001, 0.80000001, 0.88235295, 0.98039216, 0.97647059, 0.97647059, 0.6156863, 0.0, 0.01176471, 0.0, 0.0, 0.01176471, 0.01176471, 0.01176471, 0.01176471, 0.0, 0.0, 0.01176471, 0.0, 0.0, 0.01176471, 0.0, 0.0, 0.0, 0.04705882, 0.6901961, 0.98039216, 0.97647059, 0.97647059, 0.97647059, 0.9999999999999999, 0.28235295, 0.65098041, 0.97647059, 0.20784314, 0.01176471, 0.01176471, 0.01176471, 0.01176471, 0.01176471, 0.01176471, 0.01176471, 0.0, 0.0, 0.01176471, 0.0, 0.01176471, 0.0, 0.01176471, 0.01176471, 0.01176471, 0.0, 0.0, 0.01176471, 0.23921569, 0.44313726, 0.44313726, 0.3019608, 0.01176471, 0.5960784599999999, 0.98039216, 0.83137256, 0.09411765, 0.01176471, 0.01176471, 0.01176471, 0.01176471, 0.01176471, 0.01176471, 0.01176471, 0.0, 0.0, 0.01176471, 0.0, 0.0, 0.01176471, 0.01176471, 0.01176471, 0.01176471, 0.01176471, 0.01176471, 0.01176471, 0.0, 0.01176471, 0.01176471, 0.01176471, 0.01176471, 1.0, 0.9999999999999999, 0.62352943, 0.01176471, 0.01176471, 0.01176471, 0.01176471, 0.01176471, 0.01176471, 0.01176471, 0.01176471, 0.0, 0.0, 0.01176471, 0.01176471, 0.0, 0.01176471, 0.01176471, 0.01176471, 0.01176471, 0.01176471, 0.01176471, 0.01176471, 0.01176471, 0.01176471, 0.01176471, 0.01176471, 0.13725491, 1.0, 0.95294118, 0.18431373, 0.0, 0.01176471, 0.01176471, 0.01176471, 0.01176471, 0.01176471, 0.01176471, 0.0, 0.0, 0.0, 0.0, 0.0, 0.01176471, 0.01176471, 0.01176471, 0.0, 0.01176471, 0.01176471, 0.01176471, 0.01176471, 0.01176471, 0.01176471, 0.01176471, 0.01176471, 0.6274509999999999, 1.0, 0.6549019799999999, 0.01176471, 0.01176471, 0.01176471, 0.01176471, 0.01176471, 0.01176471, 0.01176471, 0.01176471, 0.0, 0.0, 0.0, 0.0, 0.0, 0.01176471, 0.0, 0.01176471, 0.01176471, 0.01176471, 0.0, 0.01176471, 0.01176471, 0.01176471, 0.01176471, 0.01176471, 0.18039215999999997, 0.95294118, 1.0, 0.37254903000000006, 0.01176471, 0.01176471, 0.01176471, 0.01176471, 0.01176471, 0.01176471, 0.01176471, 0.01176471, 0.0, 0.0, 0.0, 0.0, 0.0, 0.0, 0.0, 0.0, 0.0, 0.01176471, 0.01176471, 0.01176471, 0.01176471, 0.01176471, 0.01176471, 0.01176471, 0.3764706, 0.98039216, 0.9999999999999999, 0.34117647999999995, 0.01176471, 0.01176471, 0.01176471, 0.0, 0.01176471, 0.01176471, 0.01176471, 0.01176471, 0.0, 0.0, 0.01176471, 0.0, 0.0, 0.0, 0.01176471, 0.01176471, 0.01176471, 0.0, 0.0, 0.01176471, 0.01176471, 0.01176471, 0.01176471, 0.01176471, 0.45882353, 0.9999999999999999, 0.83137256, 0.01176471, 0.01176471, 0.01176471, 0.01176471, 0.0, 0.01176471, 0.0, 0.01176471, 0.0, 0.01176471, 0.0, 0.01176471, 0.01176471, 0.0, 0.0, 0.0, 0.01176471, 0.0, 0.0, 0.0, 0.0, 0.01176471, 0.0, 0.0, 0.01176471, 0.80000001, 0.9999999999999999, 0.46666667000000006, 0.01176471, 0.01176471, 0.01176471, 0.01176471, 0.0, 0.0, 0.0, 0.01176471, 0.0, 0.0, 0.0, 0.0, 0.0, 0.0, 0.0, 0.0, 0.0, 0.0, 0.01176471, 0.0, 0.0, 0.0, 0.0, 0.0, 0.0, 0.63529414, 0.97647059, 0.44313726, 0.0, 0.0, 0.0, 0.0, 0.0, 0.0, 0.01176471, 0.0, 0.0, 0.0, 0.01176471, 0.0, 0.01176471, 0.0, 0.0, 0.0, 0.0, 0.0, 0.0, 0.0, 0.0, 0.0, 0.0, 0.0, 0.0, 0.35294119, 0.77254903, 0.23529412, 0.0, 0.0, 0.0, 0.0, 0.0, 0.0, 0.0, 0.0, 0.0, 0.01176471, 0.01176471, 0.0, 0.0, 0.0, 0.0, 0.0, 0.01176471, 0.0, 0.01176471, 0.0, 0.01176471, 0.0, 0.01176471, 0.0, 0.0, 0.0, 0.0, 0.01176471, 0.0, 0.0, 0.01176471, 0.0, 0.01176471, 0.0, 0.01176471, 0.0, 0.0, 0.0, 0.01176471, 0.01176471], ([0.0, 2.269158451608372, 0.0, 5.299319982415864, 1.147930562108011, 0.0, 0.0, 11.546836169595885, 0.0, 21.973109387840797], [0.0, 1.6014890442359784, 0.0, 5.293775950036238, 0.0, 0.0, 0.0, 8.960148818384676, 0.0, 16.999903369347244], 5.401159986014054))
[Thread 1] Total splits: 0
Processed 1 zonotopes (Work Done: 0.0%); Generated 0 (1.907684892s/loop)
[Thread 1] Finished in 1.91s
 ────────────────────────────────────────────────────────────────────────────────
                                        Time                    Allocations      
                               ───────────────────────   ────────────────────────
       Tot / % measured:            1.93s / 100.0%            513MiB / 100.0%    

 Section               ncalls     time    %tot     avg     alloc    %tot      avg
 ────────────────────────────────────────────────────────────────────────────────
 Verify                     1    1.91s   99.0%   1.91s    486MiB   94.7%   486MiB
   Zonotope Loop            1    1.91s   99.0%   1.91s    486MiB   94.7%   486MiB
     Zonotope Propa...      1    1.88s   97.6%   1.88s    465MiB   90.7%   465MiB
       DiffZonotope...      4    1.16s   60.4%   291ms    378MiB   73.8%  94.5MiB
         Zonotope_R...      8    771ms   40.0%  96.3ms    311MiB   60.6%  38.8MiB
           Influenc...      8    641ms   33.2%  80.1ms    174MiB   33.9%  21.7MiB
             Multiply       8    374ms   19.4%  46.7ms   97.7MiB   19.1%  12.2MiB
             Alloca...      8    255ms   13.3%  31.9ms   76.1MiB   14.8%  9.51MiB
             Set Ma...      8   11.5ms    0.6%  1.44ms     0.00B    0.0%    0.00B
           Allocation       8   79.0ms    4.1%  9.87ms   68.3MiB   13.3%  8.53MiB
           Column M...      8   39.2ms    2.0%  4.90ms   68.3MiB   13.3%  8.53MiB
           Set Matrix       8   11.5ms    0.6%  1.43ms   67.2KiB    0.0%  8.41KiB
           Vectors          8    233μs    0.0%  29.1μs    272KiB    0.1%  34.0KiB
           Bounds           8   5.72μs    0.0%   714ns     0.00B    0.0%    0.00B
       DiffZonotope...      5    717ms   37.2%   143ms   86.7MiB   16.9%  17.3MiB
         Zonotope_D...     10    355ms   18.4%  35.5ms   49.6MiB    9.7%  4.96MiB
     Property Check         1   11.1ms    0.6%  11.1ms    543KiB    0.1%   543KiB
 Initialize                 1   19.6ms    1.0%  19.6ms   27.0MiB    5.3%  27.0MiB
 ────────────────────────────────────────────────────────────────────────────────
[VERYDIFF_TIMER] 2.021263441

[VERYDIFF_EXPERIMENT] NETWORK: /home/i57/steuber/NeuroDiff/repos/VeryDiffExperiments/src/../benchmarks/mnist-prune/specs/mnist_12_global_3.vnnlib
[VERYDIFF_EXPERIMENT] TIME: 3.264399349
