
[VERYDIFF_EXPERIMENT] Running on /home/i57/steuber/NeuroDiff/repos/VeryDiffExperiments/src/../benchmarks/mnist-prune/specs/mnist_2_global_3.vnnlib /home/i57/steuber/NeuroDiff/repos/VeryDiffExperiments/src/../benchmarks/mnist-prune/nets/mnist_relu_3_100.onnx
Total difference: 419.1098
Average difference: 0.0047
Initial output delta:
[-0.000604 -0.681224 -0.822000 -0.658342 -0.781162 -0.732178 -0.674415 -0.744135 -0.594697 -0.671820 ]
[0.000436 0.718092 0.634910 0.667675 0.720926 0.861613 0.794084 0.680686 0.603240 0.749047 ]

No adv!
time: 0.127856 


numSplits: 0
setenv(`timeout -k 5 120 ../NeuroDiff/DiffNN-Code/delta_network_test 402 /home/i57/steuber/NeuroDiff/repos/VeryDiffExperiments/src/../benchmarks/mnist-prune/nets/mnist_relu_3_100.nnet /home/i57/steuber/NeuroDiff/repos/VeryDiffExperiments/src/../benchmarks/mnist-prune/nets_pruned/mnist_relu_3_100_0.79_adam_1_stepsize.nnet 1.0 -p 3`,["OMP_NUM_THREADS=1"])
[VERYDIFF_TIMER] 0.18719144

[VERYDIFF_EXPERIMENT] NETWORK: /home/i57/steuber/NeuroDiff/repos/VeryDiffExperiments/src/../benchmarks/mnist-prune/specs/mnist_2_global_3.vnnlib
[VERYDIFF_EXPERIMENT] TIME: 0.415301152
