forecast_date,target,horizon,q0.025,q0.25,q0.5,q0.75,q0.975
2021-12-01,DAX,1 day,-3.512197545776153,-1.1581944207401729,0.0769536182841992,1.312101657308571,3.666104782344551
2021-12-01,DAX,2 day,-4.148306525706457,-1.3114091470824871,0.1771140400170284,1.665637227116544,4.502534605740512
2021-12-01,DAX,5 day,-6.737112012030301,-2.121633535979845,0.3001131168695573,2.7218597697189595,7.3373382457694145
2021-12-01,DAX,6 day,-7.973055919533287,-2.488924847721266,0.3886047813006638,3.2661344103225933,8.750265482134614
2021-12-01,DAX,7 day,-7.86099198951175,-2.359258336872388,0.5275073857466234,3.414273108365635,8.916006761004994
2021-12-01,temperature,36 hour,0.6214257590509877,2.1095125635157617,2.890313352981416,3.6711141424470695,5.159200946911843
2021-12-01,temperature,48 hour,-2.6209132326764446,-1.2426662406473186,-0.5194985220530645,0.2036691965411896,1.5819161885703157
2021-12-01,temperature,60 hour,0.0575436900928658,1.7187272337678363,2.5903520734325403,3.461976913097244,5.123160456772214
2021-12-01,temperature,72 hour,-1.1364607285219253,0.5623027068582752,1.453645757196872,2.344988807535469,4.0437522429156685
2021-12-01,temperature,84 hour,-1.166925654805262,1.209274470059731,2.4560692994045747,3.702864128749418,6.07906425361441
2021-12-01,wind,36 hour,11.902804914455857,17.39139679113536,20.27126700939693,23.1511372276585,28.639729104338
2021-12-01,wind,48 hour,6.958082697591305,10.388267019558718,12.188088520944971,13.987910022331228,17.41809434429864
2021-12-01,wind,60 hour,12.448951501730368,16.320804086803523,18.352369413536664,20.383934740269805,24.25578732534296
2021-12-01,wind,72 hour,7.90471278403961,12.200172190841588,14.454004484687488,16.707836778533387,21.003296185335365
2021-12-01,wind,84 hour,6.320346571354008,12.06148337983343,15.073864202673509,18.086245025513584,23.827381833993
