"forecast_date","target","horizon","q0.025","q0.25","q0.5","q0.75","q0.975"
2021-11-03,"temperature","36 hour",6.31578327832365,7.63136770881847,8.32165631218293,9.01194491554739,10.3275293460422
2021-11-03,"temperature","48 hour",6.24817763140052,7.64982543943644,8.38527159202891,9.12071774462139,10.5223655526573
2021-11-03,"temperature","60 hour",7.99191374474882,9.47950938907917,10.26005246628,11.0405955434807,12.5281911878111
2021-11-03,"temperature","72 hour",5.04263139276858,6.62238374637901,7.45128155069957,8.28017935502012,9.85993170863055
2021-11-03,"temperature","84 hour",8.14333994465985,10.0304614356028,11.0206361656824,12.0108108957619,13.8979323867049
