forecast_date,target,horizon,q0.025,q0.25,q0.5,q0.75,q0.975
2021-11-03,DAX,1 day,-2.502640902391917,-0.4235770875624212,0.0696381082290642,0.6627417069314134,2.5005982680463883
2021-11-03,DAX,2 day,-3.361831777923019,-0.5199007182918436,0.1291483558230055,0.9415601371104644,3.0754940554004926
2021-11-03,DAX,5 day,-4.125922300295351,-0.6584717727749378,0.1932045629530421,1.222135153060755,4.133468767504149
2021-11-03,DAX,6 day,-4.360374244446419,-0.7784084627751042,0.2189648390112708,1.435681215853002,4.981766881136725
2021-11-03,DAX,7 day,-5.036158177974439,-0.6332176376064425,0.3868668182683166,1.4048997195864388,6.295733117847581
2021-11-03,temperature,36 hour,6.412711,7.664834,8.321825,8.978815,10.230938
2021-11-03,temperature,48 hour,6.356177,7.6872,8.385589,9.083978,10.415001
2021-11-03,temperature,60 hour,8.035087,9.494428,10.260145,11.025862,12.485203
2021-11-03,temperature,72 hour,5.052141,6.625657,7.451283,8.276908,9.850424
2021-11-03,temperature,84 hour,8.152697,10.033672,11.020621,12.007571,13.888546
2021-11-03,wind,36 hour,9.003304,14.225074,16.964943,19.704812,24.926582
2021-11-03,wind,48 hour,6.200433,13.377787,17.143753,20.909719,28.087073
2021-11-03,wind,60 hour,9.654247,13.864154,16.073096,18.282039,22.491946
2021-11-03,wind,72 hour,6.886109,11.700698,14.226918,16.753138,21.567727
2021-11-03,wind,84 hour,10.12227,14.97762,17.52523,20.07284,24.92819
