"forecast_date","target","horizon","q0.025","q0.25","q0.5","q0.75","q0.975"
2022-01-12,"DAX","1 day",-1.72067912872058,-0.264623659850475,0.143079910328381,0.523827914773825,1.48798741499469
2022-01-12,"DAX","2 day",-2.46423471997006,-0.509384889593704,0.14981929941955,0.781309603467141,2.08031316310336
2022-01-12,"DAX","5 day",-3.1509780900486,-0.692722574923864,0.214875849657393,1.02742180847055,2.60007098251593
2022-01-12,"DAX","6 day",-3.70301348211465,-0.837088812667236,0.230014560039088,1.1472054654837,2.99655976056734
2022-01-12,"DAX","7 day",-4.21895961425219,-0.928081631312724,0.272140630304767,1.25216447626163,3.37704804175624
2022-01-12,"temperature","36 hour",3.13963780876279,4.59972064292345,5.48436827305818,6.34611397459425,7.85766832554336
2022-01-12,"temperature","48 hour",3.96767329924897,5.22118489918212,5.89659222989052,6.55741839066554,8.11526699373094
2022-01-12,"temperature","60 hour",3.45410124287514,4.97147193954739,5.8382263788906,6.73492772668716,8.32908373620924
2022-01-12,"temperature","72 hour",1.92605478792447,3.93008572654146,4.95162932911295,5.89065946917541,7.79771015493361
2022-01-12,"temperature","84 hour",1.81924418296181,4.0279445032529,5.2022991337458,6.44323169684345,8.6922689419798
2022-01-12,"wind","36 hour",14.2127853392953,18.8540173644983,21.1539924222766,23.4772252359091,28.3513890022495
2022-01-12,"wind","48 hour",13.5411851911917,17.9762724775006,20.9462213136613,23.6750304612365,29.2863263529892
2022-01-12,"wind","60 hour",14.2659666062249,19.6808749167827,22.4726226538315,25.1581099424159,30.577506134198
2022-01-12,"wind","72 hour",6.12478550940355,10.1780842092749,12.1957200567808,14.9803966615356,19.9116349427185
2022-01-12,"wind","84 hour",4.76397195484169,9.20244377426077,11.4327176213859,13.7055471442067,19.4235110863445
