forecast_date,target,horizon,q0.025,q0.25,q0.5,q0.75,q0.975
2021-11-03,DAX,1 day,-2.04976467492226,-0.348449403815085,0.0329080399575071,0.464977819239363,1.69723920663692
2021-11-03,DAX,2 day,-2.74250521734635,-0.445506325285446,0.0967575884315395,0.666021481043876,2.07268420762909
2021-11-03,DAX,5 day,-3.35930731575883,-0.648441179893353,0.148320949455241,0.927472366959349,2.27207330148471
2021-11-03,DAX,6 day,-3.73482481016929,-0.706718227409423,0.186414324572953,1.09624265926181,2.56430929859925
2021-11-03,DAX,7 day,-4.07596663251004,-0.74928617170252,0.25066085746804,1.27325071819635,2.91533499672229
2021-11-03,temperature,36 hour,6.31578327832365,7.63136770881847,8.32165631218293,9.01194491554739,10.3275293460422
2021-11-03,temperature,48 hour,6.24817763140052,7.64982543943644,8.38527159202891,9.12071774462139,10.5223655526573
2021-11-03,temperature,60 hour,7.99191374474882,9.47950938907917,10.26005246628,11.0405955434807,12.5281911878111
2021-11-03,temperature,72 hour,5.04263139276858,6.62238374637901,7.45128155069957,8.28017935502012,9.85993170863055
2021-11-03,temperature,84 hour,8.14333994465985,10.0304614356028,11.0206361656824,12.0108108957619,13.8979323867049
2021-11-03,wind,36 hour,8.45411165612409,14.0415233492364,16.9745660671664,19.9077409524097,25.4980328480232
2021-11-03,wind,48 hour,4.79793300782167,12.8453932405484,17.2346028794432,21.6418262189472,30.0563565306699
2021-11-03,wind,60 hour,9.24080697326821,13.7321648856895,16.0888315844708,18.4455029036225,22.9369615803238
2021-11-03,wind,72 hour,5.82782943773967,11.4213925132652,14.3705723994401,17.3211881648055,22.9458006470541
2021-11-03,wind,84 hour,9.6368131081246,14.8244535676967,17.5465921746853,20.2687485612698,25.456776739405
