"forecast_date","target","horizon","q0.025","q0.25","q0.5","q0.75","q0.975"
2022-01-12,"temperature","36 hour",3.92725,4.5625,5.095,5.8525,6.943
2022-01-12,"temperature","48 hour",3.499,4.335,5.15,5.6625,6.1695
2022-01-12,"temperature","60 hour",4.443,5.035,5.715,6.1125,7.1115
2022-01-12,"temperature","72 hour",0.78975,3.535,4.485,5.36,6.37075
2022-01-12,"temperature","84 hour",1.063,3.52,5.04,5.855,7.117
