"forecast_date","target","horizon","q0.025","q0.25","q0.5","q0.75","q0.975"
2021-12-08,"DAX","1 day",-1.62805854423804,-0.33320918250882,0.235678872419067,0.722654243758806,1.89296919820558
2021-12-08,"DAX","2 day",-4.32104713430258,-1.75169561261103,0.907602535762146,2.83335101578053,4.62385642501613
2021-12-08,"DAX","5 day",-4.8408331772221,-1.78249184298892,0.385457974959172,2.39462637302957,5.4398907912425
2021-12-08,"DAX","6 day",-5.34060635366716,-2.00746302853719,0.183862615865656,2.24852794931596,5.86045756999967
2021-12-08,"DAX","7 day",-5.68912646769633,-2.17599793921897,0.0158857384234578,2.21866532941907,6.23515242725801
2021-12-08,"temperature","36 hour",-1.7406967079882,-0.534163435819755,-0.0330219038645739,0.802472613465215,2.72204754484332
2021-12-08,"temperature","48 hour",-2.28727606824987,-1.31418805514713,-0.865786630368894,-0.0167605705908032,1.70319012808742
2021-12-08,"temperature","60 hour",-0.489728637640329,0.917925201983224,1.45552199462118,2.38744698133939,4.35005242936573
2021-12-08,"temperature","72 hour",-2.59119327528758,-1.48990374683831,-0.90696133819838,0.0503062912852344,1.94765367935057
2021-12-08,"temperature","84 hour",-1.39799832254628,0.0041232057827044,0.843598470975849,2.00095257077309,4.38346267920634
2021-12-08,"wind","36 hour",4.05245666004964,8.00964421830175,10.1468356053068,12.119361857691,15.3356088204693
2021-12-08,"wind","48 hour",3.3688499579167,6.25552965055191,7.74404554057583,9.5144131263648,14.0148703587648
2021-12-08,"wind","60 hour",3.31987714986178,7.36509468024611,10.0568745405792,12.2820303848666,15.5669984388735
2021-12-08,"wind","72 hour",2.82826079570641,5.57308456844948,7.24693023250438,9.25621888530259,14.1687629983725
2021-12-08,"wind","84 hour",3.69499309594008,7.16414421427344,9.58330879113637,11.95217166245,16.357171783807
