"forecast_date","target","horizon","q0.025","q0.25","q0.5","q0.75","q0.975"
"2022-01-12","DAX","1 day",-2.71099410396365,-0.496172661875782,0.0754703798988565,0.667302552216587,2.43822167008952
"2022-01-12","DAX","2 day",-3.93656249759128,-0.748017337438078,0.16366619333823,0.924420302130136,3.1329715130069
"2022-01-12","DAX","5 day",-4.75944674725471,-0.846163184392834,0.170139635921451,1.20953097840677,3.89032640718187
"2022-01-12","DAX","6 day",-5.24615804417818,-0.968345906220103,0.23998729150474,1.40651637752689,4.57407374600166
"2022-01-12","DAX","7 day",-5.75308316717284,-1.10420987852282,0.388792428974138,1.4963419076008,5.19223708311003
