"forecast_date","target","horizon","q0.025","q0.25","q0.5","q0.75","q0.975"
"2021-11-03","DAX","1 day",-2.65844263691718,-0.481709571803846,0.0733950537846084,0.662320554605333,2.22946787319034
"2021-11-03","DAX","2 day",-3.76658704113496,-0.732473649417953,0.142980430012329,0.907244580165889,3.10108794007109
"2021-11-03","DAX","5 day",-4.73040567059547,-0.81103402646141,0.16179836626895,1.18916624608452,3.89032640718187
"2021-11-03","DAX","6 day",-5.23203014061953,-0.933589441129046,0.219661627911449,1.39266918407004,4.57407374600166
"2021-11-03","DAX","7 day",-5.68685922947709,-1.06110544198859,0.357564327371396,1.47103419000207,5.19223708311003
