"","forecast_date","target","horizon","q0.025","q0.25","q0.5","q0.75","q0.975"
"1",2021-12-08,"DAX","1 day",-2.768865,-0.603312312944606,0.0754703763075959,0.807759199764219,2.57699054200194
"2",2021-12-08,"DAX","2 day",-3.93656249759128,-0.84819557625469,0.15394269408694,1.0837719699674,3.36686463031345
"3",2021-12-08,"temperature","36 hour",-2.08156151450643,-0.674992678788349,0.0254181275219436,0.776912409845149,2.13239776955032
"4",2021-12-08,"wind","36 hour",4.02703437278741,7.70408201471338,9.80434606950001,12.0439877601441,16.3919425816836
"5",2021-12-08,"temperature","48 hour",-2.28336714806728,-0.833818911486068,-0.181940154456182,0.5895116881887,2.06266262985408
"6",2021-12-08,"wind","48 hour",2.17448278863993,5.73631677869149,7.73821370222319,10.1165451587023,14.7191620289369
"7",2021-12-08,"DAX","5 day",-4.75944674725471,-0.834726688584375,0.30253451779415,1.75411092200915,4.30744297622689
"8",2021-12-08,"DAX","6 day",-5.24615804417818,-1.1148874590796,0.293949359258868,1.76426738280055,4.69440506438463
"9",2021-12-08,"temperature","60 hour",-0.903059911299565,0.691889839863258,1.56711849242676,2.34282514728833,4.00693239137615
"10",2021-12-08,"wind","60 hour",3.29142561806484,7.17275861991654,9.33363176501911,11.655161215976,16.2214362775311
"11",2021-12-08,"DAX","7 day",-5.75308316717284,-1.10980931887409,0.392182685950626,1.89560391032554,5.28773680321487
"12",2021-12-08,"temperature","72 hour",-2.89461348068343,-1.23348322661081,-0.382227867128368,0.478143712361052,2.07479333403992
"13",2021-12-08,"wind","72 hour",1.41311811178148,5.16804500349835,7.30113488426968,9.8925434965705,14.8867939524093
"14",2021-12-08,"temperature","84 hour",-1.7901312488341,-0.07518117620021,0.96267946037279,2.09991160232648,4.28523968144451
"15",2021-12-08,"wind","84 hour",1.85657692191401,6.07434812360776,8.80803136942312,11.6896296540153,17.2032786280462
