"forecast_date","target","horizon","q0.025","q0.25","q0.5","q0.75","q0.975"
"2022-01-26","DAX","1 day",-3.39502986438869,-0.835683465483633,0.24120258136373,1.38989040724575,3.64052622962764
"2022-01-26","DAX","2 day",-6.04324822425929,-1.23507688199716,0.343684780341811,1.81022921427266,4.12430172294229
"2022-01-26","DAX","5 day",-8.87179508855544,-1.6222494950386,0.485864949799198,2.0745738028974,4.8654629790012
"2022-01-26","DAX","6 day",-9.61679237464528,-1.68931987115957,0.539688662454601,2.51135906197328,5.61446525876403
"2022-01-26","DAX","7 day",-11.4832891920973,-1.92218422462786,0.61986414668342,2.73213595062882,6.13012262269716
"2022-01-26","temperature","36 hour",2.44205183816524,4.11386385136113,4.87270159637626,5.67821757668699,7.40928108613055
"2022-01-26","temperature","48 hour",2.84730787449948,4.31087816433908,5.06295089170499,5.75560324999556,7.22304807962597
"2022-01-26","temperature","60 hour",2.93940068789608,4.66364627534153,5.57197045120548,6.47558994959755,8.22388123966932
"2022-01-26","temperature","72 hour",-1.32439195090063,0.527640127649855,1.59834873301593,2.5306923682151,4.32091890982322
"2022-01-26","temperature","84 hour",1.83249703858889,4.41610149664003,6.09099182760752,7.38055270761827,10.2160450104824
"2022-01-26","wind","36 hour",16.6416754313528,21.7020532242825,24.2696059455876,27.1223781152757,32.488343288879
"2022-01-26","wind","48 hour",19.5927693930261,26.6672604255752,30.7514305015857,34.7497857363703,42.1569572832719
"2022-01-26","wind","60 hour",15.2397356210843,20.5509350124794,23.2290466361806,25.8020141823,30.5950260570048
"2022-01-26","wind","72 hour",5.23781222069582,10.8806805904695,13.6295782245395,17.2183064991125,24.7104777195507
"2022-01-26","wind","84 hour",15.163349841531,23.2537957855413,26.4389460183289,29.67180672442,35.3864307820444
