"","forecast_date","target","horizon","q0.025","q0.25","q0.5","q0.75","q0.975"
"1",2021-12-22,"DAX","1 day",-2.62847713519405,-0.551185627077631,0.076818920279843,0.659777823060824,2.43822167008952
"2",2021-12-22,"DAX","2 day",-3.20996967647327,-0.781605684597499,0.144730448714361,0.983926075798568,2.98839835168391
"3",2021-12-22,"temperature","36 hour",-1.70736066018778,-0.483069408685512,0.159317562854559,0.834350598508365,2.0259957858969
"4",2021-12-22,"wind","36 hour",4.18179372874462,8.27647869400778,10.4307715251782,12.5647995925881,16.7459918831878
"5",2021-12-22,"temperature","48 hour",-0.793161881131784,0.645318686544959,1.41611846258963,2.21723352639314,3.74403622868011
"6",2021-12-22,"wind","48 hour",3.61959123436033,8.28864793242765,11.0718682398434,14.3150779813004,20.5603369216196
"7",2021-12-22,"DAX","5 day",-3.96020727923732,-0.849379110212389,0.249591332379815,1.19032305218194,3.74283527557711
"8",2021-12-22,"DAX","6 day",-4.84120454610143,-0.968345906220103,0.237449183918059,1.39631925115538,3.8329701
"9",2021-12-22,"temperature","60 hour",-0.753560426713739,1.93800309215942,3.87419548678495,6.18777393139726,8.87458186600388
"10",2021-12-22,"wind","60 hour",3.33905430020515,11.1803753401612,18.0194480269572,23.7113466721126,35.1031615999521
"11",2021-12-22,"DAX","7 day",-5.4392962018744,-1.09294845009975,0.349359387491135,1.50194588699606,4.53424217189652
"12",2021-12-22,"temperature","72 hour",-3.29,-0.590098089887979,0.875913582515109,2.42074620769456,5.10860636132024
"13",2021-12-22,"wind","72 hour",2.28519904240412,6.9134772497575,9.82348231596372,12.9060431519472,19.2559695508775
"14",2021-12-22,"temperature","84 hour",-4.06066634498129,-1.43593410776647,-0.0416674053836062,1.44923592596002,4.3503602260938
"15",2021-12-22,"wind","84 hour",3.04857661404747,8.39711028406225,11.3729041236396,14.333691593912,20.0728627942803
