"","forecast_date","target","horizon","q0.025","q0.25","q0.5","q0.75","q0.975"
"1",2022-02-02,"DAX","1 day",-2.45083222797258,-0.528750012146389,0.107511664552371,0.858653286655315,2.39696542801489
"2",2022-02-02,"DAX","2 day",-3.53126730879416,-0.68007258057873,0.159347216909094,1.14421419884413,3.09277637726427
"3",2022-02-02,"temperature","36 hour",2.7045359177416,4.48693873160529,5.42216745618976,6.3253124268975,8.06026377825161
"4",2022-02-02,"wind","36 hour",5.11775303566522,9.36826471473421,11.61199,13.9114582448709,18.2270537325285
"5",2022-02-02,"temperature","48 hour",3.69794710471955,5.22203009159243,6.01973527474785,6.79953162124294,8.28570411113414
"6",2022-02-02,"wind","48 hour",4.66344863288274,8.49410565779406,10.9065832992153,13.2675575641935,17.9269166312747
"7",2022-02-02,"DAX","5 day",-4.16494303131489,-0.747205386736922,0.293509518990146,1.36998409169237,3.80877221819307
"8",2022-02-02,"DAX","6 day",-4.54857332281886,-0.86515336379023,0.273654022013487,1.59253747082459,4.31364544034655
"9",2022-02-02,"temperature","60 hour",5.5427776331554,7.06766679300293,7.96969077318202,8.8355127465662,10.3879827374573
"10",2022-02-02,"wind","60 hour",11.3679420909175,16.08,19.1170513009303,21.9228662357012,27.3584421842876
"11",2022-02-02,"DAX","7 day",-4.99783703038041,-1.00614197536878,0.413227502754161,1.71949380825547,4.72119601308192
"12",2022-02-02,"temperature","72 hour",1.01198986175854,2.86942035594412,3.85833365240659,4.81861201853574,6.67604251272132
"13",2022-02-02,"wind","72 hour",11.9536962766266,17.1346071201433,19.9063714831002,23.3532386342862,29.0065321928057
"14",2022-02-02,"temperature","84 hour",2.65741795128868,4.47092294889662,5.55812072753906,6.50276096627887,8.50211046305246
"15",2022-02-02,"wind","84 hour",15.8026919065807,21.9570628378277,25.1682976942369,28.0700973801666,33.5411090848847
