"forecast_date","target","horizon","q0.025","q0.25","q0.5","q0.75","q0.975"
2021-12-22,"DAX","1 day",-2.62847713519405,-0.465174008439681,0.0836221978629551,0.659777823060824,2.31973245681129
2021-12-22,"DAX","2 day",NA,NA,NA,NA,NA
2021-12-22,"DAX","5 day",-3.5787139069209,-0.69253546927848,0.142147681025153,0.917977560254956,3.13397548296989
2021-12-22,"DAX","6 day",-4.37925046335393,-0.803988178062824,0.192987563255431,1.20019908815787,3.97698477677204
2021-12-22,"DAX","7 day",-4.97378632564876,-0.912826483873455,0.248172585452084,1.38867953070102,4.53424217189652
2021-12-22,"temperature","36 hour",-2.4966838825,-0.7410225275,-0.014810286,0.721752945,2.18440829
2021-12-22,"temperature","48 hour",-0.82960857,0.551399775,1.19206165,1.988720875,3.3956600825
2021-12-22,"temperature","60 hour",1.31369978,2.913955125,3.78833745,4.5746227,6.5101471825
2021-12-22,"temperature","72 hour",-1.4714964625,0.062972342,0.832235625,1.6402998,3.1522055425
2021-12-22,"temperature","84 hour",-2.6617146475,-0.5058097425,0.47624805,1.64670375,3.8215772475
2021-12-22,"wind","36 hour",0.701874965,6.00870325,8.9400685,11.5270785,16.8917496
2021-12-22,"wind","48 hour",0.340951001,5.9319005,9.3819395,13.105768375,20.5344552
2021-12-22,"wind","60 hour",4.6610038875,12.60206075,16.3077125,20.324997,29.954315275
2021-12-22,"wind","72 hour",1.190753225,8.1293345,12.44557775,16.16718875,23.06551535
2021-12-22,"wind","84 hour",0.031177217275,8.694984,13.0616385,16.47764575,28.886120925
