"forecast_date","target","horizon","q0.025","q0.25","q0.5","q0.75","q0.975"
2022-02-09,"wind","36 hour",7.22042891474558,14.1754863818178,17.8428256871708,21.5119827637084,28.5063416474456
2022-02-09,"wind","48 hour",3.42503255720826,10.3935222347299,14.2912908934198,18.216507394035,25.7204095592421
2022-02-09,"wind","60 hour",11.2318162831339,19.4745678831174,23.8038389956567,28.1335396168697,36.3856421710028
2022-02-09,"wind","72 hour",2.70547499058154,8.17528331042106,11.2318197449924,14.3095234088099,20.1929198217416
2022-02-09,"wind","84 hour",3.79255446560812,8.6449796598018,11.2330357425152,13.8254278545994,18.7697333765434
