"forecast_date","target","horizon","q0.025","q0.25","q0.5","q0.75","q0.975"
2021-12-15,"DAX","1 day",-2.87667479520319,-0.499672731593918,0.0909801702562127,0.688063738490503,2.39271843372761
2021-12-15,"DAX","2 day",-3.2593580622455,-0.455527236267494,0.0723551415036994,0.636056773774341,2.73309902750497
2021-12-15,"DAX","5 day",-4.40740786337242,-0.804033107221613,0.148208616137691,1.13741440666257,3.75424080883707
2021-12-15,"DAX","6 day",-5.30465527713619,-0.944068674847484,0.247013263618179,1.4757547009941,4.84564013291921
2021-12-15,"DAX","7 day",-5.42778181992567,-0.997157572867913,0.347180381028611,1.4757547009941,4.84564013291921
2021-12-15,"temperature","36 hour",6.75405198104024,8.16011859266744,8.89788329638356,9.63564800009967,11.0417146117269
2021-12-15,"temperature","48 hour",3.21454020481533,5.01630351845734,5.96169071865358,6.90707791884983,8.70884123249184
2021-12-15,"temperature","60 hour",4.23130380812897,6.10019890881931,7.08081023180752,8.06142155479574,9.93031665548608
2021-12-15,"temperature","72 hour",-1.03096570367771,1.92835270856277,3.48111034717961,5.03386798579646,7.99318639803694
2021-12-15,"temperature","84 hour",0.613323502324943,3.864824909902,5.57089128880386,7.27695766770572,10.5284590752828
2021-12-15,"wind","36 hour",8.90950537152506,12.9847323718975,15.1230271633983,17.2613238217304,21.3365915360542
2021-12-15,"wind","48 hour",6.41573484011716,11.5833824564172,14.2998182082176,17.0167519002576,22.1952242762163
2021-12-15,"wind","60 hour",7.83866107572062,12.1174327090262,14.3626794196469,16.6079431688223,20.8870863539034
2021-12-15,"wind","72 hour",1.56865148874991,6.22883125279099,9.04874267931344,11.9185566053424,17.4307233057337
2021-12-15,"wind","84 hour",3.12196606683951,9.7267543719942,13.4440650953068,17.1903636291751,24.3546030601243
