"forecast_date","target","horizon","q0.025","q0.25","q0.5","q0.75","q0.975"
2022-01-19,"temperature","36 hour",-0.422022305830656,1.15825893284716,1.98743424374658,2.81660955464599,4.39689079332381
2022-01-19,"temperature","48 hour",-2.94735728005821,-1.59452695260937,-0.884695385985768,-0.174863819362168,1.17796650808668
2022-01-19,"temperature","60 hour",-0.820655033818339,0.638105125594028,1.40351819201786,2.16893125844169,3.62769141785405
2022-01-19,"temperature","72 hour",-2.94876042282528,-0.429893585693804,0.89175862511153,2.21341083591687,4.73227767304834
2022-01-19,"temperature","84 hour",-1.47722057615227,1.96093889895927,3.76494497200652,5.56895104505376,9.00711052016531
