"forecast_date","target","horizon","q0.025","q0.25","q0.5","q0.75","q0.975"
"2021-11-10","DAX","1 day",-2.65844263691718,-0.478408853013734,0.0733950537846084,0.65948147757644,2.22946787319034
"2021-11-10","DAX","2 day",-3.76658704113496,-0.732473649417953,0.152264060287965,0.905783297834439,3.10108794007109
"2021-11-10","DAX","5 day",-4.73040567059547,-0.81103402646141,0.16179836626895,1.1996376118808,3.89032640718187
"2021-11-10","DAX","6 day",-5.23203014061953,-0.933589441129046,0.23998729150474,1.39631925115538,4.57407374600166
"2021-11-10","DAX","7 day",-5.68685922947709,-1.06110544198859,0.374569351209342,1.49206818774594,5.19223708311003
