"forecast_date","target","horizon","q0.025","q0.25","q0.5","q0.75","q0.975"
2022-01-19,"DAX","1 day",-2.50153322708216,-0.44530241490505,0.088094732199503,0.640434539166572,2.23665286855024
2022-01-19,"DAX","2 day",-3.39635649886787,-0.671222037314135,0.139804125195243,0.883569292744391,2.98147606194243
2022-01-19,"DAX","5 day",-4.20686386934892,-0.757909656600824,0.185286813749162,1.14945368757129,3.79933280517124
2022-01-19,"DAX","6 day",-4.68349755782234,-0.870804124941684,0.244598983348379,1.34046961527327,4.36187697955199
2022-01-19,"DAX","7 day",-5.23916153736198,-0.905073104474264,0.376735154760952,1.48082899016514,4.81329450847938
2022-01-19,"temperature","36 hour",0.0712194107350001,1.349771,1.96755625,2.575838525,3.933777385
2022-01-19,"temperature","48 hour",-2.89459321,-1.511293925,-0.78611201,-0.02916642275,1.6188437175
2022-01-19,"temperature","60 hour",-0.585151376,1.199213525,2.03010915,2.79575345,4.6535747175
2022-01-19,"temperature","72 hour",-1.7992419825,-0.04723330575,0.872261825,1.74973175,3.395729855
2022-01-19,"temperature","84 hour",0.78921271125,2.791989525,3.82184485,4.843370875,6.617544525
2022-01-19,"wind","36 hour",19.27941225,25.16232675,27.802988,30.66573675,36.75857875
2022-01-19,"wind","48 hour",8.9764395,15.65453675,18.8565125,21.6796085,27.999492725
2022-01-19,"wind","60 hour",9.548709325,15.12304175,17.6177465,20.4372675,25.763678575
2022-01-19,"wind","72 hour",1.46430044,8.475048,11.8671025,14.88341975,20.741047775
2022-01-19,"wind","84 hour",0.61470613075,9.0851605,12.292676,15.174631,21.682886225
