"model","target","horizon","forecast_date","q0.025","q0.25","q0.5","q0.75","q0.975","target_end_date","mean_qscore","ae"
"AryaStark","DAX","1 day",2022-01-19 23:59:00,-2.09748829319593,-0.494968299130705,0.0843650245495803,0.660683731997279,2.13942548161075,2022-01-20 17:30:00,0.270448572282395,0.562571157107651
"AryaStark","DAX","2 day",2022-01-19 23:59:00,-2.4677432223697,-0.580196734167172,0.143260354786434,0.8299678610587,2.4854798636918,2022-01-21 17:30:00,0.773441850025772,1.45379332537335
"AryaStark","DAX","5 day",2022-01-19 23:59:00,-3.2938381698719,-0.797054580126964,0.136659530446271,1.03986894962328,3.09814699451916,2022-01-24 17:30:00,3.82188754317589,5.31996006291352
"AryaStark","DAX","6 day",2022-01-19 23:59:00,-3.56073433101794,-0.917760878685969,0.0689994320686728,0.973698629525141,3.05902319155412,2022-01-25 17:30:00,2.912807865432,4.50406196892167
"AryaStark","DAX","7 day",2022-01-19 23:59:00,-4.03580174501565,-1.00144701165676,0.142811972826122,1.22072713347631,3.64250939209224,2022-01-26 17:30:00,1.27148574804345,2.38364802658703
"AryaStark","temperature","36 hour",2022-01-19 23:59:00,-0.287957112814635,1.25078884928693,2.05817055470304,2.86555226011916,4.40429822222072,2022-01-20 12:00:00,0.510543879445305,1.04182944529696
"AryaStark","temperature","48 hour",2022-01-19 23:59:00,-2.88940436361358,-1.59357849261838,-0.913657227240997,-0.233735961863614,1.06208990913159,2022-01-21 00:00:00,0.192767750354729,0.086342772759003
"AryaStark","temperature","60 hour",2022-01-19 23:59:00,-0.629186838423293,0.810102266324907,1.56529884886628,2.32049543140765,3.75978453615585,2022-01-21 12:00:00,0.247988800027322,0.26529884886628
"AryaStark","temperature","72 hour",2022-01-19 23:59:00,-2.85179770455523,-0.416873421479377,0.860734038522611,2.1383414985246,4.57326578160045,2022-01-22 00:00:00,1.34228871974759,2.53926596147739
"AryaStark","temperature","84 hour",2022-01-19 23:59:00,-1.0520016808663,2.06932818697552,3.70709341524135,5.34485864350717,8.46618851134899,2022-01-22 12:00:00,0.524153630623588,0.50709341524135
"AryaStark","wind","36 hour",2022-01-19 23:59:00,20.6047882525262,24.9626223466658,26.7906489852622,28.9786756238586,36.5765097179981,2022-01-20 12:00:00,3.05172249577812,5.6093510147378
"AryaStark","wind","48 hour",2022-01-19 23:59:00,11.2450443572321,15.3745245140702,17.9916265706694,20.6087286855711,24.7382101139534,2022-01-21 00:00:00,1.99253528635498,3.9683734293306
"AryaStark","wind","60 hour",2022-01-19 23:59:00,10.6246078785309,15.3826396226053,17.4969458531865,20.2112523023425,23.9372888134038,2022-01-21 12:00:00,1.99209798574815,4.1030541468135
"AryaStark","wind","72 hour",2022-01-19 23:59:00,4.64105126131961,10.5672866847983,12.8446201085281,16.3229719856155,22.0791999085211,2022-01-22 00:00:00,3.09983720060191,6.2353798914719
"AryaStark","wind","84 hour",2022-01-19 23:59:00,3.05538194879595,9.39623630693945,13.4204018780562,17.3467031384785,24.0118623243904,2022-01-22 12:00:00,1.31269186252109,1.5404018780562
"Bronn","DAX","1 day",2022-01-19 23:59:00,-2.38691459011207,-0.511845810270108,0.0739005442763669,0.658197996626894,2.30732986773646,2022-01-20 17:30:00,0.278553952744358,0.573035637380865
"Bronn","DAX","2 day",2022-01-19 23:59:00,-3.22441557379379,-0.745686260724136,0.131061665113458,0.951017497138903,2.9960743235609,2022-01-21 17:30:00,0.74613288584504,1.44159463570038
"Bronn","DAX","5 day",2022-01-19 23:59:00,-4.14898299167438,-0.904445668813988,0.188276575472296,1.20812016722081,3.61716328761364,2022-01-24 17:30:00,3.48850242976272,5.37157710793955
"Bronn","DAX","6 day",2022-01-19 23:59:00,-4.83991603392694,-1.0257294284214,0.264216741911518,1.40858634123559,4.11556344833039,2022-01-25 17:30:00,2.63657547091381,4.69927927876451
"Bronn","DAX","7 day",2022-01-19 23:59:00,-5.31788897959713,-1.11963109446171,0.332490537854849,1.66743074685971,4.7026747364046,2022-01-26 17:30:00,1.34205912333499,2.57332659161576
"Bronn","temperature","36 hour",2022-01-19 23:59:00,-1.26203301486937,0.846668553073994,1.96035327328128,3.09812763180812,5.2123004981604,2022-01-20 12:00:00,0.518567535624206,1.13964672671872
"Bronn","temperature","48 hour",2022-01-19 23:59:00,-3.20419718675311,-1.36943032395208,-0.42790237772458,0.496751779770048,2.2957465334634,2022-01-21 00:00:00,0.356037172029462,0.57209762227542
"Bronn","temperature","60 hour",2022-01-19 23:59:00,0.447652835913447,1.17951858969229,1.56251450759054,1.94331701037699,2.67095719015166,2022-01-21 12:00:00,0.151115787128961,0.262514507590544
"Bronn","temperature","72 hour",2022-01-19 23:59:00,-0.730705495971693,0.68456927485808,1.41884117595138,2.14037730532719,3.58234891188823,2022-01-22 00:00:00,1.08879218980436,1.98115882404862
"Bronn","temperature","84 hour",2022-01-19 23:59:00,0.146654215275671,3.06531313434517,4.62873321089717,6.22765224814496,9.13572177640844,2022-01-22 12:00:00,0.691871229170741,1.42873321089717
"Bronn","wind","36 hour",2022-01-19 23:59:00,20.7564596809508,24.7713467687436,26.8779624569941,28.9845781452446,32.9994652330373,2022-01-20 12:00:00,3.01432944367431,5.5220375430059
"Bronn","wind","48 hour",2022-01-19 23:59:00,11.8630347254573,16.3098664114452,18.6431246913629,20.9763830496149,25.4232164440319,2022-01-21 00:00:00,1.65907532288418,3.31687530863714
"Bronn","wind","60 hour",2022-01-19 23:59:00,10.8792532782247,15.0091408611694,17.1760983605193,19.3430559522184,23.4729455492484,2022-01-21 12:00:00,2.34688637882392,4.42390163948072
"Bronn","wind","72 hour",2022-01-19 23:59:00,3.68238066915678,9.18565042398262,12.1538296355551,15.130524558156,20.8107414641655,2022-01-22 00:00:00,3.730795270994,6.92617036444488
"Bronn","wind","84 hour",2022-01-19 23:59:00,2.83591628935317,9.35220771250469,13.0731234597857,16.8298152691586,24.0196725764163,2022-01-22 12:00:00,1.19822301049316,1.19312345978568
"CaptainRaymondHolt","DAX","1 day",2022-01-19 23:59:00,-1.25132489011736,-0.664013816845488,0.373073211173924,0.827786314489831,1.23083764678672,2022-01-20 17:30:00,0.228774232599234,0.273862970483307
"CaptainRaymondHolt","DAX","2 day",2022-01-19 23:59:00,-1.90314461665845,-0.643294391205629,0.0350514043231164,1.52719650120599,2.14527684433823,2022-01-21 17:30:00,0.793545610585652,1.34558437491004
"CaptainRaymondHolt","DAX","5 day",2022-01-19 23:59:00,-2.42386636225947,-0.531948640566515,0.334706986486477,1.71136638342437,2.9280670069495,2022-01-24 17:30:00,4.34576676472533,5.51800751895373
"CaptainRaymondHolt","DAX","6 day",2022-01-19 23:59:00,-2.23735628179059,-0.320360062487524,0.625440830260704,1.24127990279823,3.57418930987886,2022-01-25 17:30:00,3.75134361763916,5.0605033671137
"CaptainRaymondHolt","DAX","7 day",2022-01-19 23:59:00,-1.60482347598021,-0.570786999947526,0.75892652255849,1.86639599466933,3.665550480618,2022-01-26 17:30:00,1.81879920692918,2.9997625763194
"CaptainRaymondHolt","temperature","36 hour",2022-01-19 23:59:00,-0.609857363014161,0.788870140822462,1.90326567592699,2.8031101465405,4.21947558095995,2022-01-20 12:00:00,0.607820136209947,1.19673432407301
"CaptainRaymondHolt","temperature","48 hour",2022-01-19 23:59:00,-2.99680628743573,-1.47194767165137,-0.735789469484913,0.0018997377093119,1.25384182530149,2022-01-21 00:00:00,0.242733328166458,0.264210530515087
"CaptainRaymondHolt","temperature","60 hour",2022-01-19 23:59:00,-1.42275212452171,0.615184873917227,1.41943609808426,2.25047002423457,4.13514980195761,2022-01-21 12:00:00,0.24299475391338,0.119436098084264
"CaptainRaymondHolt","temperature","72 hour",2022-01-19 23:59:00,-1.55458473689175,0.369590321899034,0.64626568793477,1.48300127338078,3.04935076701949,2022-01-22 00:00:00,1.61518649644023,2.75373431206523
"CaptainRaymondHolt","temperature","84 hour",2022-01-19 23:59:00,0.809002235871817,3.14270956938458,3.69621361825494,4.46888156109578,7.74965715991511,2022-01-22 12:00:00,0.301266472062539,0.496213618254937
"CaptainRaymondHolt","wind","36 hour",2022-01-19 23:59:00,18.9178877671559,23.6727074749947,26.9266710516381,29.6885187104615,36.6648614480598,2022-01-20 12:00:00,2.9583091658435,5.47332894836192
"CaptainRaymondHolt","wind","48 hour",2022-01-19 23:59:00,9.14084490464408,16.0695051177896,18.7318215315534,21.7917500801743,30.0116636908091,2022-01-21 00:00:00,1.49386834571973,3.22817846844663
"CaptainRaymondHolt","wind","60 hour",2022-01-19 23:59:00,9.83106809849915,14.2990963516525,16.9582908262185,20.3471131927992,25.638275100378,2022-01-21 12:00:00,2.1923703117701,4.64170917378154
"CaptainRaymondHolt","wind","72 hour",2022-01-19 23:59:00,4.76588761257437,9.22078005243814,11.3144412285082,15.7144579263669,20.9427265775922,2022-01-22 00:00:00,3.71046476079467,7.76555877149184
"CaptainRaymondHolt","wind","84 hour",2022-01-19 23:59:00,3.13889081985548,8.81213347824455,11.6104479111162,14.5496376600684,20.8652274539588,2022-01-22 12:00:00,0.804924202300185,0.269552088883826
"ChandlerBing","DAX","1 day",2022-01-19 23:59:00,-1.75189938675107,-0.461536988364058,0.215517586902977,0.892572162170012,2.18293456055703,2022-01-20 17:30:00,0.261042973477339,0.431418594754255
"ChandlerBing","DAX","2 day",2022-01-19 23:59:00,-1.6367595458319,-0.275769458517237,0.438343543118058,1.15245654475335,2.51344663206801,2022-01-21 17:30:00,0.948005369674926,1.74887651370498
"ChandlerBing","DAX","5 day",2022-01-19 23:59:00,-2.60816871353057,-1.29346612831493,-0.603640230142193,0.0861856680305428,1.40088825324619,2022-01-24 17:30:00,3.67997429900293,4.57966030232506
"ChandlerBing","DAX","6 day",2022-01-19 23:59:00,-2.39761823507457,-1.03703954864855,-0.323142409513793,0.390754729620961,1.75133341604698,2022-01-25 17:30:00,3.18083988579916,4.1119201273392
"ChandlerBing","DAX","7 day",2022-01-19 23:59:00,-3.70775794630003,-2.10478439600509,-1.26370240414305,-0.422620412281014,1.18035313801392,2022-01-26 17:30:00,0.466944902241445,0.977133649617856
"ChandlerBing","temperature","36 hour",2022-01-19 23:59:00,-0.109970914714028,1.44013594828785,2.2534787309512,3.06682151361456,4.61692837661644,2022-01-20 12:00:00,0.392513197809911,0.846521269048795
"ChandlerBing","temperature","48 hour",2022-01-19 23:59:00,-3.0024185774329,-1.69141775118412,-1.00353417002882,-0.315650588873517,0.995350237375268,2022-01-21 00:00:00,0.178261238384905,0.00353417002881784
"ChandlerBing","temperature","60 hour",2022-01-19 23:59:00,0.180851620955417,1.57334219438501,2.30398353586802,3.03462487735103,4.42711545078063,2022-01-21 12:00:00,0.498724491522463,1.00398353586802
"ChandlerBing","temperature","72 hour",2022-01-19 23:59:00,-3.32695633535821,-0.724251379036151,0.641390785483519,2.00703295000319,4.60973790632525,2022-01-22 00:00:00,1.46140403822279,2.75860921451648
"ChandlerBing","temperature","84 hour",2022-01-19 23:59:00,-1.72039081449803,1.64968861894574,3.41797301895511,5.18625741896448,8.55633685240825,2022-01-22 12:00:00,0.500018760461959,0.21797301895511
"ChandlerBing","wind","36 hour",2022-01-19 23:59:00,17.3332375226099,23.0598812704813,26.064657568417,29.0694338663526,34.7960776142241,2022-01-20 12:00:00,3.37487860027882,6.33534243158302
"ChandlerBing","wind","48 hour",2022-01-19 23:59:00,8.52526957492059,14.3951559773068,17.4750918542366,20.5550277311663,26.4249141335525,2022-01-21 00:00:00,2.25395415765843,4.48490814576344
"ChandlerBing","wind","60 hour",2022-01-19 23:59:00,7.84905015044419,13.9517119746529,17.1537853724464,20.3558587702398,26.4585205944486,2022-01-21 12:00:00,2.21340880141352,4.4462146275536
"ChandlerBing","wind","72 hour",2022-01-19 23:59:00,2.46813065438022,8.80702777029518,12.1330540865007,15.4590804027061,21.7979775186211,2022-01-22 00:00:00,3.69626075350092,6.94694591349935
"ChandlerBing","wind","84 hour",2022-01-19 23:59:00,2.7102106862753,9.4646858931616,13.008766492586,16.5528470920103,23.3073222988966,2022-01-22 12:00:00,1.14054053452828,1.12876649258597
"DAX_benchmark","DAX","1 day",2022-01-19 23:59:00,-2.71099410396365,-0.496172661875782,0.077906443446718,0.667302552216587,2.43822167008952,2022-01-20 17:30:00,0.281645626791871,0.569029738210514
"DAX_benchmark","DAX","2 day",2022-01-19 23:59:00,-3.93656249759128,-0.743836242666962,0.16366619333823,0.924420302130136,3.1329715130069,2022-01-21 17:30:00,0.759039518538705,1.47419916392515
"DAX_benchmark","DAX","5 day",2022-01-19 23:59:00,-4.75944674725471,-0.8384707202445,0.173268130051962,1.21502365472375,3.89032640718187,2022-01-24 17:30:00,3.27063434051915,5.35656866251921
"DAX_benchmark","DAX","6 day",2022-01-19 23:59:00,-5.24615804417818,-0.964596524739569,0.246671919221697,1.40651637752689,4.57407374600166,2022-01-25 17:30:00,2.65984690418875,4.68173445607469
"DAX_benchmark","DAX","7 day",2022-01-19 23:59:00,-5.75308316717284,-1.09294845009975,0.392182689335741,1.4963419076008,5.19223708311003,2022-01-26 17:30:00,1.35414102835668,2.63301874309665
"DexterJettster","DAX","1 day",2022-01-19 23:59:00,-1.90338269757615,-0.377082725570421,0.0990026592760707,0.465515518292214,1.43081087054397,2022-01-20 17:30:00,0.299756729889704,0.547933522381161
"DexterJettster","DAX","2 day",2022-01-19 23:59:00,-3.89638517444022,-0.603823613621035,0.131234139349434,1.01035073978535,3.86283118476632,2022-01-21 17:30:00,0.810046763706328,1.44176710993635
"DexterJettster","DAX","5 day",2022-01-19 23:59:00,-4.66208349718295,-0.81669546725891,0.18500611,1.04963213949011,4.26450998004592,2022-01-24 17:30:00,3.3046888641377,5.36830664246725
"DexterJettster","DAX","6 day",2022-01-19 23:59:00,-5.04493265855431,-0.923131394077847,0.227982376104841,1.0627259393917,4.46534937768572,2022-01-25 17:30:00,2.63106999341098,4.66304491295784
"DexterJettster","DAX","7 day",2022-01-19 23:59:00,-5.42778181992567,-1.02956732089678,0.344020797641598,1.43721918627353,4.66618877532552,2022-01-26 17:30:00,1.3490972200957,2.58485685140251
"DexterJettster","temperature","36 hour",2022-01-19 23:59:00,0.05565813155778,1.56371851308229,2.35499946048624,3.1462804078902,4.65434078941471,2022-01-20 12:00:00,0.353243123962112,0.74500053951376
"DexterJettster","temperature","48 hour",2022-01-19 23:59:00,-2.43064010380775,-1.25999901961032,-0.645762350096248,-0.0315256805821768,1.13911540361525,2022-01-21 00:00:00,0.229392418957795,0.354237649903752
"DexterJettster","temperature","60 hour",2022-01-19 23:59:00,-0.337945366717222,1.04851769205514,1.77599638994185,2.50347508782856,3.88993814660092,2022-01-21 12:00:00,0.282973852698893,0.47599638994185
"DexterJettster","temperature","72 hour",2022-01-19 23:59:00,-2.50556542536034,-0.141400567216917,1.09907934438964,2.33955925599619,4.70372411413962,2022-01-22 00:00:00,1.20454930643991,2.30092065561036
"DexterJettster","temperature","84 hour",2022-01-19 23:59:00,-0.0147986811915981,2.70239542780276,4.12811017714987,5.55382492649697,8.27101903549133,2022-01-22 12:00:00,0.553623162466224,0.92811017714987
"DexterJettster","wind","36 hour",2022-01-19 23:59:00,20.7564596809508,24.7713467687436,26.8779624569941,28.9845781452446,32.9994652330373,2022-01-20 12:00:00,3.0143294436743,5.5220375430059
"DexterJettster","wind","48 hour",2022-01-19 23:59:00,11.8630347254573,16.3098664114452,18.6431246913629,20.9763830496149,25.4232164440319,2022-01-21 00:00:00,1.65907532288418,3.3168753086371
"DexterJettster","wind","60 hour",2022-01-19 23:59:00,10.8792532782247,15.0091408611694,17.1760983605193,19.3430559522184,23.4729455492484,2022-01-21 12:00:00,2.34688637882392,4.4239016394807
"DexterJettster","wind","72 hour",2022-01-19 23:59:00,3.68238066915678,9.18565042398262,12.1538296355551,15.130524558156,20.8107414641655,2022-01-22 00:00:00,3.730795270994,6.9261703644449
"DexterJettster","wind","84 hour",2022-01-19 23:59:00,2.83591628935317,9.35220771250469,13.0731234597857,16.8298152691586,24.0196725764163,2022-01-22 12:00:00,1.19822301049316,1.1931234597857
"DougJudy","DAX","1 day",2022-01-19 23:59:00,-3.20836826949129,-0.64910508355039,0.114472041167393,0.857673214004796,3.15711274679915,2022-01-20 17:30:00,0.320825468016391,0.532464140489838
"DougJudy","DAX","2 day",2022-01-19 23:59:00,-3.68582718057914,-0.650978319013954,0.27356052143891,1.10428481533767,3.66561605129793,2022-01-21 17:30:00,0.829681304788285,1.58409349202583
"DougJudy","DAX","5 day",2022-01-19 23:59:00,-4.62045376307113,-1.19969636326095,-0.190868697903639,0.75974084627502,3.54984502841077,2022-01-24 17:30:00,3.0947134512221,4.99243183456361
"DougJudy","DAX","6 day",2022-01-19 23:59:00,-4.69886078239129,-1.08394093672356,0.0171429003961099,1.0244361044539,4.07674312775395,2022-01-25 17:30:00,2.52948347072079,4.45220543724911
"DougJudy","DAX","7 day",2022-01-19 23:59:00,-5.97875029094218,-1.8402565124111,-0.491211484926465,0.613835759416178,4.14582409396572,2022-01-26 17:30:00,0.856811701338619,1.74962456883444
"DougJudy","temperature","36 hour",2022-01-19 23:59:00,-0.704018606514656,1.25313678755779,2.28005838394165,3.30697998032551,5.26413537439796,2022-01-20 12:00:00,0.429054182297569,0.81994161605835
"DougJudy","temperature","48 hour",2022-01-19 23:59:00,-2.5937360074136,-0.700177553845711,0.29337465763092,1.28692686910755,3.18048532267544,2022-01-21 00:00:00,0.635056565584116,1.29337465763092
"DougJudy","temperature","60 hour",2022-01-19 23:59:00,-0.843307959159622,0.90426228268954,1.82121431827545,2.73816635386136,4.48573659571052,2022-01-21 12:00:00,0.340923716320974,0.521214318275452
"DougJudy","temperature","72 hour",2022-01-19 23:59:00,-1.630445242558,-0.0237642890217288,0.819262981414795,1.66229025185132,3.26897120538759,2022-01-22 00:00:00,1.48124243938824,2.5807370185852
"DougJudy","temperature","84 hour",2022-01-19 23:59:00,0.395361608995743,1.97498765103515,2.80381917953491,3.63265070803468,5.21227675007408,2022-01-22 12:00:00,0.293171621203754,0.396180820465088
"DougJudy","wind","36 hour",2022-01-19 23:59:00,17.3195969828825,24.5371207477755,28.3241634368896,32.1112061260038,39.3287298908968,2022-01-20 12:00:00,1.90818472912352,4.07583656311035
"DougJudy","wind","48 hour",2022-01-19 23:59:00,12.5955323307484,18.6735495387932,21.8626918792725,25.0518342197518,31.1298514277965,2022-01-21 00:00:00,0.842633283211848,0.0973081207275399
"DougJudy","wind","60 hour",2022-01-19 23:59:00,10.9464149272382,16.5230231871305,19.4490756988525,22.3751282105746,27.9517364704669,2022-01-21 12:00:00,1.18544857800619,2.15092430114746
"DougJudy","wind","72 hour",2022-01-19 23:59:00,7.68386666309315,12.3057328529193,14.7308311462402,17.1559294395611,21.7777956293873,2022-01-22 00:00:00,2.26542094325462,4.34916885375976
"DougJudy","wind","84 hour",2022-01-19 23:59:00,8.2641877391183,13.0641659404337,15.5827198028564,18.1012736652792,22.9012518665946,2022-01-22 12:00:00,1.86429175050409,3.70271980285644
"GeneralGrievous","DAX","1 day",2022-01-19 23:59:00,0.1,0.15,0.18,0.21,0.26,2022-01-20 17:30:00,0.430536181657232,0.466936181657232
"GeneralGrievous","DAX","2 day",2022-01-19 23:59:00,-0.02,0.09,0.14,0.2,0.3,2022-01-21 17:30:00,1.38073297058692,1.45053297058692
"GeneralGrievous","DAX","5 day",2022-01-19 23:59:00,-0.27,-0.12,-0.04,0.05,0.2,2022-01-24 17:30:00,5.04100053246725,5.14330053246725
"GeneralGrievous","DAX","6 day",2022-01-19 23:59:00,-0.15,0.06,0.17,0.28,0.49,2022-01-25 17:30:00,4.461462536853,4.605062536853
"GeneralGrievous","DAX","7 day",2022-01-19 23:59:00,-0.2,0.06,0.2,0.33,0.59,2022-01-26 17:30:00,2.25973605376091,2.44083605376091
"GeneralGrievous","temperature","36 hour",2022-01-19 23:59:00,0.04,0.72,0.98,1.23,1.91,2022-01-20 12:00:00,1.7177,2.12
"GeneralGrievous","temperature","48 hour",2022-01-19 23:59:00,-2.88,-2.18,-1.92,-1.65,-0.95,2022-01-21 00:00:00,0.5163,0.92
"GeneralGrievous","temperature","60 hour",2022-01-19 23:59:00,-1.87,-0.75,-0.32,0.11,1.23,2022-01-21 12:00:00,0.945,1.62
"GeneralGrievous","temperature","72 hour",2022-01-19 23:59:00,-3.67,-2.46,-2,-1.54,-0.33,2022-01-22 00:00:00,4.6734,5.4
"GeneralGrievous","temperature","84 hour",2022-01-19 23:59:00,0.62,2.25,2.87,3.5,5.12,2022-01-22 12:00:00,0.236,0.33
"GeneralGrievous","wind","36 hour",2022-01-19 23:59:00,25.75,28.72,29.86,31.01,33.98,2022-01-20 12:00:00,1.3753,2.54
"GeneralGrievous","wind","48 hour",2022-01-19 23:59:00,17.66,20.65,21.8,22.95,25.94,2022-01-21 00:00:00,0.3448,0.16
"GeneralGrievous","wind","60 hour",2022-01-19 23:59:00,19.34,21.51,22.34,23.18,25.35,2022-01-21 12:00:00,0.3751,0.739999999999998
"GeneralGrievous","wind","72 hour",2022-01-19 23:59:00,11.72,14.74,15.91,17.08,20.1,2022-01-22 00:00:00,1.7518,3.17
"GeneralGrievous","wind","84 hour",2022-01-19 23:59:00,8.84,10.08,10.94,11.8,14.04,2022-01-22 12:00:00,0.444,0.940000000000001
"GinaLinetti","DAX","1 day",2022-01-19 23:59:00,-3.115045,-1.57011,0.0587872,1.687685,3.232619,2022-01-20 17:30:00,0.506885936331446,0.588148981657232
"GinaLinetti","DAX","2 day",2022-01-19 23:59:00,-4.170599,-2.005071,0.278148,2.561367,4.726895,2022-01-21 17:30:00,0.863354934117384,1.58868097058692
"GinaLinetti","DAX","5 day",2022-01-19 23:59:00,-5.03339,-2.836122,-0.5194384,1.797245,3.994513,2022-01-24 17:30:00,2.48522378246725,4.66386213246725
"GinaLinetti","DAX","6 day",2022-01-19 23:59:00,-4.39416,-2.221139,-0.06997979,2.361099,4.534119,2022-01-25 17:30:00,2.322453568853,4.365082746853
"GinaLinetti","DAX","7 day",2022-01-19 23:59:00,-4.172215,-1.937486,0.4186948,2.774876,5.009605,2022-01-26 17:30:00,1.21630059225655,2.65953085376091
"GinaLinetti","temperature","36 hour",2022-01-19 23:59:00,0.1095,0.8175,1.435,1.9575,2.92275,2022-01-20 12:00:00,1.0030325,1.665
"GinaLinetti","temperature","48 hour",2022-01-19 23:59:00,-2.61075,-2.01,-1.575,-1.1375,-0.89575,2022-01-21 00:00:00,0.2744,0.575
"GinaLinetti","temperature","60 hour",2022-01-19 23:59:00,0.02775,0.5525,0.87,1.1825,1.656,2022-01-21 12:00:00,0.2122825,0.43
"GinaLinetti","temperature","72 hour",2022-01-19 23:59:00,-2.312,-1.48,0.08,0.9,5.2805,2022-01-22 00:00:00,1.977925,3.32
"GinaLinetti","temperature","84 hour",2022-01-19 23:59:00,-0.93525,1,3.11,5.235,8.357,2022-01-22 12:00:00,0.5344225,0.0900000000000003
"GinaLinetti","wind","36 hour",2022-01-19 23:59:00,20.7735,22.55,23.235,23.93,26.321,2022-01-20 12:00:00,7.846075,9.165
"GinaLinetti","wind","48 hour",2022-01-19 23:59:00,12.06775,14.19,15.56,16.145,18.59375,2022-01-21 00:00:00,5.21326,6.4
"GinaLinetti","wind","60 hour",2022-01-19 23:59:00,12.04625,13.1875,13.91,15.2925,16.96125,2022-01-21 12:00:00,6.17615,7.69
"GinaLinetti","wind","72 hour",2022-01-19 23:59:00,7.09825,8,9.41,11.99,15.60625,2022-01-22 00:00:00,6.64358,9.67
"GinaLinetti","wind","84 hour",2022-01-19 23:59:00,3.8995,6.8725,9.11,12.395,19.868,2022-01-22 12:00:00,1.265935,2.77
"HanSolo","DAX","1 day",2022-01-19 23:59:00,-2.96741674236849,-0.6492535154541,0.0527261575789753,0.637618528020891,2.29756219717733,2022-01-20 17:30:00,0.303906060013145,0.594210024078256
"HanSolo","DAX","2 day",2022-01-19 23:59:00,-3.5407919043919,-0.694074817397658,0.177152126169393,1.16384404659452,3.36081594288503,2022-01-21 17:30:00,0.798928245498955,1.48768509675631
"HanSolo","DAX","5 day",2022-01-19 23:59:00,-4.07182934612638,-1.05682461664949,0.200745629050675,1.18319721081762,3.74298062103484,2022-01-24 17:30:00,3.47413835558536,5.38404616151792
"HanSolo","DAX","6 day",2022-01-19 23:59:00,-6.02576472558723,-1.07732670311978,0.184948878189611,1.31687453007459,4.35129490444735,2022-01-25 17:30:00,2.61028733612159,4.62001141504261
"HanSolo","DAX","7 day",2022-01-19 23:59:00,-5.00254678105273,-0.690005703983776,0.424685568152526,1.46096413903075,5.01884170467382,2022-01-26 17:30:00,1.46874733345226,2.66552162191343
"HanSolo","temperature","36 hour",2022-01-19 23:59:00,-0.712298839410487,1.00058552505304,1.77434040625372,2.51186412130534,4.04589556131426,2022-01-20 12:00:00,0.699096073859597,1.32565959374628
"HanSolo","temperature","48 hour",2022-01-19 23:59:00,-3.52993067843848,-1.68158495464394,-0.847047375127067,-0.0486980779856658,1.56743258357242,2022-01-21 00:00:00,0.244852845260523,0.152952624872933
"HanSolo","temperature","60 hour",2022-01-19 23:59:00,-1.18399661994055,0.704771348845187,1.57316099804932,2.40291770389121,4.17526980722657,2022-01-21 12:00:00,0.278039499386137,0.273160998049317
"HanSolo","temperature","72 hour",2022-01-19 23:59:00,-2.18720218003445,-0.0467014094870564,0.94856541114155,1.94813395074816,4.14099309288344,2022-01-22 00:00:00,1.33379882622513,2.45143458885845
"HanSolo","temperature","84 hour",2022-01-19 23:59:00,-0.47562853428655,1.87807720755419,2.95952645205919,4.03915375561866,6.57225709348731,2022-01-22 12:00:00,0.334681220672347,0.24047354794081
"HanSolo","wind","36 hour",2022-01-19 23:59:00,18.5973919769668,24.9095514223826,27.2123686920315,29.9516702959038,35.0970861685816,2022-01-20 12:00:00,2.68606697250044,5.18763130796848
"HanSolo","wind","48 hour",2022-01-19 23:59:00,13.0660322612523,17.4119166379168,19.3721927943004,21.5843231536508,26.84181651444,2022-01-21 00:00:00,1.22283067378489,2.58780720569959
"HanSolo","wind","60 hour",2022-01-19 23:59:00,11.9698626433615,16.0250126092663,17.8532888691524,19.8499954732867,24.0051365416964,2022-01-21 12:00:00,1.95219506224023,3.74671113084762
"HanSolo","wind","72 hour",2022-01-19 23:59:00,6.8507153090351,11.5943324851293,13.6973075591182,15.7824113500096,21.8001784467453,2022-01-22 00:00:00,2.96387646603764,5.38269244088181
"HanSolo","wind","84 hour",2022-01-19 23:59:00,6.32848928659464,13.1819982019124,14.911855562927,16.4521939559965,22.8274174445039,2022-01-22 12:00:00,1.61917925033784,3.03185556292698
"HotPie","DAX","1 day",2022-01-19 23:59:00,-1.96111012736662,-0.853831954782261,-0.105818503535284,0.887432469490436,1.98999398310927,2022-01-20 17:30:00,0.364188420570532,0.752754685192516
"HotPie","DAX","2 day",2022-01-19 23:59:00,-2.82216240735463,-1.26419661757474,0.0415216042548764,1.2229536305237,2.82644812602061,2022-01-21 17:30:00,0.594146586316828,1.3520545748418
"HotPie","DAX","5 day",2022-01-19 23:59:00,-3.85228636085494,-1.49044691292353,-0.0109535280072125,1.39104883832194,3.97521201948347,2022-01-24 17:30:00,3.41044107628235,5.17234700446004
"HotPie","DAX","6 day",2022-01-19 23:59:00,-4.44985172044072,-1.65800139461708,0.00618937159124462,1.64831557265683,4.88273817352955,2022-01-25 17:30:00,2.42303243425031,4.44125190844424
"HotPie","DAX","7 day",2022-01-19 23:59:00,-4.96385908745654,-1.80785137790256,0.0341297753422165,1.87504331715057,5.38734724450146,2022-01-26 17:30:00,1.09998856898886,2.27496582910312
"HotPie","temperature","36 hour",2022-01-19 23:59:00,0.0790300932804005,1.26770013882404,1.87796807201039,2.74631260408541,4.45702783997959,2022-01-20 12:00:00,0.577522567956887,1.22203192798961
"HotPie","temperature","48 hour",2022-01-19 23:59:00,-3.14052896952782,-1.9525456795438,-1.41255311398627,-0.478632159060234,1.46113395509212,2022-01-21 00:00:00,0.27591860409181,0.41255311398627
"HotPie","temperature","60 hour",2022-01-19 23:59:00,0.135084919996408,1.61214275730834,2.35642012761323,3.33558960524409,5.41814615073248,2022-01-21 12:00:00,0.561316425546918,1.05642012761323
"HotPie","temperature","72 hour",2022-01-19 23:59:00,-2.19039380303364,-0.528844132658567,0.254632459975824,1.38098134204876,3.27869963060236,2022-01-22 00:00:00,1.73087460075148,3.14536754002418
"HotPie","temperature","84 hour",2022-01-19 23:59:00,0.261531419955434,2.2644503254124,3.28322704994225,4.56528442879435,7.0345053677707,2022-01-22 12:00:00,0.314458559804798,0.0832270499422498
"HotPie","wind","36 hour",2022-01-19 23:59:00,12.1556239229382,22.6367727097289,28.7135429023275,32.5185470742078,38.8480045140138,2022-01-20 12:00:00,1.99239266189315,3.6864570976725
"HotPie","wind","48 hour",2022-01-19 23:59:00,10.1596658769792,17.1135397591361,20.368863359791,23.3516503769519,30.0620766887889,2022-01-21 00:00:00,1.14106249794148,1.591136640209
"HotPie","wind","60 hour",2022-01-19 23:59:00,7.67484423139518,13.856299313516,17.5050695980644,20.4361540496147,25.247974463975,2022-01-21 12:00:00,2.11824123647691,4.0949304019356
"HotPie","wind","72 hour",2022-01-19 23:59:00,6.05519193049719,10.8052204894684,13.0256191175286,15.7937927310249,21.6576005309789,2022-01-22 00:00:00,3.18024039424479,6.0543808824714
"HotPie","wind","84 hour",2022-01-19 23:59:00,5.17755348606736,10.5441303570642,13.6835306748188,16.7713946488199,21.9207433801565,2022-01-22 12:00:00,1.15086446308022,1.8035306748188
"Joey","DAX","1 day",2022-01-19 23:59:00,-1.6759907,-0.36778593,-0.09293033,0.29300728,1.3295107,2022-01-20 17:30:00,0.385679197994339,0.739866511657232
"Joey","DAX","2 day",2022-01-19 23:59:00,-2.609302,-0.95192895,-0.0052960217,0.649822,2.2519884,2022-01-21 17:30:00,0.613276997012152,1.30523694888692
"Joey","DAX","5 day",2022-01-19 23:59:00,-3.9409952,-1.52392894,0.3024323,2.0348282,4.277158,2022-01-24 17:30:00,3.49587458246725,5.48573283246725
"Joey","DAX","6 day",2022-01-19 23:59:00,-4.7332554,-1.5705097,0.026825055,1.7103393,5.0622444,2022-01-25 17:30:00,2.4642385511118,4.461887591853
"Joey","DAX","7 day",2022-01-19 23:59:00,-5.452412,-3.26234597,-0.38310477,2.7928521,4.631335,2022-01-26 17:30:00,1.07790353375218,1.85773128376091
"Joey","temperature","36 hour",2022-01-19 23:59:00,0.0807283258602511,2.19889164600269,3.87691573317225,4.65977703123957,5.57681771873415,2022-01-20 12:00:00,0.456432579086877,0.776915733172247
"Joey","temperature","48 hour",2022-01-19 23:59:00,-2.97930067775895,-2.31621636739884,0.307275657464189,1.23394110104355,2.40591838517669,2022-01-21 00:00:00,0.670323068966433,1.30727565746419
"Joey","temperature","60 hour",2022-01-19 23:59:00,0.57544172382368,1.21039176324037,2.89285920102686,3.79135068157843,4.72990892611313,2022-01-21 12:00:00,0.618212404062072,1.59285920102686
"Joey","temperature","72 hour",2022-01-19 23:59:00,-1.09505065733893,0.226342583004932,1.49361385134779,2.65207874405502,3.55744333650837,2022-01-22 00:00:00,0.969544288151915,1.90638614865221
"Joey","temperature","84 hour",2022-01-19 23:59:00,1.09592890279353,3.04737507133557,4.43766861297443,5.78512658827195,6.87659629995524,2022-01-22 12:00:00,0.57911554826014,1.23766861297443
"Joey","wind","36 hour",2022-01-19 23:59:00,21.9639643815445,22.6388573468772,24.2198666221151,25.9986099604194,26.9820848338255,2022-01-20 12:00:00,6.74990522375606,8.18013337788486
"Joey","wind","48 hour",2022-01-19 23:59:00,10.1018637982896,14.8535768403832,17.1404887453353,19.1163050280147,21.1711087510623,2022-01-21 00:00:00,2.95390200759301,4.81951125466467
"Joey","wind","60 hour",2022-01-19 23:59:00,13.1033844950924,14.9322024464128,16.9634306346833,19.472151286241,20.2276069196423,2022-01-21 12:00:00,2.85264769893833,4.63656936531665
"Joey","wind","72 hour",2022-01-19 23:59:00,7.33399209579448,10.4295201076472,11.9146830701175,13.9499481887176,15.6667331923481,2022-01-22 00:00:00,5.28576105262277,7.16531692988247
"Joey","wind","84 hour",2022-01-19 23:59:00,9.04349420137948,10.9511961865091,13.2021922950075,16.4714506156214,18.4327231517296,2022-01-22 12:00:00,0.910356191416225,1.32219229500747
"Joffrey_Baratheon","DAX","1 day",2022-01-19 23:59:00,-2.92824212759312,-0.685053922239708,0.0679405843479533,0.853491445828011,2.76186995257906,2022-01-20 17:30:00,0.326554777070349,0.578995597309278
"Joffrey_Baratheon","DAX","2 day",2022-01-19 23:59:00,-4.13687263973552,-1.1037883686352,0.322434966537259,1.50066521382489,3.94662620164147,2022-01-21 17:30:00,0.750571774865302,1.63296793712418
"Joffrey_Baratheon","DAX","5 day",2022-01-19 23:59:00,-5.2397996079142,-1.46576360184239,0.38127334485549,1.60001872107555,4.39282448237195,2022-01-24 17:30:00,3.00283402090915,5.56457387732274
"Joffrey_Baratheon","DAX","6 day",2022-01-19 23:59:00,-6.64589383735461,-0.98293455074877,0.365909297535565,2.02661742073485,4.96959393503494,2022-01-25 17:30:00,2.75815563619166,4.80097183438856
"Joffrey_Baratheon","DAX","7 day",2022-01-19 23:59:00,-6.15658060403456,-1.08147462627741,0.228413586636387,2.24411989991593,5.27564707346585,2022-01-26 17:30:00,1.40447622846719,2.46924964039729
"Joffrey_Baratheon","temperature","36 hour",2022-01-19 23:59:00,-0.422022305830656,1.15825893284716,1.98743424374658,2.81660955464599,4.39689079332381,2022-01-20 12:00:00,0.549893522563716,1.11256575625342
"Joffrey_Baratheon","temperature","48 hour",2022-01-19 23:59:00,-2.94735728005821,-1.59452695260937,-0.884695385985768,-0.174863819362168,1.17796650808668,2022-01-21 00:00:00,0.206280474009016,0.115304614014232
"Joffrey_Baratheon","temperature","60 hour",2022-01-19 23:59:00,-0.820655033818339,0.638105125594028,1.40351819201786,2.16893125844169,3.62769141785405,2022-01-21 12:00:00,0.218269716205062,0.10351819201786
"Joffrey_Baratheon","temperature","72 hour",2022-01-19 23:59:00,-2.94876042282528,-0.429893585693804,0.89175862511153,2.21341083591687,4.73227767304834,2022-01-22 00:00:00,1.31742476373075,2.50824137488847
"Joffrey_Baratheon","temperature","84 hour",2022-01-19 23:59:00,-1.47722057615227,1.96093889895927,3.76494497200652,5.56895104505376,9.00711052016531,2022-01-22 12:00:00,0.578633519973929,0.56494497200652
"Joffrey_Baratheon","wind","36 hour",2022-01-19 23:59:00,20.7564596809508,24.7713467687436,26.8779624569941,28.9845781452446,32.9994652330373,2022-01-20 12:00:00,3.0143294436743,5.5220375430059
"Joffrey_Baratheon","wind","48 hour",2022-01-19 23:59:00,11.8630347254573,16.3098664114452,18.6431246913629,20.9763830496149,25.4232164440319,2022-01-21 00:00:00,1.65907532288418,3.3168753086371
"Joffrey_Baratheon","wind","60 hour",2022-01-19 23:59:00,10.8792532782247,15.0091408611694,17.1760983605193,19.3430559522184,23.4729455492484,2022-01-21 12:00:00,2.34688637882392,4.4239016394807
"Joffrey_Baratheon","wind","72 hour",2022-01-19 23:59:00,3.68238066915678,9.18565042398262,12.1538296355551,15.130524558156,20.8107414641655,2022-01-22 00:00:00,3.730795270994,6.9261703644449
"Joffrey_Baratheon","wind","84 hour",2022-01-19 23:59:00,2.83591628935316,9.35220771250469,13.0731234597857,16.8298152691586,24.0196725764163,2022-01-22 12:00:00,1.19822301049316,1.1931234597857
"KyloRen","DAX","1 day",2022-01-19 23:59:00,-2.50153322708216,-0.44530241490505,0.088094732199503,0.640434539166572,2.23665286855024,2022-01-20 17:30:00,0.270324503251296,0.558841449457729
"KyloRen","DAX","2 day",2022-01-19 23:59:00,-3.39635649886787,-0.671222037314135,0.139804125195243,0.883569292744391,2.98147606194243,2022-01-21 17:30:00,0.765049251079502,1.45033709578216
"KyloRen","DAX","5 day",2022-01-19 23:59:00,-4.20686386934892,-0.757909656600824,0.185286813749162,1.14945368757129,3.79933280517124,2022-01-24 17:30:00,3.5052467859996,5.36858734621641
"KyloRen","DAX","6 day",2022-01-19 23:59:00,-4.68349755782234,-0.870804124941684,0.244598983348379,1.34046961527327,4.36187697955199,2022-01-25 17:30:00,2.67321678820004,4.67966152020137
"KyloRen","DAX","7 day",2022-01-19 23:59:00,-5.23916153736198,-0.905073104474264,0.376735154760952,1.48082899016514,4.81329450847938,2022-01-26 17:30:00,1.39693419134138,2.61757120852186
"KyloRen","temperature","36 hour",2022-01-19 23:59:00,0.0712194107350001,1.349771,1.96755625,2.575838525,3.933777385,2022-01-20 12:00:00,0.59738567224265,1.13244375
"KyloRen","temperature","48 hour",2022-01-19 23:59:00,-2.89459321,-1.511293925,-0.78611201,-0.02916642275,1.6188437175,2022-01-21 00:00:00,0.2361247175,0.21388799
"KyloRen","temperature","60 hour",2022-01-19 23:59:00,-0.585151376,1.199213525,2.03010915,2.79575345,4.6535747175,2022-01-21 12:00:00,0.358063083435,0.73010915
"KyloRen","temperature","72 hour",2022-01-19 23:59:00,-1.7992419825,-0.04723330575,0.872261825,1.74973175,3.395729855,2022-01-22 00:00:00,1.39900921695,2.527738175
"KyloRen","temperature","84 hour",2022-01-19 23:59:00,0.78921271125,2.791989525,3.82184485,4.843370875,6.617544525,2022-01-22 12:00:00,0.3877904231375,0.62184485
"KyloRen","wind","36 hour",2022-01-19 23:59:00,19.27941225,25.16232675,27.802988,30.66573675,36.75857875,2022-01-20 12:00:00,2.338240365,4.597012
"KyloRen","wind","48 hour",2022-01-19 23:59:00,8.9764395,15.65453675,18.8565125,21.6796085,27.999492725,2022-01-21 00:00:00,1.52559180725,3.1034875
"KyloRen","wind","60 hour",2022-01-19 23:59:00,9.548709325,15.12304175,17.6177465,20.4372675,25.763678575,2022-01-21 12:00:00,1.9551159675,3.9822535
"KyloRen","wind","72 hour",2022-01-19 23:59:00,1.46430044,8.475048,11.8671025,14.88341975,20.741047775,2022-01-22 00:00:00,3.95481624835,7.2128975
"KyloRen","wind","84 hour",2022-01-19 23:59:00,0.61470613075,9.0851605,12.292676,15.174631,21.682886225,2022-01-22 12:00:00,0.9021640509425,0.412675999999999
"mean_ensemble","DAX","1 day",2022-01-19 23:59:00,-2.06160407401732,-0.529206300048463,0.095507116734025,0.682721239237547,1.95004273933659,2022-01-20 17:30:00,0.271595035046781,0.551429064923207
"mean_ensemble","DAX","2 day",2022-01-19 23:59:00,-2.7925669191424,-0.727765203082031,0.157972076009126,1.01680328976925,2.68339206992379,2022-01-21 17:30:00,0.756024555496955,1.46850504659605
"mean_ensemble","DAX","5 day",2022-01-19 23:59:00,-3.60040944105576,-1.01506746617523,0.0656623590561362,1.07824313319501,3.14498093373735,2022-01-24 17:30:00,3.62702720507104,5.24896289152339
"mean_ensemble","DAX","6 day",2022-01-19 23:59:00,-4.0261069167747,-0.965278699242543,0.146995242760386,1.2180951456649,3.58682603792242,2022-01-25 17:30:00,2.76237405303589,4.58205777961338
"mean_ensemble","DAX","7 day",2022-01-19 23:59:00,-4.35624568244214,-1.18224546670433,0.144903346556978,1.39671975868198,3.86622157551901,2022-01-26 17:30:00,1.24070531000445,2.38573940031789
"mean_ensemble","temperature","36 hour",2022-01-19 23:59:00,-0.235152896883031,1.19360851453119,2.01522066434911,2.7789460502472,4.21701615915141,2022-01-20 12:00:00,0.548432891163243,1.08477933565089
"mean_ensemble","temperature","48 hour",2022-01-19 23:59:00,-2.85352264376504,-1.61149159181322,-0.855833552494327,-0.170381101372352,1.05441315730522,2022-01-21 00:00:00,0.212023696555924,0.144166447505673
"mean_ensemble","temperature","60 hour",2022-01-19 23:59:00,-0.454940703769764,0.840341987938268,1.5590873815993,2.24334029402181,3.56391743604389,2022-01-21 12:00:00,0.232305888326351,0.2590873815993
"mean_ensemble","temperature","72 hour",2022-01-19 23:59:00,-2.34140181720835,-0.469418968585991,0.663731968649746,1.73124342516144,4.09157032639963,2022-01-22 00:00:00,1.4991521970163,2.73626803135025
"mean_ensemble","temperature","84 hour",2022-01-19 23:59:00,-0.465967403181692,2.10683522576889,3.60859200026914,5.12478116497277,7.93130601186732,2022-01-22 12:00:00,0.467485728124706,0.40859200026914
"mean_ensemble","wind","36 hour",2022-01-19 23:59:00,19.8314537309029,24.2127415591973,26.4788155574103,28.6657520013596,33.1828527156857,2022-01-20 12:00:00,3.25675112203816,5.9211844425897
"mean_ensemble","wind","48 hour",2022-01-19 23:59:00,11.3578341390806,16.0846518617223,18.3966877385773,20.6606621141617,25.1015176336607,2022-01-21 00:00:00,1.8274354668096,3.5633122614227
"mean_ensemble","wind","60 hour",2022-01-19 23:59:00,11.1164764534303,15.0418395610639,17.0917088146125,19.3239643252586,23.1866462965743,2022-01-21 12:00:00,2.36098668182497,4.5082911853875
"mean_ensemble","wind","72 hour",2022-01-19 23:59:00,5.33763582867681,9.78836300697129,12.157470899977,14.988106264973,20.0141218670858,2022-01-22 00:00:00,3.68800250019966,6.922529100023
"mean_ensemble","wind","84 hour",2022-01-19 23:59:00,4.10052793253552,9.49394095901223,12.5018553235261,15.7145497606825,22.0687614427016,2022-01-22 12:00:00,0.926114279973908,0.621855323526098
"median_ensemble","DAX","1 day",2022-01-19 23:59:00,-2.09748829319593,-0.496172661875782,0.088094732199503,0.660683731997279,2.18293456055703,2022-01-20 17:30:00,0.270258157816381,0.558841449457729
"median_ensemble","DAX","2 day",2022-01-19 23:59:00,-3.22441557379379,-0.694074817397658,0.14,1.01035073978535,2.80349097389528,2022-01-21 17:30:00,0.76741147658828,1.45053297058692
"median_ensemble","DAX","5 day",2022-01-19 23:59:00,-4.07182934612638,-0.904445668813988,0.173268130051962,1.18319721081762,3.61716328761364,2022-01-24 17:30:00,3.51309836680206,5.35656866251921
"median_ensemble","DAX","6 day",2022-01-19 23:59:00,-4.68349755782234,-0.98293455074877,0.17,1.31687453007459,4.07674312775395,2022-01-25 17:30:00,2.61944701675039,4.605062536853
"median_ensemble","DAX","7 day",2022-01-19 23:59:00,-5.08205850665419,-1.09294845009975,0.228413586636387,1.4963419076008,4.48303602271085,2022-01-26 17:30:00,1.30758495060763,2.4692496403973
"median_ensemble","temperature","36 hour",2022-01-19 23:59:00,-0.313279643575141,1.18039482492291,1.98743424374658,2.81660955464599,4.40059450777227,2022-01-20 12:00:00,0.54662954387807,1.11256575625342
"median_ensemble","temperature","48 hour",2022-01-19 23:59:00,-2.94735728005821,-1.59452695260937,-0.884695385985768,-0.174863819362168,1.17796650808668,2022-01-21 00:00:00,0.206280474009016,0.115304614014232
"median_ensemble","temperature","60 hour",2022-01-19 23:59:00,-0.599801068082405,0.815603366058101,1.5692299234578,2.25941575068499,3.75550253993396,2022-01-21 12:00:00,0.241780259234413,0.2692299234578
"median_ensemble","temperature","72 hour",2022-01-19 23:59:00,-2.40878271268017,-0.429893585693804,0.86371259714072,2.07268722426389,4.59150184396285,2022-01-22 00:00:00,1.3584435174285,2.53628740285928
"median_ensemble","temperature","84 hour",2022-01-19 23:59:00,-0.705439267143275,1.96796327499721,3.7054544921365,5.31764175538448,8.41159425567449,2022-01-22 12:00:00,0.527229081694205,0.5054544921365
"median_ensemble","wind","36 hour",2022-01-19 23:59:00,20.6806239667385,24.5842592528906,26.8779624569941,28.9845781452446,32.9994652330373,2022-01-20 12:00:00,3.03379655240173,5.5220375430059
"median_ensemble","wind","48 hour",2022-01-19 23:59:00,11.8630347254573,16.0671587062615,18.6431246913629,20.9763830496149,25.4232164440319,2022-01-21 00:00:00,1.68334609340255,3.3168753086371
"median_ensemble","wind","60 hour",2022-01-19 23:59:00,10.8792532782247,15.0091408611694,17.1760983605193,19.4221295454738,23.5400663082643,2022-01-21 12:00:00,2.32383550843746,4.4239016394807
"median_ensemble","wind","72 hour",2022-01-19 23:59:00,4.70346943694699,9.18565042398262,12.1538296355551,15.1352529491604,20.8107414641655,2022-01-22 00:00:00,3.71916586601478,6.9261703644449
"median_ensemble","wind","84 hour",2022-01-19 23:59:00,3.09713638432571,9.35220771250469,13.0731234597857,16.6621208704151,23.1042870827456,2022-01-22 12:00:00,1.16968751473238,1.1931234597857
"ObiWanKenobi","DAX","1 day",2022-01-19 23:59:00,-1.80813904674609,-0.333338774719122,0.106815988835936,0.538671974738184,1.66221673016117,2022-01-20 17:30:00,0.273234354046681,0.540120192821296
"ObiWanKenobi","DAX","2 day",2022-01-19 23:59:00,-1.90699697792589,-0.429189206695705,0.0974915924443043,0.620983010994601,1.95820257774518,2022-01-21 17:30:00,0.777811635488472,1.40802456303122
"ObiWanKenobi","DAX","5 day",2022-01-19 23:59:00,-2.08880441108736,-0.629882115865104,0.0689357633771815,0.636252265527637,2.4983728133932,2022-01-24 17:30:00,4.28209828474578,5.25223629584443
"ObiWanKenobi","DAX","6 day",2022-01-19 23:59:00,-2.55005702900047,-0.714108209872926,-0.0166516706811351,0.635861591309395,2.18132368397172,2022-01-25 17:30:00,3.30837689441536,4.41841086617186
"ObiWanKenobi","DAX","7 day",2022-01-19 23:59:00,-3.06079700114265,-0.655868921318013,0.0639362213559229,0.812454946393944,2.49249162129778,2022-01-26 17:30:00,1.29730658099612,2.30477227511683
"ObiWanKenobi","temperature","36 hour",2022-01-19 23:59:00,-0.338602174335648,1.23538327259102,2.06125517460672,2.88712707662242,4.46111252354908,2022-01-20 12:00:00,0.506069661811675,1.03874482539328
"ObiWanKenobi","temperature","48 hour",2022-01-19 23:59:00,-2.96294750661239,-1.61414543046404,-0.906427491745856,-0.198709553027669,1.15009252312068,2022-01-21 00:00:00,0.201388489691797,0.093572508254144
"ObiWanKenobi","temperature","60 hour",2022-01-19 23:59:00,-0.61445076016481,0.821104465791296,1.57434187800746,2.32757929022363,3.76313451617974,2022-01-21 12:00:00,0.249291710808171,0.27434187800746
"ObiWanKenobi","temperature","72 hour",2022-01-19 23:59:00,-2.95187090388893,-0.447404914391391,0.86669115575883,2.18078722590905,4.68525321540659,2022-01-22 00:00:00,1.33353733370761,2.53330884424117
"ObiWanKenobi","temperature","84 hour",2022-01-19 23:59:00,-1.51901846271346,1.90646212316512,3.70381556903164,5.50116901489817,8.92664960077675,2022-01-22 12:00:00,0.564690483614535,0.50381556903164
"ObiWanKenobi","wind","36 hour",2022-01-19 23:59:00,18.9747521629626,23.6153058708085,25.6029528504409,27.5906015544232,32.2312014211782,2022-01-20 12:00:00,3.88078230061489,6.7970471495591
"ObiWanKenobi","wind","48 hour",2022-01-19 23:59:00,7.5238669932594,16.0648122947334,18.2570284899692,21.7013218098969,24.0129922569813,2022-01-21 00:00:00,1.57260778220097,3.7029715100308
"ObiWanKenobi","wind","60 hour",2022-01-19 23:59:00,9.34007196271052,14.1500545818526,16.214765553463,18.2799265335216,23.1019156697034,2022-01-21 12:00:00,2.95568190813559,5.385234446537
"ObiWanKenobi","wind","72 hour",2022-01-19 23:59:00,6.11877353884661,9.99730263180492,12.3286720167596,15.417684828171,21.1576305737352,2022-01-22 00:00:00,3.50761845536517,6.7513279832404
"ObiWanKenobi","wind","84 hour",2022-01-19 23:59:00,2.35868390467158,8.8999857627996,12.4140255601858,16.0325955233659,24.5834027239243,2022-01-22 12:00:00,1.04231327628632,0.5340255601858
"PhoebeBuffay","DAX","1 day",2022-01-19 23:59:00,-2.54777491523195,-0.586307137944008,0.161457131729127,0.771566438006484,2.20735321268353,2022-01-20 17:30:00,0.280434448859825,0.485479049928105
"PhoebeBuffay","DAX","2 day",2022-01-19 23:59:00,-3.25671062309324,-0.839708913947323,0.249382468816318,1.09428100287672,2.70950852076215,2022-01-21 17:30:00,0.753373893657444,1.55991543940324
"PhoebeBuffay","DAX","5 day",2022-01-19 23:59:00,-4.1710569464956,-0.888177153984144,0.270654051577011,1.35203940526545,3.22223174479892,2022-01-24 17:30:00,3.51169224542866,5.45395458404426
"PhoebeBuffay","DAX","6 day",2022-01-19 23:59:00,-4.90534756335487,-0.925996205866654,0.433380254754584,1.53205463037145,4.03144507825446,2022-01-25 17:30:00,2.71248810075596,4.86844279160758
"PhoebeBuffay","DAX","7 day",2022-01-19 23:59:00,-5.14400987163906,-1.10871258532029,0.475903255694927,1.63568365080328,4.48303602271085,2022-01-26 17:30:00,1.36690733182327,2.71673930945584
"PhoebeBuffay","temperature","36 hour",2022-01-19 23:59:00,-0.382974781891536,1.20253071699865,2.09138790523096,2.86820513857978,4.43264093000885,2022-01-20 12:00:00,0.509163962799013,1.00861209476904
"PhoebeBuffay","temperature","48 hour",2022-01-19 23:59:00,-2.74135965997669,-1.36816153081695,-0.773889486318345,-0.172919406467869,0.997733370763142,2022-01-21 00:00:00,0.202137245478637,0.226110513681655
"PhoebeBuffay","temperature","60 hour",2022-01-19 23:59:00,-0.383911483715908,0.940284883318087,1.62987669816569,2.26836147713541,3.75122054371208,2022-01-21 12:00:00,0.24013431928915,0.32987669816569
"PhoebeBuffay","temperature","72 hour",2022-01-19 23:59:00,-2.60913747527521,-0.615327474427607,0.790987609844978,2.14143417983985,4.26552614835964,2022-01-22 00:00:00,1.36965160775816,2.60901239015502
"PhoebeBuffay","temperature","84 hour",2022-01-19 23:59:00,-1.23137574253079,1.57499441466203,3.62968648830917,5.2904248672618,8.68090676893417,2022-01-22 12:00:00,0.556603168036461,0.42968648830917
"PhoebeBuffay","wind","36 hour",2022-01-19 23:59:00,18.4744500768917,23.7985010262351,26.4369259418178,29.3178589259487,35.0364889551958,2022-01-20 12:00:00,3.14302742001136,5.9630740581822
"PhoebeBuffay","wind","48 hour",2022-01-19 23:59:00,11.1280831045018,15.474120432166,18.0079749501293,20.9351829628907,26.0824028216735,2022-01-21 00:00:00,1.89598127506205,3.9520250498707
"PhoebeBuffay","wind","60 hour",2022-01-19 23:59:00,10.446001303577,15.0686535172893,17.1176153039582,19.3852733048032,23.9059292650542,2022-01-21 12:00:00,2.34862887565324,4.4823846960418
"PhoebeBuffay","wind","72 hour",2022-01-19 23:59:00,4.34745112153521,9.69212697868752,12.30411380904,15.732632007908,21.8317366205199,2022-01-22 00:00:00,3.47301779294069,6.77588619096
"PhoebeBuffay","wind","84 hour",2022-01-19 23:59:00,3.33934563792417,9.63046805009323,13.2805112496931,17.0404901464497,24.3274316355268,2022-01-22 12:00:00,1.23098531955029,1.4005112496931
"SamwellTarly","DAX","1 day",2022-01-19 23:59:00,-0.0350093231425975,-0.0142855113830834,-0.0034117044693892,0.0074621024443049,0.0281859142038189,2022-01-20 17:30:00,0.636166029648063,0.650347886126621
"SamwellTarly","DAX","2 day",2022-01-19 23:59:00,-0.0484809208621362,-0.0194821378591392,-0.0042664443966687,0.0109492490658016,0.0399480320687986,2022-01-21 17:30:00,1.28642188644088,1.30626652619025
"SamwellTarly","DAX","5 day",2022-01-19 23:59:00,-0.0955627436102927,-0.0460880775941667,-0.020128665704996,0.0058307461841745,0.0553054122003006,2022-01-24 17:30:00,5.12931503478041,5.16317186676225
"SamwellTarly","DAX","6 day",2022-01-19 23:59:00,-0.092370301397914,-0.0367966425512688,-0.0076370823893451,0.0215224777725786,0.0770961366192238,2022-01-25 17:30:00,4.38939491920801,4.42742545446365
"SamwellTarly","DAX","7 day",2022-01-19 23:59:00,-0.0880340030196484,-0.0278569393127467,0.0037180324624874,0.0352930042377216,0.0954700679446232,2022-01-26 17:30:00,2.20337331838514,2.2445540862234
"SamwellTarly","temperature","36 hour",2022-01-19 23:59:00,0.884762938746832,1.50556062390251,2.05506422542572,2.63215426097017,3.70112947041194,2022-01-20 12:00:00,0.536948479550205,1.04493577457428
"SamwellTarly","temperature","48 hour",2022-01-19 23:59:00,-1.74756715883364,-1.09703678531308,-0.65366371885608,-0.313434865943648,-0.0715779596343726,2022-01-21 00:00:00,0.16438734015772,0.34633628114392
"SamwellTarly","temperature","60 hour",2022-01-19 23:59:00,0.729867387070975,1.33550941375239,1.68953875762668,2.0432043440081,2.38990805780381,2022-01-21 12:00:00,0.179481416759192,0.389538757626678
"SamwellTarly","temperature","72 hour",2022-01-19 23:59:00,-1.27396388789536,-0.51106939199471,0.858755158411611,1.70799173389113,5.57512627373102,2022-01-22 00:00:00,1.47544928896607,2.54124484158839
"SamwellTarly","temperature","84 hour",2022-01-19 23:59:00,0.431431873052775,2.00028384670757,3.80281630296295,5.78299355627894,8.58507926089434,2022-01-22 12:00:00,0.580370705428143,0.602816302962953
"SamwellTarly","wind","36 hour",2022-01-19 23:59:00,21.3615412540078,22.9530526162734,23.9977890969319,24.7348407406668,26.7573870666436,2022-01-20 12:00:00,7.23568832825518,8.40221090306814
"SamwellTarly","wind","48 hour",2022-01-19 23:59:00,12.0624030183803,14.0885290964797,15.4752582739844,16.1383718548375,18.3160413014602,2022-01-21 00:00:00,5.35070374135062,6.48474172601563
"SamwellTarly","wind","60 hour",2022-01-19 23:59:00,12.2090926562164,13.4884971956621,14.1812502479052,15.3899003345117,17.2504487041955,2022-01-21 12:00:00,5.94816420930084,7.41874975209476
"SamwellTarly","wind","72 hour",2022-01-19 23:59:00,7.1308337580837,8.08722947745871,9.36606012725952,11.6971925584336,14.5669643335274,2022-01-22 00:00:00,7.13648283161561,9.71393987274048
"SamwellTarly","wind","84 hour",2022-01-19 23:59:00,4.50537118759386,7.04660754297694,9.08847675220898,12.1993149638419,18.4191537350584,2022-01-22 12:00:00,1.21271321711934,2.79152324779102
"Shaggydog","DAX","1 day",2022-01-19 23:59:00,-1.9791665179801,-0.400449787781726,0.152358877810202,0.653993479761831,1.92388207586851,2022-01-20 17:30:00,0.243390273462248,0.49457730384703
"Shaggydog","DAX","2 day",2022-01-19 23:59:00,-2.56693986633156,-0.819240465609844,0.027913892762059,0.735562218480731,2.27735307886095,2022-01-21 17:30:00,0.668129572521609,1.33844686334898
"Shaggydog","DAX","5 day",2022-01-19 23:59:00,-3.80591630577289,-1.11261023384975,-0.0068588216878236,0.891914936789258,3.15131942928608,2022-01-24 17:30:00,3.48454302669512,5.17644171077943
"Shaggydog","DAX","6 day",2022-01-19 23:59:00,-4.32512874235772,-1.03975372361115,0.0598925257002984,1.23832491586808,3.67271328850026,2022-01-25 17:30:00,2.60887433986201,4.49495506255329
"Shaggydog","DAX","7 day",2022-01-19 23:59:00,-5.08205850665419,-1.15113928253637,0.227768965131263,1.51069026027374,4.39278271674307,2022-01-26 17:30:00,1.29053107878323,2.46860501889217
"Shaggydog","temperature","36 hour",2022-01-19 23:59:00,-0.459677112784387,1.13865177659909,1.9772967097522,2.81594164290531,4.41427053228879,2022-01-20 12:00:00,0.55463246396879,1.1227032902478
"Shaggydog","temperature","48 hour",2022-01-19 23:59:00,-3.01345064752152,-1.61871549239372,-0.886896416415164,-0.155077340436612,1.23965781469119,2022-01-21 00:00:00,0.211515616534805,0.113103583584836
"Shaggydog","temperature","60 hour",2022-01-19 23:59:00,-0.89054493305707,0.583178325663501,1.35644254681677,2.12970676797005,3.60343002669062,2022-01-21 12:00:00,0.210881103191487,0.0564425468167749
"Shaggydog","temperature","72 hour",2022-01-19 23:59:00,-2.98083924502938,-0.456330508936955,0.868282012483039,2.19289453390303,4.71740326999546,2022-01-22 00:00:00,1.33109071337643,2.53171798751696
"Shaggydog","temperature","84 hour",2022-01-19 23:59:00,-1.55309538628527,1.93583271617422,3.76647714405024,5.59712157192626,9.08604967438574,2022-01-22 12:00:00,0.585815764991962,0.566477144050238
"Shaggydog","wind","36 hour",2022-01-19 23:59:00,20.567129662817,24.6313977580056,26.7639237153638,28.896449672722,32.9607177679107,2022-01-20 12:00:00,3.079076460361,5.63607628463618
"Shaggydog","wind","48 hour",2022-01-19 23:59:00,11.5209634341183,15.9399382184445,18.2585803654903,20.577222632253,24.9962000275361,2022-01-21 00:00:00,1.89187568131576,3.70141963450966
"Shaggydog","wind","60 hour",2022-01-19 23:59:00,10.9576550054166,15.1058543653906,17.2824200317232,19.4589857861444,23.6071870672802,2022-01-21 12:00:00,2.28173014189161,4.31757996827676
"Shaggydog","wind","72 hour",2022-01-19 23:59:00,3.56411884259258,9.11740048886574,12.1237650521629,15.1399813401648,20.8966389139129,2022-01-22 00:00:00,3.74283773934459,6.95623494783706
"Shaggydog","wind","84 hour",2022-01-19 23:59:00,2.65566217491851,9.21601239758645,13.0158849921381,16.8593864579259,24.22144373221,2022-01-22 12:00:00,1.20717222003448,1.13588499213813
"t2m_benchmark","temperature","36 hour",2022-01-19 23:59:00,0.1095,0.8175,1.435,1.9575,2.92275,2022-01-20 12:00:00,1.0030325,1.665
"t2m_benchmark","temperature","48 hour",2022-01-19 23:59:00,-2.61075,-2.01,-1.575,-1.1375,-0.89575,2022-01-21 00:00:00,0.2744,0.575
"t2m_benchmark","temperature","60 hour",2022-01-19 23:59:00,0.02775,0.5525,0.87,1.1825,1.656,2022-01-21 12:00:00,0.2122825,0.43
"t2m_benchmark","temperature","72 hour",2022-01-19 23:59:00,-2.312,-1.48,0.08,0.9,5.2805,2022-01-22 00:00:00,1.977925,3.32
"t2m_benchmark","temperature","84 hour",2022-01-19 23:59:00,-0.93525,1,3.11,5.235,8.357,2022-01-22 12:00:00,0.5344225,0.0900000000000003
"t2m_EMOS","temperature","36 hour",2022-01-19 23:59:00,-0.422022305830656,1.15825893284716,1.98743424374658,2.81660955464599,4.39689079332381,2022-01-20 12:00:00,0.549893522563716,1.11256575625342
"t2m_EMOS","temperature","48 hour",2022-01-19 23:59:00,-2.94735728005821,-1.59452695260937,-0.884695385985768,-0.174863819362168,1.17796650808668,2022-01-21 00:00:00,0.206280474009016,0.115304614014232
"t2m_EMOS","temperature","60 hour",2022-01-19 23:59:00,-0.820655033818339,0.638105125594028,1.40351819201786,2.16893125844169,3.62769141785405,2022-01-21 12:00:00,0.218269716205062,0.10351819201786
"t2m_EMOS","temperature","72 hour",2022-01-19 23:59:00,-2.94876042282528,-0.429893585693804,0.89175862511153,2.21341083591687,4.73227767304834,2022-01-22 00:00:00,1.31742476373075,2.50824137488847
"t2m_EMOS","temperature","84 hour",2022-01-19 23:59:00,-1.47722057615227,1.96093889895927,3.76494497200652,5.56895104505376,9.00711052016531,2022-01-22 12:00:00,0.578633519973929,0.56494497200652
"wind_benchmark","wind","36 hour",2022-01-19 23:59:00,20.7735,22.55,23.235,23.93,26.321,2022-01-20 12:00:00,7.846075,9.165
"wind_benchmark","wind","48 hour",2022-01-19 23:59:00,12.06775,14.19,15.56,16.145,18.59375,2022-01-21 00:00:00,5.21326,6.4
"wind_benchmark","wind","60 hour",2022-01-19 23:59:00,12.04625,13.1875,13.91,15.2925,16.96125,2022-01-21 12:00:00,6.17615,7.69
"wind_benchmark","wind","72 hour",2022-01-19 23:59:00,7.09825,8,9.41,11.99,15.60625,2022-01-22 00:00:00,6.64358,9.67
"wind_benchmark","wind","84 hour",2022-01-19 23:59:00,3.8995,6.8725,9.11,12.395,19.868,2022-01-22 12:00:00,1.265935,2.77
"wind_EMOS","wind","36 hour",2022-01-19 23:59:00,20.7564596809509,24.7713467687436,26.8779624569941,28.9845781452446,32.9994652330373,2022-01-20 12:00:00,3.0143294436743,5.5220375430059
"wind_EMOS","wind","48 hour",2022-01-19 23:59:00,11.8630347254573,16.3098664114452,18.6431246913629,20.9763830496149,25.4232164440319,2022-01-21 00:00:00,1.65907532288418,3.3168753086371
"wind_EMOS","wind","60 hour",2022-01-19 23:59:00,10.8792532782247,15.0091408611694,17.1760983605193,19.3430559522184,23.4729455492484,2022-01-21 12:00:00,2.34688637882392,4.4239016394807
"wind_EMOS","wind","72 hour",2022-01-19 23:59:00,3.68238066915678,9.18565042398262,12.1538296355551,15.130524558156,20.8107414641655,2022-01-22 00:00:00,3.730795270994,6.9261703644449
"wind_EMOS","wind","84 hour",2022-01-19 23:59:00,2.83591628935317,9.35220771250469,13.0731234597857,16.8298152691586,24.0196725764163,2022-01-22 12:00:00,1.19822301049316,1.1931234597857
"Yoda","DAX","1 day",2022-01-19 23:59:00,-2.44067744761049,-0.644475366104791,0.110377572656422,0.760608798259068,2.23429256893862,2022-01-20 17:30:00,0.294569838402039,0.53655860900081
"Yoda","DAX","2 day",2022-01-19 23:59:00,-3.83272081387829,-0.876051323608721,0.221005312622977,1.17557157910025,2.80349097389528,2022-01-21 17:30:00,0.751624723581892,1.5315382832099
"Yoda","DAX","5 day",2022-01-19 23:59:00,-5.11443434400372,-0.976750979433274,0.212227930445926,1.3248527103643,3.69644045530253,2022-01-24 17:30:00,3.10754110615446,5.39552846291318
"Yoda","DAX","6 day",2022-01-19 23:59:00,-5.5151281744696,-1.03036625649459,0.26812199894838,1.52433068901966,3.91897352336472,2022-01-25 17:30:00,2.65232613083341,4.70318453580138
"Yoda","DAX","7 day",2022-01-19 23:59:00,-6.38110614910556,-1.13542757077803,0.466764363898626,1.70553879097171,4.07302127551424,2022-01-26 17:30:00,1.37232138714623,2.70760041765953
"Yoda","temperature","36 hour",2022-01-19 23:59:00,-0.422022305830656,1.15825893284716,1.98743424374658,2.81660955464599,4.39689079332381,2022-01-20 12:00:00,0.549893522563716,1.11256575625342
"Yoda","temperature","48 hour",2022-01-19 23:59:00,-2.94735728005821,-1.59452695260937,-0.884695385985768,-0.174863819362168,1.17796650808668,2022-01-21 00:00:00,0.206280474009016,0.115304614014232
"Yoda","temperature","60 hour",2022-01-19 23:59:00,-0.820655033818339,0.638105125594028,1.40351819201786,2.16893125844169,3.62769141785405,2022-01-21 12:00:00,0.218269716205062,0.10351819201786
"Yoda","temperature","72 hour",2022-01-19 23:59:00,-2.94876042282528,-0.429893585693804,0.89175862511153,2.21341083591687,4.73227767304834,2022-01-22 00:00:00,1.31742476373075,2.50824137488847
"Yoda","temperature","84 hour",2022-01-19 23:59:00,-1.47722057615227,1.96093889895927,3.76494497200652,5.56895104505376,9.00711052016531,2022-01-22 12:00:00,0.578633519973929,0.56494497200652
"Yoda","wind","36 hour",2022-01-19 23:59:00,20.7564596809508,24.7713467687436,26.8779624569941,28.9845781452446,32.9994652330373,2022-01-20 12:00:00,3.0143294436743,5.5220375430059
"Yoda","wind","48 hour",2022-01-19 23:59:00,11.8630347254573,16.3098664114452,18.6431246913629,20.9763830496149,25.4232164440319,2022-01-21 00:00:00,1.65907532288418,3.3168753086371
"Yoda","wind","60 hour",2022-01-19 23:59:00,10.8792532782247,15.0091408611694,17.1760983605193,19.3430559522184,23.4729455492484,2022-01-21 12:00:00,2.34688637882392,4.4239016394807
"Yoda","wind","72 hour",2022-01-19 23:59:00,3.68238066915678,9.18565042398262,12.1538296355551,15.130524558156,20.8107414641655,2022-01-22 00:00:00,3.730795270994,6.9261703644449
"Yoda","wind","84 hour",2022-01-19 23:59:00,2.83591628935317,9.35220771250469,13.0731234597857,16.8298152691586,24.0196725764163,2022-01-22 12:00:00,1.19822301049316,1.1931234597857
