"forecast_date","target","horizon","q0.025","q0.25","q0.5","q0.75","q0.975"
2021-12-22,"DAX","1 day",-1.5584758592322,-0.41945694147621,0.125649940909352,0.62518841017004,1.63213980618756
2021-12-22,"DAX","2 day",-2.75263105172428,-1.01903773040917,0.405757544530547,1.46685306098701,2.77478555619755
2021-12-22,"DAX","5 day",-3.5553921888104,-1.11668286654695,0.300977547225375,1.58455326927225,3.86355964735507
2021-12-22,"DAX","6 day",-4.00640323770928,-1.28911269811972,0.291325818354653,1.73199799938765,4.48032157474192
2021-12-22,"DAX","7 day",-4.43419488149412,-1.46522808522719,0.257393239725752,1.88805226406175,4.94974927534899
2021-12-22,"temperature","36 hour",-1.73723290514947,-0.384232204029483,0.224985666767134,1.04319922165929,3.05194469709263
2021-12-22,"temperature","48 hour",-0.437925451921893,0.922183222452874,1.41179090394635,2.14237329820171,3.71569425689037
2021-12-22,"temperature","60 hour",0.666448546871203,2.30731290172933,3.02431254353505,4.17883812452549,6.86722590176613
2021-12-22,"temperature","72 hour",-2.36461454392412,-0.763307034188746,-0.0648840986166762,0.973363415345567,3.01829085957792
2021-12-22,"temperature","84 hour",-2.27408919980835,-0.946752393140263,-0.0665454915110786,1.28522516041973,3.55381554355872
2021-12-22,"wind","36 hour",4.48664218546014,8.50734773880027,11.0219609938933,13.1151330605937,16.4325635363271
2021-12-22,"wind","48 hour",5.04625618421646,9.3795704239868,11.4810475909339,13.454268465726,18.1671806345568
2021-12-22,"wind","60 hour",7.079980844807,14.2526939024014,18.0641806346854,22.1780824274592,28.373078807358
2021-12-22,"wind","72 hour",4.72355549653991,7.81664098696184,9.89590718539185,12.2111054218253,17.5689110031033
2021-12-22,"wind","84 hour",4.79382623674123,8.7054039654893,11.2919572025043,14.0043327781801,18.6748901444639
