"forecast_date","target","horizon","q0.025","q0.25","q0.5","q0.75","q0.975"
2021-10-27,"DAX","1 day",-1.23064597735448,-0.368002949531811,-0.0747224614446484,0.218558026642514,1.08120105446518
2021-10-27,"DAX","2 day",-1.99839277093688,-0.52637452441627,-0.0178380036473744,0.490698517121522,1.96271676364213
2021-10-27,"DAX","5 day",-2.40659723180217,-0.60724814195139,-0.00592892641207428,0.595390289127241,2.39473937897803
2021-10-27,"DAX","6 day",-2.85011237593657,-0.651598262791511,0.0661500755413695,0.78389841387425,2.98241252701931
2021-10-27,"DAX","7 day",-3.21694360903609,-0.667136359054492,0.114768089753967,0.896672538562425,3.44647978854403
