forecast_date,target,horizon,q0.025,q0.25,q0.5,q0.75,q0.975
2021-11-03,DAX,1 day,-2.658,-0.482,0.073,0.662,2.229
2021-11-03,DAX,2 day,-3.767,-0.739,0.142,0.906,3.101
2021-11-03,DAX,5 day,-4.730,-0.823,0.157,1.186,3.890
2021-11-03,DAX,6 day,-5.232,-0.943,0.215,1.391,4.574
2021-11-03,DAX,7 day,-5.687,-1.064,0.354,1.465,5.192
2021-11-03,temperature,36 hour,7.12725,7.42,7.705,8.025,8.573
2021-11-03,temperature,48 hour,6.7635,7.3625,7.99,8.2625,8.70275
2021-11-03,temperature,60 hour,8.81375,9.345,9.71,9.945,10.63075
2021-11-03,temperature,72 hour,5.02875,6.46,6.965,7.395,8.219
2021-11-03,temperature,84 hour,8.765,10.07,10.54,10.96,11.76875
2021-11-03,wind,36 hour,31.9671,44.64,50.706,57.492,68.1264
2021-11-03,wind,48 hour,30.1995,41.571,50.13,59.328,79.0173
2021-11-03,wind,60 hour,36.7263,43.686,48.06,51.723,62.3628
2021-11-03,wind,72 hour,27.0126,39.114,42.912,49.995,58.6368
2021-11-03,wind,84 hour,33.2568,45.63,52.866,58.059,68.7672
