"forecast_date","target","horizon","q0.025","q0.25","q0.5","q0.75","q0.975"
2021-10-27,"DAX","1 day",-1.8161953693977,-0.324756987105124,0.109073715116637,0.572088417648819,1.67659203602573
2021-10-27,"DAX","2 day",-1.89737100520356,-0.447922085649877,0.0894760728813893,0.668424142305879,2.27868649322914
2021-10-27,"DAX","5 day",-2.13308778549318,-0.534901799109821,0.166567016445729,0.935018516664465,2.92076047370097
2021-10-27,"DAX","6 day",-2.07149915297452,-0.545991627165243,0.190332055613585,1.04763131286885,3.03955771179448
2021-10-27,"DAX","7 day",-2.60377642353261,-0.446004730207727,0.335185949158934,1.11401151785357,3.20454371441699
2021-10-27,"temperature","36 hour",0,0,0,0,0
2021-10-27,"temperature","48 hour",0,0,0,0,0
2021-10-27,"temperature","60 hour",0,0,0,0,0
2021-10-27,"temperature","72 hour",0,0,0,0,0
2021-10-27,"temperature","84 hour",0,0,0,0,0
2021-10-27,"wind","36 hour",0,0,0,0,0
2021-10-27,"wind","48 hour",0,0,0,0,0
2021-10-27,"wind","60 hour",0,0,0,0,0
2021-10-27,"wind","72 hour",0,0,0,0,0
2021-10-27,"wind","84 hour",0,0,0,0,0
