"model","target","horizon","forecast_date","q0.025","q0.25","q0.5","q0.75","q0.975","value","qscore_q0.025","qscore_q0.25","qscore_q0.5","qscore_q0.75","qscore_q0.975","mean_qscore","ae","interval_coverage_0.5","interval_coverage_0.95","scores_imputed"
"AryaStark","DAX","1 day",2021-12-08,-2.95651486776012,-0.751611687095848,0.0741508783073308,0.885584374509759,2.94700548357465,-0.305366669036999,0.132557409936156,0.223122509029424,0.37951754734433,0.595475521773379,0.162618607630583,0.298658319142774,0.37951754734433,TRUE,TRUE,FALSE
"GinaLinetti","DAX","1 day",2021-12-08,-2.768865,-0.9478292,0.007670316,0.9631698,2.784206,-0.305366669036999,0.12317491654815,0.3212312654815,0.313036985036999,0.6342682345185,0.15447863345185,0.3092380070074,0.313036985036999,TRUE,TRUE,FALSE
"ChandlerBing","DAX","1 day",2021-12-08,-3.2617248808445,-1.0722885081349,0.0765111742272687,1.22531085658944,3.41474722929904,-0.305366669036999,0.147817910590375,0.383460919548952,0.381877843264268,0.76533876281322,0.186005694916802,0.372900226226723,0.381877843264268,TRUE,TRUE,FALSE
"Joey","DAX","1 day",2021-12-08,-2.023183,-0.880331,-0.212765,1.315604,1.735455,-0.305366669036999,0.08589081654815,0.2874821654815,0.0926016690369994,0.8104853345185,0.10204108345185,0.2757002138074,0.0926016690369994,TRUE,TRUE,FALSE
"DougJudy","DAX","1 day",2021-12-08,-3.45427986890291,-0.709600924681458,0.0635829392248317,0.842493174947417,3.28231491588744,-0.305366669036999,0.157445659993296,0.202117127822229,0.368949608261831,0.573929921992208,0.179384079246222,0.296365279463157,0.368949608261831,TRUE,TRUE,FALSE
"Bronn","DAX","1 day",2021-12-08,-2.75542148506779,-0.603312312944606,0.0789620363235132,0.739532581634929,2.6154142194292,-0.305366669036999,0.12250274080154,0.148972821953803,0.384328705360513,0.522449625335964,0.14603904442331,0.264858587575026,0.384328705360513,TRUE,TRUE,FALSE
"HanSolo","DAX","1 day",2021-12-08,-3.27126260271771,-0.56013348512203,0.0227635369947071,0.582598650304708,2.08456299818993,-0.305366669036999,0.148294796684036,0.127383408042515,0.328130206031707,0.443982659670854,0.119496483361347,0.233457510758091,0.328130206031707,TRUE,TRUE,FALSE
"DAX_benchmark","DAX","1 day",2021-12-08,-2.71099410396365,-0.485396555504147,0.0733950537846084,0.65948147757644,2.43822167008952,-0.305366669036999,0.120281371746333,0.0900149432335738,0.378761722821608,0.48242407330672,0.137179416956326,0.241732305612912,0.378761722821608,TRUE,TRUE,FALSE
"KyloRen","DAX","1 day",2021-12-08,-2.60320554295652,-0.459747799811703,0.0822876872871249,0.651130885472294,2.30508515493297,-0.305366669036999,0.114891943695976,0.0771905653873518,0.387654356324124,0.478248777254647,0.130522591198499,0.237701646772119,0.387654356324124,TRUE,TRUE,FALSE
"GeneralGrievous","DAX","1 day",2021-12-08,-0.43,-0.13,0.03,0.2,0.5,-0.305366669036999,0.00623166654815003,0.263050003555499,0.335366669036999,0.2526833345185,0.04026833345185,0.1795200014222,0.335366669036999,FALSE,TRUE,FALSE
"CaptainRaymondHolt","DAX","1 day",2021-12-08,-3.0894841598946,-0.4654545533743,0.0754703763075959,0.661280603420433,2.57699054200194,-0.305366669036999,0.13920587454288,0.0800439421686505,0.380837045344595,0.483323636228716,0.144117860551947,0.245505671767358,0.380837045344595,TRUE,TRUE,FALSE
"HotPie","DAX","1 day",2021-12-08,-1.62805854423804,-0.33320918250882,0.235678872419067,0.722654243758806,1.89296919820558,-0.305366669036999,0.066134593760052,0.0139212567359103,0.541045541456066,0.514010456397903,0.109916793362129,0.249005728342412,0.541045541456066,TRUE,TRUE,FALSE
"DexterJettster","DAX","1 day",2021-12-08,-4.08580327954918,-0.714478189327604,0.188162055986197,0.995979346870328,3.3131901028634,-0.305366669036999,0.189021830525609,0.204555760145302,0.493528725023196,0.650673007953664,0.18092783859502,0.343741432448558,0.493528725023196,TRUE,TRUE,FALSE
"mean_ensemble","DAX","1 day",2021-12-08,-2.68111093551009,-0.62434431001803,0.083209280546784,0.822869487182892,2.49329854076243,-0.305366669036999,0.118787213323655,0.159488820490515,0.388575949583783,0.564118078109946,0.139933260489972,0.274180664399574,0.388575949583783,TRUE,TRUE,FALSE
"median_ensemble","DAX","1 day",2021-12-08,-2.768865,-0.603312312944606,0.0754703763075959,0.807759199764219,2.57699054200194,-0.305366669036999,0.12317491654815,0.148972821953803,0.380837045344595,0.556562934400609,0.144117860551947,0.270733115759821,0.380837045344595,TRUE,TRUE,FALSE
"PhoebeBuffay","DAX","1 day",2021-12-08,-2.46510442218014,-0.626100535814584,0.10476881371127,0.971383442182712,2.62337478793168,-0.305366669036999,0.107986887657157,0.160366933388792,0.410135482748269,0.638375055609856,0.146437072848434,0.292660286450502,0.410135482748269,TRUE,TRUE,FALSE
"SamwellTarly","DAX","1 day",2021-12-08,-1.75725796241293,-0.575902917976802,0.0439553783049986,0.663813674586799,1.84516871902293,-0.305366669036999,0.0725945646687967,0.135268124469901,0.349322047341998,0.484590171811899,0.107526769402997,0.229860335539118,0.349322047341998,TRUE,TRUE,FALSE
"UglyNakedGuy","DAX","1 day",2021-12-08,-2.33879064640473,-0.309234738350297,0.339562614063866,0.900401606770059,2.32858103144102,-0.305366669036999,0.101671198868387,0.00193403465664882,0.644929283100865,0.602884137903529,0.131697385023901,0.296623207910666,0.644929283100865,TRUE,TRUE,FALSE
"Yoda","DAX","1 day",2021-12-08,-2.85935268889392,-0.72952458419986,0.0355452095916518,0.688419978422458,2.1255767792494,-0.305366669036999,0.127699300992846,0.21207895758143,0.340911878628651,0.496893323729729,0.12154717241432,0.259826126669395,0.340911878628651,TRUE,TRUE,FALSE
"ObiWanKenobi","DAX","1 day",2021-12-08,-3.02560140301468,-0.593610114469322,0.0863891730629971,0.807759199764219,2.84938402996064,-0.305366669036999,0.136011736698884,0.144121722716161,0.391755842099996,0.556562934400609,0.157737534949882,0.277237954173107,0.391755842099996,TRUE,TRUE,FALSE
"Shaggydog","DAX","1 day",2021-12-08,-3.45620331589026,-0.914775601026293,0.174885214791868,1.15792235966414,3.71042441240676,-0.305366669036999,0.157541832342663,0.304704465994647,0.480251883828867,0.731644514350569,0.200789554072188,0.374986450117787,0.480251883828867,TRUE,TRUE,FALSE
"ChandlerBing","DAX","2 day",2021-12-08,-4.87299162421623,-1.55928992916578,0.179413009255656,1.91811594767709,5.23181764272754,-0.407406889804207,0.223279236720601,0.575941519680786,0.586819899059863,1.16276141874065,0.281961226626587,0.566152660165697,0.586819899059863,TRUE,TRUE,FALSE
"AryaStark","DAX","2 day",2021-12-08,-3.43423948665825,-0.84819557625469,0.15394269408694,1.09638471624103,3.36686463031345,-0.407406889804207,0.151341629842702,0.220394343225241,0.561349583891147,0.751895803022619,0.188713576005883,0.374738987197518,0.561349583891147,TRUE,TRUE,FALSE
"Bronn","DAX","2 day",2021-12-08,-3.88498524582038,-0.894563145326011,0.159808207997058,1.10275487931968,3.52408620747837,-0.407406889804207,0.173878917800809,0.243578127760902,0.567215097801265,0.755080884561944,0.196574654864129,0.38726553655781,0.567215097801265,TRUE,TRUE,FALSE
"CaptainRaymondHolt","DAX","2 day",2021-12-08,-4.05773752752467,-0.742306620175492,0.16216460067513,0.921903639743515,3.38280928059834,-0.407406889804207,0.182516531886023,0.167449865185643,0.569571490479337,0.664655264773861,0.189510808520127,0.354740792168998,0.569571490479337,TRUE,TRUE,FALSE
"DAX_benchmark","DAX","2 day",2021-12-08,-3.93656249759128,-0.743836242666962,0.162164603826653,0.910938083469892,3.1329715130069,-0.407406889804207,0.176457780389354,0.168214676431377,0.56957149363086,0.65917248663705,0.177018920140556,0.350087071445839,0.56957149363086,TRUE,TRUE,FALSE
"DexterJettster","DAX","2 day",2021-12-08,-4.21988617591363,-0.744021848136061,0.934387627980652,1.83423976337694,3.52232063757725,-0.407406889804207,0.190623964305471,0.168307479165927,1.34179451778486,1.12082332659057,0.196486376369073,0.603607132843181,1.34179451778486,TRUE,TRUE,FALSE
"mean_ensemble","DAX","2 day",2021-12-08,-3.71742783250936,-0.942073420656298,0.190909486107616,1.18484995439229,3.33419968620494,-0.407406889804207,0.165501047135258,0.267333265426045,0.598316375911823,0.796128422098249,0.187080328800458,0.402871887874366,0.598316375911823,TRUE,TRUE,FALSE
"GinaLinetti","DAX","2 day",2021-12-08,-3.824753,-1.272538,0.06661209,1.405762,3.957977,-0.407406889804207,0.17086730550979,0.432565555097896,0.474018979804207,0.906584444902104,0.218269194490211,0.440461095960841,0.474018979804207,TRUE,TRUE,FALSE
"PhoebeBuffay","DAX","2 day",2021-12-08,-4.26993755632657,-0.982172521573506,0.140816183945303,1.10845446528612,3.05075554112539,-0.407406889804207,0.193126533326118,0.287382815884649,0.54822307374951,0.757930677545164,0.17290812154648,0.391914244410384,0.54822307374951,TRUE,TRUE,FALSE
"Joey","DAX","2 day",2021-12-08,-2.269776,-1.109536,-0.017447,0.777061,2.899713,-0.407406889804207,0.0931184555097896,0.351064555097896,0.389959889804207,0.592233944902104,0.165355994490211,0.318346567960841,0.389959889804207,TRUE,TRUE,FALSE
"DougJudy","DAX","2 day",2021-12-08,-4.6060382751306,-1.08482462834693,-0.0834778769099969,0.857697911391294,3.87818134721805,-0.407406889804207,0.20993156926632,0.338708869271361,0.32392901289421,0.632552400597751,0.214279411851113,0.343880252776151,0.32392901289421,TRUE,TRUE,FALSE
"median_ensemble","DAX","2 day",2021-12-08,-3.93656249759128,-0.84819557625469,0.15394269408694,1.0837719699674,3.36686463031345,-0.407406889804207,0.176457780389354,0.220394343225241,0.561349583891147,0.745589429885804,0.188713576005883,0.378500942679486,0.561349583891147,TRUE,TRUE,FALSE
"HanSolo","DAX","2 day",2021-12-08,-4.1680621967853,-0.815851355612545,0.0621796344613922,0.983063018751354,2.51657707425355,-0.407406889804207,0.188032765349054,0.204222232904169,0.469586524265599,0.69523495427778,0.146199198202888,0.340655134999898,0.469586524265599,TRUE,TRUE,FALSE
"SamwellTarly","DAX","2 day",2021-12-08,-1.94001576143866,-0.668794153304173,-0.0017827718181252,0.665228609667923,1.93645021780241,-0.407406889804207,0.0766304435817228,0.130693631749983,0.405624117986082,0.536317749736065,0.117192855380331,0.253291759686837,0.405624117986082,TRUE,TRUE,FALSE
"KyloRen","DAX","2 day",2021-12-08,-3.53557228783887,-0.677148856320289,0.149157443863254,0.904802703888695,3.11425027253125,-0.407406889804207,0.156408269901733,0.134870983258041,0.556564333667461,0.656104796846451,0.176082858116773,0.336006248358092,0.556564333667461,TRUE,TRUE,FALSE
"GeneralGrievous","DAX","2 day",2021-12-08,-0.62,-0.31,-0.15,0.01,0.32,-0.407406889804207,0.0106296555097896,0.146110334706311,0.257406889804207,0.208703444902104,0.0363703444902104,0.131844133882524,0.257406889804207,FALSE,TRUE,FALSE
"ObiWanKenobi","DAX","2 day",2021-12-08,-3.65261442561186,-0.693978406696148,0.202611233436224,1.0143175887875,3.4367115746139,-0.407406889804207,0.162260376790383,0.14328575844597,0.610018123240431,0.710862239295854,0.192205923220906,0.363726484198709,0.610018123240431,TRUE,TRUE,FALSE
"HotPie","DAX","2 day",2021-12-08,-4.32104713430258,-1.75169561261103,0.907602535762146,2.83335101578053,4.62385642501613,-0.407406889804207,0.195682012224919,0.672144361403411,1.31500942556635,1.62037895279237,0.251563165741017,0.810955583545614,1.31500942556635,TRUE,TRUE,FALSE
"Shaggydog","DAX","2 day",2021-12-08,-5.42859865815031,-1.35620628287322,0.189253071737508,1.69525101481632,5.01144855108451,-0.407406889804207,0.251059588417305,0.474399696534509,0.596659961541716,1.05132895231026,0.270942772044436,0.528878194169646,0.596659961541716,TRUE,TRUE,FALSE
"UglyNakedGuy","DAX","2 day",2021-12-08,-3.58159228188008,-0.585826868706255,0.357408945404017,1.38905080528823,3.30540378687731,-0.407406889804207,0.158709269603794,0.0892099894510239,0.764815835208224,0.898228847546219,0.185640533834076,0.419320895128667,0.764815835208224,TRUE,TRUE,FALSE
"Yoda","DAX","2 day",2021-12-08,-4.00671868248857,-1.05860894470057,0.0524660023408944,1.0837719699674,3.13759933566947,-0.407406889804207,0.179965589634218,0.32560102744818,0.459872892145102,0.745589429885806,0.177250311273684,0.377655850077398,0.459872892145102,TRUE,TRUE,FALSE
"GinaLinetti","DAX","5 day",2021-12-08,-0.5938751,1.99592,3.354789,4.713657,7.303452,-0.417583503730512,0.0088145798134744,3.62025525559577,3.77237250373051,2.56562025186526,0.386051775186526,2.07062287323831,3.77237250373051,FALSE,TRUE,FALSE
"ChandlerBing","DAX","5 day",2021-12-08,-5.39250769853944,-1.65732170004978,0.30253451779415,2.26239073563808,5.99757673412774,-0.417583503730512,0.248746209740446,0.619869098159632,0.720118021524662,1.33998711968429,0.320758011892913,0.64989569220039,0.720118021524662,TRUE,TRUE,FALSE
"DexterJettster","DAX","5 day",2021-12-08,-4.35396907227808,-0.773565506944518,0.151047724588338,1.97764858332365,3.73145117229111,-0.417583503730512,0.196819278427378,0.177991001607003,0.56863122831885,1.19761604352708,0.207451733801081,0.469701857136279,0.56863122831885,TRUE,TRUE,FALSE
"AryaStark","DAX","5 day",2021-12-08,-4.09615630088585,-0.740716053492074,0.563535582007417,1.80322357416726,4.66947058598143,-0.417583503730512,0.183928639857767,0.161566274880781,0.981119085737929,1.11040353894889,0.254352704485597,0.538274048782192,0.981119085737929,TRUE,TRUE,FALSE
"Bronn","DAX","5 day",2021-12-08,-4.85209744766788,-1.06803940615655,0.23245844321584,1.40641372250106,4.24726274675144,-0.417583503730512,0.221725697196868,0.325227951213018,0.650041946946353,0.911998613115787,0.233242312524098,0.468447304199225,0.650041946946353,TRUE,TRUE,FALSE
"HanSolo","DAX","5 day",2021-12-08,-4.55208676841982,-1.04952501092186,0.228778294548704,1.15596141455723,3.101332233719,-0.417583503730512,0.206725163234466,0.315970753595672,0.646361798279216,0.786772459143869,0.175945786872476,0.42635519222514,0.646361798279216,TRUE,TRUE,FALSE
"DAX_benchmark","DAX","5 day",2021-12-08,-4.75944674725471,-0.849379110212389,0.163942978832576,1.21502365472375,3.89032640718187,-0.417583503730512,0.21709316217621,0.215897803240938,0.581526482563088,0.816303579227131,0.215395495545619,0.409243304550597,0.581526482563088,TRUE,TRUE,FALSE
"DougJudy","DAX","5 day",2021-12-08,-4.42008042473878,-0.445036233162608,0.660915010795202,1.78343439431521,5.16432020489951,-0.417583503730512,0.200124846050413,0.0137263647160482,1.07849851452571,1.10050894902286,0.279095185431501,0.534390771949308,1.07849851452571,TRUE,TRUE,FALSE
"GeneralGrievous","DAX","5 day",2021-12-08,-0.91,-0.61,-0.44,-0.28,0.03,-0.417583503730512,0.0246208248134744,0.096208248134744,0.022416496269488,0.068791751865256,0.0223791751865256,0.0468832992538976,0.022416496269488,TRUE,TRUE,FALSE
"CaptainRaymondHolt","DAX","5 day",2021-12-08,-5.03844956952209,-0.834726688584375,0.170139639649136,1.22399324045142,4.30744297622689,-0.417583503730512,0.231043303289579,0.208571592426932,0.587723143379648,0.820788372090964,0.236251323997871,0.416875547036999,0.587723143379648,TRUE,TRUE,FALSE
"HotPie","DAX","5 day",2021-12-08,-4.8408331772221,-1.78249184298892,0.385457974959172,2.39462637302957,5.4398907912425,-0.417583503730512,0.221162483674579,0.682454169629204,0.803041478689684,1.40610493838004,0.292873714748651,0.681127357024432,0.803041478689684,TRUE,TRUE,FALSE
"Shaggydog","DAX","5 day",2021-12-08,-6.32248757691421,-1.4705098496345,0.466982023990259,2.21488874619255,5.92667036783598,-0.417583503730512,0.295245203659185,0.526463172951995,0.884565527720771,1.31623612496153,0.317212693578325,0.667944544574361,0.884565527720771,TRUE,TRUE,FALSE
"mean_ensemble","DAX","5 day",2021-12-08,-4.22336365963575,-0.696560052766279,0.528252795914385,1.7906896825111,4.40652631890492,-0.417583503730512,0.190289007795262,0.139488274517883,0.945836299644897,1.10413659312081,0.241205491131772,0.524191133242124,0.945836299644897,TRUE,TRUE,FALSE
"median_ensemble","DAX","5 day",2021-12-08,-4.75944674725471,-0.834726688584375,0.30253451779415,1.75411092200915,4.30744297622689,-0.417583503730512,0.21709316217621,0.208571592426932,0.720118021524662,1.08584721286983,0.23625132399787,0.493576262599101,0.720118021524662,TRUE,TRUE,FALSE
"PhoebeBuffay","DAX","5 day",2021-12-08,-5.48967761267348,-1.26763195151305,0.32697612512119,1.51184836993619,3.71881078885944,-0.417583503730512,0.253604705447148,0.425024223891269,0.744559628851702,0.964715936833351,0.206819714629498,0.518944841930594,0.744559628851702,TRUE,TRUE,FALSE
"Joey","DAX","5 day",2021-12-08,-5.842215,-1.254954,-0.339736,1.357249,4.80213,-0.417583503730512,0.271231574813474,0.418685248134744,0.077847503730512,0.887416251865256,0.260985675186526,0.383233250746102,0.077847503730512,TRUE,TRUE,FALSE
"UglyNakedGuy","DAX","5 day",2021-12-08,-4.98286135617503,-0.812165134351021,0.419567554387296,1.78468187760492,4.21585029019252,-0.417583503730512,0.228263892622226,0.197290815310254,0.837151058117808,1.10113269066772,0.231671689696152,0.519102029282831,0.837151058117808,TRUE,TRUE,FALSE
"Yoda","DAX","5 day",2021-12-08,-5.56786362863729,-1.05757895951059,0.0716296470575086,1.24372754552705,3.85516976029037,-0.417583503730512,0.257514006245339,0.319997727890038,0.489213150788021,0.830655524628782,0.213637663201044,0.422203614550645,0.489213150788021,TRUE,TRUE,FALSE
"ObiWanKenobi","DAX","5 day",2021-12-08,-4.18039751229502,-0.534244758271389,0.588708147106275,1.75411092200915,4.60287254940474,-0.417583503730512,0.188140700428225,0.0583306272704385,1.00629165083679,1.08584721286983,0.251022802656763,0.517926598812409,1.00629165083679,TRUE,TRUE,FALSE
"SamwellTarly","DAX","5 day",2021-12-08,0.297304781159632,1.76497172168829,2.5350581859988,3.30514465030932,4.77281159083798,-0.417583503730512,1.39403215553578,3.2738328381282,2.95264168972932,1.86136407701992,0.259519754728425,1.94827810302833,2.95264168972932,FALSE,FALSE,FALSE
"KyloRen","DAX","5 day",2021-12-08,-4.34620932101506,-0.787646518453975,0.194018272321441,1.19508016342443,3.94715885935092,-0.417583503730512,0.196431290864227,0.185031507361732,0.611601776051953,0.806331833577471,0.218237118154072,0.403526705201891,0.611601776051953,TRUE,TRUE,FALSE
"AryaStark","DAX","6 day",2021-12-08,-3.95312698486094,-0.657417978645074,0.598102428189786,1.76426738280055,4.45094222414869,-1.49987014601649,0.122662841942222,1.26367825105713,2.09797257420628,1.63206876440852,0.297540618508259,1.08278461002448,2.09797257420628,FALSE,TRUE,FALSE
"Bronn","DAX","6 day",2021-12-08,-5.51898566405351,-1.20190264842815,0.293949359258868,1.62876250463708,4.77399414152379,-1.49987014601649,0.200955775901851,0.446951246382516,1.79381950527536,1.56431632532679,0.313693214377014,0.863947213452705,1.79381950527536,FALSE,TRUE,FALSE
"CaptainRaymondHolt","DAX","6 day",2021-12-08,-5.69839927016786,-0.945714692536592,0.290792166632325,1.41747971068051,5.16868699249392,-1.49987014601649,0.209926456207569,0.831233180219848,1.79066231264882,1.4586749283485,0.333427856925521,0.924784946870051,1.79066231264882,FALSE,TRUE,FALSE
"HotPie","DAX","6 day",2021-12-08,-5.34060635366716,-2.00746302853719,0.183862615865656,2.24852794931596,5.86045756999967,-1.49987014601649,0.192036810382533,0.25379644126035,1.68373276188215,1.87419904766623,0.368016385800808,0.874356289398413,1.68373276188215,TRUE,TRUE,FALSE
"DexterJettster","DAX","6 day",2021-12-08,-7.36557382691036,-1.22969029601622,0.370572684516884,2.12105740327036,8.56859724881518,-1.49987014601649,0.293285184044693,0.405269775000407,1.87044283053337,1.81046377464343,0.503423369741584,0.976576986792697,1.87044283053337,FALSE,TRUE,FALSE
"mean_ensemble","DAX","6 day",2021-12-08,-4.67721661905723,-0.865642909262657,0.476121153033474,1.86150885647819,4.92269222152353,-1.49987014601649,0.158867323652037,0.951340855130751,1.97599129904996,1.68068950124734,0.321128118377001,1.01760341949142,1.97599129904996,FALSE,TRUE,FALSE
"GinaLinetti","DAX","6 day",2021-12-08,-1.16356,1.396269,2.739414,4.08256,6.642389,-1.49987014601649,0.655804784732157,4.34420871902474,4.23928414601649,2.79121507300825,0.407112957300825,2.48752513601649,4.23928414601649,FALSE,FALSE,FALSE
"ChandlerBing","DAX","6 day",2021-12-08,-4.1100176208999,-1.16302668883912,0.383262707315287,1.92955210346969,4.87654303553047,-1.49987014601649,0.13050737374417,0.505265185766056,1.88313285333178,1.71471112474309,0.318820659077348,0.910487439332489,1.88313285333178,FALSE,TRUE,FALSE
"Joey","DAX","6 day",2021-12-08,-6.037626,-2.104877,-1.105209,1.802798,5.702994,-1.49987014601649,0.226887792699175,0.302503426991755,0.394661146016491,1.65133407300825,0.360143207300825,0.587105929203298,0.394661146016491,TRUE,TRUE,FALSE
"DougJudy","DAX","6 day",2021-12-08,-4.54409864217702,-0.172264080946838,1.04204192264746,2.27825021975693,6.05930452217919,-1.49987014601649,0.152211424808026,1.99140909760448,2.54191206866395,1.88906018288671,0.377958733409784,1.39051030147459,2.54191206866395,FALSE,TRUE,FALSE
"median_ensemble","DAX","6 day",2021-12-08,-5.24615804417818,-1.1148874590796,0.293949359258868,1.76426738280055,4.69440506438463,-1.49987014601649,0.187314394908084,0.577474030405336,1.79381950527536,1.63206876440852,0.309713760520056,0.900078091103471,1.79381950527536,FALSE,TRUE,FALSE
"HanSolo","DAX","6 day",2021-12-08,-4.60632468942858,-1.33915940045195,0.24389174570181,1.35664621381033,3.81166797443493,-1.49987014601649,0.155322727170604,0.241066118346819,1.7437618917183,1.42825817991341,0.265576906022571,0.766797164634341,1.7437618917183,FALSE,TRUE,FALSE
"DAX_benchmark","DAX","6 day",2021-12-08,-5.24615804417818,-0.968345906220103,0.237904627820118,1.40651637752689,4.57407374600166,-1.49987014601649,0.187314394908084,0.797286359694582,1.73777477383661,1.45319326177169,0.303697194600908,0.895853196962375,1.73777477383661,FALSE,TRUE,FALSE
"KyloRen","DAX","6 day",2021-12-08,-4.94236410294969,-0.901375062543896,0.250338983795639,1.37146763863798,4.50378016561459,-1.49987014601649,0.17212469784666,0.897742625208892,1.75020912981213,1.43566889232724,0.300182515581554,0.911185572155294,1.75020912981213,FALSE,TRUE,FALSE
"GeneralGrievous","DAX","6 day",2021-12-08,-0.78,-0.48,-0.31,-0.15,0.15,-1.49987014601649,1.40374678473216,1.52980521902474,1.18987014601649,0.674935073008246,0.0824935073008246,0.976170146016491,1.18987014601649,FALSE,FALSE,FALSE
"ObiWanKenobi","DAX","6 day",2021-12-08,-3.88902961168026,-0.43523284705022,0.628772713888271,1.6453788270271,4.24768266066392,-1.49987014601649,0.119457973283188,1.59695594844941,2.12864285990476,1.5726244865218,0.287377640334021,1.14101178169863,2.12864285990476,FALSE,TRUE,FALSE
"PhoebeBuffay","DAX","6 day",2021-12-08,-5.85687453217572,-1.28492304530066,0.291272109187278,1.68389696783919,4.2100003704458,-1.49987014601649,0.217850219307961,0.322420651073747,1.79114225520377,1.59188355692784,0.285493525823115,0.841758041667286,1.79114225520377,FALSE,TRUE,FALSE
"Shaggydog","DAX","6 day",2021-12-08,-7.12932865451812,-1.660648221496,0.577173302357419,2.6604961452964,6.78134286485753,-1.49987014601649,0.281472925425081,0.0803890377397569,2.07704344837391,2.08018314565644,0.414060650543701,0.986629841547779,2.07704344837391,TRUE,TRUE,FALSE
"UglyNakedGuy","DAX","6 day",2021-12-08,-6.05986536533409,-1.11969210598624,0.441130603174276,2.05974681644141,4.69440506438463,-1.49987014601649,0.22799976096588,0.570267060045377,1.94100074919077,1.77980848122895,0.309713760520056,0.965757962390206,1.94100074919077,FALSE,TRUE,FALSE
"Yoda","DAX","6 day",2021-12-08,-6.03270409986568,-1.1148874590796,0.140157283319596,1.50665689073187,4.3640750207021,-1.49987014601649,0.22664169769246,0.577474030405341,1.64002742933609,1.50326351837418,0.29319725833593,0.8481207868288,1.64002742933609,FALSE,TRUE,FALSE
"SamwellTarly","DAX","6 day",2021-12-08,-0.592472299220382,0.943136186087371,1.74887165396534,2.5546071218433,4.09021560715105,-1.49987014601649,1.76942580125241,3.66450949815579,3.24874179998183,2.0272386339299,0.279504287658377,2.19788400419566,3.24874179998183,FALSE,FALSE,FALSE
"CaptainRaymondHolt","DAX","7 day",2021-12-08,-6.1385374373471,-1.05731608595394,0.392182685950626,1.49313023621653,6.12344494761861,-1.35250441666717,0.239301651033996,0.442782496069838,1.74468710261779,1.42281732644185,0.373797468214289,0.844677208875553,1.74468710261779,FALSE,TRUE,FALSE
"DexterJettster","DAX","7 day",2021-12-08,-7.36557382691036,-1.22969029601622,0.344020797641598,2.12105740327036,8.56859724881518,-1.35250441666717,0.30065347051216,0.184221180976419,1.69652521430876,1.73678090996876,0.496055083274118,0.882847171808045,1.69652521430876,FALSE,TRUE,FALSE
"AryaStark","DAX","7 day",2021-12-08,-5.29548154808766,-1.18053655790096,0.426491513953383,1.93651498010972,5.28773680321487,-1.35250441666717,0.197148856571025,0.25795178814931,1.77899593062055,1.64450969838844,0.332012060994102,0.842123666944686,1.77899593062055,FALSE,TRUE,FALSE
"Bronn","DAX","7 day",2021-12-08,-6.18318411247508,-1.31871816976353,0.372804122430238,1.89560391032554,5.33263611952792,-1.35250441666717,0.241533984790396,0.0506793703554571,1.7253085390974,1.62405416349635,0.334257026809755,0.795166616909873,1.7253085390974,FALSE,TRUE,FALSE
"ChandlerBing","DAX","7 day",2021-12-08,-4.05500475125181,-1.05178845333692,0.524002454365858,2.09979336206863,5.10300965998352,-1.35250441666717,0.135125016729232,0.451073944995375,1.87650687103302,1.7261488893679,0.322775703832535,0.902326085191613,1.87650687103302,FALSE,TRUE,FALSE
"DAX_benchmark","DAX","7 day",2021-12-08,-5.75308316717284,-1.09756078213268,0.378064646743592,1.49206818774594,5.19223708311003,-1.35250441666717,0.220028937525284,0.382415451801729,1.73056906341076,1.42228630220655,0.32723707498886,0.816507365986637,1.73056906341076,FALSE,TRUE,FALSE
"DougJudy","DAX","7 day",2021-12-08,-5.11904628594265,-0.407100769840602,1.03721678089624,2.31543155512097,6.36601120897987,-1.35250441666717,0.188327093463774,1.41810547023985,2.38972119756341,1.83396798589407,0.385925781282352,1.24320950568869,2.38972119756341,FALSE,TRUE,FALSE
"GeneralGrievous","DAX","7 day",2021-12-08,-0.41,-0.1,0.06,0.22,0.53,-1.35250441666717,1.83788361250097,1.87875662500075,1.41250441666717,0.786252208333583,0.0941252208333584,1.20190441666717,1.41250441666717,FALSE,FALSE,FALSE
"ObiWanKenobi","DAX","7 day",2021-12-08,-5.43716725751697,-0.896529988064286,0.462575500422445,1.76536609782714,5.18395809317717,-1.35250441666717,0.20423314204249,0.68396164290432,1.81507991708961,1.55893525724715,0.326823125492217,0.917806616955158,1.81507991708961,FALSE,TRUE,FALSE
"HotPie","DAX","7 day",2021-12-08,-5.68912646769633,-2.17599793921897,0.0158857384234578,2.21866532941907,6.23515242725801,-1.35250441666717,0.216831102551458,0.411746761275902,1.36839015509062,1.78558487304312,0.379382842196259,0.832387146831472,1.36839015509062,TRUE,TRUE,FALSE
"Shaggydog","DAX","7 day",2021-12-08,-8.17833536587694,-1.77125809602027,0.741376029688113,3.07254979062986,7.5683231935743,-1.35250441666717,0.341291547460489,0.209376839676554,2.09388044635528,2.21252710364851,0.446041380512073,1.06062346353058,2.09388044635528,TRUE,TRUE,FALSE
"mean_ensemble","DAX","7 day",2021-12-08,-5.33326505056752,-1.04059983599199,0.584505609226722,1.9559626670991,5.46093972014177,-1.35250441666717,0.199038031695018,0.467856871012765,1.93701002589389,1.65423354188313,0.340672206840447,0.91976213546505,1.93701002589389,FALSE,TRUE,FALSE
"GinaLinetti","DAX","7 day",2021-12-08,-2.569407,0.06412807,1.445947,2.827766,5.461302,-1.35250441666717,0.0608451291666417,2.12494873000075,2.79845141666717,2.09013520833358,0.340690320833359,1.4830141610003,2.79845141666717,FALSE,TRUE,FALSE
"PhoebeBuffay","DAX","7 day",2021-12-08,-7.1079457143315,-1.40454143416886,0.351687359302506,1.73926071993167,4.84823548292789,-1.35250441666717,0.287772064883217,0.0260185087508469,1.70419177596967,1.54588256829942,0.310036994979753,0.774780382576581,1.70419177596967,TRUE,TRUE,FALSE
"Joey","DAX","7 day",2021-12-08,-6.471572,-4.181127,-0.388368,1.251934,6.590333,-1.35250441666717,0.255953379166642,1.41431129166642,0.964136416667166,1.30221920833358,0.397141870833359,0.866752433333433,0.964136416667166,TRUE,TRUE,FALSE
"UglyNakedGuy","DAX","7 day",2021-12-08,-7.05356651765211,-1.13392238920657,0.516099563530152,2.13690779256016,5.06687399113203,-1.35250441666717,0.285053105049247,0.327873041190894,1.86860398019732,1.74470610461366,0.32096892038996,0.909441030288217,1.86860398019732,FALSE,TRUE,FALSE
"median_ensemble","DAX","7 day",2021-12-08,-5.75308316717284,-1.10980931887409,0.392182685950626,1.89560391032554,5.28773680321487,-1.35250441666717,0.220028937525284,0.364042646689614,1.74468710261779,1.62405416349635,0.332012060994102,0.856964982264629,1.74468710261779,FALSE,TRUE,FALSE
"HanSolo","DAX","7 day",2021-12-08,-6.90833854426227,-1.23576546238252,0.347464038630758,1.32638860965862,5.14092761190693,-1.35250441666717,0.277791706379755,0.17510843142697,1.69996845529792,1.33944651316289,0.324671601428705,0.763397341539249,1.69996845529792,FALSE,TRUE,FALSE
"SamwellTarly","DAX","7 day",2021-12-08,0.858302323782147,2.43052647410611,3.25547422184952,4.08042196959294,5.6526461199169,-1.35250441666717,4.31107314387616,5.67454633615991,4.60797863851669,2.71646319313005,0.350257526829204,3.5320637677024,4.60797863851669,FALSE,FALSE,FALSE
"KyloRen","DAX","7 day",2021-12-08,-5.44283970473306,-0.914388685073412,0.374272477108684,1.49607179742409,4.94783534660937,-1.35250441666717,0.204516764403295,0.657173597390631,1.72677689377585,1.42428810704563,0.315016988163827,0.865554470155846,1.72677689377585,FALSE,TRUE,FALSE
"Yoda","DAX","7 day",2021-12-08,-7.0121285833083,-1.10980931887409,0.448409644370537,1.67435893298171,4.55859434494104,-1.35250441666717,0.282981208332057,0.364042646689622,1.8009140610377,1.51343167482444,0.29555493808041,0.851384905792846,1.8009140610377,FALSE,TRUE,FALSE
"AryaStark","wind","36 hour",2021-12-08,4.32,7.56,9.36,11.16,13.68,9.36,0.252,0.9,0,0.9,0.216,0.4536,0,TRUE,TRUE,FALSE
"HanSolo","wind","36 hour",2021-12-08,5.44857138231503,8.69456356372013,9.73093509619744,11.0160221865867,14.8017973891428,9.36,0.195571430884249,0.332718218139933,0.370935096197444,0.828011093293368,0.272089869457143,0.399865141594427,0.370935096197444,TRUE,TRUE,FALSE
"ChandlerBing","wind","36 hour",2021-12-08,2.78130473134822,7.47711576969193,9.94101300668076,12.4049102436696,17.1007212820133,9.36,0.328934763432589,0.941442115154035,0.581013006680763,1.5224551218348,0.387036064100666,0.75217621424057,0.581013006680763,TRUE,TRUE,FALSE
"KyloRen","wind","36 hour",2021-12-08,3.7207233525,7.508628025,9.4330245,11.1027355,14.93025495,9.36,0.281963832375,0.9256859875,0.0730245000000007,0.87136775,0.2785127475,0.486110963475,0.0730245000000007,TRUE,TRUE,FALSE
"GeneralGrievous","wind","36 hour",2021-12-08,3.93,13.2,16.78,20.35,29.63,9.36,0.2715,5.76,7.42,5.495,1.0135,3.992,7.42,FALSE,TRUE,FALSE
"Bronn","wind","36 hour",2021-12-08,3.28690845459761,7.53643286702562,9.80434606950001,12.0762078121722,16.4093099407019,9.36,0.30365457727012,0.911783566487188,0.444346069500007,1.3581039060861,0.352465497035097,0.674070723275703,0.444346069500007,TRUE,TRUE,FALSE
"HotPie","wind","36 hour",2021-12-08,4.05245666004964,8.00964421830175,10.1468356053068,12.119361857691,15.3356088204693,9.36,0.265377166997518,0.675177890849125,0.7868356053068,1.3796809288455,0.298780441023465,0.681170406604482,0.7868356053068,TRUE,TRUE,FALSE
"DexterJettster","wind","36 hour",2021-12-08,3.28690845459761,7.53643286702562,9.80434606950001,12.0762078121722,16.4093099407019,9.36,0.30365457727012,0.91178356648719,0.444346069500011,1.3581039060861,0.352465497035095,0.674070723275703,0.444346069500011,TRUE,TRUE,FALSE
"mean_ensemble","wind","36 hour",2021-12-08,4.78754189423801,8.59251225609466,10.4235798573177,12.3106941326943,16.1877290315582,9.36,0.228622905288099,0.38374387195267,1.0635798573177,1.47534706634715,0.34138645157791,0.698536030496706,1.0635798573177,TRUE,TRUE,FALSE
"GinaLinetti","wind","36 hour",2021-12-08,13.44225,15.4425,15.94,16.945,18.3105,9.36,7.9603875,9.12375,6.58,3.7925,0.447525000000001,5.5808325,6.58,FALSE,FALSE,FALSE
"CaptainRaymondHolt","wind","36 hour",2021-12-08,4.57036774469588,9.79690510939161,11.2263387497025,13.5634551022902,17.2226057930344,9.36,0.239481612765206,0.65535766408742,1.86633874970245,2.10172755114508,0.393130289651718,1.05120717347037,1.86633874970245,FALSE,TRUE,FALSE
"Joey","wind","36 hour",2021-12-08,7.34476803106986,8.43953336083565,10.3366175778824,11.9116900608289,13.2656793709589,9.36,0.100761598446507,0.460233319582175,0.976617577882392,1.27584503041444,0.195283968547947,0.601748298974693,0.976617577882392,TRUE,TRUE,FALSE
"DougJudy","wind","36 hour",2021-12-08,9.91800404415698,10.3404920256366,10.5621719360352,10.7838518464337,11.2063398279133,9.36,1.08810788610611,1.47073803845489,1.20217193603516,0.71192592321686,0.0923169913956669,0.913052155041736,1.20217193603516,FALSE,FALSE,FALSE
"median_ensemble","wind","36 hour",2021-12-08,4.02703437278741,7.70408201471338,9.80434606950001,12.0439877601441,16.3919425816836,9.36,0.266648281360629,0.82795899264331,0.444346069500011,1.34199388007205,0.35159712908418,0.646508870532036,0.444346069500011,TRUE,TRUE,FALSE
"Yoda","wind","36 hour",2021-12-08,3.28690845459761,7.53643286702562,9.80434606950001,12.0762078121722,16.4093099407019,9.36,0.30365457727012,0.91178356648719,0.444346069500011,1.3581039060861,0.352465497035095,0.674070723275703,0.444346069500011,TRUE,TRUE,FALSE
"SamwellTarly","wind","36 hour",2021-12-08,5.561350350208,8.47625507252785,9.428277778807,9.98837387883914,12.5660973573163,9.36,0.1899324824896,0.441872463736077,0.0682777788069959,0.31418693941957,0.160304867865816,0.234914906463612,0.0682777788069959,TRUE,TRUE,FALSE
"Shaggydog","wind","36 hour",2021-12-08,3.17541086328603,7.44197851591762,9.72458991084766,12.011767708116,16.3745752226652,9.36,0.309229456835699,0.959010742041188,0.364589910847663,1.32588385405802,0.350728761133262,0.661888544983167,0.364589910847663,TRUE,TRUE,FALSE
"wind_benchmark","wind","36 hour",2021-12-08,4.2055,6.6675,7.355,8.3225,11.164,9.36,0.257725,1.34625,2.005,1.55625,0.0902000000000001,1.051085,2.005,FALSE,TRUE,FALSE
"ObiWanKenobi","wind","36 hour",2021-12-08,1.77690085162417,6.91747173742812,9.72073142972805,12.6145499578344,19.4599163287041,9.36,0.379154957418792,1.22126413128594,0.36073142972805,1.6272749789172,0.504995816435206,0.818684262757037,0.36073142972805,TRUE,TRUE,FALSE
"PhoebeBuffay","wind","36 hour",2021-12-08,4.35398396959076,7.84816402942676,9.80894547911575,11.7611624510013,16.2646621121121,9.36,0.250300801520462,0.75591798528662,0.44894547911575,1.20058122550065,0.345233105605605,0.600195719405818,0.44894547911575,TRUE,TRUE,FALSE
"UglyNakedGuy","wind","36 hour",2021-12-08,4.00161208552518,7.88376222591269,9.75973179805033,11.8536706119056,16.8045824140264,9.36,0.267919395723741,0.738118887043655,0.399731798050331,1.2468353059528,0.37222912070132,0.604966901494369,0.399731798050331,TRUE,TRUE,FALSE
"wind_EMOS","wind","36 hour",2021-12-08,3.28690845459761,7.53643286702563,9.80434606950001,12.0762078121722,16.4093099407019,9.36,0.30365457727012,0.911783566487185,0.444346069500011,1.3581039060861,0.352465497035095,0.674070723275702,0.444346069500011,TRUE,TRUE,FALSE
"ChandlerBing","wind","48 hour",2021-12-08,0.586615649938704,5.15321760996281,7.54931870088316,9.94541979180351,14.5120217518276,4.32,0.186669217503065,1.24982641494421,3.22931870088316,2.81270989590175,0.509601087591381,1.59762506336471,3.22931870088316,FALSE,TRUE,FALSE
"Bronn","wind","48 hour",2021-12-08,1.40194677801034,5.35686439928675,7.71815612572173,10.1165451587023,14.7191620289369,4.32,0.145902661099483,1.55529659893012,3.39815612572173,2.89827257935115,0.519958101446845,1.70351721330987,3.39815612572173,FALSE,TRUE,FALSE
"CaptainRaymondHolt","wind","48 hour",2021-12-08,2.52378140787604,5.81133792959974,7.55498763064706,8.86481449737175,15.0948933499251,4.32,0.0898109296061981,2.2370068943996,3.23498763064706,2.27240724868588,0.538744667496257,1.674591474167,3.23498763064706,FALSE,TRUE,FALSE
"DexterJettster","wind","48 hour",2021-12-08,1.40194677801034,5.35686439928675,7.71815612572173,10.1165451587023,14.7191620289369,4.32,0.145902661099483,1.55529659893012,3.39815612572173,2.89827257935115,0.519958101446845,1.70351721330987,3.39815612572173,FALSE,TRUE,FALSE
"DougJudy","wind","48 hour",2021-12-08,8.28361808943742,8.74825103123708,8.99204444885254,9.23583786646799,9.70047080826766,4.32,7.72905527440296,6.64237654685563,4.67204444885254,2.457918933234,0.269023540413383,4.3540837487517,4.67204444885254,FALSE,FALSE,FALSE
"AryaStark","wind","48 hour",2021-12-08,2.16,7.56,9,11.52,12.96,4.32,0.108,4.86,4.68,3.6,0.432,2.736,4.68,FALSE,TRUE,FALSE
"HanSolo","wind","48 hour",2021-12-08,4.51264117553921,8.23573834132908,9.62391840052005,10.991807152186,14.9445701791049,4.32,0.375650292301463,5.87360751199362,5.30391840052005,3.335903576093,0.531228508955244,3.08406165797267,5.30391840052005,FALSE,FALSE,FALSE
"SamwellTarly","wind","48 hour",2021-12-08,5.88969622326478,7.3924338896996,8.80729866763215,10.4484965213973,12.0230660194073,4.32,3.06090763536631,4.6086508345494,4.48729866763215,3.06424826069866,0.385153300970367,3.12125173984338,4.48729866763215,FALSE,FALSE,FALSE
"KyloRen","wind","48 hour",2021-12-08,1.442019245,5.461396725,7.85643435,10.47601525,15.0830107375,4.32,0.14389903775,1.7120950875,3.53643435,3.078007625,0.538150536875,1.801717327425,3.53643435,FALSE,TRUE,FALSE
"GeneralGrievous","wind","48 hour",2021-12-08,5.14,11.9,14.51,17.12,23.88,4.32,1.599,11.37,10.19,6.4,0.978000000000001,6.1074,10.19,FALSE,FALSE,FALSE
"ObiWanKenobi","wind","48 hour",2021-12-08,0.67499902191154,4.49442497877969,7.45672309880163,10.782895246779,18.9576275790473,4.32,0.182250048904423,0.261637468169534,3.13672309880163,3.2314476233895,0.731881378952366,1.50878792364349,3.13672309880163,FALSE,TRUE,FALSE
"HotPie","wind","48 hour",2021-12-08,3.3688499579167,6.25552965055191,7.74404554057583,9.5144131263648,14.0148703587648,4.32,0.047557502104165,2.90329447582786,3.42404554057583,2.5972065631824,0.48474351793824,1.8913695199257,3.42404554057583,FALSE,TRUE,FALSE
"Shaggydog","wind","48 hour",2021-12-08,1.42864351469723,5.38269977475059,7.73238186387055,10.1173794248563,14.6929151281934,4.32,0.144567824265138,1.59404966212589,3.41238186387055,2.89868971242815,0.51864575640967,1.71366696381988,3.41238186387055,FALSE,TRUE,FALSE
"mean_ensemble","wind","48 hour",2021-12-08,3.09353995879653,6.66763789135719,8.52604199668594,10.5847842245559,14.6988455887274,4.32,0.0613230020601735,3.52145683703578,4.20604199668594,3.13239211227795,0.51894227943637,2.28803124549924,4.20604199668594,FALSE,TRUE,FALSE
"GinaLinetti","wind","48 hour",2021-12-08,9.1655,11.925,12.715,14.0225,15.718,4.32,9.448725,11.4075,8.395,4.85125,0.569900000000001,6.934475,8.395,FALSE,FALSE,FALSE
"PhoebeBuffay","wind","48 hour",2021-12-08,1.92619099393935,5.84081337326438,8.088881903494,10.4113148955919,15.5503067256982,4.32,0.119690450303033,2.28122005989657,3.768881903494,3.04565744779595,0.56151533628491,1.95539303955489,3.768881903494,FALSE,TRUE,FALSE
"Joey","wind","48 hour",2021-12-08,3.70174120708845,6.88316129803858,8.12341167330239,10.0247612168604,13.0612863153237,4.32,0.0309129396455777,3.84474194705788,3.80341167330239,2.85238060843021,0.437064315766183,2.19370229684045,3.80341167330239,FALSE,TRUE,FALSE
"UglyNakedGuy","wind","48 hour",2021-12-08,2.18896557727985,5.66129562778324,7.70876915225245,9.98134886663073,15.3724747057408,4.32,0.106551721136008,2.01194344167486,3.38876915225245,2.83067443331537,0.55262373528704,1.77811249673314,3.38876915225245,FALSE,TRUE,FALSE
"median_ensemble","wind","48 hour",2021-12-08,2.17448278863993,5.73631677869149,7.73821370222319,10.1165451587023,14.7191620289369,4.32,0.107275860568004,2.12447516803724,3.41821370222319,2.89827257935115,0.519958101446845,1.81363908232528,3.41821370222319,FALSE,TRUE,FALSE
"Yoda","wind","48 hour",2021-12-08,1.40194677801034,5.35686439928675,7.71815612572173,10.1165451587023,14.7191620289369,4.32,0.145902661099483,1.55529659893012,3.39815612572173,2.89827257935115,0.519958101446845,1.70351721330987,3.39815612572173,FALSE,TRUE,FALSE
"wind_benchmark","wind","48 hour",2021-12-08,3.26975,5.22,6.185,7.7725,9.53475,4.32,0.0525125,1.35,1.865,1.72625,0.2607375,1.0509,1.865,FALSE,TRUE,FALSE
"wind_EMOS","wind","48 hour",2021-12-08,1.40194677801034,5.35686439928675,7.71815612572173,10.1165451587023,14.7191620289369,4.32,0.145902661099483,1.55529659893012,3.39815612572173,2.89827257935115,0.519958101446845,1.70351721330987,3.39815612572173,FALSE,TRUE,FALSE
"HanSolo","wind","60 hour",2021-12-08,4.53000170765217,7.9877111033475,9.44865266475215,10.8582036764287,14.5128245731361,9.36,0.241499914617391,0.686144448326249,0.0886526647521464,0.749101838214373,0.257641228656805,0.404608018913393,0.0886526647521464,TRUE,TRUE,FALSE
"ChandlerBing","wind","60 hour",2021-12-08,0.855093999542001,6.5228883952489,9.49678637312167,12.4706843509944,18.1384787467013,9.36,0.4252453000229,1.41855580237555,0.136786373121673,1.55534217549722,0.438923937335067,0.794970717670483,0.136786373121673,TRUE,TRUE,FALSE
"Bronn","wind","60 hour",2021-12-08,2.62238511753703,6.95999563842072,9.3222635300382,11.6938310470114,16.2214362775311,9.36,0.336880744123149,1.20000218078964,0.0377364699617946,1.16691552350568,0.343071813876558,0.616921346451365,0.0377364699617946,TRUE,TRUE,FALSE
"HotPie","wind","60 hour",2021-12-08,3.31987714986178,7.36509468024611,10.0568745405792,12.2820303848666,15.5669984388735,9.36,0.302006142506911,0.997452659876945,0.6968745405792,1.4610151924333,0.310349921943675,0.753539691468006,0.6968745405792,TRUE,TRUE,FALSE
"DexterJettster","wind","60 hour",2021-12-08,2.62238511753703,6.95999563842072,9.3222635300382,11.6938310470114,16.2214362775311,9.36,0.336880744123149,1.20000218078964,0.0377364699617999,1.1669155235057,0.343071813876555,0.616921346451369,0.0377364699617999,TRUE,TRUE,FALSE
"GeneralGrievous","wind","60 hour",2021-12-08,4.48,13.33,16.74,20.15,28.99,9.36,0.244,5.955,7.38,5.395,0.981500000000001,3.9911,7.38,FALSE,TRUE,FALSE
"GinaLinetti","wind","60 hour",2021-12-08,5.054,8.105,9.345,11.2875,14.79325,9.36,0.2153,0.6275,0.0149999999999988,0.96375,0.2716625,0.4186425,0.0149999999999988,TRUE,TRUE,FALSE
"CaptainRaymondHolt","wind","60 hour",2021-12-08,3.25638814762419,6.81075475489037,7.93672276091958,11.5854513309996,17.6022910774549,9.36,0.305180592618791,1.27462262255482,1.42327723908041,1.11272566549978,0.412114553872748,0.90558413472531,1.42327723908041,TRUE,TRUE,FALSE
"Joey","wind","60 hour",2021-12-08,6.12840931304049,7.96864653066809,9.84228844526839,12.3553615638505,13.6844449170853,9.36,0.161579534347975,0.695676734665953,0.482288445268388,1.49768078192525,0.216222245854263,0.610689548412366,0.482288445268388,TRUE,TRUE,FALSE
"DougJudy","wind","60 hour",2021-12-08,8.33674407782793,8.79470209460587,9.03499317169189,9.27528424877792,9.73324226555586,9.36,0.0511627961086033,0.282648952697064,0.325006828308105,0.127073626833122,0.0186621132777928,0.160910863444937,0.325006828308105,FALSE,TRUE,FALSE
"AryaStark","wind","60 hour",2021-12-08,4.68,7.92,9,11.52,15.12,9.36,0.234,0.72,0.359999999999999,1.08,0.288,0.5364,0.359999999999999,TRUE,TRUE,FALSE
"Yoda","wind","60 hour",2021-12-08,2.62238511753703,6.95999563842072,9.3222635300382,11.6938310470114,16.2214362775311,9.36,0.336880744123149,1.20000218078964,0.0377364699617999,1.1669155235057,0.343071813876555,0.616921346451369,0.0377364699617999,TRUE,TRUE,FALSE
"SamwellTarly","wind","60 hour",2021-12-08,7.20930616518749,8.46971598491755,9.41385487027459,11.2078414369067,12.3500848546935,9.36,0.107534691740625,0.445142007541222,0.0538548702745949,0.923920718453338,0.149504242734674,0.335991306148891,0.0538548702745949,TRUE,TRUE,FALSE
"KyloRen","wind","60 hour",2021-12-08,1.7269572025,6.508084375,8.730547,11.0543875,15.61370835,9.36,0.381652139875,1.4259578125,0.629453,0.847193750000001,0.3126854175,0.719388423975,0.629453,TRUE,TRUE,FALSE
"wind_benchmark","wind","60 hour",2021-12-08,3.831,5.835,6.805,8.2025,10.3115,9.36,0.27645,1.7625,2.555,1.73625,0.0475750000000001,1.275555,2.555,FALSE,TRUE,FALSE
"ObiWanKenobi","wind","60 hour",2021-12-08,1.42622945463522,6.41824951711721,9.35701996477843,12.4331549956423,19.7532121045637,9.36,0.396688527268239,1.47087524144139,0.00298003522156876,1.53657749782115,0.519660605228186,0.785356381396108,0.00298003522156876,TRUE,TRUE,FALSE
"PhoebeBuffay","wind","60 hour",2021-12-08,3.32616957261264,7.47508767286083,9.52493589277395,11.6164913849406,16.4544776511513,9.36,0.301691521369368,0.942456163569585,0.164935892773951,1.1282456924703,0.354723882557565,0.578410630548154,0.164935892773951,TRUE,TRUE,FALSE
"Shaggydog","wind","60 hour",2021-12-08,2.71199714602884,7.0901127320196,9.46846304793201,11.8555116722345,16.4121158825924,9.36,0.332400142698558,1.1349436339902,0.108463047932007,1.24775583611723,0.352605794129619,0.635233690973524,0.108463047932007,TRUE,TRUE,FALSE
"mean_ensemble","wind","60 hour",2021-12-08,3.73123442464644,7.58482174512092,9.53689618525653,11.8191659200605,16.0322529021999,9.36,0.281438278767678,0.88758912743954,0.176896185256531,1.22958296003025,0.333612645109995,0.581823839320799,0.176896185256531,TRUE,TRUE,FALSE
"wind_EMOS","wind","60 hour",2021-12-08,2.62238511753703,6.95999563842073,9.32226353003821,11.6938310470114,16.2214362775312,9.36,0.336880744123149,1.20000218078963,0.0377364699617893,1.1669155235057,0.34307181387656,0.616921346451367,0.0377364699617893,TRUE,TRUE,FALSE
"UglyNakedGuy","wind","60 hour",2021-12-08,3.26297408626791,7.25540450781349,9.24773085288586,11.453591667523,16.7226840720659,9.36,0.304851295686605,1.05229774609325,0.112269147114139,1.0467958337615,0.368134203603295,0.576869645251759,0.112269147114139,TRUE,TRUE,FALSE
"median_ensemble","wind","60 hour",2021-12-08,3.29142561806484,7.17275861991654,9.33363176501911,11.655161215976,16.2214362775311,9.36,0.303428719096758,1.09362069004173,0.0263682349808896,1.147580607988,0.343071813876555,0.582814013196786,0.0263682349808896,TRUE,TRUE,FALSE
"Bronn","wind","72 hour",2021-12-08,0.961684860830244,4.76235977451777,7.28511454990338,9.8925434965705,14.9366197257372,6.84,0.293915756958488,1.03882011274112,0.445114549903376,1.52627174828525,0.404830986286861,0.741790630835018,0.445114549903376,TRUE,TRUE,FALSE
"CaptainRaymondHolt","wind","72 hour",2021-12-08,1.16326299578509,5.30300448616091,6.76030686615564,9.08787643392447,15.4180941632079,6.84,0.283836850210746,0.768497756919543,0.0796931338443549,1.12393821696224,0.428904708160394,0.536974133219455,0.0796931338443549,TRUE,TRUE,FALSE
"AryaStark","wind","72 hour",2021-12-08,2.16,6.12,7.92,9,12.6,6.84,0.234,0.36,1.08,1.08,0.288,0.6084,1.08,TRUE,TRUE,FALSE
"HanSolo","wind","72 hour",2021-12-08,3.19970723049641,6.53098725750239,8.04159406791877,9.83129411301979,14.0831132900591,6.84,0.18201463847518,0.154506371248803,1.20159406791877,1.49564705650989,0.362155664502958,0.679183559731121,1.20159406791877,TRUE,TRUE,FALSE
"ChandlerBing","wind","72 hour",2021-12-08,0.407794861585297,4.98538058829741,7.38724487372737,9.78910915915732,14.3666948858694,6.84,0.321610256920735,0.927309705851294,0.547244873727366,1.47455457957866,0.376334744293472,0.729410832074305,0.547244873727366,TRUE,TRUE,FALSE
"KyloRen","wind","72 hour",2021-12-08,0.84694926675,5.678856875,8.131159,10.30546975,14.8711323625,6.84,0.2996525366625,0.5805715625,1.291159,1.732734875,0.401556618125,0.8611349184575,1.291159,TRUE,TRUE,FALSE
"GeneralGrievous","wind","72 hour",2021-12-08,6.3,12.11,14.36,16.6,22.42,6.84,0.027,7.905,7.52,4.88,0.779000000000001,4.2222,7.52,FALSE,TRUE,FALSE
"ObiWanKenobi","wind","72 hour",2021-12-08,0.576850583476051,4.16205268929433,7.15233973911416,10.5945710762659,19.160082743256,6.84,0.313157470826197,1.33897365535283,0.31233973911416,1.87728553813295,0.616004137162801,0.891552108117789,0.31233973911416,TRUE,TRUE,FALSE
"HotPie","wind","72 hour",2021-12-08,2.82826079570641,5.57308456844948,7.24693023250438,9.25621888530259,14.1687629983725,6.84,0.20058696021468,0.63345771577526,0.40693023250438,1.2081094426513,0.366438149918625,0.563104500212848,0.40693023250438,TRUE,TRUE,FALSE
"DexterJettster","wind","72 hour",2021-12-08,0.961684860830244,4.76235977451777,7.28511454990338,9.8925434965705,14.9366197257372,6.84,0.293915756958488,1.03882011274111,0.44511454990338,1.52627174828525,0.40483098628686,0.741790630835019,0.44511454990338,TRUE,TRUE,FALSE
"mean_ensemble","wind","72 hour",2021-12-08,2.3225411423478,5.8540203954029,7.89517816294175,10.0936837740163,14.4218060912264,6.84,0.22587294288261,0.49298980229855,1.05517816294175,1.62684188700815,0.37909030456132,0.755994619938476,1.05517816294175,TRUE,TRUE,FALSE
"GinaLinetti","wind","72 hour",2021-12-08,3.993,6.7625,8.86,10.6275,12.391,6.84,0.14235,0.0387499999999998,2.02,1.89375,0.27755,0.87448,2.02,TRUE,TRUE,FALSE
"PhoebeBuffay","wind","72 hour",2021-12-08,1.48615559000549,5.03308552083579,7.22267801152049,10.0174802041814,16.1291447681076,6.84,0.267692220499726,0.903457239582105,0.38267801152049,1.5887401020907,0.46445723840538,0.72140496241968,0.38267801152049,TRUE,TRUE,FALSE
"Joey","wind","72 hour",2021-12-08,2.37784990289061,6.25588814196102,7.6550350173009,10.1298445717548,12.2029489213773,6.84,0.223107504855469,0.292055929019491,0.815035017300902,1.6449222858774,0.268147446068864,0.648653636624426,0.815035017300902,TRUE,TRUE,FALSE
"DougJudy","wind","72 hour",2021-12-08,7.92544237515919,8.40095837853308,8.65046215057373,8.89996592261438,9.37548192598827,6.84,2.11661263156042,2.34143756779962,1.81046215057373,1.02998296130719,0.126774096299414,1.48505388150808,1.81046215057373,FALSE,FALSE,FALSE
"median_ensemble","wind","72 hour",2021-12-08,1.41311811178148,5.16804500349835,7.30113488426968,9.8925434965705,14.8867939524093,6.84,0.271344094410926,0.835977498250825,0.46113488426968,1.52627174828525,0.402339697620465,0.699413584567429,0.46113488426968,TRUE,TRUE,FALSE
"Yoda","wind","72 hour",2021-12-08,0.961684860830244,4.76235977451777,7.28511454990338,9.8925434965705,14.9366197257372,6.84,0.293915756958488,1.03882011274111,0.44511454990338,1.52627174828525,0.40483098628686,0.741790630835019,0.44511454990338,TRUE,TRUE,FALSE
"SamwellTarly","wind","72 hour",2021-12-08,4.70670347194783,7.02341497486297,8.7803077478023,10.5749292829349,12.2009195649311,6.84,0.106664826402609,0.27512246229446,1.9403077478023,1.86746464146747,0.268045978246555,0.891521131242678,1.9403077478023,FALSE,TRUE,FALSE
"Shaggydog","wind","72 hour",2021-12-08,0.913525696275173,4.6674297819822,7.19789213396786,9.82099903994861,14.9024555423186,6.84,0.296323715186241,1.0862851090089,0.357892133967856,1.49049951997431,0.403122777115933,0.726824651050647,0.357892133967856,TRUE,TRUE,FALSE
"wind_benchmark","wind","72 hour",2021-12-08,2.3785,4.4025,6.08,7.8425,9.16525,6.84,0.223075,1.21875,0.76,0.50125,0.1162625,0.5638675,0.76,TRUE,TRUE,FALSE
"wind_EMOS","wind","72 hour",2021-12-08,0.961684860830244,4.76235977451777,7.28511454990338,9.8925434965705,14.9366197257372,6.84,0.293915756958488,1.03882011274111,0.44511454990338,1.52627174828525,0.40483098628686,0.741790630835019,0.44511454990338,TRUE,TRUE,FALSE
"UglyNakedGuy","wind","72 hour",2021-12-08,1.34008063355747,5.0218255471073,7.31715521863599,9.92574305494002,15.2345617555923,6.84,0.274995968322127,0.90908722644635,0.47715521863599,1.54287152747001,0.419728087779615,0.724767605730818,0.47715521863599,TRUE,TRUE,FALSE
"Bronn","wind","84 hour",2021-12-08,1.42230749826314,5.98590960780811,8.80803136942312,11.6896296540153,17.2327806210822,6.84,0.270884625086843,0.427045196095945,1.96803136942312,2.42481482700764,0.519639031054109,1.12208300973353,1.96803136942312,TRUE,TRUE,FALSE
"ChandlerBing","wind","84 hour",2021-12-08,0.174328176602428,6.04061569458846,9.11866323289954,12.1967107712106,18.0629982891967,6.84,0.333283591169879,0.399692152705771,2.27866323289954,2.67835538560531,0.561149914459833,1.25022885536807,2.27866323289954,TRUE,TRUE,FALSE
"GeneralGrievous","wind","84 hour",2021-12-08,7.89,14.28,16.75,19.21,25.6,6.84,2.0475,11.16,9.91,6.185,0.938000000000001,6.0481,9.91,FALSE,FALSE,FALSE
"GinaLinetti","wind","84 hour",2021-12-08,4.67575,7.17,7.74,9.045,11.14375,6.84,0.1082125,0.495,0.9,1.1025,0.2151875,0.56418,0.9,FALSE,TRUE,FALSE
"CaptainRaymondHolt","wind","84 hour",2021-12-08,1.39089691423949,5.76659494830598,8.76484061093261,10.7116516807307,18.8956896278497,6.84,0.272455154288026,0.536702525847011,1.92484061093261,1.93582584036535,0.602784481392486,1.0545217225651,1.92484061093261,TRUE,TRUE,FALSE
"DexterJettster","wind","84 hour",2021-12-08,1.42230749826314,5.98590960780811,8.80803136942312,11.6896296540153,17.2327806210822,6.84,0.270884625086843,0.427045196095945,1.96803136942312,2.42481482700765,0.51963903105411,1.12208300973353,1.96803136942312,TRUE,TRUE,FALSE
"DougJudy","wind","84 hour",2021-12-08,8.77582082601381,9.22025881920612,9.45345592498779,9.68665303076947,10.1310910239618,6.84,3.77485061072693,3.57038822880918,2.61345592498779,1.42332651538473,0.164554551198089,2.30931516622134,2.61345592498779,FALSE,FALSE,FALSE
"AryaStark","wind","84 hour",2021-12-08,3.96,7.56,7.92,10.44,14.4,6.84,0.144,1.08,1.08,1.8,0.378,0.8964,1.08,FALSE,TRUE,FALSE
"HanSolo","wind","84 hour",2021-12-08,3.63339472934857,7.94052661060195,9.91207691865899,11.9919883698337,17.1737766350103,6.84,0.160330263532572,1.65078991590293,3.07207691865899,2.57599418491684,0.516688831750516,1.59517602295237,3.07207691865899,FALSE,TRUE,FALSE
"SamwellTarly","wind","84 hour",2021-12-08,6.5161219380623,8.88032783744111,9.8072123253899,11.7861300966281,13.9245750042914,6.84,0.0161939030968848,3.06049175616166,2.9672123253899,2.47306504831405,0.354228750214569,1.77423835663542,2.9672123253899,FALSE,TRUE,FALSE
"KyloRen","wind","84 hour",2021-12-08,1.67195043,5.849443,8.293905,10.5396015,15.5122178,6.84,0.2584024785,0.4952785,1.453905,1.84980075,0.43361089,0.8981995237,1.453905,TRUE,TRUE,FALSE
"wind_benchmark","wind","84 hour",2021-12-08,1.64675,3.9025,5.48,8.2,12.36425,6.84,0.2596625,1.46875,1.36,0.68,0.2762125,0.808925,1.36,TRUE,TRUE,FALSE
"ObiWanKenobi","wind","84 hour",2021-12-08,1.14000505284354,5.95580437218907,9.0636386074755,12.3811531890737,20.3441023472164,6.84,0.284999747357823,0.442097813905465,2.2236386074755,2.77057659453685,0.675205117360821,1.27930357612729,2.2236386074755,TRUE,TRUE,FALSE
"HotPie","wind","84 hour",2021-12-08,3.69499309594008,7.16414421427344,9.58330879113637,11.95217166245,16.357171783807,6.84,0.157250345202996,0.48621632141016,2.74330879113637,2.556085831225,0.47585858919035,1.28374397563298,2.74330879113637,FALSE,TRUE,FALSE
"Shaggydog","wind","84 hour",2021-12-08,1.42382491690991,5.97247271501378,8.7817314675918,11.6496179640767,17.1658852078774,6.84,0.270808754154505,0.433763642493112,1.9417314675918,2.40480898203833,0.516294260393869,1.11348142133432,1.9417314675918,TRUE,TRUE,FALSE
"mean_ensemble","wind","84 hour",2021-12-08,3.08584424571589,6.9981650801414,9.16266575576113,11.5678956980492,16.4857548131787,6.84,0.187707787714205,0.237247620212101,2.32266575576113,2.3639478490246,0.482287740658935,1.11877135067419,2.32266575576113,FALSE,TRUE,FALSE
"wind_EMOS","wind","84 hour",2021-12-08,1.42230749826314,5.98590960780811,8.80803136942312,11.6896296540153,17.2327806210822,6.84,0.270884625086843,0.427045196095945,1.96803136942312,2.42481482700765,0.51963903105411,1.12208300973353,1.96803136942312,TRUE,TRUE,FALSE
"PhoebeBuffay","wind","84 hour",2021-12-08,2.16747619601056,6.40736754062155,8.74761456307445,11.2840666074755,17.4729320192305,6.84,0.233626190199472,0.216316229689225,1.90761456307445,2.22203330373775,0.531646600961526,1.02224737753248,1.90761456307445,TRUE,TRUE,FALSE
"Joey","wind","84 hour",2021-12-08,5.22513923146648,7.80152686672697,9.91737818164568,12.1391417759716,14.6357361920061,6.84,0.0807430384266761,1.44229030009045,3.07737818164568,2.64957088798579,0.389786809600305,1.52795384354978,3.07737818164568,FALSE,TRUE,FALSE
"UglyNakedGuy","wind","84 hour",2021-12-08,2.04120341382803,6.10808055262707,8.68736401373737,11.3855086967027,17.5997978487974,6.84,0.239939829308599,0.365959723686465,1.84736401373737,2.27275434835135,0.53798989243987,1.05280156150473,1.84736401373737,TRUE,TRUE,FALSE
"median_ensemble","wind","84 hour",2021-12-08,1.85657692191401,6.07434812360776,8.80803136942312,11.6896296540153,17.2032786280462,6.84,0.249171153904299,0.38282593819612,1.96803136942312,2.42481482700765,0.51816393140231,1.1086014439867,1.96803136942312,TRUE,TRUE,FALSE
"Yoda","wind","84 hour",2021-12-08,1.42230749826314,5.98590960780811,8.80803136942312,11.6896296540153,17.2327806210822,6.84,0.270884625086843,0.427045196095945,1.96803136942312,2.42481482700765,0.51963903105411,1.12208300973353,1.96803136942312,TRUE,TRUE,FALSE
"AryaStark","temperature","36 hour",2021-12-08,-2.04309004257934,-0.6924921327987,0.0161680818093311,0.724828296417362,2.075426206198,-1,0.052154502128967,0.46126180080195,1.01616808180933,0.862414148208681,0.1537713103099,0.509153968651766,1.01616808180933,FALSE,TRUE,FALSE
"HanSolo","temperature","36 hour",2021-12-08,-2.41842937469482,0.0686942264437675,0.454816937446594,0.990508198738098,2.78311920166016,-1,0.0709214687347412,1.60304133966565,1.45481693744659,0.995254099369049,0.189155960083008,0.862637961059809,1.45481693744659,FALSE,TRUE,FALSE
"ChandlerBing","temperature","36 hour",2021-12-08,-3.12254096706495,-0.659891308334761,0.632263686887744,1.92441868211025,4.38706834084044,-1,0.106127048353247,0.510163037497858,1.63226368688774,1.46220934105512,0.269353417042022,0.796023306167199,1.63226368688774,FALSE,TRUE,FALSE
"KyloRen","temperature","36 hour",2021-12-08,-2.626523775,-1.071296725,-0.18114348,0.70683509,2.6475591675,-1,0.08132618875,0.0356483625,0.81885652,0.853417545,0.182377958375,0.394325314925,0.81885652,TRUE,TRUE,FALSE
"GeneralGrievous","temperature","36 hour",2021-12-08,-3.05,-0.04,1.12,2.28,5.28,-1,0.1025,1.44,2.12,1.64,0.314,1.1233,2.12,FALSE,TRUE,FALSE
"Bronn","temperature","36 hour",2021-12-08,-2.08156151450643,-0.69966467176911,0.0254181275219436,0.750500926812997,2.13239776955032,-1,0.0540780757253217,0.450502992346335,1.02541812752194,0.875250463406499,0.156619888477516,0.512373909495523,1.02541812752194,FALSE,TRUE,FALSE
"HotPie","temperature","36 hour",2021-12-08,-1.7406967079882,-0.534163435819755,-0.0330219038645739,0.802472613465215,2.72204754484332,-1,0.03703483539941,0.698754846270367,0.966978096135426,0.901236306732607,0.186102377242166,0.558021292355996,0.966978096135426,FALSE,TRUE,FALSE
"DexterJettster","temperature","36 hour",2021-12-08,-1.4069036215494,-0.178922464834884,0.465400604044491,1.10972367292387,2.33770482963839,-1,0.02034518107747,1.23161630274767,1.46540060404449,1.05486183646194,0.16688524148192,0.787821833162698,1.46540060404449,FALSE,TRUE,FALSE
"mean_ensemble","temperature","36 hour",2021-12-08,-1.93144755437474,-0.57404067139034,0.0937020358021585,0.832786669827118,2.22859315178941,-1,0.046572377718737,0.63893899291449,1.09370203580216,0.916393334913559,0.161429657589471,0.571407279787683,1.09370203580216,FALSE,TRUE,FALSE
"GinaLinetti","temperature","36 hour",2021-12-08,-1.02725,-0.4925,-0.2,-0.005,0.50325,-1,0.0013625,0.76125,0.8,0.4975,0.0751625000000001,0.427055,0.8,FALSE,TRUE,FALSE
"CaptainRaymondHolt","temperature","36 hour",2021-12-08,-2.45196921868757,-0.690094049241937,0.0504443539058704,0.99088863809506,2.13759709021222,-1,0.0725984609343785,0.464858926137095,1.05044435390587,0.99544431904753,0.156879854510611,0.548045182907097,1.05044435390587,FALSE,TRUE,FALSE
"Joey","temperature","36 hour",2021-12-08,-0.42030580022624,-0.17965296816388,-0.00914377714210346,0.941667058694822,1.30718146688209,-1,1.13040368955883,1.23052054775418,0.990856222857897,0.970833529347411,0.115359073344105,0.887594612572485,0.990856222857897,FALSE,FALSE,FALSE
"DougJudy","temperature","36 hour",2021-12-08,-3.44163380958873,-1.73335932799697,-0.837025821208954,0.0593076855790594,1.76758216717082,-1,0.122081690479437,0.366679663998484,0.162974178791046,0.52965384278953,0.138379108358541,0.263953696883407,0.162974178791046,TRUE,TRUE,FALSE
"median_ensemble","temperature","36 hour",2021-12-08,-2.08156151450643,-0.674992678788349,0.0254181275219436,0.776912409845149,2.13239776955032,-1,0.0540780757253215,0.487510981817476,1.02541812752194,0.888456204922574,0.156619888477516,0.522416655692966,1.02541812752194,FALSE,TRUE,FALSE
"Yoda","temperature","36 hour",2021-12-08,-2.08156151450643,-0.69966467176911,0.0254181275219436,0.750500926812997,2.13239776955032,-1,0.0540780757253215,0.450502992346335,1.02541812752194,0.875250463406498,0.156619888477516,0.512373909495523,1.02541812752194,FALSE,TRUE,FALSE
"SamwellTarly","temperature","36 hour",2021-12-08,-0.316894048533066,0.251936644464963,0.540026511069417,0.993968235131602,1.37592081170328,-1,1.33205660536052,1.87790496669744,1.54002651106942,0.996984117565801,0.118796040585164,1.17315364825567,1.54002651106942,FALSE,FALSE,FALSE
"Shaggydog","temperature","36 hour",2021-12-08,-2.12949116174537,-0.723791804084172,0.0137802010704557,0.751352206225084,2.15705156388628,-1,0.0564745580872685,0.414312293873741,1.01378020107046,0.875676103112542,0.157852578194314,0.503619146867664,1.01378020107046,FALSE,TRUE,FALSE
"t2m_EMOS","temperature","36 hour",2021-12-08,-2.08156151450643,-0.69966467176911,0.0254181275219436,0.750500926812997,2.13239776955032,-1,0.0540780757253215,0.450502992346335,1.02541812752194,0.875250463406498,0.156619888477516,0.512373909495523,1.02541812752194,FALSE,TRUE,FALSE
"ObiWanKenobi","temperature","36 hour",2021-12-08,-1.1,-0.6,-0.1,0.6,1.8,-1,0.005,0.6,0.9,0.8,0.14,0.489,0.9,FALSE,TRUE,FALSE
"PhoebeBuffay","temperature","36 hour",2021-12-08,-1.63493844381494,-0.546190034868618,0.229074530739544,0.835679647208447,2.08501684375116,-1,0.031746922190747,0.680714947697073,1.22907453073954,0.917839823604224,0.154250842187558,0.602725413283829,1.22907453073954,FALSE,TRUE,FALSE
"t2m_benchmark","temperature","36 hour",2021-12-08,-1.23275,-0.86,-0.525,-0.255,0.330499999999998,-1,0.0116375,0.21,0.475,0.3725,0.066525,0.2271325,0.475,FALSE,TRUE,FALSE
"UglyNakedGuy","temperature","36 hour",2021-12-08,-2.2208495725029,-0.700096032264535,0.161146408719522,0.952580591514492,2.47764449285113,-1,0.061042478625145,0.449855951603198,1.16114640871952,0.976290295757246,0.173882224642557,0.564443471869533,1.16114640871952,FALSE,TRUE,FALSE
"ChandlerBing","temperature","48 hour",2021-12-08,-3.50624303777893,-1.14942158108616,0.0872052396705582,1.32383206042728,3.68065351712004,-0.9,0.130312151888946,0.124710790543082,0.987205239670558,1.11191603021364,0.229032675856002,0.516635377634446,0.987205239670558,TRUE,TRUE,FALSE
"Bronn","temperature","48 hour",2021-12-08,-2.24122815205508,-0.817791141283823,-0.0709121699562222,0.675966801371379,2.09940381214263,-0.9,0.0670614076027539,0.123313288074265,0.829087830043778,0.787983400685689,0.149970190607132,0.391483223402724,0.829087830043778,FALSE,TRUE,FALSE
"CaptainRaymondHolt","temperature","48 hour",2021-12-08,-1.82187644071242,-0.69696251191761,-0.21054194254418,0.573065676847542,2.33270747190884,-0.9,0.0460938220356212,0.304556232123586,0.68945805745582,0.736532838423771,0.161635373595442,0.387655264726848,0.68945805745582,FALSE,TRUE,FALSE
"DexterJettster","temperature","48 hour",2021-12-08,-2.07869896344524,-0.729817068997889,-0.0220572495300806,0.685702569937728,2.03458446438507,-0.9,0.058934948172262,0.255274396503167,0.877942750469919,0.792851284968864,0.146729223219254,0.426346520666693,0.877942750469919,FALSE,TRUE,FALSE
"DougJudy","temperature","48 hour",2021-12-08,-3.81543735340242,-2.15727679630314,-1.28723812103271,-0.417199445762294,1.24096111133699,-0.9,0.145771867670121,0.628638398151568,0.387238121032715,0.241400277118853,0.107048055566849,0.302019343908021,0.387238121032715,TRUE,TRUE,FALSE
"AryaStark","temperature","48 hour",2021-12-08,-2.20056016803403,-0.831127727672458,-0.1125850140713,0.605957699529858,1.97539013989143,-0.9,0.0650280084017015,0.103308408491313,0.7874149859287,0.752978849764929,0.143769506994572,0.370499951916243,0.7874149859287,FALSE,TRUE,FALSE
"HanSolo","temperature","48 hour",2021-12-08,-2.96259307861328,-0.720505595207214,-0.212842836976051,0.566593289375305,2.38263130187988,-0.9,0.103129653930664,0.269241607189179,0.687157163023949,0.733296644687653,0.164131565093994,0.391391326785088,0.687157163023949,FALSE,TRUE,FALSE
"SamwellTarly","temperature","48 hour",2021-12-08,-1.10991862357453,-0.339537020884548,0.0200190047731709,0.563722308739195,1.66271631972327,-0.9,0.0104959311787266,0.840694468673177,0.920019004773171,0.731861154369598,0.128135815986164,0.526241274996167,0.920019004773171,FALSE,TRUE,FALSE
"KyloRen","temperature","48 hour",2021-12-08,-2.8677376025,-1.186922075,-0.2808592,0.625635675,2.2212533925,-0.9,0.098386880125,0.1434610375,0.6191408,0.7628178375,0.156062669625,0.35597384495,0.6191408,TRUE,TRUE,FALSE
"GeneralGrievous","temperature","48 hour",2021-12-08,-2.79,-0.76,0.03,0.81,2.85,-0.9,0.0945,0.21,0.93,0.855,0.1875,0.4554,0.93,FALSE,TRUE,FALSE
"ObiWanKenobi","temperature","48 hour",2021-12-08,-3.4,-2.1,-1,-0.5,0.9,-0.9,0.125,0.6,0.1,0.2,0.0900000000000001,0.223,0.1,TRUE,TRUE,FALSE
"HotPie","temperature","48 hour",2021-12-08,-2.28727606824987,-1.31418805514713,-0.865786630368894,-0.0167605705908032,1.70319012808742,-0.9,0.0693638034124935,0.207094027573565,0.034213369631106,0.441619714704598,0.130159506404371,0.176490084345227,0.034213369631106,TRUE,TRUE,FALSE
"Shaggydog","temperature","48 hour",2021-12-08,-2.29241875872555,-0.836510095299678,-0.0725932119686169,0.691323671362444,2.14723233478832,-0.9,0.0696209379362776,0.0952348570504833,0.827406788031383,0.795661835681222,0.152361616739416,0.388057207087756,0.827406788031383,FALSE,TRUE,FALSE
"mean_ensemble","temperature","48 hour",2021-12-08,-2.4874837576845,-1.05512922223804,-0.377253500833562,0.364302037602328,1.81885339868667,-0.9,0.079374187884225,0.07756461111902,0.522746499166438,0.632151018801164,0.135942669934334,0.289555797381036,0.522746499166438,TRUE,TRUE,FALSE
"GinaLinetti","temperature","48 hour",2021-12-08,-3.90775,-1.9875,-1.62,-1.1175,-0.38625,-0.9,0.1503875,0.54375,0.72,0.32625,0.0256875,0.353215,0.72,FALSE,TRUE,FALSE
"PhoebeBuffay","temperature","48 hour",2021-12-08,-2.2794582278847,-0.77464610924605,-0.212600388552753,0.524842355650863,1.8934050839182,-0.9,0.068972911394235,0.188030836130925,0.687399611447247,0.712421177825431,0.13967025419591,0.35929895819875,0.687399611447247,FALSE,TRUE,FALSE
"Joey","temperature","48 hour",2021-12-08,-1.35734687813036,-0.846478757634713,-0.564114789833525,-0.0037755755634663,1.02039047644302,-0.9,0.0228673439065178,0.0802818635479298,0.335885210166475,0.448112212218267,0.0960195238221512,0.196633230732268,0.335885210166475,FALSE,TRUE,FALSE
"t2m_benchmark","temperature","48 hour",2021-12-08,-1.9505,-1.3225,-0.855,-0.31,0.329249999999999,-0.9,0.052525,0.21125,0.045,0.295,0.0614625,0.1330475,0.045,TRUE,TRUE,FALSE
"median_ensemble","temperature","48 hour",2021-12-08,-2.28336714806728,-0.833818911486068,-0.181940154456182,0.5895116881887,2.06266262985408,-0.9,0.069168357403364,0.099271632770898,0.718059845543818,0.74475584409435,0.148133131492704,0.355877762261027,0.718059845543818,FALSE,TRUE,FALSE
"Yoda","temperature","48 hour",2021-12-08,-2.24122815205508,-0.817791141283823,-0.0709121699562223,0.675966801371379,2.09940381214263,-0.9,0.067061407602754,0.123313288074266,0.829087830043778,0.78798340068569,0.149970190607132,0.391483223402724,0.829087830043778,FALSE,TRUE,FALSE
"t2m_EMOS","temperature","48 hour",2021-12-08,-2.24122815205508,-0.817791141283823,-0.0709121699562223,0.675966801371379,2.09940381214263,-0.9,0.067061407602754,0.123313288074266,0.829087830043778,0.78798340068569,0.149970190607132,0.391483223402724,0.829087830043778,FALSE,TRUE,FALSE
"UglyNakedGuy","temperature","48 hour",2021-12-08,-2.39817549647336,-0.895817626512756,-0.153338366368184,0.652700632978779,2.09074079532309,-0.9,0.074908774823668,0.00627356023086606,0.746661633631816,0.776350316489389,0.149537039766155,0.350746264988379,0.746661633631816,FALSE,TRUE,FALSE
"HanSolo","temperature","60 hour",2021-12-08,-0.848948359489441,1.3012820482254,1.87781727313995,2.38433647155762,4.27980947494507,0.1,0.0474474179744721,1.8019230723381,1.77781727313995,1.14216823577881,0.208990473747254,0.995669294595719,1.77781727313995,FALSE,TRUE,FALSE
"ChandlerBing","temperature","60 hour",2021-12-08,-1.87671718553094,0.671894263156835,2.00915350449011,3.34641274582338,5.89502419451115,0.1,0.0988358592765469,0.857841394735252,1.90915350449011,1.62320637291169,0.289751209725558,0.95575766822783,1.90915350449011,FALSE,TRUE,FALSE
"Bronn","temperature","60 hour",2021-12-08,-0.950729009553879,0.637831941821036,1.47135162711518,2.30487131240932,3.89343226378424,0.1,0.052536450477694,0.806747912731554,1.37135162711518,1.10243565620466,0.189671613189212,0.70454865194366,1.37135162711518,FALSE,TRUE,FALSE
"HotPie","temperature","60 hour",2021-12-08,-0.489728637640329,0.917925201983224,1.45552199462118,2.38744698133939,4.35005242936573,0.1,0.0294864318820165,1.22688780297484,1.35552199462118,1.14372349066969,0.212502621468287,0.793624468323203,1.35552199462118,FALSE,TRUE,FALSE
"DexterJettster","temperature","60 hour",2021-12-08,-0.350002926863946,1.11233576239843,1.87962648738602,2.6469172123736,4.10925590163598,0.1,0.0225001463431973,1.51850364359764,1.77962648738602,1.2734586061868,0.200462795081799,0.958910335719092,1.77962648738602,FALSE,TRUE,FALSE
"GeneralGrievous","temperature","60 hour",2021-12-08,-5.15,-0.72,0.98,2.69,7.12,0.1,0.2625,0.41,0.88,1.295,0.351,0.6397,0.88,TRUE,TRUE,FALSE
"GinaLinetti","temperature","60 hour",2021-12-08,-3.05725,-1.22,-0.52,-0.24,0.57075,0.1,0.1578625,0.66,0.62,0.51,0.0235375,0.39428,0.62,FALSE,TRUE,FALSE
"CaptainRaymondHolt","temperature","60 hour",2021-12-08,-1.2607653437864,0.731318397912514,1.76351774603723,2.57076983669439,4.53357798360458,0.1,0.0680382671893201,0.946977596868771,1.66351774603723,1.23538491834719,0.221678899180229,0.827119485524548,1.66351774603723,FALSE,TRUE,FALSE
"Joey","temperature","60 hour",2021-12-08,0.270966281493292,1.08035521128525,1.76455175364808,2.88389289083857,4.14686790754971,0.1,0.333384248911919,1.47053281692788,1.66455175364808,1.39194644541929,0.202343395377486,1.01255173205693,1.66455175364808,FALSE,FALSE,FALSE
"DougJudy","temperature","60 hour",2021-12-08,-2.10508506998527,-0.488760387177625,0.359326958656311,1.20741430449025,2.8237389872979,0.1,0.110254253499264,0.294380193588813,0.259326958656311,0.553707152245124,0.136186949364895,0.270771101470881,0.259326958656311,TRUE,TRUE,FALSE
"AryaStark","temperature","60 hour",2021-12-08,-0.855390813045252,0.711885416569682,1.53423698485352,2.35658855313736,3.9238647827523,0.1,0.0477695406522626,0.917828124854523,1.43423698485352,1.12829427656868,0.191193239137615,0.74386443321332,1.43423698485352,FALSE,TRUE,FALSE
"Yoda","temperature","60 hour",2021-12-08,-0.950729009553879,0.637831941821036,1.47135162711518,2.30487131240932,3.89343226378424,0.1,0.052536450477694,0.806747912731554,1.37135162711518,1.10243565620466,0.189671613189212,0.70454865194366,1.37135162711518,FALSE,TRUE,FALSE
"SamwellTarly","temperature","60 hour",2021-12-08,0.420655619102625,1.63087484901843,1.97930747997183,2.3290617414393,3.14537441658036,0.1,0.625278457250118,2.29631227352765,1.87930747997183,1.11453087071965,0.152268720829018,1.21353956045965,1.87930747997183,FALSE,FALSE,FALSE
"KyloRen","temperature","60 hour",2021-12-08,-1.1872180375,0.750040325,1.89754605,3.032266875,5.1654054375,0.1,0.064360901875,0.9750604875,1.79754605,1.4661334375,0.253270271875,0.91127422975,1.79754605,FALSE,TRUE,FALSE
"t2m_EMOS","temperature","60 hour",2021-12-08,-0.950729009553879,0.637831941821036,1.47135162711518,2.30487131240932,3.89343226378424,0.1,0.052536450477694,0.806747912731554,1.37135162711518,1.10243565620466,0.189671613189212,0.70454865194366,1.37135162711518,FALSE,TRUE,FALSE
"ObiWanKenobi","temperature","60 hour",2021-12-08,-0.1,0.6,1.6,2.2,4.09,0.1,0.01,0.75,1.5,1.05,0.1995,0.7019,1.5,FALSE,TRUE,FALSE
"PhoebeBuffay","temperature","60 hour",2021-12-08,-0.567637454399324,0.879185769719132,1.61454484628108,2.32472054058697,3.84073485607953,0.1,0.0333818727199662,1.1687786545787,1.51454484628108,1.11236027029348,0.187036742803977,0.803220477335441,1.51454484628108,FALSE,TRUE,FALSE
"Shaggydog","temperature","60 hour",2021-12-08,-1.03209043451802,0.579098828508414,1.42449161391255,2.26988439931669,3.88107366234312,0.1,0.0566045217259008,0.71864824276262,1.32449161391255,1.08494219965835,0.189053683117156,0.674748052235315,1.32449161391255,FALSE,TRUE,FALSE
"mean_ensemble","temperature","60 hour",2021-12-08,-1.09056480983889,0.619481314138159,1.45852411247324,2.27237889110895,4.00889569267345,0.1,0.0595282404919445,0.779221971207239,1.35852411247324,1.08618944555447,0.195444784633673,0.695781710872114,1.35852411247324,FALSE,TRUE,FALSE
"UglyNakedGuy","temperature","60 hour",2021-12-08,-0.31864680595307,1.33869477070039,2.10678467512144,2.84075133235361,4.50533702795082,0.1,0.0209323402976535,1.85804215605058,2.00678467512144,1.3703756661768,0.220266851397541,1.0952803378088,2.00678467512144,FALSE,TRUE,FALSE
"t2m_benchmark","temperature","60 hour",2021-12-08,-0.45125,0.6,1.03,1.3025,2.11675,0.1,0.0275625,0.75,0.93,0.60125,0.1008375,0.48193,0.93,FALSE,TRUE,FALSE
"median_ensemble","temperature","60 hour",2021-12-08,-0.903059911299565,0.691889839863258,1.56711849242676,2.34282514728833,4.00693239137615,0.1,0.0501529955649783,0.887834759794887,1.46711849242676,1.12141257364416,0.195346619568808,0.74437308819992,1.46711849242676,FALSE,TRUE,FALSE
"Bronn","temperature","72 hour",2021-12-08,-2.8769167435434,-1.22673894847176,-0.360888837251906,0.504961273967952,2.15513906903959,-0.2,0.13384583717717,0.513369474235882,0.160888837251906,0.352480636983976,0.11775695345198,0.255668347820183,0.160888837251906,TRUE,TRUE,FALSE
"CaptainRaymondHolt","temperature","72 hour",2021-12-08,-2.91231021782346,-1.06818406514628,-0.268654076707066,0.0279602620289867,1.61555896399488,-0.2,0.135615510891173,0.434092032573138,0.0686540767070656,0.113980131014493,0.0907779481997441,0.168623939877123,0.0686540767070656,TRUE,TRUE,FALSE
"AryaStark","temperature","72 hour",2021-12-08,-2.85163534933287,-1.24142209356537,-0.396541420247712,0.448339253069947,2.05855250883744,-0.2,0.132581767466643,0.520711046782685,0.196541420247712,0.324169626534973,0.112927625441872,0.257386297294777,0.196541420247712,TRUE,TRUE,FALSE
"HanSolo","temperature","72 hour",2021-12-08,-3.4483118057251,-0.62291419506073,-0.433614611625671,1.01414978504181,2.37098979949951,-0.2,0.162415590286255,0.211457097530365,0.233614611625671,0.607074892520905,0.128549489974976,0.268622336387634,0.233614611625671,TRUE,TRUE,FALSE
"ChandlerBing","temperature","72 hour",2021-12-08,-3.98915744160839,-1.5032374432257,-0.198872475092143,1.10549249304141,3.5914124914241,-0.2,0.189457872080419,0.651618721612849,0.00112752490785742,0.652746246520706,0.189570624571205,0.336904197938607,0.00112752490785742,TRUE,TRUE,FALSE
"KyloRen","temperature","72 hour",2021-12-08,-3.158376305,-1.4486208,-0.58911388,0.2751360275,1.8275528275,-0.2,0.14791881525,0.6243104,0.38911388,0.23756801375,0.101377641375,0.300057750075,0.38911388,TRUE,TRUE,FALSE
"GeneralGrievous","temperature","72 hour",2021-12-08,-6.83,-2.07,-0.23,1.61,6.37,-0.2,0.3315,0.935,0.03,0.905,0.3285,0.506,0.03,TRUE,TRUE,FALSE
"ObiWanKenobi","temperature","72 hour",2021-12-08,-3.7,-1.2,-0.6,0.7,2.3,-0.2,0.175,0.5,0.4,0.45,0.125,0.33,0.4,TRUE,TRUE,FALSE
"HotPie","temperature","72 hour",2021-12-08,-2.59119327528758,-1.48990374683831,-0.90696133819838,0.0503062912852344,1.94765367935057,-0.2,0.119559663764379,0.644951873419155,0.70696133819838,0.125153145642617,0.107382683967529,0.340801740998412,0.70696133819838,TRUE,TRUE,FALSE
"DexterJettster","temperature","72 hour",2021-12-08,-2.76700048045361,-1.17964612416542,-0.346759540645622,0.486127042874177,2.07348139916236,-0.2,0.128350024022681,0.48982306208271,0.146759540645622,0.343063521437089,0.113674069958118,0.244334043629244,0.146759540645622,TRUE,TRUE,FALSE
"mean_ensemble","temperature","72 hour",2021-12-08,-3.16281116673802,-1.28876153703419,-0.457803425513178,0.494200714747523,2.15407817548219,-0.2,0.148140558336901,0.544380768517095,0.257803425513178,0.347100357373761,0.11770390877411,0.283025803703009,0.257803425513178,TRUE,TRUE,FALSE
"GinaLinetti","temperature","72 hour",2021-12-08,-2.48725,-0.9925,-0.405,0.245,1.107,-0.2,0.1143625,0.39625,0.205,0.2225,0.0653500000000001,0.2006925,0.205,TRUE,TRUE,FALSE
"PhoebeBuffay","temperature","72 hour",2021-12-08,-2.97201421299191,-1.16183040254001,-0.310120230758815,0.467756415716072,2.13681212120596,-0.2,0.138600710649596,0.480915201270005,0.110120230758815,0.333878207858036,0.116840606060298,0.23607099131935,0.110120230758815,TRUE,TRUE,FALSE
"Joey","temperature","72 hour",2021-12-08,-2.69076423157018,-1.68047867472987,-1.03748221311817,0.973738456227834,1.54021102937736,-0.2,0.124538211578509,0.740239337364936,0.837482213118174,0.586869228113917,0.0870105514688681,0.475227908328881,0.837482213118174,TRUE,TRUE,FALSE
"DougJudy","temperature","72 hour",2021-12-08,-3.54740469550019,-1.92116259594137,-1.06787157058716,-0.21458054523295,1.41166155432588,-0.2,0.16737023477501,0.860581297970683,0.867871570587158,0.0218708178494245,0.0805830777162939,0.399655399779714,0.867871570587158,FALSE,TRUE,FALSE
"median_ensemble","temperature","72 hour",2021-12-08,-2.89461348068343,-1.23348322661081,-0.382227867128368,0.478143712361052,2.07479333403992,-0.2,0.134730674034171,0.516741613305405,0.182227867128368,0.339071856180526,0.113739666701996,0.257302335470093,0.182227867128368,TRUE,TRUE,FALSE
"Yoda","temperature","72 hour",2021-12-08,-2.8769167435434,-1.22673894847176,-0.360888837251906,0.504961273967952,2.15513906903959,-0.2,0.13384583717717,0.51336947423588,0.160888837251906,0.352480636983976,0.11775695345198,0.255668347820182,0.160888837251906,TRUE,TRUE,FALSE
"SamwellTarly","temperature","72 hour",2021-12-08,-1.51066097336671,-0.354924448277624,0.282045092729638,0.715843122427484,1.49187550715856,-0.2,0.0655330486683356,0.077462224138812,0.482045092729638,0.457921561213742,0.0845937753579282,0.233511140421691,0.482045092729638,TRUE,TRUE,FALSE
"Shaggydog","temperature","72 hour",2021-12-08,-2.87009627467284,-1.24022750474986,-0.385033561450966,0.470160381847928,2.10002915177091,-0.2,0.133504813733642,0.52011375237493,0.185033561450966,0.335080190923964,0.115001457588546,0.257746755214409,0.185033561450966,TRUE,TRUE,FALSE
"t2m_EMOS","temperature","72 hour",2021-12-08,-2.8769167435434,-1.22673894847176,-0.360888837251906,0.504961273967952,2.15513906903959,-0.2,0.13384583717717,0.51336947423588,0.160888837251906,0.352480636983976,0.11775695345198,0.255668347820182,0.160888837251906,TRUE,TRUE,FALSE
"UglyNakedGuy","temperature","72 hour",2021-12-08,-3.07654784079741,-1.277461801028,-0.379422172805769,0.461201487218664,2.07610526891747,-0.2,0.14382739203987,0.538730900514,0.179422172805769,0.330600743609332,0.113805263445874,0.261277294482969,0.179422172805769,TRUE,TRUE,FALSE
"t2m_benchmark","temperature","72 hour",2021-12-08,-3.22275,-1.6425,-0.8,-0.4675,0.59725,-0.2,0.1511375,0.72125,0.6,0.40125,0.0398625,0.3827,0.6,FALSE,TRUE,FALSE
"Bronn","temperature","84 hour",2021-12-08,-2.37870458914806,-0.193376510030026,0.953267546148226,2.09991160232648,4.28523968144451,-0.3,0.103935229457403,0.15993523495496,1.25326754614823,1.19995580116324,0.229261984072226,0.589271159159211,1.25326754614823,FALSE,TRUE,FALSE
"ChandlerBing","temperature","84 hour",2021-12-08,-2.59980650362551,0.110549818061353,1.53267677285784,2.95480372765433,5.66516004934119,-0.3,0.114990325181275,0.61582472709203,1.83267677285784,1.62740186382716,0.29825800246706,0.897830338285074,1.83267677285784,FALSE,TRUE,FALSE
"GeneralGrievous","temperature","84 hour",2021-12-08,-6.86,-1.61,0.42,2.45,7.71,-0.3,0.328,0.655,0.72,1.375,0.4005,0.6957,0.72,TRUE,TRUE,FALSE
"GinaLinetti","temperature","84 hour",2021-12-08,-1.124,0.7375,1.195,1.7,2.16725,-0.3,0.0412,1.55625,1.495,1,0.1233625,0.8431625,1.495,FALSE,TRUE,FALSE
"CaptainRaymondHolt","temperature","84 hour",2021-12-08,-2.5970203243623,-0.0883737367144062,0.779564541601869,1.58448082128721,4.07678907714903,-0.3,0.114851016218115,0.317439394928391,1.07956454160187,0.942240410643607,0.218839453857451,0.534586963449887,1.07956454160187,FALSE,TRUE,FALSE
"DexterJettster","temperature","84 hour",2021-12-08,-1.65827975308093,0.326153899347625,1.36738842801191,2.40862295667621,4.39305660910476,-0.3,0.0679139876540465,0.939230849021437,1.66738842801191,1.3543114783381,0.234652830455238,0.852699514696148,1.66738842801191,FALSE,TRUE,FALSE
"DougJudy","temperature","84 hour",2021-12-08,-2.69354566348238,-1.0216198214249,-0.144358485937119,0.732902849550661,2.40482869160814,-0.3,0.119677283174119,0.360809910712449,0.155641514062881,0.516451424775331,0.135241434580407,0.257564313461037,0.155641514062881,TRUE,TRUE,FALSE
"AryaStark","temperature","84 hour",2021-12-08,-2.18994907154207,-0.103767561863381,0.990854179851235,2.08547592156585,4.17165743124454,-0.3,0.0944974535771035,0.294348657204929,1.29085417985123,1.19273796078292,0.223582871562227,0.619204224595684,1.29085417985123,FALSE,TRUE,FALSE
"HanSolo","temperature","84 hour",2021-12-08,-1.75328528881073,0.215937718749046,0.967537045478821,2.38101005554199,4.13646030426025,-0.3,0.0726642644405365,0.77390657812357,1.26753704547882,1.340505027771,0.221823015213013,0.735287186205387,1.26753704547882,FALSE,TRUE,FALSE
"SamwellTarly","temperature","84 hour",2021-12-08,0.14213118548774,1.01271582929703,1.62136257336291,2.53694066631319,4.1800124399824,-0.3,0.862155811701094,1.96907374394554,1.92136257336291,1.4184703331566,0.22400062199912,1.27901261683305,1.92136257336291,FALSE,FALSE,FALSE
"KyloRen","temperature","84 hour",2021-12-08,-1.80942245,0.52054697,1.67497085,2.838878875,5.21570941,-0.3,0.0754711225,1.230820455,1.97497085,1.5694394375,0.2757854705,1.0252974671,1.97497085,FALSE,TRUE,FALSE
"t2m_EMOS","temperature","84 hour",2021-12-08,-2.37870458914806,-0.193376510030026,0.953267546148227,2.09991160232648,4.28523968144451,-0.3,0.103935229457403,0.159935234954961,1.25326754614823,1.19995580116324,0.229261984072226,0.589271159159211,1.25326754614823,FALSE,TRUE,FALSE
"ObiWanKenobi","temperature","84 hour",2021-12-08,-1,-0.3,0.6,1.9,4.1,-0.3,0.035,0,0.9,1.1,0.22,0.451,0.9,TRUE,TRUE,FALSE
"HotPie","temperature","84 hour",2021-12-08,-1.39799832254628,0.0041232057827044,0.843598470975849,2.00095257077309,4.38346267920634,-0.3,0.054899916127314,0.456184808674057,1.14359847097585,1.15047628538654,0.234173133960317,0.607866523024816,1.14359847097585,FALSE,TRUE,FALSE
"Shaggydog","temperature","84 hour",2021-12-08,-2.45329111239294,-0.216057218984619,0.957821875266758,2.13170096951814,4.36893486292646,-0.3,0.107664555619647,0.125914171523071,1.25782187526676,1.21585048475907,0.233446743146323,0.588139566062973,1.25782187526676,FALSE,TRUE,FALSE
"mean_ensemble","temperature","84 hour",2021-12-08,-1.97928977257479,0.000894125917558567,0.990852454420538,2.12430212757047,4.31389718887468,-0.3,0.0839644886287395,0.451341188876338,1.29085245442054,1.21215106378523,0.230694859443734,0.653800811030917,1.29085245442054,FALSE,TRUE,FALSE
"UglyNakedGuy","temperature","84 hour",2021-12-08,-1.50339001193383,0.42510765698208,1.37016566046166,2.4575624210503,4.49965437687639,-0.3,0.0601695005966915,1.08766148547312,1.67016566046166,1.37878121052515,0.23998271884382,0.887352115180088,1.67016566046166,FALSE,TRUE,FALSE
"PhoebeBuffay","temperature","84 hour",2021-12-08,-1.77084004766819,-0.0619886156860138,1.04601090768382,1.99265985650169,4.14773092761255,-0.3,0.0735420023834095,0.357017076470979,1.34601090768382,1.14632992825085,0.222386546380628,0.629057292233936,1.34601090768382,FALSE,TRUE,FALSE
"Joey","temperature","84 hour",2021-12-08,0.239515679905823,1.04218390489473,1.53965363035053,2.76781605299734,4.5907678738481,-0.3,1.05205557581636,2.01327585734209,1.83965363035053,1.53390802649867,0.244538393692405,1.33668629674001,1.83965363035053,FALSE,FALSE,FALSE
"t2m_benchmark","temperature","84 hour",2021-12-08,-1.4205,-0.395,0.195,1.2625,3.21075,-0.3,0.056025,0.0475,0.495,0.78125,0.1755375,0.3110625,0.495,TRUE,TRUE,FALSE
"median_ensemble","temperature","84 hour",2021-12-08,-1.7901312488341,-0.07518117620021,0.96267946037279,2.09991160232648,4.28523968144451,-0.3,0.074506562441705,0.337228235699685,1.26267946037279,1.19995580116324,0.229261984072226,0.620726408749929,1.26267946037279,FALSE,TRUE,FALSE
"Yoda","temperature","84 hour",2021-12-08,-2.37870458914806,-0.193376510030026,0.953267546148227,2.09991160232648,4.28523968144451,-0.3,0.103935229457403,0.159935234954961,1.25326754614823,1.19995580116324,0.229261984072226,0.589271159159211,1.25326754614823,FALSE,TRUE,FALSE
"JabbaTheHutt","DAX","1 day",2021-12-08,NA,NA,NA,NA,NA,-0.305366669036999,NA,NA,NA,NA,NA,0.378736314618965,0.651378575931874,FALSE,FALSE,TRUE
"Joffrey_Baratheon","DAX","1 day",2021-12-08,NA,NA,NA,NA,NA,-0.305366669036999,NA,NA,NA,NA,NA,0.378736314618965,0.651378575931874,FALSE,FALSE,TRUE
"RossGeller","DAX","1 day",2021-12-08,NA,NA,NA,NA,NA,-0.305366669036999,NA,NA,NA,NA,NA,0.378736314618965,0.651378575931874,FALSE,FALSE,TRUE
"t2m_benchmark","DAX","1 day",2021-12-08,NA,NA,NA,NA,NA,-0.305366669036999,NA,NA,NA,NA,NA,0.378736314618965,0.651378575931874,FALSE,FALSE,TRUE
"t2m_EMOS","DAX","1 day",2021-12-08,NA,NA,NA,NA,NA,-0.305366669036999,NA,NA,NA,NA,NA,0.378736314618965,0.651378575931874,FALSE,FALSE,TRUE
"wind_benchmark","DAX","1 day",2021-12-08,NA,NA,NA,NA,NA,-0.305366669036999,NA,NA,NA,NA,NA,0.378736314618965,0.651378575931874,FALSE,FALSE,TRUE
"wind_EMOS","DAX","1 day",2021-12-08,NA,NA,NA,NA,NA,-0.305366669036999,NA,NA,NA,NA,NA,0.378736314618965,0.651378575931874,FALSE,FALSE,TRUE
"JabbaTheHutt","DAX","2 day",2021-12-08,NA,NA,NA,NA,NA,-0.407406889804207,NA,NA,NA,NA,NA,0.81906513938107,1.35521246296271,FALSE,FALSE,TRUE
"Joffrey_Baratheon","DAX","2 day",2021-12-08,NA,NA,NA,NA,NA,-0.407406889804207,NA,NA,NA,NA,NA,0.81906513938107,1.35521246296271,FALSE,FALSE,TRUE
"RossGeller","DAX","2 day",2021-12-08,NA,NA,NA,NA,NA,-0.407406889804207,NA,NA,NA,NA,NA,0.81906513938107,1.35521246296271,FALSE,FALSE,TRUE
"t2m_benchmark","DAX","2 day",2021-12-08,NA,NA,NA,NA,NA,-0.407406889804207,NA,NA,NA,NA,NA,0.81906513938107,1.35521246296271,FALSE,FALSE,TRUE
"t2m_EMOS","DAX","2 day",2021-12-08,NA,NA,NA,NA,NA,-0.407406889804207,NA,NA,NA,NA,NA,0.81906513938107,1.35521246296271,FALSE,FALSE,TRUE
"wind_benchmark","DAX","2 day",2021-12-08,NA,NA,NA,NA,NA,-0.407406889804207,NA,NA,NA,NA,NA,0.81906513938107,1.35521246296271,FALSE,FALSE,TRUE
"wind_EMOS","DAX","2 day",2021-12-08,NA,NA,NA,NA,NA,-0.407406889804207,NA,NA,NA,NA,NA,0.81906513938107,1.35521246296271,FALSE,FALSE,TRUE
"JabbaTheHutt","DAX","5 day",2021-12-08,NA,NA,NA,NA,NA,-0.417583503730512,NA,NA,NA,NA,NA,2.09132910197069,3.81009622876782,FALSE,FALSE,TRUE
"Joffrey_Baratheon","DAX","5 day",2021-12-08,NA,NA,NA,NA,NA,-0.417583503730512,NA,NA,NA,NA,NA,2.09132910197069,3.81009622876782,FALSE,FALSE,TRUE
"RossGeller","DAX","5 day",2021-12-08,NA,NA,NA,NA,NA,-0.417583503730512,NA,NA,NA,NA,NA,2.09132910197069,3.81009622876782,FALSE,FALSE,TRUE
"t2m_benchmark","DAX","5 day",2021-12-08,NA,NA,NA,NA,NA,-0.417583503730512,NA,NA,NA,NA,NA,2.09132910197069,3.81009622876782,FALSE,FALSE,TRUE
"t2m_EMOS","DAX","5 day",2021-12-08,NA,NA,NA,NA,NA,-0.417583503730512,NA,NA,NA,NA,NA,2.09132910197069,3.81009622876782,FALSE,FALSE,TRUE
"wind_benchmark","DAX","5 day",2021-12-08,NA,NA,NA,NA,NA,-0.417583503730512,NA,NA,NA,NA,NA,2.09132910197069,3.81009622876782,FALSE,FALSE,TRUE
"wind_EMOS","DAX","5 day",2021-12-08,NA,NA,NA,NA,NA,-0.417583503730512,NA,NA,NA,NA,NA,2.09132910197069,3.81009622876782,FALSE,FALSE,TRUE
"JabbaTheHutt","DAX","6 day",2021-12-08,NA,NA,NA,NA,NA,-1.49987014601649,NA,NA,NA,NA,NA,2.51240038737666,4.28167698747666,FALSE,FALSE,TRUE
"Joffrey_Baratheon","DAX","6 day",2021-12-08,NA,NA,NA,NA,NA,-1.49987014601649,NA,NA,NA,NA,NA,2.51240038737666,4.28167698747666,FALSE,FALSE,TRUE
"RossGeller","DAX","6 day",2021-12-08,NA,NA,NA,NA,NA,-1.49987014601649,NA,NA,NA,NA,NA,2.51240038737666,4.28167698747666,FALSE,FALSE,TRUE
"t2m_benchmark","DAX","6 day",2021-12-08,NA,NA,NA,NA,NA,-1.49987014601649,NA,NA,NA,NA,NA,2.51240038737666,4.28167698747666,FALSE,FALSE,TRUE
"t2m_EMOS","DAX","6 day",2021-12-08,NA,NA,NA,NA,NA,-1.49987014601649,NA,NA,NA,NA,NA,2.51240038737666,4.28167698747666,FALSE,FALSE,TRUE
"wind_benchmark","DAX","6 day",2021-12-08,NA,NA,NA,NA,NA,-1.49987014601649,NA,NA,NA,NA,NA,2.51240038737666,4.28167698747666,FALSE,FALSE,TRUE
"wind_EMOS","DAX","6 day",2021-12-08,NA,NA,NA,NA,NA,-1.49987014601649,NA,NA,NA,NA,NA,2.51240038737666,4.28167698747666,FALSE,FALSE,TRUE
"JabbaTheHutt","DAX","7 day",2021-12-08,NA,NA,NA,NA,NA,-1.35250441666717,NA,NA,NA,NA,NA,3.56738440537943,4.65405842490186,FALSE,FALSE,TRUE
"Joffrey_Baratheon","DAX","7 day",2021-12-08,NA,NA,NA,NA,NA,-1.35250441666717,NA,NA,NA,NA,NA,3.56738440537943,4.65405842490186,FALSE,FALSE,TRUE
"RossGeller","DAX","7 day",2021-12-08,NA,NA,NA,NA,NA,-1.35250441666717,NA,NA,NA,NA,NA,3.56738440537943,4.65405842490186,FALSE,FALSE,TRUE
"t2m_benchmark","DAX","7 day",2021-12-08,NA,NA,NA,NA,NA,-1.35250441666717,NA,NA,NA,NA,NA,3.56738440537943,4.65405842490186,FALSE,FALSE,TRUE
"t2m_EMOS","DAX","7 day",2021-12-08,NA,NA,NA,NA,NA,-1.35250441666717,NA,NA,NA,NA,NA,3.56738440537943,4.65405842490186,FALSE,FALSE,TRUE
"wind_benchmark","DAX","7 day",2021-12-08,NA,NA,NA,NA,NA,-1.35250441666717,NA,NA,NA,NA,NA,3.56738440537943,4.65405842490186,FALSE,FALSE,TRUE
"wind_EMOS","DAX","7 day",2021-12-08,NA,NA,NA,NA,NA,-1.35250441666717,NA,NA,NA,NA,NA,3.56738440537943,4.65405842490186,FALSE,FALSE,TRUE
"DAX_benchmark","wind","36 hour",2021-12-08,NA,NA,NA,NA,NA,9.36,NA,NA,NA,NA,NA,5.636640825,7.4942,FALSE,FALSE,TRUE
"JabbaTheHutt","wind","36 hour",2021-12-08,NA,NA,NA,NA,NA,9.36,NA,NA,NA,NA,NA,5.636640825,7.4942,FALSE,FALSE,TRUE
"Joffrey_Baratheon","wind","36 hour",2021-12-08,NA,NA,NA,NA,NA,9.36,NA,NA,NA,NA,NA,5.636640825,7.4942,FALSE,FALSE,TRUE
"RossGeller","wind","36 hour",2021-12-08,NA,NA,NA,NA,NA,9.36,NA,NA,NA,NA,NA,5.636640825,7.4942,FALSE,FALSE,TRUE
"t2m_benchmark","wind","36 hour",2021-12-08,NA,NA,NA,NA,NA,9.36,NA,NA,NA,NA,NA,5.636640825,7.4942,FALSE,FALSE,TRUE
"t2m_EMOS","wind","36 hour",2021-12-08,NA,NA,NA,NA,NA,9.36,NA,NA,NA,NA,NA,5.636640825,7.4942,FALSE,FALSE,TRUE
"DAX_benchmark","wind","48 hour",2021-12-08,NA,NA,NA,NA,NA,4.32,NA,NA,NA,NA,NA,7.00381975,10.2919,FALSE,FALSE,TRUE
"JabbaTheHutt","wind","48 hour",2021-12-08,NA,NA,NA,NA,NA,4.32,NA,NA,NA,NA,NA,7.00381975,10.2919,FALSE,FALSE,TRUE
"Joffrey_Baratheon","wind","48 hour",2021-12-08,NA,NA,NA,NA,NA,4.32,NA,NA,NA,NA,NA,7.00381975,10.2919,FALSE,FALSE,TRUE
"RossGeller","wind","48 hour",2021-12-08,NA,NA,NA,NA,NA,4.32,NA,NA,NA,NA,NA,7.00381975,10.2919,FALSE,FALSE,TRUE
"t2m_benchmark","wind","48 hour",2021-12-08,NA,NA,NA,NA,NA,4.32,NA,NA,NA,NA,NA,7.00381975,10.2919,FALSE,FALSE,TRUE
"t2m_EMOS","wind","48 hour",2021-12-08,NA,NA,NA,NA,NA,4.32,NA,NA,NA,NA,NA,7.00381975,10.2919,FALSE,FALSE,TRUE
"DAX_benchmark","wind","60 hour",2021-12-08,NA,NA,NA,NA,NA,9.36,NA,NA,NA,NA,NA,4.031011,7.4538,FALSE,FALSE,TRUE
"JabbaTheHutt","wind","60 hour",2021-12-08,NA,NA,NA,NA,NA,9.36,NA,NA,NA,NA,NA,4.031011,7.4538,FALSE,FALSE,TRUE
"Joffrey_Baratheon","wind","60 hour",2021-12-08,NA,NA,NA,NA,NA,9.36,NA,NA,NA,NA,NA,4.031011,7.4538,FALSE,FALSE,TRUE
"RossGeller","wind","60 hour",2021-12-08,NA,NA,NA,NA,NA,9.36,NA,NA,NA,NA,NA,4.031011,7.4538,FALSE,FALSE,TRUE
"t2m_benchmark","wind","60 hour",2021-12-08,NA,NA,NA,NA,NA,9.36,NA,NA,NA,NA,NA,4.031011,7.4538,FALSE,FALSE,TRUE
"t2m_EMOS","wind","60 hour",2021-12-08,NA,NA,NA,NA,NA,9.36,NA,NA,NA,NA,NA,4.031011,7.4538,FALSE,FALSE,TRUE
"DAX_benchmark","wind","72 hour",2021-12-08,NA,NA,NA,NA,NA,6.84,NA,NA,NA,NA,NA,4.264422,7.5952,FALSE,FALSE,TRUE
"JabbaTheHutt","wind","72 hour",2021-12-08,NA,NA,NA,NA,NA,6.84,NA,NA,NA,NA,NA,4.264422,7.5952,FALSE,FALSE,TRUE
"Joffrey_Baratheon","wind","72 hour",2021-12-08,NA,NA,NA,NA,NA,6.84,NA,NA,NA,NA,NA,4.264422,7.5952,FALSE,FALSE,TRUE
"RossGeller","wind","72 hour",2021-12-08,NA,NA,NA,NA,NA,6.84,NA,NA,NA,NA,NA,4.264422,7.5952,FALSE,FALSE,TRUE
"t2m_benchmark","wind","72 hour",2021-12-08,NA,NA,NA,NA,NA,6.84,NA,NA,NA,NA,NA,4.264422,7.5952,FALSE,FALSE,TRUE
"t2m_EMOS","wind","72 hour",2021-12-08,NA,NA,NA,NA,NA,6.84,NA,NA,NA,NA,NA,4.264422,7.5952,FALSE,FALSE,TRUE
"DAX_benchmark","wind","84 hour",2021-12-08,NA,NA,NA,NA,NA,6.84,NA,NA,NA,NA,NA,6.108581,10.0091,FALSE,FALSE,TRUE
"JabbaTheHutt","wind","84 hour",2021-12-08,NA,NA,NA,NA,NA,6.84,NA,NA,NA,NA,NA,6.108581,10.0091,FALSE,FALSE,TRUE
"Joffrey_Baratheon","wind","84 hour",2021-12-08,NA,NA,NA,NA,NA,6.84,NA,NA,NA,NA,NA,6.108581,10.0091,FALSE,FALSE,TRUE
"RossGeller","wind","84 hour",2021-12-08,NA,NA,NA,NA,NA,6.84,NA,NA,NA,NA,NA,6.108581,10.0091,FALSE,FALSE,TRUE
"t2m_benchmark","wind","84 hour",2021-12-08,NA,NA,NA,NA,NA,6.84,NA,NA,NA,NA,NA,6.108581,10.0091,FALSE,FALSE,TRUE
"t2m_EMOS","wind","84 hour",2021-12-08,NA,NA,NA,NA,NA,6.84,NA,NA,NA,NA,NA,6.108581,10.0091,FALSE,FALSE,TRUE
"DAX_benchmark","temperature","36 hour",2021-12-08,NA,NA,NA,NA,NA,-1,NA,NA,NA,NA,NA,1.18488518473823,2.1412,FALSE,FALSE,TRUE
"JabbaTheHutt","temperature","36 hour",2021-12-08,NA,NA,NA,NA,NA,-1,NA,NA,NA,NA,NA,1.18488518473823,2.1412,FALSE,FALSE,TRUE
"Joffrey_Baratheon","temperature","36 hour",2021-12-08,NA,NA,NA,NA,NA,-1,NA,NA,NA,NA,NA,1.18488518473823,2.1412,FALSE,FALSE,TRUE
"RossGeller","temperature","36 hour",2021-12-08,NA,NA,NA,NA,NA,-1,NA,NA,NA,NA,NA,1.18488518473823,2.1412,FALSE,FALSE,TRUE
"wind_benchmark","temperature","36 hour",2021-12-08,NA,NA,NA,NA,NA,-1,NA,NA,NA,NA,NA,1.18488518473823,2.1412,FALSE,FALSE,TRUE
"wind_EMOS","temperature","36 hour",2021-12-08,NA,NA,NA,NA,NA,-1,NA,NA,NA,NA,NA,1.18488518473823,2.1412,FALSE,FALSE,TRUE
"DAX_benchmark","temperature","48 hour",2021-12-08,NA,NA,NA,NA,NA,-0.9,NA,NA,NA,NA,NA,0.531503687746129,0.997077292067264,FALSE,FALSE,TRUE
"JabbaTheHutt","temperature","48 hour",2021-12-08,NA,NA,NA,NA,NA,-0.9,NA,NA,NA,NA,NA,0.531503687746129,0.997077292067264,FALSE,FALSE,TRUE
"Joffrey_Baratheon","temperature","48 hour",2021-12-08,NA,NA,NA,NA,NA,-0.9,NA,NA,NA,NA,NA,0.531503687746129,0.997077292067264,FALSE,FALSE,TRUE
"RossGeller","temperature","48 hour",2021-12-08,NA,NA,NA,NA,NA,-0.9,NA,NA,NA,NA,NA,0.531503687746129,0.997077292067264,FALSE,FALSE,TRUE
"wind_benchmark","temperature","48 hour",2021-12-08,NA,NA,NA,NA,NA,-0.9,NA,NA,NA,NA,NA,0.531503687746129,0.997077292067264,FALSE,FALSE,TRUE
"wind_EMOS","temperature","48 hour",2021-12-08,NA,NA,NA,NA,NA,-0.9,NA,NA,NA,NA,NA,0.531503687746129,0.997077292067264,FALSE,FALSE,TRUE
"DAX_benchmark","temperature","60 hour",2021-12-08,NA,NA,NA,NA,NA,0.1,NA,NA,NA,NA,NA,1.22567495606425,2.02685252187265,FALSE,FALSE,TRUE
"JabbaTheHutt","temperature","60 hour",2021-12-08,NA,NA,NA,NA,NA,0.1,NA,NA,NA,NA,NA,1.22567495606425,2.02685252187265,FALSE,FALSE,TRUE
"Joffrey_Baratheon","temperature","60 hour",2021-12-08,NA,NA,NA,NA,NA,0.1,NA,NA,NA,NA,NA,1.22567495606425,2.02685252187265,FALSE,FALSE,TRUE
"RossGeller","temperature","60 hour",2021-12-08,NA,NA,NA,NA,NA,0.1,NA,NA,NA,NA,NA,1.22567495606425,2.02685252187265,FALSE,FALSE,TRUE
"wind_benchmark","temperature","60 hour",2021-12-08,NA,NA,NA,NA,NA,0.1,NA,NA,NA,NA,NA,1.22567495606425,2.02685252187265,FALSE,FALSE,TRUE
"wind_EMOS","temperature","60 hour",2021-12-08,NA,NA,NA,NA,NA,0.1,NA,NA,NA,NA,NA,1.22567495606425,2.02685252187265,FALSE,FALSE,TRUE
"DAX_benchmark","temperature","72 hour",2021-12-08,NA,NA,NA,NA,NA,-0.2,NA,NA,NA,NA,NA,0.51106,0.87655028629303,FALSE,FALSE,TRUE
"JabbaTheHutt","temperature","72 hour",2021-12-08,NA,NA,NA,NA,NA,-0.2,NA,NA,NA,NA,NA,0.51106,0.87655028629303,FALSE,FALSE,TRUE
"Joffrey_Baratheon","temperature","72 hour",2021-12-08,NA,NA,NA,NA,NA,-0.2,NA,NA,NA,NA,NA,0.51106,0.87655028629303,FALSE,FALSE,TRUE
"RossGeller","temperature","72 hour",2021-12-08,NA,NA,NA,NA,NA,-0.2,NA,NA,NA,NA,NA,0.51106,0.87655028629303,FALSE,FALSE,TRUE
"wind_benchmark","temperature","72 hour",2021-12-08,NA,NA,NA,NA,NA,-0.2,NA,NA,NA,NA,NA,0.51106,0.87655028629303,FALSE,FALSE,TRUE
"wind_EMOS","temperature","72 hour",2021-12-08,NA,NA,NA,NA,NA,-0.2,NA,NA,NA,NA,NA,0.51106,0.87655028629303,FALSE,FALSE,TRUE
"DAX_benchmark","temperature","84 hour",2021-12-08,NA,NA,NA,NA,NA,-0.3,NA,NA,NA,NA,NA,1.35005315970741,1.9947205585,FALSE,FALSE,TRUE
"JabbaTheHutt","temperature","84 hour",2021-12-08,NA,NA,NA,NA,NA,-0.3,NA,NA,NA,NA,NA,1.35005315970741,1.9947205585,FALSE,FALSE,TRUE
"Joffrey_Baratheon","temperature","84 hour",2021-12-08,NA,NA,NA,NA,NA,-0.3,NA,NA,NA,NA,NA,1.35005315970741,1.9947205585,FALSE,FALSE,TRUE
"RossGeller","temperature","84 hour",2021-12-08,NA,NA,NA,NA,NA,-0.3,NA,NA,NA,NA,NA,1.35005315970741,1.9947205585,FALSE,FALSE,TRUE
"wind_benchmark","temperature","84 hour",2021-12-08,NA,NA,NA,NA,NA,-0.3,NA,NA,NA,NA,NA,1.35005315970741,1.9947205585,FALSE,FALSE,TRUE
"wind_EMOS","temperature","84 hour",2021-12-08,NA,NA,NA,NA,NA,-0.3,NA,NA,NA,NA,NA,1.35005315970741,1.9947205585,FALSE,FALSE,TRUE
