forecast_date,target,horizon,q0.025,q0.25,q0.5,q0.75,q0.975
2022-01-26,DAX,1 day,-3.58455654107691,-0.859847132523605,0.0956471938094342,0.994704094241004,3.41392974959803
2022-01-26,DAX,2 day,-4.75590548102381,-1.14302596488279,0.176575042041178,1.34863391182026,4.256680178358
2022-01-26,DAX,5 day,-5.63122837332822,-1.37019951189923,0.241353006329436,1.65853024493711,5.16774113367395
2022-01-26,DAX,6 day,-6.0216744491999,-1.56972997396142,0.0724253108432689,1.57042732806865,5.10412144839563
2022-01-26,DAX,7 day,-6.91150042517552,-1.6975502740618,0.24022975009485,1.94923067904025,5.66646120438147
2022-01-26,temperature,36 hour,2.42695806368833,3.93985117992554,4.73366786856962,5.5274845572137,7.04037767345091
2022-01-26,temperature,48 hour,2.88981228517876,4.25125409033484,4.96560410882032,5.6799541273058,7.04139593246188
2022-01-26,temperature,60 hour,2.95190757698414,4.65915572465281,5.55495071289809,6.45074570114337,8.15799384881204
2022-01-26,temperature,72 hour,-1.18022072638372,0.621030953860963,1.56614969944868,2.5112684450364,4.31252012528108
2022-01-26,temperature,84 hour,2.04211139166281,4.61529050495167,5.96544042702903,7.3155903491064,9.88876946239525
2022-01-26,wind,36 hour,18.142851971332,21.8882040590163,24.4926455075536,26.8570869560914,31.8384390437872
2022-01-26,wind,48 hour,19.6676126856377,26.3954248593771,30.0314120235408,32.8273991877352,37.3952113621468
2022-01-26,wind,60 hour,16.6377256951908,20.7467454673295,23.4916324485038,25.5165194299826,30.5975392087615
2022-01-26,wind,72 hour,6.80512375083236,11.3382444131489,14.2445284589398,16.9116692823614,22.783331936488
2022-01-26,wind,84 hour,16.31785078675,23.1330569256854,25.7919356731505,29.0508144212225,34.6180205733965
