"forecast_date","target","horizon","q0.025","q0.25","q0.5","q0.75","q0.975"
2022-01-12,"DAX","1 day",-1.55023995391206,-0.350253270135086,0.104220283859104,0.593773775154072,1.57278746819172
2022-01-12,"DAX","2 day",-2.42592421802554,-0.798426631187115,0.390632855914919,1.23084059927944,2.42653524971854
2022-01-12,"DAX","5 day",-3.14017066810444,-0.917033133552877,0.381480612533051,1.44171650741237,3.39933011275082
2022-01-12,"DAX","6 day",-3.5475720163186,-1.02141915409586,0.399527802272133,1.64016980436447,4.08380057515697
2022-01-12,"DAX","7 day",-3.96277332669917,-1.11703273514291,0.459727003454418,1.8764616703865,4.61237205945579
2022-01-12,"temperature","36 hour",2.95372389640815,5.05566143501352,5.73673195140589,6.49766339668815,8.29282564019807
2022-01-12,"temperature","48 hour",3.11397501305759,5.22998577912953,5.94366151421727,6.66153212528759,8.25044098476246
2022-01-12,"temperature","60 hour",2.91747935262239,5.39159891238574,6.16931636046102,7.02573860927551,9.01713613667055
2022-01-12,"temperature","72 hour",1.04684720918792,3.57683462063381,4.40281716654463,5.30322548599732,7.25818294446357
2022-01-12,"temperature","84 hour",1.29614397435862,3.85345299297857,4.87599605023734,6.04724311797435,8.40026148145192
2022-01-12,"wind","36 hour",10.5189487678744,18.6748241445789,23.0521898700719,25.9512194941232,30.8455320492671
2022-01-12,"wind","48 hour",12.3271236495076,20.0042990141221,23.5307076925758,26.5913597636431,33.6454987767897
2022-01-12,"wind","60 hour",9.68923721808767,19.2954971797304,24.2558483919394,28.0248642039338,34.2728419539683
2022-01-12,"wind","72 hour",5.31878301465543,10.1562995659496,12.5466637205867,15.2088437207166,21.0601597589392
2022-01-12,"wind","84 hour",4.74419260180165,9.20140496852511,12.0336573527471,14.863338081461,19.4213083592013
