"forecast_date","target","horizon","q0.025","q0.25","q0.5","q0.75","q0.975"
"2021-10-27","DAX","1 day",-2.65844263691718,-0.483787003227087,0.0693890771191086,0.656902293272221,2.22946787319034
"2021-10-27","DAX","2 day",-3.76658704113496,-0.754702332963619,0.137166393470345,0.9054642766952,3.10108794007109
"2021-10-27","DAX","5 day",-4.73040567059547,-0.849379110212389,0.14578755206589,1.18415337595774,3.89032640718187
"2021-10-27","DAX","6 day",-5.23203014061953,-0.968345906220103,0.197265375858358,1.37748695784952,4.57407374600166
"2021-10-27","DAX","7 day",-5.68685922947709,-1.09164649900868,0.346067477430712,1.4646373891495,5.19223708311003
