forecast_date,target,horizon,q0.025,q0.25,q0.5,q0.75,q0.975
2023-02-08,DAX,1 day,-2.00532839035822,-0.2253406102493431,0.05988764932748385,0.33303502896771797,1.7970800974662138
2023-02-08,DAX,2 day,-3.136614712662224,-0.35678339758946753,0.11036935832056886,0.6395318036111175,2.562980379734518
2023-02-08,DAX,5 day,-3.8709282100825577,-0.45963879226780124,0.17680485927659184,0.8133527617510301,3.654543500554942
2023-02-08,DAX,6 day,-4.022460882997526,-0.3977025358152055,0.2533077080749597,0.9320497651254545,3.647022557805478
2023-02-08,DAX,7 day,-4.79574497573493,-0.5374952338250272,0.269710681012675,1.2000220727784758,3.96371152485706
2023-02-08,energy,36 hour,,,,,
2023-02-08,energy,40 hour,,,,,
2023-02-08,energy,44 hour,,,,,
2023-02-08,energy,60 hour,,,,,
2023-02-08,energy,64 hour,,,,,
2023-02-08,energy,68 hour,,,,,
2023-02-08,wind,36 hour,3.4194,6.12,7.705,10.08,15.12
2023-02-08,wind,48 hour,2.3378,5.3601,7.4032,9.72,14.76
2023-02-08,wind,60 hour,3.24,6.84,9.36,11.835,17.28
2023-02-08,wind,72 hour,3.24,7.068,9.442,11.52,17.286
2023-02-08,wind,84 hour,5.1421,12.0495,14.4,17.01,23.04

