"","forecast_date","target","horizon","q0.025","q0.25","q0.5","q0.75","q0.975"
"1",2022-11-02,"DAX","1 day",-2.94399759274886,-0.544591606074585,0.0802984650697552,0.71753426395782,2.75598600917788
"2",2022-11-02,"DAX","2 day",-3.68897013605596,-0.843297706282753,0.0912147363063212,1.00656009383364,3.55920294012512
"8",2022-11-02,"DAX","5 day",-4,-0.894154527578861,0.170139639649136,1.2805891405407,4
"9",2022-11-02,"DAX","6 day",-4.41064455770643,-1.05564772832705,0.239987296754496,1.49878094653775,4.12052672605284
"14",2022-11-02,"DAX","7 day",-5.20032720666059,-1.12866422700009,0.394356897801185,1.60944599433259,4.6729441670701
"3",2022-11-02,"energy","36 hour",54.477225,65.016,67.026,71.15225,75.454325
"5",2022-11-02,"energy","40 hour",49.942375,59.5945,61.846,67.56975,74.193625
"6",2022-11-02,"energy","44 hour",50.563825,55.69075,58.856,65.443,74.193625
"10",2022-11-02,"energy","60 hour",52.1603,54.99825,56.717,65.443,74.193625
"12",2022-11-02,"energy","64 hour",48.1775,50.74125,56.717,65.443,71.166675
"13",2022-11-02,"energy","68 hour",46.39905,49.3735,56.717,65.443,72.27125
"4",2022-11-02,"wind","36 hour",1.44768763404701,3.40812609651221,5.48511384679326,7.4985,11.9608087267903
"7",2022-11-02,"wind","48 hour",1.41125,5.4,10.08,16.2,25.566
"11",2022-11-02,"wind","60 hour",6.65332007556094,11.3975,12.955,16.825,27.7783471438496
"15",2022-11-02,"wind","72 hour",2.16,5.6925,9.38815587366445,11.3225,14.0543
"16",2022-11-02,"wind","84 hour",2.86075,8.1777,12.3066,15.8063,20.881
