"","forecast_date","target","horizon","q0.025","q0.25","q0.5","q0.75","q0.975"
"1",2022-11-30,"DAX","1 day",-1.9690667002836,-0.524205252259247,0.0804995203516734,0.689312054374287,2.13941564772225
"2",2022-11-30,"DAX","2 day",-2.66822694711667,-0.803756704313059,0.132960006856742,1.02690078258507,2.89586172981263
"8",2022-11-30,"DAX","5 day",-2.78685063113451,-0.743701026664505,0.225613419226396,1.30216472555289,3.22775991451581
"9",2022-11-30,"DAX","6 day",-3.47818565085795,-0.676387954964409,0.284571705021952,1.53339061899578,4.02093309255258
"14",2022-11-30,"DAX","7 day",-3.78964664608942,-1.08526790900125,0.414260978758474,1.68104193479119,4.37408692718866
"3",2022-11-30,"energy","36 hour",54.5549825821966,67.4749898827426,69.5068948952762,72.3083122637942,75.9989583333334
"5",2022-11-30,"energy","40 hour",50.6301601789564,61.4658789374535,66.5223588957055,70.1443226293495,73.8191929812011
"6",2022-11-30,"energy","44 hour",52.0714912356235,59.6482790697675,63.0820862141987,65.9866118946597,68.8782553430796
"10",2022-11-30,"energy","60 hour",52.3712156862746,57.6979938435246,60.9625833867788,64.975257902652,69.1933935002089
"12",2022-11-30,"energy","64 hour",48.6462001935542,54.5585379911769,57.80089129,60.9692237763852,65.3659751797914
"13",2022-11-30,"energy","68 hour",49.2433725490197,53.1641395348838,55.8966564417178,58.6535575335175,62.6756538134813
"4",2022-11-30,"wind","36 hour",7.98653414936099,12.6267258966125,15.0617890076245,17.3440500678386,21.7399385160725
"7",2022-11-30,"wind","48 hour",4.49582193782844,9.50347689749666,12.2633987318227,14.9564711588471,20.2970163571616
"11",2022-11-30,"wind","60 hour",7.39082123191791,12.6553409005075,15.3522959576671,17.9397477153259,23.5674480978317
"15",2022-11-30,"wind","72 hour",5.42891776238057,10.1088018120467,12.6262604908938,15.2395593280352,20.4983757695517
"16",2022-11-30,"wind","84 hour",6.74168450202653,11.989298696026,14.5070423701467,17.8922583950041,25.1635228401902
