forecast_date,target,horizon,q0.025,q0.25,q0.5,q0.75,q0.975
2022-12-07,DAX,1 day,-2.6526046298020987,-0.7988891790049157,0.18747835976178,0.704422517600545,2.1761715001497146
2022-12-07,DAX,2 day,-2.3249528222040325,-0.969758039356922,0.5397036255982731,1.077783415833056,2.8359821237233995
2022-12-07,DAX,5 day,-1.0087695643863048,-0.4355421825653516,0.2394510985200544,1.2583061492132708,3.7565378966778
2022-12-07,DAX,6 day,-1.833906897351184,-0.1631847465603925,0.1847547116893758,0.8123715279430845,4.065528121267819
2022-12-07,DAX,7 day,-2.610552655232089,-0.0742499077778906,-0.0254164550133718,0.8496784828195638,3.946454541430625
2022-12-07,energy,36 hour,51.756014172384965,68.37534589417446,69.01284313861372,70.12385861250542,73.93404061082033
2022-12-07,energy,40 hour,55.88126712870537,62.75836749505093,64.54856358508556,66.08193627991524,71.09018971862679
2022-12-07,energy,44 hour,59.51126695509869,63.99992477117799,68.76219590368225,70.48140201864099,73.7608715369496
2022-12-07,energy,60 hour,54.06579177377768,65.08112930876604,67.02983038237744,69.83026828392205,72.95102612184276
2022-12-07,energy,64 hour,59.51126695509869,63.99992477117799,68.76219590368225,70.48140201864099,73.7608715369496
2022-12-07,energy,68 hour,59.51126695509869,63.99992477117799,68.76219590368225,70.48140201864099,73.7608715369496
2022-12-07,wind,36 hour,NA,NA,NA,NA,NA
2022-12-07,wind,48 hour,NA,NA,NA,NA,NA
2022-12-07,wind,60 hour,NA,NA,NA,NA,NA
2022-12-07,wind,72 hour,NA,NA,NA,NA,NA
2022-12-07,wind,84 hour,NA,NA,NA,NA,NA
