"model","target","horizon","forecast_date","q0.025","q0.25","q0.5","q0.75","q0.975","value","qscore_q0.025","qscore_q0.25","qscore_q0.5","qscore_q0.75","qscore_q0.975","mean_qscore","ae","interval_coverage_0.5","interval_coverage_0.95","scores_imputed"
"AmySantiago","DAX","1 day",2023-01-25,-2.15050894791984,-0.596737805583562,0.166991892061343,0.999380892148164,2.35325104129424,0.338976506272282,0.124474272709606,0.467857155927922,0.171984614210938,0.330202192937941,0.100713726751098,0.239046392507501,0.171984614210938,TRUE,TRUE,FALSE
"median_ensemble","DAX","1 day",2023-01-25,-2.16487079831376,-0.518451789913986,0.0837595610355904,0.687356981494817,1.99147897913699,0.338976506272282,0.125192365229302,0.428714148093134,0.255216945236691,0.174190237611268,0.0826251236432355,0.213187763962726,0.255216945236691,TRUE,TRUE,FALSE
"JakePeralta","DAX","1 day",2023-01-25,-1.49262821674347,-0.0797084122896194,0.36880299448967,1.0415370464325,2.15623235702515,0.338976506272282,0.0915802361507875,0.20934245928095,0.0298264882173882,0.351280270080107,0.0908627925376433,0.154578449253375,0.0298264882173882,TRUE,TRUE,FALSE
"MadelineWuntsch","DAX","1 day",2023-01-25,-2.88811451386561,-0.496873992744224,0.0813232009472308,0.689543041091985,2.56645508145833,0.338976506272282,0.161354551006894,0.417925249508253,0.257653305325051,0.175283267409852,0.111373928759303,0.224718060401871,0.257653305325051,TRUE,TRUE,FALSE
"DAX_benchmark","DAX","1 day",2023-01-25,-3.24347780251216,-0.524205252259247,0.105837122753716,0.731760753007071,2.75598601331828,0.338976506272282,0.179122715439222,0.431590879265764,0.233139383518566,0.196392123367395,0.1208504753523,0.232219115388649,0.233139383518566,TRUE,TRUE,FALSE
"OlennaTyrell","DAX","1 day",2023-01-25,-1.65433375900094,-0.512779079649749,0.08619592112395,0.685170921897649,1.82672560124884,0.338976506272282,0.0996655132636611,0.425877792961015,0.252780585148332,0.173097207812684,0.074387454748828,0.205161710786904,0.252780585148332,TRUE,TRUE,FALSE
"JonSnow","DAX","1 day",2023-01-25,-2.17923264870768,-0.513083193788699,0.220667410365606,0.730267598553639,1.75112137213435,0.338976506272282,0.125910457748998,0.42602985003049,0.118309095906676,0.195645546140679,0.0706072432931037,0.187300438623989,0.118309095906676,TRUE,TRUE,FALSE
"Yoda","DAX","1 day",2023-01-25,-1.68037437590179,-0.55726701241641,0,0.55726701241641,1.68037437590179,0.338976506272282,0.100967544108704,0.448121759344346,0.338976506272282,0.109145253072064,0.0670698934814754,0.212856191255774,0.338976506272282,TRUE,TRUE,FALSE
"mean_ensemble","DAX","1 day",2023-01-25,-2.16002475868474,-0.456565702009163,0.113674503043409,0.694087100917715,2.04871669521221,0.338976506272282,0.124950063247851,0.397771104140722,0.225302003228873,0.177555297322717,0.0854870094469965,0.202213095477432,0.225302003228873,TRUE,TRUE,FALSE
"GreyWorm","DAX","1 day",2023-01-26,-1.79400495575653,-0.684835374183356,-0.0215170163508454,0.664796695982256,1.72350924637938,0.338976506272282,0.10664907310144,0.511905940227819,0.360493522623127,0.162910094854987,0.0692266370053551,0.242237053562546,0.360493522623127,TRUE,TRUE,FALSE
"PetyrBaelish","DAX","1 day",2023-01-25,-2.28330685348662,-0.523820386039273,0.0765866109137647,0.659314004895456,2.1779717901926,0.338976506272282,0.131114167987945,0.431398446155777,0.262389895358517,0.160168749311587,0.0919497641960158,0.215404204601969,0.262389895358517,TRUE,TRUE,FALSE
"KhalDrogo","DAX","1 day",2023-01-25,-2.23426551295276,-0.0763465111374929,0.0518568941296588,0.181833042752021,1.49554007316918,0.338976506272282,0.128662100961252,0.207661508704887,0.287119612142623,0.23571519528039,0.0578281783448448,0.183397319086799,0.287119612142623,FALSE,TRUE,FALSE
"KhalDrogo","DAX","2 day",2023-01-25,-3.16318563444002,-0.247782997705646,0.162559295940063,0.702982289017408,3.00024983250768,0.452444352859338,0.180781499364968,0.350113675282492,0.289885056919275,0.125268968079035,0.127390273982417,0.214687894725637,0.289885056919275,TRUE,TRUE,FALSE
"AmySantiago","DAX","2 day",2023-01-25,-3.12809384908237,-0.927799650205091,0.0722066441593829,1.18185890726418,3.40555524483381,0.452444352859338,0.179026910097086,0.690122001532215,0.380237708699955,0.36470727720242,0.147655544598724,0.35234988842608,0.380237708699955,TRUE,TRUE,FALSE
"median_ensemble","DAX","2 day",2023-01-25,-2.33866860568514,-0.569097438493823,0.146610719054916,0.853817745233991,2.58473987810786,0.452444352859338,0.139555647927224,0.510770895676581,0.305833633804422,0.200686696187326,0.106614776262426,0.252692329971596,0.305833633804422,TRUE,TRUE,FALSE
"JakePeralta","DAX","2 day",2023-01-25,-1.39649057388306,-0.0151956863701343,0.622474431991577,1.35715794563293,2.95203447341919,0.452444352859338,0.0924467463371197,0.233820019614736,0.170030079132239,0.452356796386798,0.124979506027993,0.214726629499777,0.170030079132239,TRUE,TRUE,FALSE
"MadelineWuntsch","DAX","2 day",2023-01-25,-3.14137378355253,-0.666180683665213,0.0963801585536664,0.870024524173402,2.61864806790698,0.452444352859338,0.179690906820594,0.559312518262275,0.356064194305672,0.208790085657032,0.108310185752382,0.282433578159591,0.356064194305672,TRUE,TRUE,FALSE
"DAX_benchmark","DAX","2 day",2023-01-25,-4.13198489753049,-0.824249689649381,0.147856929493173,1.00155519448029,3.57049232679329,0.452444352859338,0.229221462519491,0.63834702125436,0.304587423366165,0.274555420810474,0.155902398696698,0.320522745329437,0.304587423366165,TRUE,TRUE,FALSE
"OlennaTyrell","DAX","2 day",2023-01-25,-1.84704771797548,-0.517327094675335,0.180378784663432,0.8780846640022,2.20780528730234,0.452444352859338,0.114974603541741,0.484885723767337,0.272065568195906,0.212820155571431,0.0877680467221502,0.234502819559713,0.272065568195906,TRUE,TRUE,FALSE
"JonSnow","DAX","2 day",2023-01-25,-2.18120744266799,-0.738204339369053,0.162266715765735,0.837610966294581,2.55083168830874,0.452444352859338,0.131682589776366,0.595324346114195,0.290177637093603,0.192583306717621,0.10491936677247,0.262937449294851,0.290177637093603,TRUE,TRUE,FALSE
"Yoda","DAX","2 day",2023-01-25,-1.67384330902468,-0.555101097380633,0,0.555101097380633,1.67384330902468,0.452444352859338,0.106314383094201,0.503772725119985,0.452444352859338,0.0513283722606473,0.061069947808267,0.234985956228488,0.452444352859338,TRUE,TRUE,FALSE
"mean_ensemble","DAX","2 day",2023-01-25,-2.48852824844942,-0.563003611600813,0.162526850035114,0.880994906995047,2.6190775072625,0.452444352859338,0.147048630065438,0.507723982230076,0.289917502824224,0.214275277067854,0.108331657720158,0.25345940998155,0.289917502824224,TRUE,TRUE,FALSE
"GreyWorm","DAX","2 day",2023-01-26,-1.7259255076353,-0.569391046999248,0.035781031167456,0.62852034208307,1.82883557146504,0.452444352859338,0.108918493024732,0.510917699929293,0.416663321691882,0.088037994611866,0.0688195609302851,0.238671414037612,0.416663321691882,TRUE,TRUE,FALSE
"PetyrBaelish","DAX","2 day",2023-01-25,-2.49612976870228,-0.568803829988397,0.145364508616658,0.797053139621776,2.38247927106328,0.452444352859338,0.147428706078081,0.510624091423868,0.30707984424268,0.172304393381219,0.0965017459101971,0.246787756207209,0.30707984424268,TRUE,TRUE,FALSE
"PetyrBaelish","DAX","5 day",2023-01-25,-3.17997595902877,-0.693809829027048,0.286425423466871,1.15442052407064,3.19984240761855,0.294232484041679,0.173710422153522,0.494021156534363,0.0078070605748074,0.430094020014482,0.145280496178844,0.250182631091204,0.0078070605748074,TRUE,TRUE,FALSE
"KhalDrogo","DAX","5 day",2023-01-25,-3.74091071250208,-0.341359987231263,0.225126861824492,0.898436032802109,3.51533043468925,0.294232484041679,0.201757159827188,0.317796235636471,0.0691056222171871,0.302101774380215,0.161054897532379,0.210363137918688,0.0691056222171871,TRUE,TRUE,FALSE
"AmySantiago","DAX","5 day",2023-01-25,-4.12826304295379,-1.3737809133686,-0.0795421378060701,1.28633745793099,3.95763094371333,0.294232484041679,0.221124776349774,0.834006698705141,0.373774621847749,0.496052486944658,0.183169922983583,0.421625701366181,0.373774621847749,TRUE,TRUE,FALSE
"median_ensemble","DAX","5 day",2023-01-25,-3.46044333576543,-0.646795370312962,0.199097757478294,1.16454307931033,3.35853463958919,0.294232484041679,0.187733790990355,0.47051392717732,0.0951347265633848,0.435155297634326,0.153215107777376,0.268350570028552,0.0951347265633848,TRUE,TRUE,FALSE
"JakePeralta","DAX","5 day",2023-01-25,-1.1885073184967,0.0621197968721389,0.980070471763611,2.13850879669189,3.99280905723572,0.294232484041679,0.0741369901269191,0.11605634358477,0.685837987721932,0.922138156325108,0.184928828659702,0.396619661283686,0.685837987721932,TRUE,TRUE,FALSE
"MadelineWuntsch","DAX","5 day",2023-01-25,-4.18047943356047,-0.799284599339658,0.204003207296097,1.17466563455001,3.72289316992398,0.294232484041679,0.223735595880107,0.546758541690669,0.0902292767455815,0.440216575254165,0.171433034294115,0.294474604772927,0.0902292767455815,TRUE,TRUE,FALSE
"DAX_benchmark","DAX","5 day",2023-01-25,-5.27475891574504,-0.87953514376391,0.19419230766049,1.28482259911507,4.62869696515187,0.294232484041679,0.278449569989336,0.586883813902794,0.100040176381189,0.495295057536693,0.21672322405551,0.335478368373104,0.100040176381189,TRUE,TRUE,FALSE
"OlennaTyrell","DAX","5 day",2023-01-25,-1.59310935640419,-0.457277749289952,0.269869625214485,0.997016999718921,2.13284860683316,0.294232484041679,0.0943670920222934,0.375755116665815,0.0243628588271938,0.351392257838621,0.0919308061395741,0.1875616262987,0.0243628588271938,TRUE,TRUE,FALSE
"JonSnow","DAX","5 day",2023-01-25,-3.87909553971685,-0.704859771086721,0.0396781152125582,1.23663007810706,3.20173884448912,0.294232484041679,0.208666401187926,0.4995461275642,0.254554368829121,0.471198797032689,0.145375318022372,0.315868202527262,0.254554368829121,TRUE,TRUE,FALSE
"Yoda","DAX","5 day",2023-01-25,-1.6586545887162,-0.550064021768128,0,0.550064021768128,1.6586545887162,0.294232484041679,0.0976443536378939,0.422148252904903,0.294232484041679,0.127915768863224,0.0682211052337261,0.202032392936285,0.294232484041679,TRUE,TRUE,FALSE
"mean_ensemble","DAX","5 day",2023-01-25,-3.06138939609933,-0.633763312960202,0.211948361320654,1.13098179604681,3.17449561517827,0.294232484041679,0.16778109400705,0.46399789850094,0.0822841227210248,0.418374656002566,0.14401315655683,0.255290185557682,0.0822841227210248,TRUE,TRUE,FALSE
"GreyWorm","DAX","5 day",2023-01-26,-1.7901390938692,-0.599780911598877,-0.000340261425993557,0.588915815713316,1.73451113341147,0.294232484041679,0.104218578895544,0.447006697820278,0.294572745467672,0.147341665835818,0.0720139324684898,0.21303072409756,0.294572745467672,TRUE,TRUE,FALSE
"GreyWorm","DAX","6 day",2023-01-26,-2.13346289242895,-0.693521570374471,-0.0293648314735228,0.633506209858606,2.0677921994541,0.308706125234615,0.122108450883178,0.501113847804543,0.338070956708137,0.162400042311996,0.0879543037109742,0.242329520283766,0.338070956708137,TRUE,TRUE,FALSE
"PetyrBaelish","DAX","6 day",2023-01-25,-3.65392873558799,-0.743066890560357,0.392478988075453,1.44037283534263,3.76891712960349,0.308706125234615,0.19813174304113,0.525886507897486,0.0837728628408383,0.565833355054008,0.173010550218444,0.309327003810381,0.0837728628408383,TRUE,TRUE,FALSE
"KhalDrogo","DAX","6 day",2023-01-25,-3.86625636813356,-0.219623003867025,0.282443940041872,0.885003599753778,4.26421720425813,0.308706125234615,0.208748124668409,0.26416456455082,0.0262621851927426,0.288148737259582,0.197775553951176,0.197019833124546,0.0262621851927426,TRUE,TRUE,FALSE
"AmySantiago","DAX","6 day",2023-01-25,-4.87888368850339,-1.57858631206284,-0.119346689447818,1.49370836021304,4.96738186992614,0.308706125234615,0.2593794906869,0.943646218648728,0.428052814682432,0.592501117489211,0.232933787234577,0.491302685748369,0.428052814682432,TRUE,TRUE,FALSE
"median_ensemble","DAX","6 day",2023-01-25,-3.66227569789274,-0.718294230467414,0.286299565617197,1.42415839300659,3.92383538193857,0.308706125234615,0.198549091156368,0.513500177851014,0.0224065596174176,0.557726133885988,0.180756462835198,0.294587685069197,0.0224065596174176,TRUE,TRUE,FALSE
"JakePeralta","DAX","6 day",2023-01-25,-1.15918660163879,-0.0311145614832639,1.35697185993195,2.95645761489868,4.21923303604126,0.308706125234615,0.0733946363436704,0.169910343358939,1.04826573469733,1.32387574483203,0.195526345540332,0.562194560954461,1.04826573469733,TRUE,TRUE,FALSE
"MadelineWuntsch","DAX","6 day",2023-01-25,-4.67883716326272,-0.840178763994746,0.290155191192522,1.40794395067054,4.00856883856325,0.308706125234615,0.249377164424867,0.57444244461468,0.0185509340420923,0.549618912717965,0.184993135666432,0.315396518293207,0.0185509340420923,TRUE,TRUE,FALSE
"DAX_benchmark","DAX","6 day",2023-01-25,-6.28262880068359,-1.00746347507736,0.258226051214727,1.54339208948922,5.3673964152176,0.308706125234615,0.32956674629591,0.658084800155989,0.0504800740198874,0.6173429821273,0.252934514499149,0.381681823419647,0.0504800740198874,TRUE,TRUE,FALSE
"OlennaTyrell","DAX","6 day",2023-01-25,-1.4667274273605,-0.52514291247928,0.336198295135864,1.19753950275101,2.13912401763223,0.308706125234615,0.0887716776297557,0.416924518856947,0.0274921699012494,0.444416688758198,0.0915208946198809,0.213825189953206,0.0274921699012494,TRUE,TRUE,FALSE
"JonSnow","DAX","6 day",2023-01-25,-3.67062266019749,-0.947798981733253,0.393591169278079,1.56450607383625,3.83910192531389,0.308706125234615,0.198966439271605,0.628252553483934,0.0848850440434644,0.62789997430082,0.176519790003964,0.343304760220757,0.0848850440434644,TRUE,TRUE,FALSE
"Yoda","DAX","6 day",2023-01-25,-1.85712018190791,-0.615881692979663,0,0.615881692979663,1.85712018190791,0.308706125234615,0.108291315357126,0.462293909107139,0.308706125234615,0.153587783872524,0.0774207028336647,0.222059967281014,0.308706125234615,TRUE,TRUE,FALSE
"mean_ensemble","DAX","6 day",2023-01-25,-3.36476545197049,-0.720237816461226,0.316135397394912,1.37383119297934,3.6498852817918,0.308706125234615,0.183673578860255,0.51447197084792,0.00742927216029737,0.532562533872363,0.167058957827859,0.281039262713739,0.00742927216029737,TRUE,TRUE,FALSE
"mean_ensemble","DAX","7 day",2023-01-25,-3.66271641303224,-0.762544461733322,0.36752610371932,1.63511384873794,4.10695120148043,0.654944790407619,0.215883060171993,0.70874462607047,0.287418686688299,0.490084529165161,0.172600320553641,0.374946244529913,0.287418686688299,TRUE,TRUE,FALSE
"GreyWorm","DAX","7 day",2023-01-26,-1.75823909422969,-0.609115330190337,0.0303611890072492,0.669697737587009,1.84428623999656,0.654944790407619,0.120659194231865,0.632030060298978,0.62458360140037,0.00737647358969518,0.0594670724794473,0.288823280400071,0.62458360140037,TRUE,TRUE,FALSE
"PetyrBaelish","DAX","7 day",2023-01-25,-3.92075097829805,-0.812030734199003,0.519682028788432,1.76176636805652,4.15059898301404,0.654944790407619,0.228784788435283,0.733487762303311,0.135262761619187,0.553410788824452,0.174782709630321,0.365145762162511,0.135262761619187,TRUE,TRUE,FALSE
"KhalDrogo","DAX","7 day",2023-01-25,-5.0177919174415,-0.339073321830472,0.372774827582309,1.21055298998088,4.51702810753124,0.654944790407619,0.283636835392456,0.497009056119045,0.28216996282531,0.277804099786631,0.193104165856181,0.306744823995925,0.28216996282531,TRUE,TRUE,FALSE
"AmySantiago","DAX","7 day",2023-01-25,-5.3128508977543,-1.80577452497969,0.0758083665020604,1.8631731757011,5.31725024301477,0.654944790407619,0.298389784408096,1.23035965769366,0.579136423905559,0.60411419264674,0.233115272630358,0.589023066256882,0.579136423905559,TRUE,TRUE,FALSE
"median_ensemble","DAX","7 day",2023-01-25,-4.20458321656589,-0.705574559682528,0.382478756766468,1.66003331675384,4.59328041446054,0.654944790407619,0.242976400348675,0.680259675045073,0.272466033641151,0.502544263173111,0.196916781202646,0.379032630682131,0.272466033641151,TRUE,TRUE,FALSE
"JakePeralta","DAX","7 day",2023-01-25,-0.771716177463531,-0.0463276877999305,1.4384434223175,3.40164661407471,5.0150351524353,0.654944790407619,0.0713330483935575,0.350636239103775,0.783498631909886,1.37335091183354,0.218004518101384,0.559364669868429,0.783498631909886,TRUE,TRUE,FALSE
"MadelineWuntsch","DAX","7 day",2023-01-25,-5.00587869489221,-0.798148206424296,0.455309341901277,1.63902469868233,4.66953272138985,0.654944790407619,0.283041174264991,0.726546498415957,0.199635448506342,0.492039954137357,0.200729396549112,0.380398494374752,0.199635448506342,TRUE,TRUE,FALSE
"DAX_benchmark","DAX","7 day",2023-01-25,-6.73574196413719,-1.06446218795013,0.392182685950626,1.68104193482534,6.25993408587484,0.654944790407619,0.369534337727241,0.859703489178876,0.262762104456993,0.513048572208863,0.280249464773361,0.457059593669067,0.262762104456993,TRUE,TRUE,FALSE
"OlennaTyrell","DAX","7 day",2023-01-25,-1.76734542917389,-0.582953347318595,0.432024314009411,1.44700197533742,2.63139405719271,0.654944790407619,0.121114510979075,0.618949068863107,0.222920476398208,0.396028592464901,0.0988224633392546,0.291567022408909,0.222920476398208,TRUE,TRUE,FALSE
"JonSnow","DAX","7 day",2023-01-25,-4.48841545483373,-0.954558363699998,-0.0413251388656719,2.06423208019336,4.81601890225668,0.654944790407619,0.257168012262067,0.804751577053808,0.696269929273291,0.70464364489287,0.208053705592453,0.534177373814898,0.696269929273291,TRUE,TRUE,FALSE
"Yoda","DAX","7 day",2023-01-25,-1.84843352209829,-0.613000912940761,0,0.613000912940761,1.84843352209829,0.654944790407619,0.125168915625296,0.63397285167419,0.654944790407619,0.0629158162002867,0.0596744365845338,0.307335362098385,0.654944790407619,FALSE,TRUE,FALSE
"W-EMOS","wind","36 hour",2023-01-25,2.37472950824185,6.8304720694452,9.29392281632126,11.7713143888533,16.5045151685929,7.92,0.277263524587908,0.5447639652774,1.37392281632126,1.92565719442665,0.429225758429645,0.910166651808572,1.37392281632126,TRUE,TRUE,FALSE
"mean_ensemble","wind","36 hour",2023-01-25,2.77506450454052,6.09086029539722,8.1941312360353,10.5317534973311,14.922129940679,7.92,0.257246774772974,0.91456985230139,0.2741312360353,1.30587674866555,0.35010649703395,0.620386221761833,0.2741312360353,TRUE,TRUE,FALSE
"median_ensemble","wind","36 hour",2023-01-25,3.33245148303869,6.8304720694452,9.29392281632126,11.7713143888533,16.5045151685929,7.92,0.229377425848065,0.5447639652774,1.37392281632126,1.92565719442665,0.429225758429645,0.900589432060604,1.37392281632126,TRUE,TRUE,FALSE
"KhalDrogo","wind","36 hour",2023-01-25,4.3182,7.92,10.0179,12.024,17.055,7.92,0.18009,0,2.0979,2.052,0.45675,0.957348,2.0979,TRUE,TRUE,FALSE
"W-ENS","wind","36 hour",2023-01-25,3.54225,5.7125,7.025,8.0175,9.65625,7.92,0.2188875,1.10375,0.895,0.0487500000000001,0.0868125000000001,0.47064,0.895,TRUE,TRUE,FALSE
"PhoebeBuffay","wind","36 hour",2023-01-25,0.30769153142206,2.69965363900418,5.1270644232893,7.99638425591574,13.9767479254151,7.92,0.380615423428897,2.61017318049791,2.7929355767107,0.0381921279578701,0.302837396270755,1.22495074097323,2.7929355767107,TRUE,TRUE,FALSE
"MadelineWuntsch","wind","36 hour",2023-01-25,3.33245148303869,7.29167576853671,9.50676894056594,12.8495688418863,17.4181366093872,7.92,0.229377425848065,0.314162115731644,1.58676894056594,2.46478442094313,0.474906830469363,1.01399994671163,1.58676894056594,TRUE,TRUE,FALSE
"mean_ensemble","wind","48 hour",2023-01-25,1.07720579858231,2.63498058299558,3.91170272596093,5.79960865993462,9.94330929398461,4.32,0.162139710070885,0.84250970850221,0.40829727403907,0.73980432996731,0.281165464699231,0.486783297455741,0.40829727403907,TRUE,TRUE,FALSE
"W-EMOS","wind","48 hour",2023-01-25,0.41725542961946,2.97951705593656,5.11706398204824,7.45497639371835,12.1083309825556,4.32,0.195137228519027,0.67024147203172,0.79706398204824,1.56748819685917,0.38941654912778,0.723869485717188,0.79706398204824,TRUE,TRUE,FALSE
"W-ENS","wind","48 hour",2023-01-25,0.648,1.605,2.485,4.075,6.74375,4.32,0.1836,1.3575,1.835,0.3675,0.1211875,0.7729575,1.835,FALSE,TRUE,FALSE
"median_ensemble","wind","48 hour",2023-01-25,0.648,2.97951705593656,4.16504096988883,6.39378594828431,12.1083309825556,4.32,0.1836,0.67024147203172,0.15495903011117,1.03689297414215,0.38941654912778,0.487022005082565,0.15495903011117,TRUE,TRUE,FALSE
"KhalDrogo","wind","48 hour",2023-01-25,2.16,3.78,5.4,7.56,12.4245,4.32,0.108,0.27,1.08,1.62,0.405225,0.696645,1.08,TRUE,TRUE,FALSE
"MadelineWuntsch","wind","48 hour",2023-01-25,1.97459491137966,3.43665013133787,4.16504096988883,6.39378594828431,12.6800379824626,4.32,0.117270254431017,0.441674934331063,0.154959030111173,1.03689297414216,0.418001899123132,0.433759818427708,0.154959030111173,TRUE,TRUE,FALSE
"PhoebeBuffay","wind","48 hour",2023-01-25,0.186178651912416,1.37373572770347,2.39140867786758,3.51428095767042,5.75992750490482,4.32,0.206691067404379,1.47313213614826,1.92859132213242,1.20857856349437,0.0719963752452409,0.977797892884934,1.92859132213242,FALSE,TRUE,FALSE
"mean_ensemble","wind","60 hour",2023-01-25,4.83206512797315,10.6768624534183,13.8982150534027,17.5353763375932,24.6793569017933,16.56,0.586396743601342,2.94156877329085,2.6617849465973,0.4876881687966,0.405967845089665,1.41668129547515,2.6617849465973,TRUE,TRUE,FALSE
"W-EMOS","wind","60 hour",2023-01-25,5.7704284174922,11.7590675122303,14.9234145696415,18.0900014423341,24.126889086025,16.56,0.53947857912539,2.40046624388485,1.6365854303585,0.76500072116705,0.37834445430125,1.14397508576741,1.6365854303585,TRUE,TRUE,FALSE
"W-ENS","wind","60 hour",2023-01-25,7.3835,10.9425,12.3,13.56,16.4185,16.56,0.458825,2.80875,4.26,4.5,0.275924999999994,2.4607,4.26,FALSE,FALSE,FALSE
"median_ensemble","wind","60 hour",2023-01-25,5.76,11.3329896608246,14.8515674969974,18.0900014423341,24.126889086025,16.56,0.54,2.6135051695877,1.7084325030026,0.76500072116705,0.37834445430125,1.20105656961172,1.7084325030026,TRUE,TRUE,FALSE
"KhalDrogo","wind","60 hour",2023-01-25,5.76,13.3691,15.48,18,23.4,16.56,0.54,1.59545,1.08,0.720000000000001,0.342,0.85549,1.08,TRUE,TRUE,FALSE
"MadelineWuntsch","wind","60 hour",2023-01-25,4.61410064124518,11.3329896608246,14.8515674969974,18.6876155608685,24.1305455358375,16.56,0.597294967937741,2.61350516958768,1.70843250300259,1.06380778043427,0.378527276791875,1.27231353955083,1.70843250300259,TRUE,TRUE,FALSE
"PhoebeBuffay","wind","60 hour",2023-01-25,0.632296581128362,5.98065509403635,11.9360932003745,19.3392646847633,35.3208498871039,16.56,0.796385170943582,5.28967245298183,4.62390679962554,1.38963234238167,0.938042494355198,2.60752785205756,4.62390679962554,TRUE,TRUE,FALSE
"mean_ensemble","wind","72 hour",2023-01-25,3.2151489468189,8.0576456366335,11.1646873218758,13.9536894777469,18.8765343991819,11.16,0.397242552659055,1.55117718168325,0.00468732187579946,1.39684473887345,0.385826719959095,0.74715570301013,0.00468732187579946,TRUE,TRUE,FALSE
"W-EMOS","wind","72 hour",2023-01-25,4.11665683071588,9.01865574780785,11.6230670991439,14.2307911523927,19.2034645921366,11.16,0.352167158464206,1.07067212609607,0.463067099143899,1.53539557619635,0.40217322960683,0.764695037901472,0.463067099143899,TRUE,TRUE,FALSE
"W-ENS","wind","72 hour",2023-01-25,5.02675,7.8075,9.06,10.78,12.79675,11.16,0.3066625,1.67625,2.1,0.570000000000001,0.0818375,0.94695,2.1,FALSE,TRUE,FALSE
"median_ensemble","wind","72 hour",2023-01-25,3.6,9.01865574780785,11.6230670991439,14.2307911523927,20.0497926019513,11.16,0.378,1.07067212609607,0.463067099143899,1.53539557619635,0.444489630097565,0.778324886306778,0.463067099143899,TRUE,TRUE,FALSE
"KhalDrogo","wind","72 hour",2023-01-25,3.6,9.8898,12.4375,14.76,20.88,11.16,0.378,0.6351,1.2775,1.8,0.486,0.91532,1.2775,TRUE,TRUE,FALSE
"MadelineWuntsch","wind","72 hour",2023-01-25,2.91044355902805,9.70941050254529,15.1661675514163,18.0028648928874,20.0497926019513,11.16,0.412477822048598,0.725294748727353,4.00616755141633,3.42143244644371,0.444489630097565,1.80197243974671,4.00616755141633,TRUE,TRUE,FALSE
"PhoebeBuffay","wind","72 hour",2023-01-25,0.421894344350591,3.86286193281437,7.53670195881889,11.9947913434544,21.4526648018218,11.16,0.536905282782471,3.64856903359281,3.62329804118111,0.417395671727224,0.51463324009109,1.74816025387494,3.62329804118111,TRUE,TRUE,FALSE
"mean_ensemble","wind","84 hour",2023-01-25,4.54108934725397,9.4129230087843,12.4221618017567,15.8486706684105,22.1666960503836,16.56,0.600945532637302,3.57353849560785,4.1378381982433,1.06699399738425,0.28033480251918,1.93193020527838,4.1378381982433,FALSE,TRUE,FALSE
"W-EMOS","wind","84 hour",2023-01-25,4.5212831594107,10.1064081021835,13.0793478296649,16.0566509678801,21.7345593188715,16.56,0.601935842029465,3.22679594890825,3.4806521703351,0.75502354817985,0.258727965943575,1.66462709507925,3.4806521703351,FALSE,TRUE,FALSE
"W-ENS","wind","84 hour",2023-01-25,5.46225,9.2625,10.37,11.91,14.36975,16.56,0.5548875,3.64875,6.19,6.975,4.2709875,4.327925,6.19,FALSE,FALSE,FALSE
"median_ensemble","wind","84 hour",2023-01-25,4.5212831594107,10.025061192785,13.0793478296649,16.0566509678801,22.9679481517988,16.56,0.601935842029465,3.2674694036075,3.4806521703351,0.75502354817985,0.32039740758994,1.68509567434837,3.4806521703351,FALSE,TRUE,FALSE
"KhalDrogo","wind","84 hour",2023-01-25,7.9128,12.808,14.6137,17.1165,23.769,16.56,0.43236,1.876,1.9463,0.27825,0.36045,0.978672,1.9463,TRUE,TRUE,FALSE
"MadelineWuntsch","wind","84 hour",2023-01-25,4.2882775049072,10.025061192785,14.4329657447373,18.6977424039331,22.9679481517988,16.56,0.61358612475464,3.2674694036075,2.12703425526269,1.06887120196653,0.32039740758994,1.47947167863626,2.12703425526269,TRUE,TRUE,FALSE
"PhoebeBuffay","wind","84 hour",2023-01-25,0.520836071951934,4.862645748953,9.6147954343811,15.4624599702392,27.9922227812476,16.56,0.801958196402403,5.8486771255235,6.9452045656189,1.64631004464124,0.571611139062379,3.16275221424968,6.9452045656189,FALSE,TRUE,FALSE
"AmySantiago","energy","36 hour",2023-01-25,66.20515904,68.48395147,69.67963638,70.87532129,73.15411373,69.40425,0.159954548,0.460149265000005,0.27538638,0.735535644999999,0.1874931865,0.363703804900001,0.27538638,TRUE,TRUE,FALSE
"power_benchmark","energy","36 hour",2023-01-25,56.55761875,64.75275,66.7695,70.342375,75.454325,69.40425,0.6423315625,2.32575,2.63475000000001,0.4690625,0.30250375,1.2748795625,2.63475000000001,TRUE,TRUE,FALSE
"PetyrBaelish","energy","36 hour",2023-01-25,54.3969143877557,65.1290378977348,67.1592662820846,68.7113454013911,71.6375161348854,69.40425,0.750366780612216,2.1376060511326,2.24498371791542,1.03935689791334,0.111663306744271,1.25679535086357,2.24498371791542,FALSE,TRUE,FALSE
"median_ensemble","energy","36 hour",2023-01-25,59.7208158136612,65.1833169883808,67.1592662820846,70.7749657420652,75.454325,69.40425,0.48417170931694,2.1104665058096,2.2449837179154,0.6853578710326,0.30250375,1.16549671081491,2.2449837179154,TRUE,TRUE,FALSE
"JonSnow","energy","36 hour",2023-01-25,59.7208158136612,65.2671973865297,68.2195253383523,70.7749657420652,76.3034242892779,69.40425,0.484171709316939,2.06852630673515,1.18472466164769,0.685357871032622,0.344958714463896,0.95354785263926,1.18472466164769,TRUE,TRUE,FALSE
"mean_ensemble","energy","36 hour",2023-01-25,60.1049180664387,65.2794713681373,67.5981840200057,70.1211480401062,74.4769457857103,69.40425,0.464966596678065,2.06238931593136,1.8060659799943,0.358449020053101,0.253634789285515,0.989101140388468,1.8060659799943,TRUE,TRUE,FALSE
"Yoda","energy","36 hour",2023-01-25,55.9319110019673,60.7631744457154,65.8570050297691,70.9508356138228,75.7820990575709,69.40425,0.673616949901635,4.32053777714228,3.54724497023088,0.773292806911407,0.318892452878547,1.92671699141295,3.54724497023088,TRUE,TRUE,FALSE
"PhoebeBuffay","energy","36 hour",2023-01-25,61.992694084774,65.1833169883808,66.8574403490267,68.5315637096726,71.7221866132794,69.40425,0.370577795761301,2.1104665058096,2.54680965097329,1.30902943549107,0.115896830663972,1.29055604373985,2.54680965097329,FALSE,TRUE,FALSE
"OlennaTyrell","energy","36 hour",2023-01-25,63.12075,67.8802666666667,70.067,72.1100826446281,75.7656346153847,69.40425,0.314175,0.761991666666653,0.662749999999988,1.35291632231404,0.318069230769235,0.681980443949984,0.662749999999988,TRUE,TRUE,FALSE
"JakePeralta","energy","36 hour",2023-01-25,63.967081840974,64.8449667216667,65.2498339211673,66.7538244781011,71.6953353078571,69.40425,0.271858407951299,2.27964163916666,4.15441607883268,3.97563828284837,0.114554265392857,2.15922173483837,4.15441607883268,FALSE,TRUE,FALSE
"JonSnow","energy","40 hour",2023-01-25,56.1129001328461,62.2631902123533,65.2923032857942,67.9284362704005,74.1336408241745,64.62875,0.425792493357694,1.18277989382335,0.663553285794194,1.64984313520025,0.475244541208728,0.879442669876843,0.663553285794194,TRUE,TRUE,FALSE
"JakePeralta","energy","40 hour",2023-01-25,58.3955962192289,63.886466806709,64.2881074190319,66.3338116312395,68.0409102792544,64.62875,0.311657689038555,0.371141596645522,0.340642580968137,0.85253081561973,0.170608013962721,0.409316139246933,0.340642580968137,TRUE,TRUE,FALSE
"AmySantiago","energy","40 hour",2023-01-25,60.38921964,63.26590632,64.775307,66.28470768,69.16139436,64.62875,0.211976518,0.681421839999999,0.146557000000001,0.82797884,0.226632218,0.4189132832,0.146557000000001,TRUE,TRUE,FALSE
"power_benchmark","energy","40 hour",2023-01-25,54.5806125,59.39675,61.613875,65.417,72.031775,64.62875,0.502406875,2.616,3.014875,0.394125000000003,0.37015125,1.379511625,3.014875,TRUE,TRUE,FALSE
"PetyrBaelish","energy","40 hour",2023-01-25,52.3415709661072,62.2187564511325,64.3645313521069,65.7269618872806,69.8618225843121,64.62875,0.614358951694638,1.20499677443375,0.264218647893102,0.549105943640313,0.261653629215605,0.578866789375482,0.264218647893102,TRUE,TRUE,FALSE
"median_ensemble","energy","40 hour",2023-01-25,56.1129001328461,62.2187564511325,64.2881074190319,66.3338116312395,71.2734957618146,64.62875,0.425792493357695,1.20499677443375,0.340642580968094,0.852530815619751,0.332237288090731,0.631239990494004,0.340642580968094,TRUE,TRUE,FALSE
"OlennaTyrell","energy","40 hour",2023-01-25,59.3240357142857,64.0498666666667,66.31,68.6248181818182,72.9199230769231,64.62875,0.265235714285715,0.289441666666647,1.68125000000001,1.9980340909091,0.414558653846155,0.929704025141525,1.68125000000001,TRUE,TRUE,FALSE
"mean_ensemble","energy","40 hour",2023-01-25,56.3197236619882,61.633126093555,63.9980358805948,66.6244220936898,71.0949220379645,64.62875,0.41545131690059,1.4978119532225,0.630714119405198,0.997836046844903,0.323308601898225,0.773024407654283,0.630714119405198,TRUE,TRUE,FALSE
"Yoda","energy","40 hour",2023-01-25,52.5442024030772,57.1026554554027,61.9088490824459,66.7150427094891,71.2734957618146,64.62875,0.604227379846142,3.76304727229863,2.7199009175541,1.04314635474454,0.332237288090732,1.69251184250683,2.7199009175541,TRUE,TRUE,FALSE
"PhoebeBuffay","energy","40 hour",2023-01-25,58.6781438287439,61.9936429641623,63.7332890215295,65.4729350788968,68.7884342143152,64.62875,0.297530308562807,1.31755351791886,0.89546097847046,0.4220925394484,0.20798421071576,0.628124311023257,0.89546097847046,TRUE,TRUE,FALSE
"JonSnow","energy","44 hour",2023-01-25,54.0435716158113,60.2510096775854,63.0224786842567,64.935272341896,72.0487465496515,60.739,0.334771419209436,0.243995161207291,2.28347868425674,2.098136170948,0.565487327482576,1.10517375262081,2.28347868425674,TRUE,TRUE,FALSE
"JakePeralta","energy","44 hour",2023-01-25,54.0316003474477,54.2679011117927,55.0027737761234,55.6729208498912,67.3417907401632,60.739,0.335369982627613,3.23554944410367,5.73622622387663,7.59911872516324,0.33013953700816,3.44728078255586,5.73622622387663,FALSE,TRUE,FALSE
"AmySantiago","energy","44 hour",2023-01-25,58.3984755,61.48176617,63.09957218,64.7173782,67.80066887,60.739,0.117026225,1.114149255,2.36057218000001,1.9891891,0.3530834435,1.1868040407,2.36057218000001,FALSE,TRUE,FALSE
"power_benchmark","energy","44 hour",2023-01-25,51.8143,55.463875,58.419,63.4035,67.442775,60.739,0.446235,2.6375625,2.32,1.33225,0.335188750000001,1.41424725,2.32,TRUE,TRUE,FALSE
"PetyrBaelish","energy","44 hour",2023-01-25,50.8523015382181,58.4172677411346,60.7079131039488,61.5584361332596,64.562137101127,60.739,0.494334923089097,1.16086612943272,0.0310868960511499,0.409718066629818,0.191156855056351,0.457432574051827,0.0310868960511499,TRUE,TRUE,FALSE
"median_ensemble","energy","44 hour",2023-01-25,54.0435716158113,58.4172677411346,60.7079131039488,63.4035,67.80066887,60.739,0.334771419209435,1.1608661294327,0.0310868960511996,1.33225,0.3530834435,0.642411577638667,0.0310868960511996,TRUE,TRUE,FALSE
"PhoebeBuffay","energy","44 hour",2023-01-25,55.1552050099733,58.578097398439,60.3740928142651,62.1700882300911,65.5929806185568,60.739,0.279189749501333,1.08045130078049,0.364907185734921,0.715544115045567,0.242699030927841,0.53655827639803,0.364907185734921,TRUE,TRUE,FALSE
"OlennaTyrell","energy","44 hour",2023-01-25,55.1365714285715,59.4576,62.098,64.8192314049587,68.6063076923076,60.739,0.280121428571425,0.640699999999999,1.359,2.04011570247935,0.39336538461538,0.942660503133231,1.359,TRUE,TRUE,FALSE
"mean_ensemble","energy","44 hour",2023-01-25,53.9585276246721,58.196177813655,60.6180018012235,63.0223558216675,68.0112742223183,60.739,0.339023618766395,1.2714110931725,0.120998198776498,1.14167791083375,0.363613711115916,0.647344906533012,0.120998198776498,TRUE,TRUE,FALSE
"Yoda","energy","44 hour",2023-01-25,54.3618091884333,58.3645705275445,62.5848719802043,66.8051734328641,70.8079347719754,60.739,0.318859540578337,1.18721473622776,1.84587198020431,3.03308671643206,0.503446738598768,1.37769594240825,1.84587198020431,TRUE,TRUE,FALSE
"GreyWorm","energy","36 hour",2023-01-26,59.0513176788158,65.2105807365411,68.5244488796516,72.0400184812748,78.7778773231372,58.33625,1.39438197369079,10.3114961048116,10.1881988796516,6.85188424063738,1.02208136615686,5.95360851298965,10.1881988796516,FALSE,FALSE,FALSE
"JonSnow","energy","60 hour",2023-01-25,48.9381951121675,56.8539728723661,60.0389065764874,63.2101827572821,70.7215942480525,58.33625,0.469902744391626,0.741138563816932,1.70265657648744,2.43696637864104,0.619267212402626,1.19398629514793,1.70265657648744,TRUE,TRUE,FALSE
"mean_ensemble","energy","60 hour",2023-01-25,53.4040462387114,57.2722301757426,59.3151603422969,61.6465185138028,65.6350186637994,58.33625,0.24661018806443,0.5320099121287,0.978910342296899,1.6551342569014,0.36493843318997,0.75552062651628,0.978910342296899,TRUE,TRUE,FALSE
"JakePeralta","energy","60 hour",2023-01-25,58.7313072687005,59.0808001742095,59.7303727681429,60.8518495288902,63.9136504071238,58.33625,0.770361673965985,1.11682526131433,1.39412276814287,1.25779976444512,0.278870020356192,0.963595897644899,1.39412276814287,FALSE,FALSE,FALSE
"AmySantiago","energy","60 hour",2023-01-25,56.58203105,59.75269981,61.41635321,63.08000661,66.25067537,58.33625,0.0877109475000001,2.124674715,3.08010321,2.371878305,0.3957212685,1.6120176892,3.08010321,FALSE,TRUE,FALSE
"power_benchmark","energy","60 hour",2023-01-25,52.08323125,54.797,56.2635,59.277375,63.945375,58.33625,0.3126509375,1.769625,2.07275,0.4705625,0.28045625,0.981208937499999,2.07275,TRUE,TRUE,FALSE
"PetyrBaelish","energy","60 hour",2023-01-25,50.2758946869342,56.3555967649092,58.1932584675837,60.8642664530138,64.3055322428822,58.33625,0.403017765653292,0.99032661754541,0.142991532416339,1.26400822650691,0.29846411214411,0.619761650853213,0.142991532416339,TRUE,TRUE,FALSE
"median_ensemble","energy","60 hour",2023-01-25,53.4894561943536,56.8539728723661,59.6977696002507,61.3657844099044,64.8815708071,58.33625,0.24233969028232,0.74113856381695,1.3615196002507,1.5147672049522,0.327266040355001,0.837406219931434,1.3615196002507,TRUE,TRUE,FALSE
"PhoebeBuffay","energy","60 hour",2023-01-25,54.1605240031462,57.6763104003418,59.5210474051231,61.3657844099044,64.8815708071,58.33625,0.208786299842688,0.329969799829083,1.18479740512314,1.51476720495222,0.327266040355003,0.713117350020428,1.18479740512314,TRUE,TRUE,FALSE
"OlennaTyrell","energy","60 hour",2023-01-25,52.3512857142857,55.9758000000001,58.1290000000001,60.1768429752067,63.5669807692308,58.33625,0.299248214285715,1.18022499999995,0.207249999999902,0.920296487603348,0.26153653846154,0.573711248070091,0.207249999999902,TRUE,TRUE,FALSE
"Yoda","energy","60 hour",2023-01-25,53.4894561943536,56.511492813979,59.6977696002507,62.8840463865225,65.9060830061478,58.33625,0.24233969028232,0.912378593010516,1.36151960025072,2.27389819326123,0.378491650307392,1.03372554542244,1.36151960025072,TRUE,TRUE,FALSE
"JonSnow","energy","64 hour",2023-01-25,46.3212918307315,54.3898428891185,57.1432501346243,60.6660278327513,68.8498848668496,54.91475,0.429672908463424,0.262453555440747,2.22850013462434,2.87563891637567,0.696756743342483,1.29860445164933,2.22850013462434,TRUE,TRUE,FALSE
"GreyWorm","energy","40 hour",2023-01-26,54.5112315536045,60.5208999655683,63.6960607644446,67.116085404084,73.6429022408867,54.91475,0.020175922319773,8.4092249483524,8.78131076444464,6.10066770204199,0.936407612044337,4.84955738984063,8.78131076444464,FALSE,TRUE,FALSE
"OlennaTyrell","energy","64 hour",2023-01-25,49.9838928571429,53.9722,55.796,58.0987685950414,61.4770192307693,54.91475,0.246542857142855,0.471274999999999,0.881250000000001,1.5920092975207,0.328113461538465,0.703838123240404,0.881250000000001,TRUE,TRUE,FALSE
"mean_ensemble","energy","64 hour",2023-01-25,50.3990780862589,54.5373440914837,56.8243030625088,59.2743699192181,63.6153557032497,54.91475,0.225783595687055,0.188702954258147,1.9095530625088,2.17980995960905,0.435030285162485,0.987775971445108,1.9095530625088,TRUE,TRUE,FALSE
"JakePeralta","energy","64 hour",2023-01-25,56.7766726232952,59.7796743710469,63.0537878497305,63.2821973451974,64.3499423898511,54.91475,3.63074911542557,7.29738655657041,8.13903784973049,4.1837236725987,0.471759619492554,4.74453136276354,8.13903784973049,FALSE,FALSE,FALSE
"AmySantiago","energy","64 hour",2023-01-25,51.12556747,54.35185649,56.0446939,57.73753131,60.96382033,54.91475,0.1894591265,0.281446754999997,1.1299439,1.411390655,0.3024535165,0.6629387906,1.1299439,TRUE,TRUE,FALSE
"power_benchmark","energy","64 hour",2023-01-25,47.91565625,50.60725,52.056,55.962,63.03845,54.91475,0.3499546875,2.15375,2.85875,0.523625000000003,0.406185,1.2584529375,2.85875,TRUE,TRUE,FALSE
"PetyrBaelish","energy","64 hour",2023-01-25,48.2205512652857,53.4453153183069,55.398523537606,57.8798829389033,62.5298386923089,54.91475,0.334709936735716,0.734717340846565,0.483773537605984,1.48256646945167,0.380754434615443,0.683304343851075,0.483773537605984,TRUE,TRUE,FALSE
"median_ensemble","energy","64 hour",2023-01-25,50.5322321162164,54.35185649,56.729312107465,58.9039143256837,62.9263920987135,54.91475,0.21912589418918,0.281446754999997,1.814562107465,1.99458216284185,0.400582104935675,0.942059804886341,1.814562107465,TRUE,TRUE,FALSE
"PhoebeBuffay","energy","64 hour",2023-01-25,51.5332243060201,55.1297316140381,57.0168229698609,58.9039143256837,62.5004216337017,54.91475,0.169076284698993,0.322472421057174,2.10207296986091,1.99458216284185,0.379283581685084,0.993497484028801,2.10207296986091,FALSE,TRUE,FALSE
"Yoda","energy","64 hour",2023-01-25,50.5322321162164,53.5488006178181,56.729312107465,59.9098235971118,62.9263920987135,54.91475,0.219125894189181,0.682974691090955,1.81456210746496,2.49753679855591,0.400582104935677,1.12295631924734,1.81456210746496,TRUE,TRUE,FALSE
"JonSnow","energy","68 hour",2023-01-25,45.4223839976649,53.695749341436,57.2244394559546,60.1756441040968,68.961475573764,53.4415,0.400955800116756,0.381374012153991,3.78293945595455,3.36707205204839,0.775998778688201,1.74166801979238,3.78293945595455,FALSE,TRUE,FALSE
"GreyWorm","energy","44 hour",2023-01-26,51.8329139935935,57.4835126963991,60.2533136722131,63.1192018020471,67.8981266570836,53.4415,0.0804293003203256,6.06301904459872,6.81181367221312,4.83885090102354,0.722831332854181,3.70338885020198,6.81181367221312,FALSE,TRUE,FALSE
"PhoebeBuffay","energy","68 hour",2023-01-25,50.0655186828862,53.7324281567355,55.6564596067089,57.5804910566823,61.2474005305317,53.4415,0.168799065855691,0.436392235103288,2.21495960670893,2.06949552834117,0.390295026526584,1.05598829250713,2.21495960670893,FALSE,TRUE,FALSE
"OlennaTyrell","energy","68 hour",2023-01-25,48.685,52.5848666666668,55.2010000000001,57.4760165289256,60.954,53.4415,0.237825,0.4283166666666,1.7595000000001,2.0172582644628,0.375625,0.963704986225901,1.7595000000001,TRUE,TRUE,FALSE
"mean_ensemble","energy","68 hour",2023-01-25,48.4456575438394,52.3587291176715,55.1686786717062,58.0871157542523,62.3056157621483,53.4415,0.24979212280803,0.541385441164248,1.72717867170621,2.32280787712615,0.443205788107415,1.05687398018241,1.72717867170621,TRUE,TRUE,FALSE
"JakePeralta","energy","68 hour",2023-01-25,50.4360411637135,52.1010291602746,56.6793842612913,60.517965138172,62.1800676377952,53.4415,0.150272941814324,0.670235419862721,3.23788426129129,3.538232569086,0.436928381889759,1.60671071478882,3.23788426129129,TRUE,TRUE,FALSE
"AmySantiago","energy","68 hour",2023-01-25,49.33192016,52.59953168,54.31405105,56.02857042,59.29618194,53.4415,0.205478992,0.42098416,0.872551050000006,1.29353521,0.292734097,0.617056701800001,0.872551050000006,TRUE,TRUE,FALSE
"power_benchmark","energy","68 hour",2023-01-25,46.217025,49.0664375,51.4195,56.45475,60.2539,53.4415,0.36122375,2.18753125,2.022,1.506625,0.34062,1.2836,2.022,TRUE,TRUE,FALSE
"PetyrBaelish","energy","68 hour",2023-01-25,46.7312818373965,49.6438266083089,51.7419052894479,53.7113571848823,57.2301532091238,53.4415,0.335510908130174,1.89883669584553,1.69959471055206,0.134928592441174,0.189432660456189,0.851660713485025,1.69959471055206,TRUE,TRUE,FALSE
"median_ensemble","energy","68 hour",2023-01-25,48.685,52.59953168,55.6564596067089,57.5804910566823,61.2474005305317,53.4415,0.237825,0.42098416,2.2149596067089,2.06949552834115,0.390295026526585,1.06671186431533,2.2149596067089,TRUE,TRUE,FALSE
"Yoda","energy","68 hour",2023-01-25,51.4450999933701,54.3861284902357,57.4869945639525,60.5878606376694,63.528889134535,53.4415,0.0998200003314935,1.41694273535351,4.04549456395255,3.57318031883472,0.504369456726749,1.9279614150398,4.04549456395255,FALSE,TRUE,FALSE
"GreyWorm","energy","60 hour",2023-01-26,54.0244908688149,58.4463987458773,60.8462350530841,63.1083125034059,67.2237061236573,55.356,0.0665754565592529,4.63559811881602,5.49023505308405,3.87615625170293,0.593385306182864,2.93239003726902,5.49023505308405,FALSE,TRUE,FALSE
"GreyWorm","energy","64 hour",2023-01-26,51.182614057638,55.6114255230249,58.1803370632923,61.0291833282738,65.9024320870533,51.7885,0.0302942971180979,5.73438828453742,6.39183706329226,4.6203416641369,0.705696604352663,3.49651158268747,6.39183706329226,FALSE,TRUE,FALSE
"GreyWorm","energy","68 hour",2023-01-26,47.6766470595229,53.4185644553858,56.7943738180006,60.2513867178422,67.0984738335849,55.347,0.383517647023854,0.964217772307094,1.44737381800061,2.45219335892109,0.587573691679244,1.16697525758638,1.44737381800061,TRUE,TRUE,FALSE
"PhoebeBuffay","DAX","1 day",2023-01-25,NA,NA,NA,NA,NA,0.338976506272282,NA,NA,NA,NA,NA,0.244659424098171,0.364098457849358,FALSE,FALSE,TRUE
"power_benchmark","DAX","1 day",2023-01-25,NA,NA,NA,NA,NA,0.338976506272282,NA,NA,NA,NA,NA,0.244659424098171,0.364098457849358,FALSE,FALSE,TRUE
"W-EMOS","DAX","1 day",2023-01-25,NA,NA,NA,NA,NA,0.338976506272282,NA,NA,NA,NA,NA,0.244659424098171,0.364098457849358,FALSE,FALSE,TRUE
"W-ENS","DAX","1 day",2023-01-25,NA,NA,NA,NA,NA,0.338976506272282,NA,NA,NA,NA,NA,0.244659424098171,0.364098457849358,FALSE,FALSE,TRUE
"PhoebeBuffay","DAX","2 day",2023-01-25,NA,NA,NA,NA,NA,0.452444352859338,NA,NA,NA,NA,NA,0.355873387310341,0.456968796387931,FALSE,FALSE,TRUE
"power_benchmark","DAX","2 day",2023-01-25,NA,NA,NA,NA,NA,0.452444352859338,NA,NA,NA,NA,NA,0.355873387310341,0.456968796387931,FALSE,FALSE,TRUE
"W-EMOS","DAX","2 day",2023-01-25,NA,NA,NA,NA,NA,0.452444352859338,NA,NA,NA,NA,NA,0.355873387310341,0.456968796387931,FALSE,FALSE,TRUE
"W-ENS","DAX","2 day",2023-01-25,NA,NA,NA,NA,NA,0.452444352859338,NA,NA,NA,NA,NA,0.355873387310341,0.456968796387931,FALSE,FALSE,TRUE
"PhoebeBuffay","DAX","5 day",2023-01-25,NA,NA,NA,NA,NA,0.294232484041679,NA,NA,NA,NA,NA,0.425841958379843,0.692696367599151,FALSE,FALSE,TRUE
"power_benchmark","DAX","5 day",2023-01-25,NA,NA,NA,NA,NA,0.294232484041679,NA,NA,NA,NA,NA,0.425841958379843,0.692696367599151,FALSE,FALSE,TRUE
"W-EMOS","DAX","5 day",2023-01-25,NA,NA,NA,NA,NA,0.294232484041679,NA,NA,NA,NA,NA,0.425841958379843,0.692696367599151,FALSE,FALSE,TRUE
"W-ENS","DAX","5 day",2023-01-25,NA,NA,NA,NA,NA,0.294232484041679,NA,NA,NA,NA,NA,0.425841958379843,0.692696367599151,FALSE,FALSE,TRUE
"PhoebeBuffay","DAX","6 day",2023-01-26,NA,NA,NA,NA,NA,0.308706125234615,NA,NA,NA,NA,NA,0.567816506564006,1.0587483920443,FALSE,FALSE,TRUE
"power_benchmark","DAX","6 day",2023-01-26,NA,NA,NA,NA,NA,0.308706125234615,NA,NA,NA,NA,NA,0.567816506564006,1.0587483920443,FALSE,FALSE,TRUE
"W-EMOS","DAX","6 day",2023-01-26,NA,NA,NA,NA,NA,0.308706125234615,NA,NA,NA,NA,NA,0.567816506564006,1.0587483920443,FALSE,FALSE,TRUE
"W-ENS","DAX","6 day",2023-01-26,NA,NA,NA,NA,NA,0.308706125234615,NA,NA,NA,NA,NA,0.567816506564006,1.0587483920443,FALSE,FALSE,TRUE
"PhoebeBuffay","DAX","7 day",2023-01-25,NA,NA,NA,NA,NA,0.654944790407619,NA,NA,NA,NA,NA,0.59491329691945,0.791333618228985,FALSE,FALSE,TRUE
"power_benchmark","DAX","7 day",2023-01-25,NA,NA,NA,NA,NA,0.654944790407619,NA,NA,NA,NA,NA,0.59491329691945,0.791333618228985,FALSE,FALSE,TRUE
"W-EMOS","DAX","7 day",2023-01-25,NA,NA,NA,NA,NA,0.654944790407619,NA,NA,NA,NA,NA,0.59491329691945,0.791333618228985,FALSE,FALSE,TRUE
"W-ENS","DAX","7 day",2023-01-25,NA,NA,NA,NA,NA,0.654944790407619,NA,NA,NA,NA,NA,0.59491329691945,0.791333618228985,FALSE,FALSE,TRUE
"AmySantiago","wind","36 hour",2023-01-25,NA,NA,NA,NA,NA,7.92,NA,NA,NA,NA,NA,1.23720024838296,2.82086493247781,FALSE,FALSE,TRUE
"DAX_benchmark","wind","36 hour",2023-01-25,NA,NA,NA,NA,NA,7.92,NA,NA,NA,NA,NA,1.23720024838296,2.82086493247781,FALSE,FALSE,TRUE
"GreyWorm","wind","36 hour",2023-01-25,NA,NA,NA,NA,NA,7.92,NA,NA,NA,NA,NA,1.23720024838296,2.82086493247781,FALSE,FALSE,TRUE
"JakePeralta","wind","36 hour",2023-01-25,NA,NA,NA,NA,NA,7.92,NA,NA,NA,NA,NA,1.23720024838296,2.82086493247781,FALSE,FALSE,TRUE
"JonSnow","wind","36 hour",2023-01-25,NA,NA,NA,NA,NA,7.92,NA,NA,NA,NA,NA,1.23720024838296,2.82086493247781,FALSE,FALSE,TRUE
"OlennaTyrell","wind","36 hour",2023-01-25,NA,NA,NA,NA,NA,7.92,NA,NA,NA,NA,NA,1.23720024838296,2.82086493247781,FALSE,FALSE,TRUE
"PetyrBaelish","wind","36 hour",2023-01-25,NA,NA,NA,NA,NA,7.92,NA,NA,NA,NA,NA,1.23720024838296,2.82086493247781,FALSE,FALSE,TRUE
"power_benchmark","wind","36 hour",2023-01-25,NA,NA,NA,NA,NA,7.92,NA,NA,NA,NA,NA,1.23720024838296,2.82086493247781,FALSE,FALSE,TRUE
"Yoda","wind","36 hour",2023-01-25,NA,NA,NA,NA,NA,7.92,NA,NA,NA,NA,NA,1.23720024838296,2.82086493247781,FALSE,FALSE,TRUE
"AmySantiago","wind","48 hour",2023-01-25,NA,NA,NA,NA,NA,4.32,NA,NA,NA,NA,NA,0.987575871813784,1.94787723535375,FALSE,FALSE,TRUE
"DAX_benchmark","wind","48 hour",2023-01-25,NA,NA,NA,NA,NA,4.32,NA,NA,NA,NA,NA,0.987575871813784,1.94787723535375,FALSE,FALSE,TRUE
"GreyWorm","wind","48 hour",2023-01-25,NA,NA,NA,NA,NA,4.32,NA,NA,NA,NA,NA,0.987575871813784,1.94787723535375,FALSE,FALSE,TRUE
"JakePeralta","wind","48 hour",2023-01-25,NA,NA,NA,NA,NA,4.32,NA,NA,NA,NA,NA,0.987575871813784,1.94787723535375,FALSE,FALSE,TRUE
"JonSnow","wind","48 hour",2023-01-25,NA,NA,NA,NA,NA,4.32,NA,NA,NA,NA,NA,0.987575871813784,1.94787723535375,FALSE,FALSE,TRUE
"OlennaTyrell","wind","48 hour",2023-01-25,NA,NA,NA,NA,NA,4.32,NA,NA,NA,NA,NA,0.987575871813784,1.94787723535375,FALSE,FALSE,TRUE
"PetyrBaelish","wind","48 hour",2023-01-25,NA,NA,NA,NA,NA,4.32,NA,NA,NA,NA,NA,0.987575871813784,1.94787723535375,FALSE,FALSE,TRUE
"power_benchmark","wind","48 hour",2023-01-25,NA,NA,NA,NA,NA,4.32,NA,NA,NA,NA,NA,0.987575871813784,1.94787723535375,FALSE,FALSE,TRUE
"Yoda","wind","48 hour",2023-01-25,NA,NA,NA,NA,NA,4.32,NA,NA,NA,NA,NA,0.987575871813784,1.94787723535375,FALSE,FALSE,TRUE
"AmySantiago","wind","60 hour",2023-01-25,NA,NA,NA,NA,NA,16.56,NA,NA,NA,NA,NA,2.63360313057814,4.6701458676218,FALSE,FALSE,TRUE
"DAX_benchmark","wind","60 hour",2023-01-25,NA,NA,NA,NA,NA,16.56,NA,NA,NA,NA,NA,2.63360313057814,4.6701458676218,FALSE,FALSE,TRUE
"GreyWorm","wind","60 hour",2023-01-25,NA,NA,NA,NA,NA,16.56,NA,NA,NA,NA,NA,2.63360313057814,4.6701458676218,FALSE,FALSE,TRUE
"JakePeralta","wind","60 hour",2023-01-25,NA,NA,NA,NA,NA,16.56,NA,NA,NA,NA,NA,2.63360313057814,4.6701458676218,FALSE,FALSE,TRUE
"JonSnow","wind","60 hour",2023-01-25,NA,NA,NA,NA,NA,16.56,NA,NA,NA,NA,NA,2.63360313057814,4.6701458676218,FALSE,FALSE,TRUE
"OlennaTyrell","wind","60 hour",2023-01-25,NA,NA,NA,NA,NA,16.56,NA,NA,NA,NA,NA,2.63360313057814,4.6701458676218,FALSE,FALSE,TRUE
"PetyrBaelish","wind","60 hour",2023-01-25,NA,NA,NA,NA,NA,16.56,NA,NA,NA,NA,NA,2.63360313057814,4.6701458676218,FALSE,FALSE,TRUE
"power_benchmark","wind","60 hour",2023-01-25,NA,NA,NA,NA,NA,16.56,NA,NA,NA,NA,NA,2.63360313057814,4.6701458676218,FALSE,FALSE,TRUE
"Yoda","wind","60 hour",2023-01-25,NA,NA,NA,NA,NA,16.56,NA,NA,NA,NA,NA,2.63360313057814,4.6701458676218,FALSE,FALSE,TRUE
"AmySantiago","wind","72 hour",2023-01-25,NA,NA,NA,NA,NA,11.16,NA,NA,NA,NA,NA,1.81999216414418,4.04622922693049,FALSE,FALSE,TRUE
"DAX_benchmark","wind","72 hour",2023-01-25,NA,NA,NA,NA,NA,11.16,NA,NA,NA,NA,NA,1.81999216414418,4.04622922693049,FALSE,FALSE,TRUE
"GreyWorm","wind","72 hour",2023-01-25,NA,NA,NA,NA,NA,11.16,NA,NA,NA,NA,NA,1.81999216414418,4.04622922693049,FALSE,FALSE,TRUE
"JakePeralta","wind","72 hour",2023-01-25,NA,NA,NA,NA,NA,11.16,NA,NA,NA,NA,NA,1.81999216414418,4.04622922693049,FALSE,FALSE,TRUE
"JonSnow","wind","72 hour",2023-01-25,NA,NA,NA,NA,NA,11.16,NA,NA,NA,NA,NA,1.81999216414418,4.04622922693049,FALSE,FALSE,TRUE
"OlennaTyrell","wind","72 hour",2023-01-25,NA,NA,NA,NA,NA,11.16,NA,NA,NA,NA,NA,1.81999216414418,4.04622922693049,FALSE,FALSE,TRUE
"PetyrBaelish","wind","72 hour",2023-01-25,NA,NA,NA,NA,NA,11.16,NA,NA,NA,NA,NA,1.81999216414418,4.04622922693049,FALSE,FALSE,TRUE
"power_benchmark","wind","72 hour",2023-01-25,NA,NA,NA,NA,NA,11.16,NA,NA,NA,NA,NA,1.81999216414418,4.04622922693049,FALSE,FALSE,TRUE
"Yoda","wind","72 hour",2023-01-25,NA,NA,NA,NA,NA,11.16,NA,NA,NA,NA,NA,1.81999216414418,4.04622922693049,FALSE,FALSE,TRUE
"AmySantiago","wind","84 hour",2023-01-25,NA,NA,NA,NA,NA,16.56,NA,NA,NA,NA,NA,4.37120425,7.01465661127509,FALSE,FALSE,TRUE
"DAX_benchmark","wind","84 hour",2023-01-25,NA,NA,NA,NA,NA,16.56,NA,NA,NA,NA,NA,4.37120425,7.01465661127509,FALSE,FALSE,TRUE
"GreyWorm","wind","84 hour",2023-01-25,NA,NA,NA,NA,NA,16.56,NA,NA,NA,NA,NA,4.37120425,7.01465661127509,FALSE,FALSE,TRUE
"JakePeralta","wind","84 hour",2023-01-25,NA,NA,NA,NA,NA,16.56,NA,NA,NA,NA,NA,4.37120425,7.01465661127509,FALSE,FALSE,TRUE
"JonSnow","wind","84 hour",2023-01-25,NA,NA,NA,NA,NA,16.56,NA,NA,NA,NA,NA,4.37120425,7.01465661127509,FALSE,FALSE,TRUE
"OlennaTyrell","wind","84 hour",2023-01-25,NA,NA,NA,NA,NA,16.56,NA,NA,NA,NA,NA,4.37120425,7.01465661127509,FALSE,FALSE,TRUE
"PetyrBaelish","wind","84 hour",2023-01-25,NA,NA,NA,NA,NA,16.56,NA,NA,NA,NA,NA,4.37120425,7.01465661127509,FALSE,FALSE,TRUE
"power_benchmark","wind","84 hour",2023-01-25,NA,NA,NA,NA,NA,16.56,NA,NA,NA,NA,NA,4.37120425,7.01465661127509,FALSE,FALSE,TRUE
"Yoda","wind","84 hour",2023-01-25,NA,NA,NA,NA,NA,16.56,NA,NA,NA,NA,NA,4.37120425,7.01465661127509,FALSE,FALSE,TRUE
"DAX_benchmark","energy","36 hour",2023-01-25,NA,NA,NA,NA,NA,69.40425,NA,NA,NA,NA,NA,6.01314459811955,10.2900808684481,FALSE,FALSE,TRUE
"KhalDrogo","energy","36 hour",2023-01-25,NA,NA,NA,NA,NA,69.40425,NA,NA,NA,NA,NA,6.01314459811955,10.2900808684481,FALSE,FALSE,TRUE
"MadelineWuntsch","energy","36 hour",2023-01-25,NA,NA,NA,NA,NA,69.40425,NA,NA,NA,NA,NA,6.01314459811955,10.2900808684481,FALSE,FALSE,TRUE
"W-EMOS","energy","36 hour",2023-01-25,NA,NA,NA,NA,NA,69.40425,NA,NA,NA,NA,NA,6.01314459811955,10.2900808684481,FALSE,FALSE,TRUE
"W-ENS","energy","36 hour",2023-01-25,NA,NA,NA,NA,NA,69.40425,NA,NA,NA,NA,NA,6.01314459811955,10.2900808684481,FALSE,FALSE,TRUE
"DAX_benchmark","energy","40 hour",2023-01-25,NA,NA,NA,NA,NA,64.62875,NA,NA,NA,NA,NA,4.89805296373903,8.86912387208909,FALSE,FALSE,TRUE
"KhalDrogo","energy","40 hour",2023-01-25,NA,NA,NA,NA,NA,64.62875,NA,NA,NA,NA,NA,4.89805296373903,8.86912387208909,FALSE,FALSE,TRUE
"MadelineWuntsch","energy","40 hour",2023-01-25,NA,NA,NA,NA,NA,64.62875,NA,NA,NA,NA,NA,4.89805296373903,8.86912387208909,FALSE,FALSE,TRUE
"W-EMOS","energy","40 hour",2023-01-25,NA,NA,NA,NA,NA,64.62875,NA,NA,NA,NA,NA,4.89805296373903,8.86912387208909,FALSE,FALSE,TRUE
"W-ENS","energy","40 hour",2023-01-25,NA,NA,NA,NA,NA,64.62875,NA,NA,NA,NA,NA,4.89805296373903,8.86912387208909,FALSE,FALSE,TRUE
"DAX_benchmark","energy","44 hour",2023-01-25,NA,NA,NA,NA,NA,60.739,NA,NA,NA,NA,NA,3.740422738704,6.87993180893525,FALSE,FALSE,TRUE
"KhalDrogo","energy","44 hour",2023-01-25,NA,NA,NA,NA,NA,60.739,NA,NA,NA,NA,NA,3.740422738704,6.87993180893525,FALSE,FALSE,TRUE
"MadelineWuntsch","energy","44 hour",2023-01-25,NA,NA,NA,NA,NA,60.739,NA,NA,NA,NA,NA,3.740422738704,6.87993180893525,FALSE,FALSE,TRUE
"W-EMOS","energy","44 hour",2023-01-25,NA,NA,NA,NA,NA,60.739,NA,NA,NA,NA,NA,3.740422738704,6.87993180893525,FALSE,FALSE,TRUE
"W-ENS","energy","44 hour",2023-01-25,NA,NA,NA,NA,NA,60.739,NA,NA,NA,NA,NA,3.740422738704,6.87993180893525,FALSE,FALSE,TRUE
"DAX_benchmark","energy","60 hour",2023-01-25,NA,NA,NA,NA,NA,58.33625,NA,NA,NA,NA,NA,2.96171393764171,5.54513740361489,FALSE,FALSE,TRUE
"KhalDrogo","energy","60 hour",2023-01-25,NA,NA,NA,NA,NA,58.33625,NA,NA,NA,NA,NA,2.96171393764171,5.54513740361489,FALSE,FALSE,TRUE
"MadelineWuntsch","energy","60 hour",2023-01-25,NA,NA,NA,NA,NA,58.33625,NA,NA,NA,NA,NA,2.96171393764171,5.54513740361489,FALSE,FALSE,TRUE
"W-EMOS","energy","60 hour",2023-01-25,NA,NA,NA,NA,NA,58.33625,NA,NA,NA,NA,NA,2.96171393764171,5.54513740361489,FALSE,FALSE,TRUE
"W-ENS","energy","60 hour",2023-01-25,NA,NA,NA,NA,NA,58.33625,NA,NA,NA,NA,NA,2.96171393764171,5.54513740361489,FALSE,FALSE,TRUE
"DAX_benchmark","energy","64 hour",2023-01-25,NA,NA,NA,NA,NA,54.91475,NA,NA,NA,NA,NA,4.79197667639118,8.22042822822779,FALSE,FALSE,TRUE
"KhalDrogo","energy","64 hour",2023-01-25,NA,NA,NA,NA,NA,54.91475,NA,NA,NA,NA,NA,4.79197667639118,8.22042822822779,FALSE,FALSE,TRUE
"MadelineWuntsch","energy","64 hour",2023-01-25,NA,NA,NA,NA,NA,54.91475,NA,NA,NA,NA,NA,4.79197667639118,8.22042822822779,FALSE,FALSE,TRUE
"W-EMOS","energy","64 hour",2023-01-25,NA,NA,NA,NA,NA,54.91475,NA,NA,NA,NA,NA,4.79197667639118,8.22042822822779,FALSE,FALSE,TRUE
"W-ENS","energy","64 hour",2023-01-25,NA,NA,NA,NA,NA,54.91475,NA,NA,NA,NA,NA,4.79197667639118,8.22042822822779,FALSE,FALSE,TRUE
"DAX_benchmark","energy","68 hour",2023-01-25,NA,NA,NA,NA,NA,53.4415,NA,NA,NA,NA,NA,1.9472410291902,4.08594950959208,FALSE,FALSE,TRUE
"KhalDrogo","energy","68 hour",2023-01-25,NA,NA,NA,NA,NA,53.4415,NA,NA,NA,NA,NA,1.9472410291902,4.08594950959208,FALSE,FALSE,TRUE
"MadelineWuntsch","energy","68 hour",2023-01-25,NA,NA,NA,NA,NA,53.4415,NA,NA,NA,NA,NA,1.9472410291902,4.08594950959208,FALSE,FALSE,TRUE
"W-EMOS","energy","68 hour",2023-01-25,NA,NA,NA,NA,NA,53.4415,NA,NA,NA,NA,NA,1.9472410291902,4.08594950959208,FALSE,FALSE,TRUE
"W-ENS","energy","68 hour",2023-01-25,NA,NA,NA,NA,NA,53.4415,NA,NA,NA,NA,NA,1.9472410291902,4.08594950959208,FALSE,FALSE,TRUE
