forecast_date,target,horizon,q0.025,q0.25,q0.5,q0.75,q0.975
2022-12-14,energy,36 hour,57.562124999999995,65.11075000000001,67.02600000000001,70.89925,75.454325
2022-12-14,energy,40 hour,54.931875000000005,59.679,61.777,65.99325,72.031775
2022-12-14,energy,44 hour,51.814299999999996,55.7595,58.453,64.2265,68.13647499999999
2022-12-14,energy,60 hour,52.1603,54.99825,56.421375,59.555375,63.994550000000004
2022-12-14,energy,64 hour,48.1775,50.63,52.0865,56.384,63.03845
2022-12-14,energy,68 hour,46.39905,49.22325,51.4195,56.8295,60.391675
