"forecast_date","target","horizon","q0.025","q0.25","q0.5","q0.75","q0.975","model","target_end_date","ae","mean_qscore"
2022-11-02 23:59:00,"DAX","1 day",-3.244,-0.545,0.08,0.718,2.756,"DAX_benchmark",2022-11-03 17:30:00,NA,NA
2022-11-02 23:59:00,"DAX","2 day",-4.214,-0.843,0.111,1.007,3.559,"DAX_benchmark",2022-11-04 17:30:00,NA,NA
2022-11-02 23:59:00,"DAX","5 day",-5.303,-0.894,0.17,1.281,4.629,"DAX_benchmark",2022-11-07 17:30:00,NA,NA
2022-11-02 23:59:00,"DAX","6 day",-6.382,-1.056,0.24,1.499,5.367,"DAX_benchmark",2022-11-08 17:30:00,NA,NA
2022-11-02 23:59:00,"DAX","7 day",-6.891,-1.118,0.394,1.609,5.669,"DAX_benchmark",2022-11-09 17:30:00,NA,NA
2022-11-02 23:59:00,"DAX","1 day",-1.946,-0.666,0.047,0.698,2.024,"GreyWorm",2022-11-03 17:30:00,NA,NA
2022-11-02 23:59:00,"DAX","2 day",-1.754,-0.603,0.084,0.647,1.791,"GreyWorm",2022-11-04 17:30:00,NA,NA
2022-11-02 23:59:00,"DAX","5 day",-1.962,-0.635,-0.021,0.591,1.746,"GreyWorm",2022-11-07 17:30:00,NA,NA
2022-11-02 23:59:00,"DAX","6 day",-1.719,-0.674,-0.021,0.664,1.854,"GreyWorm",2022-11-08 17:30:00,NA,NA
2022-11-02 23:59:00,"DAX","7 day",-1.843,-0.675,-0.018,0.684,1.934,"GreyWorm",2022-11-09 17:30:00,NA,NA
2022-11-02 23:59:00,"wind","36 hour",NA,NA,NA,NA,NA,"GreyWorm",2022-11-03 12:00:00,NA,NA
2022-11-02 23:59:00,"wind","48 hour",NA,NA,NA,NA,NA,"GreyWorm",2022-11-04 00:00:00,NA,NA
2022-11-02 23:59:00,"wind","60 hour",NA,NA,NA,NA,NA,"GreyWorm",2022-11-04 12:00:00,NA,NA
2022-11-02 23:59:00,"wind","72 hour",NA,NA,NA,NA,NA,"GreyWorm",2022-11-05 00:00:00,NA,NA
2022-11-02 23:59:00,"wind","84 hour",NA,NA,NA,NA,NA,"GreyWorm",2022-11-05 12:00:00,NA,NA
2022-11-02 23:59:00,"energy","36 hour",NA,NA,NA,NA,NA,"GreyWorm",2022-11-04 12:00:00,NA,NA
2022-11-02 23:59:00,"energy","40 hour",NA,NA,NA,NA,NA,"GreyWorm",2022-11-04 16:00:00,NA,NA
2022-11-02 23:59:00,"energy","44 hour",NA,NA,NA,NA,NA,"GreyWorm",2022-11-04 20:00:00,NA,NA
2022-11-02 23:59:00,"energy","60 hour",NA,NA,NA,NA,NA,"GreyWorm",2022-11-05 12:00:00,NA,NA
2022-11-02 23:59:00,"energy","64 hour",NA,NA,NA,NA,NA,"GreyWorm",2022-11-05 16:00:00,NA,NA
2022-11-02 23:59:00,"energy","68 hour",NA,NA,NA,NA,NA,"GreyWorm",2022-11-05 20:00:00,NA,NA
2022-11-02 23:59:00,"DAX","1 day",-2.549,-0.247,0.128,0.7,2.025,"JakePeralta",2022-11-03 17:30:00,NA,NA
2022-11-02 23:59:00,"DAX","2 day",-2.685,-0.068,0.173,1.24,4.057,"JakePeralta",2022-11-04 17:30:00,NA,NA
2022-11-02 23:59:00,"DAX","5 day",-2.061,-0.45,0.723,1.801,3.754,"JakePeralta",2022-11-07 17:30:00,NA,NA
2022-11-02 23:59:00,"DAX","6 day",-2.609,-0.157,1.007,1.89,3.065,"JakePeralta",2022-11-08 17:30:00,NA,NA
2022-11-02 23:59:00,"DAX","7 day",-3.82,-1.501,0.792,1.385,2.907,"JakePeralta",2022-11-09 17:30:00,NA,NA
2022-11-02 23:59:00,"wind","36 hour",NA,NA,NA,NA,NA,"JakePeralta",2022-11-03 12:00:00,NA,NA
2022-11-02 23:59:00,"wind","48 hour",NA,NA,NA,NA,NA,"JakePeralta",2022-11-04 00:00:00,NA,NA
2022-11-02 23:59:00,"wind","60 hour",NA,NA,NA,NA,NA,"JakePeralta",2022-11-04 12:00:00,NA,NA
2022-11-02 23:59:00,"wind","72 hour",NA,NA,NA,NA,NA,"JakePeralta",2022-11-05 00:00:00,NA,NA
2022-11-02 23:59:00,"wind","84 hour",NA,NA,NA,NA,NA,"JakePeralta",2022-11-05 12:00:00,NA,NA
2022-11-02 23:59:00,"energy","36 hour",54.477,66.544,68.823,72.778,77.055,"JakePeralta",2022-11-04 12:00:00,NA,NA
2022-11-02 23:59:00,"energy","40 hour",52.009,62.919,65.096,68.866,74.656,"JakePeralta",2022-11-04 16:00:00,NA,NA
2022-11-02 23:59:00,"energy","44 hour",51.267,60.467,64.164,70.386,74.848,"JakePeralta",2022-11-04 20:00:00,NA,NA
2022-11-02 23:59:00,"energy","60 hour",54.665,65.663,67.896,72.168,76.136,"JakePeralta",2022-11-05 12:00:00,NA,NA
2022-11-02 23:59:00,"energy","64 hour",49.885,60.716,63.098,66.964,71.167,"JakePeralta",2022-11-05 16:00:00,NA,NA
2022-11-02 23:59:00,"energy","68 hour",53.006,57.718,61.652,68.532,72.271,"JakePeralta",2022-11-05 20:00:00,NA,NA
2022-11-02 23:59:00,"DAX","1 day",NA,NA,NA,NA,NA,"JoeyTribbiani",2022-11-03 17:30:00,NA,NA
2022-11-02 23:59:00,"DAX","2 day",NA,NA,NA,NA,NA,"JoeyTribbiani",2022-11-04 17:30:00,NA,NA
2022-11-02 23:59:00,"DAX","5 day",NA,NA,NA,NA,NA,"JoeyTribbiani",2022-11-07 17:30:00,NA,NA
2022-11-02 23:59:00,"DAX","6 day",NA,NA,NA,NA,NA,"JoeyTribbiani",2022-11-08 17:30:00,NA,NA
2022-11-02 23:59:00,"DAX","7 day",NA,NA,NA,NA,NA,"JoeyTribbiani",2022-11-09 17:30:00,NA,NA
2022-11-02 23:59:00,"wind","36 hour",NA,NA,NA,NA,NA,"JoeyTribbiani",2022-11-03 12:00:00,NA,NA
2022-11-02 23:59:00,"wind","48 hour",NA,NA,NA,NA,NA,"JoeyTribbiani",2022-11-04 00:00:00,NA,NA
2022-11-02 23:59:00,"wind","60 hour",NA,NA,NA,NA,NA,"JoeyTribbiani",2022-11-04 12:00:00,NA,NA
2022-11-02 23:59:00,"wind","72 hour",NA,NA,NA,NA,NA,"JoeyTribbiani",2022-11-05 00:00:00,NA,NA
2022-11-02 23:59:00,"wind","84 hour",NA,NA,NA,NA,NA,"JoeyTribbiani",2022-11-05 12:00:00,NA,NA
2022-11-02 23:59:00,"energy","42 hour",54.567,64.956,66.96,71.152,75.454,"JoeyTribbiani",2022-11-04 18:00:00,NA,NA
2022-11-02 23:59:00,"energy","46 hour",49.942,59.542,61.777,67.476,72.406,"JoeyTribbiani",2022-11-04 22:00:00,NA,NA
2022-11-02 23:59:00,"energy","50 hour",50.564,55.691,58.693,64.572,68.136,"JoeyTribbiani",2022-11-05 02:00:00,NA,NA
2022-11-02 23:59:00,"energy","66 hour",52.16,54.998,56.538,60.798,63.995,"JoeyTribbiani",2022-11-05 18:00:00,NA,NA
2022-11-02 23:59:00,"energy","70 hour",48.178,50.648,52.254,57.193,63.038,"JoeyTribbiani",2022-11-05 22:00:00,NA,NA
2022-11-02 23:59:00,"energy","74 hour",46.399,49.374,52.068,57.09,60.392,"JoeyTribbiani",2022-11-06 02:00:00,NA,NA
2022-11-02 23:59:00,"DAX","1 day",-1.956,-0.846,0.081,0.841,3.272,"JonSnow",2022-11-03 17:30:00,NA,NA
2022-11-02 23:59:00,"DAX","2 day",-3.689,-1.194,0.027,1.201,3.607,"JonSnow",2022-11-04 17:30:00,NA,NA
2022-11-02 23:59:00,"DAX","5 day",-3.84,-1.693,0.34,1.498,5.594,"JonSnow",2022-11-07 17:30:00,NA,NA
2022-11-02 23:59:00,"DAX","6 day",-4.411,-1.989,0.678,2.494,4.691,"JonSnow",2022-11-08 17:30:00,NA,NA
2022-11-02 23:59:00,"DAX","7 day",-5.481,-2.549,1.264,2.514,4.673,"JonSnow",2022-11-09 17:30:00,NA,NA
2022-11-02 23:59:00,"wind","36 hour",NA,NA,NA,NA,NA,"JonSnow",2022-11-03 12:00:00,NA,NA
2022-11-02 23:59:00,"wind","48 hour",NA,NA,NA,NA,NA,"JonSnow",2022-11-04 00:00:00,NA,NA
2022-11-02 23:59:00,"wind","60 hour",NA,NA,NA,NA,NA,"JonSnow",2022-11-04 12:00:00,NA,NA
2022-11-02 23:59:00,"wind","72 hour",NA,NA,NA,NA,NA,"JonSnow",2022-11-05 00:00:00,NA,NA
2022-11-02 23:59:00,"wind","84 hour",NA,NA,NA,NA,NA,"JonSnow",2022-11-05 12:00:00,NA,NA
2022-11-02 23:59:00,"energy","36 hour",54.567,65.016,67.026,71.152,75.454,"JonSnow",2022-11-04 12:00:00,NA,NA
2022-11-02 23:59:00,"energy","40 hour",49.942,59.594,61.846,67.57,72.406,"JonSnow",2022-11-04 16:00:00,NA,NA
2022-11-02 23:59:00,"energy","44 hour",50.564,55.691,58.856,64.572,68.136,"JonSnow",2022-11-04 20:00:00,NA,NA
2022-11-02 23:59:00,"energy","60 hour",52.16,54.998,56.609,60.798,63.995,"JonSnow",2022-11-05 12:00:00,NA,NA
2022-11-02 23:59:00,"energy","64 hour",48.178,50.741,52.432,57.653,63.038,"JonSnow",2022-11-05 16:00:00,NA,NA
2022-11-02 23:59:00,"energy","68 hour",46.399,49.374,52.161,57.09,60.392,"JonSnow",2022-11-05 20:00:00,NA,NA
2022-11-02 23:59:00,"DAX","1 day",-4,-1.5,0,1.5,5,"KhalDrogo",2022-11-03 17:30:00,NA,NA
2022-11-02 23:59:00,"DAX","2 day",-4,-2,0,2,4,"KhalDrogo",2022-11-04 17:30:00,NA,NA
2022-11-02 23:59:00,"DAX","5 day",-4,-2,0,2,4,"KhalDrogo",2022-11-07 17:30:00,NA,NA
2022-11-02 23:59:00,"DAX","6 day",-4,-2,0,2,4,"KhalDrogo",2022-11-08 17:30:00,NA,NA
2022-11-02 23:59:00,"DAX","7 day",-4,-2,0,2,4,"KhalDrogo",2022-11-09 17:30:00,NA,NA
2022-11-02 23:59:00,"wind","36 hour",2.878,4.83,6.297,7.498,12.016,"KhalDrogo",2022-11-03 12:00:00,NA,NA
2022-11-02 23:59:00,"wind","48 hour",3.6,9.874,14.4,17.995,25.566,"KhalDrogo",2022-11-04 00:00:00,NA,NA
2022-11-02 23:59:00,"wind","60 hour",6.716,14.012,16.753,19.184,28.44,"KhalDrogo",2022-11-04 12:00:00,NA,NA
2022-11-02 23:59:00,"wind","72 hour",7.2,9.348,10.317,11.322,14.054,"KhalDrogo",2022-11-05 00:00:00,NA,NA
2022-11-02 23:59:00,"wind","84 hour",5.489,8.178,12.307,15.806,20.881,"KhalDrogo",2022-11-05 12:00:00,NA,NA
2022-11-02 23:59:00,"energy","36 hour",NA,NA,NA,NA,NA,"KhalDrogo",2022-11-04 12:00:00,NA,NA
2022-11-02 23:59:00,"energy","40 hour",NA,NA,NA,NA,NA,"KhalDrogo",2022-11-04 16:00:00,NA,NA
2022-11-02 23:59:00,"energy","44 hour",NA,NA,NA,NA,NA,"KhalDrogo",2022-11-04 20:00:00,NA,NA
2022-11-02 23:59:00,"energy","60 hour",NA,NA,NA,NA,NA,"KhalDrogo",2022-11-05 12:00:00,NA,NA
2022-11-02 23:59:00,"energy","64 hour",NA,NA,NA,NA,NA,"KhalDrogo",2022-11-05 16:00:00,NA,NA
2022-11-02 23:59:00,"energy","68 hour",NA,NA,NA,NA,NA,"KhalDrogo",2022-11-05 20:00:00,NA,NA
2022-10-26 23:59:00,"DAX","1 day",-2.944,-0.508,0.08,0.702,2.603,"MadelineWuntsch",2022-10-27 17:30:00,NA,NA
2022-10-26 23:59:00,"DAX","2 day",-3.277,-0.749,0.091,0.939,2.725,"MadelineWuntsch",2022-10-28 17:30:00,NA,NA
2022-10-26 23:59:00,"DAX","5 day",-4.294,-0.873,0.18,1.215,3.818,"MadelineWuntsch",2022-10-31 17:30:00,NA,NA
2022-10-26 23:59:00,"DAX","6 day",-4.873,-0.939,0.243,1.452,4.121,"MadelineWuntsch",2022-11-01 17:30:00,NA,NA
2022-10-26 23:59:00,"DAX","7 day",-5.2,-0.908,0.405,1.672,4.866,"MadelineWuntsch",2022-11-02 17:30:00,NA,NA
2022-10-26 23:59:00,"wind","36 hour",1.448,2.801,4.308,6.565,11.487,"MadelineWuntsch",2022-10-27 12:00:00,NA,NA
2022-10-26 23:59:00,"wind","48 hour",0.985,1.756,3.089,5.772,10.663,"MadelineWuntsch",2022-10-28 00:00:00,NA,NA
2022-10-26 23:59:00,"wind","60 hour",2.048,4.435,5.867,8.922,14.172,"MadelineWuntsch",2022-10-28 12:00:00,NA,NA
2022-10-26 23:59:00,"wind","72 hour",1.061,1.831,3.705,6.365,11.369,"MadelineWuntsch",2022-10-29 00:00:00,NA,NA
2022-10-26 23:59:00,"wind","84 hour",1.494,2.93,4.499,7.301,13.266,"MadelineWuntsch",2022-10-29 12:00:00,NA,NA
2022-10-26 23:59:00,"energy","36 hour",NA,NA,NA,NA,NA,"MadelineWuntsch",2022-10-28 12:00:00,NA,NA
2022-10-26 23:59:00,"energy","40 hour",NA,NA,NA,NA,NA,"MadelineWuntsch",2022-10-28 16:00:00,NA,NA
2022-10-26 23:59:00,"energy","44 hour",NA,NA,NA,NA,NA,"MadelineWuntsch",2022-10-28 20:00:00,NA,NA
2022-10-26 23:59:00,"energy","60 hour",NA,NA,NA,NA,NA,"MadelineWuntsch",2022-10-29 12:00:00,NA,NA
2022-10-26 23:59:00,"energy","64 hour",NA,NA,NA,NA,NA,"MadelineWuntsch",2022-10-29 16:00:00,NA,NA
2022-10-26 23:59:00,"energy","68 hour",NA,NA,NA,NA,NA,"MadelineWuntsch",2022-10-29 20:00:00,NA,NA
2022-11-02 23:59:00,"DAX","1 day",-2.841,-0.693,0.071,0.839,2.919,"mean_ensemble",2022-11-03 17:30:00,NA,NA
2022-11-02 23:59:00,"DAX","2 day",-3.405,-0.9,0.085,1.149,3.328,"mean_ensemble",2022-11-04 17:30:00,NA,NA
2022-11-02 23:59:00,"DAX","5 day",-3.823,-1.063,0.223,1.381,4.024,"mean_ensemble",2022-11-07 17:30:00,NA,NA
2022-11-02 23:59:00,"DAX","6 day",-4.339,-1.124,0.341,1.643,4.066,"mean_ensemble",2022-11-08 17:30:00,NA,NA
2022-11-02 23:59:00,"DAX","7 day",-4.875,-1.411,0.461,1.639,4.245,"mean_ensemble",2022-11-09 17:30:00,NA,NA
2022-11-02 23:59:00,"wind","36 hour",1.613,3.853,5.911,8.468,14.735,"mean_ensemble",2022-11-03 12:00:00,NA,NA
2022-11-02 23:59:00,"wind","48 hour",1.883,5.945,9.93,14.113,24.354,"mean_ensemble",2022-11-04 00:00:00,NA,NA
2022-11-02 23:59:00,"wind","60 hour",4.961,9.758,12.569,16.392,24.743,"mean_ensemble",2022-11-04 12:00:00,NA,NA
2022-11-02 23:59:00,"wind","72 hour",3.125,5.782,8.08,10.924,17.635,"mean_ensemble",2022-11-05 00:00:00,NA,NA
2022-11-02 23:59:00,"wind","84 hour",3.327,7.737,11.011,14.547,22.733,"mean_ensemble",2022-11-05 12:00:00,NA,NA
2022-11-02 23:59:00,"energy","36 hour",49.499,60.088,64.189,69.791,75.568,"mean_ensemble",2022-11-04 12:00:00,NA,NA
2022-11-02 23:59:00,"energy","40 hour",47.135,57.072,61.219,67.293,73.752,"mean_ensemble",2022-11-04 16:00:00,NA,NA
2022-11-02 23:59:00,"energy","44 hour",47.095,54.954,59.912,66.8,72.393,"mean_ensemble",2022-11-04 20:00:00,NA,NA
2022-11-02 23:59:00,"energy","60 hour",48.76,56.455,60.407,66.136,71.442,"mean_ensemble",2022-11-05 12:00:00,NA,NA
2022-11-02 23:59:00,"energy","64 hour",45.839,53.387,57.416,63.353,69.466,"mean_ensemble",2022-11-05 16:00:00,NA,NA
2022-11-02 23:59:00,"energy","68 hour",46.286,51.932,56.843,63.688,68.952,"mean_ensemble",2022-11-05 20:00:00,NA,NA
2022-11-02 23:59:00,"DAX","1 day",-2.944,-0.545,0.08,0.718,2.756,"median_ensemble",2022-11-03 17:30:00,NA,NA
2022-11-02 23:59:00,"DAX","2 day",-3.689,-0.843,0.091,1.007,3.559,"median_ensemble",2022-11-04 17:30:00,NA,NA
2022-11-02 23:59:00,"DAX","5 day",-4,-0.894,0.17,1.281,4,"median_ensemble",2022-11-07 17:30:00,NA,NA
2022-11-02 23:59:00,"DAX","6 day",-4.411,-1.056,0.24,1.499,4.121,"median_ensemble",2022-11-08 17:30:00,NA,NA
2022-11-02 23:59:00,"DAX","7 day",-5.2,-1.129,0.394,1.609,4.673,"median_ensemble",2022-11-09 17:30:00,NA,NA
2022-11-02 23:59:00,"wind","36 hour",1.448,3.408,5.485,7.498,11.961,"median_ensemble",2022-11-03 12:00:00,NA,NA
2022-11-02 23:59:00,"wind","48 hour",1.411,5.4,10.08,16.2,25.566,"median_ensemble",2022-11-04 00:00:00,NA,NA
2022-11-02 23:59:00,"wind","60 hour",6.653,11.398,12.955,16.825,27.778,"median_ensemble",2022-11-04 12:00:00,NA,NA
2022-11-02 23:59:00,"wind","72 hour",2.16,5.692,9.388,11.322,14.054,"median_ensemble",2022-11-05 00:00:00,NA,NA
2022-11-02 23:59:00,"wind","84 hour",2.861,8.178,12.307,15.806,20.881,"median_ensemble",2022-11-05 12:00:00,NA,NA
2022-11-02 23:59:00,"energy","36 hour",54.477,65.016,67.026,71.152,75.454,"median_ensemble",2022-11-04 12:00:00,NA,NA
2022-11-02 23:59:00,"energy","40 hour",49.942,59.594,61.846,67.57,74.194,"median_ensemble",2022-11-04 16:00:00,NA,NA
2022-11-02 23:59:00,"energy","44 hour",50.564,55.691,58.856,65.443,74.194,"median_ensemble",2022-11-04 20:00:00,NA,NA
2022-11-02 23:59:00,"energy","60 hour",52.16,54.998,56.717,65.443,74.194,"median_ensemble",2022-11-05 12:00:00,NA,NA
2022-11-02 23:59:00,"energy","64 hour",48.178,50.741,56.717,65.443,71.167,"median_ensemble",2022-11-05 16:00:00,NA,NA
2022-11-02 23:59:00,"energy","68 hour",46.399,49.374,56.717,65.443,72.271,"median_ensemble",2022-11-05 20:00:00,NA,NA
2022-11-02 23:59:00,"DAX","1 day",-3.244,-0.541,0.081,0.718,2.756,"PhoebeBuffay",2022-11-03 17:30:00,NA,NA
2022-11-02 23:59:00,"DAX","2 day",-4.214,-0.843,0.111,1.007,3.559,"PhoebeBuffay",2022-11-04 17:30:00,NA,NA
2022-11-02 23:59:00,"DAX","5 day",-5.303,-0.894,0.17,1.281,4.629,"PhoebeBuffay",2022-11-07 17:30:00,NA,NA
2022-11-02 23:59:00,"DAX","6 day",-6.382,-1.056,0.238,1.499,5.367,"PhoebeBuffay",2022-11-08 17:30:00,NA,NA
2022-11-02 23:59:00,"DAX","7 day",-6.891,-1.129,0.392,1.609,5.669,"PhoebeBuffay",2022-11-09 17:30:00,NA,NA
2022-11-02 23:59:00,"wind","36 hour",2.16,5.4,10.08,16.2,32.4,"PhoebeBuffay",2022-11-03 12:00:00,NA,NA
2022-11-02 23:59:00,"wind","48 hour",2.16,5.4,10.08,16.2,32.4,"PhoebeBuffay",2022-11-04 00:00:00,NA,NA
2022-11-02 23:59:00,"wind","60 hour",2.16,5.4,10.08,16.2,32.76,"PhoebeBuffay",2022-11-04 12:00:00,NA,NA
2022-11-02 23:59:00,"wind","72 hour",2.16,5.4,10.08,16.2,32.4,"PhoebeBuffay",2022-11-05 00:00:00,NA,NA
2022-11-02 23:59:00,"wind","84 hour",2.16,5.4,10.08,16.2,32.706,"PhoebeBuffay",2022-11-05 12:00:00,NA,NA
2022-11-02 23:59:00,"energy","36 hour",39.454,48.703,56.717,65.443,74.194,"PhoebeBuffay",2022-11-04 12:00:00,NA,NA
2022-11-02 23:59:00,"energy","40 hour",39.454,48.703,56.717,65.443,74.194,"PhoebeBuffay",2022-11-04 16:00:00,NA,NA
2022-11-02 23:59:00,"energy","44 hour",39.454,48.703,56.717,65.443,74.194,"PhoebeBuffay",2022-11-04 20:00:00,NA,NA
2022-11-02 23:59:00,"energy","60 hour",39.454,48.703,56.717,65.443,74.194,"PhoebeBuffay",2022-11-05 12:00:00,NA,NA
2022-11-02 23:59:00,"energy","64 hour",39.454,48.703,56.717,65.443,74.194,"PhoebeBuffay",2022-11-05 16:00:00,NA,NA
2022-11-02 23:59:00,"energy","68 hour",39.454,48.703,56.717,65.443,74.194,"PhoebeBuffay",2022-11-05 20:00:00,NA,NA
2022-11-02 23:59:00,"energy","37 hour",54.567,64.956,66.96,71.152,75.454,"power_benchmark",2022-11-04 13:00:00,NA,NA
2022-11-02 23:59:00,"energy","41 hour",49.942,59.542,61.777,67.476,72.406,"power_benchmark",2022-11-04 17:00:00,NA,NA
2022-11-02 23:59:00,"energy","45 hour",50.564,55.691,58.693,64.572,68.136,"power_benchmark",2022-11-04 21:00:00,NA,NA
2022-11-02 23:59:00,"energy","61 hour",52.16,54.998,56.538,60.798,63.995,"power_benchmark",2022-11-05 13:00:00,NA,NA
2022-11-02 23:59:00,"energy","65 hour",48.178,50.648,52.254,57.193,63.038,"power_benchmark",2022-11-05 17:00:00,NA,NA
2022-11-02 23:59:00,"energy","69 hour",46.399,49.374,52.068,57.09,60.392,"power_benchmark",2022-11-05 21:00:00,NA,NA
2022-11-02 23:59:00,"wind","36 hour",0.574,3.408,5.485,7.677,11.961,"W-EMOS",2022-11-03 12:00:00,NA,NA
2022-11-02 23:59:00,"wind","48 hour",1.257,8.023,13.219,18.767,29.673,"W-EMOS",2022-11-04 00:00:00,NA,NA
2022-11-02 23:59:00,"wind","60 hour",6.653,13.545,17.187,20.831,27.778,"W-EMOS",2022-11-04 12:00:00,NA,NA
2022-11-02 23:59:00,"wind","72 hour",1.903,6.64,9.388,12.169,17.495,"W-EMOS",2022-11-05 00:00:00,NA,NA
2022-11-02 23:59:00,"wind","84 hour",4.632,11.662,15.458,19.266,26.534,"W-EMOS",2022-11-05 12:00:00,NA,NA
2022-11-02 23:59:00,"wind","36 hour",1.007,2.825,3.385,4.4,5.809,"W-ENS",2022-11-03 12:00:00,NA,NA
2022-11-02 23:59:00,"wind","48 hour",1.411,4.67,8.86,11.832,23.468,"W-ENS",2022-11-04 00:00:00,NA,NA
2022-11-02 23:59:00,"wind","60 hour",7.226,11.398,12.955,16.825,20.566,"W-ENS",2022-11-04 12:00:00,NA,NA
2022-11-02 23:59:00,"wind","72 hour",3.3,5.692,6.91,8.562,12.857,"W-ENS",2022-11-05 00:00:00,NA,NA
2022-11-02 23:59:00,"wind","84 hour",2.861,10.515,12.71,14.162,20.276,"W-ENS",2022-11-05 12:00:00,NA,NA
