forecast_date,target,horizon,q0.025,q0.25,q0.5,q0.75,q0.975
2022-11-09,DAX,1 day,-3.2443951542319294,-0.5445916060745848,0.08145195548525663,0.7178737956823777,2.755986013318279
2022-11-09,DAX,2 day,-4.214009293428953,-0.8442960514924547,0.11387638570123926,1.0161678548878061,3.5592029342396754
2022-11-09,DAX,5 day,-5.303069529848403,-0.8941545275788609,0.17326813212967807,1.2962013052173926,4.628696965151875
2022-11-09,DAX,6 day,-6.3822285974625625,-1.0489407409679963,0.24230479176576836,1.5101205600644096,5.367396415217598
2022-11-09,DAX,7 day,-6.890928795064694,-1.1042098825691404,0.3990926451685972,1.6360550100142035,5.668726944716766
