forecast_date,target,horizon,q0.025,q0.25,q0.5,q0.75,q0.975
2023-02-01,DAX,1 day,-2.135767995165899,-0.5571731615612764,0.0729055250711773,0.7028518466553713,2.1678254642727945
2023-02-01,DAX,2 day,-2.427139198047664,-0.6435402248550094,0.1086934890304055,0.828872347380501,2.449745359839533
2023-02-01,DAX,5 day,-3.319070177837843,-0.849654145380675,0.1840119335899955,1.1707292489512835,3.4481601411840384
2023-02-01,DAX,6 day,-3.6700159645261463,-0.8646376274368286,0.2396222549216733,1.3240875266890044,3.829437352038308
2023-02-01,DAX,7 day,-4.644298344243554,-1.1725773580466083,0.31475672307475,1.7723101007873745,4.870801161253442
2023-02-01,energy,36 hour,62.46766742017724,68.00870670680557,68.99080887445223,70.19127419745398,74.16155892709355
2023-02-01,energy,40 hour,57.888291121415676,63.385728118831395,64.45405182747656,65.66398134162604,69.81364366079548
2023-02-01,energy,44 hour,55.98531726033012,60.40337337040393,61.58230278562094,62.425207226509414,66.31329830113606
2023-02-01,energy,60 hour,54.35635278365163,57.53357206377113,58.47845712516132,60.60148836240164,65.11702258684429
2023-02-01,energy,64 hour,50.632756027907774,53.76637301881468,54.79747962120336,56.9299750495914,61.62488686356392
2023-02-01,energy,68 hour,50.45058058902004,52.504816692585045,53.64652900154555,55.41199935667261,59.84533992610232
2023-02-01,wind,36 hour,NA,NA,NA,NA,NA
2023-02-01,wind,48 hour,NA,NA,NA,NA,NA
2023-02-01,wind,60 hour,NA,NA,NA,NA,NA
2023-02-01,wind,72 hour,NA,NA,NA,NA,NA
2023-02-01,wind,84 hour,NA,NA,NA,NA,NA
