"","forecast_date","target","horizon","q0.025","q0.25","q0.5","q0.75","q0.975"
"1",2022-11-02,"DAX","1 day",-2.84053971341132,-0.693404127079271,0.0711155891300725,0.839403023448391,2.91948575376909
"2",2022-11-02,"DAX","2 day",-3.40478114785718,-0.899947536989736,0.0850809004004996,1.14866196975876,3.32838008078612
"8",2022-11-02,"DAX","5 day",-3.82323230404574,-1.06280284576195,0.223265356533372,1.38063402217808,4.0242282293833
"9",2022-11-02,"DAX","6 day",-4.3394610982539,-1.12434217175363,0.340718779171776,1.64252837260648,4.0664119358688
"14",2022-11-02,"DAX","7 day",-4.87524652459041,-1.41133351039474,0.46129150351851,1.63918648894471,4.24548419381455
"3",2022-11-02,"energy","36 hour",49.4992916666667,60.0875833333333,64.1886666666667,69.7911666666667,75.567625
"5",2022-11-02,"energy","40 hour",47.13515,57.0720833333333,61.2195,67.2928333333333,73.7519083333333
"6",2022-11-02,"energy","44 hour",47.0951083333333,54.9535833333333,59.9121666666667,66.8003333333333,72.3928
"10",2022-11-02,"energy","60 hour",48.75985,56.4545833333333,60.4073333333333,66.1364166666667,71.4415333333333
"12",2022-11-02,"energy","64 hour",45.838925,53.38675,57.4155,63.3530833333333,69.46625
"13",2022-11-02,"energy","68 hour",46.2862083333333,51.9315,56.8435,63.6881666666667,68.9521833333333
"4",2022-11-02,"wind","36 hour",1.61335323932408,3.85288060385553,5.91103357430325,8.46817282873458,14.7345029272629
"7",2022-11-02,"wind","48 hour",1.88277736723485,5.94479110820429,9.92960992998926,14.1134791206328,24.3540552931401
"11",2022-11-02,"wind","60 hour",4.96072803234119,9.75811401285698,12.5685784765138,16.3923145244445,24.743373636527
"15",2022-11-02,"wind","72 hour",3.12477288275464,5.78233098213055,8.08005835420959,10.9238266247729,17.6349628834111
"16",2022-11-02,"wind","84 hour",3.32724213448765,7.7367743618513,11.0107403970689,14.5473350448635,22.7325333267776
