forecast_date,target,horizon,q0.025,q0.25,q0.5,q0.75,q0.975
2022-12-21,DAX,1 day,-2.0739070374359576,-0.5300222969233844,0.0744323848048884,0.6439845950595275,1.8785957290391253
2022-12-21,DAX,2 day,-2.830512986314809,-0.7678233114147357,0.143107227413695,0.9581678803954472,2.543530975153627
2022-12-21,DAX,5 day,-3.471546297662496,-0.8921514300858886,0.2114549084920605,1.2159766351428634,3.0658425056357865
2022-12-21,DAX,6 day,-3.934667637833861,-1.0139404567331882,0.2818880030150552,1.433002155928875,3.5921173814640204
2022-12-21,DAX,7 day,-4.319684376345065,-1.1212451902885148,0.3693710445463167,1.664659821660148,3.87037948339932
2022-12-21,energy,36 hour,5.069201351252012e-05,6.55446249983348e-05,6.942737824094296e-05,7.162151226949692e-05,7.696243037895625e-05
2022-12-21,energy,40 hour,4.6595709465642454e-05,6.131193749898672e-05,6.542985522365571e-05,6.764982054513694e-05,7.332453481516987e-05
2022-12-21,energy,44 hour,4.6975721849749804e-05,5.9497124998258424e-05,6.386665774428844e-05,6.533697109746934e-05,7.050478164612504e-05
2022-12-21,energy,60 hour,4.645651464343909e-05,5.640256249857321e-05,6.023524671578407e-05,6.428914971852304e-05,7.072518986718403e-05
2022-12-21,energy,64 hour,4.236021059656143e-05,5.2169874999225136e-05,5.623772369849682e-05,6.031745799416304e-05,6.708729430339764e-05
2022-12-21,energy,68 hour,4.274022298066877e-05,5.035506249849684e-05,5.467452621912956e-05,5.800460854649544e-05,6.42675411343528e-05
2022-12-21,wind,36 hour,NA,NA,NA,NA,NA
2022-12-21,wind,48 hour,NA,NA,NA,NA,NA
2022-12-21,wind,60 hour,NA,NA,NA,NA,NA
2022-12-21,wind,72 hour,NA,NA,NA,NA,NA
2022-12-21,wind,84 hour,NA,NA,NA,NA,NA
