"","forecast_date","target","horizon","q0.025","q0.25","q0.5","q0.75","q0.975"
"1",2023-01-18,"DAX","1 day",-2.09204330231221,-0.489332787314122,0.0855230195415764,0.64960312340127,2.04356966878425
"2",2023-01-18,"DAX","2 day",-2.58837990877999,-0.636800449292183,0.127808855558182,0.823940391228831,2.52985691840864
"8",2023-01-18,"DAX","5 day",-3.07899934811589,-0.701785398487861,0.165123646797322,1.0610027464706,3.07177062479563
"9",2023-01-18,"DAX","6 day",-3.29595144315651,-0.764189472596302,0.206145118972775,1.29518472569317,3.49254238473827
"14",2023-01-18,"DAX","7 day",-3.60883115320885,-0.786341836448814,0.19365917395847,1.47104581347083,3.74617771909478
"3",2023-01-18,"energy","36 hour",60.1423784689845,65.4171665082823,67.8386092898552,70.0885048381858,74.2769679250069
"5",2023-01-18,"energy","40 hour",57.2078801166458,62.5390725347171,65.0779940070878,67.6102768627031,72.1690550499571
"6",2023-01-18,"energy","44 hour",54.4546410183738,59.1355693140164,61.445323467798,63.9186142083736,68.0576591114567
"10",2023-01-18,"energy","60 hour",52.5358658419219,56.0111606958267,58.0235914056133,60.1461483735315,63.677610513514
"12",2023-01-18,"energy","64 hour",50.2399904859451,53.8245524050773,55.7935273889528,57.9430364777715,61.6694517588387
"13",2023-01-18,"energy","68 hour",48.8484441093834,51.880281660771,54.1032326075514,56.5599685183862,59.9650319081207
"4",2023-01-18,"wind","36 hour",6.36400323307429,10.1937046613281,12.3138569598852,14.4824683602622,18.9640915469807
"7",2023-01-18,"wind","48 hour",0.947101267855264,2.83502398333816,4.48817813667364,6.31769163547024,9.83055897965485
"11",2023-01-18,"wind","60 hour",3.24152281476905,7.11362850491853,9.64504426696433,12.3378586928364,17.4515350018279
"15",2023-01-18,"wind","72 hour",2.1741248481802,4.84323697326998,6.9567559354857,9.55373677859011,14.7931316074406
"16",2023-01-18,"wind","84 hour",3.49678773326424,7.26317753348614,9.57494053844939,12.0124259625699,17.1146051400046
