"forecast_date","target","horizon","q0.025","q0.25","q0.5","q0.75","q0.975"
2023-01-25,"wind","36 hour",2.37472950824185,6.8304720694452,9.29392281632126,11.7713143888533,16.5045151685929
2023-01-25,"wind","48 hour",0.41725542961946,2.97951705593656,5.11706398204824,7.45497639371835,12.1083309825556
2023-01-25,"wind","60 hour",5.7704284174922,11.7590675122303,14.9234145696415,18.0900014423341,24.126889086025
2023-01-25,"wind","72 hour",4.11665683071588,9.01865574780785,11.6230670991439,14.2307911523927,19.2034645921366
2023-01-25,"wind","84 hour",4.5212831594107,10.1064081021835,13.0793478296649,16.0566509678801,21.7345593188715
