"model","target","horizon","forecast_date","q0.025","q0.25","q0.5","q0.75","q0.975","value","qscore_q0.025","qscore_q0.25","qscore_q0.5","qscore_q0.75","qscore_q0.975","mean_qscore","ae","interval_coverage_0.5","interval_coverage_0.95","scores_imputed"
"AmySantiago","DAX","1 day",2022-11-30,-2.20112153,-0.75596151,0.07038003,0.81423338,2.38306853,0.64568139888852,0.142340146444426,0.70082145444426,0.57530136888852,0.0842759905557399,0.0868693565555741,0.317921663377704,0.57530136888852,TRUE,TRUE,FALSE
"median_ensemble","DAX","1 day",2022-11-30,-1.9690667002836,-0.524205252259247,0.0804995203516734,0.689312054374287,2.13941564772225,0.64568139888852,0.130737404958606,0.584943325573884,0.565181878536847,0.0218153277428834,0.0746867124416866,0.275472929850781,0.565181878536847,TRUE,TRUE,FALSE
"JakePeralta","DAX","1 day",2022-11-30,-1.83348235410458,-0.638928678371461,-0.0121450456740468,0.614638587023367,1.80919226275649,0.64568139888852,0.123958187649655,0.642305038629991,0.657826444562567,0.0465642177977292,0.0581755431933983,0.305765886366668,0.657826444562567,FALSE,TRUE,FALSE
"PhoebeBuffay","DAX","1 day",2022-11-30,-3.15845100540869,-0.524205251892607,0.0974051869129688,0.717873797130819,2.7571313619777,0.64568139888852,0.19020662021486,0.584943325390563,0.548276211975551,0.0360961991211495,0.105572498154459,0.293018970971317,0.548276211975551,TRUE,TRUE,FALSE
"MadelineWuntsch","DAX","1 day",2022-11-30,-0.35,-0.13,0.2,0.51,0.61,0.64568139888852,0.049784069944426,0.38784069944426,0.44568139888852,0.20352209833278,0.0695787278326143,0.23128139888852,0.44568139888852,FALSE,FALSE,FALSE
"DAX_benchmark","DAX","1 day",2022-11-30,-3.15845100496706,-0.524205252259247,0.0974051876275972,0.717873795682378,2.75713136147251,0.64568139888852,0.190206620192779,0.584943325573883,0.548276211260923,0.0360961983969288,0.1055724981292,0.293018970710743,0.548276211260923,TRUE,TRUE,FALSE
"OlennaTyrell","DAX","1 day",2022-11-30,-1.67016202275561,-0.51886333310267,0.0852243606358084,0.689312054374287,1.84061074402723,0.64568139888852,0.115792171082207,0.582272365995595,0.560457038252712,0.0218153277428834,0.0597464672569355,0.268016674066066,0.560457038252712,TRUE,TRUE,FALSE
"JonSnow","DAX","1 day",2022-11-30,-2.72655380035329,-1.38192783396478,-1.0245909778499,1.30541200013965,2.75681902139336,0.64568139888852,0.168611759962091,1.01380461642665,1.67027237673842,0.329865300625565,0.105556881125242,0.657622186975594,1.67027237673842,TRUE,TRUE,FALSE
"Yoda","DAX","1 day",2022-11-30,-1.0933286042487,-0.43201434210435,0.664637449391308,0.43201434210435,1.0933286042487,0.64568139888852,0.0869505001568611,0.538847870496435,0.0189560505027875,0.320500585176255,0.0223823602680091,0.19752747332007,0.0189560505027875,FALSE,TRUE,FALSE
"mean_ensemble","DAX","1 day",2022-11-30,-2.01150989577073,-0.597082869972551,0.0334626102315785,0.707929604892554,2.03866887536591,0.64568139888852,0.132859564732963,0.621382134430536,0.612218788656942,0.0311241030020169,0.0696493738238695,0.293446792929265,0.612218788656942,TRUE,TRUE,FALSE
"GreyWorm","DAX","1 day",2022-11-30,-1.64951242579712,-0.511943352007579,0.0482890740483576,0.58503912828532,1.79498779435294,0.64568139888852,0.114759691234282,0.578812375448049,0.597392324840162,0.0909634059047999,0.057465319773221,0.287878623440103,0.597392324840162,FALSE,TRUE,FALSE
"PetyrBaelish","DAX","1 day",2022-11-30,-2.31647940555941,-0.606208841774903,0.0804995203516734,0.726368723041771,2.13941564772225,0.64568139888852,0.148108040222396,0.625945120331712,0.565181878536847,0.0403436620766252,0.0746867124416865,0.290853082721853,0.565181878536847,TRUE,TRUE,FALSE
"KhalDrogo","DAX","1 day",2022-11-30,-1.9690667002836,-0.543653174220462,0.0609839271036008,0.67445984603615,2.48367230107388,0.64568139888852,0.130737404958606,0.594667286554491,0.584697471784919,0.0143892235738147,0.0918995451092682,0.28327818639622,0.584697471784919,TRUE,TRUE,FALSE
"KhalDrogo","DAX","2 day",2022-11-30,-2.66822694711667,-0.803756704313059,0.195209614593568,1.06208830320785,2.94992702381937,0.915083776232173,0.179165536167442,0.859420240272616,0.719874161638605,0.0735022634878394,0.10174216237936,0.386740872789173,0.719874161638605,TRUE,TRUE,FALSE
"AmySantiago","DAX","2 day",2022-11-30,-3.12558413,-1.03707933,0.05731999,1.17791875,3.46407437,0.915083776232173,0.202033395311609,0.976081553116086,0.857763786232173,0.131417486883914,0.127449529688391,0.458949150246435,0.857763786232173,TRUE,TRUE,FALSE
"median_ensemble","DAX","2 day",2022-11-30,-2.66822694711667,-0.803756704313059,0.132960006856742,1.02690078258507,2.89586172981263,0.915083776232173,0.179165536167442,0.859420240272616,0.782123769375431,0.0559085031764486,0.0990388976790229,0.395131389334192,0.782123769375431,TRUE,TRUE,FALSE
"JakePeralta","DAX","2 day",2022-11-30,-1.77170277495179,-0.612241535478413,-0.0038709428359674,0.604499649806479,1.76396088927986,0.915083776232173,0.134339327559198,0.763662655855293,0.91895471906814,0.465876189638541,0.0424438556523841,0.465055349554712,0.91895471906814,FALSE,TRUE,FALSE
"PhoebeBuffay","DAX","2 day",2022-11-30,-4.13198489660203,-0.824249687620293,0.132960008806116,1.02690078258507,3.5704923306664,0.915083776232173,0.25235343364171,0.869666731926233,0.782123767426057,0.0559085031764495,0.132770427721712,0.418564572778432,0.782123767426057,TRUE,TRUE,FALSE
"MadelineWuntsch","DAX","2 day",2022-11-30,-1.53,-0.56,0.11,0.34,1.31,0.915083776232173,0.122254188811609,0.737541888116086,0.805083776232173,0.862625664348259,0.0197458111883914,0.509450265739304,0.805083776232173,FALSE,TRUE,FALSE
"DAX_benchmark","DAX","2 day",2022-11-30,-4.13198489753049,-0.824249689649381,0.132960006856742,1.02690078320791,3.57049232679329,0.915083776232173,0.252353433688133,0.869666732940777,0.782123769375431,0.055908503487867,0.132770427528056,0.418564573404053,0.782123769375431,TRUE,TRUE,FALSE
"OlennaTyrell","DAX","2 day",2022-11-30,-2.06382426259814,-0.591950087055805,0.180343918112069,0.952637923279943,2.42451209882228,0.915083776232173,0.148945401941516,0.753516931643989,0.734739858120104,0.0187770735238851,0.0754714161295054,0.3462901362718,0.734739858120104,TRUE,TRUE,FALSE
"JonSnow","DAX","2 day",2022-11-30,-4.20392207419215,-2.01622177532084,-1.46442811224872,1.82024833693324,3.51439156313622,0.915083776232173,0.255950292521216,1.4656527757765,2.37951188848089,0.452582280350533,0.129965389345203,0.936732525294869,2.37951188848089,TRUE,TRUE,FALSE
"Yoda","DAX","2 day",2022-11-30,-1.51725084009383,-0.599521608547713,0.922340936227251,0.599521608547713,1.51725084009383,0.915083776232173,0.1216167308163,0.757302692389943,0.00725715999507837,0.473343251526689,0.0301083531930828,0.277925637584219,0.00725715999507837,FALSE,TRUE,FALSE
"mean_ensemble","DAX","2 day",2022-11-30,-2.73494136201967,-0.852376204028886,0.0342844892750338,0.933544267308558,2.60371760661526,0.915083776232173,0.182501256912592,0.883729990130529,0.880799286957139,0.00923024553819257,0.0844316915191544,0.408138494211521,0.880799286957139,TRUE,TRUE,FALSE
"GreyWorm","DAX","2 day",2022-11-30,-1.716118255459,-0.617634421176205,-0.0424501092190687,0.56702270689319,1.65993050034396,0.915083776232173,0.131560101584559,0.766359098704189,0.957533885451242,0.522091604008474,0.0372423362055894,0.482957405190811,0.957533885451242,FALSE,TRUE,FALSE
"PetyrBaelish","DAX","2 day",2022-11-30,-3.22375590367222,-0.88923340515604,0.156744071733379,1.09124809593274,2.89586172981263,0.915083776232173,0.20694198399522,0.902158590694107,0.758339704498794,0.0880821598502833,0.0990388976790227,0.410912267343485,0.758339704498794,TRUE,TRUE,FALSE
"PetyrBaelish","DAX","5 day",2022-11-30,-3.96251357441404,-1.03007249687048,0.225613419226396,1.38277334061553,3.47390705194532,0.350639471286129,0.215657652285008,0.690355984078306,0.125026052059734,0.516066934664701,0.15616337903296,0.340654000424142,0.125026052059734,TRUE,TRUE,FALSE
"KhalDrogo","DAX","5 day",2022-11-30,-2.78685063113451,-0.951987964096691,0.290782391999156,1.31214989062168,3.08995032237327,0.350639471286129,0.156874505121032,0.65131371769141,0.0598570792869733,0.480755209667776,0.136965542554357,0.29715321086431,0.0598570792869733,TRUE,TRUE,FALSE
"AmySantiago","DAX","5 day",2022-11-30,-4.07317916,-1.40221266,-0.03048627,1.37227641,3.99027277,0.350639471286129,0.221190931564306,0.876426065643065,0.381125741286129,0.510818469356935,0.181981664935694,0.434308574557226,0.381125741286129,TRUE,TRUE,FALSE
"median_ensemble","DAX","5 day",2022-11-30,-2.78685063113451,-0.743701026664505,0.225613419226396,1.30216472555289,3.22775991451581,0.350639471286129,0.156874505121032,0.547170248975317,0.125026052059733,0.47576262713338,0.143856022161484,0.289737891090189,0.125026052059733,TRUE,TRUE,FALSE
"JakePeralta","DAX","5 day",2022-11-30,-1.79119561213244,-0.585274388701504,0.0474738088251358,0.680222006351776,1.88614322978271,0.350639471286129,0.107091754170929,0.467956929993817,0.303165662460994,0.164791267532823,0.0767751879248293,0.223956160416678,0.303165662460994,TRUE,TRUE,FALSE
"PhoebeBuffay","DAX","5 day",2022-11-30,-5.27475891595438,-0.87953514817416,0.189690424830058,1.30216472555289,4.62869696633333,0.350639471286129,0.281269919362025,0.615087309730145,0.160949046456071,0.47576262713338,0.21390287475236,0.349394355486796,0.160949046456071,TRUE,TRUE,FALSE
"MadelineWuntsch","DAX","5 day",2022-11-30,-1.19,-0.49,0.35,0.68,1.05,0.350639471286129,0.0770319735643065,0.420319735643065,0.000639471286129401,0.164680264356935,0.0349680264356936,0.139527894257226,0.000639471286129401,TRUE,TRUE,FALSE
"DAX_benchmark","DAX","5 day",2022-11-30,-5.27475891574504,-0.87953514376391,0.189690426952538,1.30216472611129,4.62869696515187,0.350639471286129,0.281269919351558,0.61508730752502,0.160949044333591,0.475762627412579,0.213902874693287,0.349394354663207,0.160949044333591,TRUE,TRUE,FALSE
"OlennaTyrell","DAX","5 day",2022-11-30,-2.68156413857909,-0.743701026664505,0.273097887968363,1.28989680260123,3.22775991451581,0.350639471286129,0.151610180493261,0.547170248975317,0.0775415833177664,0.46962866565755,0.143856022161484,0.277961340121076,0.0775415833177664,TRUE,TRUE,FALSE
"JonSnow","DAX","5 day",2022-11-30,-4.92921239829362,1.4199180909511,1.72178281908308,2.2057848356573,4.22851929584737,0.350639471286129,0.263992593478988,1.60391792949746,1.37114334779695,0.927572682185585,0.193893991228062,0.872104108837409,1.37114334779695,FALSE,TRUE,FALSE
"Yoda","DAX","5 day",2022-11-30,-1.01557912836034,-0.401292664701653,0.617373330310235,0.401292664701653,1.01557912836034,0.350639471286129,0.0683109299823233,0.375966067993891,0.266733859024106,0.0253265967077617,0.0332469828537104,0.153916887312358,0.266733859024106,TRUE,TRUE,FALSE
"mean_ensemble","DAX","5 day",2022-11-30,-3.14251426008324,-0.598514715817856,0.346986174853067,1.13053849058355,2.97779643693117,0.350639471286129,0.174657686568468,0.474577093551993,0.00365329643306239,0.38994950964871,0.131357848282252,0.234839086896897,0.00365329643306239,TRUE,TRUE,FALSE
"GreyWorm","DAX","5 day",2022-11-30,-1.58804438630221,-0.639968471974613,-0.0581703158112329,0.507197994205717,1.5362351619329,0.350639471286129,0.0969341928794171,0.495303971630371,0.408809787097362,0.0782792614597938,0.0592797845323385,0.227721399519857,0.408809787097362,TRUE,TRUE,FALSE
"GreyWorm","DAX","6 day",2022-11-30,-2.03725890141753,-0.632306073694585,-0.0243845796335516,0.574010182702532,1.81030774833854,-0.374733752211931,0.0831262574602801,0.128786160741327,0.350349172578379,0.474371967457231,0.109252075027524,0.229177126652948,0.350349172578379,TRUE,TRUE,FALSE
"PetyrBaelish","DAX","6 day",2022-11-30,-4.51554867837627,-1.1898922968897,0.284571705021952,1.61735414024153,4.02093309255258,-0.374733752211931,0.207040746308217,0.407579272338887,0.659305457233883,0.99604394622673,0.219783342238226,0.497950552869188,0.659305457233883,TRUE,TRUE,FALSE
"KhalDrogo","DAX","6 day",2022-11-30,-3.47818565085795,-1.03928417226618,0.291876566972106,1.59331215095936,5.35479133551064,-0.374733752211931,0.155172594932301,0.332275210027125,0.666610319184036,0.984022951585643,0.286476254386129,0.484911466023047,0.666610319184036,TRUE,TRUE,FALSE
"AmySantiago","DAX","6 day",2022-11-30,-4.44414887,-1.3584743,0.17365202,1.63752018,4.49633735,-0.374733752211931,0.203470755889403,0.491870273894034,0.548385772211931,1.00612696610597,0.243553555110597,0.498681464642386,0.548385772211931,TRUE,TRUE,FALSE
"median_ensemble","DAX","6 day",2022-11-30,-3.47818565085795,-0.676387954964409,0.284571705021952,1.53339061899578,4.02093309255258,-0.374733752211931,0.155172594932301,0.150827101376239,0.659305457233883,0.954062185603855,0.219783342238226,0.427830136276901,0.659305457233883,TRUE,TRUE,FALSE
"JakePeralta","DAX","6 day",2022-11-30,-1.77640613259112,-0.550289442722361,0.0930553383442768,0.736400119410915,1.96251680927968,-0.374733752211931,0.0700836190189596,0.0877778452552152,0.467789090556208,0.555566935811423,0.11686252807458,0.259616003743277,0.467789090556208,TRUE,TRUE,FALSE
"PhoebeBuffay","DAX","6 day",2022-11-30,-6.28262879961787,-1.01601902036079,0.273944112026214,1.53339061899578,5.36739641108034,-0.374733752211931,0.295394752370297,0.320642634074431,0.648677864238145,0.954062185603854,0.287106508164614,0.501176788890268,0.648677864238145,TRUE,TRUE,FALSE
"MadelineWuntsch","DAX","6 day",2022-11-30,-1.54,-0.43,0.44,0.93,1.25,-0.374733752211931,0.0582633123894035,0.0276331238940345,0.814733752211931,0.652366876105966,0.0812366876105966,0.326846750442386,0.814733752211931,TRUE,TRUE,FALSE
"DAX_benchmark","DAX","6 day",2022-11-30,-6.28262880068359,-1.0110363507823,0.273944111030389,1.53339062024926,5.3673964152176,-0.374733752211931,0.295394752423583,0.318151299285185,0.64867786324232,0.954062186230598,0.287106508371477,0.500678521910632,0.64867786324232,TRUE,TRUE,FALSE
"OlennaTyrell","DAX","6 day",2022-11-30,-2.61947344714756,-0.676387954964409,0.343151148361992,1.36269025168839,3.30577574387155,-0.374733752211931,0.112236984746781,0.150827101376239,0.717884900573923,0.868712001950161,0.184025474804174,0.406737292690256,0.717884900573923,TRUE,TRUE,FALSE
"JonSnow","DAX","6 day",2022-11-30,-5.87247088040818,1.68115317780826,1.97285949255137,2.50025095809092,4.71393463508726,-0.374733752211931,0.274886856409813,3.08383039503028,2.3475932447633,1.43749235515143,0.25443341936496,1.47964725414396,2.3475932447633,FALSE,TRUE,FALSE
"Yoda","DAX","6 day",2022-11-30,-1.57061798741601,-0.620608931197815,0.954782971073562,0.620608931197815,1.57061798741601,-0.374733752211931,0.0597942117602039,0.122937589492942,1.32951672328549,0.497671341704873,0.0972675869813971,0.421437490644982,1.32951672328549,TRUE,TRUE,FALSE
"mean_ensemble","DAX","6 day",2022-11-30,-3.67448801350146,-0.622104124097263,0.461586625977119,1.3308116503215,3.56545522985038,-0.374733752211931,0.164987713064476,0.123685185942666,0.83632037818905,0.852772701266715,0.197009449103116,0.434955085513205,0.83632037818905,TRUE,TRUE,FALSE
"mean_ensemble","DAX","7 day",2022-11-30,-3.9280257167883,-1.10176236081756,0.49034399443429,1.40434352615955,3.73697672985734,-0.948074073933647,0.148997582142733,0.0768441434419566,1.43841806836794,1.1762088000466,0.23425254018955,0.614944226837755,1.43841806836794,TRUE,TRUE,FALSE
"GreyWorm","DAX","7 day",2022-11-30,-1.82706416139172,-0.637587461407044,-0.0322113816344573,0.588330347067442,1.8212871382477,-0.948074073933647,0.0439495043729036,0.465729918789904,0.915862692299189,0.768202210500544,0.138468060609068,0.466442477314322,0.915862692299189,FALSE,TRUE,FALSE
"PetyrBaelish","DAX","7 day",2022-11-30,-5.00741090257001,-1.33677674214171,0.379309275859833,1.86245789730993,4.37408692718866,-0.948074073933647,0.202966841431818,0.194351334104032,1.32738334979348,1.40526598562179,0.266108050056115,0.679215112201447,1.32738334979348,TRUE,TRUE,FALSE
"KhalDrogo","DAX","7 day",2022-11-30,-3.78964664608942,-1.20082183416288,0.449766294108703,1.74383120525311,4.55634904690459,-0.948074073933647,0.142078628607788,0.126373880114615,1.39784036804235,1.34595263959338,0.275221156041912,0.657493334480009,1.39784036804235,TRUE,TRUE,FALSE
"AmySantiago","DAX","7 day",2022-11-30,-5.01428708,-1.48913743,0.20870091,1.87252681,5.06655004,-0.948074073933647,0.203310650303318,0.270531678033177,1.15677498393365,1.41030044196682,0.300731205696683,0.668329791986729,1.15677498393365,TRUE,TRUE,FALSE
"median_ensemble","DAX","7 day",2022-11-30,-3.78964664608942,-1.08526790900125,0.414260978758474,1.68104193479119,4.37408692718866,-0.948074073933647,0.142078628607789,0.0685969175338016,1.36233505269212,1.31455800436242,0.266108050056116,0.630735330650449,1.36233505269212,TRUE,TRUE,FALSE
"JakePeralta","DAX","7 day",2022-11-30,-1.83914309240735,-0.593118162088133,0.0606724947257743,0.714463151539682,1.9604880818589,-0.948074073933647,0.0445534509236853,0.532433867768271,1.00874656865942,0.831268612736664,0.145428107789628,0.512486121575534,1.00874656865942,FALSE,TRUE,FALSE
"PhoebeBuffay","DAX","7 day",2022-11-30,-6.73574196916958,-1.09164649900868,0.414260982912218,1.68104193479119,6.25993408865678,-0.948074073933647,0.289383394761797,0.0717862125375168,1.36233505684586,1.31455800436242,0.360400408129522,0.679692615327424,1.36233505684586,TRUE,TRUE,FALSE
"MadelineWuntsch","DAX","7 day",2022-11-30,-1.68,-0.48,0.06,0.59,0.98,-0.948074073933647,0.0365962963033177,0.70211111090047,1.00807407393365,0.769037036966823,0.0964037036966824,0.522444444360188,1.00807407393365,FALSE,TRUE,FALSE
"DAX_benchmark","DAX","7 day",2022-11-30,-6.73574196413719,-1.08526790900125,0.414260978758474,1.68104193482534,6.25993408587484,-0.948074073933647,0.289383394510177,0.068596917533803,1.36233505269212,1.3145580043795,0.360400407990425,0.679054755421204,1.36233505269212,TRUE,TRUE,FALSE
"OlennaTyrell","DAX","7 day",2022-11-30,-2.51644798873025,-0.572077022312758,0.448136570763839,1.46835016384044,3.41272113025793,-0.948074073933647,0.0784186957398302,0.563995577431333,1.39621064469749,1.20821211888704,0.218039760209579,0.692975359393054,1.39621064469749,FALSE,TRUE,FALSE
"JonSnow","DAX","7 day",2022-11-30,-6.73289629425844,-3.10745940683649,2.18243627169175,2.72024184109375,5.08549070352407,-0.948074073933647,0.28924111101624,1.07969266645142,3.13051034562539,1.8341579575137,0.301678238872886,1.32705606389593,3.13051034562539,TRUE,TRUE,FALSE
"Yoda","DAX","7 day",2022-11-30,-1.32990278591729,-0.525493502034189,0.80845154159106,0.525493502034189,1.32990278591729,-0.948074073933647,0.0190914355991823,0.633870857849187,1.75652561552471,0.736783787983918,0.113898842992547,0.652034107989908,1.75652561552471,FALSE,TRUE,FALSE
"AmySantiago","wind","36 hour",2022-11-30,7.53845657,13.35299293,16.24046277,17.1912131,22.56454849,11.52,0.1990771715,2.749489395,4.72046277,2.83560655,0.552227424500001,2.2113726622,4.72046277,FALSE,TRUE,FALSE
"W-EMOS","wind","36 hour",2022-11-30,7.98653414936099,12.6267258966125,15.0617890076245,17.4968870356773,22.137840111584,11.52,0.17667329253195,1.66008884491875,3.5417890076245,2.98844351783865,0.530892005579201,1.77957733369861,3.5417890076245,FALSE,TRUE,FALSE
"mean_ensemble","wind","36 hour",2022-11-30,8.0246934901803,12.7258347014164,14.7469363429067,16.6240470317021,20.4259213808763,11.52,0.174765325490985,1.8087520521246,3.2269363429067,2.55202351585105,0.445296069043815,1.64155466108343,3.2269363429067,FALSE,TRUE,FALSE
"KhalDrogo","wind","36 hour",2022-11-30,8.21036568108897,14.5888692684925,15.7943342008349,17.8307866919915,20.2320126515285,11.52,0.165481715945551,4.60330390273876,4.27433420083494,3.15539334599574,0.435600632576426,2.52682275961828,4.27433420083494,FALSE,TRUE,FALSE
"W-ENS","wind","36 hour",2022-11-30,9.15025,11.005,11.95,13.21,14.14125,11.52,0.1184875,0.257499999999999,0.43,0.845000000000001,0.1310625,0.35641,0.43,TRUE,TRUE,FALSE
"median_ensemble","wind","36 hour",2022-11-30,7.98653414936099,12.6267258966125,15.0617890076245,17.3440500678386,21.7399385160725,11.52,0.17667329253195,1.66008884491875,3.5417890076245,2.9120250339193,0.510996925803625,1.76031462095963,3.5417890076245,FALSE,TRUE,FALSE
"PhoebeBuffay","wind","36 hour",2022-11-30,7.98653414936099,12.6267258966125,15.0617890076245,17.4968870356773,22.137840111584,11.52,0.176673292531951,1.66008884491869,3.54178900762448,2.98844351783864,0.530892005579203,1.77957733369859,3.54178900762448,FALSE,TRUE,FALSE
"MadelineWuntsch","wind","36 hour",2022-11-30,7.27602039127086,12.1546942167807,14.3732430713563,16.5185083268667,21.342036920561,11.52,0.212198980436457,0.95204132517109,2.85324307135626,2.49925416343334,0.491101846028049,1.40156787728504,2.85324307135626,FALSE,TRUE,FALSE
"AmySantiago","wind","48 hour",2022-11-30,5.36616329,9.9407868,13.38889784,14.88595303,19.31697442,9.36,0.1996918355,0.8711802,4.02889784,2.762976515,0.497848721000001,1.6721190223,4.02889784,FALSE,TRUE,FALSE
"W-EMOS","wind","48 hour",2022-11-30,4.31164387565688,9.50347689749666,12.2633987318227,15.0269892876942,20.2970163571616,9.36,0.252417806217156,0.21521534624499,2.9033987318227,2.8334946438471,0.54685081785808,1.35027546919801,2.9033987318227,FALSE,TRUE,FALSE
"mean_ensemble","wind","48 hour",2022-11-30,4.72113641673825,9.73009199654649,12.1460016582874,14.3991147760598,19.5958548725206,9.36,0.231943179163087,0.555137994819735,2.7860016582874,2.5195573880299,0.511792743626031,1.32088659278523,2.7860016582874,FALSE,TRUE,FALSE
"KhalDrogo","wind","48 hour",2022-11-30,5.48717672256673,12.4074664935951,13.2730894101745,15.6366301293652,24.6775077355025,9.36,0.193641163871664,4.57119974039265,3.91308941017454,3.13831506468262,0.765875386775123,2.51642415317932,3.91308941017454,FALSE,TRUE,FALSE
"W-ENS","wind","48 hour",2022-11-30,4.68,7.855,10.075,11.49,12.41025,9.36,0.234,0.7525,0.715,1.065,0.1525125,0.5838025,0.715,TRUE,TRUE,FALSE
"median_ensemble","wind","48 hour",2022-11-30,4.49582193782844,9.50347689749666,12.2633987318227,14.9564711588471,20.2970163571616,9.36,0.243208903108578,0.21521534624499,2.9033987318227,2.79823557942355,0.54685081785808,1.34138187569158,2.9033987318227,FALSE,TRUE,FALSE
"PhoebeBuffay","wind","48 hour",2022-11-30,4.31164387565688,9.50347689749666,12.2633987318227,15.0269892876942,20.2970163571616,9.36,0.252417806217156,0.215215346244995,2.90339873182266,2.83349464384709,0.546850817858082,1.350275469198,2.90339873182266,FALSE,TRUE,FALSE
"MadelineWuntsch","wind","48 hour",2022-11-30,4.17019073654899,9.17034489069052,11.6122252359046,14.328126921605,20.5763643652977,9.36,0.259490463172551,0.0948275546547386,2.25222523590456,2.48406346080249,0.560818218264887,1.13028498655984,2.25222523590456,TRUE,TRUE,FALSE
"AmySantiago","wind","60 hour",2022-11-30,4.99299546,9.78122686,12.36493771,16.40688036,25.16600501,7.92,0.146350227,2.79184029,4.44493771,4.24344018,0.862300250500001,2.4977737315,4.44493771,FALSE,TRUE,FALSE
"W-EMOS","wind","60 hour",2022-11-30,7.43552913848709,12.8564324538648,15.7034800803846,18.5507973533635,23.9775716833812,7.92,0.0242235430756455,7.4046486807972,7.7834800803846,5.31539867668175,0.802878584169061,4.26612591302165,7.7834800803846,FALSE,TRUE,FALSE
"mean_ensemble","wind","60 hour",2022-11-30,6.99652721485511,12.0878175476387,14.540358551242,17.2567450828965,22.6677764305393,7.92,0.0461736392572445,6.25172632145805,6.620358551242,4.66837254144825,0.737388821526966,3.6648039749865,6.620358551242,FALSE,TRUE,FALSE
"KhalDrogo","wind","60 hour",2022-11-30,7.34611332534874,12.9785641709523,15.7391416017331,18.1331967859238,22.3136856941913,7.92,0.0286943337325631,7.58784625642844,7.81914160173315,5.10659839296188,0.719684284709563,4.25239297391312,7.81914160173315,FALSE,TRUE,FALSE
"W-ENS","wind","60 hour",2022-11-30,7.90525,11.6,12.73,14.1525,17.4145,7.92,0.000737500000000013,5.52,4.81,3.11625,0.474725,2.7843425,4.81,FALSE,TRUE,FALSE
"median_ensemble","wind","60 hour",2022-11-30,7.39082123191791,12.6553409005075,15.3522959576671,17.9397477153259,23.5674480978317,7.92,0.0264589384041045,7.10301135076125,7.4322959576671,5.00987385766295,0.782372404891586,4.0708025018774,7.4322959576671,FALSE,TRUE,FALSE
"PhoebeBuffay","wind","60 hour",2022-11-30,7.43552913848709,12.8564324538648,15.7034800803846,18.5507973533635,23.9775716833812,7.92,0.0242235430756454,7.40464868079726,7.78348008038455,5.31539867668173,0.802878584169062,4.26612591302165,7.78348008038455,FALSE,TRUE,FALSE
"MadelineWuntsch","wind","60 hour",2022-11-30,6.86374622680777,12.4542493471502,15.0011118349497,17.746298644728,23.1573245122822,7.92,0.0528126886596117,6.80137402072536,7.08111183494973,4.913149322364,0.76186622561411,3.92206281846256,7.08111183494973,FALSE,TRUE,FALSE
"AmySantiago","wind","72 hour",2022-11-30,5.00336116,7.36982093,12.00845758,14.66303806,22.4550425,13.32,0.415831942,2.975089535,1.31154242,0.67151903,0.456752125,1.1661470104,1.31154242,TRUE,TRUE,FALSE
"W-EMOS","wind","72 hour",2022-11-30,5.42891776238057,10.3574737661083,12.9529065583673,15.5492868793413,20.4983757695517,13.32,0.394554111880972,1.48126311694585,0.367093441632701,1.11464343967065,0.358918788477585,0.743294579721552,0.367093441632701,TRUE,TRUE,FALSE
"mean_ensemble","wind","72 hour",2022-11-30,5.77057916205141,9.81909904409401,12.3838684907175,14.5997050791255,19.9341906804166,13.32,0.37747104189743,1.750450477953,0.9361315092825,0.639852539562749,0.33070953402083,0.806923020543301,0.9361315092825,TRUE,TRUE,FALSE
"KhalDrogo","wind","72 hour",2022-11-30,7.75173956718478,11.7546959443622,13.7093258241499,15.1682125387939,20.3227385861465,13.32,0.278413021640761,0.782652027818881,0.389325824149891,0.924106269396956,0.350136929307326,0.544926814462763,0.389325824149891,TRUE,TRUE,FALSE
"W-ENS","wind","72 hour",2022-11-30,6.31375,9.215,10.38,11.3575,14.2445,13.32,0.3503125,2.0525,2.94,2.94375,0.046225,1.6665575,2.94,FALSE,TRUE,FALSE
"median_ensemble","wind","72 hour",2022-11-30,5.42891776238057,10.1088018120467,12.6262604908938,15.2395593280352,20.4983757695517,13.32,0.394554111880972,1.60559909397665,0.6937395091062,0.9597796640176,0.358918788477585,0.802518233491801,0.6937395091062,TRUE,TRUE,FALSE
"PhoebeBuffay","wind","72 hour",2022-11-30,5.42891776238057,10.3574737661083,12.9529065583673,15.5492868793413,20.4983757695517,13.32,0.394554111880972,1.48126311694583,0.367093441632701,1.11464343967064,0.358918788477583,0.743294579721546,0.367093441632701,TRUE,TRUE,FALSE
"MadelineWuntsch","wind","72 hour",2022-11-30,4.69678872036254,9.86012985798517,12.2996144234202,15.3109061172764,21.5861114572497,13.32,0.431160563981873,1.72993507100741,1.02038557657978,0.995453058638216,0.413305572862487,0.918047968613955,1.02038557657978,TRUE,TRUE,FALSE
"AmySantiago","wind","84 hour",2022-11-30,4.60672951,8.33705044,9.02538442,13.07894757,24.92441166,15.48,0.5436635245,3.57147478,6.45461558,3.601578645,0.472220583,2.9287106225,6.45461558,FALSE,TRUE,FALSE
"W-EMOS","wind","84 hour",2022-11-30,6.93252583818609,12.9263458491682,16.0800684977873,19.2346711908316,25.2475904329418,15.48,0.427373708090695,1.2768270754159,0.600068497787298,1.8773355954158,0.48837952164709,0.933996879671357,0.600068497787298,TRUE,TRUE,FALSE
"mean_ensemble","wind","84 hour",2022-11-30,6.50666474135876,11.3672305689622,13.7774343593113,17.1188011236119,24.5200829750167,15.48,0.448666762932062,2.0563847155189,1.7025656406887,0.819400561805949,0.452004148750835,1.09580436593929,1.7025656406887,TRUE,TRUE,FALSE
"KhalDrogo","wind","84 hour",2022-11-30,5.66761409591335,10.0350438833846,13.4851203900411,17.1563219226933,26.5569500767779,15.48,0.490619295204332,2.72247805830769,1.99487960995893,0.838160961346661,0.553847503838896,1.3199970857313,1.99487960995893,TRUE,TRUE,FALSE
"W-ENS","wind","84 hour",2022-11-30,8.34975,11.1725,12.465,15.38,20.0645,15.48,0.3565125,2.15375,3.015,0.149999999999999,0.229225,1.1808975,3.015,FALSE,TRUE,FALSE
"median_ensemble","wind","84 hour",2022-11-30,6.74168450202653,11.989298696026,14.5070423701467,17.8922583950041,25.1635228401902,15.48,0.436915774898674,1.745350651987,0.972957629853301,1.20612919750205,0.48417614200951,0.969105879250107,0.972957629853301,TRUE,TRUE,FALSE
"PhoebeBuffay","wind","84 hour",2022-11-30,6.93252583818613,12.9263458491682,16.0800684977873,19.2346711908316,25.2475904329418,15.48,0.427373708090694,1.27682707541589,0.600068497787287,1.87733559541582,0.48837952164709,0.933996879671355,0.600068497787287,TRUE,TRUE,FALSE
"MadelineWuntsch","wind","84 hour",2022-11-30,6.55084316586697,12.806097392052,15.5289643502523,18.6281948673149,25.0794552474386,15.48,0.446457841706652,1.33695130397399,0.0489643502523442,1.57409743365746,0.479972762371928,0.777288738392474,0.0489643502523442,TRUE,TRUE,FALSE
"AmySantiago","energy","36 hour",2022-11-30,71.12131223,73.2967701,74.43823525,75.57970039,77.75515827,70.65225,0.914671348500011,3.96678015000001,3.78598525000001,2.463725195,0.3551454135,2.29726147140001,3.78598525000001,FALSE,FALSE,FALSE
"power_benchmark","energy","36 hour",2022-11-30,54.56665,64.956,66.84,70.89925,75.454325,70.65225,0.80428,2.848125,3.81224999999999,0.1235,0.24010375,1.56565175,3.81224999999999,TRUE,TRUE,FALSE
"PetyrBaelish","energy","36 hour",2022-11-30,51.1335706223156,65.3835657275915,70.1768518505096,72.3083122637942,75.3959950298071,70.65225,0.975933968884218,2.63434213620424,0.475398149490346,0.828031131897127,0.237187251490355,1.03017852759326,0.475398149490346,TRUE,TRUE,FALSE
"median_ensemble","energy","36 hour",2022-11-30,54.5549825821966,67.4749898827426,69.5068948952762,72.3083122637942,75.9989583333334,70.65225,0.80486337089017,1.58863005862869,1.14535510472379,0.828031131897106,0.267335416666671,0.926843016561286,1.14535510472379,TRUE,TRUE,FALSE
"JonSnow","energy","36 hour",2022-11-30,17.5408363177552,32.7595602057216,67.9728936068147,103.186227007908,118.404950895874,70.65225,2.65557068411224,18.9463448971392,2.67935639318529,16.2669885039539,2.38763504479371,8.58717910463687,2.67935639318529,TRUE,TRUE,FALSE
"GreyWorm","energy","36 hour",2022-11-30,65.0129208958248,68.1001181838328,69.5068948952762,71.0727010794564,74.0673797776593,70.65225,0.281966455208759,1.27606590808359,1.14535510472376,0.210225539728214,0.170756488882965,0.616873899325459,1.14535510472376,TRUE,TRUE,FALSE
"Yoda","energy","36 hour",2022-11-30,54.5549825821966,69.4951906175166,71.5883921566527,73.172349043372,76.456692981178,70.65225,0.80486337089017,0.578529691241677,0.936142156652707,1.26004952168599,0.2902221490589,0.773961377905888,0.936142156652707,TRUE,TRUE,FALSE
"PhoebeBuffay","energy","36 hour",2022-11-30,46.3089760554266,60.9605770945818,68.6482883382971,76.3359995820123,90.9876006211675,70.65225,1.21716369722867,4.8458364527091,2.00396166170293,2.84187479100617,1.01676753105838,2.38512082674105,2.00396166170293,TRUE,TRUE,FALSE
"OlennaTyrell","energy","36 hour",2022-11-30,63.1323137254902,68.0588837209303,70.2706165644172,72.29825,75.9989583333334,70.65225,0.37599681372549,1.29668313953485,0.381633435582799,0.823,0.267335416666671,0.628929761101962,0.381633435582799,TRUE,TRUE,FALSE
"mean_ensemble","energy","36 hour",2022-11-30,52.9043750776736,63.387295059213,69.8446026633166,76.1974305025691,82.224005263361,70.65225,0.88739374611632,3.6324774703935,0.807647336683388,2.77259025128456,0.57858776316805,1.73573931352916,0.807647336683388,TRUE,TRUE,FALSE
"JakePeralta","energy","36 hour",2022-11-30,52.7678132700533,67.4749898827426,69.1592513078814,70.9240851565795,75.4949864612297,70.65225,0.894221836497333,1.58863005862869,1.49299869211862,0.135917578289771,0.242136823061486,0.870780997719181,1.49299869211862,TRUE,TRUE,FALSE
"JakePeralta","energy","40 hour",2022-11-30,52.7678132700533,67.4749898827426,69.1592513078814,70.9240851565795,75.4949864612297,68.1455,0.768884336497333,0.335255058628697,1.01375130788138,1.38929257828977,0.367474323061486,0.774931520871733,1.01375130788138,TRUE,TRUE,FALSE
"AmySantiago","energy","40 hour",2022-11-30,67.58178313,70.30053192,71.72706241,73.1535929,75.87234169,68.1455,0.0281858434999997,3.23254788,3.58156241,2.50404645,0.3863420845,1.9465369336,3.58156241,FALSE,TRUE,FALSE
"power_benchmark","energy","40 hour",2022-11-30,49.942375,59.542,61.7265,67.06925,72.031775,68.1455,0.91015625,4.30175,6.419,1.614375,0.19431375,2.687919,6.419,FALSE,TRUE,FALSE
"PetyrBaelish","energy","40 hour",2022-11-30,46.9097484697606,61.1245654796362,66.1047608962059,68.3022781375274,71.5685767093897,68.1455,1.06178757651197,3.5104672601819,2.0407391037941,0.0783890687637054,0.171153835469485,1.37250736894423,2.0407391037941,TRUE,TRUE,FALSE
"median_ensemble","energy","40 hour",2022-11-30,50.6301601789564,61.4658789374535,66.5223588957055,70.1443226293495,73.8191929812011,68.1455,0.87576699105218,3.33981053127325,1.6231411042945,0.999411314674752,0.283684649060055,1.42436291807095,1.6231411042945,TRUE,TRUE,FALSE
"JonSnow","energy","40 hour",2022-11-30,9.2133790098921,26.2315626239915,65.6085155075474,104.985468391103,122.003652005203,68.1455,2.94660604950539,20.9569686880043,2.53698449245258,18.4199841955517,2.69290760026014,9.51069020515481,2.53698449245258,TRUE,TRUE,FALSE
"GreyWorm","energy","40 hour",2022-11-30,57.1894120844617,61.4658789374535,63.5880491249321,65.8504703491386,69.9393401526579,68.1455,0.547804395776914,3.33981053127323,4.55745087506789,3.44254447629213,0.0896920076328954,2.39546045720861,4.55745087506789,FALSE,TRUE,FALSE
"Yoda","energy","40 hour",2022-11-30,50.6301601789564,65.9715883710003,68.3896013075144,70.1443226293495,73.8191929812011,68.1455,0.875766991052181,1.08695581449985,0.244101307514413,0.999411314674745,0.283684649060054,0.697984015360249,0.244101307514413,TRUE,TRUE,FALSE
"PhoebeBuffay","energy","40 hour",2022-11-30,42.783356236626,58.4476019684289,66.6666490005505,74.8856960326722,90.5499417644751,68.1455,1.2681071881687,4.84894901578557,1.47885099944945,3.37009801633612,1.12022208822376,2.41724546159272,1.47885099944945,TRUE,TRUE,FALSE
"OlennaTyrell","energy","40 hour",2022-11-30,59.3076666666667,64.2278837209302,66.5223588957055,68.8331944444445,73.1367916666668,68.1455,0.441891666666665,1.9588081395349,1.6231411042945,0.343847222222252,0.24956458333334,0.923450543210333,1.6231411042945,TRUE,TRUE,FALSE
"mean_ensemble","energy","40 hour",2022-11-30,48.4806326718241,59.4207336560204,66.6103053833708,73.794262004535,80.4907331589803,68.1455,0.983243366408795,4.3623831719898,1.5351946166292,2.8243810022675,0.617261657949016,2.06449276304886,1.5351946166292,TRUE,TRUE,FALSE
"JakePeralta","energy","44 hour",2022-11-30,53.768843430474,59.9639789179466,60.5404035642598,61.2732897730796,68.0521833642857,62.83875,0.453495328476302,1.4373855410267,2.29834643574024,2.34819034038054,0.260671668214284,1.35961786276761,2.29834643574024,FALSE,TRUE,FALSE
"AmySantiago","energy","44 hour",2022-11-30,61.69486575,64.56340207,66.06852625,67.57365042,70.44218674,62.83875,0.0571942125,2.586978105,3.22977625000001,2.36745021,0.380171837,1.7243141229,3.22977625000001,FALSE,TRUE,FALSE
"power_benchmark","energy","44 hour",2022-11-30,50.563825,55.69075,58.546,64.2265,68.136475,62.83875,0.61374625,3.574,4.29275,0.693875000000002,0.26488625,1.8878515,4.29275,TRUE,TRUE,FALSE
"PetyrBaelish","energy","44 hour",2022-11-30,47.4447361115124,59.373607339263,64.5756045126915,65.9866118946597,68.8782553430796,62.83875,0.76970069442438,1.73257133036852,1.7368545126915,1.57393094732985,0.301975267153979,1.22300655039365,1.7368545126915,TRUE,TRUE,FALSE
"median_ensemble","energy","44 hour",2022-11-30,52.0714912356235,59.6482790697675,63.0820862141987,65.9866118946597,68.8782553430796,62.83875,0.538362938218825,1.59523546511625,0.243336214198706,1.57393094732985,0.30197526715398,0.850568166403523,0.243336214198706,TRUE,TRUE,FALSE
"JonSnow","energy","44 hour",2022-11-30,4.38197431530234,23.0623696631757,66.28537536926,109.508381075344,128.188776423218,62.83875,2.92283878423488,19.8881901684121,3.44662536926004,23.3348155376722,3.26750132116089,10.571994236148,3.44662536926004,TRUE,TRUE,FALSE
"GreyWorm","energy","44 hour",2022-11-30,57.8544432861751,60.3084660755382,61.550532542351,62.883100365325,65.3414309869427,62.83875,0.249215335691247,1.26514196223091,1.28821745764905,0.0221751826625045,0.125134049347134,0.589976797516169,1.28821745764905,TRUE,TRUE,FALSE
"Yoda","energy","44 hour",2022-11-30,52.0714912356235,64.9120127333659,68.2374771242255,69.9771471573843,73.256864051555,62.83875,0.538362938218825,3.10989410004885,5.39872712422549,3.56919857869214,0.520905702577753,2.62741768875261,5.39872712422549,FALSE,TRUE,FALSE
"PhoebeBuffay","energy","44 hour",2022-11-30,37.7075113161947,54.3498386732813,63.0820862141987,71.8143337551161,88.4566611122027,62.83875,1.25656193419027,4.24445566335933,0.243336214198713,4.48779187755804,1.28089555561014,2.3026082489833,0.243336214198713,TRUE,TRUE,FALSE
"OlennaTyrell","energy","44 hour",2022-11-30,55.1337843137256,59.6482790697675,62.2904754601228,65.0015,68.8090000000001,62.83875,0.38524828431372,1.59523546511625,0.548274539877198,1.081375,0.298512500000005,0.781729157861434,0.548274539877198,TRUE,TRUE,FALSE
"mean_ensemble","energy","44 hour",2022-11-30,46.7357194176675,55.7636338380376,63.4640534485677,70.916057160101,77.7290925579204,62.83875,0.805151529116625,3.5375580809812,0.625303448567699,4.0386535800505,0.744517127896021,1.95023675332241,0.625303448567699,TRUE,TRUE,FALSE
"mean_ensemble","energy","60 hour",2022-11-30,44.9692630635124,52.3266116088751,62.4626541381315,72.8334821216957,81.235279711667,60.50875,0.77697434682438,4.09106919556245,1.9539041381315,6.16236606084785,1.03632648558335,2.80412804538991,1.9539041381315,TRUE,TRUE,FALSE
"JakePeralta","energy","60 hour",2022-11-30,52.7678132700533,67.4749898827426,69.1592513078814,70.9240851565795,75.4949864612297,60.50875,0.387046836497333,10.4493598241139,8.65050130788138,5.20766757828977,0.749311823061486,5.08877747396877,8.65050130788138,FALSE,TRUE,FALSE
"AmySantiago","energy","60 hour",2022-11-30,55.03228997,57.99789982,59.55395858,61.11001735,64.0756272,60.50875,0.2738230015,1.25542509,0.954791419999999,0.300633675,0.17834386,0.5926034093,0.954791419999999,TRUE,TRUE,FALSE
"power_benchmark","energy","60 hour",2022-11-30,52.1603,54.95925,56.3335,59.725,63.99455,60.50875,0.4174225,2.77475,4.17525,1.17562500000001,0.17429,1.7434675,4.17525,FALSE,TRUE,FALSE
"PetyrBaelish","energy","60 hour",2022-11-30,46.814214862695,56.2798214359283,60.9625833867788,64.975257902652,69.1933935002089,60.50875,0.684726756865252,2.11446428203583,0.453833386778832,2.23325395132602,0.434232175010443,1.18410211040327,0.453833386778832,TRUE,TRUE,FALSE
"median_ensemble","energy","60 hour",2022-11-30,52.3712156862746,57.6979938435246,60.9625833867788,64.975257902652,69.1933935002089,60.50875,0.40687671568627,1.4053780782377,0.453833386778804,2.233253951326,0.434232175010445,0.986714861407844,0.453833386778804,TRUE,TRUE,FALSE
"JonSnow","energy","60 hour",2022-11-30,0,1.00499981414978,66.6450049507671,132.285010087384,160.653727777368,60.50875,3.0254375,29.7518750929251,6.13625495076712,35.8881300436922,5.0072488888684,15.9617892952506,6.13625495076712,TRUE,TRUE,FALSE
"GreyWorm","energy","60 hour",2022-11-30,55.6150687964188,57.6979938435246,58.8949107745655,60.1186362243567,62.4360560983551,60.50875,0.244684060179061,1.40537807823772,1.6138392254345,0.585170663464876,0.0963653049177549,0.789087466446783,1.6138392254345,FALSE,TRUE,FALSE
"Yoda","energy","60 hour",2022-11-30,52.6314849958032,61.3841514854151,63.3681307186251,66.2490811328846,71.0788289471133,60.50875,0.393863250209838,1.31310222812266,2.85938071862508,2.87016556644229,0.528503947355665,1.5930031421511,2.85938071862508,FALSE,TRUE,FALSE
"PhoebeBuffay","energy","60 hour",2022-11-30,37.3309799903669,58.0418400585802,68.9088512055474,79.7758623525147,100.486722420728,60.50875,1.15888850048166,1.23345497070992,8.40010120554745,9.63355617625737,1.9988986210364,4.48497989480656,8.40010120554745,TRUE,TRUE,FALSE
"OlennaTyrell","energy","60 hour",2022-11-30,52.3712156862746,56.098558139535,58.3376963190185,60.338388888889,63.703625,60.50875,0.40687671568627,2.2050959302325,2.1710536809815,0.255541666666499,0.15974375,1.03966234871335,2.1710536809815,FALSE,TRUE,FALSE
"OlennaTyrell","energy","64 hour",2022-11-30,50.0613333333333,54.1100000000002,55.983564417178,58.2988333333334,61.6640416666667,58.53575,0.423720833333335,2.2128749999999,2.552185582822,0.355374999999903,0.156414583333335,1.14011419989769,2.552185582822,FALSE,TRUE,FALSE
"mean_ensemble","energy","64 hour",2022-11-30,42.3211219347491,48.971123229625,58.9669718408891,70.1341024987134,79.6408290494077,58.53575,0.810731403262545,4.7823133851875,0.431221840889101,5.7991762493567,1.05525395247039,2.57573936623325,0.431221840889101,TRUE,TRUE,FALSE
"JakePeralta","energy","64 hour",2022-11-30,53.768843430474,59.9639789179466,60.5404035642598,61.2732897730796,68.0521833642857,58.53575,0.238345328476302,2.1423433769199,2.00465356425976,1.36876988653982,0.475821668214285,1.24598676488201,2.00465356425976,FALSE,TRUE,FALSE
"AmySantiago","energy","64 hour",2022-11-30,53.19006036,56.21414876,57.80089129,59.38763382,62.41172222,58.53575,0.267284482,1.16080062,0.734858709999997,0.425941909999999,0.193798611,0.556536866599999,0.734858709999997,TRUE,TRUE,FALSE
"power_benchmark","energy","64 hour",2022-11-30,48.1775,50.6475,52.2535,56.384,63.03845,58.53575,0.5179125,3.944125,6.28225,3.227625,0.225135,2.8394095,6.28225,FALSE,TRUE,FALSE
"PetyrBaelish","energy","64 hour",2022-11-30,42.59039271014,52.020821187973,56.8904924324751,60.9692237763852,65.3659751797914,58.53575,0.797267864493001,3.25746440601349,1.64525756752491,1.21673688819259,0.341511258989573,1.45164759704271,1.64525756752491,TRUE,TRUE,FALSE
"median_ensemble","energy","64 hour",2022-11-30,48.6462001935542,54.5585379911769,57.80089129,60.9692237763852,65.3659751797914,58.53575,0.49447749032229,1.98860600441155,0.734858709999997,1.2167368881926,0.341511258989571,0.955238070383202,0.734858709999997,TRUE,TRUE,FALSE
"JonSnow","energy","64 hour",2022-11-30,0,0,64.0754165481447,135.315330712468,166.104252940308,58.53575,2.9267875,29.267875,5.5396665481447,38.3897903562339,5.37842514701541,16.3005089102788,5.5396665481447,TRUE,TRUE,FALSE
"GreyWorm","energy","64 hour",2022-11-30,50.4727169934179,54.5585379911769,56.3066842177642,58.3293894353684,62.02602307194,58.53575,0.403151650329104,1.98860600441155,2.22906578223578,0.309540846947414,0.174513653597,1.02097558750417,2.22906578223578,FALSE,TRUE,FALSE
"Yoda","energy","64 hour",2022-11-30,48.6462001935542,57.6351077276356,59.9245816995638,62.9848113224458,68.2334385962668,58.53575,0.494477490322292,0.450321136182176,1.38883169956377,2.22453066122292,0.484884429813341,1.0086090834209,1.38883169956377,TRUE,TRUE,FALSE
"PhoebeBuffay","energy","64 hour",2022-11-30,33.9830503918225,55.5900144818923,66.9272123986164,78.2644103153404,99.8713744054103,58.53575,1.22763498040888,1.47286775905383,8.39146239861639,9.86433015767022,2.06678122027052,4.60461530320397,8.39146239861639,TRUE,TRUE,FALSE
"PhoebeBuffay","energy","68 hour",2022-11-30,29.0528480004714,51.5423715554457,63.3426493979376,75.1429272404296,97.6324507954039,55.334,1.31405759997643,1.89581422227717,8.00864939793763,9.90446362021481,2.1149225397702,4.64758147603525,8.00864939793763,TRUE,TRUE,FALSE
"OlennaTyrell","energy","68 hour",2022-11-30,49.2433725490197,53.1641395348838,55.8966564417178,58.176138888889,61.5460416666667,55.334,0.304531372549015,1.0849302325581,0.562656441717799,1.4210694444445,0.310602083333335,0.73675791492055,0.562656441717799,TRUE,TRUE,FALSE
"mean_ensemble","energy","68 hour",2022-11-30,41.4026207812548,47.5022030787603,57.8820987393924,69.6257855510431,78.9413992549647,55.334,0.69656896093726,3.91589846061985,2.54809873939239,7.14589277552155,1.18036996274824,3.09736577984386,2.54809873939239,TRUE,TRUE,FALSE
"JakePeralta","energy","68 hour",2022-11-30,53.768843430474,59.9639789179466,60.5404035642598,61.2732897730796,68.0521833642857,55.334,0.0782578284763023,6.94496837691989,5.20640356425976,2.96964488653982,0.635909168214284,3.16703676488201,5.20640356425976,FALSE,TRUE,FALSE
"AmySantiago","energy","68 hour",2022-11-30,50.34924682,53.41173217,55.01862161,56.62551106,59.68799641,55.334,0.249237659,0.961133915000001,0.315378390000006,0.645755529999999,0.2176998205,0.477841062900001,0.315378390000006,TRUE,TRUE,FALSE
"power_benchmark","energy","68 hour",2022-11-30,46.39905,49.3735,51.9425,56.98525,60.391675,55.334,0.4467475,2.98025,3.39150000000001,0.825624999999999,0.25288375,1.57940125,3.39150000000001,TRUE,TRUE,FALSE
"PetyrBaelish","energy","68 hour",2022-11-30,43.1253803518917,50.2698630475998,55.3613360489607,58.6535575335175,62.6756538134813,55.334,0.610430982405413,2.53206847620011,0.0273360489606844,1.65977876675874,0.367082690674067,1.0393393929998,0.0273360489606844,TRUE,TRUE,FALSE
"median_ensemble","energy","68 hour",2022-11-30,49.2433725490197,53.1641395348838,55.8966564417178,58.6535575335175,62.6756538134813,55.334,0.304531372549015,1.0849302325581,0.562656441717799,1.65977876675875,0.367082690674065,0.795795900851546,0.562656441717799,TRUE,TRUE,FALSE
"JonSnow","energy","68 hour",2022-11-30,0,0,64.539114263671,141.079481337068,174.159187240101,55.334,2.7667,27.667,9.20511426367099,42.8727406685339,5.94125936200506,17.690562858842,9.20511426367099,TRUE,TRUE,FALSE
"GreyWorm","energy","68 hour",2022-11-30,50.5836618294392,53.1678042452615,54.4698818378567,55.8249329928615,58.6093523556687,55.334,0.237516908528042,1.08309787736927,0.864118162143264,0.245466496430765,0.163767617783435,0.518793412450956,0.864118162143264,TRUE,TRUE,FALSE
"Yoda","energy","68 hour",2022-11-30,50.1011840499975,56.6264382377058,59.8277254901284,62.8709811335424,67.7180526490752,55.334,0.261640797500126,1.93865735655874,4.49372549012843,3.76849056677118,0.619202632453759,2.21634336868245,4.49372549012843,FALSE,TRUE,FALSE
"power_benchmark","DAX","1 day",2022-11-30,NA,NA,NA,NA,NA,0.64568139888852,NA,NA,NA,NA,NA,0.66419840884535,1.68697510050581,FALSE,FALSE,TRUE
"W-EMOS","DAX","1 day",2022-11-30,NA,NA,NA,NA,NA,0.64568139888852,NA,NA,NA,NA,NA,0.66419840884535,1.68697510050581,FALSE,FALSE,TRUE
"W-ENS","DAX","1 day",2022-11-30,NA,NA,NA,NA,NA,0.64568139888852,NA,NA,NA,NA,NA,0.66419840884535,1.68697510050581,FALSE,FALSE,TRUE
"power_benchmark","DAX","2 day",2022-11-30,NA,NA,NA,NA,NA,0.915083776232173,NA,NA,NA,NA,NA,0.946099850547818,2.4033070073657,FALSE,FALSE,TRUE
"W-EMOS","DAX","2 day",2022-11-30,NA,NA,NA,NA,NA,0.915083776232173,NA,NA,NA,NA,NA,0.946099850547818,2.4033070073657,FALSE,FALSE,TRUE
"W-ENS","DAX","2 day",2022-11-30,NA,NA,NA,NA,NA,0.915083776232173,NA,NA,NA,NA,NA,0.946099850547818,2.4033070073657,FALSE,FALSE,TRUE
"power_benchmark","DAX","5 day",2022-11-30,NA,NA,NA,NA,NA,0.350639471286129,NA,NA,NA,NA,NA,0.880825149925783,1.38485478127492,FALSE,FALSE,TRUE
"W-EMOS","DAX","5 day",2022-11-30,NA,NA,NA,NA,NA,0.350639471286129,NA,NA,NA,NA,NA,0.880825149925783,1.38485478127492,FALSE,FALSE,TRUE
"W-ENS","DAX","5 day",2022-11-30,NA,NA,NA,NA,NA,0.350639471286129,NA,NA,NA,NA,NA,0.880825149925783,1.38485478127492,FALSE,FALSE,TRUE
"power_benchmark","DAX","6 day",2022-11-30,NA,NA,NA,NA,NA,-0.374733752211931,NA,NA,NA,NA,NA,1.4944437266854,2.37106917721094,FALSE,FALSE,TRUE
"W-EMOS","DAX","6 day",2022-11-30,NA,NA,NA,NA,NA,-0.374733752211931,NA,NA,NA,NA,NA,1.4944437266854,2.37106917721094,FALSE,FALSE,TRUE
"W-ENS","DAX","6 day",2022-11-30,NA,NA,NA,NA,NA,-0.374733752211931,NA,NA,NA,NA,NA,1.4944437266854,2.37106917721094,FALSE,FALSE,TRUE
"power_benchmark","DAX","7 day",2022-11-30,NA,NA,NA,NA,NA,-0.948074073933647,NA,NA,NA,NA,NA,1.34032662453489,3.16181544908165,FALSE,FALSE,TRUE
"W-EMOS","DAX","7 day",2022-11-30,NA,NA,NA,NA,NA,-0.948074073933647,NA,NA,NA,NA,NA,1.34032662453489,3.16181544908165,FALSE,FALSE,TRUE
"W-ENS","DAX","7 day",2022-11-30,NA,NA,NA,NA,NA,-0.948074073933647,NA,NA,NA,NA,NA,1.34032662453489,3.16181544908165,FALSE,FALSE,TRUE
"DAX_benchmark","wind","36 hour",2022-11-30,NA,NA,NA,NA,NA,11.52,NA,NA,NA,NA,NA,2.55209098721447,4.7676673977,FALSE,FALSE,TRUE
"GreyWorm","wind","36 hour",2022-11-30,NA,NA,NA,NA,NA,11.52,NA,NA,NA,NA,NA,2.55209098721447,4.7676673977,FALSE,FALSE,TRUE
"JakePeralta","wind","36 hour",2022-11-30,NA,NA,NA,NA,NA,11.52,NA,NA,NA,NA,NA,2.55209098721447,4.7676673977,FALSE,FALSE,TRUE
"JonSnow","wind","36 hour",2022-11-30,NA,NA,NA,NA,NA,11.52,NA,NA,NA,NA,NA,2.55209098721447,4.7676673977,FALSE,FALSE,TRUE
"OlennaTyrell","wind","36 hour",2022-11-30,NA,NA,NA,NA,NA,11.52,NA,NA,NA,NA,NA,2.55209098721447,4.7676673977,FALSE,FALSE,TRUE
"PetyrBaelish","wind","36 hour",2022-11-30,NA,NA,NA,NA,NA,11.52,NA,NA,NA,NA,NA,2.55209098721447,4.7676673977,FALSE,FALSE,TRUE
"power_benchmark","wind","36 hour",2022-11-30,NA,NA,NA,NA,NA,11.52,NA,NA,NA,NA,NA,2.55209098721447,4.7676673977,FALSE,FALSE,TRUE
"Yoda","wind","36 hour",2022-11-30,NA,NA,NA,NA,NA,11.52,NA,NA,NA,NA,NA,2.55209098721447,4.7676673977,FALSE,FALSE,TRUE
"DAX_benchmark","wind","48 hour",2022-11-30,NA,NA,NA,NA,NA,9.36,NA,NA,NA,NA,NA,2.54158839471111,4.0691868184,FALSE,FALSE,TRUE
"GreyWorm","wind","48 hour",2022-11-30,NA,NA,NA,NA,NA,9.36,NA,NA,NA,NA,NA,2.54158839471111,4.0691868184,FALSE,FALSE,TRUE
"JakePeralta","wind","48 hour",2022-11-30,NA,NA,NA,NA,NA,9.36,NA,NA,NA,NA,NA,2.54158839471111,4.0691868184,FALSE,FALSE,TRUE
"JonSnow","wind","48 hour",2022-11-30,NA,NA,NA,NA,NA,9.36,NA,NA,NA,NA,NA,2.54158839471111,4.0691868184,FALSE,FALSE,TRUE
"OlennaTyrell","wind","48 hour",2022-11-30,NA,NA,NA,NA,NA,9.36,NA,NA,NA,NA,NA,2.54158839471111,4.0691868184,FALSE,FALSE,TRUE
"PetyrBaelish","wind","48 hour",2022-11-30,NA,NA,NA,NA,NA,9.36,NA,NA,NA,NA,NA,2.54158839471111,4.0691868184,FALSE,FALSE,TRUE
"power_benchmark","wind","48 hour",2022-11-30,NA,NA,NA,NA,NA,9.36,NA,NA,NA,NA,NA,2.54158839471111,4.0691868184,FALSE,FALSE,TRUE
"Yoda","wind","48 hour",2022-11-30,NA,NA,NA,NA,NA,9.36,NA,NA,NA,NA,NA,2.54158839471111,4.0691868184,FALSE,FALSE,TRUE
"DAX_benchmark","wind","60 hour",2022-11-30,NA,NA,NA,NA,NA,7.92,NA,NA,NA,NA,NA,4.30878717215187,7.89733301775048,FALSE,FALSE,TRUE
"GreyWorm","wind","60 hour",2022-11-30,NA,NA,NA,NA,NA,7.92,NA,NA,NA,NA,NA,4.30878717215187,7.89733301775048,FALSE,FALSE,TRUE
"JakePeralta","wind","60 hour",2022-11-30,NA,NA,NA,NA,NA,7.92,NA,NA,NA,NA,NA,4.30878717215187,7.89733301775048,FALSE,FALSE,TRUE
"JonSnow","wind","60 hour",2022-11-30,NA,NA,NA,NA,NA,7.92,NA,NA,NA,NA,NA,4.30878717215187,7.89733301775048,FALSE,FALSE,TRUE
"OlennaTyrell","wind","60 hour",2022-11-30,NA,NA,NA,NA,NA,7.92,NA,NA,NA,NA,NA,4.30878717215187,7.89733301775048,FALSE,FALSE,TRUE
"PetyrBaelish","wind","60 hour",2022-11-30,NA,NA,NA,NA,NA,7.92,NA,NA,NA,NA,NA,4.30878717215187,7.89733301775048,FALSE,FALSE,TRUE
"power_benchmark","wind","60 hour",2022-11-30,NA,NA,NA,NA,NA,7.92,NA,NA,NA,NA,NA,4.30878717215187,7.89733301775048,FALSE,FALSE,TRUE
"Yoda","wind","60 hour",2022-11-30,NA,NA,NA,NA,NA,7.92,NA,NA,NA,NA,NA,4.30878717215187,7.89733301775048,FALSE,FALSE,TRUE
"DAX_benchmark","wind","72 hour",2022-11-30,NA,NA,NA,NA,NA,13.32,NA,NA,NA,NA,NA,1.683223075,2.9694,FALSE,FALSE,TRUE
"GreyWorm","wind","72 hour",2022-11-30,NA,NA,NA,NA,NA,13.32,NA,NA,NA,NA,NA,1.683223075,2.9694,FALSE,FALSE,TRUE
"JakePeralta","wind","72 hour",2022-11-30,NA,NA,NA,NA,NA,13.32,NA,NA,NA,NA,NA,1.683223075,2.9694,FALSE,FALSE,TRUE
"JonSnow","wind","72 hour",2022-11-30,NA,NA,NA,NA,NA,13.32,NA,NA,NA,NA,NA,1.683223075,2.9694,FALSE,FALSE,TRUE
"OlennaTyrell","wind","72 hour",2022-11-30,NA,NA,NA,NA,NA,13.32,NA,NA,NA,NA,NA,1.683223075,2.9694,FALSE,FALSE,TRUE
"PetyrBaelish","wind","72 hour",2022-11-30,NA,NA,NA,NA,NA,13.32,NA,NA,NA,NA,NA,1.683223075,2.9694,FALSE,FALSE,TRUE
"power_benchmark","wind","72 hour",2022-11-30,NA,NA,NA,NA,NA,13.32,NA,NA,NA,NA,NA,1.683223075,2.9694,FALSE,FALSE,TRUE
"Yoda","wind","72 hour",2022-11-30,NA,NA,NA,NA,NA,13.32,NA,NA,NA,NA,NA,1.683223075,2.9694,FALSE,FALSE,TRUE
"DAX_benchmark","wind","84 hour",2022-11-30,NA,NA,NA,NA,NA,15.48,NA,NA,NA,NA,NA,2.957997728725,6.5191617358,FALSE,FALSE,TRUE
"GreyWorm","wind","84 hour",2022-11-30,NA,NA,NA,NA,NA,15.48,NA,NA,NA,NA,NA,2.957997728725,6.5191617358,FALSE,FALSE,TRUE
"JakePeralta","wind","84 hour",2022-11-30,NA,NA,NA,NA,NA,15.48,NA,NA,NA,NA,NA,2.957997728725,6.5191617358,FALSE,FALSE,TRUE
"JonSnow","wind","84 hour",2022-11-30,NA,NA,NA,NA,NA,15.48,NA,NA,NA,NA,NA,2.957997728725,6.5191617358,FALSE,FALSE,TRUE
"OlennaTyrell","wind","84 hour",2022-11-30,NA,NA,NA,NA,NA,15.48,NA,NA,NA,NA,NA,2.957997728725,6.5191617358,FALSE,FALSE,TRUE
"PetyrBaelish","wind","84 hour",2022-11-30,NA,NA,NA,NA,NA,15.48,NA,NA,NA,NA,NA,2.957997728725,6.5191617358,FALSE,FALSE,TRUE
"power_benchmark","wind","84 hour",2022-11-30,NA,NA,NA,NA,NA,15.48,NA,NA,NA,NA,NA,2.957997728725,6.5191617358,FALSE,FALSE,TRUE
"Yoda","wind","84 hour",2022-11-30,NA,NA,NA,NA,NA,15.48,NA,NA,NA,NA,NA,2.957997728725,6.5191617358,FALSE,FALSE,TRUE
"DAX_benchmark","energy","36 hour",2022-11-30,NA,NA,NA,NA,NA,70.65225,NA,NA,NA,NA,NA,8.67305089568324,3.85037249999999,FALSE,FALSE,TRUE
"KhalDrogo","energy","36 hour",2022-11-30,NA,NA,NA,NA,NA,70.65225,NA,NA,NA,NA,NA,8.67305089568324,3.85037249999999,FALSE,FALSE,TRUE
"MadelineWuntsch","energy","36 hour",2022-11-30,NA,NA,NA,NA,NA,70.65225,NA,NA,NA,NA,NA,8.67305089568324,3.85037249999999,FALSE,FALSE,TRUE
"W-EMOS","energy","36 hour",2022-11-30,NA,NA,NA,NA,NA,70.65225,NA,NA,NA,NA,NA,8.67305089568324,3.85037249999999,FALSE,FALSE,TRUE
"W-ENS","energy","36 hour",2022-11-30,NA,NA,NA,NA,NA,70.65225,NA,NA,NA,NA,NA,8.67305089568324,3.85037249999999,FALSE,FALSE,TRUE
"DAX_benchmark","energy","40 hour",2022-11-30,NA,NA,NA,NA,NA,68.1455,NA,NA,NA,NA,NA,9.60579710720636,6.48319,FALSE,FALSE,TRUE
"KhalDrogo","energy","40 hour",2022-11-30,NA,NA,NA,NA,NA,68.1455,NA,NA,NA,NA,NA,9.60579710720636,6.48319,FALSE,FALSE,TRUE
"MadelineWuntsch","energy","40 hour",2022-11-30,NA,NA,NA,NA,NA,68.1455,NA,NA,NA,NA,NA,9.60579710720636,6.48319,FALSE,FALSE,TRUE
"W-EMOS","energy","40 hour",2022-11-30,NA,NA,NA,NA,NA,68.1455,NA,NA,NA,NA,NA,9.60579710720636,6.48319,FALSE,FALSE,TRUE
"W-ENS","energy","40 hour",2022-11-30,NA,NA,NA,NA,NA,68.1455,NA,NA,NA,NA,NA,9.60579710720636,6.48319,FALSE,FALSE,TRUE
"DAX_benchmark","energy","44 hour",2022-11-30,NA,NA,NA,NA,NA,62.83875,NA,NA,NA,NA,NA,10.6777141785095,5.45271439546775,FALSE,FALSE,TRUE
"KhalDrogo","energy","44 hour",2022-11-30,NA,NA,NA,NA,NA,62.83875,NA,NA,NA,NA,NA,10.6777141785095,5.45271439546775,FALSE,FALSE,TRUE
"MadelineWuntsch","energy","44 hour",2022-11-30,NA,NA,NA,NA,NA,62.83875,NA,NA,NA,NA,NA,10.6777141785095,5.45271439546775,FALSE,FALSE,TRUE
"W-EMOS","energy","44 hour",2022-11-30,NA,NA,NA,NA,NA,62.83875,NA,NA,NA,NA,NA,10.6777141785095,5.45271439546775,FALSE,FALSE,TRUE
"W-ENS","energy","44 hour",2022-11-30,NA,NA,NA,NA,NA,62.83875,NA,NA,NA,NA,NA,10.6777141785095,5.45271439546775,FALSE,FALSE,TRUE
"DAX_benchmark","energy","60 hour",2022-11-30,NA,NA,NA,NA,NA,60.50875,NA,NA,NA,NA,NA,16.1214071882031,8.73700632096019,FALSE,FALSE,TRUE
"KhalDrogo","energy","60 hour",2022-11-30,NA,NA,NA,NA,NA,60.50875,NA,NA,NA,NA,NA,16.1214071882031,8.73700632096019,FALSE,FALSE,TRUE
"MadelineWuntsch","energy","60 hour",2022-11-30,NA,NA,NA,NA,NA,60.50875,NA,NA,NA,NA,NA,16.1214071882031,8.73700632096019,FALSE,FALSE,TRUE
"W-EMOS","energy","60 hour",2022-11-30,NA,NA,NA,NA,NA,60.50875,NA,NA,NA,NA,NA,16.1214071882031,8.73700632096019,FALSE,FALSE,TRUE
"W-ENS","energy","60 hour",2022-11-30,NA,NA,NA,NA,NA,60.50875,NA,NA,NA,NA,NA,16.1214071882031,8.73700632096019,FALSE,FALSE,TRUE
"DAX_benchmark","energy","64 hour",2022-11-30,NA,NA,NA,NA,NA,58.53575,NA,NA,NA,NA,NA,16.4635139993816,8.47537702260255,FALSE,FALSE,TRUE
"KhalDrogo","energy","64 hour",2022-11-30,NA,NA,NA,NA,NA,58.53575,NA,NA,NA,NA,NA,16.4635139993816,8.47537702260255,FALSE,FALSE,TRUE
"MadelineWuntsch","energy","64 hour",2022-11-30,NA,NA,NA,NA,NA,58.53575,NA,NA,NA,NA,NA,16.4635139993816,8.47537702260255,FALSE,FALSE,TRUE
"W-EMOS","energy","64 hour",2022-11-30,NA,NA,NA,NA,NA,58.53575,NA,NA,NA,NA,NA,16.4635139993816,8.47537702260255,FALSE,FALSE,TRUE
"W-ENS","energy","64 hour",2022-11-30,NA,NA,NA,NA,NA,58.53575,NA,NA,NA,NA,NA,16.4635139993816,8.47537702260255,FALSE,FALSE,TRUE
"DAX_benchmark","energy","68 hour",2022-11-30,NA,NA,NA,NA,NA,55.334,NA,NA,NA,NA,NA,17.8674684874304,9.2971654063077,FALSE,FALSE,TRUE
"KhalDrogo","energy","68 hour",2022-11-30,NA,NA,NA,NA,NA,55.334,NA,NA,NA,NA,NA,17.8674684874304,9.2971654063077,FALSE,FALSE,TRUE
"MadelineWuntsch","energy","68 hour",2022-11-30,NA,NA,NA,NA,NA,55.334,NA,NA,NA,NA,NA,17.8674684874304,9.2971654063077,FALSE,FALSE,TRUE
"W-EMOS","energy","68 hour",2022-11-30,NA,NA,NA,NA,NA,55.334,NA,NA,NA,NA,NA,17.8674684874304,9.2971654063077,FALSE,FALSE,TRUE
"W-ENS","energy","68 hour",2022-11-30,NA,NA,NA,NA,NA,55.334,NA,NA,NA,NA,NA,17.8674684874304,9.2971654063077,FALSE,FALSE,TRUE
