"model","target","horizon","ae","mean_qscore","interval_coverage_0.5","interval_coverage_0.95","n","scores_imputed"
"AmySantiago","DAX","1 day",1.69869656996647,1.09031561448277,0.5,1,2,0
"AmySantiago","DAX","2 day",3.58567281177651,2.0591036870659,0,1,1,0
"AmySantiago","DAX","5 day",3.99547265613527,2.36397265613527,0,0,1,0
"AmySantiago","DAX","6 day",4.17002797527318,2.51552797527318,0,0,1,0
"AmySantiago","DAX","7 day",2.97011609200261,1.75016965520156,0,1,1,0
"AmySantiago","energy","36 hour",1.571,1.008263,1,1,1,0
"AmySantiago","energy","40 hour",1.8637,1.207964,1,1,1,0
"AmySantiago","energy","44 hour",0.0775000000000006,1.29132,1,1,1,0
"AmySantiago","energy","60 hour",1.7365,1.365669,1,1,1,0
"AmySantiago","energy","64 hour",0.164999999999999,1.054368,1,1,1,0
"AmySantiago","energy","68 hour",0.0320000000000036,0.958503000000001,1,1,1,0
"AmySantiago","wind","36 hour",1.49270168,0.9126793639,1,1,1,0
"AmySantiago","wind","48 hour",4.3701647,2.7556667005,0,0,1,0
"AmySantiago","wind","60 hour",4.27357965,3.0651495365,0,0,1,0
"AmySantiago","wind","72 hour",2.65652161,1.8724546461,0,1,1,0
"AmySantiago","wind","84 hour",3.24705033,2.3523369448,0,0,1,0
"DAX_benchmark","DAX","1 day",1.75258845683581,1.22199669421021,0.5,0.5,2,0
"DAX_benchmark","DAX","2 day",3.89179642607527,2.41652773189998,0,0,1,0
"DAX_benchmark","DAX","5 day",4.45220452400559,2.54050269339789,0,1,1,0
"DAX_benchmark","DAX","6 day",4.83772318350741,2.76890998301503,0,1,1,0
"DAX_benchmark","DAX","7 day",3.67102344683401,2.10745216881831,0,1,1,0
"DAX_benchmark","energy","36 hour",3.54763892859155,2.85466345735963,0,0,1,1
"DAX_benchmark","energy","40 hour",4.34044163871062,3.14727284771501,0,0,1,1
"DAX_benchmark","energy","44 hour",7.03565999999999,3.9099258875,0,0,1,1
"DAX_benchmark","energy","60 hour",16.9868420718112,8.73566978,0,0,1,1
"DAX_benchmark","energy","64 hour",14.3517044763243,6.9172836241253,0,0,1,1
"DAX_benchmark","energy","68 hour",13.7687070565307,7.483151105,0,0,1,1
"DAX_benchmark","wind","36 hour",1.885872,1.10634944339062,0,0,1,1
"DAX_benchmark","wind","48 hour",4.413866347,2.783223367505,0,0,1,1
"DAX_benchmark","wind","60 hour",4.3163154465,3.095801031865,0,0,1,1
"DAX_benchmark","wind","72 hour",2.6830868261,1.891179192561,0,0,1,1
"DAX_benchmark","wind","84 hour",7.65255598254422,4.2094235029859,0,0,1,1
"DougJudy","DAX","1 day",2.62626555358746,1.90343157437154,0,0,2,2
"DougJudy","DAX","2 day",4.12702134235197,3.11641105553016,0,0,1,1
"DougJudy","DAX","5 day",4.6383497212935,3.64804641972055,0,0,1,1
"DougJudy","DAX","6 day",5.09370058843502,4.14719069091615,0,0,1,1
"DougJudy","DAX","7 day",4.15078326160983,3.02959979045826,0,0,1,1
"DougJudy","energy","36 hour",3.54763892859155,2.85466345735963,0,0,1,1
"DougJudy","energy","40 hour",4.34044163871062,3.14727284771501,0,0,1,1
"DougJudy","energy","44 hour",7.03565999999999,3.9099258875,0,0,1,1
"DougJudy","energy","60 hour",16.9868420718112,8.73566978,0,0,1,1
"DougJudy","energy","64 hour",14.3517044763243,6.9172836241253,0,0,1,1
"DougJudy","energy","68 hour",13.7687070565307,7.483151105,0,0,1,1
"DougJudy","wind","36 hour",1.885872,1.10634944339062,0,0,1,1
"DougJudy","wind","48 hour",4.413866347,2.783223367505,0,0,1,1
"DougJudy","wind","60 hour",4.3163154465,3.095801031865,0,0,1,1
"DougJudy","wind","72 hour",2.6830868261,1.891179192561,0,0,1,1
"DougJudy","wind","84 hour",7.65255598254422,4.2094235029859,0,0,1,1
"GreyWorm","DAX","1 day",1.81799107172565,1.29950521933306,0.5,0.5,2,0
"GreyWorm","DAX","2 day",4.02198421050763,3.08555550052491,0,0,1,0
"GreyWorm","DAX","5 day",4.54101721409574,3.61192714823817,0,0,1,0
"GreyWorm","DAX","6 day",5.0432679093416,4.10612939694668,0,0,1,0
"GreyWorm","DAX","7 day",4.10968639763349,2.99960375292897,0,0,1,0
"GreyWorm","energy","36 hour",0.506152419153551,0.331060768923561,1,1,1,0
"GreyWorm","energy","40 hour",0.303902297447749,0.315879067579383,1,1,1,0
"GreyWorm","energy","44 hour",0.402062230881697,0.245399002609609,1,1,1,0
"GreyWorm","energy","60 hour",1.5991331572026,0.860987673693529,0,1,1,0
"GreyWorm","energy","64 hour",0.388390725057526,0.23084886020168,1,1,1,0
"GreyWorm","energy","68 hour",0.773699861892851,0.362961630308459,0,1,1,0
"GreyWorm","wind","36 hour",1.885872,1.10634944339062,0,0,1,1
"GreyWorm","wind","48 hour",4.413866347,2.783223367505,0,0,1,1
"GreyWorm","wind","60 hour",4.3163154465,3.095801031865,0,0,1,1
"GreyWorm","wind","72 hour",2.6830868261,1.891179192561,0,0,1,1
"GreyWorm","wind","84 hour",7.65255598254422,4.2094235029859,0,0,1,1
"JakePeralta","DAX","1 day",1.56703051858718,1.42042350754854,0.5,0.5,2,0
"JakePeralta","DAX","2 day",3.13566272227701,2.58663510612904,0,0,1,0
"JakePeralta","DAX","5 day",3.58235040873869,3.11994012199102,0,0,1,0
"JakePeralta","DAX","6 day",4.18232526051458,3.45042102943824,0,0,1,0
"JakePeralta","DAX","7 day",3.11295329462036,1.83864967443991,0,0,1,0
"JakePeralta","energy","36 hour",2.8415,1.4318755,0,1,1,0
"JakePeralta","energy","40 hour",4.07949999999999,2.27606225,0,1,1,0
"JakePeralta","energy","44 hour",6.96599999999999,3.87121375,0,1,1,0
"JakePeralta","energy","60 hour",14.7025,8.649178,0,0,1,0
"JakePeralta","energy","64 hour",11.147,6.4423755,0,1,1,0
"JakePeralta","energy","68 hour",11.3955,7.4090605,0,0,1,0
"JakePeralta","wind","36 hour",1.885872,1.10634944339062,0,0,1,1
"JakePeralta","wind","48 hour",4.413866347,2.783223367505,0,0,1,1
"JakePeralta","wind","60 hour",4.3163154465,3.095801031865,0,0,1,1
"JakePeralta","wind","72 hour",2.6830868261,1.891179192561,0,0,1,1
"JakePeralta","wind","84 hour",7.65255598254422,4.2094235029859,0,0,1,1
"JonSnow","DAX","1 day",2.56704047166672,1.5595017591217,0,0.5,2,0
"JonSnow","DAX","2 day",3.95640968847342,2.34131710803567,0,0,1,0
"JonSnow","DAX","5 day",4.14373448181134,2.3681751328585,0,1,1,0
"JonSnow","DAX","6 day",4.30528984598788,2.58190677017147,0,0,1,0
"JonSnow","DAX","7 day",2.83078422652086,1.76513231983761,0,1,1,0
"JonSnow","energy","36 hour",1.574,1.070234,1,1,1,0
"JonSnow","energy","40 hour",1.15,1.08244,1,1,1,0
"JonSnow","energy","44 hour",2.386,1.41906,1,1,1,0
"JonSnow","energy","60 hour",2.889,1.651642,0,1,1,0
"JonSnow","energy","64 hour",0.125999999999998,0.785687999999999,1,1,1,0
"JonSnow","energy","68 hour",1.585,1.179098,1,1,1,0
"JonSnow","wind","36 hour",1.885872,1.10634944339062,0,0,1,1
"JonSnow","wind","48 hour",4.413866347,2.783223367505,0,0,1,1
"JonSnow","wind","60 hour",4.3163154465,3.095801031865,0,0,1,1
"JonSnow","wind","72 hour",2.6830868261,1.891179192561,0,0,1,1
"JonSnow","wind","84 hour",7.65255598254422,4.2094235029859,0,0,1,1
"KhalDrogo","DAX","1 day",1.72736412892514,1.2437880092213,0.5,0.5,2,0
"KhalDrogo","DAX","2 day",4.08615974490294,2.45382991467928,0,0,1,0
"KhalDrogo","DAX","5 day",4.41656447529191,2.55041788249691,0,0,1,0
"KhalDrogo","DAX","6 day",4.69803834803759,2.92964373886709,0,0,1,0
"KhalDrogo","DAX","7 day",3.6074796924134,1.95544873294946,0,1,1,0
"KhalDrogo","energy","36 hour",3.54763892859155,2.85466345735963,0,0,1,1
"KhalDrogo","energy","40 hour",4.34044163871062,3.14727284771501,0,0,1,1
"KhalDrogo","energy","44 hour",7.03565999999999,3.9099258875,0,0,1,1
"KhalDrogo","energy","60 hour",16.9868420718112,8.73566978,0,0,1,1
"KhalDrogo","energy","64 hour",14.3517044763243,6.9172836241253,0,0,1,1
"KhalDrogo","energy","68 hour",13.7687070565307,7.483151105,0,0,1,1
"KhalDrogo","wind","36 hour",1.8672,0.979915999999999,0,1,1,0
"KhalDrogo","wind","48 hour",0.3703,0.219394,1,1,1,0
"KhalDrogo","wind","60 hour",4.0313,2.594576,0,0,1,0
"KhalDrogo","wind","72 hour",1.1316,0.594867,0,1,1,0
"KhalDrogo","wind","84 hour",4.8966,3.30747,0,0,1,0
"MadelineWuntsch","DAX","1 day",1.67961824270561,1.13559362195658,0.5,0.5,2,0
"MadelineWuntsch","DAX","2 day",3.97362071452784,2.47596744515005,0,0,1,0
"MadelineWuntsch","DAX","5 day",4.59242546662722,2.63745565771441,0,0,1,0
"MadelineWuntsch","DAX","6 day",4.99968944728313,2.92309620497893,0,0,1,0
"MadelineWuntsch","DAX","7 day",3.90532042112182,2.12024911677622,0,1,1,0
"MadelineWuntsch","energy","36 hour",3.54763892859155,2.85466345735963,0,0,1,1
"MadelineWuntsch","energy","40 hour",4.34044163871062,3.14727284771501,0,0,1,1
"MadelineWuntsch","energy","44 hour",7.03565999999999,3.9099258875,0,0,1,1
"MadelineWuntsch","energy","60 hour",16.9868420718112,8.73566978,0,0,1,1
"MadelineWuntsch","energy","64 hour",14.3517044763243,6.9172836241253,0,0,1,1
"MadelineWuntsch","energy","68 hour",13.7687070565307,7.483151105,0,0,1,1
"MadelineWuntsch","wind","36 hour",1.70889385562585,1.09539548850556,1,1,1,0
"MadelineWuntsch","wind","48 hour",0.301408358444531,0.505738609316741,1,1,1,0
"MadelineWuntsch","wind","60 hour",3.53333649172671,1.88892734164156,0,1,1,0
"MadelineWuntsch","wind","72 hour",0.500816407770383,0.624770256914839,1,1,1,0
"MadelineWuntsch","wind","84 hour",7.54382633494394,4.1677460425603,0,1,1,0
"mean_ensemble","DAX","1 day",1.70281595978185,1.20702776890071,0.5,0.5,2,0
"mean_ensemble","DAX","2 day",3.816521057463,2.43995930751318,0,0,1,0
"mean_ensemble","DAX","5 day",4.27817234497631,2.61467957516692,0,0,1,0
"mean_ensemble","DAX","6 day",4.62911574154076,2.89150195984348,0,0,1,0
"mean_ensemble","DAX","7 day",3.49980052198985,1.96772361974516,0,1,1,0
"mean_ensemble","energy","36 hour",0.799484596836805,1.05995658488828,1,1,1,0
"mean_ensemble","energy","40 hour",1.3156516301747,1.25220490322346,1,1,1,0
"mean_ensemble","energy","44 hour",2.3105337764312,1.66800451112252,1,1,1,0
"mean_ensemble","energy","60 hour",6.2704209637608,3.37857431103934,0,1,1,0
"mean_ensemble","energy","64 hour",4.0208575185936,2.1017617263603,0,1,1,0
"mean_ensemble","energy","68 hour",4.35039812068671,2.13921682447567,0,1,1,0
"mean_ensemble","wind","36 hour",1.0888038908097,0.832684945374918,1,1,1,0
"mean_ensemble","wind","48 hour",0.86531533233908,0.604070288592912,1,1,1,0
"mean_ensemble","wind","60 hour",3.46361585806073,1.88419083108681,0,1,1,0
"mean_ensemble","wind","72 hour",0.48044870319957,0.56802363428041,1,1,1,0
"mean_ensemble","wind","84 hour",5.97684214466696,3.43676923857636,0,0,1,0
"median_ensemble","DAX","1 day",1.75015004615069,1.21813651859235,0.5,0.5,2,0
"median_ensemble","DAX","2 day",3.89179642607527,2.34537372263642,0,0,1,0
"median_ensemble","DAX","5 day",4.41656447529191,2.52960394450795,0,0,1,0
"median_ensemble","DAX","6 day",4.7406761297628,2.84048779638243,0,0,1,0
"median_ensemble","DAX","7 day",3.62468881398455,1.95571543023845,0,1,1,0
"median_ensemble","energy","36 hour",1.574,1.13288958143422,1,1,1,0
"median_ensemble","energy","40 hour",1.15,1.11801365805799,1,1,1,0
"median_ensemble","energy","44 hour",2.386,1.42111725,1,1,1,0
"median_ensemble","energy","60 hour",2.889,1.648642,0,1,1,0
"median_ensemble","energy","64 hour",0.164999999999999,0.7388845,1,1,1,0
"median_ensemble","energy","68 hour",1.585,1.20823525,1,1,1,0
"median_ensemble","wind","36 hour",1.5420139046162,1.00015314025016,1,1,1,0
"median_ensemble","wind","48 hour",0.68210891311975,0.548167312090185,1,1,1,0
"median_ensemble","wind","60 hour",3.73173950331882,1.91024363782905,0,1,1,0
"median_ensemble","wind","72 hour",0.5751935084839,0.590623722341024,1,1,1,0
"median_ensemble","wind","84 hour",6.28191316747197,3.59926095187332,0,1,1,0
"OlennaTyrell","DAX","1 day",1.75415470924141,1.31515319074967,0.5,0.5,2,0
"OlennaTyrell","DAX","2 day",3.82603307972296,2.42923641249261,0,0,1,0
"OlennaTyrell","DAX","5 day",4.3545572461985,2.39674316392138,0,1,1,0
"OlennaTyrell","DAX","6 day",4.7406761297628,2.64990986756329,0,0,1,0
"OlennaTyrell","DAX","7 day",3.62468881398455,1.94921134839998,0,1,1,0
"OlennaTyrell","energy","36 hour",1.755,1.1946865,1,1,1,0
"OlennaTyrell","energy","40 hour",1.24,1.1155975,1,1,1,0
"OlennaTyrell","energy","44 hour",2.911,1.9533865,1,1,1,0
"OlennaTyrell","energy","60 hour",3.094,1.764078,0,1,1,0
"OlennaTyrell","energy","64 hour",0.0899999999999963,0.721259499999999,1,1,1,0
"OlennaTyrell","energy","68 hour",2.01300000000001,1.6522345,1,1,1,0
"OlennaTyrell","wind","36 hour",1.885872,1.10634944339062,0,0,1,1
"OlennaTyrell","wind","48 hour",4.413866347,2.783223367505,0,0,1,1
"OlennaTyrell","wind","60 hour",4.3163154465,3.095801031865,0,0,1,1
"OlennaTyrell","wind","72 hour",2.6830868261,1.891179192561,0,0,1,1
"OlennaTyrell","wind","84 hour",7.65255598254422,4.2094235029859,0,0,1,1
"PetyrBaelish","DAX","1 day",1.75258845683581,1.22199669421021,0.5,0.5,2,0
"PetyrBaelish","DAX","2 day",3.89179642607527,2.41652773189998,0,0,1,0
"PetyrBaelish","DAX","5 day",4.45533301648613,2.5445420037247,0,1,1,0
"PetyrBaelish","DAX","6 day",4.83772318350741,2.76890998301503,0,1,1,0
"PetyrBaelish","DAX","7 day",3.67102344683401,2.10983382720453,0,1,1,0
"PetyrBaelish","energy","36 hour",2.7055,1.49724725,1,1,1,0
"PetyrBaelish","energy","40 hour",0.0484999999999971,1.209125,1,1,1,0
"PetyrBaelish","energy","44 hour",4.699,2.14250575,1,1,1,0
"PetyrBaelish","energy","60 hour",0.4315,0.80025275,1,1,1,0
"PetyrBaelish","energy","64 hour",1.165,1.132094,1,1,1,0
"PetyrBaelish","energy","68 hour",1.998,1.36888575,1,1,1,0
"PetyrBaelish","wind","36 hour",1.885872,1.10634944339062,0,0,1,1
"PetyrBaelish","wind","48 hour",4.413866347,2.783223367505,0,0,1,1
"PetyrBaelish","wind","60 hour",4.3163154465,3.095801031865,0,0,1,1
"PetyrBaelish","wind","72 hour",2.6830868261,1.891179192561,0,0,1,1
"PetyrBaelish","wind","84 hour",7.65255598254422,4.2094235029859,0,0,1,1
"PhoebeBuffay","DAX","1 day",1.75258845478599,1.22199669427988,0.5,0.5,2,0
"PhoebeBuffay","DAX","2 day",3.89511098997763,2.41719064376049,0,0,1,0
"PhoebeBuffay","DAX","5 day",4.45533302021381,2.54454200428057,0,1,1,0
"PhoebeBuffay","DAX","6 day",4.83772318745954,2.77044634383449,0,1,1,0
"PhoebeBuffay","DAX","7 day",3.6710234489207,2.11138576888823,0,1,1,0
"PhoebeBuffay","energy","36 hour",3.51251379068471,2.82639946273231,1,1,1,0
"PhoebeBuffay","energy","40 hour",4.29746696902041,3.1161117304109,1,1,1,0
"PhoebeBuffay","energy","44 hour",5.95324175699942,3.59822109749314,1,1,1,0
"PhoebeBuffay","energy","60 hour",16.8186555166448,8.48010712566061,0,1,1,0
"PhoebeBuffay","energy","64 hour",14.2096083924002,6.84879566745079,0,1,1,0
"PhoebeBuffay","energy","68 hour",13.6323832242879,6.42733503997273,0,1,1,0
"PhoebeBuffay","wind","36 hour",1.54201390461617,1.02566065992197,1,1,1,0
"PhoebeBuffay","wind","48 hour",0.99391782623949,0.657016844559267,1,1,1,0
"PhoebeBuffay","wind","60 hour",3.73173950331882,1.89792917018964,0,1,1,0
"PhoebeBuffay","wind","72 hour",0.575193508483899,0.628606668887892,1,1,1,0
"PhoebeBuffay","wind","84 hour",7.57678810152893,4.12935712360334,0,1,1,0
"power_benchmark","DAX","1 day",2.62626555358746,1.90343157437154,0,0,2,2
"power_benchmark","DAX","2 day",4.12702134235197,3.11641105553016,0,0,1,1
"power_benchmark","DAX","5 day",4.6383497212935,3.64804641972055,0,0,1,1
"power_benchmark","DAX","6 day",5.09370058843502,4.14719069091615,0,0,1,1
"power_benchmark","DAX","7 day",4.15078326160983,3.02959979045826,0,0,1,1
"power_benchmark","energy","36 hour",0.168000000000006,0.859576750000003,1,1,1,0
"power_benchmark","energy","40 hour",0.0394999999999968,0.984233999999999,1,1,1,0
"power_benchmark","energy","44 hour",0.679500000000004,1.1894015,1,1,1,0
"power_benchmark","energy","60 hour",2.289,1.4164175,0,1,1,0
"power_benchmark","energy","64 hour",0.369499999999995,0.815534499999999,1,1,1,0
"power_benchmark","energy","68 hour",1.048,1.12112625,1,1,1,0
"power_benchmark","wind","36 hour",1.885872,1.10634944339062,0,0,1,1
"power_benchmark","wind","48 hour",4.413866347,2.783223367505,0,0,1,1
"power_benchmark","wind","60 hour",4.3163154465,3.095801031865,0,0,1,1
"power_benchmark","wind","72 hour",2.6830868261,1.891179192561,0,0,1,1
"power_benchmark","wind","84 hour",7.65255598254422,4.2094235029859,0,0,1,1
"W-EMOS","DAX","1 day",2.62626555358746,1.90343157437154,0,0,2,2
"W-EMOS","DAX","2 day",4.12702134235197,3.11641105553016,0,0,1,1
"W-EMOS","DAX","5 day",4.6383497212935,3.64804641972055,0,0,1,1
"W-EMOS","DAX","6 day",5.09370058843502,4.14719069091615,0,0,1,1
"W-EMOS","DAX","7 day",4.15078326160983,3.02959979045826,0,0,1,1
"W-EMOS","energy","36 hour",3.54763892859155,2.85466345735963,0,0,1,1
"W-EMOS","energy","40 hour",4.34044163871062,3.14727284771501,0,0,1,1
"W-EMOS","energy","44 hour",7.03565999999999,3.9099258875,0,0,1,1
"W-EMOS","energy","60 hour",16.9868420718112,8.73566978,0,0,1,1
"W-EMOS","energy","64 hour",14.3517044763243,6.9172836241253,0,0,1,1
"W-EMOS","energy","68 hour",13.7687070565307,7.483151105,0,0,1,1
"W-EMOS","wind","36 hour",1.5420139046162,1.02566065992198,1,1,1,0
"W-EMOS","wind","48 hour",0.99391782623949,0.657016844559268,1,1,1,0
"W-EMOS","wind","60 hour",3.73173950331882,1.89792917018964,0,1,1,0
"W-EMOS","wind","72 hour",0.5751935084839,0.628606668887891,1,1,1,0
"W-EMOS","wind","84 hour",7.5767881015289,4.12935712360334,0,1,1,0
"W-ENS","DAX","1 day",2.62626555358746,1.90343157437154,0,0,2,2
"W-ENS","DAX","2 day",4.12702134235197,3.11641105553016,0,0,1,1
"W-ENS","DAX","5 day",4.6383497212935,3.64804641972055,0,0,1,1
"W-ENS","DAX","6 day",5.09370058843502,4.14719069091615,0,0,1,1
"W-ENS","DAX","7 day",4.15078326160983,3.02959979045826,0,0,1,1
"W-ENS","energy","36 hour",3.54763892859155,2.85466345735963,0,0,1,1
"W-ENS","energy","40 hour",4.34044163871062,3.14727284771501,0,0,1,1
"W-ENS","energy","44 hour",7.03565999999999,3.9099258875,0,0,1,1
"W-ENS","energy","60 hour",16.9868420718112,8.73566978,0,0,1,1
"W-ENS","energy","64 hour",14.3517044763243,6.9172836241253,0,0,1,1
"W-ENS","energy","68 hour",13.7687070565307,7.483151105,0,0,1,1
"W-ENS","wind","36 hour",1.62,0.726237500000001,0,1,1,0
"W-ENS","wind","48 hour",1.235,0.59908,0,1,1,0
"W-ENS","wind","60 hour",1.48,0.7816125,1,1,1,0
"W-ENS","wind","72 hour",1.555,0.764025,0,1,1,0
"W-ENS","wind","84 hour",5.02,3.1449875,0,0,1,0
"Yoda","DAX","1 day",1.74592306119513,1.1258068704124,0.5,0.5,2,0
"Yoda","DAX","2 day",3.71748481777651,2.24339197629651,0,0,1,0
"Yoda","DAX","5 day",4.07090328513527,2.50217918860527,0,0,1,0
"Yoda","DAX","6 day",4.26778868627318,2.68646239145318,0,0,1,0
"Yoda","DAX","7 day",3.32370646100261,1.80372485453156,0,1,1,0
"Yoda","energy","36 hour",2.12700000000001,1.274627,1,1,1,0
"Yoda","energy","40 hour",3.3295,1.9481715,0,1,1,0
"Yoda","energy","44 hour",6.2735,3.513233,0,1,1,0
"Yoda","energy","60 hour",13.7365,8.41648675,0,0,1,0
"Yoda","energy","64 hour",10.475,6.169764,0,1,1,0
"Yoda","energy","68 hour",10.672,6.91388675,0,0,1,0
"Yoda","wind","36 hour",1.885872,1.10634944339062,0,0,1,1
"Yoda","wind","48 hour",4.413866347,2.783223367505,0,0,1,1
"Yoda","wind","60 hour",4.3163154465,3.095801031865,0,0,1,1
"Yoda","wind","72 hour",2.6830868261,1.891179192561,0,0,1,1
"Yoda","wind","84 hour",7.65255598254422,4.2094235029859,0,0,1,1
