forecast_date,target,horizon,q0.025,q0.25,q0.5,q0.75,q0.975
2023-02-08,DAX,1 day,-3.2434778025121647,-0.5324682544826764,0.10135448408705727,0.7303222037741364,2.755986013318279
2023-02-08,DAX,2 day,-4.131984897530487,-0.8411165459622172,0.1371663969665704,1.0161678548878061,3.5704923267932855
2023-02-08,DAX,5 day,-5.274758915745039,-0.8823147516447527,0.18896259894018996,1.296318705970556,4.628696965151875
2023-02-08,DAX,6 day,-6.282628800683585,-1.0074634750773637,0.2466719201119183,1.543392089489215,5.367396415217598
2023-02-08,DAX,7 day,-6.735741964137194,-1.0644621879501326,0.38424227014894896,1.6670980248387757,6.259934085874841
