forecast_date,target,horizon,q0.025,q0.25,q0.5,q0.75,q0.975
2023-01-11,DAX,1 day,-2.83321281348596,-0.5881557459420423,0.0938119478589407,0.7475428458380118,2.503324421479992
2023-01-11,DAX,2 day,-3.7645809815779296,-0.8813530072497497,0.1509533421840731,1.081904239629853,3.307820902025853
2023-01-11,DAX,5 day,-4.725478545045241,-0.9847206640876937,0.2154496742667846,1.3752180889035848,4.138026484143707
2023-01-11,DAX,6 day,-5.523105299756631,-1.1436648822275877,0.274289395422339,1.6195178444494798,4.785529095606671
2023-01-11,DAX,7 day,-6.017647572810942,-1.2595837119528206,0.3891206585565328,1.8066479063302812,5.434111739349715
2023-01-11,energy,36 hour,51.33463339845289,63.93950000159754,66.1465984355047,67.97738462507257,70.82594541210945
2023-01-11,energy,40 hour,47.273199532677346,59.75372661133208,62.12577817982755,64.01080847149653,67.18397257428036
2023-01-11,energy,44 hour,47.60630758065073,57.96027794298029,60.58274763505819,61.69740077257028,64.39194544837662
2023-01-11,energy,60 hour,47.0314669010583,54.84744839016025,56.99347767785376,60.63877252783675,64.55605448248505
2023-01-11,energy,64 hour,42.97003303528274,50.66167499989479,52.9726574221766,56.6721963742607,60.914081644655944
2023-01-11,energy,68 hour,43.30314108325612,48.868226331543,51.42962687740725,54.358788675334445,58.12205451875222
2023-01-11,wind,36 hour,NA,NA,NA,NA,NA
2023-01-11,wind,48 hour,NA,NA,NA,NA,NA
2023-01-11,wind,60 hour,NA,NA,NA,NA,NA
2023-01-11,wind,72 hour,NA,NA,NA,NA,NA
2023-01-11,wind,84 hour,NA,NA,NA,NA,NA
