"forecast_date","target","horizon","q0.025","q0.25","q0.5","q0.75","q0.975"
2023-01-11,"wind","36 hour",20.874,21.9225,23.1,25.45,27.29625
2023-01-11,"wind","48 hour",16.23,19.2625,21.215,22.8725,25.24125
2023-01-11,"wind","60 hour",16.192,21.0325,22.715,24.4825,26.39125
2023-01-11,"wind","72 hour",11.717,14.68,16.365,17.6725,21.712
2023-01-11,"wind","84 hour",7.07375,13.0125,15.33,17.8575,27.6515
