forecast_date,target,horizon,q0.025,q0.25,q0.5,q0.75,q0.975
2022-12-21,DAX,1 day,-2.996285516771339,-0.3591214614167032,0.0028575603757362,0.7422349970472639,2.528122841522821
2022-12-21,DAX,2 day,-5.0333953414441615,-0.2983513220700085,0.0295803603109522,0.9976182932325725,3.216452072940145
2022-12-21,DAX,5 day,-6.01303332321784,-0.6247975834399853,0.7502440298011167,1.5399341866063334,4.2012508721216335
2022-12-21,DAX,6 day,-6.191273942118329,-1.5248170298017554,0.6819120342070331,2.250488221600802,4.932956451892924
2022-12-21,DAX,7 day,-7.039042895654122,-1.3865602487473376,0.5645343649763928,2.8377920276711888,5.345765991635247
2022-12-21,energy,36 hour,55.59878416090015,65.53598233109766,67.01583868139073,68.5116526016402,73.419587331856
2022-12-21,energy,40 hour,60.58537188505405,62.62949132787568,64.62310485707211,68.1738320002032,68.53731640889988
2022-12-21,energy,44 hour,52.08455865770372,58.82591608980805,61.11737803721002,62.5707910076594,67.10169798369434
2022-12-21,energy,60 hour,54.37253190723586,61.15500984541444,62.36141133490957,63.62155594397786,65.08400915041663
2022-12-21,energy,64 hour,51.835185269916494,58.0547908395005,59.85883284246599,61.86851424143402,63.41948677287075
2022-12-21,energy,68 hour,52.79545378616752,57.15877227156296,58.680356509045154,60.03941320008488,62.32000220097698
2022-12-21,wind,36 hour,NA,NA,NA,NA,NA
2022-12-21,wind,48 hour,NA,NA,NA,NA,NA
2022-12-21,wind,60 hour,NA,NA,NA,NA,NA
2022-12-21,wind,72 hour,NA,NA,NA,NA,NA
2022-12-21,wind,84 hour,NA,NA,NA,NA,NA
