"model","target","horizon","forecast_date","q0.025","q0.25","q0.5","q0.75","q0.975","target_end_date","mean_qscore","ae"
"AmySantiago","DAX","1 day",2022-11-30 23:59:00,-2.201,-0.756,0.07,0.814,2.383,2022-12-01 17:30:00,0.317921663377704,0.57530136888852
"AmySantiago","DAX","2 day",2022-11-30 23:59:00,-3.126,-1.037,0.057,1.178,3.464,2022-12-02 17:30:00,0.458949150246435,0.857763786232173
"AmySantiago","DAX","5 day",2022-11-30 23:59:00,-4.073,-1.402,-0.03,1.372,3.99,2022-12-05 17:30:00,0.434308574557226,0.381125741286129
"AmySantiago","DAX","6 day",2022-11-30 23:59:00,-4.444,-1.358,0.174,1.638,4.496,2022-12-06 17:30:00,0.498681464642386,0.548385772211931
"AmySantiago","DAX","7 day",2022-11-30 23:59:00,-5.014,-1.489,0.209,1.873,5.067,2022-12-07 17:30:00,0.668329791986729,1.15677498393365
"AmySantiago","energy","36 hour",2022-11-30 23:59:00,71.121,73.297,74.438,75.58,77.755,2022-12-02 12:00:00,2.29726147140001,3.78598525000001
"AmySantiago","energy","40 hour",2022-11-30 23:59:00,67.582,70.301,71.727,73.154,75.872,2022-12-02 16:00:00,1.9465369336,3.58156241
"AmySantiago","energy","44 hour",2022-11-30 23:59:00,61.695,64.563,66.069,67.574,70.442,2022-12-02 20:00:00,1.7243141229,3.22977625000001
"AmySantiago","energy","60 hour",2022-11-30 23:59:00,55.032,57.998,59.554,61.11,64.076,2022-12-03 12:00:00,0.5926034093,0.954791419999999
"AmySantiago","energy","64 hour",2022-11-30 23:59:00,53.19,56.214,57.801,59.388,62.412,2022-12-03 16:00:00,0.556536866599999,0.734858709999997
"AmySantiago","energy","68 hour",2022-11-30 23:59:00,50.349,53.412,55.019,56.626,59.688,2022-12-03 20:00:00,0.477841062900001,0.315378390000006
"AmySantiago","wind","36 hour",2022-11-30 23:59:00,7.538,13.353,16.24,17.191,22.565,2022-12-01 12:00:00,2.2113726622,4.72046277
"AmySantiago","wind","48 hour",2022-11-30 23:59:00,5.366,9.941,13.389,14.886,19.317,2022-12-02 00:00:00,1.6721190223,4.02889784
"AmySantiago","wind","60 hour",2022-11-30 23:59:00,4.993,9.781,12.365,16.407,25.166,2022-12-02 12:00:00,2.4977737315,4.44493771
"AmySantiago","wind","72 hour",2022-11-30 23:59:00,5.003,7.37,12.008,14.663,22.455,2022-12-03 00:00:00,1.1661470104,1.31154242
"AmySantiago","wind","84 hour",2022-11-30 23:59:00,4.607,8.337,9.025,13.079,24.924,2022-12-03 12:00:00,2.9287106225,6.45461558
"DAX_benchmark","DAX","1 day",2022-11-30 23:59:00,-3.158,-0.524,0.097,0.718,2.757,2022-12-01 17:30:00,0.293018970710743,0.548276211260923
"DAX_benchmark","DAX","2 day",2022-11-30 23:59:00,-4.132,-0.824,0.133,1.027,3.57,2022-12-02 17:30:00,0.418564573404053,0.782123769375431
"DAX_benchmark","DAX","5 day",2022-11-30 23:59:00,-5.275,-0.88,0.19,1.302,4.629,2022-12-05 17:30:00,0.349394354663207,0.160949044333591
"DAX_benchmark","DAX","6 day",2022-11-30 23:59:00,-6.283,-1.011,0.274,1.533,5.367,2022-12-06 17:30:00,0.500678521910632,0.64867786324232
"DAX_benchmark","DAX","7 day",2022-11-30 23:59:00,-6.736,-1.085,0.414,1.681,6.26,2022-12-07 17:30:00,0.679054755421204,1.36233505269212
"GreyWorm","DAX","1 day",2022-11-30 23:59:00,-1.65,-0.512,0.048,0.585,1.795,2022-12-01 17:30:00,0.287878623440103,0.597392324840162
"GreyWorm","DAX","2 day",2022-11-30 23:59:00,-1.716,-0.618,-0.042,0.567,1.66,2022-12-02 17:30:00,0.482957405190811,0.957533885451242
"GreyWorm","DAX","5 day",2022-11-30 23:59:00,-1.588,-0.64,-0.058,0.507,1.536,2022-12-05 17:30:00,0.227721399519857,0.408809787097362
"GreyWorm","DAX","6 day",2022-11-30 23:59:00,-2.037,-0.632,-0.024,0.574,1.81,2022-12-06 17:30:00,0.229177126652948,0.350349172578379
"GreyWorm","DAX","7 day",2022-11-30 23:59:00,-1.827,-0.638,-0.032,0.588,1.821,2022-12-07 17:30:00,0.466442477314322,0.915862692299189
"GreyWorm","energy","36 hour",2022-11-30 23:59:00,65.013,68.1,69.507,71.073,74.067,2022-12-02 12:00:00,0.616873899325459,1.14535510472376
"GreyWorm","energy","40 hour",2022-11-30 23:59:00,57.189,61.466,63.588,65.85,69.939,2022-12-02 16:00:00,2.39546045720861,4.55745087506789
"GreyWorm","energy","44 hour",2022-11-30 23:59:00,57.854,60.308,61.551,62.883,65.341,2022-12-02 20:00:00,0.589976797516169,1.28821745764905
"GreyWorm","energy","60 hour",2022-11-30 23:59:00,55.615,57.698,58.895,60.119,62.436,2022-12-03 12:00:00,0.789087466446783,1.6138392254345
"GreyWorm","energy","64 hour",2022-11-30 23:59:00,50.473,54.559,56.307,58.329,62.026,2022-12-03 16:00:00,1.02097558750417,2.22906578223578
"GreyWorm","energy","68 hour",2022-11-30 23:59:00,50.584,53.168,54.47,55.825,58.609,2022-12-03 20:00:00,0.518793412450956,0.864118162143264
"GreyWorm","wind","36 hour",2022-11-30 23:59:00,NA,NA,NA,NA,NA,2022-12-01 12:00:00,2.55209098721447,4.7676673977
"GreyWorm","wind","48 hour",2022-11-30 23:59:00,NA,NA,NA,NA,NA,2022-12-02 00:00:00,2.54158839471111,4.0691868184
"GreyWorm","wind","60 hour",2022-11-30 23:59:00,NA,NA,NA,NA,NA,2022-12-02 12:00:00,4.30878717215187,7.89733301775048
"GreyWorm","wind","72 hour",2022-11-30 23:59:00,NA,NA,NA,NA,NA,2022-12-03 00:00:00,1.683223075,2.9694
"GreyWorm","wind","84 hour",2022-11-30 23:59:00,NA,NA,NA,NA,NA,2022-12-03 12:00:00,2.957997728725,6.5191617358
"JakePeralta","DAX","1 day",2022-11-30 23:59:00,-1.833,-0.639,-0.012,0.615,1.809,2022-12-01 17:30:00,0.305765886366668,0.657826444562567
"JakePeralta","DAX","2 day",2022-11-30 23:59:00,-1.772,-0.612,-0.004,0.604,1.764,2022-12-02 17:30:00,0.465055349554712,0.91895471906814
"JakePeralta","DAX","5 day",2022-11-30 23:59:00,-1.791,-0.585,0.047,0.68,1.886,2022-12-05 17:30:00,0.223956160416678,0.303165662460994
"JakePeralta","DAX","6 day",2022-11-30 23:59:00,-1.776,-0.55,0.093,0.736,1.963,2022-12-06 17:30:00,0.259616003743277,0.467789090556208
"JakePeralta","DAX","7 day",2022-11-30 23:59:00,-1.839,-0.593,0.061,0.714,1.96,2022-12-07 17:30:00,0.512486121575534,1.00874656865942
"JakePeralta","energy","36 hour",2022-11-30 23:59:00,52.768,67.475,69.159,70.924,75.495,2022-12-02 12:00:00,0.870780997719181,1.49299869211862
"JakePeralta","energy","40 hour",2022-11-30 23:59:00,52.768,67.475,69.159,70.924,75.495,2022-12-02 16:00:00,0.774931520871733,1.01375130788138
"JakePeralta","energy","44 hour",2022-11-30 23:59:00,53.769,59.964,60.54,61.273,68.052,2022-12-02 20:00:00,1.35961786276761,2.29834643574024
"JakePeralta","energy","60 hour",2022-11-30 23:59:00,52.768,67.475,69.159,70.924,75.495,2022-12-03 12:00:00,5.08877747396877,8.65050130788138
"JakePeralta","energy","64 hour",2022-11-30 23:59:00,53.769,59.964,60.54,61.273,68.052,2022-12-03 16:00:00,1.24598676488201,2.00465356425976
"JakePeralta","energy","68 hour",2022-11-30 23:59:00,53.769,59.964,60.54,61.273,68.052,2022-12-03 20:00:00,3.16703676488201,5.20640356425976
"JakePeralta","wind","36 hour",2022-11-30 23:59:00,NA,NA,NA,NA,NA,2022-12-01 12:00:00,2.55209098721447,4.7676673977
"JakePeralta","wind","48 hour",2022-11-30 23:59:00,NA,NA,NA,NA,NA,2022-12-02 00:00:00,2.54158839471111,4.0691868184
"JakePeralta","wind","60 hour",2022-11-30 23:59:00,NA,NA,NA,NA,NA,2022-12-02 12:00:00,4.30878717215187,7.89733301775048
"JakePeralta","wind","72 hour",2022-11-30 23:59:00,NA,NA,NA,NA,NA,2022-12-03 00:00:00,1.683223075,2.9694
"JakePeralta","wind","84 hour",2022-11-30 23:59:00,NA,NA,NA,NA,NA,2022-12-03 12:00:00,2.957997728725,6.5191617358
"JonSnow","DAX","1 day",2022-11-30 23:59:00,-2.727,-1.382,-1.025,1.305,2.757,2022-12-01 17:30:00,0.657622186975594,1.67027237673842
"JonSnow","DAX","2 day",2022-11-30 23:59:00,-4.204,-2.016,-1.464,1.82,3.514,2022-12-02 17:30:00,0.936732525294869,2.37951188848089
"JonSnow","DAX","5 day",2022-11-30 23:59:00,-4.929,1.42,1.722,2.206,4.229,2022-12-05 17:30:00,0.872104108837409,1.37114334779695
"JonSnow","DAX","6 day",2022-11-30 23:59:00,-5.872,1.681,1.973,2.5,4.714,2022-12-06 17:30:00,1.47964725414396,2.3475932447633
"JonSnow","DAX","7 day",2022-11-30 23:59:00,-6.733,-3.107,2.182,2.72,5.085,2022-12-07 17:30:00,1.32705606389593,3.13051034562539
"JonSnow","energy","36 hour",2022-11-30 23:59:00,17.541,32.76,67.973,103.186,118.405,2022-12-02 12:00:00,8.58717910463687,2.67935639318529
"JonSnow","energy","40 hour",2022-11-30 23:59:00,9.213,26.232,65.609,104.985,122.004,2022-12-02 16:00:00,9.51069020515481,2.53698449245258
"JonSnow","energy","44 hour",2022-11-30 23:59:00,4.382,23.062,66.285,109.508,128.189,2022-12-02 20:00:00,10.571994236148,3.44662536926004
"JonSnow","energy","60 hour",2022-11-30 23:59:00,0,1.005,66.645,132.285,160.654,2022-12-03 12:00:00,15.9617892952506,6.13625495076712
"JonSnow","energy","64 hour",2022-11-30 23:59:00,0,0,64.075,135.315,166.104,2022-12-03 16:00:00,16.3005089102788,5.5396665481447
"JonSnow","energy","68 hour",2022-11-30 23:59:00,0,0,64.539,141.079,174.159,2022-12-03 20:00:00,17.690562858842,9.20511426367099
"JonSnow","wind","36 hour",2022-11-30 23:59:00,NA,NA,NA,NA,NA,2022-12-01 12:00:00,2.55209098721447,4.7676673977
"JonSnow","wind","48 hour",2022-11-30 23:59:00,NA,NA,NA,NA,NA,2022-12-02 00:00:00,2.54158839471111,4.0691868184
"JonSnow","wind","60 hour",2022-11-30 23:59:00,NA,NA,NA,NA,NA,2022-12-02 12:00:00,4.30878717215187,7.89733301775048
"JonSnow","wind","72 hour",2022-11-30 23:59:00,NA,NA,NA,NA,NA,2022-12-03 00:00:00,1.683223075,2.9694
"JonSnow","wind","84 hour",2022-11-30 23:59:00,NA,NA,NA,NA,NA,2022-12-03 12:00:00,2.957997728725,6.5191617358
"KhalDrogo","DAX","1 day",2022-11-30 23:59:00,-1.969,-0.544,0.061,0.674,2.484,2022-12-01 17:30:00,0.28327818639622,0.584697471784919
"KhalDrogo","DAX","2 day",2022-11-30 23:59:00,-2.668,-0.804,0.195,1.062,2.95,2022-12-02 17:30:00,0.386740872789173,0.719874161638605
"KhalDrogo","DAX","5 day",2022-11-30 23:59:00,-2.787,-0.952,0.291,1.312,3.09,2022-12-05 17:30:00,0.29715321086431,0.0598570792869733
"KhalDrogo","DAX","6 day",2022-11-30 23:59:00,-3.478,-1.039,0.292,1.593,5.355,2022-12-06 17:30:00,0.484911466023047,0.666610319184036
"KhalDrogo","DAX","7 day",2022-11-30 23:59:00,-3.79,-1.201,0.45,1.744,4.556,2022-12-07 17:30:00,0.657493334480009,1.39784036804235
"KhalDrogo","energy","36 hour",2022-11-30 23:59:00,NA,NA,NA,NA,NA,2022-12-02 12:00:00,8.67305089568324,3.85037249999999
"KhalDrogo","energy","40 hour",2022-11-30 23:59:00,NA,NA,NA,NA,NA,2022-12-02 16:00:00,9.60579710720636,6.48319
"KhalDrogo","energy","44 hour",2022-11-30 23:59:00,NA,NA,NA,NA,NA,2022-12-02 20:00:00,10.6777141785095,5.45271439546775
"KhalDrogo","energy","60 hour",2022-11-30 23:59:00,NA,NA,NA,NA,NA,2022-12-03 12:00:00,16.1214071882031,8.73700632096019
"KhalDrogo","energy","64 hour",2022-11-30 23:59:00,NA,NA,NA,NA,NA,2022-12-03 16:00:00,16.4635139993816,8.47537702260255
"KhalDrogo","energy","68 hour",2022-11-30 23:59:00,NA,NA,NA,NA,NA,2022-12-03 20:00:00,17.8674684874304,9.2971654063077
"KhalDrogo","wind","36 hour",2022-11-30 23:59:00,8.21,14.589,15.794,17.831,20.232,2022-12-01 12:00:00,2.52682275961828,4.27433420083494
"KhalDrogo","wind","48 hour",2022-11-30 23:59:00,5.487,12.407,13.273,15.637,24.678,2022-12-02 00:00:00,2.51642415317932,3.91308941017454
"KhalDrogo","wind","60 hour",2022-11-30 23:59:00,7.346,12.979,15.739,18.133,22.314,2022-12-02 12:00:00,4.25239297391312,7.81914160173315
"KhalDrogo","wind","72 hour",2022-11-30 23:59:00,7.752,11.755,13.709,15.168,20.323,2022-12-03 00:00:00,0.544926814462763,0.389325824149891
"KhalDrogo","wind","84 hour",2022-11-30 23:59:00,5.668,10.035,13.485,17.156,26.557,2022-12-03 12:00:00,1.3199970857313,1.99487960995893
"MadelineWuntsch","DAX","1 day",2022-11-30 23:59:00,-0.35,-0.13,0.2,0.51,0.61,2022-12-01 17:30:00,0.23128139888852,0.44568139888852
"MadelineWuntsch","DAX","2 day",2022-11-30 23:59:00,-1.53,-0.56,0.11,0.34,1.31,2022-12-02 17:30:00,0.509450265739304,0.805083776232173
"MadelineWuntsch","DAX","5 day",2022-11-30 23:59:00,-1.19,-0.49,0.35,0.68,1.05,2022-12-05 17:30:00,0.139527894257226,0.000639471286129401
"MadelineWuntsch","DAX","6 day",2022-11-30 23:59:00,-1.54,-0.43,0.44,0.93,1.25,2022-12-06 17:30:00,0.326846750442386,0.814733752211931
"MadelineWuntsch","DAX","7 day",2022-11-30 23:59:00,-1.68,-0.48,0.06,0.59,0.98,2022-12-07 17:30:00,0.522444444360188,1.00807407393365
"MadelineWuntsch","energy","36 hour",2022-11-30 23:59:00,NA,NA,NA,NA,NA,2022-12-02 12:00:00,8.67305089568324,3.85037249999999
"MadelineWuntsch","energy","40 hour",2022-11-30 23:59:00,NA,NA,NA,NA,NA,2022-12-02 16:00:00,9.60579710720636,6.48319
"MadelineWuntsch","energy","44 hour",2022-11-30 23:59:00,NA,NA,NA,NA,NA,2022-12-02 20:00:00,10.6777141785095,5.45271439546775
"MadelineWuntsch","energy","60 hour",2022-11-30 23:59:00,NA,NA,NA,NA,NA,2022-12-03 12:00:00,16.1214071882031,8.73700632096019
"MadelineWuntsch","energy","64 hour",2022-11-30 23:59:00,NA,NA,NA,NA,NA,2022-12-03 16:00:00,16.4635139993816,8.47537702260255
"MadelineWuntsch","energy","68 hour",2022-11-30 23:59:00,NA,NA,NA,NA,NA,2022-12-03 20:00:00,17.8674684874304,9.2971654063077
"MadelineWuntsch","wind","36 hour",2022-11-30 23:59:00,7.276,12.155,14.373,16.519,21.342,2022-12-01 12:00:00,1.40156787728504,2.85324307135626
"MadelineWuntsch","wind","48 hour",2022-11-30 23:59:00,4.17,9.17,11.612,14.328,20.576,2022-12-02 00:00:00,1.13028498655984,2.25222523590456
"MadelineWuntsch","wind","60 hour",2022-11-30 23:59:00,6.864,12.454,15.001,17.746,23.157,2022-12-02 12:00:00,3.92206281846256,7.08111183494973
"MadelineWuntsch","wind","72 hour",2022-11-30 23:59:00,4.697,9.86,12.3,15.311,21.586,2022-12-03 00:00:00,0.918047968613955,1.02038557657978
"MadelineWuntsch","wind","84 hour",2022-11-30 23:59:00,6.551,12.806,15.529,18.628,25.079,2022-12-03 12:00:00,0.777288738392474,0.0489643502523442
"mean_ensemble","DAX","1 day",2022-11-30 23:59:00,-2.012,-0.597,0.033,0.708,2.039,2022-12-01 17:30:00,0.293446792929265,0.612218788656942
"mean_ensemble","DAX","2 day",2022-11-30 23:59:00,-2.735,-0.852,0.034,0.934,2.604,2022-12-02 17:30:00,0.408138494211521,0.880799286957139
"mean_ensemble","DAX","5 day",2022-11-30 23:59:00,-3.143,-0.599,0.347,1.131,2.978,2022-12-05 17:30:00,0.234839086896897,0.00365329643306239
"mean_ensemble","DAX","6 day",2022-11-30 23:59:00,-3.674,-0.622,0.462,1.331,3.565,2022-12-06 17:30:00,0.434955085513205,0.83632037818905
"mean_ensemble","DAX","7 day",2022-11-30 23:59:00,-3.928,-1.102,0.49,1.404,3.737,2022-12-07 17:30:00,0.614944226837755,1.43841806836794
"mean_ensemble","energy","36 hour",2022-11-30 23:59:00,52.904,63.387,69.845,76.197,82.224,2022-12-02 12:00:00,1.73573931352916,0.807647336683388
"mean_ensemble","energy","40 hour",2022-11-30 23:59:00,48.481,59.421,66.61,73.794,80.491,2022-12-02 16:00:00,2.06449276304886,1.5351946166292
"mean_ensemble","energy","44 hour",2022-11-30 23:59:00,46.736,55.764,63.464,70.916,77.729,2022-12-02 20:00:00,1.95023675332241,0.625303448567699
"mean_ensemble","energy","60 hour",2022-11-30 23:59:00,44.969,52.327,62.463,72.833,81.235,2022-12-03 12:00:00,2.80412804538991,1.9539041381315
"mean_ensemble","energy","64 hour",2022-11-30 23:59:00,42.321,48.971,58.967,70.134,79.641,2022-12-03 16:00:00,2.57573936623325,0.431221840889101
"mean_ensemble","energy","68 hour",2022-11-30 23:59:00,41.403,47.502,57.882,69.626,78.941,2022-12-03 20:00:00,3.09736577984386,2.54809873939239
"mean_ensemble","wind","36 hour",2022-11-30 23:59:00,8.025,12.726,14.747,16.624,20.426,2022-12-01 12:00:00,1.64155466108343,3.2269363429067
"mean_ensemble","wind","48 hour",2022-11-30 23:59:00,4.721,9.73,12.146,14.399,19.596,2022-12-02 00:00:00,1.32088659278523,2.7860016582874
"mean_ensemble","wind","60 hour",2022-11-30 23:59:00,6.997,12.088,14.54,17.257,22.668,2022-12-02 12:00:00,3.6648039749865,6.620358551242
"mean_ensemble","wind","72 hour",2022-11-30 23:59:00,5.771,9.819,12.384,14.6,19.934,2022-12-03 00:00:00,0.806923020543301,0.9361315092825
"mean_ensemble","wind","84 hour",2022-11-30 23:59:00,6.507,11.367,13.777,17.119,24.52,2022-12-03 12:00:00,1.09580436593929,1.7025656406887
"median_ensemble","DAX","1 day",2022-11-30 23:59:00,-1.969,-0.524,0.08,0.689,2.139,2022-12-01 17:30:00,0.275472929850781,0.565181878536847
"median_ensemble","DAX","2 day",2022-11-30 23:59:00,-2.668,-0.804,0.133,1.027,2.896,2022-12-02 17:30:00,0.395131389334192,0.782123769375431
"median_ensemble","DAX","5 day",2022-11-30 23:59:00,-2.787,-0.744,0.226,1.302,3.228,2022-12-05 17:30:00,0.289737891090189,0.125026052059733
"median_ensemble","DAX","6 day",2022-11-30 23:59:00,-3.478,-0.676,0.285,1.533,4.021,2022-12-06 17:30:00,0.427830136276901,0.659305457233883
"median_ensemble","DAX","7 day",2022-11-30 23:59:00,-3.79,-1.085,0.414,1.681,4.374,2022-12-07 17:30:00,0.630735330650449,1.36233505269212
"median_ensemble","energy","36 hour",2022-11-30 23:59:00,54.555,67.475,69.507,72.308,75.999,2022-12-02 12:00:00,0.926843016561286,1.14535510472379
"median_ensemble","energy","40 hour",2022-11-30 23:59:00,50.63,61.466,66.522,70.144,73.819,2022-12-02 16:00:00,1.42436291807095,1.6231411042945
"median_ensemble","energy","44 hour",2022-11-30 23:59:00,52.071,59.648,63.082,65.987,68.878,2022-12-02 20:00:00,0.850568166403523,0.243336214198706
"median_ensemble","energy","60 hour",2022-11-30 23:59:00,52.371,57.698,60.963,64.975,69.193,2022-12-03 12:00:00,0.986714861407844,0.453833386778804
"median_ensemble","energy","64 hour",2022-11-30 23:59:00,48.646,54.559,57.801,60.969,65.366,2022-12-03 16:00:00,0.955238070383202,0.734858709999997
"median_ensemble","energy","68 hour",2022-11-30 23:59:00,49.243,53.164,55.897,58.654,62.676,2022-12-03 20:00:00,0.795795900851546,0.562656441717799
"median_ensemble","wind","36 hour",2022-11-30 23:59:00,7.987,12.627,15.062,17.344,21.74,2022-12-01 12:00:00,1.76031462095963,3.5417890076245
"median_ensemble","wind","48 hour",2022-11-30 23:59:00,4.496,9.503,12.263,14.956,20.297,2022-12-02 00:00:00,1.34138187569158,2.9033987318227
"median_ensemble","wind","60 hour",2022-11-30 23:59:00,7.391,12.655,15.352,17.94,23.567,2022-12-02 12:00:00,4.0708025018774,7.4322959576671
"median_ensemble","wind","72 hour",2022-11-30 23:59:00,5.429,10.109,12.626,15.24,20.498,2022-12-03 00:00:00,0.802518233491801,0.6937395091062
"median_ensemble","wind","84 hour",2022-11-30 23:59:00,6.742,11.989,14.507,17.892,25.164,2022-12-03 12:00:00,0.969105879250107,0.972957629853301
"OlennaTyrell","DAX","1 day",2022-11-30 23:59:00,-1.67,-0.519,0.085,0.689,1.841,2022-12-01 17:30:00,0.268016674066066,0.560457038252712
"OlennaTyrell","DAX","2 day",2022-11-30 23:59:00,-2.064,-0.592,0.18,0.953,2.425,2022-12-02 17:30:00,0.3462901362718,0.734739858120104
"OlennaTyrell","DAX","5 day",2022-11-30 23:59:00,-2.682,-0.744,0.273,1.29,3.228,2022-12-05 17:30:00,0.277961340121076,0.0775415833177664
"OlennaTyrell","DAX","6 day",2022-11-30 23:59:00,-2.619,-0.676,0.343,1.363,3.306,2022-12-06 17:30:00,0.406737292690256,0.717884900573923
"OlennaTyrell","DAX","7 day",2022-11-30 23:59:00,-2.516,-0.572,0.448,1.468,3.413,2022-12-07 17:30:00,0.692975359393054,1.39621064469749
"OlennaTyrell","energy","36 hour",2022-11-30 23:59:00,63.132,68.059,70.271,72.298,75.999,2022-12-02 12:00:00,0.628929761101962,0.381633435582799
"OlennaTyrell","energy","40 hour",2022-11-30 23:59:00,59.308,64.228,66.522,68.833,73.137,2022-12-02 16:00:00,0.923450543210333,1.6231411042945
"OlennaTyrell","energy","44 hour",2022-11-30 23:59:00,55.134,59.648,62.29,65.001,68.809,2022-12-02 20:00:00,0.781729157861434,0.548274539877198
"OlennaTyrell","energy","60 hour",2022-11-30 23:59:00,52.371,56.099,58.338,60.338,63.704,2022-12-03 12:00:00,1.03966234871335,2.1710536809815
"OlennaTyrell","energy","64 hour",2022-11-30 23:59:00,50.061,54.11,55.984,58.299,61.664,2022-12-03 16:00:00,1.14011419989769,2.552185582822
"OlennaTyrell","energy","68 hour",2022-11-30 23:59:00,49.243,53.164,55.897,58.176,61.546,2022-12-03 20:00:00,0.73675791492055,0.562656441717799
"OlennaTyrell","wind","36 hour",2022-11-30 23:59:00,NA,NA,NA,NA,NA,2022-12-01 12:00:00,2.55209098721447,4.7676673977
"OlennaTyrell","wind","48 hour",2022-11-30 23:59:00,NA,NA,NA,NA,NA,2022-12-02 00:00:00,2.54158839471111,4.0691868184
"OlennaTyrell","wind","60 hour",2022-11-30 23:59:00,NA,NA,NA,NA,NA,2022-12-02 12:00:00,4.30878717215187,7.89733301775048
"OlennaTyrell","wind","72 hour",2022-11-30 23:59:00,NA,NA,NA,NA,NA,2022-12-03 00:00:00,1.683223075,2.9694
"OlennaTyrell","wind","84 hour",2022-11-30 23:59:00,NA,NA,NA,NA,NA,2022-12-03 12:00:00,2.957997728725,6.5191617358
"PetyrBaelish","DAX","1 day",2022-11-30 23:59:00,-2.316,-0.606,0.08,0.726,2.139,2022-12-01 17:30:00,0.290853082721853,0.565181878536847
"PetyrBaelish","DAX","2 day",2022-11-30 23:59:00,-3.224,-0.889,0.157,1.091,2.896,2022-12-02 17:30:00,0.410912267343485,0.758339704498794
"PetyrBaelish","DAX","5 day",2022-11-30 23:59:00,-3.963,-1.03,0.226,1.383,3.474,2022-12-05 17:30:00,0.340654000424142,0.125026052059734
"PetyrBaelish","DAX","6 day",2022-11-30 23:59:00,-4.516,-1.19,0.285,1.617,4.021,2022-12-06 17:30:00,0.497950552869188,0.659305457233883
"PetyrBaelish","DAX","7 day",2022-11-30 23:59:00,-5.007,-1.337,0.379,1.862,4.374,2022-12-07 17:30:00,0.679215112201447,1.32738334979348
"PetyrBaelish","energy","36 hour",2022-11-30 23:59:00,51.134,65.384,70.177,72.308,75.396,2022-12-02 12:00:00,1.03017852759326,0.475398149490346
"PetyrBaelish","energy","40 hour",2022-11-30 23:59:00,46.91,61.125,66.105,68.302,71.569,2022-12-02 16:00:00,1.37250736894423,2.0407391037941
"PetyrBaelish","energy","44 hour",2022-11-30 23:59:00,47.445,59.374,64.576,65.987,68.878,2022-12-02 20:00:00,1.22300655039365,1.7368545126915
"PetyrBaelish","energy","60 hour",2022-11-30 23:59:00,46.814,56.28,60.963,64.975,69.193,2022-12-03 12:00:00,1.18410211040327,0.453833386778832
"PetyrBaelish","energy","64 hour",2022-11-30 23:59:00,42.59,52.021,56.89,60.969,65.366,2022-12-03 16:00:00,1.45164759704271,1.64525756752491
"PetyrBaelish","energy","68 hour",2022-11-30 23:59:00,43.125,50.27,55.361,58.654,62.676,2022-12-03 20:00:00,1.0393393929998,0.0273360489606844
"PetyrBaelish","wind","36 hour",2022-11-30 23:59:00,NA,NA,NA,NA,NA,2022-12-01 12:00:00,2.55209098721447,4.7676673977
"PetyrBaelish","wind","48 hour",2022-11-30 23:59:00,NA,NA,NA,NA,NA,2022-12-02 00:00:00,2.54158839471111,4.0691868184
"PetyrBaelish","wind","60 hour",2022-11-30 23:59:00,NA,NA,NA,NA,NA,2022-12-02 12:00:00,4.30878717215187,7.89733301775048
"PetyrBaelish","wind","72 hour",2022-11-30 23:59:00,NA,NA,NA,NA,NA,2022-12-03 00:00:00,1.683223075,2.9694
"PetyrBaelish","wind","84 hour",2022-11-30 23:59:00,NA,NA,NA,NA,NA,2022-12-03 12:00:00,2.957997728725,6.5191617358
"PhoebeBuffay","DAX","1 day",2022-11-30 23:59:00,-3.158,-0.524,0.097,0.718,2.757,2022-12-01 17:30:00,0.293018970971317,0.548276211975551
"PhoebeBuffay","DAX","2 day",2022-11-30 23:59:00,-4.132,-0.824,0.133,1.027,3.57,2022-12-02 17:30:00,0.418564572778432,0.782123767426057
"PhoebeBuffay","DAX","5 day",2022-11-30 23:59:00,-5.275,-0.88,0.19,1.302,4.629,2022-12-05 17:30:00,0.349394355486796,0.160949046456071
"PhoebeBuffay","DAX","6 day",2022-11-30 23:59:00,-6.283,-1.016,0.274,1.533,5.367,2022-12-06 17:30:00,0.501176788890268,0.648677864238145
"PhoebeBuffay","DAX","7 day",2022-11-30 23:59:00,-6.736,-1.092,0.414,1.681,6.26,2022-12-07 17:30:00,0.679692615327424,1.36233505684586
"PhoebeBuffay","energy","36 hour",2022-11-30 23:59:00,46.309,60.961,68.648,76.336,90.988,2022-12-02 12:00:00,2.38512082674105,2.00396166170293
"PhoebeBuffay","energy","40 hour",2022-11-30 23:59:00,42.783,58.448,66.667,74.886,90.55,2022-12-02 16:00:00,2.41724546159272,1.47885099944945
"PhoebeBuffay","energy","44 hour",2022-11-30 23:59:00,37.708,54.35,63.082,71.814,88.457,2022-12-02 20:00:00,2.3026082489833,0.243336214198713
"PhoebeBuffay","energy","60 hour",2022-11-30 23:59:00,37.331,58.042,68.909,79.776,100.487,2022-12-03 12:00:00,4.48497989480656,8.40010120554745
"PhoebeBuffay","energy","64 hour",2022-11-30 23:59:00,33.983,55.59,66.927,78.264,99.871,2022-12-03 16:00:00,4.60461530320397,8.39146239861639
"PhoebeBuffay","energy","68 hour",2022-11-30 23:59:00,29.053,51.542,63.343,75.143,97.632,2022-12-03 20:00:00,4.64758147603525,8.00864939793763
"PhoebeBuffay","wind","36 hour",2022-11-30 23:59:00,7.987,12.627,15.062,17.497,22.138,2022-12-01 12:00:00,1.77957733369859,3.54178900762448
"PhoebeBuffay","wind","48 hour",2022-11-30 23:59:00,4.312,9.503,12.263,15.027,20.297,2022-12-02 00:00:00,1.350275469198,2.90339873182266
"PhoebeBuffay","wind","60 hour",2022-11-30 23:59:00,7.436,12.856,15.703,18.551,23.978,2022-12-02 12:00:00,4.26612591302165,7.78348008038455
"PhoebeBuffay","wind","72 hour",2022-11-30 23:59:00,5.429,10.357,12.953,15.549,20.498,2022-12-03 00:00:00,0.743294579721546,0.367093441632701
"PhoebeBuffay","wind","84 hour",2022-11-30 23:59:00,6.933,12.926,16.08,19.235,25.248,2022-12-03 12:00:00,0.933996879671355,0.600068497787287
"power_benchmark","energy","36 hour",2022-11-30 23:59:00,54.567,64.956,66.84,70.899,75.454,2022-12-02 12:00:00,1.56565175,3.81224999999999
"power_benchmark","energy","40 hour",2022-11-30 23:59:00,49.942,59.542,61.727,67.069,72.032,2022-12-02 16:00:00,2.687919,6.419
"power_benchmark","energy","44 hour",2022-11-30 23:59:00,50.564,55.691,58.546,64.226,68.136,2022-12-02 20:00:00,1.8878515,4.29275
"power_benchmark","energy","60 hour",2022-11-30 23:59:00,52.16,54.959,56.334,59.725,63.995,2022-12-03 12:00:00,1.7434675,4.17525
"power_benchmark","energy","64 hour",2022-11-30 23:59:00,48.178,50.648,52.254,56.384,63.038,2022-12-03 16:00:00,2.8394095,6.28225
"power_benchmark","energy","68 hour",2022-11-30 23:59:00,46.399,49.374,51.942,56.985,60.392,2022-12-03 20:00:00,1.57940125,3.39150000000001
"W-EMOS","wind","36 hour",2022-11-30 23:59:00,7.987,12.627,15.062,17.497,22.138,2022-12-01 12:00:00,1.77957733369861,3.5417890076245
"W-EMOS","wind","48 hour",2022-11-30 23:59:00,4.312,9.503,12.263,15.027,20.297,2022-12-02 00:00:00,1.35027546919801,2.9033987318227
"W-EMOS","wind","60 hour",2022-11-30 23:59:00,7.436,12.856,15.703,18.551,23.978,2022-12-02 12:00:00,4.26612591302165,7.7834800803846
"W-EMOS","wind","72 hour",2022-11-30 23:59:00,5.429,10.357,12.953,15.549,20.498,2022-12-03 00:00:00,0.743294579721552,0.367093441632701
"W-EMOS","wind","84 hour",2022-11-30 23:59:00,6.933,12.926,16.08,19.235,25.248,2022-12-03 12:00:00,0.933996879671357,0.600068497787298
"W-ENS","wind","36 hour",2022-11-30 23:59:00,9.15,11.005,11.95,13.21,14.141,2022-12-01 12:00:00,0.35641,0.43
"W-ENS","wind","48 hour",2022-11-30 23:59:00,4.68,7.855,10.075,11.49,12.41,2022-12-02 00:00:00,0.5838025,0.715
"W-ENS","wind","60 hour",2022-11-30 23:59:00,7.905,11.6,12.73,14.152,17.414,2022-12-02 12:00:00,2.7843425,4.81
"W-ENS","wind","72 hour",2022-11-30 23:59:00,6.314,9.215,10.38,11.358,14.245,2022-12-03 00:00:00,1.6665575,2.94
"W-ENS","wind","84 hour",2022-11-30 23:59:00,8.35,11.172,12.465,15.38,20.064,2022-12-03 12:00:00,1.1808975,3.015
"Yoda","DAX","1 day",2022-11-30 23:59:00,-1.093,-0.432,0.665,0.432,1.093,2022-12-01 17:30:00,0.19752747332007,0.0189560505027875
"Yoda","DAX","2 day",2022-11-30 23:59:00,-1.517,-0.6,0.922,0.6,1.517,2022-12-02 17:30:00,0.277925637584219,0.00725715999507837
"Yoda","DAX","5 day",2022-11-30 23:59:00,-1.016,-0.401,0.617,0.401,1.016,2022-12-05 17:30:00,0.153916887312358,0.266733859024106
"Yoda","DAX","6 day",2022-11-30 23:59:00,-1.571,-0.621,0.955,0.621,1.571,2022-12-06 17:30:00,0.421437490644982,1.32951672328549
"Yoda","DAX","7 day",2022-11-30 23:59:00,-1.33,-0.525,0.808,0.525,1.33,2022-12-07 17:30:00,0.652034107989908,1.75652561552471
"Yoda","energy","36 hour",2022-11-30 23:59:00,54.555,69.495,71.588,73.172,76.457,2022-12-02 12:00:00,0.773961377905888,0.936142156652707
"Yoda","energy","40 hour",2022-11-30 23:59:00,50.63,65.972,68.39,70.144,73.819,2022-12-02 16:00:00,0.697984015360249,0.244101307514413
"Yoda","energy","44 hour",2022-11-30 23:59:00,52.071,64.912,68.237,69.977,73.257,2022-12-02 20:00:00,2.62741768875261,5.39872712422549
"Yoda","energy","60 hour",2022-11-30 23:59:00,52.631,61.384,63.368,66.249,71.079,2022-12-03 12:00:00,1.5930031421511,2.85938071862508
"Yoda","energy","64 hour",2022-11-30 23:59:00,48.646,57.635,59.925,62.985,68.233,2022-12-03 16:00:00,1.0086090834209,1.38883169956377
"Yoda","energy","68 hour",2022-11-30 23:59:00,50.101,56.626,59.828,62.871,67.718,2022-12-03 20:00:00,2.21634336868245,4.49372549012843
"Yoda","wind","36 hour",2022-11-30 23:59:00,NA,NA,NA,NA,NA,2022-12-01 12:00:00,2.55209098721447,4.7676673977
"Yoda","wind","48 hour",2022-11-30 23:59:00,NA,NA,NA,NA,NA,2022-12-02 00:00:00,2.54158839471111,4.0691868184
"Yoda","wind","60 hour",2022-11-30 23:59:00,NA,NA,NA,NA,NA,2022-12-02 12:00:00,4.30878717215187,7.89733301775048
"Yoda","wind","72 hour",2022-11-30 23:59:00,NA,NA,NA,NA,NA,2022-12-03 00:00:00,1.683223075,2.9694
"Yoda","wind","84 hour",2022-11-30 23:59:00,NA,NA,NA,NA,NA,2022-12-03 12:00:00,2.957997728725,6.5191617358
