"forecast_date","target","horizon","q0.025","q0.25","q0.5","q0.75","q0.975"
2022-11-16,"wind","36 hour",15.25575,20.93,22.77,24.945,30.90625
2022-11-16,"wind","48 hour",3.2125,6.2775,9.465,13.4,17.2555
2022-11-16,"wind","60 hour",12.9655,15.1875,17.365,19.4975,21.1065
2022-11-16,"wind","72 hour",3.38525,6.02,7.52,11.2625,18.32825
2022-11-16,"wind","84 hour",0.623,4.8575,8.585,12.1825,23.68575
