###############################################
# Feature-parallel PyTorch k-means clustering #
###############################################

Loading data... /pfs/work7/workspace/scratch/ku4408-VL_ScalableAI/data/cityscapes_300.h5[cityscapes_data]

Rank 0 / 4 : 	[OK]
Start fitting the data...
Rank 1 / 4 : 	[OK]
Rank 2 / 4 : 	[OK]
Rank 3 / 4 : 	[OK]
Rank 0 / 4 : Shape of data [#samples, #features] = [300, 1572864]
Rank 1 / 4 : Shape of data [#samples, #features] = [300, 1572864]
Rank 3 / 4 : Shape of data [#samples, #features] = [300, 1572864]
Rank 2 / 4 : Shape of data [#samples, #features] = [300, 1572864]
Rank 0 / 4 : Iteration 0 ...
Rank 2 / 4 : Iteration 0 ...
Rank 1 / 4 : Iteration 0 ...
Rank 3 / 4 : Iteration 0 ...
Rank 2 / 4 : Iteration 1 ...
Rank 0 / 4 : Iteration 1 ...
Rank 1 / 4 : Iteration 1 ...
Rank 3 / 4 : Iteration 1 ...
Rank 3 / 4 : Iteration 2 ...
Rank 1 / 4 : Iteration 2 ...
Rank 0 / 4 : Iteration 2 ...
Rank 2 / 4 : Iteration 2 ...
Rank 1 / 4 : Iteration 3 ...
Rank 3 / 4 : Iteration 3 ...
Rank 0 / 4 : Iteration 3 ...
Rank 2 / 4 : Iteration 3 ...
Rank 0 / 4 : Iteration 4 ...
Rank 3 / 4 : Iteration 4 ...
Rank 1 / 4 : Iteration 4 ...
Rank 2 / 4 : Iteration 4 ...
Rank 3 / 4 : Iteration 5 ...
Rank 1 / 4 : Iteration 5 ...
Rank 0 / 4 : Iteration 5 ...
Rank 2 / 4 : Iteration 5 ...
Rank 0 / 4 : Iteration 6 ...
Rank 3 / 4 : Iteration 6 ...
Rank 1 / 4 : Iteration 6 ...
Rank 2 / 4 : Iteration 6 ...
Rank 3 / 4 : Iteration 7 ...
Rank 1 / 4 : Iteration 7 ...
Rank 0 / 4 : Iteration 7 ...
Rank 2 / 4 : Iteration 7 ...
Rank 3 / 4 : Iteration 8 ...
Rank 1 / 4 : Iteration 8 ...
Rank 0 / 4 : Iteration 8 ...
Rank 2 / 4 : Iteration 8 ...
Rank 3 / 4 : Iteration 9 ...
Rank 1 / 4 : Iteration 9 ...
Rank 0 / 4 : Iteration 9 ...
Rank 2 / 4 : Iteration 9 ...
Rank 3 / 4 : Iteration 10 ...
Rank 1 / 4 : Iteration 10 ...
Rank 0 / 4 : Iteration 10 ...
Rank 2 / 4 : Iteration 10 ...
Rank 3 / 4 : Iteration 11 ...
Rank 0 / 4 : Iteration 11 ...
Rank 2 / 4 : Iteration 11 ...
Rank 1 / 4 : Iteration 11 ...
Rank 3 / 4 : Iteration 12 ...
Rank 1 / 4 : Iteration 12 ...
Rank 0 / 4 : Iteration 12 ...
Rank 2 / 4 : Iteration 12 ...
Rank 0 / 4 : Iteration 13 ...
Rank 3 / 4 : Iteration 13 ...
Rank 1 / 4 : Iteration 13 ...
Rank 2 / 4 : Iteration 13 ...
Rank 0 / 4 : Iteration 14 ...
Rank 1 / 4 : Iteration 14 ...
Rank 3 / 4 : Iteration 14 ...
Rank 2 / 4 : Iteration 14 ...
Rank 0 / 4 : Iteration 15 ...
Rank 1 / 4 : Iteration 15 ...
Rank 3 / 4 : Iteration 15 ...
Rank 2 / 4 : Iteration 15 ...
Rank 0 / 4 : Iteration 16 ...
Rank 3 / 4 : Iteration 16 ...
Rank 1 / 4 : Iteration 16 ...
Rank 2 / 4 : Iteration 16 ...
Rank 0 / 4 : Iteration 17 ...
Rank 1 / 4 : Iteration 17 ...
Rank 3 / 4 : Iteration 17 ...
Rank 2 / 4 : Iteration 17 ...
Rank 0 / 4 : Iteration 18 ...
Rank 3 / 4 : Iteration 18 ...
Rank 1 / 4 : Iteration 18 ...
Rank 2 / 4 : Iteration 18 ...
Rank 0 / 4 : Iteration 19 ...
Rank 3 / 4 : Iteration 19 ...
Rank 1 / 4 : Iteration 19 ...
Rank 2 / 4 : Iteration 19 ...
DONE.
Run time: 	259.1418700427748s s
/pfs/work7/workspace/scratch/ku4408-kmeans

============================= JOB FEEDBACK =============================

NodeName=uc2n[003,005-007]
Job ID: 20167551
Cluster: uc2
User/Group: ku4408/scc
State: COMPLETED (exit code 0)
Nodes: 4
Cores per node: 80
CPU Utilized: 00:17:23
CPU Efficiency: 0.94% of 1-06:40:00 core-walltime
Job Wall-clock time: 00:05:45
Memory Utilized: 5.50 GB
Memory Efficiency: 3.52% of 156.25 GB
