Restoring modules from user's RF, for system: "uc2"
Loading data...
Done...
Train samples and targets have shapes (3749999, 18) and (3749999,).
First ten elements are: [[ 5.64361513e-01 -1.31939769e+00 -8.58432949e-01  7.67571807e-01
   3.65966469e-01  5.09164035e-01  5.50257266e-01  1.43123353e+00
   8.26004028e-01 -2.35704675e-01  8.24788570e-01  6.90458238e-01
   7.42864966e-01  1.04133034e+00  8.45727503e-01  8.24382603e-01
   1.54591525e+00  5.65462001e-02]
 [ 1.41570020e+00 -1.13652432e+00 -1.40880847e+00  2.07752991e+00
  -1.24187887e+00  2.12358192e-01  4.00426447e-01  1.58091938e+00
   4.63205069e-01  2.39674687e-01  1.39051378e+00  8.29233170e-01
   5.29196382e-01  6.87759578e-01  1.39403772e+00  5.13132393e-01
   9.53929961e-01  2.50237994e-02]
 [ 5.15676498e-01  8.99099350e-01  1.31472409e+00  7.16880798e-01
  -1.59324300e+00  7.97395408e-01  8.52125227e-01 -6.74679279e-01
   1.27914500e+00 -5.38600862e-01  1.15659142e+00  9.80365813e-01
   7.52184510e-01  2.09187770e+00  1.17206526e+00  1.56408703e+00
   1.38404322e+00  1.75529998e-02]
 [ 1.14175045e+00  5.16864717e-01 -1.72178948e+00  1.75364316e+00
   4.96453345e-01  3.36790174e-01  1.31611645e+00  9.42051291e-01
   1.74705517e+00  1.56168568e+00  1.14231932e+00  1.14846158e+00
   8.92165601e-01  0.00000000e+00  1.11719549e+00  6.31326616e-01
   1.39848244e+00  8.98976028e-02]
 [ 4.24049288e-01  1.15563667e+00 -4.93615657e-01  5.88874996e-01
   1.96341932e-01  1.13378465e+00  2.81785667e-01  3.05213034e-01
   4.10394430e-01  5.25891066e-01  4.71476227e-01  3.52367163e-01
   6.63210750e-01  0.00000000e+00  4.74265933e-01  2.06591919e-01
   1.34884167e+00  3.01517006e-02]
 [ 1.20513952e+00 -1.58459127e-01  1.48004606e-01  5.59386134e-01
  -1.13073027e+00 -1.50335062e+00  5.14428914e-01 -1.54805779e-02
   2.34338477e-01  8.17031264e-01  9.05386686e-01  4.73082125e-01
   4.63679522e-01  0.00000000e+00  7.87792861e-01  1.57026350e-01
   2.85524398e-01  9.09316987e-02]
 [ 6.71923816e-01  1.17850959e+00  2.47729108e-01  7.95828521e-01
   4.49932635e-01  1.19901967e+00  5.08929729e-01 -1.20858920e+00
   2.12651134e-01 -1.87565863e-01  6.52959883e-01  7.81309962e-01
   1.06182504e+00  1.45686460e+00  6.24516964e-01  1.10378087e+00
   2.64703959e-01  1.90106004e-01]
 [ 1.75623548e+00 -8.11564386e-01 -7.56103158e-01  2.89606285e+00
   5.27267218e-01  1.06524241e+00  5.07203460e-01  2.55363166e-01
   7.58145273e-01 -1.92832649e-01  2.43577838e+00  1.09752047e+00
   3.99844527e-01  9.15749371e-01  2.45047426e+00  7.29176223e-01
   1.56577051e+00  1.05923004e-02]
 [ 7.49598086e-01  1.79259151e-01 -6.93670392e-01  9.80782568e-01
  -1.15915768e-01  9.10121381e-01  3.27323943e-01 -1.58151519e+00
   4.91353631e-01  1.06380098e-01  7.07787454e-01  5.53513527e-01
   6.93974793e-01  5.60284913e-01  7.14386880e-01  4.53956306e-01
   1.07983541e+00  5.54984994e-02]
 [ 6.86034620e-01 -7.57933497e-01 -1.38983846e-01  9.39946949e-01
  -1.36964393e+00 -1.38785315e+00  1.18249692e-01 -4.25062887e-03
   4.07678187e-02  3.65130663e-01  6.98383689e-01  2.76638836e-01
   3.51507187e-01  1.49598479e-01  6.53427541e-01  4.28879261e-01
   2.29316071e-01  3.19937011e-04]] and [0. 0. 0. 1. 0. 0. 0. 1. 0. 1.]
Test samples and targets have shapes (1250000, 18) and (1250000,).
First ten elements are: [[ 1.74275374e+00  8.65227401e-01 -1.23019648e+00  1.42320979e+00
  -2.56393015e-01  1.06697607e+00  1.83100605e+00  3.26419979e-01
   2.68366289e+00 -1.49651408e+00  1.63528502e+00  2.16725349e+00
   1.17607129e+00  3.06618905e+00  1.71234071e+00  2.55725169e+00
   1.34597421e+00  3.30614001e-01]
 [ 7.66915739e-01  3.86776477e-02  1.11490178e+00  8.27923179e-01
   5.84184408e-01 -4.17088687e-01  2.63665676e+00  4.38048869e-01
   3.74020076e+00  2.31312585e+00  6.93222225e-01  1.28649092e+00
   1.64682853e+00  0.00000000e+00  8.38083744e-01  1.67206895e+00
   1.47795427e+00  3.63853984e-02]
 [ 6.58630311e-01 -4.16876793e-01  8.65921436e-04  8.43965113e-01
  -1.54971278e+00  1.66989827e+00  1.03182346e-01 -6.68376386e-01
   1.45711288e-01  3.15547764e-01  7.56078422e-01  2.75453895e-01
   3.23295623e-01  1.99500620e-01  7.55473256e-01  1.63030282e-01
   6.00025654e-01  3.14942002e-02]
 [ 6.13592684e-01 -6.93519533e-01 -1.27218652e+00  8.75339746e-01
  -9.40660298e-01  1.28140271e+00  3.87254924e-01  2.12378606e-01
   5.81317425e-01 -5.81764914e-02  6.00503147e-01  6.77767038e-01
   1.00157046e+00  1.30852413e+00  5.43647826e-01  1.00621831e+00
   2.15435117e-01  1.36150002e-01]
 [ 6.80473804e-01 -1.26157969e-01  1.00841391e+00  1.11625648e+00
   1.52294946e+00 -1.60370982e+00  7.35401154e-01 -1.55922413e-01
   1.48185194e-01 -3.98200095e-01  1.08359897e+00  1.02833104e+00
   8.42130125e-01  2.06264448e+00  1.06952155e+00  1.54051185e+00
   5.17797709e-01  2.06914004e-02]
 [ 8.17997992e-01 -1.27970660e+00 -1.05499721e+00  1.03085434e+00
  -5.96156120e-01  7.66124964e-01  5.86613595e-01  1.59318316e+00
   8.77496719e-01  5.95376492e-01  8.07319641e-01  7.00172186e-01
   7.69616842e-01  0.00000000e+00  8.14855099e-01  4.66460317e-01
   1.26820982e+00  6.55615032e-02]
 [ 1.37811887e+00 -3.02617729e-01  1.26041424e+00  1.71841776e+00
   5.75853169e-01 -5.95618963e-01  1.27876365e+00 -3.82022053e-01
   7.02762127e-01 -8.79842401e-01  1.43093932e+00  1.50850642e+00
   9.35499072e-01  7.34687567e-01  1.49561214e+00  9.05745566e-01
   1.46556187e+00  2.66819000e-01]
 [ 4.72059608e-01  1.04023826e+00  5.09127080e-02  6.62546813e-01
  -1.21942997e+00  1.38550508e+00  5.77613972e-02 -6.28660321e-01
   8.21040496e-02  2.81440645e-01  9.36661541e-01  1.96489379e-01
   1.86154306e-01  2.94077545e-01  9.30149436e-01  3.11541677e-01
   1.66801065e-01  5.61589980e-03]
 [ 3.86759609e-01  1.91086912e+00 -4.05443370e-01  4.74322557e-01
   1.52558553e+00  7.22145379e-01  9.18595195e-01  1.39290273e+00
   1.28713632e+00 -4.09361541e-01  3.57348889e-01  7.44143307e-01
   1.84790432e+00  1.11751854e+00  4.44342762e-01  8.66362274e-01
   1.33872914e+00  5.33474982e-01]
 [ 2.34400272e+00  1.49294049e-01 -3.44877660e-01  2.03919721e+00
   6.40939236e-01  1.38368320e+00  5.69031775e-01  1.19549787e+00
   2.94525981e-01 -2.15599939e-01  1.93577302e+00  1.28865743e+00
   5.90742588e-01  0.00000000e+00  1.90493810e+00  4.51742530e-01
   2.74458319e-01  2.28890002e-01]] and [1. 1. 1. 0. 0. 1. 1. 0. 0. 1.]
Time for data loading is 698.3978498987854 s.
Set up classifier.
Train.
Time for training is 7602.39036767371 s.
 Accuracy is 0.7993904.

============================= JOB FEEDBACK =============================

NodeName=uc2n471
Job ID: 21655162
Cluster: uc2
User/Group: ku4408/scc
State: COMPLETED (exit code 0)
Nodes: 1
Cores per node: 40
CPU Utilized: 01:25:45
CPU Efficiency: 1.54% of 3-20:59:20 core-walltime
Job Wall-clock time: 02:19:29
Memory Utilized: 6.94 GB
Memory Efficiency: 15.79% of 43.95 GB
