##############################
# PyTorch k-means clustering #
##############################

Loading data... /pfs/work7/workspace/scratch/ku4408-VL_ScalableAI/data/cityscapes_300.h5[cityscapes_data]

Open h5 file...
Torch tensor created...
Start fitting the data...
Iteration 0 ...
Iteration 1 ...
Iteration 2 ...
Iteration 3 ...
Iteration 4 ...
Iteration 5 ...
Iteration 6 ...
Iteration 7 ...
Iteration 8 ...
Iteration 9 ...
Iteration 10 ...
Iteration 11 ...
Iteration 12 ...
Iteration 13 ...
Iteration 14 ...
Iteration 15 ...
Iteration 16 ...
Iteration 17 ...
Iteration 18 ...
Iteration 19 ...
DONE.
Run time: 	9.046169609762728s s

============================= JOB FEEDBACK =============================

NodeName=uc2n488
Job ID: 20167556
Cluster: uc2
User/Group: ku4408/scc
State: COMPLETED (exit code 0)
Nodes: 1
Cores per node: 20
CPU Utilized: 00:00:25
CPU Efficiency: 0.95% of 00:43:40 core-walltime
Job Wall-clock time: 00:02:11
Memory Utilized: 8.52 GB
Memory Efficiency: 6.82% of 125.00 GB
