Restoring modules from user's RF, for system: "uc2"
[0/8]: Loading data...
Using root-based dataloader...
[3/8]: Loading data...
Using root-based dataloader...
[5/8]: Loading data...
Using root-based dataloader...
[7/8]: Loading data...
Using root-based dataloader...
[2/8]: Loading data...
Using root-based dataloader...
[1/8]: Loading data...
Using root-based dataloader...
[4/8]: Loading data...
Using root-based dataloader...
[6/8]: Loading data...
Using root-based dataloader...
There are 3750000 train and 1250000 test samples.
Local train samples: [468750 468750 468750 468750 468750 468750 468750 468750]
train_indices have shape (3750000,).
[5/8]: Done...
Local train samples and targets have shapes (468750, 18) and (468750,).
Global test samples and targets have shapes (1250000, 18) and (1250000,).

[1/8]: Done...
Local train samples and targets have shapes (468750, 18) and (468750,).
Global test samples and targets have shapes (1250000, 18) and (1250000,).

[3/8]: Done...
Local train samples and targets have shapes (468750, 18) and (468750,).
Global test samples and targets have shapes (1250000, 18) and (1250000,).

[7/8]: Done...
Local train samples and targets have shapes (468750, 18) and (468750,).
Global test samples and targets have shapes (1250000, 18) and (1250000,).

[2/8]: Done...
Local train samples and targets have shapes (468750, 18) and (468750,).
Global test samples and targets have shapes (1250000, 18) and (1250000,).

[4/8]: Done...
Local train samples and targets have shapes (468750, 18) and (468750,).
Global test samples and targets have shapes (1250000, 18) and (1250000,).

[6/8]: Done...
Local train samples and targets have shapes (468750, 18) and (468750,).
Global test samples and targets have shapes (1250000, 18) and (1250000,).

[0/8]: Done...
Local train samples and targets have shapes (468750, 18) and (468750,).
Global test samples and targets have shapes (1250000, 18) and (1250000,).

[5/8]: Labels are [0. 0. 0. ... 1. 0. 1.]
[1/8]: Labels are [0. 1. 0. ... 1. 0. 0.]
[2/8]: Labels are [1. 0. 0. ... 0. 0. 1.]
[7/8]: Labels are [1. 1. 0. ... 0. 0. 0.]
[6/8]: Labels are [0. 0. 0. ... 0. 1. 1.]
[3/8]: Labels are [1. 1. 0. ... 0. 0. 1.]
[4/8]: Labels are [1. 0. 1. ... 0. 0. 0.]
[0/8]: Labels are [1. 1. 0. ... 1. 0. 0.]
Elapsed time is 50.72652635013219 s.
[0/8]: Set up and train local random forest.
[2/8]: Set up and train local random forest.
[1/8]: Set up and train local random forest.
[6/8]: Set up and train local random forest.
[7/8]: Set up and train local random forest.
[4/8]: Set up and train local random forest.
[3/8]: Set up and train local random forest.
[5/8]: Set up and train local random forest.
[4/8]: Get predictions of individual sub estimators.
[7/8]: Get predictions of individual sub estimators.
[6/8]: Get predictions of individual sub estimators.
[5/8]: Get predictions of individual sub estimators.
[0/8]: Get predictions of individual sub estimators.
[2/8]: Get predictions of individual sub estimators.
[3/8]: Get predictions of individual sub estimators.
[1/8]: Get predictions of individual sub estimators.
[7/8]: Allgather predictions.
[7/8]: tree_predictions (12, 1250000), float64
[4/8]: Allgather predictions.
[4/8]: tree_predictions (12, 1250000), float64
[6/8]: Allgather predictions.
[6/8]: tree_predictions (12, 1250000), float64
[5/8]: Allgather predictions.
[5/8]: tree_predictions (12, 1250000), float64
[2/8]: Allgather predictions.
[2/8]: tree_predictions (13, 1250000), float64
[0/8]: Allgather predictions.
[0/8]: tree_predictions (13, 1250000), float64
[3/8]: Allgather predictions.
[3/8]: tree_predictions (13, 1250000), float64
[1/8]: Allgather predictions.
[1/8]: tree_predictions (13, 1250000), float64
[0/8]: tree counts [13 13 13 13 12 12 12 12] and displs [ 0 13 26 39 52 64 76 88]
[0/8]: all_predictions (100, 1250000), float64
[3/8]: tree counts [13 13 13 13 12 12 12 12] and displs [ 0 13 26 39 52 64 76 88]
[3/8]: all_predictions (100, 1250000), float64
[7/8]: tree counts [13 13 13 13 12 12 12 12] and displs [ 0 13 26 39 52 64 76 88]
[6/8]: tree counts [13 13 13 13 12 12 12 12] and displs [ 0 13 26 39 52 64 76 88]
[6/8]: all_predictions (100, 1250000), float64
[7/8]: all_predictions (100, 1250000), float64
[1/8]: tree counts [13 13 13 13 12 12 12 12] and displs [ 0 13 26 39 52 64 76 88]
[1/8]: all_predictions (100, 1250000), float64
[5/8]: tree counts [13 13 13 13 12 12 12 12] and displs [ 0 13 26 39 52 64 76 88]
[5/8]: all_predictions (100, 1250000), float64
[2/8]: tree counts [13 13 13 13 12 12 12 12] and displs [ 0 13 26 39 52 64 76 88]
[2/8]: all_predictions (100, 1250000), float64
[4/8]: tree counts [13 13 13 13 12 12 12 12] and displs [ 0 13 26 39 52 64 76 88]
[4/8]: all_predictions (100, 1250000), float64
[6/8]: Directly before Allgatherv...
[3/8]: Directly before Allgatherv...
[2/8]: Directly before Allgatherv...
[1/8]: Directly before Allgatherv...
[0/8]: Directly before Allgatherv...
[4/8]: Directly before Allgatherv...
[7/8]: Directly before Allgatherv...
[5/8]: Directly before Allgatherv...
[0/8]: Calculate majority vote.
[4/8]: Calculate majority vote.
[6/8]: Calculate majority vote.
[7/8]: Calculate majority vote.
[2/8]: Calculate majority vote.
[3/8]: Calculate majority vote.
[5/8]: Calculate majority vote.
[1/8]: Calculate majority vote.
[0/8]: Local accuracy is 0.7860144.
[7/8]: Local accuracy is 0.7856088.
[4/8]: Local accuracy is 0.7862968.
[2/8]: Local accuracy is 0.7861352.
[6/8]: Local accuracy is 0.7860064.
[5/8]: Local accuracy is 0.7862688.
[1/8]: Local accuracy is 0.785568.
[3/8]: Local accuracy is 0.7862328.
Median local accuracy is 0.7860748. Min 0.785568 and max 0.7862968.
Global accuracy is 0.8008904.
Average train time is 73.27786629775073 s.
[5/8]: Loading data...
[7/8]: Loading data...
[6/8]: Loading data...
[1/8]: Loading data...
[4/8]: Loading data...
[2/8]: Loading data...
[3/8]: Loading data...
[0/8]: Loading data...
Using truly parallel dataloader...
File size is 2390277560 bytes.
After Allgatherv: All line starts: [         0        479        957 ... 2390276125 2390276602 2390277082]
[0/8]: Construct array with line starts and lengths in bytes.
[4/8]: Construct array with line starts and lengths in bytes.
[6/8]: Construct array with line starts and lengths in bytes.
[7/8]: Construct array with line starts and lengths in bytes.
[5/8]: Construct array with line starts and lengths in bytes.
[2/8]: Construct array with line starts and lengths in bytes.
[3/8]: Construct array with line starts and lengths in bytes.
[1/8]: Construct array with line starts and lengths in bytes.
[0/8]: Make global train-test split.
[2/8]: Make global train-test split.
[5/8]: Make global train-test split.
[4/8]: Make global train-test split.
[3/8]: Make global train-test split.
[1/8]: Make global train-test split.
[6/8]: Make global train-test split.
[7/8]: Make global train-test split.
[0/8]: Decode 1250000 test samples from file.
[6/8]: Decode 1250000 test samples from file.
[2/8]: Decode 1250000 test samples from file.
[3/8]: Decode 1250000 test samples from file.
[1/8]: Decode 1250000 test samples from file.
[5/8]: Decode 1250000 test samples from file.
[4/8]: Decode 1250000 test samples from file.
[7/8]: Decode 1250000 test samples from file.
[0/8]: Draw local 468750 train indices.
[0/8]: Decode train lines from file.
[3/8]: Draw local 468750 train indices.
[2/8]: Draw local 468750 train indices.
[4/8]: Draw local 468750 train indices.
[3/8]: Decode train lines from file.
[2/8]: Decode train lines from file.
[4/8]: Decode train lines from file.
[6/8]: Draw local 468750 train indices.
[6/8]: Decode train lines from file.
[1/8]: Draw local 468750 train indices.
[1/8]: Decode train lines from file.
[7/8]: Draw local 468750 train indices.
[7/8]: Decode train lines from file.
[5/8]: Draw local 468750 train indices.
[5/8]: Decode train lines from file.
[0/8]: Done...
Local train samples and targets have shapes (468750, 18) and (468750,).
Global test samples and targets have shapes (1250000, 18) and (1250000,).

[0/8]: Labels are [0. 0. 0. ... 0. 1. 0.]
[4/8]: Done...
Local train samples and targets have shapes (468750, 18) and (468750,).
Global test samples and targets have shapes (1250000, 18) and (1250000,).

[4/8]: Labels are [0. 1. 0. ... 1. 0. 0.]
[2/8]: Done...
Local train samples and targets have shapes (468750, 18) and (468750,).
Global test samples and targets have shapes (1250000, 18) and (1250000,).

[2/8]: Labels are [0. 0. 0. ... 0. 0. 1.]
[3/8]: Done...
Local train samples and targets have shapes (468750, 18) and (468750,).
Global test samples and targets have shapes (1250000, 18) and (1250000,).

[3/8]: Labels are [0. 0. 1. ... 0. 0. 0.]
[6/8]: Done...
Local train samples and targets have shapes (468750, 18) and (468750,).
Global test samples and targets have shapes (1250000, 18) and (1250000,).

[6/8]: Labels are [1. 0. 1. ... 0. 0. 0.]
[1/8]: Done...
Local train samples and targets have shapes (468750, 18) and (468750,).
Global test samples and targets have shapes (1250000, 18) and (1250000,).

[1/8]: Labels are [1. 0. 1. ... 1. 0. 1.]
[7/8]: Done...
Local train samples and targets have shapes (468750, 18) and (468750,).
Global test samples and targets have shapes (1250000, 18) and (1250000,).

[7/8]: Labels are [0. 1. 0. ... 0. 0. 0.]
[5/8]: Done...
Local train samples and targets have shapes (468750, 18) and (468750,).
Global test samples and targets have shapes (1250000, 18) and (1250000,).

[5/8]: Labels are [1. 0. 0. ... 0. 0. 1.]
Elapsed time is 78.47511398501229 s.
[0/8]: Set up and train local random forest.
[5/8]: Set up and train local random forest.
[2/8]: Set up and train local random forest.
[1/8]: Set up and train local random forest.
[4/8]: Set up and train local random forest.
[3/8]: Set up and train local random forest.
[6/8]: Set up and train local random forest.
[7/8]: Set up and train local random forest.
[4/8]: Get predictions of individual sub estimators.
[5/8]: Get predictions of individual sub estimators.
[7/8]: Get predictions of individual sub estimators.
[6/8]: Get predictions of individual sub estimators.
[2/8]: Get predictions of individual sub estimators.
[0/8]: Get predictions of individual sub estimators.
[3/8]: Get predictions of individual sub estimators.
[1/8]: Get predictions of individual sub estimators.
[4/8]: Allgather predictions.
[4/8]: tree_predictions (12, 1250000), float64
[5/8]: Allgather predictions.
[5/8]: tree_predictions (12, 1250000), float64
[7/8]: Allgather predictions.
[7/8]: tree_predictions (12, 1250000), float64
[6/8]: Allgather predictions.
[6/8]: tree_predictions (12, 1250000), float64
[2/8]: Allgather predictions.
[2/8]: tree_predictions (13, 1250000), float64
[0/8]: Allgather predictions.
[0/8]: tree_predictions (13, 1250000), float64
[3/8]: Allgather predictions.
[3/8]: tree_predictions (13, 1250000), float64
[1/8]: Allgather predictions.
[1/8]: tree_predictions (13, 1250000), float64
[0/8]: tree counts [13 13 13 13 12 12 12 12] and displs [ 0 13 26 39 52 64 76 88]
[0/8]: all_predictions (100, 1250000), float64
[1/8]: tree counts [13 13 13 13 12 12 12 12] and displs [ 0 13 26 39 52 64 76 88]
[1/8]: all_predictions (100, 1250000), float64
[5/8]: tree counts [13 13 13 13 12 12 12 12] and displs [ 0 13 26 39 52 64 76 88]
[5/8]: all_predictions (100, 1250000), float64
[2/8]: tree counts [13 13 13 13 12 12 12 12] and displs [ 0 13 26 39 52 64 76 88]
[2/8]: all_predictions (100, 1250000), float64
[7/8]: tree counts [13 13 13 13 12 12 12 12] and displs [ 0 13 26 39 52 64 76 88]
[7/8]: all_predictions (100, 1250000), float64
[4/8]: tree counts [13 13 13 13 12 12 12 12] and displs [ 0 13 26 39 52 64 76 88]
[4/8]: all_predictions (100, 1250000), float64
[3/8]: tree counts [13 13 13 13 12 12 12 12] and displs [ 0 13 26 39 52 64 76 88]
[3/8]: all_predictions (100, 1250000), float64
[6/8]: tree counts [13 13 13 13 12 12 12 12] and displs [ 0 13 26 39 52 64 76 88]
[6/8]: all_predictions (100, 1250000), float64
[6/8]: Directly before Allgatherv...
[7/8]: Directly before Allgatherv...
[4/8]: Directly before Allgatherv...
[5/8]: Directly before Allgatherv...
[2/8]: Directly before Allgatherv...
[1/8]: Directly before Allgatherv...
[3/8]: Directly before Allgatherv...
[0/8]: Directly before Allgatherv...
[4/8]: Calculate majority vote.
[0/8]: Calculate majority vote.
[6/8]: Calculate majority vote.
[7/8]: Calculate majority vote.
[2/8]: Calculate majority vote.
[3/8]: Calculate majority vote.
[5/8]: Calculate majority vote.
[1/8]: Calculate majority vote.
[0/8]: Local accuracy is 0.7855.
[4/8]: Local accuracy is 0.7852976.
[2/8]: Local accuracy is 0.7856016.
[7/8]: Local accuracy is 0.7852224.
[3/8]: Local accuracy is 0.7859976.
[5/8]: Local accuracy is 0.7854168.
[6/8]: Local accuracy is 0.7856872.
[1/8]: Local accuracy is 0.785904.
Median local accuracy is 0.7855508. Min 0.7852224 and max 0.7859976.
Global accuracy is 0.8004056.
Average train time is 68.65706375567243 s.
[6/8]: Loading data...
Using mixed dataloader...
[7/8]: Loading data...
Using mixed dataloader...
[1/8]: Loading data...
Using mixed dataloader...
[2/8]: Loading data...
Using mixed dataloader...
[3/8]: Loading data...
Using mixed dataloader...
[5/8]: Loading data...
Using mixed dataloader...
[4/8]: Loading data...
Using mixed dataloader...
[0/8]: Loading data...
Using mixed dataloader...
There are 3750000 train and 1250000 test samples.
Local train samples: [468750 468750 468750 468750 468750 468750 468750 468750]
train_indices have shape (3750000,) and type int64.
[1/8]: Done...
Local train samples and targets have shapes (468750, 18) and (468750,).
Global test samples and targets have shapes (1250000, 18) and (1250000,).

[2/8]: Done...
Local train samples and targets have shapes (468750, 18) and (468750,).
Global test samples and targets have shapes (1250000, 18) and (1250000,).

[1/8]: Labels are [0. 1. 0. ... 0. 0. 1.]
[2/8]: Labels are [1. 1. 0. ... 0. 1. 0.]
[3/8]: Done...
Local train samples and targets have shapes (468750, 18) and (468750,).
Global test samples and targets have shapes (1250000, 18) and (1250000,).

[3/8]: Labels are [0. 0. 0. ... 0. 1. 1.]
[4/8]: Done...
Local train samples and targets have shapes (468750, 18) and (468750,).
Global test samples and targets have shapes (1250000, 18) and (1250000,).

[4/8]: Labels are [1. 0. 1. ... 0. 0. 1.]
[5/8]: Done...
Local train samples and targets have shapes (468750, 18) and (468750,).
Global test samples and targets have shapes (1250000, 18) and (1250000,).

[6/8]: Done...
Local train samples and targets have shapes (468750, 18) and (468750,).
Global test samples and targets have shapes (1250000, 18) and (1250000,).

[5/8]: Labels are [1. 0. 1. ... 0. 0. 0.]
[6/8]: Labels are [1. 1. 1. ... 1. 0. 1.]
[7/8]: Done...
Local train samples and targets have shapes (468750, 18) and (468750,).
Global test samples and targets have shapes (1250000, 18) and (1250000,).

[7/8]: Labels are [1. 1. 1. ... 0. 1. 0.]
[0/8]: Done...
Local train samples and targets have shapes (468750, 18) and (468750,).
Global test samples and targets have shapes (1250000, 18) and (1250000,).

[0/8]: Labels are [0. 0. 0. ... 0. 1. 1.]
Elapsed time is 38.31049142451957 s.
[0/8]: Set up and train local random forest.
[1/8]: Set up and train local random forest.
[2/8]: Set up and train local random forest.
[7/8]: Set up and train local random forest.
[5/8]: Set up and train local random forest.
[6/8]: Set up and train local random forest.
[3/8]: Set up and train local random forest.
[4/8]: Set up and train local random forest.
[5/8]: Get predictions of individual sub estimators.
[4/8]: Get predictions of individual sub estimators.
[6/8]: Get predictions of individual sub estimators.
[7/8]: Get predictions of individual sub estimators.
[0/8]: Get predictions of individual sub estimators.
[3/8]: Get predictions of individual sub estimators.
[2/8]: Get predictions of individual sub estimators.
[1/8]: Get predictions of individual sub estimators.
[5/8]: Allgather predictions.
[5/8]: tree_predictions (12, 1250000), float64
[4/8]: Allgather predictions.
[4/8]: tree_predictions (12, 1250000), float64
[6/8]: Allgather predictions.
[6/8]: tree_predictions (12, 1250000), float64
[7/8]: Allgather predictions.
[7/8]: tree_predictions (12, 1250000), float64
[0/8]: Allgather predictions.
[0/8]: tree_predictions (13, 1250000), float64
[3/8]: Allgather predictions.
[3/8]: tree_predictions (13, 1250000), float64
[2/8]: Allgather predictions.
[2/8]: tree_predictions (13, 1250000), float64
[1/8]: Allgather predictions.
[1/8]: tree_predictions (13, 1250000), float64
[0/8]: tree counts [13 13 13 13 12 12 12 12] and displs [ 0 13 26 39 52 64 76 88]
[0/8]: all_predictions (100, 1250000), float64
[1/8]: tree counts [13 13 13 13 12 12 12 12] and displs [ 0 13 26 39 52 64 76 88]
[1/8]: all_predictions (100, 1250000), float64
[2/8]: tree counts [13 13 13 13 12 12 12 12] and displs [ 0 13 26 39 52 64 76 88]
[2/8]: all_predictions (100, 1250000), float64
[4/8]: tree counts [13 13 13 13 12 12 12 12] and displs [ 0 13 26 39 52 64 76 88]
[4/8]: all_predictions (100, 1250000), float64
[6/8]: tree counts [13 13 13 13 12 12 12 12] and displs [ 0 13 26 39 52 64 76 88]
[6/8]: all_predictions (100, 1250000), float64
[3/8]: tree counts [13 13 13 13 12 12 12 12] and displs [ 0 13 26 39 52 64 76 88]
[3/8]: all_predictions (100, 1250000), float64
[7/8]: tree counts [13 13 13 13 12 12 12 12] and displs [ 0 13 26 39 52 64 76 88]
[7/8]: all_predictions (100, 1250000), float64
[5/8]: tree counts [13 13 13 13 12 12 12 12] and displs [ 0 13 26 39 52 64 76 88]
[5/8]: all_predictions (100, 1250000), float64
[7/8]: Directly before Allgatherv...
[6/8]: Directly before Allgatherv...
[4/8]: Directly before Allgatherv...
[5/8]: Directly before Allgatherv...
[2/8]: Directly before Allgatherv...
[3/8]: Directly before Allgatherv...
[0/8]: Directly before Allgatherv...
[1/8]: Directly before Allgatherv...
[4/8]: Calculate majority vote.
[0/8]: Calculate majority vote.
[6/8]: Calculate majority vote.
[7/8]: Calculate majority vote.
[2/8]: Calculate majority vote.
[3/8]: Calculate majority vote.
[5/8]: Calculate majority vote.
[1/8]: Calculate majority vote.
[4/8]: Local accuracy is 0.7857312.
[0/8]: Local accuracy is 0.7858752.
[6/8]: Local accuracy is 0.786224.
[7/8]: Local accuracy is 0.7862888.
[5/8]: Local accuracy is 0.786252.
[3/8]: Local accuracy is 0.7860992.
[2/8]: Local accuracy is 0.7864496.
[1/8]: Local accuracy is 0.7861328.
Median local accuracy is 0.7861784. Min 0.7857312 and max 0.7864496.
Global accuracy is 0.8008024.
Average train time is 68.0355254720198 s.
[5/8]: Loading data...
Using all-parallel dataloader...
[3/8]: Loading data...
Using all-parallel dataloader...
[6/8]: Loading data...
Using all-parallel dataloader...
[7/8]: Loading data...
Using all-parallel dataloader...
[2/8]: Loading data...
Using all-parallel dataloader...
[1/8]: Loading data...
Using all-parallel dataloader...
[4/8]: Loading data...
Using all-parallel dataloader...
[0/8]: Loading data...
Using all-parallel dataloader...
[0/8]: Data loading done.
[6/8]: Data loading done.
[1/8]: Data loading done.
[7/8]: Data loading done.
[4/8]: Data loading done.
[2/8]: Data loading done.
[5/8]: Data loading done.
[3/8]: Data loading done.
[0/8]: Data splitting done.
[0/8]: There are 3750000 train and 1250000 test samples.
Local train samples: 468750
[6/8]: Data splitting done.
[6/8]: There are 3750000 train and 1250000 test samples.
Local train samples: 468750
[1/8]: Data splitting done.
[1/8]: There are 3750000 train and 1250000 test samples.
Local train samples: 468750
[7/8]: Data splitting done.
[7/8]: There are 3750000 train and 1250000 test samples.
Local train samples: 468750
[4/8]: Data splitting done.
[4/8]: There are 3750000 train and 1250000 test samples.
Local train samples: 468750
[2/8]: Data splitting done.
[2/8]: There are 3750000 train and 1250000 test samples.
Local train samples: 468750
[5/8]: Data splitting done.
[5/8]: There are 3750000 train and 1250000 test samples.
Local train samples: 468750
[3/8]: Data splitting done.
[3/8]: There are 3750000 train and 1250000 test samples.
Local train samples: 468750
[0/8]: train_indices have shape (468750,).
[6/8]: train_indices have shape (468750,).
[1/8]: train_indices have shape (468750,).
[7/8]: train_indices have shape (468750,).
[6/8]: Done...
Local train samples and targets have shapes (468750, 18) and (468750,).
Global test samples and targets have shapes (1250000, 18) and (1250000,).

[6/8]: Labels are [0. 1. 1. ... 1. 1. 1.]
[4/8]: train_indices have shape (468750,).
[1/8]: Done...
Local train samples and targets have shapes (468750, 18) and (468750,).
Global test samples and targets have shapes (1250000, 18) and (1250000,).

[1/8]: Labels are [1. 1. 0. ... 1. 0. 1.]
[0/8]: Done...
Local train samples and targets have shapes (468750, 18) and (468750,).
Global test samples and targets have shapes (1250000, 18) and (1250000,).

[0/8]: Labels are [1. 1. 0. ... 1. 0. 0.]
[2/8]: train_indices have shape (468750,).
[5/8]: train_indices have shape (468750,).
[7/8]: Done...
Local train samples and targets have shapes (468750, 18) and (468750,).
Global test samples and targets have shapes (1250000, 18) and (1250000,).

[7/8]: Labels are [1. 0. 0. ... 1. 0. 1.]
[2/8]: Done...
Local train samples and targets have shapes (468750, 18) and (468750,).
Global test samples and targets have shapes (1250000, 18) and (1250000,).

[2/8]: Labels are [0. 1. 0. ... 1. 0. 0.]
[4/8]: Done...
Local train samples and targets have shapes (468750, 18) and (468750,).
Global test samples and targets have shapes (1250000, 18) and (1250000,).

[4/8]: Labels are [0. 1. 1. ... 0. 1. 1.]
[5/8]: Done...
Local train samples and targets have shapes (468750, 18) and (468750,).
Global test samples and targets have shapes (1250000, 18) and (1250000,).

[5/8]: Labels are [1. 1. 0. ... 1. 1. 1.]
[3/8]: train_indices have shape (468750,).
[3/8]: Done...
Local train samples and targets have shapes (468750, 18) and (468750,).
Global test samples and targets have shapes (1250000, 18) and (1250000,).

[3/8]: Labels are [0. 1. 1. ... 1. 0. 0.]
Elapsed time is 35.02440976770595 s.
[0/8]: Set up and train local random forest.
[4/8]: Set up and train local random forest.
[1/8]: Set up and train local random forest.
[6/8]: Set up and train local random forest.
[5/8]: Set up and train local random forest.
[3/8]: Set up and train local random forest.
[2/8]: Set up and train local random forest.
[7/8]: Set up and train local random forest.
[7/8]: Get predictions of individual sub estimators.
[4/8]: Get predictions of individual sub estimators.
[5/8]: Get predictions of individual sub estimators.
[6/8]: Get predictions of individual sub estimators.
[0/8]: Get predictions of individual sub estimators.
[2/8]: Get predictions of individual sub estimators.
[1/8]: Get predictions of individual sub estimators.
[3/8]: Get predictions of individual sub estimators.
[7/8]: Allgather predictions.
[7/8]: tree_predictions (12, 1250000), float64
[4/8]: Allgather predictions.
[4/8]: tree_predictions (12, 1250000), float64
[5/8]: Allgather predictions.
[5/8]: tree_predictions (12, 1250000), float64
[6/8]: Allgather predictions.
[6/8]: tree_predictions (12, 1250000), float64
[0/8]: Allgather predictions.
[0/8]: tree_predictions (13, 1250000), float64
[2/8]: Allgather predictions.
[2/8]: tree_predictions (13, 1250000), float64
[1/8]: Allgather predictions.
[1/8]: tree_predictions (13, 1250000), float64
[3/8]: Allgather predictions.
[3/8]: tree_predictions (13, 1250000), float64
[0/8]: tree counts [13 13 13 13 12 12 12 12] and displs [ 0 13 26 39 52 64 76 88]
[0/8]: all_predictions (100, 1250000), float64
[3/8]: tree counts [13 13 13 13 12 12 12 12] and displs [ 0 13 26 39 52 64 76 88]
[3/8]: all_predictions (100, 1250000), float64
[1/8]: tree counts [13 13 13 13 12 12 12 12] and displs [ 0 13 26 39 52 64 76 88]
[1/8]: all_predictions (100, 1250000), float64
[2/8]: tree counts [13 13 13 13 12 12 12 12] and displs [ 0 13 26 39 52 64 76 88]
[2/8]: all_predictions (100, 1250000), float64
[6/8]: tree counts [13 13 13 13 12 12 12 12] and displs [ 0 13 26 39 52 64 76 88]
[6/8]: all_predictions (100, 1250000), float64
[4/8]: tree counts [13 13 13 13 12 12 12 12] and displs [ 0 13 26 39 52 64 76 88]
[4/8]: all_predictions (100, 1250000), float64
[5/8]: tree counts [13 13 13 13 12 12 12 12] and displs [ 0 13 26 39 52 64 76 88]
[5/8]: all_predictions (100, 1250000), float64
[7/8]: tree counts [13 13 13 13 12 12 12 12] and displs [ 0 13 26 39 52 64 76 88]
[7/8]: all_predictions (100, 1250000), float64
[6/8]: Directly before Allgatherv...
[5/8]: Directly before Allgatherv...
[2/8]: Directly before Allgatherv...
[3/8]: Directly before Allgatherv...
[0/8]: Directly before Allgatherv...
[1/8]: Directly before Allgatherv...
[7/8]: Directly before Allgatherv...
[4/8]: Directly before Allgatherv...
[0/8]: Calculate majority vote.
[4/8]: Calculate majority vote.
[6/8]: Calculate majority vote.
[7/8]: Calculate majority vote.
[2/8]: Calculate majority vote.
[3/8]: Calculate majority vote.
[5/8]: Calculate majority vote.
[1/8]: Calculate majority vote.
[6/8]: Local accuracy is 0.7864064.
[4/8]: Local accuracy is 0.7853248.
[0/8]: Local accuracy is 0.7860144.
[5/8]: Local accuracy is 0.7860208.
[3/8]: Local accuracy is 0.785708.
[1/8]: Local accuracy is 0.786476.
[7/8]: Local accuracy is 0.78576.
[2/8]: Local accuracy is 0.7863344.
Median local accuracy is 0.7860176. Min 0.7853248 and max 0.786476.
Global accuracy is 0.8008048.
Average train time is 68.93633300368674 s.
[5/8]: Loading data...
Using sequential root-based dataloader...
[3/8]: Loading data...
Using sequential root-based dataloader...
[6/8]: Loading data...
Using sequential root-based dataloader...
[1/8]: Loading data...
Using sequential root-based dataloader...
[7/8]: Loading data...
Using sequential root-based dataloader...
[0/8]: Loading data...
Using sequential root-based dataloader...
[2/8]: Loading data...
Using sequential root-based dataloader...
[4/8]: Loading data...
Using sequential root-based dataloader...
There are 3750000 train and 1250000 test samples.
Local train samples: [468750 468750 468750 468750 468750 468750 468750 468750]
Root 0 about to send train data to rank 1.
DONE.
Root 0 about to send train data to rank 2.
DONE.
Root 0 about to send train data to rank 3.
DONE.
Root 0 about to send train data to rank 4.
DONE.
Root 0 about to send train data to rank 5.
DONE.
Root 0 about to send train data to rank 6.
DONE.
Root 0 about to send train data to rank 7.
DONE.
[1/8]: Done...
Local train samples and targets have shapes (468750, 18) and (468750,).
Global test samples and targets have shapes (1250000, 18) and (1250000,).

[2/8]: Done...
Local train samples and targets have shapes (468750, 18) and (468750,).
Global test samples and targets have shapes (1250000, 18) and (1250000,).

[1/8]: Labels are [0. 1. 0. ... 0. 0. 1.]
[2/8]: Labels are [1. 1. 0. ... 0. 1. 0.]
[3/8]: Done...
Local train samples and targets have shapes (468750, 18) and (468750,).
Global test samples and targets have shapes (1250000, 18) and (1250000,).

[3/8]: Labels are [0. 0. 0. ... 0. 1. 1.]
[4/8]: Done...
Local train samples and targets have shapes (468750, 18) and (468750,).
Global test samples and targets have shapes (1250000, 18) and (1250000,).

[4/8]: Labels are [1. 0. 1. ... 0. 0. 1.]
[5/8]: Done...
Local train samples and targets have shapes (468750, 18) and (468750,).
Global test samples and targets have shapes (1250000, 18) and (1250000,).

[6/8]: Done...
Local train samples and targets have shapes (468750, 18) and (468750,).
Global test samples and targets have shapes (1250000, 18) and (1250000,).

[5/8]: Labels are [1. 0. 1. ... 0. 0. 0.]
[6/8]: Labels are [1. 1. 1. ... 1. 0. 1.]
[7/8]: Done...
Local train samples and targets have shapes (468750, 18) and (468750,).
Global test samples and targets have shapes (1250000, 18) and (1250000,).

[7/8]: Labels are [1. 1. 1. ... 0. 1. 0.]
[0/8]: Done...
Local train samples and targets have shapes (468750, 18) and (468750,).
Global test samples and targets have shapes (1250000, 18) and (1250000,).

[0/8]: Labels are [0. 0. 0. ... 0. 1. 1.]
Elapsed time is 38.4108806271106 s.
[0/8]: Set up and train local random forest.
[6/8]: Set up and train local random forest.
[2/8]: Set up and train local random forest.
[4/8]: Set up and train local random forest.
[5/8]: Set up and train local random forest.
[3/8]: Set up and train local random forest.
[7/8]: Set up and train local random forest.
[1/8]: Set up and train local random forest.
[5/8]: Get predictions of individual sub estimators.
[4/8]: Get predictions of individual sub estimators.
[6/8]: Get predictions of individual sub estimators.
[7/8]: Get predictions of individual sub estimators.
[0/8]: Get predictions of individual sub estimators.
[3/8]: Get predictions of individual sub estimators.
[2/8]: Get predictions of individual sub estimators.
[1/8]: Get predictions of individual sub estimators.
[5/8]: Allgather predictions.
[5/8]: tree_predictions (12, 1250000), float64
[4/8]: Allgather predictions.
[4/8]: tree_predictions (12, 1250000), float64
[6/8]: Allgather predictions.
[6/8]: tree_predictions (12, 1250000), float64
[7/8]: Allgather predictions.
[7/8]: tree_predictions (12, 1250000), float64
[0/8]: Allgather predictions.
[0/8]: tree_predictions (13, 1250000), float64
[3/8]: Allgather predictions.
[3/8]: tree_predictions (13, 1250000), float64
[2/8]: Allgather predictions.
[2/8]: tree_predictions (13, 1250000), float64
[1/8]: Allgather predictions.
[1/8]: tree_predictions (13, 1250000), float64
[0/8]: tree counts [13 13 13 13 12 12 12 12] and displs [ 0 13 26 39 52 64 76 88]
[0/8]: all_predictions (100, 1250000), float64
[1/8]: tree counts [13 13 13 13 12 12 12 12] and displs [ 0 13 26 39 52 64 76 88]
[1/8]: all_predictions (100, 1250000), float64
[4/8]: tree counts [13 13 13 13 12 12 12 12] and displs [ 0 13 26 39 52 64 76 88]
[4/8]: all_predictions (100, 1250000), float64
[5/8]: tree counts [13 13 13 13 12 12 12 12] and displs [ 0 13 26 39 52 64 76 88]
[5/8]: all_predictions (100, 1250000), float64
[3/8]: tree counts [13 13 13 13 12 12 12 12] and displs [ 0 13 26 39 52 64 76 88]
[3/8]: all_predictions (100, 1250000), float64
[6/8]: tree counts [13 13 13 13 12 12 12 12] and displs [ 0 13 26 39 52 64 76 88]
[6/8]: all_predictions (100, 1250000), float64
[2/8]: tree counts [13 13 13 13 12 12 12 12] and displs [ 0 13 26 39 52 64 76 88]
[2/8]: all_predictions (100, 1250000), float64
[7/8]: tree counts [13 13 13 13 12 12 12 12] and displs [ 0 13 26 39 52 64 76 88]
[7/8]: all_predictions (100, 1250000), float64
[7/8]: Directly before Allgatherv...
[6/8]: Directly before Allgatherv...
[4/8]: Directly before Allgatherv...
[5/8]: Directly before Allgatherv...
[0/8]: Directly before Allgatherv...
[2/8]: Directly before Allgatherv...
[3/8]: Directly before Allgatherv...
[1/8]: Directly before Allgatherv...
[0/8]: Calculate majority vote.
[4/8]: Calculate majority vote.
[6/8]: Calculate majority vote.
[7/8]: Calculate majority vote.
[2/8]: Calculate majority vote.
[3/8]: Calculate majority vote.
[5/8]: Calculate majority vote.
[1/8]: Calculate majority vote.
[0/8]: Local accuracy is 0.7858752.
[4/8]: Local accuracy is 0.7857312.
[7/8]: Local accuracy is 0.7862888.
[6/8]: Local accuracy is 0.786224.
[5/8]: Local accuracy is 0.786252.
[1/8]: Local accuracy is 0.7861328.
[2/8]: Local accuracy is 0.7864496.
[3/8]: Local accuracy is 0.7860992.
Median local accuracy is 0.7861784. Min 0.7857312 and max 0.7864496.
Global accuracy is 0.8008024.
Average train time is 69.78096284798812 s.

============================= JOB FEEDBACK =============================

NodeName=uc2n[135,147,159,212-213,222-223,229]
Job ID: 21657721
Cluster: uc2
User/Group: ku4408/scc
State: COMPLETED (exit code 0)
Nodes: 8
Cores per node: 80
CPU Utilized: 01:16:51
CPU Efficiency: 1.11% of 4-19:44:00 core-walltime
Job Wall-clock time: 00:10:51
Memory Utilized: 15.00 GB (estimated maximum)
Memory Efficiency: 2.13% of 703.12 GB (87.89 GB/node)
