Restoring modules from user's RF, for system: "uc2"
[10/32]: Loading data...
Using root-based dataloader...
[24/32]: Loading data...
Using root-based dataloader...
[30/32]: Loading data...
Using root-based dataloader...
[29/32]: Loading data...
Using root-based dataloader...
[6/32]: Loading data...
Using root-based dataloader...
[0/32]: Loading data...
Using root-based dataloader...
[28/32]: Loading data...
Using root-based dataloader...
[17/32]: Loading data...
Using root-based dataloader...
[21/32]: Loading data...
Using root-based dataloader...
[20/32]: Loading data...
Using root-based dataloader...
[26/32]: Loading data...
Using root-based dataloader...
[25/32]: Loading data...
Using root-based dataloader...
[13/32]: Loading data...
Using root-based dataloader...
[15/32]: Loading data...
Using root-based dataloader...
[2/32]: Loading data...
Using root-based dataloader...
[4/32]: Loading data...
Using root-based dataloader...
[8/32]: Loading data...
Using root-based dataloader...
[22/32]: Loading data...
Using root-based dataloader...
[18/32]: Loading data...
Using root-based dataloader...
[27/32]: Loading data...
Using root-based dataloader...
[11/32]: Loading data...
Using root-based dataloader...
[1/32]: Loading data...
Using root-based dataloader...
[16/32]: Loading data...
Using root-based dataloader...
[9/32]: Loading data...
Using root-based dataloader...
[5/32]: Loading data...
Using root-based dataloader...
[3/32]: Loading data...
Using root-based dataloader...
[31/32]: Loading data...
Using root-based dataloader...
[14/32]: Loading data...
Using root-based dataloader...
[12/32]: Loading data...
Using root-based dataloader...
[7/32]: Loading data...
Using root-based dataloader...
[23/32]: Loading data...
Using root-based dataloader...
[19/32]: Loading data...
Using root-based dataloader...
There are 3750000 train and 1250000 test samples.
Local train samples: [117188 117188 117188 117188 117188 117188 117188 117188 117188 117188
 117188 117188 117188 117188 117188 117188 117187 117187 117187 117187
 117187 117187 117187 117187 117187 117187 117187 117187 117187 117187
 117187 117187]
train_indices have shape (3750000,).
[6/32]: Done...
Local train samples and targets have shapes (117188, 18) and (117188,).
Global test samples and targets have shapes (1250000, 18) and (1250000,).

[7/32]: Done...
Local train samples and targets have shapes (117188, 18) and (117188,).
Global test samples and targets have shapes (1250000, 18) and (1250000,).

[1/32]: Done...
Local train samples and targets have shapes (117188, 18) and (117188,).
Global test samples and targets have shapes (1250000, 18) and (1250000,).

[5/32]: Done...
Local train samples and targets have shapes (117188, 18) and (117188,).
Global test samples and targets have shapes (1250000, 18) and (1250000,).

[10/32]: Done...
Local train samples and targets have shapes (117188, 18) and (117188,).
Global test samples and targets have shapes (1250000, 18) and (1250000,).

[2/32]: Done...
Local train samples and targets have shapes (117188, 18) and (117188,).
Global test samples and targets have shapes (1250000, 18) and (1250000,).

[14/32]: Done...
Local train samples and targets have shapes (117188, 18) and (117188,).
Global test samples and targets have shapes (1250000, 18) and (1250000,).

[8/32]: Done...
Local train samples and targets have shapes (117188, 18) and (117188,).
Global test samples and targets have shapes (1250000, 18) and (1250000,).

[4/32]: Done...
Local train samples and targets have shapes (117188, 18) and (117188,).
Global test samples and targets have shapes (1250000, 18) and (1250000,).

[11/32]: Done...
Local train samples and targets have shapes (117188, 18) and (117188,).
Global test samples and targets have shapes (1250000, 18) and (1250000,).

[9/32]: Done...
Local train samples and targets have shapes (117188, 18) and (117188,).
Global test samples and targets have shapes (1250000, 18) and (1250000,).

[3/32]: Done...
Local train samples and targets have shapes (117188, 18) and (117188,).
Global test samples and targets have shapes (1250000, 18) and (1250000,).

[16/32]: Done...
Local train samples and targets have shapes (117187, 18) and (117187,).
Global test samples and targets have shapes (1250000, 18) and (1250000,).

[19/32]: Done...
Local train samples and targets have shapes (117187, 18) and (117187,).
Global test samples and targets have shapes (1250000, 18) and (1250000,).

[22/32]: Done...
Local train samples and targets have shapes (117187, 18) and (117187,).
Global test samples and targets have shapes (1250000, 18) and (1250000,).

[18/32]: Done...
Local train samples and targets have shapes (117187, 18) and (117187,).
Global test samples and targets have shapes (1250000, 18) and (1250000,).

[17/32]: Done...
Local train samples and targets have shapes (117187, 18) and (117187,).
Global test samples and targets have shapes (1250000, 18) and (1250000,).

[21/32]: Done...
Local train samples and targets have shapes (117187, 18) and (117187,).
Global test samples and targets have shapes (1250000, 18) and (1250000,).

[13/32]: Done...
Local train samples and targets have shapes (117188, 18) and (117188,).
Global test samples and targets have shapes (1250000, 18) and (1250000,).

[31/32]: Done...
Local train samples and targets have shapes (117187, 18) and (117187,).
Global test samples and targets have shapes (1250000, 18) and (1250000,).

[27/32]: Done...
Local train samples and targets have shapes (117187, 18) and (117187,).
Global test samples and targets have shapes (1250000, 18) and (1250000,).

[20/32]: Done...
Local train samples and targets have shapes (117187, 18) and (117187,).
Global test samples and targets have shapes (1250000, 18) and (1250000,).

[15/32]: Done...
Local train samples and targets have shapes (117188, 18) and (117188,).
Global test samples and targets have shapes (1250000, 18) and (1250000,).

[23/32]: Done...
Local train samples and targets have shapes (117187, 18) and (117187,).
Global test samples and targets have shapes (1250000, 18) and (1250000,).

[26/32]: Done...
Local train samples and targets have shapes (117187, 18) and (117187,).
Global test samples and targets have shapes (1250000, 18) and (1250000,).

[29/32]: Done...
Local train samples and targets have shapes (117187, 18) and (117187,).
Global test samples and targets have shapes (1250000, 18) and (1250000,).

[12/32]: Done...
Local train samples and targets have shapes (117188, 18) and (117188,).
Global test samples and targets have shapes (1250000, 18) and (1250000,).

[25/32]: Done...
Local train samples and targets have shapes (117187, 18) and (117187,).
Global test samples and targets have shapes (1250000, 18) and (1250000,).

[24/32]: Done...
Local train samples and targets have shapes (117187, 18) and (117187,).
Global test samples and targets have shapes (1250000, 18) and (1250000,).

[30/32]: Done...
Local train samples and targets have shapes (117187, 18) and (117187,).
Global test samples and targets have shapes (1250000, 18) and (1250000,).

[28/32]: Done...
Local train samples and targets have shapes (117187, 18) and (117187,).
Global test samples and targets have shapes (1250000, 18) and (1250000,).

[28/32]: Labels are [1. 0. 0. ... 0. 0. 0.]
[14/32]: Labels are [0. 0. 0. ... 0. 0. 0.]
[9/32]: Labels are [0. 0. 0. ... 0. 0. 1.]
[10/32]: Labels are [0. 0. 0. ... 1. 0. 0.]
[2/32]: Labels are [0. 0. 1. ... 0. 0. 0.]
[6/32]: Labels are [0. 0. 0. ... 0. 0. 0.]
[8/32]: Labels are [1. 1. 0. ... 0. 1. 0.]
[1/32]: Labels are [0. 0. 1. ... 1. 1. 0.]
[17/32]: Labels are [1. 1. 1. ... 0. 0. 0.]
[13/32]: Labels are [1. 1. 1. ... 0. 0. 1.]
[21/32]: Labels are [1. 0. 1. ... 0. 1. 0.]
[23/32]: Labels are [0. 0. 0. ... 1. 1. 1.]
[24/32]: Labels are [1. 0. 0. ... 0. 0. 1.]
[7/32]: Labels are [1. 0. 1. ... 0. 1. 1.]
[5/32]: Labels are [0. 0. 1. ... 0. 1. 0.]
[16/32]: Labels are [0. 1. 0. ... 0. 0. 1.]
[19/32]: Labels are [0. 0. 0. ... 1. 0. 1.]
[3/32]: Labels are [1. 1. 0. ... 0. 1. 0.]
[20/32]: Labels are [1. 0. 1. ... 1. 1. 1.]
[22/32]: Labels are [1. 1. 0. ... 1. 0. 1.]
[29/32]: Labels are [1. 1. 1. ... 0. 1. 0.]
[11/32]: Labels are [1. 0. 0. ... 1. 0. 1.]
[26/32]: Labels are [1. 1. 1. ... 1. 1. 1.]
[12/32]: Labels are [1. 0. 1. ... 1. 0. 0.]
[15/32]: Labels are [0. 0. 1. ... 1. 0. 1.]
[25/32]: Labels are [1. 0. 1. ... 0. 0. 1.]
[4/32]: Labels are [0. 1. 1. ... 0. 0. 0.]
[31/32]: Labels are [1. 1. 1. ... 0. 0. 1.]
[30/32]: Labels are [1. 0. 1. ... 1. 1. 1.]
[18/32]: Labels are [1. 0. 0. ... 0. 1. 1.]
[27/32]: Labels are [0. 1. 1. ... 0. 1. 0.]
[0/32]: Done...
Local train samples and targets have shapes (117188, 18) and (117188,).
Global test samples and targets have shapes (1250000, 18) and (1250000,).

[0/32]: Labels are [1. 1. 1. ... 1. 1. 0.]
Elapsed time is 58.31797715488938 s.
[0/32]: Set up and train local random forest.
[25/32]: Set up and train local random forest.
[24/32]: Set up and train local random forest.
[8/32]: Set up and train local random forest.
[12/32]: Set up and train local random forest.
[9/32]: Set up and train local random forest.
[16/32]: Set up and train local random forest.
[28/32]: Set up and train local random forest.
[18/32]: Set up and train local random forest.
[22/32]: Set up and train local random forest.
[21/32]: Set up and train local random forest.
[26/32]: Set up and train local random forest.
[30/32]: Set up and train local random forest.
[2/32]: Set up and train local random forest.
[4/32]: Set up and train local random forest.
[6/32]: Set up and train local random forest.
[1/32]: Set up and train local random forest.
[10/32]: Set up and train local random forest.
[17/32]: Set up and train local random forest.
[20/32]: Set up and train local random forest.
[14/32]: Set up and train local random forest.
[5/32]: Set up and train local random forest.
[29/32]: Set up and train local random forest.
[13/32]: Set up and train local random forest.
[11/32]: Set up and train local random forest.
[7/32]: Set up and train local random forest.
[3/32]: Set up and train local random forest.
[19/32]: Set up and train local random forest.
[27/32]: Set up and train local random forest.
[31/32]: Set up and train local random forest.
[15/32]: Set up and train local random forest.
[23/32]: Set up and train local random forest.
[4/32]: Get predictions of individual sub estimators.
[26/32]: Get predictions of individual sub estimators.
[11/32]: Get predictions of individual sub estimators.
[25/32]: Get predictions of individual sub estimators.
[27/32]: Get predictions of individual sub estimators.
[23/32]: Get predictions of individual sub estimators.
[21/32]: Get predictions of individual sub estimators.
[28/32]: Get predictions of individual sub estimators.
[31/32]: Get predictions of individual sub estimators.
[8/32]: Get predictions of individual sub estimators.
[20/32]: Get predictions of individual sub estimators.
[7/32]: Get predictions of individual sub estimators.
[24/32]: Get predictions of individual sub estimators.
[9/32]: Get predictions of individual sub estimators.
[18/32]: Get predictions of individual sub estimators.
[6/32]: Get predictions of individual sub estimators.
[14/32]: Get predictions of individual sub estimators.
[19/32]: Get predictions of individual sub estimators.
[13/32]: Get predictions of individual sub estimators.
[16/32]: Get predictions of individual sub estimators.
[29/32]: Get predictions of individual sub estimators.
[5/32]: Get predictions of individual sub estimators.
[15/32]: Get predictions of individual sub estimators.
[10/32]: Get predictions of individual sub estimators.
[17/32]: Get predictions of individual sub estimators.
[12/32]: Get predictions of individual sub estimators.
[22/32]: Get predictions of individual sub estimators.
[30/32]: Get predictions of individual sub estimators.
[0/32]: Get predictions of individual sub estimators.
[1/32]: Get predictions of individual sub estimators.
[2/32]: Get predictions of individual sub estimators.
[3/32]: Get predictions of individual sub estimators.
[26/32]: Allgather predictions.
[26/32]: tree_predictions (3, 1250000), float64
[11/32]: Allgather predictions.
[11/32]: tree_predictions (3, 1250000), float64
[4/32]: Allgather predictions.
[4/32]: tree_predictions (3, 1250000), float64
[28/32]: Allgather predictions.
[28/32]: tree_predictions (3, 1250000), float64
[25/32]: Allgather predictions.
[25/32]: tree_predictions (3, 1250000), float64
[20/32]: Allgather predictions.
[20/32]: tree_predictions (3, 1250000), float64
[27/32]: Allgather predictions.
[27/32]: tree_predictions (3, 1250000), float64
[21/32]: Allgather predictions.
[21/32]: tree_predictions (3, 1250000), float64
[23/32]: Allgather predictions.
[23/32]: tree_predictions (3, 1250000), float64
[31/32]: Allgather predictions.
[31/32]: tree_predictions (3, 1250000), float64
[8/32]: Allgather predictions.
[8/32]: tree_predictions (3, 1250000), float64
[7/32]: Allgather predictions.
[7/32]: tree_predictions (3, 1250000), float64
[24/32]: Allgather predictions.
[24/32]: tree_predictions (3, 1250000), float64
[18/32]: Allgather predictions.
[18/32]: tree_predictions (3, 1250000), float64
[19/32]: Allgather predictions.
[19/32]: tree_predictions (3, 1250000), float64
[6/32]: Allgather predictions.
[6/32]: tree_predictions (3, 1250000), float64
[12/32]: Allgather predictions.
[12/32]: tree_predictions (3, 1250000), float64
[17/32]: Allgather predictions.
[17/32]: tree_predictions (3, 1250000), float64
[13/32]: Allgather predictions.
[13/32]: tree_predictions (3, 1250000), float64
[9/32]: Allgather predictions.
[9/32]: tree_predictions (3, 1250000), float64
[14/32]: Allgather predictions.
[14/32]: tree_predictions (3, 1250000), float64
[15/32]: Allgather predictions.
[15/32]: tree_predictions (3, 1250000), float64
[29/32]: Allgather predictions.
[29/32]: tree_predictions (3, 1250000), float64
[10/32]: Allgather predictions.
[10/32]: tree_predictions (3, 1250000), float64
[5/32]: Allgather predictions.
[5/32]: tree_predictions (3, 1250000), float64
[16/32]: Allgather predictions.
[16/32]: tree_predictions (3, 1250000), float64
[22/32]: Allgather predictions.
[22/32]: tree_predictions (3, 1250000), float64
[30/32]: Allgather predictions.
[30/32]: tree_predictions (3, 1250000), float64
[0/32]: Allgather predictions.
[0/32]: tree_predictions (4, 1250000), float64
[1/32]: Allgather predictions.
[1/32]: tree_predictions (4, 1250000), float64
[2/32]: Allgather predictions.
[2/32]: tree_predictions (4, 1250000), float64
[3/32]: Allgather predictions.
[3/32]: tree_predictions (4, 1250000), float64
[0/32]: tree counts [4 4 4 4 3 3 3 3 3 3 3 3 3 3 3 3 3 3 3 3 3 3 3 3 3 3 3 3 3 3 3 3] and displs [ 0  4  8 12 16 19 22 25 28 31 34 37 40 43 46 49 52 55 58 61 64 67 70 73
 76 79 82 85 88 91 94 97]
[0/32]: all_predictions (100, 1250000), float64
[6/32]: tree counts [4 4 4 4 3 3 3 3 3 3 3 3 3 3 3 3 3 3 3 3 3 3 3 3 3 3 3 3 3 3 3 3] and displs [ 0  4  8 12 16 19 22 25 28 31 34 37 40 43 46 49 52 55 58 61 64 67 70 73
 76 79 82 85 88 91 94 97]
[6/32]: all_predictions (100, 1250000), float64
[17/32]: tree counts [4 4 4 4 3 3 3 3 3 3 3 3 3 3 3 3 3 3 3 3 3 3 3 3 3 3 3 3 3 3 3 3] and displs [ 0  4  8 12 16 19 22 25 28 31 34 37 40 43 46 49 52 55 58 61 64 67 70 73
 76 79 82 85 88 91 94 97]
[17/32]: all_predictions (100, 1250000), float64
[11/32]: tree counts [4 4 4 4 3 3 3 3 3 3 3 3 3 3 3 3 3 3 3 3 3 3 3 3 3 3 3 3 3 3 3 3] and displs [ 0  4  8 12 16 19 22 25 28 31 34 37 40 43 46 49 52 55 58 61 64 67 70 73
 76 79 82 85 88 91 94 97]
[11/32]: all_predictions (100, 1250000), float64
[16/32]: tree counts [4 4 4 4 3 3 3 3 3 3 3 3 3 3 3 3 3 3 3 3 3 3 3 3 3 3 3 3 3 3 3 3] and displs [ 0  4  8 12 16 19 22 25 28 31 34 37 40 43 46 49 52 55 58 61 64 67 70 73
 76 79 82 85 88 91 94 97]
[16/32]: all_predictions (100, 1250000), float64
[21/32]: tree counts [4 4 4 4 3 3 3 3 3 3 3 3 3 3 3 3 3 3 3 3 3 3 3 3 3 3 3 3 3 3 3 3] and displs [ 0  4  8 12 16 19 22 25 28 31 34 37 40 43 46 49 52 55 58 61 64 67 70 73
 76 79 82 85 88 91 94 97]
[21/32]: all_predictions (100, 1250000), float64
[27/32]: tree counts [4 4 4 4 3 3 3 3 3 3 3 3 3 3 3 3 3 3 3 3 3 3 3 3 3 3 3 3 3 3 3 3] and displs [ 0  4  8 12 16 19 22 25 28 31 34 37 40 43 46 49 52 55 58 61 64 67 70 73
 76 79 82 85 88 91 94 97]
[27/32]: all_predictions (100, 1250000), float64
[15/32]: tree counts [4 4 4 4 3 3 3 3 3 3 3 3 3 3 3 3 3 3 3 3 3 3 3 3 3 3 3 3 3 3 3 3] and displs [ 0  4  8 12 16 19 22 25 28 31 34 37 40 43 46 49 52 55 58 61 64 67 70 73
 76 79 82 85 88 91 94 97]
[15/32]: all_predictions (100, 1250000), float64
[24/32]: tree counts [4 4 4 4 3 3 3 3 3 3 3 3 3 3 3 3 3 3 3 3 3 3 3 3 3 3 3 3 3 3 3 3] and displs [ 0  4  8 12 16 19 22 25 28 31 34 37 40 43 46 49 52 55 58 61 64 67 70 73
 76 79 82 85 88 91 94 97]
[24/32]: all_predictions (100, 1250000), float64
[14/32]: tree counts [4 4 4 4 3 3 3 3 3 3 3 3 3 3 3 3 3 3 3 3 3 3 3 3 3 3 3 3 3 3 3 3] and displs [ 0  4  8 12 16 19 22 25 28 31 34 37 40 43 46 49 52 55 58 61 64 67 70 73
 76 79 82 85 88 91 94 97]
[14/32]: all_predictions (100, 1250000), float64
[29/32]: tree counts [4 4 4 4 3 3 3 3 3 3 3 3 3 3 3 3 3 3 3 3 3 3 3 3 3 3 3 3 3 3 3 3] and displs [ 0  4  8 12 16 19 22 25 28 31 34 37 40 43 46 49 52 55 58 61 64 67 70 73
 76 79 82 85 88 91 94 97]
[29/32]: all_predictions (100, 1250000), float64
[3/32]: tree counts [4 4 4 4 3 3 3 3 3 3 3 3 3 3 3 3 3 3 3 3 3 3 3 3 3 3 3 3 3 3 3 3] and displs [ 0  4  8 12 16 19 22 25 28 31 34 37 40 43 46 49 52 55 58 61 64 67 70 73
 76 79 82 85 88 91 94 97]
[3/32]: all_predictions (100, 1250000), float64
[1/32]: tree counts [4 4 4 4 3 3 3 3 3 3 3 3 3 3 3 3 3 3 3 3 3 3 3 3 3 3 3 3 3 3 3 3] and displs [ 0  4  8 12 16 19 22 25 28 31 34 37 40 43 46 49 52 55 58 61 64 67 70 73
 76 79 82 85 88 91 94 97]
[1/32]: all_predictions (100, 1250000), float64
[25/32]: tree counts [4 4 4 4 3 3 3 3 3 3 3 3 3 3 3 3 3 3 3 3 3 3 3 3 3 3 3 3 3 3 3 3] and displs [ 0  4  8 12 16 19 22 25 28 31 34 37 40 43 46 49 52 55 58 61 64 67 70 73
 76 79 82 85 88 91 94 97]
[25/32]: all_predictions (100, 1250000), float64
[10/32]: tree counts [4 4 4 4 3 3 3 3 3 3 3 3 3 3 3 3 3 3 3 3 3 3 3 3 3 3 3 3 3 3 3 3] and displs [ 0  4  8 12 16 19 22 25 28 31 34 37 40 43 46 49 52 55 58 61 64 67 70 73
 76 79 82 85 88 91 94 97]
[10/32]: all_predictions (100, 1250000), float64
[20/32]: tree counts [4 4 4 4 3 3 3 3 3 3 3 3 3 3 3 3 3 3 3 3 3 3 3 3 3 3 3 3 3 3 3 3] and displs [ 0  4  8 12 16 19 22 25 28 31 34 37 40 43 46 49 52 55 58 61 64 67 70 73
 76 79 82 85 88 91 94 97]
[20/32]: all_predictions (100, 1250000), float64
[23/32]: tree counts [4 4 4 4 3 3 3 3 3 3 3 3 3 3 3 3 3 3 3 3 3 3 3 3 3 3 3 3 3 3 3 3] and displs [ 0  4  8 12 16 19 22 25 28 31 34 37 40 43 46 49 52 55 58 61 64 67 70 73
 76 79 82 85 88 91 94 97]
[23/32]: all_predictions (100, 1250000), float64
[30/32]: tree counts [4 4 4 4 3 3 3 3 3 3 3 3 3 3 3 3 3 3 3 3 3 3 3 3 3 3 3 3 3 3 3 3] and displs [ 0  4  8 12 16 19 22 25 28 31 34 37 40 43 46 49 52 55 58 61 64 67 70 73
 76 79 82 85 88 91 94 97]
[30/32]: all_predictions (100, 1250000), float64
[4/32]: tree counts [4 4 4 4 3 3 3 3 3 3 3 3 3 3 3 3 3 3 3 3 3 3 3 3 3 3 3 3 3 3 3 3] and displs [ 0  4  8 12 16 19 22 25 28 31 34 37 40 43 46 49 52 55 58 61 64 67 70 73
 76 79 82 85 88 91 94 97]
[4/32]: all_predictions (100, 1250000), float64
[12/32]: tree counts [4 4 4 4 3 3 3 3 3 3 3 3 3 3 3 3 3 3 3 3 3 3 3 3 3 3 3 3 3 3 3 3] and displs [ 0  4  8 12 16 19 22 25 28 31 34 37 40 43 46 49 52 55 58 61 64 67 70 73
 76 79 82 85 88 91 94 97]
[12/32]: all_predictions (100, 1250000), float64
[9/32]: tree counts [4 4 4 4 3 3 3 3 3 3 3 3 3 3 3 3 3 3 3 3 3 3 3 3 3 3 3 3 3 3 3 3] and displs [ 0  4  8 12 16 19 22 25 28 31 34 37 40 43 46 49 52 55 58 61 64 67 70 73
 76 79 82 85 88 91 94 97]
[9/32]: all_predictions (100, 1250000), float64
[18/32]: tree counts [4 4 4 4 3 3 3 3 3 3 3 3 3 3 3 3 3 3 3 3 3 3 3 3 3 3 3 3 3 3 3 3] and displs [ 0  4  8 12 16 19 22 25 28 31 34 37 40 43 46 49 52 55 58 61 64 67 70 73
 76 79 82 85 88 91 94 97]
[18/32]: all_predictions (100, 1250000), float64
[13/32]: tree counts [4 4 4 4 3 3 3 3 3 3 3 3 3 3 3 3 3 3 3 3 3 3 3 3 3 3 3 3 3 3 3 3] and displs [ 0  4  8 12 16 19 22 25 28 31 34 37 40 43 46 49 52 55 58 61 64 67 70 73
 76 79 82 85 88 91 94 97]
[31/32]: tree counts [4 4 4 4 3 3 3 3 3 3 3 3 3 3 3 3 3 3 3 3 3 3 3 3 3 3 3 3 3 3 3 3] and displs [ 0  4  8 12 16 19 22 25 28 31 34 37 40 43 46 49 52 55 58 61 64 67 70 73
 76 79 82 85 88 91 94 97]
[31/32]: all_predictions (100, 1250000), float64
[8/32]: tree counts [4 4 4 4 3 3 3 3 3 3 3 3 3 3 3 3 3 3 3 3 3 3 3 3 3 3 3 3 3 3 3 3] and displs [ 0  4  8 12 16 19 22 25 28 31 34 37 40 43 46 49 52 55 58 61 64 67 70 73
 76 79 82 85 88 91 94 97]
[8/32]: all_predictions (100, 1250000), float64
[7/32]: tree counts [4 4 4 4 3 3 3 3 3 3 3 3 3 3 3 3 3 3 3 3 3 3 3 3 3 3 3 3 3 3 3 3] and displs [ 0  4  8 12 16 19 22 25 28 31 34 37 40 43 46 49 52 55 58 61 64 67 70 73
 76 79 82 85 88 91 94 97]
[7/32]: all_predictions (100, 1250000), float64
[28/32]: tree counts [4 4 4 4 3 3 3 3 3 3 3 3 3 3 3 3 3 3 3 3 3 3 3 3 3 3 3 3 3 3 3 3] and displs [ 0  4  8 12 16 19 22 25 28 31 34 37 40 43 46 49 52 55 58 61 64 67 70 73
 76 79 82 85 88 91 94 97]
[28/32]: all_predictions (100, 1250000), float64
[2/32]: tree counts [4 4 4 4 3 3 3 3 3 3 3 3 3 3 3 3 3 3 3 3 3 3 3 3 3 3 3 3 3 3 3 3] and displs [ 0  4  8 12 16 19 22 25 28 31 34 37 40 43 46 49 52 55 58 61 64 67 70 73
 76 79 82 85 88 91 94 97]
[5/32]: tree counts [4 4 4 4 3 3 3 3 3 3 3 3 3 3 3 3 3 3 3 3 3 3 3 3 3 3 3 3 3 3 3 3] and displs [ 0  4  8 12 16 19 22 25 28 31 34 37 40 43 46 49 52 55 58 61 64 67 70 73
 76 79 82 85 88 91 94 97]
[5/32]: all_predictions (100, 1250000), float64
[13/32]: all_predictions (100, 1250000), float64
[2/32]: all_predictions (100, 1250000), float64
[22/32]: tree counts [4 4 4 4 3 3 3 3 3 3 3 3 3 3 3 3 3 3 3 3 3 3 3 3 3 3 3 3 3 3 3 3] and displs [ 0  4  8 12 16 19 22 25 28 31 34 37 40 43 46 49 52 55 58 61 64 67 70 73
 76 79 82 85 88 91 94 97]
[22/32]: all_predictions (100, 1250000), float64
[26/32]: tree counts [4 4 4 4 3 3 3 3 3 3 3 3 3 3 3 3 3 3 3 3 3 3 3 3 3 3 3 3 3 3 3 3] and displs [ 0  4  8 12 16 19 22 25 28 31 34 37 40 43 46 49 52 55 58 61 64 67 70 73
 76 79 82 85 88 91 94 97]
[26/32]: all_predictions (100, 1250000), float64
[19/32]: tree counts [4 4 4 4 3 3 3 3 3 3 3 3 3 3 3 3 3 3 3 3 3 3 3 3 3 3 3 3 3 3 3 3] and displs [ 0  4  8 12 16 19 22 25 28 31 34 37 40 43 46 49 52 55 58 61 64 67 70 73
 76 79 82 85 88 91 94 97]
[19/32]: all_predictions (100, 1250000), float64
[0/32]: Directly before Allgatherv...
[21/32]: Directly before Allgatherv...
[16/32]: Directly before Allgatherv...
[11/32]: Directly before Allgatherv...
[23/32]: Directly before Allgatherv...
[10/32]: Directly before Allgatherv...
[6/32]: Directly before Allgatherv...
[27/32]: Directly before Allgatherv...
[15/32]: Directly before Allgatherv...
[24/32]: Directly before Allgatherv...
[4/32]: Directly before Allgatherv...
[25/32]: Directly before Allgatherv...
[30/32]: Directly before Allgatherv...
[26/32]: Directly before Allgatherv...
[29/32]: Directly before Allgatherv...
[14/32]: Directly before Allgatherv...
[9/32]: Directly before Allgatherv...
[18/32]: Directly before Allgatherv...
[22/32]: Directly before Allgatherv...
[5/32]: Directly before Allgatherv...
[13/32]: Directly before Allgatherv...
[31/32]: Directly before Allgatherv...
[8/32]: Directly before Allgatherv...
[19/32]: Directly before Allgatherv...
[7/32]: Directly before Allgatherv...
[3/32]: Directly before Allgatherv...
[17/32]: Directly before Allgatherv...
[20/32]: Directly before Allgatherv...
[1/32]: Directly before Allgatherv...
[12/32]: Directly before Allgatherv...
[28/32]: Directly before Allgatherv...
[2/32]: Directly before Allgatherv...
[17/32]: Calculate majority vote.
[16/32]: Calculate majority vote.
[15/32]: Calculate majority vote.
[19/32]: Calculate majority vote.
[18/32]: Calculate majority vote.
[14/32]: Calculate majority vote.
[26/32]: Calculate majority vote.
[10/32]: Calculate majority vote.
[27/32]: Calculate majority vote.
[25/32]: Calculate majority vote.
[9/32]: Calculate majority vote.
[13/32]: Calculate majority vote.
[28/32]: Calculate majority vote.
[8/32]: Calculate majority vote.
[29/32]: Calculate majority vote.
[24/32]: Calculate majority vote.
[11/32]: Calculate majority vote.
[12/32]: Calculate majority vote.
[23/32]: Calculate majority vote.
[22/32]: Calculate majority vote.
[0/32]: Calculate majority vote.
[7/32]: Calculate majority vote.
[31/32]: Calculate majority vote.
[30/32]: Calculate majority vote.
[1/32]: Calculate majority vote.
[20/32]: Calculate majority vote.
[21/32]: Calculate majority vote.
[6/32]: Calculate majority vote.
[3/32]: Calculate majority vote.
[2/32]: Calculate majority vote.
[4/32]: Calculate majority vote.
[5/32]: Calculate majority vote.
[25/32]: Local accuracy is 0.7461896.
[31/32]: Local accuracy is 0.7460744.
[10/32]: Local accuracy is 0.7473648.
[14/32]: Local accuracy is 0.7464824.
[6/32]: Local accuracy is 0.745756.
[19/32]: Local accuracy is 0.746564.
[16/32]: Local accuracy is 0.7447416.
[3/32]: Local accuracy is 0.7589824.
[27/32]: Local accuracy is 0.7457032.
[22/32]: Local accuracy is 0.7458824.
[24/32]: Local accuracy is 0.7469288.
[11/32]: Local accuracy is 0.7466456.
[18/32]: Local accuracy is 0.7467224.
[29/32]: Local accuracy is 0.7464384.
[8/32]: Local accuracy is 0.7477456.
[26/32]: Local accuracy is 0.746616.
[28/32]: Local accuracy is 0.7448728.
[7/32]: Local accuracy is 0.7480856.
[20/32]: Local accuracy is 0.7458968.
[13/32]: Local accuracy is 0.7454488.
[30/32]: Local accuracy is 0.7459248.
[5/32]: Local accuracy is 0.747772.
[12/32]: Local accuracy is 0.7455848.
[17/32]: Local accuracy is 0.7463272.
[4/32]: Local accuracy is 0.7455472.
[2/32]: Local accuracy is 0.7600096.
[23/32]: Local accuracy is 0.7454024.
[0/32]: Local accuracy is 0.7600528.
[21/32]: Local accuracy is 0.7473464.
[9/32]: Local accuracy is 0.746012.
[15/32]: Local accuracy is 0.7447416.
[1/32]: Local accuracy is 0.759096.
Median local accuracy is 0.7463827999999999. Min 0.7447416 and max 0.7600528.
Global accuracy is 0.7083496.
Average train time is 32.53443590358074 s.
[22/32]: Loading data...
[6/32]: Loading data...
[18/32]: Loading data...
[12/32]: Loading data...
[1/32]: Loading data...
[17/32]: Loading data...
[14/32]: Loading data...
[10/32]: Loading data...
[28/32]: Loading data...
[31/32]: Loading data...
[7/32]: Loading data...
[0/32]: Loading data...
Using truly parallel dataloader...
[25/32]: Loading data...
[15/32]: Loading data...
File size is 2390277560 bytes.
[11/32]: Loading data...
[8/32]: Loading data...
[13/32]: Loading data...
[20/32]: Loading data...
[24/32]: Loading data...
[2/32]: Loading data...
[26/32]: Loading data...
[5/32]: Loading data...
[30/32]: Loading data...
[16/32]: Loading data...
[29/32]: Loading data...
[27/32]: Loading data...
[21/32]: Loading data...
[19/32]: Loading data...
[4/32]: Loading data...
[3/32]: Loading data...
[9/32]: Loading data...
[23/32]: Loading data...
[6/32]: Construct array with line starts and lengths in bytes.
[29/32]: Construct array with line starts and lengths in bytes.
[5/32]: Construct array with line starts and lengths in bytes.
[7/32]: Construct array with line starts and lengths in bytes.
[28/32]: Construct array with line starts and lengths in bytes.
[14/32]: Construct array with line starts and lengths in bytes.
[25/32]: Construct array with line starts and lengths in bytes.
[4/32]: Construct array with line starts and lengths in bytes.
[31/32]: Construct array with line starts and lengths in bytes.
[30/32]: Construct array with line starts and lengths in bytes.
[21/32]: Construct array with line starts and lengths in bytes.
[13/32]: Construct array with line starts and lengths in bytes.
[26/32]: Construct array with line starts and lengths in bytes.
[27/32]: Construct array with line starts and lengths in bytes.
[20/32]: Construct array with line starts and lengths in bytes.
[24/32]: Construct array with line starts and lengths in bytes.
[3/32]: Construct array with line starts and lengths in bytes.
[9/32]: Construct array with line starts and lengths in bytes.
[8/32]: Construct array with line starts and lengths in bytes.
[19/32]: Construct array with line starts and lengths in bytes.
[12/32]: Construct array with line starts and lengths in bytes.
[22/32]: Construct array with line starts and lengths in bytes.
[23/32]: Construct array with line starts and lengths in bytes.
[2/32]: Construct array with line starts and lengths in bytes.
[18/32]: Construct array with line starts and lengths in bytes.
[11/32]: Construct array with line starts and lengths in bytes.
[10/32]: Construct array with line starts and lengths in bytes.
[1/32]: Construct array with line starts and lengths in bytes.
After Allgatherv: All line starts: [         0        479        957 ... 2390276125 2390276602 2390277082]
[0/32]: Construct array with line starts and lengths in bytes.
[17/32]: Construct array with line starts and lengths in bytes.
[16/32]: Construct array with line starts and lengths in bytes.
[15/32]: Construct array with line starts and lengths in bytes.
[24/32]: Make global train-test split.
[29/32]: Make global train-test split.
[26/32]: Make global train-test split.
[19/32]: Make global train-test split.
[1/32]: Make global train-test split.
[31/32]: Make global train-test split.
[17/32]: Make global train-test split.
[15/32]: Make global train-test split.
[27/32]: Make global train-test split.
[25/32]: Make global train-test split.
[11/32]: Make global train-test split.
[3/32]: Make global train-test split.
[28/32]: Make global train-test split.
[6/32]: Make global train-test split.
[16/32]: Make global train-test split.
[18/32]: Make global train-test split.
[20/32]: Make global train-test split.
[21/32]: Make global train-test split.
[13/32]: Make global train-test split.
[9/32]: Make global train-test split.
[14/32]: Make global train-test split.
[2/32]: Make global train-test split.
[0/32]: Make global train-test split.
[10/32]: Make global train-test split.
[7/32]: Make global train-test split.
[8/32]: Make global train-test split.
[23/32]: Make global train-test split.
[30/32]: Make global train-test split.
[12/32]: Make global train-test split.
[29/32]: Decode 1250000 test samples from file.
[24/32]: Decode 1250000 test samples from file.
[1/32]: Decode 1250000 test samples from file.
[22/32]: Make global train-test split.
[26/32]: Decode 1250000 test samples from file.
[27/32]: Decode 1250000 test samples from file.
[25/32]: Decode 1250000 test samples from file.
[3/32]: Decode 1250000 test samples from file.
[17/32]: Decode 1250000 test samples from file.
[31/32]: Decode 1250000 test samples from file.
[11/32]: Decode 1250000 test samples from file.
[19/32]: Decode 1250000 test samples from file.
[28/32]: Decode 1250000 test samples from file.
[6/32]: Decode 1250000 test samples from file.
[15/32]: Decode 1250000 test samples from file.
[16/32]: Decode 1250000 test samples from file.
[18/32]: Decode 1250000 test samples from file.
[9/32]: Decode 1250000 test samples from file.
[20/32]: Decode 1250000 test samples from file.
[4/32]: Make global train-test split.
[21/32]: Decode 1250000 test samples from file.
[13/32]: Decode 1250000 test samples from file.
[2/32]: Decode 1250000 test samples from file.
[14/32]: Decode 1250000 test samples from file.
[0/32]: Decode 1250000 test samples from file.
[10/32]: Decode 1250000 test samples from file.
[7/32]: Decode 1250000 test samples from file.
[8/32]: Decode 1250000 test samples from file.
[30/32]: Decode 1250000 test samples from file.
[12/32]: Decode 1250000 test samples from file.
[23/32]: Decode 1250000 test samples from file.
[22/32]: Decode 1250000 test samples from file.
[4/32]: Decode 1250000 test samples from file.
[5/32]: Make global train-test split.
[5/32]: Decode 1250000 test samples from file.
[0/32]: Draw local 117188 train indices.
[0/32]: Decode train lines from file.
[19/32]: Draw local 117187 train indices.
[16/32]: Draw local 117187 train indices.
[20/32]: Draw local 117187 train indices.
[19/32]: Decode train lines from file.
[16/32]: Decode train lines from file.
[20/32]: Decode train lines from file.
[26/32]: Draw local 117187 train indices.
[26/32]: Decode train lines from file.
[29/32]: Draw local 117187 train indices.
[29/32]: Decode train lines from file.
[11/32]: Draw local 117188 train indices.
[11/32]: Decode train lines from file.
[9/32]: Draw local 117188 train indices.
[9/32]: Decode train lines from file.
[31/32]: Draw local 117187 train indices.
[31/32]: Decode train lines from file.
[24/32]: Draw local 117187 train indices.
[24/32]: Decode train lines from file.
[27/32]: Draw local 117187 train indices.
[27/32]: Decode train lines from file.
[30/32]: Draw local 117187 train indices.
[21/32]: Draw local 117187 train indices.
[30/32]: Decode train lines from file.
[14/32]: Draw local 117188 train indices.
[21/32]: Decode train lines from file.
[14/32]: Decode train lines from file.
[8/32]: Draw local 117188 train indices.
[8/32]: Decode train lines from file.
[1/32]: Draw local 117188 train indices.
[13/32]: Draw local 117188 train indices.
[23/32]: Draw local 117187 train indices.
[17/32]: Draw local 117187 train indices.
[1/32]: Decode train lines from file.
[13/32]: Decode train lines from file.
[23/32]: Decode train lines from file.
[17/32]: Decode train lines from file.
[12/32]: Draw local 117188 train indices.
[15/32]: Draw local 117188 train indices.
[12/32]: Decode train lines from file.
[15/32]: Decode train lines from file.
[28/32]: Draw local 117187 train indices.
[28/32]: Decode train lines from file.
[4/32]: Draw local 117188 train indices.
[3/32]: Draw local 117188 train indices.
[6/32]: Draw local 117188 train indices.
[2/32]: Draw local 117188 train indices.
[4/32]: Decode train lines from file.
[3/32]: Decode train lines from file.
[6/32]: Decode train lines from file.
[2/32]: Decode train lines from file.
[18/32]: Draw local 117187 train indices.
[18/32]: Decode train lines from file.
[10/32]: Draw local 117188 train indices.
[10/32]: Decode train lines from file.
[25/32]: Draw local 117187 train indices.
[25/32]: Decode train lines from file.
[7/32]: Draw local 117188 train indices.
[7/32]: Decode train lines from file.
[5/32]: Draw local 117188 train indices.
[5/32]: Decode train lines from file.
[22/32]: Draw local 117187 train indices.
[22/32]: Decode train lines from file.
[0/32]: Done...
Local train samples and targets have shapes (117188, 18) and (117188,).
Global test samples and targets have shapes (1250000, 18) and (1250000,).

[0/32]: Labels are [0. 0. 0. ... 0. 1. 0.]
[19/32]: Done...
Local train samples and targets have shapes (117187, 18) and (117187,).
Global test samples and targets have shapes (1250000, 18) and (1250000,).

[19/32]: Labels are [0. 1. 1. ... 0. 0. 0.]
[16/32]: Done...
Local train samples and targets have shapes (117187, 18) and (117187,).
Global test samples and targets have shapes (1250000, 18) and (1250000,).

[16/32]: Labels are [1. 0. 1. ... 0. 0. 0.]
[20/32]: Done...
Local train samples and targets have shapes (117187, 18) and (117187,).
Global test samples and targets have shapes (1250000, 18) and (1250000,).

[20/32]: Labels are [1. 1. 1. ... 1. 0. 1.]
[26/32]: Done...
Local train samples and targets have shapes (117187, 18) and (117187,).
Global test samples and targets have shapes (1250000, 18) and (1250000,).

[26/32]: Labels are [0. 1. 0. ... 1. 0. 0.]
[29/32]: Done...
Local train samples and targets have shapes (117187, 18) and (117187,).
Global test samples and targets have shapes (1250000, 18) and (1250000,).

[29/32]: Labels are [0. 0. 1. ... 1. 1. 0.]
[11/32]: Done...
Local train samples and targets have shapes (117188, 18) and (117188,).
Global test samples and targets have shapes (1250000, 18) and (1250000,).

[11/32]: Labels are [1. 0. 1. ... 0. 1. 0.]
[9/32]: Done...
Local train samples and targets have shapes (117188, 18) and (117188,).
Global test samples and targets have shapes (1250000, 18) and (1250000,).

[9/32]: Labels are [0. 1. 0. ... 0. 1. 0.]
[24/32]: Done...
Local train samples and targets have shapes (117187, 18) and (117187,).
Global test samples and targets have shapes (1250000, 18) and (1250000,).

[24/32]: Labels are [0. 0. 1. ... 1. 0. 0.]
[31/32]: Done...
Local train samples and targets have shapes (117187, 18) and (117187,).
Global test samples and targets have shapes (1250000, 18) and (1250000,).

[31/32]: Labels are [1. 1. 0. ... 1. 1. 0.]
[27/32]: Done...
Local train samples and targets have shapes (117187, 18) and (117187,).
Global test samples and targets have shapes (1250000, 18) and (1250000,).

[27/32]: Labels are [0. 0. 1. ... 0. 1. 1.]
[30/32]: Done...
Local train samples and targets have shapes (117187, 18) and (117187,).
Global test samples and targets have shapes (1250000, 18) and (1250000,).

[30/32]: Labels are [0. 0. 0. ... 0. 0. 1.]
[21/32]: Done...
Local train samples and targets have shapes (117187, 18) and (117187,).
Global test samples and targets have shapes (1250000, 18) and (1250000,).

[21/32]: Labels are [0. 0. 1. ... 1. 1. 1.]
[14/32]: Done...
Local train samples and targets have shapes (117188, 18) and (117188,).
Global test samples and targets have shapes (1250000, 18) and (1250000,).

[1/32]: Done...
Local train samples and targets have shapes (117188, 18) and (117188,).
Global test samples and targets have shapes (1250000, 18) and (1250000,).

[1/32]: Labels are [1. 1. 1. ... 0. 1. 0.]
[14/32]: Labels are [1. 0. 1. ... 1. 0. 1.]
[12/32]: Done...
Local train samples and targets have shapes (117188, 18) and (117188,).
Global test samples and targets have shapes (1250000, 18) and (1250000,).

[12/32]: Labels are [1. 1. 0. ... 1. 1. 1.]
[8/32]: Done...
Local train samples and targets have shapes (117188, 18) and (117188,).
Global test samples and targets have shapes (1250000, 18) and (1250000,).

[8/32]: Labels are [0. 0. 1. ... 1. 0. 0.]
[13/32]: Done...
Local train samples and targets have shapes (117188, 18) and (117188,).
Global test samples and targets have shapes (1250000, 18) and (1250000,).

[13/32]: Labels are [0. 1. 0. ... 0. 0. 0.]
[23/32]: Done...
Local train samples and targets have shapes (117187, 18) and (117187,).
Global test samples and targets have shapes (1250000, 18) and (1250000,).

[23/32]: Labels are [0. 0. 0. ... 1. 0. 1.]
[17/32]: Done...
Local train samples and targets have shapes (117187, 18) and (117187,).
Global test samples and targets have shapes (1250000, 18) and (1250000,).

[17/32]: Labels are [1. 0. 1. ... 1. 1. 1.]
[15/32]: Done...
Local train samples and targets have shapes (117188, 18) and (117188,).
Global test samples and targets have shapes (1250000, 18) and (1250000,).

[15/32]: Labels are [1. 1. 1. ... 1. 1. 0.]
[28/32]: Done...
Local train samples and targets have shapes (117187, 18) and (117187,).
Global test samples and targets have shapes (1250000, 18) and (1250000,).

[28/32]: Labels are [0. 0. 1. ... 1. 1. 0.]
[2/32]: Done...
Local train samples and targets have shapes (117188, 18) and (117188,).
Global test samples and targets have shapes (1250000, 18) and (1250000,).

[6/32]: Done...
Local train samples and targets have shapes (117188, 18) and (117188,).
Global test samples and targets have shapes (1250000, 18) and (1250000,).

[2/32]: Labels are [1. 1. 1. ... 0. 0. 1.]
[6/32]: Labels are [1. 1. 0. ... 1. 0. 0.]
[4/32]: Done...
Local train samples and targets have shapes (117188, 18) and (117188,).
Global test samples and targets have shapes (1250000, 18) and (1250000,).

[4/32]: Labels are [0. 1. 1. ... 1. 1. 0.]
[3/32]: Done...
Local train samples and targets have shapes (117188, 18) and (117188,).
Global test samples and targets have shapes (1250000, 18) and (1250000,).

[3/32]: Labels are [0. 1. 1. ... 0. 0. 0.]
[10/32]: Done...
Local train samples and targets have shapes (117188, 18) and (117188,).
Global test samples and targets have shapes (1250000, 18) and (1250000,).

[10/32]: Labels are [1. 1. 1. ... 0. 1. 0.]
[18/32]: Done...
Local train samples and targets have shapes (117187, 18) and (117187,).
Global test samples and targets have shapes (1250000, 18) and (1250000,).

[18/32]: Labels are [0. 1. 1. ... 0. 1. 0.]
[25/32]: Done...
Local train samples and targets have shapes (117187, 18) and (117187,).
Global test samples and targets have shapes (1250000, 18) and (1250000,).

[25/32]: Labels are [0. 0. 0. ... 0. 1. 0.]
[5/32]: Done...
Local train samples and targets have shapes (117188, 18) and (117188,).
Global test samples and targets have shapes (1250000, 18) and (1250000,).

[5/32]: Labels are [0. 0. 1. ... 0. 0. 1.]
[7/32]: Done...
Local train samples and targets have shapes (117188, 18) and (117188,).
Global test samples and targets have shapes (1250000, 18) and (1250000,).

[7/32]: Labels are [1. 0. 0. ... 1. 1. 0.]
[22/32]: Done...
Local train samples and targets have shapes (117187, 18) and (117187,).
Global test samples and targets have shapes (1250000, 18) and (1250000,).

[22/32]: Labels are [0. 0. 0. ... 0. 0. 0.]
Elapsed time is 35.39883493723755 s.
[0/32]: Set up and train local random forest.
[22/32]: Set up and train local random forest.
[28/32]: Set up and train local random forest.
[18/32]: Set up and train local random forest.
[2/32]: Set up and train local random forest.
[24/32]: Set up and train local random forest.
[23/32]: Set up and train local random forest.
[29/32]: Set up and train local random forest.
[7/32]: Set up and train local random forest.
[26/32]: Set up and train local random forest.
[1/32]: Set up and train local random forest.
[15/32]: Set up and train local random forest.
[27/32]: Set up and train local random forest.
[14/32]: Set up and train local random forest.
[17/32]: Set up and train local random forest.
[4/32]: Set up and train local random forest.
[12/32]: Set up and train local random forest.
[3/32]: Set up and train local random forest.
[5/32]: Set up and train local random forest.
[25/32]: Set up and train local random forest.
[9/32]: Set up and train local random forest.
[19/32]: Set up and train local random forest.
[11/32]: Set up and train local random forest.
[6/32]: Set up and train local random forest.
[30/32]: Set up and train local random forest.
[13/32]: Set up and train local random forest.
[21/32]: Set up and train local random forest.
[10/32]: Set up and train local random forest.
[16/32]: Set up and train local random forest.
[20/32]: Set up and train local random forest.
[8/32]: Set up and train local random forest.
[31/32]: Set up and train local random forest.
[14/32]: Get predictions of individual sub estimators.
[8/32]: Get predictions of individual sub estimators.
[18/32]: Get predictions of individual sub estimators.
[26/32]: Get predictions of individual sub estimators.
[16/32]: Get predictions of individual sub estimators.
[20/32]: Get predictions of individual sub estimators.
[6/32]: Get predictions of individual sub estimators.
[28/32]: Get predictions of individual sub estimators.
[4/32]: Get predictions of individual sub estimators.
[10/32]: Get predictions of individual sub estimators.
[5/32]: Get predictions of individual sub estimators.
[24/32]: Get predictions of individual sub estimators.
[25/32]: Get predictions of individual sub estimators.
[22/32]: Get predictions of individual sub estimators.
[15/32]: Get predictions of individual sub estimators.
[31/32]: Get predictions of individual sub estimators.
[7/32]: Get predictions of individual sub estimators.
[29/32]: Get predictions of individual sub estimators.
[27/32]: Get predictions of individual sub estimators.
[11/32]: Get predictions of individual sub estimators.
[12/32]: Get predictions of individual sub estimators.
[23/32]: Get predictions of individual sub estimators.
[30/32]: Get predictions of individual sub estimators.
[21/32]: Get predictions of individual sub estimators.
[19/32]: Get predictions of individual sub estimators.
[9/32]: Get predictions of individual sub estimators.
[13/32]: Get predictions of individual sub estimators.
[17/32]: Get predictions of individual sub estimators.
[0/32]: Get predictions of individual sub estimators.
[1/32]: Get predictions of individual sub estimators.
[2/32]: Get predictions of individual sub estimators.
[3/32]: Get predictions of individual sub estimators.
[14/32]: Allgather predictions.
[14/32]: tree_predictions (3, 1250000), float64
[8/32]: Allgather predictions.
[8/32]: tree_predictions (3, 1250000), float64
[18/32]: Allgather predictions.
[18/32]: tree_predictions (3, 1250000), float64
[26/32]: Allgather predictions.
[26/32]: tree_predictions (3, 1250000), float64
[20/32]: Allgather predictions.
[20/32]: tree_predictions (3, 1250000), float64
[4/32]: Allgather predictions.
[4/32]: tree_predictions (3, 1250000), float64
[10/32]: Allgather predictions.
[10/32]: tree_predictions (3, 1250000), float64
[16/32]: Allgather predictions.
[16/32]: tree_predictions (3, 1250000), float64
[6/32]: Allgather predictions.
[6/32]: tree_predictions (3, 1250000), float64
[28/32]: Allgather predictions.
[28/32]: tree_predictions (3, 1250000), float64
[15/32]: Allgather predictions.
[15/32]: tree_predictions (3, 1250000), float64
[5/32]: Allgather predictions.
[5/32]: tree_predictions (3, 1250000), float64
[22/32]: Allgather predictions.
[22/32]: tree_predictions (3, 1250000), float64
[24/32]: Allgather predictions.
[24/32]: tree_predictions (3, 1250000), float64
[25/32]: Allgather predictions.
[25/32]: tree_predictions (3, 1250000), float64
[31/32]: Allgather predictions.
[31/32]: tree_predictions (3, 1250000), float64
[7/32]: Allgather predictions.
[7/32]: tree_predictions (3, 1250000), float64
[29/32]: Allgather predictions.
[29/32]: tree_predictions (3, 1250000), float64
[27/32]: Allgather predictions.
[27/32]: tree_predictions (3, 1250000), float64
[12/32]: Allgather predictions.
[12/32]: tree_predictions (3, 1250000), float64
[11/32]: Allgather predictions.
[11/32]: tree_predictions (3, 1250000), float64
[23/32]: Allgather predictions.
[23/32]: tree_predictions (3, 1250000), float64
[19/32]: Allgather predictions.
[19/32]: tree_predictions (3, 1250000), float64
[13/32]: Allgather predictions.
[13/32]: tree_predictions (3, 1250000), float64
[30/32]: Allgather predictions.
[30/32]: tree_predictions (3, 1250000), float64
[21/32]: Allgather predictions.
[21/32]: tree_predictions (3, 1250000), float64
[9/32]: Allgather predictions.
[9/32]: tree_predictions (3, 1250000), float64
[17/32]: Allgather predictions.
[17/32]: tree_predictions (3, 1250000), float64
[0/32]: Allgather predictions.
[0/32]: tree_predictions (4, 1250000), float64
[1/32]: Allgather predictions.
[1/32]: tree_predictions (4, 1250000), float64
[2/32]: Allgather predictions.
[2/32]: tree_predictions (4, 1250000), float64
[3/32]: Allgather predictions.
[3/32]: tree_predictions (4, 1250000), float64
[0/32]: tree counts [4 4 4 4 3 3 3 3 3 3 3 3 3 3 3 3 3 3 3 3 3 3 3 3 3 3 3 3 3 3 3 3] and displs [ 0  4  8 12 16 19 22 25 28 31 34 37 40 43 46 49 52 55 58 61 64 67 70 73
 76 79 82 85 88 91 94 97]
[0/32]: all_predictions (100, 1250000), float64
[3/32]: tree counts [4 4 4 4 3 3 3 3 3 3 3 3 3 3 3 3 3 3 3 3 3 3 3 3 3 3 3 3 3 3 3 3] and displs [ 0  4  8 12 16 19 22 25 28 31 34 37 40 43 46 49 52 55 58 61 64 67 70 73
 76 79 82 85 88 91 94 97]
[3/32]: all_predictions (100, 1250000), float64
[25/32]: tree counts [4 4 4 4 3 3 3 3 3 3 3 3 3 3 3 3 3 3 3 3 3 3 3 3 3 3 3 3 3 3 3 3] and displs [ 0  4  8 12 16 19 22 25 28 31 34 37 40 43 46 49 52 55 58 61 64 67 70 73
 76 79 82 85 88 91 94 97]
[25/32]: all_predictions (100, 1250000), float64
[15/32]: tree counts [4 4 4 4 3 3 3 3 3 3 3 3 3 3 3 3 3 3 3 3 3 3 3 3 3 3 3 3 3 3 3 3] and displs [ 0  4  8 12 16 19 22 25 28 31 34 37 40 43 46 49 52 55 58 61 64 67 70 73
 76 79 82 85 88 91 94 97]
[15/32]: all_predictions (100, 1250000), float64
[9/32]: tree counts [4 4 4 4 3 3 3 3 3 3 3 3 3 3 3 3 3 3 3 3 3 3 3 3 3 3 3 3 3 3 3 3] and displs [ 0  4  8 12 16 19 22 25 28 31 34 37 40 43 46 49 52 55 58 61 64 67 70 73
 76 79 82 85 88 91 94 97]
[9/32]: all_predictions (100, 1250000), float64
[11/32]: tree counts [4 4 4 4 3 3 3 3 3 3 3 3 3 3 3 3 3 3 3 3 3 3 3 3 3 3 3 3 3 3 3 3] and displs [ 0  4  8 12 16 19 22 25 28 31 34 37 40 43 46 49 52 55 58 61 64 67 70 73
 76 79 82 85 88 91 94 97]
[11/32]: all_predictions (100, 1250000), float64
[13/32]: tree counts [4 4 4 4 3 3 3 3 3 3 3 3 3 3 3 3 3 3 3 3 3 3 3 3 3 3 3 3 3 3 3 3] and displs [ 0  4  8 12 16 19 22 25 28 31 34 37 40 43 46 49 52 55 58 61 64 67 70 73
 76 79 82 85 88 91 94 97]
[13/32]: all_predictions (100, 1250000), float64
[8/32]: tree counts [4 4 4 4 3 3 3 3 3 3 3 3 3 3 3 3 3 3 3 3 3 3 3 3 3 3 3 3 3 3 3 3] and displs [ 0  4  8 12 16 19 22 25 28 31 34 37 40 43 46 49 52 55 58 61 64 67 70 73
 76 79 82 85 88 91 94 97]
[8/32]: all_predictions (100, 1250000), float64
[28/32]: tree counts [4 4 4 4 3 3 3 3 3 3 3 3 3 3 3 3 3 3 3 3 3 3 3 3 3 3 3 3 3 3 3 3] and displs [ 0  4  8 12 16 19 22 25 28 31 34 37 40 43 46 49 52 55 58 61 64 67 70 73
 76 79 82 85 88 91 94 97]
[28/32]: all_predictions (100, 1250000), float64
[27/32]: tree counts [4 4 4 4 3 3 3 3 3 3 3 3 3 3 3 3 3 3 3 3 3 3 3 3 3 3 3 3 3 3 3 3] and displs [ 0  4  8 12 16 19 22 25 28 31 34 37 40 43 46 49 52 55 58 61 64 67 70 73
 76 79 82 85 88 91 94 97]
[27/32]: all_predictions (100, 1250000), float64
[23/32]: tree counts [4 4 4 4 3 3 3 3 3 3 3 3 3 3 3 3 3 3 3 3 3 3 3 3 3 3 3 3 3 3 3 3] and displs [ 0  4  8 12 16 19 22 25 28 31 34 37 40 43 46 49 52 55 58 61 64 67 70 73
 76 79 82 85 88 91 94 97]
[23/32]: all_predictions (100, 1250000), float64
[7/32]: tree counts [4 4 4 4 3 3 3 3 3 3 3 3 3 3 3 3 3 3 3 3 3 3 3 3 3 3 3 3 3 3 3 3] and displs [ 0  4  8 12 16 19 22 25 28 31 34 37 40 43 46 49 52 55 58 61 64 67 70 73
 76 79 82 85 88 91 94 97]
[7/32]: all_predictions (100, 1250000), float64
[16/32]: tree counts [4 4 4 4 3 3 3 3 3 3 3 3 3 3 3 3 3 3 3 3 3 3 3 3 3 3 3 3 3 3 3 3] and displs [ 0  4  8 12 16 19 22 25 28 31 34 37 40 43 46 49 52 55 58 61 64 67 70 73
 76 79 82 85 88 91 94 97]
[16/32]: all_predictions (100, 1250000), float64
[26/32]: tree counts [4 4 4 4 3 3 3 3 3 3 3 3 3 3 3 3 3 3 3 3 3 3 3 3 3 3 3 3 3 3 3 3] and displs [ 0  4  8 12 16 19 22 25 28 31 34 37 40 43 46 49 52 55 58 61 64 67 70 73
 76 79 82 85 88 91 94 97]
[26/32]: all_predictions (100, 1250000), float64
[1/32]: tree counts [4 4 4 4 3 3 3 3 3 3 3 3 3 3 3 3 3 3 3 3 3 3 3 3 3 3 3 3 3 3 3 3] and displs [ 0  4  8 12 16 19 22 25 28 31 34 37 40 43 46 49 52 55 58 61 64 67 70 73
 76 79 82 85 88 91 94 97]
[1/32]: all_predictions (100, 1250000), float64
[2/32]: tree counts [4 4 4 4 3 3 3 3 3 3 3 3 3 3 3 3 3 3 3 3 3 3 3 3 3 3 3 3 3 3 3 3] and displs [ 0  4  8 12 16 19 22 25 28 31 34 37 40 43 46 49 52 55 58 61 64 67 70 73
 76 79 82 85 88 91 94 97]
[2/32]: all_predictions (100, 1250000), float64
[17/32]: tree counts [4 4 4 4 3 3 3 3 3 3 3 3 3 3 3 3 3 3 3 3 3 3 3 3 3 3 3 3 3 3 3 3] and displs [ 0  4  8 12 16 19 22 25 28 31 34 37 40 43 46 49 52 55 58 61 64 67 70 73
 76 79 82 85 88 91 94 97]
[17/32]: all_predictions (100, 1250000), float64
[4/32]: tree counts [4 4 4 4 3 3 3 3 3 3 3 3 3 3 3 3 3 3 3 3 3 3 3 3 3 3 3 3 3 3 3 3] and displs [ 0  4  8 12 16 19 22 25 28 31 34 37 40 43 46 49 52 55 58 61 64 67 70 73
 76 79 82 85 88 91 94 97]
[4/32]: all_predictions (100, 1250000), float64
[18/32]: tree counts [4 4 4 4 3 3 3 3 3 3 3 3 3 3 3 3 3 3 3 3 3 3 3 3 3 3 3 3 3 3 3 3] and displs [ 0  4  8 12 16 19 22 25 28 31 34 37 40 43 46 49 52 55 58 61 64 67 70 73
 76 79 82 85 88 91 94 97]
[18/32]: all_predictions (100, 1250000), float64
[12/32]: tree counts [4 4 4 4 3 3 3 3 3 3 3 3 3 3 3 3 3 3 3 3 3 3 3 3 3 3 3 3 3 3 3 3] and displs [ 0  4  8 12 16 19 22 25 28 31 34 37 40 43 46 49 52 55 58 61 64 67 70 73
 76 79 82 85 88 91 94 97]
[12/32]: all_predictions (100, 1250000), float64
[20/32]: tree counts [4 4 4 4 3 3 3 3 3 3 3 3 3 3 3 3 3 3 3 3 3 3 3 3 3 3 3 3 3 3 3 3] and displs [ 0  4  8 12 16 19 22 25 28 31 34 37 40 43 46 49 52 55 58 61 64 67 70 73
 76 79 82 85 88 91 94 97]
[20/32]: all_predictions (100, 1250000), float64
[5/32]: tree counts [4 4 4 4 3 3 3 3 3 3 3 3 3 3 3 3 3 3 3 3 3 3 3 3 3 3 3 3 3 3 3 3] and displs [ 0  4  8 12 16 19 22 25 28 31 34 37 40 43 46 49 52 55 58 61 64 67 70 73
 76 79 82 85 88 91 94 97]
[5/32]: all_predictions (100, 1250000), float64
[19/32]: tree counts [4 4 4 4 3 3 3 3 3 3 3 3 3 3 3 3 3 3 3 3 3 3 3 3 3 3 3 3 3 3 3 3] and displs [ 0  4  8 12 16 19 22 25 28 31 34 37 40 43 46 49 52 55 58 61 64 67 70 73
 76 79 82 85 88 91 94 97]
[19/32]: all_predictions (100, 1250000), float64
[6/32]: tree counts [4 4 4 4 3 3 3 3 3 3 3 3 3 3 3 3 3 3 3 3 3 3 3 3 3 3 3 3 3 3 3 3] and displs [ 0  4  8 12 16 19 22 25 28 31 34 37 40 43 46 49 52 55 58 61 64 67 70 73
 76 79 82 85 88 91 94 97]
[6/32]: all_predictions (100, 1250000), float64
[30/32]: tree counts [4 4 4 4 3 3 3 3 3 3 3 3 3 3 3 3 3 3 3 3 3 3 3 3 3 3 3 3 3 3 3 3] and displs [ 0  4  8 12 16 19 22 25 28 31 34 37 40 43 46 49 52 55 58 61 64 67 70 73
 76 79 82 85 88 91 94 97]
[30/32]: all_predictions (100, 1250000), float64
[21/32]: tree counts [4 4 4 4 3 3 3 3 3 3 3 3 3 3 3 3 3 3 3 3 3 3 3 3 3 3 3 3 3 3 3 3] and displs [ 0  4  8 12 16 19 22 25 28 31 34 37 40 43 46 49 52 55 58 61 64 67 70 73
 76 79 82 85 88 91 94 97]
[21/32]: all_predictions (100, 1250000), float64
[24/32]: tree counts [4 4 4 4 3 3 3 3 3 3 3 3 3 3 3 3 3 3 3 3 3 3 3 3 3 3 3 3 3 3 3 3] and displs [ 0  4  8 12 16 19 22 25 28 31 34 37 40 43 46 49 52 55 58 61 64 67 70 73
 76 79 82 85 88 91 94 97]
[24/32]: all_predictions (100, 1250000), float64
[10/32]: tree counts [4 4 4 4 3 3 3 3 3 3 3 3 3 3 3 3 3 3 3 3 3 3 3 3 3 3 3 3 3 3 3 3] and displs [ 0  4  8 12 16 19 22 25 28 31 34 37 40 43 46 49 52 55 58 61 64 67 70 73
 76 79 82 85 88 91 94 97]
[10/32]: all_predictions (100, 1250000), float64
[22/32]: tree counts [4 4 4 4 3 3 3 3 3 3 3 3 3 3 3 3 3 3 3 3 3 3 3 3 3 3 3 3 3 3 3 3] and displs [ 0  4  8 12 16 19 22 25 28 31 34 37 40 43 46 49 52 55 58 61 64 67 70 73
 76 79 82 85 88 91 94 97]
[22/32]: all_predictions (100, 1250000), float64
[29/32]: tree counts [4 4 4 4 3 3 3 3 3 3 3 3 3 3 3 3 3 3 3 3 3 3 3 3 3 3 3 3 3 3 3 3] and displs [ 0  4  8 12 16 19 22 25 28 31 34 37 40 43 46 49 52 55 58 61 64 67 70 73
 76 79 82 85 88 91 94 97]
[29/32]: all_predictions (100, 1250000), float64
[31/32]: tree counts [4 4 4 4 3 3 3 3 3 3 3 3 3 3 3 3 3 3 3 3 3 3 3 3 3 3 3 3 3 3 3 3] and displs [ 0  4  8 12 16 19 22 25 28 31 34 37 40 43 46 49 52 55 58 61 64 67 70 73
 76 79 82 85 88 91 94 97]
[31/32]: all_predictions (100, 1250000), float64
[14/32]: tree counts [4 4 4 4 3 3 3 3 3 3 3 3 3 3 3 3 3 3 3 3 3 3 3 3 3 3 3 3 3 3 3 3] and displs [ 0  4  8 12 16 19 22 25 28 31 34 37 40 43 46 49 52 55 58 61 64 67 70 73
 76 79 82 85 88 91 94 97]
[14/32]: all_predictions (100, 1250000), float64
[23/32]: Directly before Allgatherv...
[16/32]: Directly before Allgatherv...
[17/32]: Directly before Allgatherv...
[18/32]: Directly before Allgatherv...
[7/32]: Directly before Allgatherv...
[31/32]: Directly before Allgatherv...
[26/32]: Directly before Allgatherv...
[14/32]: Directly before Allgatherv...
[4/32]: Directly before Allgatherv...
[12/32]: Directly before Allgatherv...
[20/32]: Directly before Allgatherv...
[5/32]: Directly before Allgatherv...
[25/32]: Directly before Allgatherv...
[15/32]: Directly before Allgatherv...
[9/32]: Directly before Allgatherv...
[19/32]: Directly before Allgatherv...
[11/32]: Directly before Allgatherv...
[6/32]: Directly before Allgatherv...
[30/32]: Directly before Allgatherv...
[13/32]: Directly before Allgatherv...
[21/32]: Directly before Allgatherv...
[28/32]: Directly before Allgatherv...
[27/32]: Directly before Allgatherv...
[10/32]: Directly before Allgatherv...
[22/32]: Directly before Allgatherv...
[29/32]: Directly before Allgatherv...
[8/32]: Directly before Allgatherv...
[24/32]: Directly before Allgatherv...
[0/32]: Directly before Allgatherv...
[1/32]: Directly before Allgatherv...
[2/32]: Directly before Allgatherv...
[3/32]: Directly before Allgatherv...
[16/32]: Calculate majority vote.
[19/32]: Calculate majority vote.
[15/32]: Calculate majority vote.
[20/32]: Calculate majority vote.
[17/32]: Calculate majority vote.
[18/32]: Calculate majority vote.
[14/32]: Calculate majority vote.
[13/32]: Calculate majority vote.
[21/32]: Calculate majority vote.
[22/32]: Calculate majority vote.
[25/32]: Calculate majority vote.
[12/32]: Calculate majority vote.
[23/32]: Calculate majority vote.
[24/32]: Calculate majority vote.
[8/32]: Calculate majority vote.
[11/32]: Calculate majority vote.
[7/32]: Calculate majority vote.
[10/32]: Calculate majority vote.
[26/32]: Calculate majority vote.
[9/32]: Calculate majority vote.
[6/32]: Calculate majority vote.
[5/32]: Calculate majority vote.
[28/32]: Calculate majority vote.
[27/32]: Calculate majority vote.
[29/32]: Calculate majority vote.
[4/32]: Calculate majority vote.
[30/32]: Calculate majority vote.
[31/32]: Calculate majority vote.
[0/32]: Calculate majority vote.
[3/32]: Calculate majority vote.
[1/32]: Calculate majority vote.
[2/32]: Calculate majority vote.
[14/32]: Local accuracy is 0.7453192.
[31/32]: Local accuracy is 0.7462424.
[24/32]: Local accuracy is 0.7481592.
[15/32]: Local accuracy is 0.7465488.
[6/32]: Local accuracy is 0.7474336.
[22/32]: Local accuracy is 0.7479864.
[16/32]: Local accuracy is 0.7458712.
[19/32]: Local accuracy is 0.747448.
[26/32]: Local accuracy is 0.7477576.
[9/32]: Local accuracy is 0.746956.
[20/32]: Local accuracy is 0.7460904.
[4/32]: Local accuracy is 0.7460488.
[12/32]: Local accuracy is 0.7474048.
[0/32]: Local accuracy is 0.7612752.
[27/32]: Local accuracy is 0.7464328.
[23/32]: Local accuracy is 0.7475288.
[28/32]: Local accuracy is 0.7480752.
[7/32]: Local accuracy is 0.7470096.
[18/32]: Local accuracy is 0.747652.
[10/32]: Local accuracy is 0.7471864.
[1/32]: Local accuracy is 0.759556.
[21/32]: Local accuracy is 0.7478824.
[17/32]: Local accuracy is 0.7470496.
[3/32]: Local accuracy is 0.7604168.
[25/32]: Local accuracy is 0.7456984.
[5/32]: Local accuracy is 0.747544.
[11/32]: Local accuracy is 0.7463928.
[8/32]: Local accuracy is 0.7475224.
[2/32]: Local accuracy is 0.7598952.
[29/32]: Local accuracy is 0.7458376.
[13/32]: Local accuracy is 0.7470168.
[30/32]: Local accuracy is 0.7473904.
Median local accuracy is 0.7473976. Min 0.7453192 and max 0.7612752.
Global accuracy is 0.7082496.
Average train time is 27.19997139161569 s.

============================= JOB FEEDBACK =============================

NodeName=uc2n[044,081-083,086,088,092-093,101-103,105,107,110-111,115-116,119-120,146-147,185,187,269,275-279,325-327]
Job ID: 21643305
Cluster: uc2
User/Group: ku4408/scc
State: COMPLETED (exit code 0)
Nodes: 32
Cores per node: 80
CPU Utilized: 03:00:41
CPU Efficiency: 0.99% of 12-14:56:00 core-walltime
Job Wall-clock time: 00:07:06
Memory Utilized: 2.22 GB
Memory Efficiency: 0.08% of 2.75 TB
