#frame time energy
0 7.50000e-02 1.01282e+05
1 1.05000e-01 9.82571e+04
2 1.35000e-01 9.64338e+04
3 1.65000e-01 9.45610e+04
4 1.95000e-01 9.26766e+04
5 2.25000e-01 9.08343e+04
6 3.75000e-01 8.28231e+04
7 5.25000e-01 7.69647e+04
8 6.75000e-01 7.24428e+04
9 8.25000e-01 6.87028e+04
10 9.75000e-01 6.55722e+04
11 1.12500e+00 6.29460e+04
12 1.27500e+00 6.07371e+04
13 1.42500e+00 5.89124e+04
14 1.57500e+00 5.73937e+04
15 1.72500e+00 5.61107e+04
16 1.87500e+00 5.50197e+04
17 2.02500e+00 5.40799e+04
18 2.17500e+00 5.32557e+04
19 2.32500e+00 5.25267e+04
20 2.47500e+00 5.18877e+04
21 2.62500e+00 5.13244e+04
22 2.77500e+00 5.08196e+04
23 2.92500e+00 5.03698e+04
24 3.07500e+00 4.99639e+04
25 3.57500e+00 4.89003e+04
26 4.07499e+00 4.80778e+04
27 4.57499e+00 4.74571e+04
28 5.07498e+00 4.69575e+04
29 5.57498e+00 4.65512e+04
30 6.07497e+00 4.62313e+04
31 6.07500e+00 4.62313e+04
32 6.57500e+00 4.59699e+04
33 7.07499e+00 4.57566e+04
34 7.57499e+00 4.55723e+04
35 8.07498e+00 4.54149e+04
36 8.57498e+00 4.52755e+04
37 9.07497e+00 4.51522e+04
38 9.07500e+00 4.51522e+04
