frame time isolated dropped surfarea euler porevolume gbarea
0 0.075 0.0 0.0 3253053.3844351717 -2316 3323510.0 1995586.5315071247
1 0.105 0.0 0.0 3088610.7245225958 -2709 3056354.5 2822160.025484942
2 0.135 32.44603 0.0 2980240.0182071584 -2740 2906764.0 3221674.392672425
3 0.165 53.686577 0.0 2872803.898489638 -2527 2765145.8 3596493.0541420416
4 0.195 148.69685 0.0 2768106.4903659704 -2229 2631761.8 3941896.2331424807
5 0.225 106.843956 0.0 2666098.9570256397 -2014 2506974.5 4258036.995662284
6 0.375 440.20758 0.0 2220055.547270118 -1527 2008621.4 5463277.673292311
7 0.525 967.73676 0.0 1880739.0089466202 -1096 1667017.1 6245695.6682224525
8 0.675 7452.7764 0.0 1607553.2873687216 -792 1409883.4 6798553.3131110035
9 0.825 18264.982 0.0 1373578.3572544896 -450 1201347.1 7221549.259780158
10 0.975 51942.773 0.0 1178324.5333233804 -158 1032781.9 7547905.818150682
11 1.125 87823.586 0.0 1014288.7792843122 34 894264.7 7791838.548922889
12 1.275 161984.7 0.0 879356.0154287508 222 781045.06 7893217.866068972
13 1.425 370908.56 0.0 777646.6196712874 334 689844.75 7705807.6338609485
14 1.575 514793.5 346.8652 708693.2480523717 394 615877.2 7170754.627861294
15 1.725 635127.7 984.45386 659235.7946263638 426 554584.9 6407222.416666927
16 1.875 662924.56 3482.2695 613076.2444067303 434 500627.16 5614330.4542610785
17 2.025 666263.4 8541.847 581486.7817160486 404 457567.9 4898596.879439497
18 2.175 677401.06 15696.015 547046.0902570797 428 420356.4 4385367.259392864
19 2.325 633265.3 28692.467 514039.0428860581 406 388653.34 4005352.5956645375
20 2.475 608224.1 37351.195 487576.2294453114 418 362561.03 3748024.8615768203
21 2.625 568332.8 39376.035 462535.81344112766 438 339799.28 3540350.212206597
22 2.775 538965.9 49963.598 438010.7169769489 426 319304.62 3380418.9906434417
23 2.925 516383.9 51944.555 414890.23608160386 410 300746.84 3243050.837370582
24 3.075 488768.38 52351.547 395853.4041717796 398 284483.22 3139551.211948549
25 3.675 420190.7 88611.1 335636.4769427204 354 235645.27 2709675.1196503616
26 4.275 380779.97 122887.24 294193.73178518866 334 204532.3 2415402.526989773
27 4.875 342652.25 134523.55 259863.9616920122 318 180293.64 2180989.0133300326
28 5.475 315935.4 131631.48 238203.08843792276 282 163145.27 1992788.054047752
29 6.075 290761.16 135265.08 220852.11437242743 264 150423.89 1841236.9568095193
30 6.675 269330.97 133925.8 204838.69391734255 254 139502.98 1758079.9191476584
31 7.275 252737.75 129376.21 191171.7960845265 234 130904.11 1673210.7418935485
32 7.875 243059.89 133443.05 179483.89094546463 220 123526.305 1623999.9756788106
33 8.475 230838.17 139014.39 169066.75609164496 222 116872.71 1581019.2621223906
34 9.075 222144.1 127791.664 161404.4175695809 212 111326.914 1552278.840237577
35 9.675 213096.97 127179.695 154380.7571286063 204 106216.69 1516291.780612878
36 10.275 205017.1 122566.0 148381.64383147508 196 101872.336 1474368.886925014
37 10.875 200797.06 110635.21 143867.7344396171 184 98487.79 1438636.3264796694
