frame time nsz nsy nsx ngbz ngby ngbx ksz ksy ksx kgbz kgby kgbx wsz wsy wsx wgbz wgby wgbx ktz kty ktx wtz wty wtx
0 0.07500000298023224 11761120.0 11579303.0 11682791.0 3084582.0 3097829.0 3089712.0 -2439139.0531385117 -2461746.6121701025 -2438866.152070673 -11464732.331677241 -11485716.335434336 -11462530.807329647 21459580.394767657 21459580.394767657 21459580.394767657 2455189.813094416 2455189.813094416 2455189.813094416 -8640253.814699437 -8596950.176351875 -8622504.93152053 11068932.626202175 11068932.626202175 11068932.626202175
1 0.10499999672174454 10296177.0 10110512.0 10225320.0 4013517.0 4036041.0 4015129.0 -4739636.558409882 -4732745.774572516 -4730835.166316758 -15369838.4697282 -15417249.232204197 -15390532.754443761 18337051.39593243 18337051.39593243 18337051.39593243 3695841.9180019065 3695841.9180019065 3695841.9180019065 -8969179.364241984 -8910987.387968026 -8945353.58713321 10396170.104513785 10396170.104513785 10396170.104513785
2 0.13500000536441803 9297373.0 9118501.0 9240097.0 4710725.0 4732515.0 4707291.0 -5408143.222742395 -5397261.094019396 -5407614.901921157 -18260909.252889182 -18313536.26061638 -18278139.403615903 16360517.75813851 16360517.75813851 16360517.75813851 4636052.378478803 4636052.378478803 4636052.378478803 -8725615.197423263 -8670079.359236408 -8707849.337532245 9647840.084959716 9647840.084959716 9647840.084959716
3 0.16500000655651093 8520421.0 8350421.0 8476555.0 5252466.0 5270039.0 5247220.0 -5643178.662345574 -5647058.04421071 -5655730.843144859 -20543227.013500754 -20595010.286576908 -20569142.618889663 14868282.706748318 14868282.706748318 14868282.706748318 5386492.057332067 5386492.057332067 5386492.057332067 -8354817.3081045905 -8317271.591630979 -8346937.046336112 8990507.311537571 8990507.311537571 8990507.311537571
4 0.19499999284744263 7914530.0 7748415.0 7873207.0 5678453.0 5692862.0 5670278.0 -5689521.715858672 -5706070.355381842 -5712865.945494939 -22364742.785809577 -22407933.741056696 -22386767.796118032 13715543.244275816 13715543.244275816 13715543.244275816 5988147.509775637 5988147.509775637 5988147.509775637 -7971798.869064224 -7948601.9833188 -7972067.0824348545 8438538.472256094 8438538.472256094 8438538.472256094
5 0.22499999403953552 7432239.0 7270480.0 7391911.0 6018239.0 6035941.0 6008527.0 -5654515.71540161 -5673451.572803603 -5682871.981140069 -23839764.399013974 -23878574.220826786 -23846706.633984823 12804073.844058592 12804073.844058592 12804073.844058592 6476865.419435018 6476865.419435018 6476865.419435018 -7620435.200691907 -7604068.509356538 -7625371.711550107 7975195.010372414 7975195.010372414 7975195.010372414
6 0.375 5907528.0 5758995.0 5864990.0 7124779.0 7139517.0 7112140.0 -5207552.27615315 -5201219.692794107 -5225718.366055782 -28531104.29978038 -28561172.12726261 -28513429.531620707 9990051.436901238 9990051.436901238 9990051.436901238 8005494.124937928 8005494.124937928 8005494.124937928 -6396882.873547924 -6367384.432021274 -6390808.487220711 6425461.378621943 6425461.378621943 6425461.378621943
7 0.5249999761581421 4970660.0 4832529.0 4924597.0 7791615.0 7804672.0 7772501.0 -4603070.068020609 -4596662.083228041 -4608773.938624753 -31415547.45568894 -31461226.933369923 -31400525.286771912 8308417.316364832 8308417.316364832 8308417.316364832 8886628.964446336 8886628.964446336 8886628.964446336 -5509546.0109196 -5480586.048292995 -5492768.452384193 5393653.285783984 5393653.285783984 5393653.285783984
8 0.675000011920929 4304448.0 4178593.0 4255830.0 8251483.0 8251134.0 8235435.0 -3968348.467863097 -3976849.8099056915 -3975659.3703736803 -33481239.696146034 -33518854.69192929 -33480237.399154965 7131559.823498957 7131559.823498957 7131559.823498957 9479639.399614237 9479639.399614237 9479639.399614237 -4733138.937144136 -4720538.156688916 -4722285.9237308325 4619620.029386948 4619620.029386948 4619620.029386948
9 0.824999988079071 3808063.0 3702359.0 3770384.0 8556066.0 8549473.0 8544997.0 -3406167.8856260423 -3424441.028835799 -3417391.6173724025 -34978133.163402826 -35009673.36666576 -34990581.6227003 6279312.991883178 6279312.991883178 6279312.991883178 9894494.627840923 9894494.627840923 9894494.627840923 -4085628.4502373883 -4084890.3776449068 -4082714.6407222417 4039308.7725879964 4039308.7725879964 4039308.7725879964
10 0.9750000238418579 3439744.0 3342931.0 3404740.0 8765239.0 8750535.0 8739252.0 -2954457.4386647474 -2979334.9829969537 -2963398.0789246014 -36069269.46764712 -36093577.580311894 -36079579.93907846 5647871.18406888 5647871.18406888 5647871.18406888 10190216.629115043 10190216.629115043 10190216.629115043 -3576187.396118136 -3582221.1080594487 -3573154.1999021173 3602818.3169874195 3602818.3169874195 3602818.3169874195
11 1.125 3150597.0 3067057.0 3119566.0 8913833.0 8901349.0 8890359.0 -2596574.864440482 -2621016.1607378135 -2600774.020862754 -36914843.44919656 -36943639.33273352 -36926188.512573525 5159024.3420021925 5159024.3420021925 5159024.3420021925 10411495.824311282 10411495.824311282 10411495.824311282 -3176518.071944844 -3182473.2443074887 -3170211.7818268877 3262127.8024640684 3262127.8024640684 3262127.8024640684
12 1.274999976158142 2917854.0 2841916.0 2889475.0 9020854.0 9007023.0 8999289.0 -2288393.2764768032 -2305114.480652949 -2287142.652464202 -37591482.61910625 -37605191.954998784 -37584781.41777795 4766137.188166585 4766137.188166585 4766137.188166585 10583529.27980155 10583529.27980155 10583529.27980155 -2836809.870531776 -2835367.081009808 -2826447.9683361733 2986343.4722589846 2986343.4722589846 2986343.4722589846
13 1.4249999523162842 2728229.0 2654872.0 2704842.0 9086088.0 9071561.0 9073037.0 -2031692.3124150054 -2040120.0339855244 -2026044.0494004462 -38100075.358195536 -38119607.677070476 -38127262.30587699 4446582.0137456395 4446582.0137456395 4446582.0137456395 10718886.078099785 10718886.078099785 10718886.078099785 -2555452.7270174706 -2547103.5433058916 -2541993.5235724445 2761783.5951445377 2761783.5951445377 2761783.5951445377
14 1.5750000476837158 2569748.0 2496065.0 2551090.0 9139665.0 9125740.0 9118253.0 -1809136.272881966 -1812011.8446265287 -1806647.599578616 -38519495.70259027 -38550149.96915932 -38541331.84077258 4180141.532033522 4180141.532033522 4180141.532033522 10828948.647482112 10828948.647482112 10828948.647482112 -2314196.208763643 -2301001.264202135 -2303728.167111429 2573306.0490807774 2573306.0490807774 2573306.0490807774
15 1.725000023841858 2432301.0 2361713.0 2420946.0 9175512.0 9172408.0 9164117.0 -1611929.336776368 -1613255.142052699 -1612370.3591569227 -38879965.21803125 -38910805.51909234 -38899723.52077068 3951234.80257113 3951234.80257113 3951234.80257113 10921160.988159448 10921160.988159448 10921160.988159448 -2100488.4772813357 -2086456.7370191554 -2093692.640658613 2410875.9258622727 2410875.9258622727 2410875.9258622727
16 1.875 2314688.0 2245457.0 2307198.0 9202019.0 9198406.0 9187208.0 -1438154.1772624415 -1439631.2314571298 -1441383.5490781653 -39166990.29651094 -39210618.407476425 -39200206.294442005 3755154.1710503716 3755154.1710503716 3755154.1710503716 10998575.79732721 10998575.79732721 10998575.79732721 -1912414.7790284024 -1899580.5212227057 -1908271.667979036 2271316.0442344025 2271316.0442344025 2271316.0442344025
17 2.0250000953674316 2214013.0 2144674.0 2207007.0 9228215.0 9222703.0 9204721.0 -1283290.430089283 -1284660.8515734165 -1288082.6846555506 -39430255.58595589 -39469885.41510667 -39455038.50847613 3585106.2137310817 3585106.2137310817 3585106.2137310817 11065163.906547854 11065163.906547854 11065163.906547854 -1743986.6606496635 -1732227.5056974355 -1741741.611596739 2149331.264655685 2149331.264655685 2149331.264655685
18 2.174999952316284 2127448.0 2058400.0 2120799.0 9244463.0 9240425.0 9219173.0 -1151162.5685462758 -1152168.2041702468 -1158125.0260612948 -39647586.45459106 -39679940.35674087 -39667189.3876211 3439883.107504168 3439883.107504168 3439883.107504168 11120711.921991747 11120711.921991747 11120711.921991747 -1600121.661137637 -1589678.4893745983 -1600976.4834902568 2045772.9404974899 2045772.9404974899 2045772.9404974899
19 2.325000047683716 2052257.0 1983460.0 2045646.0 9256458.0 9255121.0 9232404.0 -1034498.0080081667 -1033738.1858995549 -1043512.7626362385 -39829909.12491989 -39872207.728482075 -39853761.7266561 3312865.0019523427 3312865.0019523427 3312865.0019523427 11168707.550920254 11168707.550920254 11168707.550920254 -1472691.5249242634 -1462174.6623855971 -1476543.010323843 1954538.0862026846 1954538.0862026846 1954538.0862026846
20 2.4749999046325684 1983719.0 1920294.0 1979183.0 9267297.0 9268228.0 9240641.0 -936757.803635935 -936067.5915209117 -944401.2890610782 -39987379.54612537 -40043557.04666116 -39999136.713830456 3202336.442435517 3202336.442435517 3202336.442435517 11209699.579574129 11209699.579574129 11209699.579574129 -1365774.6971286668 -1356385.2976303224 -1369416.3726199921 1875925.2049193864 1875925.2049193864 1875925.2049193864
21 2.625 1922600.0 1864742.0 1919433.0 9271886.0 9271844.0 9244760.0 -847414.6653533959 -847289.1843738467 -852216.6313237231 -40121535.99984802 -40173324.27159738 -40132127.97401851 3103343.5724027865 3103343.5724027865 3103343.5724027865 11245288.653341569 11245288.653341569 11245288.653341569 -1267416.4915512411 -1259416.4077084041 -1269583.5886238636 1805829.1682277645 1805829.1682277645 1805829.1682277645
22 2.7750000953674316 1866295.0 1814276.0 1866325.0 9274262.0 9277020.0 9242444.0 -762475.8644863251 -762897.176946052 -765703.9946809569 -40242408.111682236 -40296055.92107295 -40239444.48947105 3014822.0466415966 3014822.0466415966 3014822.0466415966 11276531.966829335 11276531.966829335 11276531.966829335 -1174938.2609002101 -1167778.8095250414 -1175883.3009045909 1742736.6550570237 1742736.6550570237 1742736.6550570237
23 2.924999952316284 1818163.0 1771358.0 1819954.0 9279693.0 9278585.0 9249846.0 -696459.0427753178 -696418.7554225117 -698103.2224715662 -40342649.677162126 -40392353.94465112 -40354674.48622507 2937898.0884543248 2937898.0884543248 2937898.0884543248 11303031.764330301 11303031.764330301 11303031.764330301 -1102290.4001223545 -1094609.6500052034 -1101911.651241886 1688637.1841245021 1688637.1841245021 1688637.1841245021
24 3.075000047683716 1772505.0 1730968.0 1776549.0 9284461.0 9284646.0 9255131.0 -628369.0164051089 -628299.4962879663 -630636.1389544195 -40435846.97114633 -40487929.6583924 -40450213.74931774 2865811.7157070846 2865811.7157070846 2865811.7157070846 11327258.376468409 11327258.376468409 11327258.376468409 -1027698.8029721711 -1020354.7238961713 -1028088.6382328846 1636967.210843097 1636967.210843097 1636967.210843097
