frame time nsz nsy nsx ngbz ngby ngbx ksz ksy ksx kgbz kgby kgbx wsz wsy wsx wgbz wgby wgbx ktz kty ktx wtz wty wtx
0 0.07500000298023224 11761120.0 11579303.0 11682791.0 3084582.0 3097829.0 3089712.0 -2439139.0531385117 -2461746.6121701025 -2438866.152070673 -11464732.331677241 -11485716.335434336 -11462530.807329647 21459580.394767657 21459580.394767657 21459580.394767657 2455189.813094416 2455189.813094416 2455189.813094416 -8640253.814699437 -8596950.176351875 -8622504.93152053 11068932.626202175 11068932.626202175 11068932.626202175
1 0.10499999672174454 10472986.0 10282835.0 10393898.0 4036156.0 4063108.0 4042108.0 -4355987.297742583 -4345913.666667052 -4347827.600805522 -15181314.186018089 -15238192.02878496 -15213930.378820673 18768079.96080171 18768079.96080171 18768079.96080171 3845695.5339858714 3845695.5339858714 3845695.5339858714 -8847228.69368585 -8783630.197266007 -8823357.877564149 10494877.274663161 10494877.274663161 10494877.274663161
2 0.13500000536441803 9574845.0 9387319.0 9510523.0 4684923.0 4711008.0 4688764.0 -5017122.984834368 -5004844.343861012 -5009309.254435817 -17862751.340058155 -17924180.149880324 -17900912.789780103 16964714.17765321 16964714.17765321 16964714.17765321 4757822.923386301 4757822.923386301 4757822.923386301 -8620708.224838955 -8561366.90083366 -8595880.1863635 9837303.045707926 9837303.045707926 9837303.045707926
3 0.16500000655651093 8864036.0 8685281.0 8813101.0 5185761.0 5195902.0 5179223.0 -5300014.5087986 -5295966.342286872 -5301437.305734708 -19966946.595697768 -20011778.08353107 -19995596.043247845 15575468.184222529 15575468.184222529 15575468.184222529 5461842.992874763 5461842.992874763 5461842.992874763 -8293567.153376753 -8246444.2655447135 -8274983.55095329 9259246.56622714 9259246.56622714 9259246.56622714
4 0.19499999284744263 8305363.0 8127211.0 8260925.0 5568249.0 5576422.0 5559691.0 -5393253.147230583 -5404470.269286678 -5410169.738344295 -21641060.27957679 -21670485.66014563 -21665343.433244344 14482770.503492946 14482770.503492946 14482770.503492946 6014411.397223059 6014411.397223059 6014411.397223059 -7942209.9391381 -7911727.516587264 -7936371.458315985 8769450.043911606 8769450.043911606 8769450.043911606
5 0.22499999403953552 7851714.0 7678340.0 7810172.0 5868892.0 5878865.0 5861767.0 -5401761.69383026 -5415636.381051056 -5423767.855310731 -22975297.201343205 -23015435.30450392 -22995844.2329505 13607466.869180042 13607466.869180042 13607466.869180042 6452675.079488289 6452675.079488289 6452675.079488289 -7617473.68835521 -7591700.100263011 -7615381.218695046 8360332.219107916 8360332.219107916 8360332.219107916
6 0.375 6429203.0 6274334.0 6381799.0 6808939.0 6807537.0 6793821.0 -5128654.11590056 -5122242.884488671 -5148865.963548481 -27145022.542631827 -27173389.70531486 -27135026.614318196 10919782.487113541 10919782.487113541 10919782.487113541 7762979.892727683 7762979.892727683 7762979.892727683 -6502556.185496503 -6469113.3835778395 -6498592.450820779 7023162.839746671 7023162.839746671 7023162.839746671
7 0.5249999761581421 5537649.0 5398143.0 5488898.0 7396152.0 7371001.0 7377478.0 -4724901.277641878 -4713559.792490959 -4732680.094650942 -29686094.736160304 -29716385.247348715 -29676457.201105658 9300810.007471325 9300810.007471325 9300810.007471325 8517620.844505113 8517620.844505113 8517620.844505113 -5772357.843224886 -5735122.466624032 -5757552.052369616 6119772.218628814 6119772.218628814 6119772.218628814
8 0.675000011920929 4881370.0 4749161.0 4817639.0 7880314.0 7833235.0 7833095.0 -4262459.272765611 -4254061.9715716485 -4257181.093245018 -31566376.593263894 -31587145.62617164 -31598905.082148775 8115947.776723144 8115947.776723144 8115947.776723144 9040538.241594352 9040538.241594352 9040538.241594352 -5106123.656753009 -5071724.77226131 -5082689.193930535 5365508.007148367 5365508.007148367 5365508.007148367
9 0.824999988079071 4385373.0 4267381.0 4312122.0 8146927.0 8052454.0 8098366.0 -3830635.2639782564 -3833566.0135180275 -3826157.7679067114 -32421369.66433336 -32335787.117989596 -32487606.060139354 7231862.106247949 7231862.106247949 7231862.106247949 9229061.844074346 9229061.844074346 9229061.844074346 -4437063.260507343 -4419485.8442947315 -4420809.316694811 4658256.579685597 4658256.579685597 4658256.579685597
10 0.9750000238418579 4035074.0 3917166.0 3961936.0 7837331.0 7708720.0 7832196.0 -3497885.1880547707 -3505566.4658754617 -3498494.8548732013 -30796326.991416246 -30598584.19581721 -30815165.391752638 6610142.19460594 6610142.19460594 6610142.19460594 8813068.63062922 8813068.63062922 8813068.63062922 -3778764.7190733748 -3778050.7204352417 -3767472.9053736012 3977945.808110988 3977945.808110988 3977945.808110988
11 1.125 3763160.0 3661410.0 3699178.0 7063786.0 6999812.0 7046424.0 -3235357.6195572484 -3251077.4326002575 -3236132.1882559406 -27250926.533975728 -27115861.937542334 -27232768.295018308 6145067.865570077 6145067.865570077 6145067.865570077 7992661.5569347115 7992661.5569347115 7992661.5569347115 -3193682.086961368 -3201219.66929517 -3181706.2739982638 3372908.029067616 3372908.029067616 3372908.029067616
12 1.274999976158142 3528821.0 3457452.0 3484946.0 6286349.0 6308064.0 6265227.0 -2992993.227121444 -3019878.9817677615 -3001920.322778879 -23734567.373030763 -23753437.23751548 -23824454.010119513 5766718.564834168 5766718.564834168 5766718.564834168 7204874.019421627 7204874.019421627 7204874.019421627 -2738221.365220557 -2741566.0546845905 -2728693.349879988 2877292.9050794956 2877292.9050794956 2877292.9050794956
13 1.4249999523162842 3346684.0 3281582.0 3328294.0 5606395.0 5610810.0 5579401.0 -2759108.510580225 -2781648.636853559 -2765993.6803757944 -20886937.387962356 -20868778.880955968 -20886742.464072216 5474443.0708832685 5474443.0708832685 5474443.0708832685 6532111.2496239515 6532111.2496239515 6532111.2496239515 -2402164.1844319687 -2401340.421221008 -2392996.113072138 2473400.5322489454 2473400.5322489454 2473400.5322489454
14 1.5750000476837158 3181075.0 3126754.0 3171383.0 5151121.0 5075783.0 5082073.0 -2541796.607280643 -2556157.224608334 -2544655.467467749 -18876118.492891736 -18770143.59322051 -18781479.39892069 5204319.264859905 5204319.264859905 5204319.264859905 6046326.147669671 6046326.147669671 6046326.147669671 -2124651.976470238 -2124167.876992486 -2110930.002594168 2163814.2842180226 2163814.2842180226 2163814.2842180226
15 1.725000023841858 3053472.0 2991052.0 3039418.0 4758448.0 4669696.0 4610021.0 -2364452.284188552 -2359979.2706919876 -2363973.153917036 -17319243.1620679 -17203807.072914332 -17067800.647919327 4984528.168115301 4984528.168115301 4984528.168115301 5679002.835064438 5679002.835064438 5679002.835064438 -1904354.523769127 -1906467.049500841 -1897829.9464872798 1931752.7063317385 1931752.7063317385 1931752.7063317385
16 1.875 2940482.0 2867908.0 2925488.0 4392030.0 4319679.0 4303427.0 -2203025.335597851 -2192642.907510718 -2196882.293176256 -15970640.734617671 -15906889.054071452 -15790818.775416784 4789268.089808447 4789268.089808447 4789268.089808447 5365389.810850434 5365389.810850434 5365389.810850434 -1712654.5173308656 -1711670.954100032 -1714849.0656387673 1740992.317462109 1740992.317462109 1740992.317462109
17 2.0250000953674316 2835382.0 2761420.0 2810849.0 4123318.0 4043881.0 4064418.0 -2048903.3847424597 -2037715.5794170117 -2042518.4348506362 -14934563.65159004 -14912048.56152303 -14824635.112153504 4606321.5261285305 4606321.5261285305 4606321.5261285305 5118956.947370627 5118956.947370627 5118956.947370627 -1554355.15326118 -1553387.9729083832 -1555214.6916503988 1578925.0201130756 1578925.0201130756 1578925.0201130756
18 2.174999952316284 2738681.0 2669041.0 2722076.0 3886502.0 3814448.0 3856500.0 -1916764.5247492467 -1907506.5206401492 -1915003.878972234 -14127772.769221062 -14103156.516989775 -14078557.902575197 4453073.17072757 4453073.17072757 4453073.17072757 4924909.067313429 4924909.067313429 4924909.067313429 -1418801.5803959905 -1415526.6747899444 -1414193.185962882 1442492.510873987 1442492.510873987 1442492.510873987
19 2.325000047683716 2659881.0 2585830.0 2640165.0 3696479.0 3652951.0 3659886.0 -1811319.258087619 -1799643.820721491 -1809017.8000863402 -13493189.91247555 -13479955.202403948 -13452313.29163661 4317217.285207401 4317217.285207401 4317217.285207401 4766910.357173177 4766910.357173177 4766910.357173177 -1302721.6096335019 -1298493.4049699046 -1297259.3314110527 1337403.8430321484 1337403.8430321484 1337403.8430321484
20 2.4749999046325684 2586551.0 2520406.0 2564283.0 3505762.0 3507168.0 3475020.0 -1714828.431472259 -1703548.265467246 -1711515.1885571969 -12840186.991442796 -12883030.049535226 -12832879.486657258 4197714.136492532 4197714.136492532 4197714.136492532 4598786.292853664 4598786.292853664 4598786.292853664 -1198110.9556091637 -1193663.900975281 -1191663.3135624868 1233984.3511943035 1233984.3511943035 1233984.3511943035
21 2.625 2512801.0 2458890.0 2494874.0 3373562.0 3381117.0 3279821.0 -1617169.7135932252 -1609277.8488645563 -1615977.16864452 -12272758.99591879 -12352408.786810666 -12219103.12197163 4082733.284197699 4082733.284197699 4082733.284197699 4444483.4210322555 4444483.4210322555 4444483.4210322555 -1090099.1066237956 -1088699.5486471578 -1090501.1869780116 1148097.3936364593 1148097.3936364593 1148097.3936364593
22 2.7750000953674316 2452087.0 2400936.0 2431946.0 3228698.0 3242815.0 3114789.0 -1530013.0388963078 -1522039.103978774 -1523382.2619942806 -11746490.03768681 -11799745.477482123 -11604917.504353575 3981169.743383495 3981169.743383495 3981169.743383495 4292084.551142773 4292084.551142773 4292084.551142773 -995394.3413240729 -993825.6419823592 -996499.4203357089 1066179.6626645864 1066179.6626645864 1066179.6626645864
23 2.924999952316284 2395845.0 2351337.0 2376630.0 3040519.0 3124693.0 2982051.0 -1450824.6636836992 -1447117.522058428 -1443073.902213701 -11217809.64003132 -11252654.766553834 -11064221.259082315 3891846.729742244 3891846.729742244 3891846.729742244 4140189.4906173153 4140189.4906173153 4140189.4906173153 -907364.6909737737 -909422.406439082 -912989.2643557425 992806.0257049325 992806.0257049325 992806.0257049325
24 3.075000047683716 2341213.0 2305832.0 2325629.0 2903037.0 3050114.0 2850906.0 -1368554.6164388137 -1365457.8253208557 -1360644.2410742182 -10742940.229887063 -10833411.828926409 -10594458.34205424 3806976.226849557 3806976.226849557 3806976.226849557 4006109.5670573 4006109.5670573 4006109.5670573 -830158.9628134178 -831545.666966927 -831614.5075844016 922759.4455686472 922759.4455686472 922759.4455686472
25 3.5749950408935547 2211913.0 2174806.0 2206152.0 2612681.0 2682928.0 2540025.0 -1190059.070369232 -1184555.9035063656 -1178006.594020112 -9468224.038025763 -9604265.627016552 -9510401.660506122 3597488.628675535 3597488.628675535 3597488.628675535 3655838.782549946 3655838.782549946 3655838.782549946 -636463.7580253242 -643145.7728202575 -637577.8934105386 759927.591048063 759927.591048063 759927.591048063
