{
  "@context": ["https://www.w3.org/2019/wot/td/v1"],
  "id": "http://127.0.0.1:5000/watering_system",
  "title": "Sprinkler",
  "type": "Sprinkler",
  "base": "http://127.0.0.1:5000",
  "owl:sameAs": "test",
  "securityDefinitions": {
    "basic_sc": {
      "scheme": "basic",
      "in": "header"
    }
  },
  "security": ["basic_sc"],
  "properties": {
    "water": {
      "type": "boolean",
      "description": "States whether the water tank is full or empty. If True water is still remaining in the tank and the device is ready for usage otherwise water needs to be refilled",
      "forms": [
        {
          "href": "/watering_system",
          "mediaType": "application/Json",
          "op": ["readproperty"],
          "htv:methodName": "GET"
        }
      ]
    },
    "on": {
      "type": "boolean",
      "description": "Describes whether the device is turned on (if true) or off (if false)",
      "forms": [
        {
          "href": "/watering_system",
          "mediaType": "application/Json",
          "op": ["readproperty"],
          "htv:methodName": "GET"
        }
      ]
    }
  },
  "actions": {
    "Power on": {
      "description": "Turns power of the watering system on",
      "forms": [
        {
          "href": "/watering_system/power_on",
          "contentType": "application/Json",
          "op": "invokeaction",
          "htv:methodName": "GET"
        }
      ]
    },
    "Power off": {
      "description": "Turns power of the watering system off",
      "forms": [
        {
          "href": "/watering_system/power_off",
          "contentType": "application/Json",
          "op": "invokeaction",
          "htv:methodName": "GET"
        }
      ]
    },
    "Sprinkle": {
      "description": "Initiates watering process wetting all surrounding plants",
      "forms": [
        {
          "href": "/watering_system/sprinkle",
          "contentType": "application/Json",
          "op": "invokeaction",
          "htv:methodName": "GET"
        }
      ]
    },
    "Refill": {
      "description": "Refills water tank",
      "forms": [
        {
          "href": "/watering_system/refill",
          "contentType": "application/Json",
          "op": "invokeaction",
          "htv:methodName": "GET"
        }
      ]
      
    }
  }
}
