POINTS:
0.0 0.0
0.0 0.125
0.0 0.25
0.0 0.375
0.0 0.5
0.0 0.625
0.0 0.75
0.0 0.875
0.0 1.0
0.125 0.0
0.125 0.125
0.125 0.25
0.125 0.375
0.125 0.5
0.125 0.625
0.125 0.75
0.125 0.875
0.125 1.0
0.25 0.0
0.25 0.125
0.25 0.25
0.25 0.375
0.25 0.5
0.25 0.625
0.25 0.75
0.25 0.875
0.25 1.0
0.375 0.0
0.375 0.125
0.375 0.25
0.375 0.375
0.375 0.5
0.375 0.625
0.375 0.75
0.375 0.875
0.375 1.0
0.5 0.0
0.5 0.125
0.5 0.25
0.5 0.375
0.5 0.5
0.5 0.625
0.5 0.75
0.5 0.875
0.5 1.0
0.625 0.0
0.625 0.125
0.625 0.25
0.625 0.375
0.625 0.5
0.625 0.625
0.625 0.75
0.625 0.875
0.625 1.0
0.75 0.0
0.75 0.125
0.75 0.25
0.75 0.375
0.75 0.5
0.75 0.625
0.75 0.75
0.75 0.875
0.75 1.0
0.875 0.0
0.875 0.125
0.875 0.25
0.875 0.375
0.875 0.5
0.875 0.625
0.875 0.75
0.875 0.875
0.875 1.0
1.0 0.0
1.0 0.125
1.0 0.25
1.0 0.375
1.0 0.5
1.0 0.625
1.0 0.75
1.0 0.875
1.0 1.0
1.125 0.0
1.125 0.125
1.125 0.25
1.125 0.375
1.125 0.5
1.125 0.625
1.125 0.75
1.125 0.875
1.125 1.0
1.25 0.0
1.25 0.125
1.25 0.25
1.25 0.375
1.25 0.5
1.25 0.625
1.25 0.75
1.25 0.875
1.25 1.0
1.375 0.0
1.375 0.125
1.375 0.25
1.375 0.375
1.375 0.5
1.375 0.625
1.375 0.75
1.375 0.875
1.375 1.0
1.5 0.0
1.5 0.125
1.5 0.25
1.5 0.375
1.5 0.5
1.5 0.625
1.5 0.75
1.5 0.875
1.5 1.0
1.625 0.0
1.625 0.125
1.625 0.25
1.625 0.375
1.625 0.5
1.625 0.625
1.625 0.75
1.625 0.875
1.625 1.0
1.75 0.0
1.75 0.125
1.75 0.25
1.75 0.375
1.75 0.5
1.75 0.625
1.75 0.75
1.75 0.875
1.75 1.0
1.875 0.0
1.875 0.125
1.875 0.25
1.875 0.375
1.875 0.5
1.875 0.625
1.875 0.75
1.875 0.875
1.875 1.0
2.0 0.0
2.0 0.125
2.0 0.25
2.0 0.375
2.0 0.5
2.0 0.625
2.0 0.75
2.0 0.875
2.0 1.0
2.125 0.0
2.125 0.125
2.125 0.25
2.125 0.375
2.125 0.5
2.125 0.625
2.125 0.75
2.125 0.875
2.125 1.0
2.25 0.0
2.25 0.125
2.25 0.25
2.25 0.375
2.25 0.5
2.25 0.625
2.25 0.75
2.25 0.875
2.25 1.0
2.375 0.0
2.375 0.125
2.375 0.25
2.375 0.375
2.375 0.5
2.375 0.625
2.375 0.75
2.375 0.875
2.375 1.0
2.5 0.0
2.5 0.125
2.5 0.25
2.5 0.375
2.5 0.5
2.5 0.625
2.5 0.75
2.5 0.875
2.5 1.0
2.625 0.0
2.625 0.125
2.625 0.25
2.625 0.375
2.625 0.5
2.625 0.625
2.625 0.75
2.625 0.875
2.625 1.0
2.75 0.0
2.75 0.125
2.75 0.25
2.75 0.375
2.75 0.5
2.75 0.625
2.75 0.75
2.75 0.875
2.75 1.0
2.875 0.0
2.875 0.125
2.875 0.25
2.875 0.375
2.875 0.5
2.875 0.625
2.875 0.75
2.875 0.875
2.875 1.0
3.0 0.0
3.0 0.125
3.0 0.25
3.0 0.375
3.0 0.5
3.0 0.625
3.0 0.75
3.0 0.875
3.0 1.0
3.125 0.0
3.125 0.125
3.125 0.25
3.125 0.375
3.125 0.5
3.125 0.625
3.125 0.75
3.125 0.875
3.125 1.0
3.25 0.0
3.25 0.25
3.25 0.5
3.25 0.75
3.25 1.0
3.5 0.0
3.5 0.5
3.5 1.0
4.0 0.0
4.0 0.5
4.0 1.0
4.5 0.0
4.5 0.5
4.5 1.0
5.0 0.0
5.0 0.5
5.0 1.0
5.5 0.0
5.5 0.5
5.5 1.0
6.0 0.0
6.0 0.5
6.0 1.0
-0.125 0.0
-0.125 0.125
-0.125 0.25
-0.125 0.375
-0.125 0.5
-0.125 0.625
-0.125 0.75
-0.125 0.875
-0.125 1.0
-0.25 0.0
-0.25 0.125
-0.25 0.25
-0.25 0.375
-0.25 0.5
-0.25 0.625
-0.25 0.75
-0.25 0.875
-0.25 1.0
-0.375 0.0
-0.375 0.125
-0.375 0.25
-0.375 0.375
-0.375 0.5
-0.375 0.625
-0.375 0.75
-0.375 0.875
-0.375 1.0
-0.5 0.0
-0.5 0.125
-0.5 0.25
-0.5 0.375
-0.5 0.5
-0.5 0.625
-0.5 0.75
-0.5 0.875
-0.5 1.0
-0.625 0.0
-0.625 0.125
-0.625 0.25
-0.625 0.375
-0.625 0.5
-0.625 0.625
-0.625 0.75
-0.625 0.875
-0.625 1.0
-0.75 0.0
-0.75 0.125
-0.75 0.25
-0.75 0.375
-0.75 0.5
-0.75 0.625
-0.75 0.75
-0.75 0.875
-0.75 1.0
-0.875 0.0
-0.875 0.125
-0.875 0.25
-0.875 0.375
-0.875 0.5
-0.875 0.625
-0.875 0.75
-0.875 0.875
-0.875 1.0
-1.0 0.0
-1.0 0.125
-1.0 0.25
-1.0 0.375
-1.0 0.5
-1.0 0.625
-1.0 0.75
-1.0 0.875
-1.0 1.0
-1.125 0.0
-1.125 0.125
-1.125 0.25
-1.125 0.375
-1.125 0.5
-1.125 0.625
-1.125 0.75
-1.125 0.875
-1.125 1.0
-1.25 0.0
-1.25 0.125
-1.25 0.25
-1.25 0.375
-1.25 0.5
-1.25 0.625
-1.25 0.75
-1.25 0.875
-1.25 1.0
-1.375 0.0
-1.375 0.125
-1.375 0.25
-1.375 0.375
-1.375 0.5
-1.375 0.625
-1.375 0.75
-1.375 0.875
-1.375 1.0
-1.5 0.0
-1.5 0.125
-1.5 0.25
-1.5 0.375
-1.5 0.5
-1.5 0.625
-1.5 0.75
-1.5 0.875
-1.5 1.0
-1.625 0.0
-1.625 0.125
-1.625 0.25
-1.625 0.375
-1.625 0.5
-1.625 0.625
-1.625 0.75
-1.625 0.875
-1.625 1.0
-1.75 0.0
-1.75 0.125
-1.75 0.25
-1.75 0.375
-1.75 0.5
-1.75 0.625
-1.75 0.75
-1.75 0.875
-1.75 1.0
-1.875 0.0
-1.875 0.125
-1.875 0.25
-1.875 0.375
-1.875 0.5
-1.875 0.625
-1.875 0.75
-1.875 0.875
-1.875 1.0
-2.0 0.0
-2.0 0.125
-2.0 0.25
-2.0 0.375
-2.0 0.5
-2.0 0.625
-2.0 0.75
-2.0 0.875
-2.0 1.0
-2.125 0.0
-2.125 0.125
-2.125 0.25
-2.125 0.375
-2.125 0.5
-2.125 0.625
-2.125 0.75
-2.125 0.875
-2.125 1.0
-2.25 0.0
-2.25 0.125
-2.25 0.25
-2.25 0.375
-2.25 0.5
-2.25 0.625
-2.25 0.75
-2.25 0.875
-2.25 1.0
-2.375 0.0
-2.375 0.125
-2.375 0.25
-2.375 0.375
-2.375 0.5
-2.375 0.625
-2.375 0.75
-2.375 0.875
-2.375 1.0
-2.5 0.0
-2.5 0.125
-2.5 0.25
-2.5 0.375
-2.5 0.5
-2.5 0.625
-2.5 0.75
-2.5 0.875
-2.5 1.0
-2.625 0.0
-2.625 0.125
-2.625 0.25
-2.625 0.375
-2.625 0.5
-2.625 0.625
-2.625 0.75
-2.625 0.875
-2.625 1.0
-2.75 0.0
-2.75 0.125
-2.75 0.25
-2.75 0.375
-2.75 0.5
-2.75 0.625
-2.75 0.75
-2.75 0.875
-2.75 1.0
-2.875 0.0
-2.875 0.125
-2.875 0.25
-2.875 0.375
-2.875 0.5
-2.875 0.625
-2.875 0.75
-2.875 0.875
-2.875 1.0
-3.0 0.0
-3.0 0.125
-3.0 0.25
-3.0 0.375
-3.0 0.5
-3.0 0.625
-3.0 0.75
-3.0 0.875
-3.0 1.0
-3.125 0.0
-3.125 0.125
-3.125 0.25
-3.125 0.375
-3.125 0.5
-3.125 0.625
-3.125 0.75
-3.125 0.875
-3.125 1.0
-3.25 0.0
-3.25 0.25
-3.25 0.5
-3.25 0.75
-3.25 1.0
-3.5 0.0
-3.5 0.5
-3.5 1.0
-4.0 0.0
-4.0 0.5
-4.0 1.0
-4.5 0.0
-4.5 0.5
-4.5 1.0
-5.0 0.0
-5.0 0.5
-5.0 1.0
-5.5 0.0
-5.5 0.5
-5.5 1.0
-6.0 0.0
-6.0 0.5
-6.0 1.0
CELLS:
3 1 0 9 1
3 1 1 9 10
3 1 1 10 2
3 1 2 10 11
3 1 2 11 3
3 1 3 11 12
3 1 3 12 4
3 1 4 12 13
3 1 4 13 5
3 1 5 13 14
3 1 5 14 6
3 1 6 14 15
3 1 6 15 7
3 1 7 15 16
3 1 7 16 8
3 1 8 16 17
3 1 9 18 10
3 1 10 18 19
3 1 10 19 11
3 1 11 19 20
3 1 11 20 12
3 1 12 20 21
3 1 12 21 13
3 1 13 21 22
3 1 13 22 14
3 1 14 22 23
3 1 14 23 15
3 1 15 23 24
3 1 15 24 16
3 1 16 24 25
3 1 16 25 17
3 1 17 25 26
3 1 18 27 19
3 1 19 27 28
3 1 19 28 20
3 1 20 28 29
3 1 20 29 21
3 1 21 29 30
3 1 21 30 22
3 1 22 30 31
3 1 22 31 23
3 1 23 31 32
3 1 23 32 24
3 1 24 32 33
3 1 24 33 25
3 1 25 33 34
3 1 25 34 26
3 1 26 34 35
3 1 27 36 28
3 1 28 36 37
3 1 28 37 29
3 1 29 37 38
3 1 29 38 30
3 1 30 38 39
3 1 30 39 31
3 1 31 39 40
3 1 31 40 32
3 1 32 40 41
3 1 32 41 33
3 1 33 41 42
3 1 33 42 34
3 1 34 42 43
3 1 34 43 35
3 1 35 43 44
3 1 36 45 37
3 1 37 45 46
3 1 37 46 38
3 1 38 46 47
3 1 38 47 39
3 1 39 47 48
3 1 39 48 40
3 1 40 48 49
3 1 40 49 41
3 1 41 49 50
3 1 41 50 42
3 1 42 50 51
3 1 42 51 43
3 1 43 51 52
3 1 43 52 44
3 1 44 52 53
3 1 45 54 46
3 1 46 54 55
3 1 46 55 47
3 1 47 55 56
3 1 47 56 48
3 1 48 56 57
3 1 48 57 49
3 1 49 57 58
3 1 49 58 50
3 1 50 58 59
3 1 50 59 51
3 1 51 59 60
3 1 51 60 52
3 1 52 60 61
3 1 52 61 53
3 1 53 61 62
3 1 54 63 55
3 1 55 63 64
3 1 55 64 56
3 1 56 64 65
3 1 56 65 57
3 1 57 65 66
3 1 57 66 58
3 1 58 66 67
3 1 58 67 59
3 1 59 67 68
3 1 59 68 60
3 1 60 68 69
3 1 60 69 61
3 1 61 69 70
3 1 61 70 62
3 1 62 70 71
3 1 63 72 64
3 1 64 72 73
3 1 64 73 65
3 1 65 73 74
3 1 65 74 66
3 1 66 74 75
3 1 66 75 67
3 1 67 75 76
3 1 67 76 68
3 1 68 76 77
3 1 68 77 69
3 1 69 77 78
3 1 69 78 70
3 1 70 78 79
3 1 70 79 71
3 1 71 79 80
3 1 72 81 73
3 1 73 81 82
3 1 73 82 74
3 1 74 82 83
3 1 74 83 75
3 1 75 83 84
3 1 75 84 76
3 1 76 84 85
3 1 76 85 77
3 1 77 85 86
3 1 77 86 78
3 1 78 86 87
3 1 78 87 79
3 1 79 87 88
3 1 79 88 80
3 1 80 88 89
3 1 81 90 82
3 1 82 90 91
3 1 82 91 83
3 1 83 91 92
3 1 83 92 84
3 1 84 92 93
3 1 84 93 85
3 1 85 93 94
3 1 85 94 86
3 1 86 94 95
3 1 86 95 87
3 1 87 95 96
3 1 87 96 88
3 1 88 96 97
3 1 88 97 89
3 1 89 97 98
3 1 90 99 91
3 1 91 99 100
3 1 91 100 92
3 1 92 100 101
3 1 92 101 93
3 1 93 101 102
3 1 93 102 94
3 1 94 102 103
3 1 94 103 95
3 1 95 103 104
3 1 95 104 96
3 1 96 104 105
3 1 96 105 97
3 1 97 105 106
3 1 97 106 98
3 1 98 106 107
3 1 99 108 100
3 1 100 108 109
3 1 100 109 101
3 1 101 109 110
3 1 101 110 102
3 1 102 110 111
3 1 102 111 103
3 1 103 111 112
3 1 103 112 104
3 1 104 112 113
3 1 104 113 105
3 1 105 113 114
3 1 105 114 106
3 1 106 114 115
3 1 106 115 107
3 1 107 115 116
3 1 108 117 109
3 1 109 117 118
3 1 109 118 110
3 1 110 118 119
3 1 110 119 111
3 1 111 119 120
3 1 111 120 112
3 1 112 120 121
3 1 112 121 113
3 1 113 121 122
3 1 113 122 114
3 1 114 122 123
3 1 114 123 115
3 1 115 123 124
3 1 115 124 116
3 1 116 124 125
3 1 117 126 118
3 1 118 126 127
3 1 118 127 119
3 1 119 127 128
3 1 119 128 120
3 1 120 128 129
3 1 120 129 121
3 1 121 129 130
3 1 121 130 122
3 1 122 130 131
3 1 122 131 123
3 1 123 131 132
3 1 123 132 124
3 1 124 132 133
3 1 124 133 125
3 1 125 133 134
3 1 126 135 127
3 1 127 135 136
3 1 127 136 128
3 1 128 136 137
3 1 128 137 129
3 1 129 137 138
3 1 129 138 130
3 1 130 138 139
3 1 130 139 131
3 1 131 139 140
3 1 131 140 132
3 1 132 140 141
3 1 132 141 133
3 1 133 141 142
3 1 133 142 134
3 1 134 142 143
3 1 135 144 136
3 1 136 144 145
3 1 136 145 137
3 1 137 145 146
3 1 137 146 138
3 1 138 146 147
3 1 138 147 139
3 1 139 147 148
3 1 139 148 140
3 1 140 148 149
3 1 140 149 141
3 1 141 149 150
3 1 141 150 142
3 1 142 150 151
3 1 142 151 143
3 1 143 151 152
3 1 144 153 145
3 1 145 153 154
3 1 145 154 146
3 1 146 154 155
3 1 146 155 147
3 1 147 155 156
3 1 147 156 148
3 1 148 156 157
3 1 148 157 149
3 1 149 157 158
3 1 149 158 150
3 1 150 158 159
3 1 150 159 151
3 1 151 159 160
3 1 151 160 152
3 1 152 160 161
3 1 153 162 154
3 1 154 162 163
3 1 154 163 155
3 1 155 163 164
3 1 155 164 156
3 1 156 164 165
3 1 156 165 157
3 1 157 165 166
3 1 157 166 158
3 1 158 166 167
3 1 158 167 159
3 1 159 167 168
3 1 159 168 160
3 1 160 168 169
3 1 160 169 161
3 1 161 169 170
3 1 162 171 163
3 1 163 171 172
3 1 163 172 164
3 1 164 172 173
3 1 164 173 165
3 1 165 173 174
3 1 165 174 166
3 1 166 174 175
3 1 166 175 167
3 1 167 175 176
3 1 167 176 168
3 1 168 176 177
3 1 168 177 169
3 1 169 177 178
3 1 169 178 170
3 1 170 178 179
3 1 171 180 172
3 1 172 180 181
3 1 172 181 173
3 1 173 181 182
3 1 173 182 174
3 1 174 182 183
3 1 174 183 175
3 1 175 183 184
3 1 175 184 176
3 1 176 184 185
3 1 176 185 177
3 1 177 185 186
3 1 177 186 178
3 1 178 186 187
3 1 178 187 179
3 1 179 187 188
3 1 180 189 181
3 1 181 189 190
3 1 181 190 182
3 1 182 190 191
3 1 182 191 183
3 1 183 191 192
3 1 183 192 184
3 1 184 192 193
3 1 184 193 185
3 1 185 193 194
3 1 185 194 186
3 1 186 194 195
3 1 186 195 187
3 1 187 195 196
3 1 187 196 188
3 1 188 196 197
3 1 189 198 190
3 1 190 198 199
3 1 190 199 191
3 1 191 199 200
3 1 191 200 192
3 1 192 200 201
3 1 192 201 193
3 1 193 201 202
3 1 193 202 194
3 1 194 202 203
3 1 194 203 195
3 1 195 203 204
3 1 195 204 196
3 1 196 204 205
3 1 196 205 197
3 1 197 205 206
3 1 198 207 199
3 1 199 207 208
3 1 199 208 200
3 1 200 208 209
3 1 200 209 201
3 1 201 209 210
3 1 201 210 202
3 1 202 210 211
3 1 202 211 203
3 1 203 211 212
3 1 203 212 204
3 1 204 212 213
3 1 204 213 205
3 1 205 213 214
3 1 205 214 206
3 1 206 214 215
3 1 207 216 208
3 1 208 216 217
3 1 208 217 209
3 1 209 217 218
3 1 209 218 210
3 1 210 218 219
3 1 210 219 211
3 1 211 219 220
3 1 211 220 212
3 1 212 220 221
3 1 212 221 213
3 1 213 221 222
3 1 213 222 214
3 1 214 222 223
3 1 214 223 215
3 1 215 223 224
3 1 216 225 217
3 1 217 225 226
3 1 217 226 218
3 1 218 226 227
3 1 218 227 219
3 1 219 227 228
3 1 219 228 220
3 1 220 228 229
3 1 220 229 221
3 1 221 229 230
3 1 221 230 222
3 1 222 230 231
3 1 222 231 223
3 1 223 231 232
3 1 223 232 224
3 1 224 232 233
3 1 225 234 226
3 1 226 234 235
3 1 226 235 227
3 1 227 235 228
3 1 228 235 236
3 1 228 236 229
3 1 229 236 230
3 1 230 236 237
3 1 230 237 231
3 1 231 237 232
3 1 232 237 238
3 1 232 238 233
3 1 234 239 235
3 1 235 239 240
3 1 235 240 236
3 1 236 240 237
3 1 237 240 241
3 1 237 241 238
3 1 239 242 240
3 1 240 242 243
3 1 240 243 241
3 1 241 243 244
3 1 242 245 243
3 1 243 245 246
3 1 243 246 244
3 1 244 246 247
3 1 245 248 246
3 1 246 248 249
3 1 246 249 247
3 1 247 249 250
3 1 248 251 249
3 1 249 251 252
3 1 249 252 250
3 1 250 252 253
3 1 251 254 252
3 1 252 254 255
3 1 252 255 253
3 1 253 255 256
3 1 257 0 1
3 1 257 1 258
3 1 258 1 2
3 1 258 2 259
3 1 259 2 3
3 1 259 3 260
3 1 260 3 4
3 1 260 4 261
3 1 261 4 5
3 1 261 5 262
3 1 262 5 6
3 1 262 6 263
3 1 263 6 7
3 1 263 7 264
3 1 264 7 8
3 1 264 8 265
3 1 266 257 258
3 1 266 258 267
3 1 267 258 259
3 1 267 259 268
3 1 268 259 260
3 1 268 260 269
3 1 269 260 261
3 1 269 261 270
3 1 270 261 262
3 1 270 262 271
3 1 271 262 263
3 1 271 263 272
3 1 272 263 264
3 1 272 264 273
3 1 273 264 265
3 1 273 265 274
3 1 275 266 267
3 1 275 267 276
3 1 276 267 268
3 1 276 268 277
3 1 277 268 269
3 1 277 269 278
3 1 278 269 270
3 1 278 270 279
3 1 279 270 271
3 1 279 271 280
3 1 280 271 272
3 1 280 272 281
3 1 281 272 273
3 1 281 273 282
3 1 282 273 274
3 1 282 274 283
3 1 284 275 276
3 1 284 276 285
3 1 285 276 277
3 1 285 277 286
3 1 286 277 278
3 1 286 278 287
3 1 287 278 279
3 1 287 279 288
3 1 288 279 280
3 1 288 280 289
3 1 289 280 281
3 1 289 281 290
3 1 290 281 282
3 1 290 282 291
3 1 291 282 283
3 1 291 283 292
3 1 293 284 285
3 1 293 285 294
3 1 294 285 286
3 1 294 286 295
3 1 295 286 287
3 1 295 287 296
3 1 296 287 288
3 1 296 288 297
3 1 297 288 289
3 1 297 289 298
3 1 298 289 290
3 1 298 290 299
3 1 299 290 291
3 1 299 291 300
3 1 300 291 292
3 1 300 292 301
3 1 302 293 294
3 1 302 294 303
3 1 303 294 295
3 1 303 295 304
3 1 304 295 296
3 1 304 296 305
3 1 305 296 297
3 1 305 297 306
3 1 306 297 298
3 1 306 298 307
3 1 307 298 299
3 1 307 299 308
3 1 308 299 300
3 1 308 300 309
3 1 309 300 301
3 1 309 301 310
3 1 311 302 303
3 1 311 303 312
3 1 312 303 304
3 1 312 304 313
3 1 313 304 305
3 1 313 305 314
3 1 314 305 306
3 1 314 306 315
3 1 315 306 307
3 1 315 307 316
3 1 316 307 308
3 1 316 308 317
3 1 317 308 309
3 1 317 309 318
3 1 318 309 310
3 1 318 310 319
3 1 320 311 312
3 1 320 312 321
3 1 321 312 313
3 1 321 313 322
3 1 322 313 314
3 1 322 314 323
3 1 323 314 315
3 1 323 315 324
3 1 324 315 316
3 1 324 316 325
3 1 325 316 317
3 1 325 317 326
3 1 326 317 318
3 1 326 318 327
3 1 327 318 319
3 1 327 319 328
3 1 329 320 321
3 1 329 321 330
3 1 330 321 322
3 1 330 322 331
3 1 331 322 323
3 1 331 323 332
3 1 332 323 324
3 1 332 324 333
3 1 333 324 325
3 1 333 325 334
3 1 334 325 326
3 1 334 326 335
3 1 335 326 327
3 1 335 327 336
3 1 336 327 328
3 1 336 328 337
3 1 338 329 330
3 1 338 330 339
3 1 339 330 331
3 1 339 331 340
3 1 340 331 332
3 1 340 332 341
3 1 341 332 333
3 1 341 333 342
3 1 342 333 334
3 1 342 334 343
3 1 343 334 335
3 1 343 335 344
3 1 344 335 336
3 1 344 336 345
3 1 345 336 337
3 1 345 337 346
3 1 347 338 339
3 1 347 339 348
3 1 348 339 340
3 1 348 340 349
3 1 349 340 341
3 1 349 341 350
3 1 350 341 342
3 1 350 342 351
3 1 351 342 343
3 1 351 343 352
3 1 352 343 344
3 1 352 344 353
3 1 353 344 345
3 1 353 345 354
3 1 354 345 346
3 1 354 346 355
3 1 356 347 348
3 1 356 348 357
3 1 357 348 349
3 1 357 349 358
3 1 358 349 350
3 1 358 350 359
3 1 359 350 351
3 1 359 351 360
3 1 360 351 352
3 1 360 352 361
3 1 361 352 353
3 1 361 353 362
3 1 362 353 354
3 1 362 354 363
3 1 363 354 355
3 1 363 355 364
3 1 365 356 357
3 1 365 357 366
3 1 366 357 358
3 1 366 358 367
3 1 367 358 359
3 1 367 359 368
3 1 368 359 360
3 1 368 360 369
3 1 369 360 361
3 1 369 361 370
3 1 370 361 362
3 1 370 362 371
3 1 371 362 363
3 1 371 363 372
3 1 372 363 364
3 1 372 364 373
3 1 374 365 366
3 1 374 366 375
3 1 375 366 367
3 1 375 367 376
3 1 376 367 368
3 1 376 368 377
3 1 377 368 369
3 1 377 369 378
3 1 378 369 370
3 1 378 370 379
3 1 379 370 371
3 1 379 371 380
3 1 380 371 372
3 1 380 372 381
3 1 381 372 373
3 1 381 373 382
3 1 383 374 375
3 1 383 375 384
3 1 384 375 376
3 1 384 376 385
3 1 385 376 377
3 1 385 377 386
3 1 386 377 378
3 1 386 378 387
3 1 387 378 379
3 1 387 379 388
3 1 388 379 380
3 1 388 380 389
3 1 389 380 381
3 1 389 381 390
3 1 390 381 382
3 1 390 382 391
3 1 392 383 384
3 1 392 384 393
3 1 393 384 385
3 1 393 385 394
3 1 394 385 386
3 1 394 386 395
3 1 395 386 387
3 1 395 387 396
3 1 396 387 388
3 1 396 388 397
3 1 397 388 389
3 1 397 389 398
3 1 398 389 390
3 1 398 390 399
3 1 399 390 391
3 1 399 391 400
3 1 401 392 393
3 1 401 393 402
3 1 402 393 394
3 1 402 394 403
3 1 403 394 395
3 1 403 395 404
3 1 404 395 396
3 1 404 396 405
3 1 405 396 397
3 1 405 397 406
3 1 406 397 398
3 1 406 398 407
3 1 407 398 399
3 1 407 399 408
3 1 408 399 400
3 1 408 400 409
3 1 410 401 402
3 1 410 402 411
3 1 411 402 403
3 1 411 403 412
3 1 412 403 404
3 1 412 404 413
3 1 413 404 405
3 1 413 405 414
3 1 414 405 406
3 1 414 406 415
3 1 415 406 407
3 1 415 407 416
3 1 416 407 408
3 1 416 408 417
3 1 417 408 409
3 1 417 409 418
3 1 419 410 411
3 1 419 411 420
3 1 420 411 412
3 1 420 412 421
3 1 421 412 413
3 1 421 413 422
3 1 422 413 414
3 1 422 414 423
3 1 423 414 415
3 1 423 415 424
3 1 424 415 416
3 1 424 416 425
3 1 425 416 417
3 1 425 417 426
3 1 426 417 418
3 1 426 418 427
3 1 428 419 420
3 1 428 420 429
3 1 429 420 421
3 1 429 421 430
3 1 430 421 422
3 1 430 422 431
3 1 431 422 423
3 1 431 423 432
3 1 432 423 424
3 1 432 424 433
3 1 433 424 425
3 1 433 425 434
3 1 434 425 426
3 1 434 426 435
3 1 435 426 427
3 1 435 427 436
3 1 437 428 429
3 1 437 429 438
3 1 438 429 430
3 1 438 430 439
3 1 439 430 431
3 1 439 431 440
3 1 440 431 432
3 1 440 432 441
3 1 441 432 433
3 1 441 433 442
3 1 442 433 434
3 1 442 434 443
3 1 443 434 435
3 1 443 435 444
3 1 444 435 436
3 1 444 436 445
3 1 446 437 438
3 1 446 438 447
3 1 447 438 439
3 1 447 439 448
3 1 448 439 440
3 1 448 440 449
3 1 449 440 441
3 1 449 441 450
3 1 450 441 442
3 1 450 442 451
3 1 451 442 443
3 1 451 443 452
3 1 452 443 444
3 1 452 444 453
3 1 453 444 445
3 1 453 445 454
3 1 455 446 447
3 1 455 447 456
3 1 456 447 448
3 1 456 448 457
3 1 457 448 449
3 1 457 449 458
3 1 458 449 450
3 1 458 450 459
3 1 459 450 451
3 1 459 451 460
3 1 460 451 452
3 1 460 452 461
3 1 461 452 453
3 1 461 453 462
3 1 462 453 454
3 1 462 454 463
3 1 464 455 456
3 1 464 456 465
3 1 465 456 457
3 1 465 457 466
3 1 466 457 458
3 1 466 458 467
3 1 467 458 459
3 1 467 459 468
3 1 468 459 460
3 1 468 460 469
3 1 469 460 461
3 1 469 461 470
3 1 470 461 462
3 1 470 462 471
3 1 471 462 463
3 1 471 463 472
3 1 473 464 465
3 1 473 465 474
3 1 474 465 466
3 1 474 466 475
3 1 475 466 467
3 1 475 467 476
3 1 476 467 468
3 1 476 468 477
3 1 477 468 469
3 1 477 469 478
3 1 478 469 470
3 1 478 470 479
3 1 479 470 471
3 1 479 471 480
3 1 480 471 472
3 1 480 472 481
3 1 482 473 474
3 1 482 474 483
3 1 483 474 475
3 1 483 475 476
3 1 483 476 484
3 1 484 476 477
3 1 484 477 478
3 1 484 478 485
3 1 485 478 479
3 1 485 479 480
3 1 485 480 486
3 1 486 480 481
3 1 487 482 483
3 1 487 483 488
3 1 488 483 484
3 1 488 484 485
3 1 488 485 489
3 1 489 485 486
3 1 490 487 488
3 1 490 488 491
3 1 491 488 489
3 1 491 489 492
3 1 493 490 491
3 1 493 491 494
3 1 494 491 492
3 1 494 492 495
3 1 496 493 494
3 1 496 494 497
3 1 497 494 495
3 1 497 495 498
3 1 499 496 497
3 1 499 497 500
3 1 500 497 498
3 1 500 498 501
3 1 502 499 500
3 1 502 500 503
3 1 503 500 501
3 1 503 501 504
FACES:
2 1 0 9
2 1 17 8
2 1 9 18
2 1 26 17
2 1 18 27
2 1 35 26
2 1 27 36
2 1 44 35
2 1 36 45
2 1 53 44
2 1 45 54
2 1 62 53
2 1 54 63
2 1 71 62
2 1 63 72
2 1 80 71
2 1 72 81
2 1 89 80
2 1 81 90
2 1 98 89
2 1 90 99
2 1 107 98
2 1 99 108
2 1 116 107
2 1 108 117
2 1 125 116
2 1 117 126
2 1 134 125
2 1 126 135
2 1 143 134
2 1 135 144
2 1 152 143
2 1 144 153
2 1 161 152
2 1 153 162
2 1 170 161
2 1 162 171
2 1 179 170
2 1 171 180
2 1 188 179
2 1 180 189
2 1 197 188
2 1 189 198
2 1 206 197
2 1 198 207
2 1 215 206
2 1 207 216
2 1 224 215
2 1 216 225
2 1 233 224
2 1 225 234
2 1 238 233
2 1 234 239
2 1 241 238
2 1 239 242
2 1 244 241
2 1 242 245
2 1 247 244
2 1 245 248
2 1 250 247
2 1 248 251
2 1 253 250
2 1 251 254
2 1 256 253
2 1 254 255
2 1 255 256
2 1 257 0
2 1 8 265
2 1 266 257
2 1 265 274
2 1 275 266
2 1 274 283
2 1 284 275
2 1 283 292
2 1 293 284
2 1 292 301
2 1 302 293
2 1 301 310
2 1 311 302
2 1 310 319
2 1 320 311
2 1 319 328
2 1 329 320
2 1 328 337
2 1 338 329
2 1 337 346
2 1 347 338
2 1 346 355
2 1 356 347
2 1 355 364
2 1 365 356
2 1 364 373
2 1 374 365
2 1 373 382
2 1 383 374
2 1 382 391
2 1 392 383
2 1 391 400
2 1 401 392
2 1 400 409
2 1 410 401
2 1 409 418
2 1 419 410
2 1 418 427
2 1 428 419
2 1 427 436
2 1 437 428
2 1 436 445
2 1 446 437
2 1 445 454
2 1 455 446
2 1 454 463
2 1 464 455
2 1 463 472
2 1 473 464
2 1 472 481
2 1 482 473
2 1 481 486
2 1 487 482
2 1 486 489
2 1 490 487
2 1 489 492
2 1 493 490
2 1 492 495
2 1 496 493
2 1 495 498
2 1 499 496
2 1 498 501
2 1 502 499
2 1 501 504
2 1 503 502
2 1 504 503