POINTS:
0.0 0.0625
0.0 0.125
0.0 0.1875
0.0 0.25
0.0 0.375
0.0 0.5
0.0 0.75
0.0 1.0
0.03125 0.0625
0.03125 0.09375
0.03125 0.125
0.03125 0.15625
0.0625 0.0625
0.0625 0.09375
0.0625 0.125
0.0625 0.15625
0.0625 0.1875
0.09375 0.0625
0.09375 0.09375
0.09375 0.125
0.09375 0.15625
0.125 0.0625
0.125 0.09375
0.125 0.125
0.125 0.15625
0.125 0.1875
0.125 0.25
0.125 0.375
0.15625 0.03125
0.15625 0.0625
0.15625 0.09375
0.15625 0.125
0.15625 0.15625
0.1875 0.0
0.1875 0.03125
0.1875 0.0625
0.1875 0.09375
0.1875 0.125
0.1875 0.15625
0.1875 0.1875
0.21875 0.0
0.21875 0.03125
0.21875 0.0625
0.21875 0.09375
0.21875 0.125
0.21875 0.15625
0.25 0.0
0.25 0.0625
0.25 0.125
0.25 0.1875
0.25 0.25
0.25 0.375
0.25 0.5
0.25 0.75
0.25 1.0
0.3125 0.0
0.3125 0.0625
0.3125 0.125
0.3125 0.1875
0.375 0.0
0.375 0.125
0.375 0.25
0.375 0.375
0.5 0.0
0.5 0.25
0.5 0.5
0.5 0.75
0.5 1.0
0.75 0.0
0.75 0.25
0.75 0.5
0.75 0.75
0.75 1.0
1.0 0.0
1.0 0.25
1.0 0.5
1.0 0.75
1.0 1.0
1.25 0.0
1.25 0.25
1.25 0.5
1.25 0.75
1.25 1.0
1.5 0.0
1.5 0.25
1.5 0.5
1.5 0.75
1.5 1.0
1.75 0.0
1.75 0.25
1.75 0.5
1.75 0.75
1.75 1.0
2.0 0.0
2.0 0.25
2.0 0.5
2.0 0.75
2.0 1.0
2.25 0.0
2.25 0.25
2.25 0.5
2.25 0.75
2.25 1.0
2.5 0.0
2.5 0.25
2.5 0.5
2.5 0.75
2.5 1.0
2.75 0.0
2.75 0.25
2.75 0.5
2.75 0.75
2.75 1.0
3.0 0.0
3.0 0.25
3.0 0.5
3.0 0.75
3.0 1.0
CELLS:
3 0 0 8 9
3 0 0 9 1
3 0 1 9 10
3 0 1 10 11
3 0 1 11 2
3 0 2 11 16
3 0 8 12 9
3 0 9 12 13
3 0 9 13 10
3 0 10 13 14
3 0 10 14 11
3 0 11 14 15
3 0 11 15 16
3 0 2 16 3
3 0 3 16 26
3 0 12 17 13
3 0 13 17 18
3 0 13 18 14
3 0 14 18 19
3 0 14 19 15
3 0 15 19 20
3 0 15 20 16
3 0 16 20 25
3 0 17 21 18
3 0 18 21 22
3 0 18 22 19
3 0 19 22 23
3 0 19 23 20
3 0 20 23 24
3 0 20 24 25
3 0 16 25 26
3 0 3 26 4
3 0 4 26 27
3 0 4 27 5
3 0 5 27 52
3 0 21 28 29
3 0 21 29 22
3 0 22 29 30
3 0 22 30 23
3 0 23 30 31
3 0 23 31 24
3 0 24 31 32
3 0 24 32 25
3 0 25 32 39
3 0 28 33 34
3 0 28 34 29
3 0 29 34 35
3 0 29 35 30
3 0 30 35 36
3 0 30 36 31
3 0 31 36 37
3 0 31 37 32
3 0 32 37 38
3 0 32 38 39
3 0 25 39 26
3 0 26 39 50
3 0 33 40 41
3 0 33 41 34
3 0 34 41 35
3 0 35 41 42
3 0 35 42 36
3 0 36 42 43
3 0 36 43 37
3 0 37 43 44
3 0 37 44 45
3 0 37 45 38
3 0 38 45 39
3 0 39 45 49
3 0 40 46 41
3 0 41 46 47
3 0 41 47 42
3 0 42 47 43
3 0 43 47 48
3 0 43 48 44
3 0 44 48 45
3 0 45 48 49
3 0 39 49 50
3 0 26 50 27
3 0 27 50 51
3 0 27 51 52
3 0 5 52 6
3 0 6 52 53
3 0 6 53 7
3 0 7 53 54
3 0 46 55 47
3 0 47 55 56
3 0 47 56 48
3 0 48 56 57
3 0 48 57 49
3 0 49 57 58
3 0 49 58 50
3 0 50 58 61
3 0 55 59 56
3 0 56 59 60
3 0 56 60 57
3 0 57 60 58
3 0 58 60 61
3 0 50 61 62
3 0 50 62 51
3 0 51 62 52
3 0 52 62 65
3 0 59 63 60
3 0 60 63 64
3 0 60 64 61
3 0 61 64 62
3 0 62 64 65
3 0 52 65 53
3 0 53 65 66
3 0 53 66 54
3 0 54 66 67
3 0 63 68 64
3 0 64 68 69
3 0 64 69 65
3 0 65 69 70
3 0 65 70 66
3 0 66 70 71
3 0 66 71 67
3 0 67 71 72
3 0 68 73 69
3 0 69 73 74
3 0 69 74 70
3 0 70 74 75
3 0 70 75 71
3 0 71 75 76
3 0 71 76 72
3 0 72 76 77
3 0 73 78 74
3 0 74 78 79
3 0 74 79 75
3 0 75 79 80
3 0 75 80 76
3 0 76 80 81
3 0 76 81 77
3 0 77 81 82
3 0 78 83 79
3 0 79 83 84
3 0 79 84 80
3 0 80 84 85
3 0 80 85 81
3 0 81 85 86
3 0 81 86 82
3 0 82 86 87
3 0 83 88 84
3 0 84 88 89
3 0 84 89 85
3 0 85 89 90
3 0 85 90 86
3 0 86 90 91
3 0 86 91 87
3 0 87 91 92
3 0 88 93 89
3 0 89 93 94
3 0 89 94 90
3 0 90 94 95
3 0 90 95 91
3 0 91 95 96
3 0 91 96 92
3 0 92 96 97
3 0 93 98 94
3 0 94 98 99
3 0 94 99 95
3 0 95 99 100
3 0 95 100 96
3 0 96 100 101
3 0 96 101 97
3 0 97 101 102
3 0 98 103 99
3 0 99 103 104
3 0 99 104 100
3 0 100 104 105
3 0 100 105 101
3 0 101 105 106
3 0 101 106 102
3 0 102 106 107
3 0 103 108 104
3 0 104 108 109
3 0 104 109 105
3 0 105 109 110
3 0 105 110 106
3 0 106 110 111
3 0 106 111 107
3 0 107 111 112
3 0 108 113 109
3 0 109 113 114
3 0 109 114 110
3 0 110 114 115
3 0 110 115 111
3 0 111 115 116
3 0 111 116 112
3 0 112 116 117
FACES:
2 1 117 112
2 1 112 107
2 1 107 102
2 1 102 97
2 1 97 92
2 1 92 87
2 1 87 82
2 1 82 77
2 1 77 72
2 1 72 67
2 1 67 54
2 1 54 7
2 77 7 6
2 77 6 5
2 77 5 4
2 77 4 3
2 77 3 2
2 77 2 1
2 77 1 0
2 10 0 8
2 10 8 12
2 10 12 17
2 10 17 21
2 10 21 28
2 10 28 33
2 1 33 40
2 1 40 46
2 1 46 55
2 1 55 59
2 1 59 63
2 1 63 68
2 1 68 73
2 1 73 78
2 1 78 83
2 1 83 88
2 1 88 93
2 1 93 98
2 1 98 103
2 1 103 108
2 1 108 113
2 1 113 114
2 1 114 115
2 1 115 116
2 1 116 117
