POINTS:
0.0 0.0
0.0 0.25
0.0 0.5
0.0 0.75
0.0 1.0
0.25 0.0
0.25 0.25
0.25 0.5
0.25 0.75
0.25 1.0
0.5 0.0
0.5 0.25
0.5 0.5
0.5 0.75
0.5 1.0
0.75 0.0
0.75 0.25
0.75 0.5
0.75 0.75
0.75 1.0
1.0 0.0
1.0 0.25
1.0 0.5
1.0 0.75
1.0 1.0
1.25 0.0
1.25 0.25
1.25 0.5
1.25 0.75
1.25 1.0
1.5 0.0
1.5 0.25
1.5 0.5
1.5 0.75
1.5 1.0
1.75 0.0
1.75 0.25
1.75 0.5
1.75 0.75
1.75 1.0
2.0 0.0
2.0 0.25
2.0 0.5
2.0 0.75
2.0 1.0
2.25 0.0
2.25 0.25
2.25 0.5
2.25 0.75
2.25 1.0
2.5 0.0
2.5 0.25
2.5 0.5
2.5 0.75
2.5 1.0
2.75 0.0
2.75 0.25
2.75 0.5
2.75 0.75
2.75 1.0
3.0 0.0
3.0 0.25
3.0 0.5
3.0 0.75
3.0 1.0
-0.25 0.0
-0.25 0.25
-0.25 0.5
-0.25 0.75
-0.25 1.0
-0.5 0.0
-0.5 0.25
-0.5 0.5
-0.5 0.75
-0.5 1.0
-0.75 0.0
-0.75 0.25
-0.75 0.5
-0.75 0.75
-0.75 1.0
-1.0 0.0
-1.0 0.25
-1.0 0.5
-1.0 0.75
-1.0 1.0
-1.25 0.0
-1.25 0.25
-1.25 0.5
-1.25 0.75
-1.25 1.0
-1.5 0.0
-1.5 0.25
-1.5 0.5
-1.5 0.75
-1.5 1.0
-1.75 0.0
-1.75 0.25
-1.75 0.5
-1.75 0.75
-1.75 1.0
-2.0 0.0
-2.0 0.25
-2.0 0.5
-2.0 0.75
-2.0 1.0
-2.25 0.0
-2.25 0.25
-2.25 0.5
-2.25 0.75
-2.25 1.0
-2.5 0.0
-2.5 0.25
-2.5 0.5
-2.5 0.75
-2.5 1.0
-2.75 0.0
-2.75 0.25
-2.75 0.5
-2.75 0.75
-2.75 1.0
-3.0 0.0
-3.0 0.25
-3.0 0.5
-3.0 0.75
-3.0 1.0
CELLS:
3 0 0 5 1
3 0 1 5 6
3 0 1 6 2
3 0 2 6 7
3 0 2 7 3
3 0 3 7 8
3 0 3 8 4
3 0 4 8 9
3 0 5 10 6
3 0 6 10 11
3 0 6 11 7
3 0 7 11 12
3 0 7 12 8
3 0 8 12 13
3 0 8 13 9
3 0 9 13 14
3 0 10 15 11
3 0 11 15 16
3 0 11 16 12
3 0 12 16 17
3 0 12 17 13
3 0 13 17 18
3 0 13 18 14
3 0 14 18 19
3 0 15 20 16
3 0 16 20 21
3 0 16 21 17
3 0 17 21 22
3 0 17 22 18
3 0 18 22 23
3 0 18 23 19
3 0 19 23 24
3 0 20 25 21
3 0 21 25 26
3 0 21 26 22
3 0 22 26 27
3 0 22 27 23
3 0 23 27 28
3 0 23 28 24
3 0 24 28 29
3 0 25 30 26
3 0 26 30 31
3 0 26 31 27
3 0 27 31 32
3 0 27 32 28
3 0 28 32 33
3 0 28 33 29
3 0 29 33 34
3 0 30 35 31
3 0 31 35 36
3 0 31 36 32
3 0 32 36 37
3 0 32 37 33
3 0 33 37 38
3 0 33 38 34
3 0 34 38 39
3 0 35 40 36
3 0 36 40 41
3 0 36 41 37
3 0 37 41 42
3 0 37 42 38
3 0 38 42 43
3 0 38 43 39
3 0 39 43 44
3 0 40 45 41
3 0 41 45 46
3 0 41 46 42
3 0 42 46 47
3 0 42 47 43
3 0 43 47 48
3 0 43 48 44
3 0 44 48 49
3 0 45 50 46
3 0 46 50 51
3 0 46 51 47
3 0 47 51 52
3 0 47 52 48
3 0 48 52 53
3 0 48 53 49
3 0 49 53 54
3 0 50 55 51
3 0 51 55 56
3 0 51 56 52
3 0 52 56 57
3 0 52 57 53
3 0 53 57 58
3 0 53 58 54
3 0 54 58 59
3 0 55 60 56
3 0 56 60 61
3 0 56 61 57
3 0 57 61 62
3 0 57 62 58
3 0 58 62 63
3 0 58 63 59
3 0 59 63 64
3 0 65 0 1
3 0 65 1 66
3 0 66 1 2
3 0 66 2 67
3 0 67 2 3
3 0 67 3 68
3 0 68 3 4
3 0 68 4 69
3 0 70 65 66
3 0 70 66 71
3 0 71 66 67
3 0 71 67 72
3 0 72 67 68
3 0 72 68 73
3 0 73 68 69
3 0 73 69 74
3 0 75 70 71
3 0 75 71 76
3 0 76 71 72
3 0 76 72 77
3 0 77 72 73
3 0 77 73 78
3 0 78 73 74
3 0 78 74 79
3 0 80 75 76
3 0 80 76 81
3 0 81 76 77
3 0 81 77 82
3 0 82 77 78
3 0 82 78 83
3 0 83 78 79
3 0 83 79 84
3 0 85 80 81
3 0 85 81 86
3 0 86 81 82
3 0 86 82 87
3 0 87 82 83
3 0 87 83 88
3 0 88 83 84
3 0 88 84 89
3 0 90 85 86
3 0 90 86 91
3 0 91 86 87
3 0 91 87 92
3 0 92 87 88
3 0 92 88 93
3 0 93 88 89
3 0 93 89 94
3 0 95 90 91
3 0 95 91 96
3 0 96 91 92
3 0 96 92 97
3 0 97 92 93
3 0 97 93 98
3 0 98 93 94
3 0 98 94 99
3 0 100 95 96
3 0 100 96 101
3 0 101 96 97
3 0 101 97 102
3 0 102 97 98
3 0 102 98 103
3 0 103 98 99
3 0 103 99 104
3 0 105 100 101
3 0 105 101 106
3 0 106 101 102
3 0 106 102 107
3 0 107 102 103
3 0 107 103 108
3 0 108 103 104
3 0 108 104 109
3 0 110 105 106
3 0 110 106 111
3 0 111 106 107
3 0 111 107 112
3 0 112 107 108
3 0 112 108 113
3 0 113 108 109
3 0 113 109 114
3 0 115 110 111
3 0 115 111 116
3 0 116 111 112
3 0 116 112 117
3 0 117 112 113
3 0 117 113 118
3 0 118 113 114
3 0 118 114 119
3 0 120 115 116
3 0 120 116 121
3 0 121 116 117
3 0 121 117 122
3 0 122 117 118
3 0 122 118 123
3 0 123 118 119
3 0 123 119 124
FACES:
2 1 64 59
2 1 59 54
2 1 54 49
2 1 49 44
2 1 44 39
2 1 39 34
2 1 34 29
2 1 29 24
2 1 24 19
2 1 19 14
2 1 14 9
2 1 9 4
2 1 0 5
2 1 5 10
2 1 10 15
2 1 15 20
2 1 20 25
2 1 25 30
2 1 30 35
2 1 35 40
2 1 40 45
2 1 45 50
2 1 50 55
2 1 55 60
2 1 60 61
2 1 61 62
2 1 62 63
2 1 63 64
2 1 119 124
2 1 114 119
2 1 109 114
2 1 104 109
2 1 99 104
2 1 94 99
2 1 89 94
2 1 84 89
2 1 79 84
2 1 74 79
2 1 69 74
2 1 4 69
2 1 65 0
2 1 70 65
2 1 75 70
2 1 80 75
2 1 85 80
2 1 90 85
2 1 95 90
2 1 100 95
2 1 105 100
2 1 110 105
2 1 115 110
2 1 120 115
2 1 121 120
2 1 122 121
2 1 123 122
2 1 124 123