POINTS:
0.0 0.0625
0.0 0.09375
0.0 0.125
0.0 0.1875
0.0 0.25
0.0 0.375
0.0 0.5
0.0 0.75
0.0 1.0
0.03125 0.0625
0.03125 0.09375
0.0625 0.0
0.0625 0.03125
0.0625 0.0625
0.0625 0.09375
0.0625 0.125
0.09375 0.0
0.09375 0.03125
0.09375 0.0625
0.09375 0.09375
0.125 0.0
0.125 0.0625
0.125 0.125
0.125 0.1875
0.125 0.25
0.1875 0.0
0.1875 0.125
0.1875 0.1875
0.25 0.0
0.25 0.125
0.25 0.25
0.25 0.375
0.25 0.5
0.375 0.0
0.375 0.25
0.375 0.375
0.5 0.0
0.5 0.25
0.5 0.5
0.5 0.75
0.5 1.0
0.75 0.0
0.75 0.5
0.75 0.75
1.0 0.0
1.0 0.5
1.0 1.0
1.5 0.0
1.5 0.5
1.5 1.0
2.0 0.0
2.0 0.5
2.0 1.0
2.5 0.0
2.5 0.5
2.5 1.0
3.0 0.0
3.0 0.5
3.0 1.0
CELLS:
3 0 0 9 10
3 0 0 10 1
3 0 1 10 2
3 0 2 10 15
3 0 10 14 15
3 0 10 13 14
3 0 9 13 10
3 0 2 15 3
3 0 3 15 23
3 0 15 22 23
3 0 11 16 17
3 0 11 17 12
3 0 12 17 13
3 0 13 17 18
3 0 13 18 19
3 0 13 19 14
3 0 14 19 15
3 0 15 19 22
3 0 16 20 17
3 0 17 20 21
3 0 17 21 18
3 0 18 21 19
3 0 19 21 22
3 0 3 23 4
3 0 4 23 24
3 0 4 24 5
3 0 5 24 31
3 0 20 25 21
3 0 21 25 26
3 0 21 26 22
3 0 22 26 27
3 0 22 27 23
3 0 23 27 24
3 0 24 27 30
3 0 25 28 26
3 0 26 28 29
3 0 26 29 27
3 0 27 29 30
3 0 24 30 31
3 0 5 31 6
3 0 6 31 32
3 0 6 32 7
3 0 7 32 39
3 0 28 33 29
3 0 29 33 34
3 0 29 34 30
3 0 30 34 35
3 0 30 35 31
3 0 31 35 32
3 0 32 35 38
3 0 33 36 34
3 0 34 36 37
3 0 34 37 35
3 0 35 37 38
3 0 32 38 39
3 0 7 39 8
3 0 8 39 40
3 0 36 41 37
3 0 37 41 42
3 0 37 42 38
3 0 38 42 43
3 0 38 43 39
3 0 39 43 40
3 0 40 43 46
3 0 41 44 42
3 0 42 44 45
3 0 42 45 43
3 0 43 45 46
3 0 44 47 45
3 0 45 47 48
3 0 45 48 49
3 0 45 49 46
3 0 47 50 48
3 0 48 50 51
3 0 48 51 52
3 0 48 52 49
3 0 50 53 51
3 0 51 53 54
3 0 51 54 55
3 0 51 55 52
3 0 53 56 54
3 0 54 56 57
3 0 54 57 58
3 0 54 58 55
FACES:
2 1 58 55
2 1 55 52
2 1 52 49
2 1 49 46
2 1 46 40
2 1 40 8
2 77 8 7
2 77 7 6
2 77 6 5
2 77 5 4
2 77 4 3
2 77 3 2
2 77 2 1
2 77 1 0
2 1 0 9
2 1 9 13
2 1 13 12
2 1 12 11
2 1 11 16
2 1 16 20
2 1 20 25
2 1 25 28
2 1 28 33
2 1 33 36
2 1 36 41
2 1 41 44
2 1 44 47
2 1 47 50
2 1 50 53
2 1 53 56
2 1 56 57
2 1 57 58
