POINTS:
0.0 0.46875
0.0 0.5
0.0 0.5625
0.0 0.625
0.0 0.75
0.0 0.875
0.0 1.0
0.0625 0.46875
0.0625 0.5
0.0625 0.5625
0.125 0.46875
0.125 0.5
0.125 0.5625
0.125 0.625
0.125 0.75
0.1875 0.46875
0.1875 0.5
0.1875 0.5625
0.25 0.46875
0.25 0.5
0.25 0.5625
0.25 0.625
0.25 0.75
0.25 0.875
0.25 1.0
0.3125 0.46875
0.3125 0.5
0.3125 0.5625
0.375 0.46875
0.375 0.5
0.375 0.5625
0.375 0.625
0.375 0.75
0.4375 0.46875
0.4375 0.5
0.4375 0.5625
0.5 0.46875
0.5 0.5
0.5 0.5625
0.5 0.625
0.5 0.75
0.5 0.875
0.5 1.0
0.5625 0.46875
0.5625 0.5
0.5625 0.5625
0.5625 0.625
0.5625 0.6875
0.625 0.46875
0.625 0.5
0.625 0.5625
0.625 0.625
0.625 0.6875
0.625 0.75
0.625 0.875
0.65625 0.46875
0.65625 0.5
0.65625 0.53125
0.6875 0.46875
0.6875 0.5
0.6875 0.53125
0.6875 0.5625
0.6875 0.625
0.6875 0.6875
0.703125 0.46875
0.703125 0.484375
0.71875 0.0
0.71875 0.0625
0.71875 0.125
0.71875 0.1875
0.71875 0.25
0.71875 0.3125
0.71875 0.375
0.71875 0.40625
0.71875 0.4375
0.71875 0.453125
0.71875 0.46875
0.71875 0.484375
0.71875 0.5
0.71875 0.53125
0.734375 0.453125
0.734375 0.46875
0.734375 0.484375
0.75 0.0
0.75 0.0625
0.75 0.125
0.75 0.1875
0.75 0.25
0.75 0.3125
0.75 0.375
0.75 0.40625
0.75 0.4375
0.75 0.46875
0.75 0.5
0.75 0.53125
0.75 0.5625
0.75 0.625
0.75 0.6875
0.75 0.75
0.75 0.875
0.75 1.0
0.78125 0.40625
0.78125 0.4375
0.78125 0.46875
0.78125 0.5
0.78125 0.53125
0.8125 0.0
0.8125 0.0625
0.8125 0.125
0.8125 0.1875
0.8125 0.25
0.8125 0.3125
0.8125 0.375
0.8125 0.4375
0.8125 0.5
0.8125 0.5625
0.8125 0.625
0.8125 0.6875
0.875 0.0
0.875 0.0625
0.875 0.125
0.875 0.1875
0.875 0.25
0.875 0.3125
0.875 0.375
0.875 0.4375
0.875 0.5
0.875 0.5625
0.875 0.625
0.875 0.6875
0.875 0.75
0.875 0.875
0.9375 0.0
0.9375 0.0625
0.9375 0.125
0.9375 0.1875
0.9375 0.25
0.9375 0.3125
0.9375 0.375
0.9375 0.4375
0.9375 0.5
0.9375 0.5625
0.9375 0.625
0.9375 0.6875
1.0 0.0
1.0 0.125
1.0 0.25
1.0 0.375
1.0 0.5
1.0 0.625
1.0 0.75
1.0 0.875
1.0 1.0
1.125 0.0
1.125 0.125
1.125 0.25
1.125 0.375
1.125 0.5
1.125 0.625
1.125 0.75
1.125 0.875
1.25 0.0
1.25 0.25
1.25 0.5
1.25 0.75
1.25 1.0
1.5 0.0
1.5 0.25
1.5 0.5
1.5 0.75
1.5 1.0
1.75 0.0
1.75 0.25
1.75 0.5
1.75 0.75
1.75 1.0
2.0 0.0
2.0 0.25
2.0 0.5
2.0 0.75
2.0 1.0
2.25 0.0
2.25 0.25
2.25 0.5
2.25 0.75
2.25 1.0
2.5 0.0
2.5 0.25
2.5 0.5
2.5 0.75
2.5 1.0
2.75 0.0
2.75 0.25
2.75 0.5
2.75 0.75
2.75 1.0
3.0 0.0
3.0 0.25
3.0 0.5
3.0 0.75
3.0 1.0
-0.0625 0.46875
-0.0625 0.5
-0.0625 0.5625
-0.125 0.46875
-0.125 0.5
-0.125 0.5625
-0.125 0.625
-0.125 0.75
-0.1875 0.46875
-0.1875 0.5
-0.1875 0.5625
-0.25 0.46875
-0.25 0.5
-0.25 0.5625
-0.25 0.625
-0.25 0.75
-0.25 0.875
-0.25 1.0
-0.3125 0.46875
-0.3125 0.5
-0.3125 0.5625
-0.375 0.46875
-0.375 0.5
-0.375 0.5625
-0.375 0.625
-0.375 0.75
-0.4375 0.46875
-0.4375 0.5
-0.4375 0.5625
-0.5 0.46875
-0.5 0.5
-0.5 0.5625
-0.5 0.625
-0.5 0.75
-0.5 0.875
-0.5 1.0
-0.5625 0.46875
-0.5625 0.5
-0.5625 0.5625
-0.5625 0.625
-0.5625 0.6875
-0.625 0.46875
-0.625 0.5
-0.625 0.5625
-0.625 0.625
-0.625 0.6875
-0.625 0.75
-0.625 0.875
-0.65625 0.46875
-0.65625 0.5
-0.65625 0.53125
-0.6875 0.46875
-0.6875 0.5
-0.6875 0.53125
-0.6875 0.5625
-0.6875 0.625
-0.6875 0.6875
-0.703125 0.46875
-0.703125 0.484375
-0.71875 0.0
-0.71875 0.0625
-0.71875 0.125
-0.71875 0.1875
-0.71875 0.25
-0.71875 0.3125
-0.71875 0.375
-0.71875 0.40625
-0.71875 0.4375
-0.71875 0.453125
-0.71875 0.46875
-0.71875 0.484375
-0.71875 0.5
-0.71875 0.53125
-0.734375 0.453125
-0.734375 0.46875
-0.734375 0.484375
-0.75 0.0
-0.75 0.0625
-0.75 0.125
-0.75 0.1875
-0.75 0.25
-0.75 0.3125
-0.75 0.375
-0.75 0.40625
-0.75 0.4375
-0.75 0.46875
-0.75 0.5
-0.75 0.53125
-0.75 0.5625
-0.75 0.625
-0.75 0.6875
-0.75 0.75
-0.75 0.875
-0.75 1.0
-0.78125 0.40625
-0.78125 0.4375
-0.78125 0.46875
-0.78125 0.5
-0.78125 0.53125
-0.8125 0.0
-0.8125 0.0625
-0.8125 0.125
-0.8125 0.1875
-0.8125 0.25
-0.8125 0.3125
-0.8125 0.375
-0.8125 0.4375
-0.8125 0.5
-0.8125 0.5625
-0.8125 0.625
-0.8125 0.6875
-0.875 0.0
-0.875 0.0625
-0.875 0.125
-0.875 0.1875
-0.875 0.25
-0.875 0.3125
-0.875 0.375
-0.875 0.4375
-0.875 0.5
-0.875 0.5625
-0.875 0.625
-0.875 0.6875
-0.875 0.75
-0.875 0.875
-0.9375 0.0
-0.9375 0.0625
-0.9375 0.125
-0.9375 0.1875
-0.9375 0.25
-0.9375 0.3125
-0.9375 0.375
-0.9375 0.4375
-0.9375 0.5
-0.9375 0.5625
-0.9375 0.625
-0.9375 0.6875
-1.0 0.0
-1.0 0.125
-1.0 0.25
-1.0 0.375
-1.0 0.5
-1.0 0.625
-1.0 0.75
-1.0 0.875
-1.0 1.0
-1.125 0.0
-1.125 0.125
-1.125 0.25
-1.125 0.375
-1.125 0.5
-1.125 0.625
-1.125 0.75
-1.125 0.875
-1.25 0.0
-1.25 0.25
-1.25 0.5
-1.25 0.75
-1.25 1.0
-1.5 0.0
-1.5 0.25
-1.5 0.5
-1.5 0.75
-1.5 1.0
-1.75 0.0
-1.75 0.25
-1.75 0.5
-1.75 0.75
-1.75 1.0
-2.0 0.0
-2.0 0.25
-2.0 0.5
-2.0 0.75
-2.0 1.0
-2.25 0.0
-2.25 0.25
-2.25 0.5
-2.25 0.75
-2.25 1.0
-2.5 0.0
-2.5 0.25
-2.5 0.5
-2.5 0.75
-2.5 1.0
-2.75 0.0
-2.75 0.25
-2.75 0.5
-2.75 0.75
-2.75 1.0
-3.0 0.0
-3.0 0.25
-3.0 0.5
-3.0 0.75
-3.0 1.0
CELLS:
3 0 0 7 8
3 0 0 8 1
3 0 1 8 9
3 0 1 9 2
3 0 7 10 11
3 0 7 11 8
3 0 8 11 12
3 0 8 12 9
3 0 2 9 3
3 0 3 9 13
3 0 9 12 13
3 0 10 15 16
3 0 10 16 11
3 0 11 16 17
3 0 11 17 12
3 0 15 18 19
3 0 15 19 16
3 0 16 19 20
3 0 16 20 17
3 0 12 17 13
3 0 13 17 21
3 0 17 20 21
3 0 3 13 14
3 0 3 14 4
3 0 13 21 22
3 0 13 22 14
3 0 4 14 5
3 0 5 14 23
3 0 14 22 23
3 0 5 23 24
3 0 5 24 6
3 0 18 25 26
3 0 18 26 19
3 0 19 26 27
3 0 19 27 20
3 0 25 28 29
3 0 25 29 26
3 0 26 29 30
3 0 26 30 27
3 0 20 27 21
3 0 21 27 31
3 0 27 30 31
3 0 28 33 34
3 0 28 34 29
3 0 29 34 35
3 0 29 35 30
3 0 33 36 37
3 0 33 37 34
3 0 34 37 38
3 0 34 38 35
3 0 30 35 31
3 0 31 35 39
3 0 35 38 39
3 0 21 31 32
3 0 21 32 22
3 0 31 39 40
3 0 31 40 32
3 0 22 32 23
3 0 23 32 41
3 0 32 40 41
3 0 23 41 42
3 0 23 42 24
3 0 36 43 44
3 0 36 44 37
3 0 37 44 45
3 0 37 45 38
3 0 38 45 46
3 0 38 46 39
3 0 43 48 49
3 0 43 49 44
3 0 44 49 50
3 0 44 50 45
3 0 45 50 51
3 0 45 51 46
3 0 48 55 56
3 0 48 56 49
3 0 55 58 59
3 0 55 59 56
3 0 49 56 57
3 0 49 57 50
3 0 50 57 61
3 0 57 60 61
3 0 56 59 60
3 0 56 60 57
3 0 50 61 62
3 0 50 62 51
3 0 66 83 84
3 0 66 84 67
3 0 67 84 85
3 0 67 85 68
3 0 68 85 86
3 0 68 86 69
3 0 69 86 87
3 0 69 87 70
3 0 70 87 88
3 0 70 88 71
3 0 71 88 89
3 0 71 89 72
3 0 72 89 90
3 0 72 90 73
3 0 73 90 91
3 0 73 91 74
3 0 74 91 80
3 0 80 91 92
3 0 80 92 81
3 0 76 80 81
3 0 74 80 75
3 0 75 80 76
3 0 76 81 82
3 0 82 81 92
3 0 82 92 93
3 0 78 82 93
3 0 77 82 78
3 0 76 82 77
3 0 58 64 65
3 0 64 76 65
3 0 65 76 77
3 0 65 77 78
3 0 59 65 78
3 0 58 65 59
3 0 59 78 79
3 0 59 79 60
3 0 78 93 94
3 0 78 94 79
3 0 60 79 61
3 0 61 79 95
3 0 79 94 95
3 0 61 95 96
3 0 61 96 62
3 0 39 46 47
3 0 46 51 52
3 0 46 52 47
3 0 51 62 63
3 0 51 63 52
3 0 62 96 97
3 0 62 97 63
3 0 39 47 40
3 0 40 47 53
3 0 47 52 53
3 0 52 63 53
3 0 53 63 98
3 0 63 97 98
3 0 40 53 54
3 0 40 54 41
3 0 53 98 99
3 0 53 99 54
3 0 41 54 42
3 0 42 54 100
3 0 54 99 100
3 0 83 106 107
3 0 83 107 84
3 0 84 107 108
3 0 84 108 85
3 0 85 108 109
3 0 85 109 86
3 0 86 109 110
3 0 86 110 87
3 0 87 110 111
3 0 87 111 88
3 0 88 111 112
3 0 88 112 89
3 0 89 112 101
3 0 101 112 113
3 0 101 113 102
3 0 89 101 90
3 0 90 101 102
3 0 90 102 91
3 0 91 102 103
3 0 91 103 92
3 0 92 103 104
3 0 92 104 93
3 0 102 113 103
3 0 103 113 114
3 0 103 114 104
3 0 93 104 105
3 0 93 105 94
3 0 94 105 95
3 0 104 114 105
3 0 105 114 115
3 0 95 105 115
3 0 95 115 116
3 0 95 116 96
3 0 96 116 117
3 0 96 117 97
3 0 106 118 119
3 0 106 119 107
3 0 107 119 120
3 0 107 120 108
3 0 108 120 121
3 0 108 121 109
3 0 109 121 122
3 0 109 122 110
3 0 110 122 123
3 0 110 123 111
3 0 111 123 124
3 0 111 124 112
3 0 112 124 125
3 0 112 125 113
3 0 113 125 126
3 0 113 126 114
3 0 114 126 127
3 0 114 127 115
3 0 115 127 128
3 0 115 128 116
3 0 116 128 129
3 0 116 129 117
3 0 97 117 98
3 0 98 117 130
3 0 117 129 130
3 0 118 132 133
3 0 118 133 119
3 0 119 133 134
3 0 119 134 120
3 0 120 134 135
3 0 120 135 121
3 0 121 135 136
3 0 121 136 122
3 0 122 136 137
3 0 122 137 123
3 0 123 137 138
3 0 123 138 124
3 0 124 138 139
3 0 124 139 125
3 0 125 139 140
3 0 125 140 126
3 0 126 140 141
3 0 126 141 127
3 0 127 141 142
3 0 127 142 128
3 0 128 142 143
3 0 128 143 129
3 0 132 144 133
3 0 133 144 145
3 0 133 145 134
3 0 134 145 135
3 0 135 145 146
3 0 135 146 136
3 0 136 146 137
3 0 137 146 147
3 0 137 147 138
3 0 138 147 139
3 0 139 147 148
3 0 139 148 140
3 0 140 148 141
3 0 141 148 149
3 0 141 149 142
3 0 142 149 143
3 0 143 149 150
3 0 130 143 150
3 0 129 143 130
3 0 98 130 131
3 0 98 131 99
3 0 130 150 151
3 0 130 151 131
3 0 99 131 100
3 0 100 131 152
3 0 131 151 152
3 0 144 153 154
3 0 144 154 145
3 0 145 154 155
3 0 145 155 146
3 0 146 155 156
3 0 146 156 147
3 0 147 156 157
3 0 147 157 148
3 0 148 157 158
3 0 148 158 149
3 0 149 158 159
3 0 149 159 150
3 0 150 159 160
3 0 150 160 151
3 0 153 161 154
3 0 154 161 162
3 0 154 162 155
3 0 155 162 156
3 0 156 162 163
3 0 156 163 157
3 0 157 163 158
3 0 158 163 164
3 0 158 164 159
3 0 159 164 160
3 0 160 164 165
3 0 151 160 152
3 0 152 160 165
3 0 161 166 167
3 0 161 167 162
3 0 162 167 168
3 0 162 168 163
3 0 163 168 169
3 0 163 169 164
3 0 164 169 170
3 0 164 170 165
3 0 166 171 172
3 0 166 172 167
3 0 167 172 173
3 0 167 173 168
3 0 168 173 174
3 0 168 174 169
3 0 169 174 175
3 0 169 175 170
3 0 171 176 177
3 0 171 177 172
3 0 172 177 178
3 0 172 178 173
3 0 173 178 179
3 0 173 179 174
3 0 174 179 180
3 0 174 180 175
3 0 176 181 182
3 0 176 182 177
3 0 177 182 183
3 0 177 183 178
3 0 178 183 184
3 0 178 184 179
3 0 179 184 185
3 0 179 185 180
3 0 181 186 187
3 0 181 187 182
3 0 182 187 188
3 0 182 188 183
3 0 183 188 189
3 0 183 189 184
3 0 184 189 190
3 0 184 190 185
3 0 186 191 192
3 0 186 192 187
3 0 187 192 193
3 0 187 193 188
3 0 188 193 194
3 0 188 194 189
3 0 189 194 195
3 0 189 195 190
3 0 191 196 197
3 0 191 197 192
3 0 192 197 198
3 0 192 198 193
3 0 193 198 199
3 0 193 199 194
3 0 194 199 200
3 0 194 200 195
3 0 201 0 202
3 0 202 0 1
3 0 202 1 203
3 0 203 1 2
3 0 204 201 205
3 0 205 201 202
3 0 205 202 206
3 0 206 202 203
3 0 203 2 3
3 0 203 3 207
3 0 206 203 207
3 0 209 204 210
3 0 210 204 205
3 0 210 205 211
3 0 211 205 206
3 0 212 209 213
3 0 213 209 210
3 0 213 210 214
3 0 214 210 211
3 0 211 206 207
3 0 211 207 215
3 0 214 211 215
3 0 207 3 208
3 0 208 3 4
3 0 215 207 216
3 0 216 207 208
3 0 208 4 5
3 0 208 5 217
3 0 216 208 217
3 0 217 5 218
3 0 218 5 6
3 0 219 212 220
3 0 220 212 213
3 0 220 213 221
3 0 221 213 214
3 0 222 219 223
3 0 223 219 220
3 0 223 220 224
3 0 224 220 221
3 0 221 214 215
3 0 221 215 225
3 0 224 221 225
3 0 227 222 228
3 0 228 222 223
3 0 228 223 229
3 0 229 223 224
3 0 230 227 231
3 0 231 227 228
3 0 231 228 232
3 0 232 228 229
3 0 229 224 225
3 0 229 225 233
3 0 232 229 233
3 0 225 215 226
3 0 226 215 216
3 0 233 225 234
3 0 234 225 226
3 0 226 216 217
3 0 226 217 235
3 0 234 226 235
3 0 235 217 236
3 0 236 217 218
3 0 237 230 238
3 0 238 230 231
3 0 238 231 239
3 0 239 231 232
3 0 239 232 240
3 0 240 232 233
3 0 242 237 243
3 0 243 237 238
3 0 243 238 244
3 0 244 238 239
3 0 244 239 245
3 0 245 239 240
3 0 249 242 250
3 0 250 242 243
3 0 252 249 253
3 0 253 249 250
3 0 250 243 251
3 0 251 243 244
3 0 251 244 255
3 0 254 251 255
3 0 253 250 254
3 0 254 250 251
3 0 255 244 256
3 0 256 244 245
3 0 277 260 278
3 0 278 260 261
3 0 278 261 279
3 0 279 261 262
3 0 279 262 280
3 0 280 262 263
3 0 280 263 281
3 0 281 263 264
3 0 281 264 282
3 0 282 264 265
3 0 282 265 283
3 0 283 265 266
3 0 283 266 284
3 0 284 266 267
3 0 284 267 285
3 0 285 267 268
3 0 285 268 274
3 0 285 274 286
3 0 286 274 275
3 0 274 270 275
3 0 274 268 269
3 0 274 269 270
3 0 275 270 276
3 0 275 276 286
3 0 286 276 287
3 0 276 272 287
3 0 276 271 272
3 0 276 270 271
3 0 258 252 259
3 0 270 258 259
3 0 270 259 271
3 0 271 259 272
3 0 259 253 272
3 0 259 252 253
3 0 272 253 273
3 0 273 253 254
3 0 287 272 288
3 0 288 272 273
3 0 273 254 255
3 0 273 255 289
3 0 288 273 289
3 0 289 255 290
3 0 290 255 256
3 0 240 233 241
3 0 245 240 246
3 0 246 240 241
3 0 256 245 257
3 0 257 245 246
3 0 290 256 291
3 0 291 256 257
3 0 241 233 234
3 0 241 234 247
3 0 246 241 247
3 0 257 246 247
3 0 257 247 292
3 0 291 257 292
3 0 247 234 248
3 0 248 234 235
3 0 292 247 293
3 0 293 247 248
3 0 248 235 236
3 0 248 236 294
3 0 293 248 294
3 0 300 277 301
3 0 301 277 278
3 0 301 278 302
3 0 302 278 279
3 0 302 279 303
3 0 303 279 280
3 0 303 280 304
3 0 304 280 281
3 0 304 281 305
3 0 305 281 282
3 0 305 282 306
3 0 306 282 283
3 0 306 283 295
3 0 306 295 307
3 0 307 295 296
3 0 295 283 284
3 0 295 284 296
3 0 296 284 285
3 0 296 285 297
3 0 297 285 286
3 0 297 286 298
3 0 298 286 287
3 0 307 296 297
3 0 307 297 308
3 0 308 297 298
3 0 298 287 299
3 0 299 287 288
3 0 299 288 289
3 0 308 298 299
3 0 308 299 309
3 0 299 289 309
3 0 309 289 310
3 0 310 289 290
3 0 310 290 311
3 0 311 290 291
3 0 312 300 313
3 0 313 300 301
3 0 313 301 314
3 0 314 301 302
3 0 314 302 315
3 0 315 302 303
3 0 315 303 316
3 0 316 303 304
3 0 316 304 317
3 0 317 304 305
3 0 317 305 318
3 0 318 305 306
3 0 318 306 319
3 0 319 306 307
3 0 319 307 320
3 0 320 307 308
3 0 320 308 321
3 0 321 308 309
3 0 321 309 322
3 0 322 309 310
3 0 322 310 323
3 0 323 310 311
3 0 311 291 292
3 0 311 292 324
3 0 323 311 324
3 0 326 312 327
3 0 327 312 313
3 0 327 313 328
3 0 328 313 314
3 0 328 314 329
3 0 329 314 315
3 0 329 315 330
3 0 330 315 316
3 0 330 316 331
3 0 331 316 317
3 0 331 317 332
3 0 332 317 318
3 0 332 318 333
3 0 333 318 319
3 0 333 319 334
3 0 334 319 320
3 0 334 320 335
3 0 335 320 321
3 0 335 321 336
3 0 336 321 322
3 0 336 322 337
3 0 337 322 323
3 0 338 326 327
3 0 338 327 339
3 0 339 327 328
3 0 339 328 329
3 0 339 329 340
3 0 340 329 330
3 0 340 330 331
3 0 340 331 341
3 0 341 331 332
3 0 341 332 333
3 0 341 333 342
3 0 342 333 334
3 0 342 334 335
3 0 342 335 343
3 0 343 335 336
3 0 343 336 337
3 0 343 337 344
3 0 337 324 344
3 0 337 323 324
3 0 324 292 325
3 0 325 292 293
3 0 344 324 345
3 0 345 324 325
3 0 325 293 294
3 0 325 294 346
3 0 345 325 346
3 0 347 338 348
3 0 348 338 339
3 0 348 339 349
3 0 349 339 340
3 0 349 340 350
3 0 350 340 341
3 0 350 341 351
3 0 351 341 342
3 0 351 342 352
3 0 352 342 343
3 0 352 343 353
3 0 353 343 344
3 0 353 344 354
3 0 354 344 345
3 0 355 347 348
3 0 355 348 356
3 0 356 348 349
3 0 356 349 350
3 0 356 350 357
3 0 357 350 351
3 0 357 351 352
3 0 357 352 358
3 0 358 352 353
3 0 358 353 354
3 0 358 354 359
3 0 354 345 346
3 0 354 346 359
3 0 360 355 361
3 0 361 355 356
3 0 361 356 362
3 0 362 356 357
3 0 362 357 363
3 0 363 357 358
3 0 363 358 364
3 0 364 358 359
3 0 365 360 366
3 0 366 360 361
3 0 366 361 367
3 0 367 361 362
3 0 367 362 368
3 0 368 362 363
3 0 368 363 369
3 0 369 363 364
3 0 370 365 371
3 0 371 365 366
3 0 371 366 372
3 0 372 366 367
3 0 372 367 373
3 0 373 367 368
3 0 373 368 374
3 0 374 368 369
3 0 375 370 376
3 0 376 370 371
3 0 376 371 377
3 0 377 371 372
3 0 377 372 378
3 0 378 372 373
3 0 378 373 379
3 0 379 373 374
3 0 380 375 381
3 0 381 375 376
3 0 381 376 382
3 0 382 376 377
3 0 382 377 383
3 0 383 377 378
3 0 383 378 384
3 0 384 378 379
3 0 385 380 386
3 0 386 380 381
3 0 386 381 387
3 0 387 381 382
3 0 387 382 388
3 0 388 382 383
3 0 388 383 389
3 0 389 383 384
3 0 390 385 391
3 0 391 385 386
3 0 391 386 392
3 0 392 386 387
3 0 392 387 393
3 0 393 387 388
3 0 393 388 394
3 0 394 388 389
FACES:
2 1 200 195
2 1 195 190
2 1 190 185
2 1 185 180
2 1 180 175
2 1 175 170
2 1 170 165
2 1 165 152
2 1 152 100
2 1 100 42
2 1 42 24
2 1 24 6
2 10 0 7
2 10 7 10
2 10 10 15
2 10 15 18
2 10 18 25
2 10 25 28
2 10 28 33
2 10 33 36
2 10 36 43
2 10 43 48
2 10 48 55
2 10 55 58
2 10 58 64
2 10 64 76
2 10 76 75
2 10 75 74
2 10 74 73
2 10 73 72
2 10 72 71
2 10 71 70
2 10 70 69
2 10 69 68
2 10 68 67
2 10 67 66
2 1 66 83
2 1 83 106
2 1 106 118
2 1 118 132
2 1 132 144
2 1 144 153
2 1 153 161
2 1 161 166
2 1 166 171
2 1 171 176
2 1 176 181
2 1 181 186
2 1 186 191
2 1 191 196
2 1 196 197
2 1 197 198
2 1 198 199
2 1 199 200
2 1 389 394
2 1 384 389
2 1 379 384
2 1 374 379
2 1 369 374
2 1 364 369
2 1 359 364
2 1 346 359
2 1 294 346
2 1 236 294
2 1 218 236
2 1 6 218
2 10 201 0
2 10 204 201
2 10 209 204
2 10 212 209
2 10 219 212
2 10 222 219
2 10 227 222
2 10 230 227
2 10 237 230
2 10 242 237
2 10 249 242
2 10 252 249
2 10 258 252
2 10 270 258
2 10 269 270
2 10 268 269
2 10 267 268
2 10 266 267
2 10 265 266
2 10 264 265
2 10 263 264
2 10 262 263
2 10 261 262
2 10 260 261
2 1 277 260
2 1 300 277
2 1 312 300
2 1 326 312
2 1 338 326
2 1 347 338
2 1 355 347
2 1 360 355
2 1 365 360
2 1 370 365
2 1 375 370
2 1 380 375
2 1 385 380
2 1 390 385
2 1 391 390
2 1 392 391
2 1 393 392
2 1 394 393