POINTS:
0.0 0.125
0.0 0.1875
0.0 0.25
0.0 0.375
0.0 0.5
0.0 0.75
0.0 1.0
0.03125 0.125
0.03125 0.15625
0.03125 0.1875
0.03125 0.21875
0.0625 0.125
0.0625 0.15625
0.0625 0.1875
0.0625 0.21875
0.0625 0.25
0.0625 0.3125
0.09325 0.125
0.09325 0.15625
0.09325 0.1875
0.09325 0.21875
0.125 0.125
0.125 0.15625
0.125 0.1875
0.125 0.21875
0.125 0.25
0.125 0.3125
0.125 0.375
0.15625 0.09375
0.15625 0.125
0.15625 0.15625
0.15625 0.1875
0.15625 0.21875
0.1875 0.0625
0.1875 0.09375
0.1875 0.125
0.1875 0.15625
0.1875 0.1875
0.1875 0.21875
0.1875 0.25
0.1875 0.3125
0.21875 0.03125
0.21875 0.0625
0.21875 0.09375
0.21875 0.125
0.21875 0.15625
0.21875 0.1875
0.21875 0.21875
0.25 0.0
0.25 0.0625
0.25 0.125
0.25 0.1875
0.25 0.25
0.25 0.3125
0.25 0.375
0.25 0.5
0.25 0.75
0.25 1.0
0.3125 0.0
0.3125 0.0625
0.3125 0.125
0.3125 0.1875
0.3125 0.25
0.3125 0.3125
0.375 0.0
0.375 0.125
0.375 0.25
0.375 0.375
0.5 0.0
0.5 0.25
0.5 0.5
0.5 0.75
0.5 1.0
0.75 0.0
0.75 0.25
0.75 0.5
0.75 0.75
0.75 1.0
1.0 0.0
1.0 0.25
1.0 0.5
1.0 0.75
1.0 1.0
1.25 0.0
1.25 0.25
1.25 0.5
1.25 0.75
1.25 1.0
1.5 0.0
1.5 0.25
1.5 0.5
1.5 0.75
1.5 1.0
1.75 0.0
1.75 0.25
1.75 0.5
1.75 0.75
1.75 1.0
2.0 0.0
2.0 0.25
2.0 0.5
2.0 0.75
2.0 1.0
2.25 0.0
2.25 0.25
2.25 0.5
2.25 0.75
2.25 1.0
2.5 0.0
2.5 0.25
2.5 0.5
2.5 0.75
2.5 1.0
2.75 0.0
2.75 0.25
2.75 0.5
2.75 0.75
2.75 1.0
3.0 0.0
3.0 0.25
3.0 0.5
3.0 0.75
3.0 1.0
CELLS:
3 0 0 7 8
3 0 0 8 1
3 0 1 8 9
3 0 1 9 10
3 0 1 10 2
3 0 2 10 15
3 0 7 11 8
3 0 8 11 12
3 0 8 12 9
3 0 9 12 13
3 0 9 13 10
3 0 10 13 14
3 0 10 14 15
3 0 2 15 16
3 0 2 16 3
3 0 3 16 27
3 0 11 17 12
3 0 12 17 18
3 0 12 18 13
3 0 13 18 19
3 0 13 19 14
3 0 14 19 20
3 0 14 20 15
3 0 15 20 25
3 0 17 21 18
3 0 18 21 22
3 0 18 22 19
3 0 19 22 23
3 0 19 23 20
3 0 20 23 24
3 0 20 24 25
3 0 15 25 16
3 0 16 25 26
3 0 16 26 27
3 0 3 27 4
3 0 4 27 55
3 0 21 28 29
3 0 21 29 22
3 0 22 29 30
3 0 22 30 23
3 0 23 30 31
3 0 23 31 24
3 0 24 31 32
3 0 24 32 25
3 0 25 32 39
3 0 28 33 34
3 0 28 34 29
3 0 29 34 35
3 0 29 35 30
3 0 30 35 36
3 0 30 36 31
3 0 31 36 37
3 0 31 37 32
3 0 32 37 38
3 0 32 38 39
3 0 25 39 26
3 0 26 39 40
3 0 26 40 27
3 0 27 40 54
3 0 33 41 42
3 0 33 42 34
3 0 34 42 43
3 0 34 43 35
3 0 35 43 44
3 0 35 44 36
3 0 36 44 45
3 0 36 45 37
3 0 37 45 46
3 0 37 46 47
3 0 37 47 38
3 0 38 47 39
3 0 39 47 52
3 0 41 48 49
3 0 41 49 42
3 0 42 49 43
3 0 43 49 50
3 0 43 50 44
3 0 44 50 45
3 0 45 50 51
3 0 45 51 46
3 0 46 51 47
3 0 47 51 52
3 0 39 52 40
3 0 40 52 53
3 0 40 53 54
3 0 27 54 55
3 0 4 55 5
3 0 5 55 56
3 0 5 56 6
3 0 6 56 57
3 0 48 58 59
3 0 48 59 49
3 0 49 59 50
3 0 50 59 60
3 0 50 60 51
3 0 51 60 61
3 0 51 61 52
3 0 52 61 62
3 0 52 62 63
3 0 52 63 53
3 0 53 63 54
3 0 54 63 67
3 0 58 64 59
3 0 59 64 65
3 0 59 65 60
3 0 60 65 61
3 0 61 65 66
3 0 61 66 62
3 0 62 66 63
3 0 63 66 67
3 0 54 67 55
3 0 55 67 70
3 0 64 68 65
3 0 65 68 69
3 0 65 69 66
3 0 66 69 67
3 0 67 69 70
3 0 55 70 56
3 0 56 70 71
3 0 56 71 57
3 0 57 71 72
3 0 68 73 69
3 0 69 73 74
3 0 69 74 70
3 0 70 74 75
3 0 70 75 71
3 0 71 75 76
3 0 71 76 72
3 0 72 76 77
3 0 73 78 74
3 0 74 78 79
3 0 74 79 75
3 0 75 79 80
3 0 75 80 76
3 0 76 80 81
3 0 76 81 77
3 0 77 81 82
3 0 78 83 79
3 0 79 83 84
3 0 79 84 80
3 0 80 84 85
3 0 80 85 81
3 0 81 85 86
3 0 81 86 82
3 0 82 86 87
3 0 83 88 84
3 0 84 88 89
3 0 84 89 85
3 0 85 89 90
3 0 85 90 86
3 0 86 90 91
3 0 86 91 87
3 0 87 91 92
3 0 88 93 89
3 0 89 93 94
3 0 89 94 90
3 0 90 94 95
3 0 90 95 91
3 0 91 95 96
3 0 91 96 92
3 0 92 96 97
3 0 93 98 94
3 0 94 98 99
3 0 94 99 95
3 0 95 99 100
3 0 95 100 96
3 0 96 100 101
3 0 96 101 97
3 0 97 101 102
3 0 98 103 99
3 0 99 103 104
3 0 99 104 100
3 0 100 104 105
3 0 100 105 101
3 0 101 105 106
3 0 101 106 102
3 0 102 106 107
3 0 103 108 104
3 0 104 108 109
3 0 104 109 105
3 0 105 109 110
3 0 105 110 106
3 0 106 110 111
3 0 106 111 107
3 0 107 111 112
3 0 108 113 109
3 0 109 113 114
3 0 109 114 110
3 0 110 114 115
3 0 110 115 111
3 0 111 115 116
3 0 111 116 112
3 0 112 116 117
3 0 113 118 114
3 0 114 118 119
3 0 114 119 115
3 0 115 119 120
3 0 115 120 116
3 0 116 120 121
3 0 116 121 117
3 0 117 121 122
FACES:
2 1 122 117
2 1 117 112
2 1 112 107
2 1 107 102
2 1 102 97
2 1 97 92
2 1 92 87
2 1 87 82
2 1 82 77
2 1 77 72
2 1 72 57
2 1 57 6
2 77 6 5
2 77 5 4
2 77 4 3
2 77 3 2
2 77 2 1
2 77 1 0
2 10 0 7
2 10 7 11
2 10 11 17
2 10 17 21
2 10 21 28
2 10 28 33
2 10 33 41
2 10 41 48
2 1 48 58
2 1 58 64
2 1 64 68
2 1 68 73
2 1 73 78
2 1 78 83
2 1 83 88
2 1 88 93
2 1 93 98
2 1 98 103
2 1 103 108
2 1 108 113
2 1 113 118
2 1 118 119
2 1 119 120
2 1 120 121
2 1 121 122
