POINTS:
0.0 0.0625
0.0 0.125
0.0 0.1875
0.0 0.25
0.0 0.375
0.0 0.5
0.0 0.75
0.0 1.0
0.03125 0.0625
0.03125 0.09375
0.03125 0.125
0.03125 0.15625
0.0625 0.0625
0.0625 0.09375
0.0625 0.125
0.0625 0.15625
0.0625 0.1875
0.09375 0.0625
0.09375 0.09375
0.09375 0.125
0.09375 0.15625
0.125 0.0625
0.125 0.09375
0.125 0.125
0.125 0.15625
0.125 0.1875
0.125 0.25
0.125 0.375
0.15625 0.03125
0.15625 0.0625
0.15625 0.09375
0.15625 0.125
0.15625 0.15625
0.1875 0.0
0.1875 0.03125
0.1875 0.0625
0.1875 0.09375
0.1875 0.125
0.1875 0.15625
0.1875 0.1875
0.21875 0.0
0.21875 0.03125
0.21875 0.0625
0.21875 0.09375
0.21875 0.125
0.21875 0.15625
0.25 0.0
0.25 0.0625
0.25 0.125
0.25 0.1875
0.25 0.25
0.25 0.375
0.25 0.5
0.25 0.75
0.25 1.0
0.3125 0.0
0.3125 0.0625
0.3125 0.125
0.3125 0.1875
0.375 0.0
0.375 0.125
0.375 0.25
0.375 0.375
0.5 0.0
0.5 0.25
0.5 0.5
0.5 0.75
0.5 1.0
0.75 0.0
0.75 0.25
0.75 0.5
0.75 0.75
0.75 1.0
1.0 0.0
1.0 0.25
1.0 0.5
1.0 0.75
1.0 1.0
1.25 0.0
1.25 0.25
1.25 0.5
1.25 0.75
1.25 1.0
1.5 0.0
1.5 0.25
1.5 0.5
1.5 0.75
1.5 1.0
1.75 0.0
1.75 0.25
1.75 0.5
1.75 0.75
1.75 1.0
2.0 0.0
2.0 0.25
2.0 0.5
2.0 0.75
2.0 1.0
2.25 0.0
2.25 0.25
2.25 0.5
2.25 0.75
2.25 1.0
2.5 0.0
2.5 0.25
2.5 0.5
2.5 0.75
2.5 1.0
2.75 0.0
2.75 0.25
2.75 0.5
2.75 0.75
2.75 1.0
3.0 0.0
3.0 0.25
3.0 0.5
3.0 0.75
3.0 1.0
-0.03125 0.0625
-0.03125 0.09375
-0.03125 0.125
-0.03125 0.15625
-0.0625 0.0625
-0.0625 0.09375
-0.0625 0.125
-0.0625 0.15625
-0.0625 0.1875
-0.09375 0.0625
-0.09375 0.09375
-0.09375 0.125
-0.09375 0.15625
-0.125 0.0625
-0.125 0.09375
-0.125 0.125
-0.125 0.15625
-0.125 0.1875
-0.125 0.25
-0.125 0.375
-0.15625 0.03125
-0.15625 0.0625
-0.15625 0.09375
-0.15625 0.125
-0.15625 0.15625
-0.1875 0.0
-0.1875 0.03125
-0.1875 0.0625
-0.1875 0.09375
-0.1875 0.125
-0.1875 0.15625
-0.1875 0.1875
-0.21875 0.0
-0.21875 0.03125
-0.21875 0.0625
-0.21875 0.09375
-0.21875 0.125
-0.21875 0.15625
-0.25 0.0
-0.25 0.0625
-0.25 0.125
-0.25 0.1875
-0.25 0.25
-0.25 0.375
-0.25 0.5
-0.25 0.75
-0.25 1.0
-0.3125 0.0
-0.3125 0.0625
-0.3125 0.125
-0.3125 0.1875
-0.375 0.0
-0.375 0.125
-0.375 0.25
-0.375 0.375
-0.5 0.0
-0.5 0.25
-0.5 0.5
-0.5 0.75
-0.5 1.0
-0.75 0.0
-0.75 0.25
-0.75 0.5
-0.75 0.75
-0.75 1.0
-1.0 0.0
-1.0 0.25
-1.0 0.5
-1.0 0.75
-1.0 1.0
-1.25 0.0
-1.25 0.25
-1.25 0.5
-1.25 0.75
-1.25 1.0
-1.5 0.0
-1.5 0.25
-1.5 0.5
-1.5 0.75
-1.5 1.0
-1.75 0.0
-1.75 0.25
-1.75 0.5
-1.75 0.75
-1.75 1.0
-2.0 0.0
-2.0 0.25
-2.0 0.5
-2.0 0.75
-2.0 1.0
-2.25 0.0
-2.25 0.25
-2.25 0.5
-2.25 0.75
-2.25 1.0
-2.5 0.0
-2.5 0.25
-2.5 0.5
-2.5 0.75
-2.5 1.0
-2.75 0.0
-2.75 0.25
-2.75 0.5
-2.75 0.75
-2.75 1.0
-3.0 0.0
-3.0 0.25
-3.0 0.5
-3.0 0.75
-3.0 1.0
CELLS:
3 0 0 8 9
3 0 0 9 1
3 0 1 9 10
3 0 1 10 11
3 0 1 11 2
3 0 2 11 16
3 0 8 12 9
3 0 9 12 13
3 0 9 13 10
3 0 10 13 14
3 0 10 14 11
3 0 11 14 15
3 0 11 15 16
3 0 2 16 3
3 0 3 16 26
3 0 12 17 13
3 0 13 17 18
3 0 13 18 14
3 0 14 18 19
3 0 14 19 15
3 0 15 19 20
3 0 15 20 16
3 0 16 20 25
3 0 17 21 18
3 0 18 21 22
3 0 18 22 19
3 0 19 22 23
3 0 19 23 20
3 0 20 23 24
3 0 20 24 25
3 0 16 25 26
3 0 3 26 4
3 0 4 26 27
3 0 4 27 5
3 0 5 27 52
3 0 21 28 29
3 0 21 29 22
3 0 22 29 30
3 0 22 30 23
3 0 23 30 31
3 0 23 31 24
3 0 24 31 32
3 0 24 32 25
3 0 25 32 39
3 0 28 33 34
3 0 28 34 29
3 0 29 34 35
3 0 29 35 30
3 0 30 35 36
3 0 30 36 31
3 0 31 36 37
3 0 31 37 32
3 0 32 37 38
3 0 32 38 39
3 0 25 39 26
3 0 26 39 50
3 0 33 40 41
3 0 33 41 34
3 0 34 41 35
3 0 35 41 42
3 0 35 42 36
3 0 36 42 43
3 0 36 43 37
3 0 37 43 44
3 0 37 44 45
3 0 37 45 38
3 0 38 45 39
3 0 39 45 49
3 0 40 46 41
3 0 41 46 47
3 0 41 47 42
3 0 42 47 43
3 0 43 47 48
3 0 43 48 44
3 0 44 48 45
3 0 45 48 49
3 0 39 49 50
3 0 26 50 27
3 0 27 50 51
3 0 27 51 52
3 0 5 52 6
3 0 6 52 53
3 0 6 53 7
3 0 7 53 54
3 0 46 55 47
3 0 47 55 56
3 0 47 56 48
3 0 48 56 57
3 0 48 57 49
3 0 49 57 58
3 0 49 58 50
3 0 50 58 61
3 0 55 59 56
3 0 56 59 60
3 0 56 60 57
3 0 57 60 58
3 0 58 60 61
3 0 50 61 62
3 0 50 62 51
3 0 51 62 52
3 0 52 62 65
3 0 59 63 60
3 0 60 63 64
3 0 60 64 61
3 0 61 64 62
3 0 62 64 65
3 0 52 65 53
3 0 53 65 66
3 0 53 66 54
3 0 54 66 67
3 0 63 68 64
3 0 64 68 69
3 0 64 69 65
3 0 65 69 70
3 0 65 70 66
3 0 66 70 71
3 0 66 71 67
3 0 67 71 72
3 0 68 73 69
3 0 69 73 74
3 0 69 74 70
3 0 70 74 75
3 0 70 75 71
3 0 71 75 76
3 0 71 76 72
3 0 72 76 77
3 0 73 78 74
3 0 74 78 79
3 0 74 79 75
3 0 75 79 80
3 0 75 80 76
3 0 76 80 81
3 0 76 81 77
3 0 77 81 82
3 0 78 83 79
3 0 79 83 84
3 0 79 84 80
3 0 80 84 85
3 0 80 85 81
3 0 81 85 86
3 0 81 86 82
3 0 82 86 87
3 0 83 88 84
3 0 84 88 89
3 0 84 89 85
3 0 85 89 90
3 0 85 90 86
3 0 86 90 91
3 0 86 91 87
3 0 87 91 92
3 0 88 93 89
3 0 89 93 94
3 0 89 94 90
3 0 90 94 95
3 0 90 95 91
3 0 91 95 96
3 0 91 96 92
3 0 92 96 97
3 0 93 98 94
3 0 94 98 99
3 0 94 99 95
3 0 95 99 100
3 0 95 100 96
3 0 96 100 101
3 0 96 101 97
3 0 97 101 102
3 0 98 103 99
3 0 99 103 104
3 0 99 104 100
3 0 100 104 105
3 0 100 105 101
3 0 101 105 106
3 0 101 106 102
3 0 102 106 107
3 0 103 108 104
3 0 104 108 109
3 0 104 109 105
3 0 105 109 110
3 0 105 110 106
3 0 106 110 111
3 0 106 111 107
3 0 107 111 112
3 0 108 113 109
3 0 109 113 114
3 0 109 114 110
3 0 110 114 115
3 0 110 115 111
3 0 111 115 116
3 0 111 116 112
3 0 112 116 117
3 0 118 0 119
3 0 119 0 1
3 0 119 1 120
3 0 120 1 121
3 0 121 1 2
3 0 121 2 126
3 0 122 118 119
3 0 122 119 123
3 0 123 119 120
3 0 123 120 124
3 0 124 120 121
3 0 124 121 125
3 0 125 121 126
3 0 126 2 3
3 0 126 3 136
3 0 127 122 123
3 0 127 123 128
3 0 128 123 124
3 0 128 124 129
3 0 129 124 125
3 0 129 125 130
3 0 130 125 126
3 0 130 126 135
3 0 131 127 128
3 0 131 128 132
3 0 132 128 129
3 0 132 129 133
3 0 133 129 130
3 0 133 130 134
3 0 134 130 135
3 0 135 126 136
3 0 136 3 4
3 0 136 4 137
3 0 137 4 5
3 0 137 5 162
3 0 138 131 139
3 0 139 131 132
3 0 139 132 140
3 0 140 132 133
3 0 140 133 141
3 0 141 133 134
3 0 141 134 142
3 0 142 134 135
3 0 142 135 149
3 0 143 138 144
3 0 144 138 139
3 0 144 139 145
3 0 145 139 140
3 0 145 140 146
3 0 146 140 141
3 0 146 141 147
3 0 147 141 142
3 0 147 142 148
3 0 148 142 149
3 0 149 135 136
3 0 149 136 160
3 0 150 143 151
3 0 151 143 144
3 0 151 144 145
3 0 151 145 152
3 0 152 145 146
3 0 152 146 153
3 0 153 146 147
3 0 153 147 154
3 0 154 147 155
3 0 155 147 148
3 0 155 148 149
3 0 155 149 159
3 0 156 150 151
3 0 156 151 157
3 0 157 151 152
3 0 157 152 153
3 0 157 153 158
3 0 158 153 154
3 0 158 154 155
3 0 158 155 159
3 0 159 149 160
3 0 160 136 137
3 0 160 137 161
3 0 161 137 162
3 0 162 5 6
3 0 162 6 163
3 0 163 6 7
3 0 163 7 164
3 0 165 156 157
3 0 165 157 166
3 0 166 157 158
3 0 166 158 167
3 0 167 158 159
3 0 167 159 168
3 0 168 159 160
3 0 168 160 171
3 0 169 165 166
3 0 169 166 170
3 0 170 166 167
3 0 170 167 168
3 0 170 168 171
3 0 171 160 172
3 0 172 160 161
3 0 172 161 162
3 0 172 162 175
3 0 173 169 170
3 0 173 170 174
3 0 174 170 171
3 0 174 171 172
3 0 174 172 175
3 0 175 162 163
3 0 175 163 176
3 0 176 163 164
3 0 176 164 177
3 0 178 173 174
3 0 178 174 179
3 0 179 174 175
3 0 179 175 180
3 0 180 175 176
3 0 180 176 181
3 0 181 176 177
3 0 181 177 182
3 0 183 178 179
3 0 183 179 184
3 0 184 179 180
3 0 184 180 185
3 0 185 180 181
3 0 185 181 186
3 0 186 181 182
3 0 186 182 187
3 0 188 183 184
3 0 188 184 189
3 0 189 184 185
3 0 189 185 190
3 0 190 185 186
3 0 190 186 191
3 0 191 186 187
3 0 191 187 192
3 0 193 188 189
3 0 193 189 194
3 0 194 189 190
3 0 194 190 195
3 0 195 190 191
3 0 195 191 196
3 0 196 191 192
3 0 196 192 197
3 0 198 193 194
3 0 198 194 199
3 0 199 194 195
3 0 199 195 200
3 0 200 195 196
3 0 200 196 201
3 0 201 196 197
3 0 201 197 202
3 0 203 198 199
3 0 203 199 204
3 0 204 199 200
3 0 204 200 205
3 0 205 200 201
3 0 205 201 206
3 0 206 201 202
3 0 206 202 207
3 0 208 203 204
3 0 208 204 209
3 0 209 204 205
3 0 209 205 210
3 0 210 205 206
3 0 210 206 211
3 0 211 206 207
3 0 211 207 212
3 0 213 208 209
3 0 213 209 214
3 0 214 209 210
3 0 214 210 215
3 0 215 210 211
3 0 215 211 216
3 0 216 211 212
3 0 216 212 217
3 0 218 213 214
3 0 218 214 219
3 0 219 214 215
3 0 219 215 220
3 0 220 215 216
3 0 220 216 221
3 0 221 216 217
3 0 221 217 222
3 0 223 218 219
3 0 223 219 224
3 0 224 219 220
3 0 224 220 225
3 0 225 220 221
3 0 225 221 226
3 0 226 221 222
3 0 226 222 227
FACES:
2 1 117 112
2 1 112 107
2 1 107 102
2 1 102 97
2 1 97 92
2 1 92 87
2 1 87 82
2 1 82 77
2 1 77 72
2 1 72 67
2 1 67 54
2 1 54 7
2 10 0 8
2 10 8 12
2 10 12 17
2 10 17 21
2 10 21 28
2 10 28 33
2 1 33 40
2 1 40 46
2 1 46 55
2 1 55 59
2 1 59 63
2 1 63 68
2 1 68 73
2 1 73 78
2 1 78 83
2 1 83 88
2 1 88 93
2 1 93 98
2 1 98 103
2 1 103 108
2 1 108 113
2 1 113 114
2 1 114 115
2 1 115 116
2 1 116 117
2 1 222 227
2 1 217 222
2 1 212 217
2 1 207 212
2 1 202 207
2 1 197 202
2 1 192 197
2 1 187 192
2 1 182 187
2 1 177 182
2 1 164 177
2 1 7 164
2 10 118 0
2 10 122 118
2 10 127 122
2 10 131 127
2 10 138 131
2 10 143 138
2 1 150 143
2 1 156 150
2 1 165 156
2 1 169 165
2 1 173 169
2 1 178 173
2 1 183 178
2 1 188 183
2 1 193 188
2 1 198 193
2 1 203 198
2 1 208 203
2 1 213 208
2 1 218 213
2 1 223 218
2 1 224 223
2 1 225 224
2 1 226 225
2 1 227 226