POINTS:
0.0 0.0
0.0 0.125
0.0 0.25
0.0 0.375
0.0 0.5
0.0 0.625
0.0 0.75
0.0 0.875
0.0 1.0
0.125 0.0
0.125 0.125
0.125 0.25
0.125 0.375
0.125 0.5
0.125 0.625
0.125 0.75
0.125 0.875
0.125 1.0
0.25 0.0
0.25 0.125
0.25 0.25
0.25 0.375
0.25 0.5
0.25 0.625
0.25 0.75
0.25 0.875
0.25 1.0
0.375 0.0
0.375 0.125
0.375 0.25
0.375 0.375
0.375 0.5
0.375 0.625
0.375 0.75
0.375 0.875
0.375 1.0
0.5 0.0
0.5 0.125
0.5 0.25
0.5 0.375
0.5 0.5
0.5 0.625
0.5 0.75
0.5 0.875
0.5 1.0
0.625 0.0
0.625 0.125
0.625 0.25
0.625 0.375
0.625 0.5
0.625 0.625
0.625 0.75
0.625 0.875
0.625 1.0
0.75 0.0
0.75 0.125
0.75 0.25
0.75 0.375
0.75 0.5
0.75 0.625
0.75 0.75
0.75 0.875
0.75 1.0
0.875 0.0
0.875 0.125
0.875 0.25
0.875 0.375
0.875 0.5
0.875 0.625
0.875 0.75
0.875 0.875
0.875 1.0
1.0 0.0
1.0 0.125
1.0 0.25
1.0 0.375
1.0 0.5
1.0 0.625
1.0 0.75
1.0 0.875
1.0 1.0
1.125 0.0
1.125 0.125
1.125 0.25
1.125 0.375
1.125 0.5
1.125 0.625
1.125 0.75
1.125 0.875
1.125 1.0
1.25 0.0
1.25 0.125
1.25 0.25
1.25 0.375
1.25 0.5
1.25 0.625
1.25 0.75
1.25 0.875
1.25 1.0
1.375 0.0
1.375 0.125
1.375 0.25
1.375 0.375
1.375 0.5
1.375 0.625
1.375 0.75
1.375 0.875
1.375 1.0
1.5 0.0
1.5 0.125
1.5 0.25
1.5 0.375
1.5 0.5
1.5 0.625
1.5 0.75
1.5 0.875
1.5 1.0
1.625 0.0
1.625 0.125
1.625 0.25
1.625 0.375
1.625 0.5
1.625 0.625
1.625 0.75
1.625 0.875
1.625 1.0
1.75 0.0
1.75 0.125
1.75 0.25
1.75 0.375
1.75 0.5
1.75 0.625
1.75 0.75
1.75 0.875
1.75 1.0
1.875 0.0
1.875 0.125
1.875 0.25
1.875 0.375
1.875 0.5
1.875 0.625
1.875 0.75
1.875 0.875
1.875 1.0
2.0 0.0
2.0 0.125
2.0 0.25
2.0 0.375
2.0 0.5
2.0 0.625
2.0 0.75
2.0 0.875
2.0 1.0
2.125 0.0
2.125 0.125
2.125 0.25
2.125 0.375
2.125 0.5
2.125 0.625
2.125 0.75
2.125 0.875
2.125 1.0
2.25 0.0
2.25 0.125
2.25 0.25
2.25 0.375
2.25 0.5
2.25 0.625
2.25 0.75
2.25 0.875
2.25 1.0
2.375 0.0
2.375 0.125
2.375 0.25
2.375 0.375
2.375 0.5
2.375 0.625
2.375 0.75
2.375 0.875
2.375 1.0
2.5 0.0
2.5 0.125
2.5 0.25
2.5 0.375
2.5 0.5
2.5 0.625
2.5 0.75
2.5 0.875
2.5 1.0
2.625 0.0
2.625 0.125
2.625 0.25
2.625 0.375
2.625 0.5
2.625 0.625
2.625 0.75
2.625 0.875
2.625 1.0
2.75 0.0
2.75 0.125
2.75 0.25
2.75 0.375
2.75 0.5
2.75 0.625
2.75 0.75
2.75 0.875
2.75 1.0
2.875 0.0
2.875 0.125
2.875 0.25
2.875 0.375
2.875 0.5
2.875 0.625
2.875 0.75
2.875 0.875
2.875 1.0
3.0 0.0
3.0 0.125
3.0 0.25
3.0 0.375
3.0 0.5
3.0 0.625
3.0 0.75
3.0 0.875
3.0 1.0
3.125 0.0
3.125 0.125
3.125 0.25
3.125 0.375
3.125 0.5
3.125 0.625
3.125 0.75
3.125 0.875
3.125 1.0
3.25 0.0
3.25 0.25
3.25 0.5
3.25 0.75
3.25 1.0
3.5 0.0
3.5 0.5
3.5 1.0
4.0 0.0
4.0 0.5
4.0 1.0
4.5 0.0
4.5 0.5
4.5 1.0
5.0 0.0
5.0 0.5
5.0 1.0
5.5 0.0
5.5 0.5
5.5 1.0
6.0 0.0
6.0 0.5
6.0 1.0
CELLS:
3 1 0 9 1
3 1 1 9 10
3 1 1 10 2
3 1 2 10 11
3 1 2 11 3
3 1 3 11 12
3 1 3 12 4
3 1 4 12 13
3 1 4 13 5
3 1 5 13 14
3 1 5 14 6
3 1 6 14 15
3 1 6 15 7
3 1 7 15 16
3 1 7 16 8
3 1 8 16 17
3 1 9 18 10
3 1 10 18 19
3 1 10 19 11
3 1 11 19 20
3 1 11 20 12
3 1 12 20 21
3 1 12 21 13
3 1 13 21 22
3 1 13 22 14
3 1 14 22 23
3 1 14 23 15
3 1 15 23 24
3 1 15 24 16
3 1 16 24 25
3 1 16 25 17
3 1 17 25 26
3 1 18 27 19
3 1 19 27 28
3 1 19 28 20
3 1 20 28 29
3 1 20 29 21
3 1 21 29 30
3 1 21 30 22
3 1 22 30 31
3 1 22 31 23
3 1 23 31 32
3 1 23 32 24
3 1 24 32 33
3 1 24 33 25
3 1 25 33 34
3 1 25 34 26
3 1 26 34 35
3 1 27 36 28
3 1 28 36 37
3 1 28 37 29
3 1 29 37 38
3 1 29 38 30
3 1 30 38 39
3 1 30 39 31
3 1 31 39 40
3 1 31 40 32
3 1 32 40 41
3 1 32 41 33
3 1 33 41 42
3 1 33 42 34
3 1 34 42 43
3 1 34 43 35
3 1 35 43 44
3 1 36 45 37
3 1 37 45 46
3 1 37 46 38
3 1 38 46 47
3 1 38 47 39
3 1 39 47 48
3 1 39 48 40
3 1 40 48 49
3 1 40 49 41
3 1 41 49 50
3 1 41 50 42
3 1 42 50 51
3 1 42 51 43
3 1 43 51 52
3 1 43 52 44
3 1 44 52 53
3 1 45 54 46
3 1 46 54 55
3 1 46 55 47
3 1 47 55 56
3 1 47 56 48
3 1 48 56 57
3 1 48 57 49
3 1 49 57 58
3 1 49 58 50
3 1 50 58 59
3 1 50 59 51
3 1 51 59 60
3 1 51 60 52
3 1 52 60 61
3 1 52 61 53
3 1 53 61 62
3 1 54 63 55
3 1 55 63 64
3 1 55 64 56
3 1 56 64 65
3 1 56 65 57
3 1 57 65 66
3 1 57 66 58
3 1 58 66 67
3 1 58 67 59
3 1 59 67 68
3 1 59 68 60
3 1 60 68 69
3 1 60 69 61
3 1 61 69 70
3 1 61 70 62
3 1 62 70 71
3 1 63 72 64
3 1 64 72 73
3 1 64 73 65
3 1 65 73 74
3 1 65 74 66
3 1 66 74 75
3 1 66 75 67
3 1 67 75 76
3 1 67 76 68
3 1 68 76 77
3 1 68 77 69
3 1 69 77 78
3 1 69 78 70
3 1 70 78 79
3 1 70 79 71
3 1 71 79 80
3 1 72 81 73
3 1 73 81 82
3 1 73 82 74
3 1 74 82 83
3 1 74 83 75
3 1 75 83 84
3 1 75 84 76
3 1 76 84 85
3 1 76 85 77
3 1 77 85 86
3 1 77 86 78
3 1 78 86 87
3 1 78 87 79
3 1 79 87 88
3 1 79 88 80
3 1 80 88 89
3 1 81 90 82
3 1 82 90 91
3 1 82 91 83
3 1 83 91 92
3 1 83 92 84
3 1 84 92 93
3 1 84 93 85
3 1 85 93 94
3 1 85 94 86
3 1 86 94 95
3 1 86 95 87
3 1 87 95 96
3 1 87 96 88
3 1 88 96 97
3 1 88 97 89
3 1 89 97 98
3 1 90 99 91
3 1 91 99 100
3 1 91 100 92
3 1 92 100 101
3 1 92 101 93
3 1 93 101 102
3 1 93 102 94
3 1 94 102 103
3 1 94 103 95
3 1 95 103 104
3 1 95 104 96
3 1 96 104 105
3 1 96 105 97
3 1 97 105 106
3 1 97 106 98
3 1 98 106 107
3 1 99 108 100
3 1 100 108 109
3 1 100 109 101
3 1 101 109 110
3 1 101 110 102
3 1 102 110 111
3 1 102 111 103
3 1 103 111 112
3 1 103 112 104
3 1 104 112 113
3 1 104 113 105
3 1 105 113 114
3 1 105 114 106
3 1 106 114 115
3 1 106 115 107
3 1 107 115 116
3 1 108 117 109
3 1 109 117 118
3 1 109 118 110
3 1 110 118 119
3 1 110 119 111
3 1 111 119 120
3 1 111 120 112
3 1 112 120 121
3 1 112 121 113
3 1 113 121 122
3 1 113 122 114
3 1 114 122 123
3 1 114 123 115
3 1 115 123 124
3 1 115 124 116
3 1 116 124 125
3 1 117 126 118
3 1 118 126 127
3 1 118 127 119
3 1 119 127 128
3 1 119 128 120
3 1 120 128 129
3 1 120 129 121
3 1 121 129 130
3 1 121 130 122
3 1 122 130 131
3 1 122 131 123
3 1 123 131 132
3 1 123 132 124
3 1 124 132 133
3 1 124 133 125
3 1 125 133 134
3 1 126 135 127
3 1 127 135 136
3 1 127 136 128
3 1 128 136 137
3 1 128 137 129
3 1 129 137 138
3 1 129 138 130
3 1 130 138 139
3 1 130 139 131
3 1 131 139 140
3 1 131 140 132
3 1 132 140 141
3 1 132 141 133
3 1 133 141 142
3 1 133 142 134
3 1 134 142 143
3 1 135 144 136
3 1 136 144 145
3 1 136 145 137
3 1 137 145 146
3 1 137 146 138
3 1 138 146 147
3 1 138 147 139
3 1 139 147 148
3 1 139 148 140
3 1 140 148 149
3 1 140 149 141
3 1 141 149 150
3 1 141 150 142
3 1 142 150 151
3 1 142 151 143
3 1 143 151 152
3 1 144 153 145
3 1 145 153 154
3 1 145 154 146
3 1 146 154 155
3 1 146 155 147
3 1 147 155 156
3 1 147 156 148
3 1 148 156 157
3 1 148 157 149
3 1 149 157 158
3 1 149 158 150
3 1 150 158 159
3 1 150 159 151
3 1 151 159 160
3 1 151 160 152
3 1 152 160 161
3 1 153 162 154
3 1 154 162 163
3 1 154 163 155
3 1 155 163 164
3 1 155 164 156
3 1 156 164 165
3 1 156 165 157
3 1 157 165 166
3 1 157 166 158
3 1 158 166 167
3 1 158 167 159
3 1 159 167 168
3 1 159 168 160
3 1 160 168 169
3 1 160 169 161
3 1 161 169 170
3 1 162 171 163
3 1 163 171 172
3 1 163 172 164
3 1 164 172 173
3 1 164 173 165
3 1 165 173 174
3 1 165 174 166
3 1 166 174 175
3 1 166 175 167
3 1 167 175 176
3 1 167 176 168
3 1 168 176 177
3 1 168 177 169
3 1 169 177 178
3 1 169 178 170
3 1 170 178 179
3 1 171 180 172
3 1 172 180 181
3 1 172 181 173
3 1 173 181 182
3 1 173 182 174
3 1 174 182 183
3 1 174 183 175
3 1 175 183 184
3 1 175 184 176
3 1 176 184 185
3 1 176 185 177
3 1 177 185 186
3 1 177 186 178
3 1 178 186 187
3 1 178 187 179
3 1 179 187 188
3 1 180 189 181
3 1 181 189 190
3 1 181 190 182
3 1 182 190 191
3 1 182 191 183
3 1 183 191 192
3 1 183 192 184
3 1 184 192 193
3 1 184 193 185
3 1 185 193 194
3 1 185 194 186
3 1 186 194 195
3 1 186 195 187
3 1 187 195 196
3 1 187 196 188
3 1 188 196 197
3 1 189 198 190
3 1 190 198 199
3 1 190 199 191
3 1 191 199 200
3 1 191 200 192
3 1 192 200 201
3 1 192 201 193
3 1 193 201 202
3 1 193 202 194
3 1 194 202 203
3 1 194 203 195
3 1 195 203 204
3 1 195 204 196
3 1 196 204 205
3 1 196 205 197
3 1 197 205 206
3 1 198 207 199
3 1 199 207 208
3 1 199 208 200
3 1 200 208 209
3 1 200 209 201
3 1 201 209 210
3 1 201 210 202
3 1 202 210 211
3 1 202 211 203
3 1 203 211 212
3 1 203 212 204
3 1 204 212 213
3 1 204 213 205
3 1 205 213 214
3 1 205 214 206
3 1 206 214 215
3 1 207 216 208
3 1 208 216 217
3 1 208 217 209
3 1 209 217 218
3 1 209 218 210
3 1 210 218 219
3 1 210 219 211
3 1 211 219 220
3 1 211 220 212
3 1 212 220 221
3 1 212 221 213
3 1 213 221 222
3 1 213 222 214
3 1 214 222 223
3 1 214 223 215
3 1 215 223 224
3 1 216 225 217
3 1 217 225 226
3 1 217 226 218
3 1 218 226 227
3 1 218 227 219
3 1 219 227 228
3 1 219 228 220
3 1 220 228 229
3 1 220 229 221
3 1 221 229 230
3 1 221 230 222
3 1 222 230 231
3 1 222 231 223
3 1 223 231 232
3 1 223 232 224
3 1 224 232 233
3 1 225 234 226
3 1 226 234 235
3 1 226 235 227
3 1 227 235 228
3 1 228 235 236
3 1 228 236 229
3 1 229 236 230
3 1 230 236 237
3 1 230 237 231
3 1 231 237 232
3 1 232 237 238
3 1 232 238 233
3 1 234 239 235
3 1 235 239 240
3 1 235 240 236
3 1 236 240 237
3 1 237 240 241
3 1 237 241 238
3 1 239 242 240
3 1 240 242 243
3 1 240 243 241
3 1 241 243 244
3 1 242 245 243
3 1 243 245 246
3 1 243 246 244
3 1 244 246 247
3 1 245 248 246
3 1 246 248 249
3 1 246 249 247
3 1 247 249 250
3 1 248 251 249
3 1 249 251 252
3 1 249 252 250
3 1 250 252 253
3 1 251 254 252
3 1 252 254 255
3 1 252 255 253
3 1 253 255 256
FACES:
2 77 8 7
2 77 7 6
2 77 6 5
2 77 5 4
2 77 4 3
2 77 3 2
2 77 2 1
2 77 1 0
2 1 0 9
2 1 17 8
2 1 9 18
2 1 26 17
2 1 18 27
2 1 35 26
2 1 27 36
2 1 44 35
2 1 36 45
2 1 53 44
2 1 45 54
2 1 62 53
2 1 54 63
2 1 71 62
2 1 63 72
2 1 80 71
2 1 72 81
2 1 89 80
2 1 81 90
2 1 98 89
2 1 90 99
2 1 107 98
2 1 99 108
2 1 116 107
2 1 108 117
2 1 125 116
2 1 117 126
2 1 134 125
2 1 126 135
2 1 143 134
2 1 135 144
2 1 152 143
2 1 144 153
2 1 161 152
2 1 153 162
2 1 170 161
2 1 162 171
2 1 179 170
2 1 171 180
2 1 188 179
2 1 180 189
2 1 197 188
2 1 189 198
2 1 206 197
2 1 198 207
2 1 215 206
2 1 207 216
2 1 224 215
2 1 216 225
2 1 233 224
2 1 225 234
2 1 238 233
2 1 234 239
2 1 241 238
2 1 239 242
2 1 244 241
2 1 242 245
2 1 247 244
2 1 245 248
2 1 250 247
2 1 248 251
2 1 253 250
2 1 251 254
2 1 256 253
2 1 254 255
2 1 255 256