POINTS:
0.0 0.125
0.0 0.1875
0.0 0.25
0.0 0.375
0.0 0.5
0.0 0.625
0.0 0.75
0.0 1.0
0.0625 0.125
0.0625 0.1875
0.0625 0.25
0.0625 0.3125
0.125 0.125
0.125 0.1875
0.125 0.25
0.125 0.3125
0.125 0.375
0.125 0.5
0.125 0.625
0.15625 0.125
0.15625 0.15625
0.15625 0.1875
0.15625 0.21875
0.1875 0.125
0.1875 0.140625
0.1875 0.15625
0.1875 0.1875
0.1875 0.21875
0.1875 0.25
0.1875 0.3125
0.21875 0.125
0.21875 0.140625
0.21875 0.15625
0.21875 0.1875
0.21875 0.21875
0.25 0.125
0.25 0.140625
0.25 0.15625
0.25 0.1875
0.25 0.21875
0.25 0.25
0.25 0.3125
0.25 0.375
0.25 0.5
0.25 0.625
0.25 0.75
0.25 1.0
0.28125 0.109375
0.28125 0.125
0.28125 0.140625
0.28125 0.15625
0.28125 0.1875
0.28125 0.21875
0.3125 0.09375
0.3125 0.109375
0.3125 0.125
0.3125 0.140625
0.3125 0.15625
0.3125 0.1875
0.3125 0.21875
0.3125 0.25
0.3125 0.3125
0.34375 0.078125
0.34375 0.09375
0.34375 0.125
0.34375 0.15625
0.34375 0.1875
0.34375 0.21875
0.375 0.0625
0.375 0.09375
0.375 0.125
0.375 0.1875
0.375 0.25
0.375 0.3125
0.375 0.375
0.375 0.5
0.375 0.625
0.4375 0.03125
0.4375 0.0625
0.4375 0.125
0.4375 0.1875
0.4375 0.25
0.4375 0.3125
0.5 0.0
0.5 0.0625
0.5 0.125
0.5 0.25
0.5 0.375
0.5 0.5
0.5 0.625
0.5 0.75
0.5 1.0
0.5625 0.0
0.5625 0.0625
0.625 0.0
0.625 0.125
0.625 0.25
0.625 0.375
0.625 0.5
0.625 0.625
0.75 0.0
0.75 0.25
0.75 0.5
0.75 0.75
0.75 1.0
1.0 0.0
1.0 0.25
1.0 0.5
1.0 0.75
1.0 1.0
1.25 0.0
1.25 0.25
1.25 0.5
1.25 0.75
1.25 1.0
1.5 0.0
1.5 0.25
1.5 0.5
1.5 0.75
1.5 1.0
1.75 0.0
1.75 0.25
1.75 0.5
1.75 0.75
1.75 1.0
2.0 0.0
2.0 0.25
2.0 0.5
2.0 0.75
2.0 1.0
2.25 0.0
2.25 0.25
2.25 0.5
2.25 0.75
2.25 1.0
2.5 0.0
2.5 0.25
2.5 0.5
2.5 0.75
2.5 1.0
2.75 0.0
2.75 0.25
2.75 0.5
2.75 0.75
2.75 1.0
3.0 0.0
3.0 0.25
3.0 0.5
3.0 0.75
3.0 1.0
-0.0625 0.125
-0.0625 0.1875
-0.0625 0.25
-0.0625 0.3125
-0.125 0.125
-0.125 0.1875
-0.125 0.25
-0.125 0.3125
-0.125 0.375
-0.125 0.5
-0.125 0.625
-0.15625 0.125
-0.15625 0.15625
-0.15625 0.1875
-0.15625 0.21875
-0.1875 0.125
-0.1875 0.140625
-0.1875 0.15625
-0.1875 0.1875
-0.1875 0.21875
-0.1875 0.25
-0.1875 0.3125
-0.21875 0.125
-0.21875 0.140625
-0.21875 0.15625
-0.21875 0.1875
-0.21875 0.21875
-0.25 0.125
-0.25 0.140625
-0.25 0.15625
-0.25 0.1875
-0.25 0.21875
-0.25 0.25
-0.25 0.3125
-0.25 0.375
-0.25 0.5
-0.25 0.625
-0.25 0.75
-0.25 1.0
-0.28125 0.109375
-0.28125 0.125
-0.28125 0.140625
-0.28125 0.15625
-0.28125 0.1875
-0.28125 0.21875
-0.3125 0.09375
-0.3125 0.109375
-0.3125 0.125
-0.3125 0.140625
-0.3125 0.15625
-0.3125 0.1875
-0.3125 0.21875
-0.3125 0.25
-0.3125 0.3125
-0.34375 0.078125
-0.34375 0.09375
-0.34375 0.125
-0.34375 0.15625
-0.34375 0.1875
-0.34375 0.21875
-0.375 0.0625
-0.375 0.09375
-0.375 0.125
-0.375 0.1875
-0.375 0.25
-0.375 0.3125
-0.375 0.375
-0.375 0.5
-0.375 0.625
-0.4375 0.03125
-0.4375 0.0625
-0.4375 0.125
-0.4375 0.1875
-0.4375 0.25
-0.4375 0.3125
-0.5 0.0
-0.5 0.0625
-0.5 0.125
-0.5 0.25
-0.5 0.375
-0.5 0.5
-0.5 0.625
-0.5 0.75
-0.5 1.0
-0.5625 0.0
-0.5625 0.0625
-0.625 0.0
-0.625 0.125
-0.625 0.25
-0.625 0.375
-0.625 0.5
-0.625 0.625
-0.75 0.0
-0.75 0.25
-0.75 0.5
-0.75 0.75
-0.75 1.0
-1.0 0.0
-1.0 0.25
-1.0 0.5
-1.0 0.75
-1.0 1.0
-1.25 0.0
-1.25 0.25
-1.25 0.5
-1.25 0.75
-1.25 1.0
-1.5 0.0
-1.5 0.25
-1.5 0.5
-1.5 0.75
-1.5 1.0
-1.75 0.0
-1.75 0.25
-1.75 0.5
-1.75 0.75
-1.75 1.0
-2.0 0.0
-2.0 0.25
-2.0 0.5
-2.0 0.75
-2.0 1.0
-2.25 0.0
-2.25 0.25
-2.25 0.5
-2.25 0.75
-2.25 1.0
-2.5 0.0
-2.5 0.25
-2.5 0.5
-2.5 0.75
-2.5 1.0
-2.75 0.0
-2.75 0.25
-2.75 0.5
-2.75 0.75
-2.75 1.0
-3.0 0.0
-3.0 0.25
-3.0 0.5
-3.0 0.75
-3.0 1.0
CELLS:
3 0 0 8 1
3 0 1 8 9
3 0 1 9 2
3 0 2 9 10
3 0 2 10 11
3 0 2 11 3
3 0 3 11 16
3 0 8 12 9
3 0 9 12 13
3 0 9 13 10
3 0 10 13 14
3 0 10 14 11
3 0 11 14 15
3 0 11 15 16
3 0 3 16 4
3 0 4 16 17
3 0 4 17 5
3 0 5 17 18
3 0 5 18 6
3 0 6 18 45
3 0 12 19 20
3 0 12 20 13
3 0 13 20 21
3 0 13 21 22
3 0 13 22 14
3 0 14 22 28
3 0 19 23 24
3 0 19 24 20
3 0 20 24 25
3 0 20 25 21
3 0 21 25 26
3 0 21 26 22
3 0 22 26 27
3 0 22 27 28
3 0 14 28 15
3 0 15 28 29
3 0 15 29 16
3 0 16 29 42
3 0 23 30 24
3 0 24 30 31
3 0 24 31 25
3 0 25 31 32
3 0 25 32 26
3 0 26 32 33
3 0 26 33 27
3 0 27 33 34
3 0 27 34 28
3 0 28 34 40
3 0 30 35 31
3 0 31 35 36
3 0 31 36 32
3 0 32 36 37
3 0 32 37 33
3 0 33 37 38
3 0 33 38 34
3 0 34 38 39
3 0 34 39 40
3 0 28 40 29
3 0 29 40 41
3 0 29 41 42
3 0 16 42 17
3 0 17 42 43
3 0 17 43 18
3 0 18 43 44
3 0 18 44 45
3 0 6 45 7
3 0 7 45 46
3 0 35 47 48
3 0 35 48 36
3 0 36 48 49
3 0 36 49 37
3 0 37 49 50
3 0 37 50 38
3 0 38 50 51
3 0 38 51 39
3 0 39 51 52
3 0 39 52 40
3 0 40 52 60
3 0 47 53 54
3 0 47 54 48
3 0 48 54 55
3 0 48 55 49
3 0 49 55 56
3 0 49 56 50
3 0 50 56 57
3 0 50 57 51
3 0 51 57 58
3 0 51 58 52
3 0 52 58 59
3 0 52 59 60
3 0 40 60 41
3 0 41 60 61
3 0 41 61 42
3 0 42 61 74
3 0 53 62 63
3 0 53 63 54
3 0 54 63 64
3 0 54 64 55
3 0 55 64 56
3 0 56 64 65
3 0 56 65 57
3 0 57 65 58
3 0 58 65 66
3 0 58 66 67
3 0 58 67 59
3 0 59 67 60
3 0 60 67 72
3 0 62 68 69
3 0 62 69 63
3 0 63 69 70
3 0 63 70 64
3 0 64 70 65
3 0 65 70 71
3 0 65 71 66
3 0 66 71 67
3 0 67 71 72
3 0 60 72 61
3 0 61 72 73
3 0 61 73 74
3 0 42 74 43
3 0 43 74 75
3 0 43 75 44
3 0 44 75 76
3 0 44 76 45
3 0 45 76 90
3 0 68 77 78
3 0 68 78 69
3 0 69 78 79
3 0 69 79 70
3 0 70 79 71
3 0 71 79 80
3 0 71 80 72
3 0 72 80 81
3 0 72 81 82
3 0 72 82 73
3 0 73 82 74
3 0 74 82 87
3 0 77 83 84
3 0 77 84 78
3 0 78 84 79
3 0 79 84 85
3 0 79 85 80
3 0 80 85 86
3 0 80 86 81
3 0 81 86 82
3 0 82 86 87
3 0 74 87 75
3 0 75 87 88
3 0 75 88 76
3 0 76 88 89
3 0 76 89 90
3 0 45 90 46
3 0 46 90 91
3 0 83 92 93
3 0 83 93 84
3 0 84 93 85
3 0 85 93 95
3 0 92 94 93
3 0 93 94 95
3 0 85 95 86
3 0 86 95 96
3 0 86 96 87
3 0 87 96 97
3 0 87 97 88
3 0 88 97 98
3 0 88 98 99
3 0 88 99 89
3 0 89 99 90
3 0 90 99 103
3 0 94 100 95
3 0 95 100 101
3 0 95 101 96
3 0 96 101 97
3 0 97 101 102
3 0 97 102 98
3 0 98 102 99
3 0 99 102 103
3 0 90 103 91
3 0 91 103 104
3 0 100 105 101
3 0 101 105 106
3 0 101 106 102
3 0 102 106 107
3 0 102 107 103
3 0 103 107 108
3 0 103 108 104
3 0 104 108 109
3 0 105 110 106
3 0 106 110 111
3 0 106 111 107
3 0 107 111 112
3 0 107 112 108
3 0 108 112 113
3 0 108 113 109
3 0 109 113 114
3 0 110 115 111
3 0 111 115 116
3 0 111 116 112
3 0 112 116 117
3 0 112 117 113
3 0 113 117 118
3 0 113 118 114
3 0 114 118 119
3 0 115 120 116
3 0 116 120 121
3 0 116 121 117
3 0 117 121 122
3 0 117 122 118
3 0 118 122 123
3 0 118 123 119
3 0 119 123 124
3 0 120 125 121
3 0 121 125 126
3 0 121 126 122
3 0 122 126 127
3 0 122 127 123
3 0 123 127 128
3 0 123 128 124
3 0 124 128 129
3 0 125 130 126
3 0 126 130 131
3 0 126 131 127
3 0 127 131 132
3 0 127 132 128
3 0 128 132 133
3 0 128 133 129
3 0 129 133 134
3 0 130 135 131
3 0 131 135 136
3 0 131 136 132
3 0 132 136 137
3 0 132 137 133
3 0 133 137 138
3 0 133 138 134
3 0 134 138 139
3 0 135 140 136
3 0 136 140 141
3 0 136 141 137
3 0 137 141 142
3 0 137 142 138
3 0 138 142 143
3 0 138 143 139
3 0 139 143 144
3 0 140 145 141
3 0 141 145 146
3 0 141 146 142
3 0 142 146 147
3 0 142 147 143
3 0 143 147 148
3 0 143 148 144
3 0 144 148 149
3 0 150 0 1
3 0 150 1 151
3 0 151 1 2
3 0 151 2 152
3 0 152 2 153
3 0 153 2 3
3 0 153 3 158
3 0 154 150 151
3 0 154 151 155
3 0 155 151 152
3 0 155 152 156
3 0 156 152 153
3 0 156 153 157
3 0 157 153 158
3 0 158 3 4
3 0 158 4 159
3 0 159 4 5
3 0 159 5 160
3 0 160 5 6
3 0 160 6 187
3 0 161 154 162
3 0 162 154 155
3 0 162 155 163
3 0 163 155 164
3 0 164 155 156
3 0 164 156 170
3 0 165 161 166
3 0 166 161 162
3 0 166 162 167
3 0 167 162 163
3 0 167 163 168
3 0 168 163 164
3 0 168 164 169
3 0 169 164 170
3 0 170 156 157
3 0 170 157 171
3 0 171 157 158
3 0 171 158 184
3 0 172 165 166
3 0 172 166 173
3 0 173 166 167
3 0 173 167 174
3 0 174 167 168
3 0 174 168 175
3 0 175 168 169
3 0 175 169 176
3 0 176 169 170
3 0 176 170 182
3 0 177 172 173
3 0 177 173 178
3 0 178 173 174
3 0 178 174 179
3 0 179 174 175
3 0 179 175 180
3 0 180 175 176
3 0 180 176 181
3 0 181 176 182
3 0 182 170 171
3 0 182 171 183
3 0 183 171 184
3 0 184 158 159
3 0 184 159 185
3 0 185 159 160
3 0 185 160 186
3 0 186 160 187
3 0 187 6 7
3 0 187 7 188
3 0 189 177 190
3 0 190 177 178
3 0 190 178 191
3 0 191 178 179
3 0 191 179 192
3 0 192 179 180
3 0 192 180 193
3 0 193 180 181
3 0 193 181 194
3 0 194 181 182
3 0 194 182 202
3 0 195 189 196
3 0 196 189 190
3 0 196 190 197
3 0 197 190 191
3 0 197 191 198
3 0 198 191 192
3 0 198 192 199
3 0 199 192 193
3 0 199 193 200
3 0 200 193 194
3 0 200 194 201
3 0 201 194 202
3 0 202 182 183
3 0 202 183 203
3 0 203 183 184
3 0 203 184 216
3 0 204 195 205
3 0 205 195 196
3 0 205 196 206
3 0 206 196 197
3 0 206 197 198
3 0 206 198 207
3 0 207 198 199
3 0 207 199 200
3 0 207 200 208
3 0 208 200 209
3 0 209 200 201
3 0 209 201 202
3 0 209 202 214
3 0 210 204 211
3 0 211 204 205
3 0 211 205 212
3 0 212 205 206
3 0 212 206 207
3 0 212 207 213
3 0 213 207 208
3 0 213 208 209
3 0 213 209 214
3 0 214 202 203
3 0 214 203 215
3 0 215 203 216
3 0 216 184 185
3 0 216 185 217
3 0 217 185 186
3 0 217 186 218
3 0 218 186 187
3 0 218 187 232
3 0 219 210 220
3 0 220 210 211
3 0 220 211 221
3 0 221 211 212
3 0 221 212 213
3 0 221 213 222
3 0 222 213 214
3 0 222 214 223
3 0 223 214 224
3 0 224 214 215
3 0 224 215 216
3 0 224 216 229
3 0 225 219 226
3 0 226 219 220
3 0 226 220 221
3 0 226 221 227
3 0 227 221 222
3 0 227 222 228
3 0 228 222 223
3 0 228 223 224
3 0 228 224 229
3 0 229 216 217
3 0 229 217 230
3 0 230 217 218
3 0 230 218 231
3 0 231 218 232
3 0 232 187 188
3 0 232 188 233
3 0 234 225 235
3 0 235 225 226
3 0 235 226 227
3 0 235 227 237
3 0 236 234 235
3 0 236 235 237
3 0 237 227 228
3 0 237 228 238
3 0 238 228 229
3 0 238 229 239
3 0 239 229 230
3 0 239 230 240
3 0 240 230 241
3 0 241 230 231
3 0 241 231 232
3 0 241 232 245
3 0 242 236 237
3 0 242 237 243
3 0 243 237 238
3 0 243 238 239
3 0 243 239 244
3 0 244 239 240
3 0 244 240 241
3 0 244 241 245
3 0 245 232 233
3 0 245 233 246
3 0 247 242 243
3 0 247 243 248
3 0 248 243 244
3 0 248 244 249
3 0 249 244 245
3 0 249 245 250
3 0 250 245 246
3 0 250 246 251
3 0 252 247 248
3 0 252 248 253
3 0 253 248 249
3 0 253 249 254
3 0 254 249 250
3 0 254 250 255
3 0 255 250 251
3 0 255 251 256
3 0 257 252 253
3 0 257 253 258
3 0 258 253 254
3 0 258 254 259
3 0 259 254 255
3 0 259 255 260
3 0 260 255 256
3 0 260 256 261
3 0 262 257 258
3 0 262 258 263
3 0 263 258 259
3 0 263 259 264
3 0 264 259 260
3 0 264 260 265
3 0 265 260 261
3 0 265 261 266
3 0 267 262 263
3 0 267 263 268
3 0 268 263 264
3 0 268 264 269
3 0 269 264 265
3 0 269 265 270
3 0 270 265 266
3 0 270 266 271
3 0 272 267 268
3 0 272 268 273
3 0 273 268 269
3 0 273 269 274
3 0 274 269 270
3 0 274 270 275
3 0 275 270 271
3 0 275 271 276
3 0 277 272 273
3 0 277 273 278
3 0 278 273 274
3 0 278 274 279
3 0 279 274 275
3 0 279 275 280
3 0 280 275 276
3 0 280 276 281
3 0 282 277 278
3 0 282 278 283
3 0 283 278 279
3 0 283 279 284
3 0 284 279 280
3 0 284 280 285
3 0 285 280 281
3 0 285 281 286
3 0 287 282 283
3 0 287 283 288
3 0 288 283 284
3 0 288 284 289
3 0 289 284 285
3 0 289 285 290
3 0 290 285 286
3 0 290 286 291
FACES:
2 1 149 144
2 1 144 139
2 1 139 134
2 1 134 129
2 1 129 124
2 1 124 119
2 1 119 114
2 1 114 109
2 1 109 104
2 1 104 91
2 1 91 46
2 1 46 7
2 10 0 8
2 10 8 12
2 10 12 19
2 10 19 23
2 10 23 30
2 10 30 35
2 10 35 47
2 10 47 53
2 10 53 62
2 10 62 68
2 10 68 77
2 10 77 83
2 1 83 92
2 1 92 94
2 1 94 100
2 1 100 105
2 1 105 110
2 1 110 115
2 1 115 120
2 1 120 125
2 1 125 130
2 1 130 135
2 1 135 140
2 1 140 145
2 1 145 146
2 1 146 147
2 1 147 148
2 1 148 149
2 1 286 291
2 1 281 286
2 1 276 281
2 1 271 276
2 1 266 271
2 1 261 266
2 1 256 261
2 1 251 256
2 1 246 251
2 1 233 246
2 1 188 233
2 1 7 188
2 10 150 0
2 10 154 150
2 10 161 154
2 10 165 161
2 10 172 165
2 10 177 172
2 10 189 177
2 10 195 189
2 10 204 195
2 10 210 204
2 10 219 210
2 10 225 219
2 1 234 225
2 1 236 234
2 1 242 236
2 1 247 242
2 1 252 247
2 1 257 252
2 1 262 257
2 1 267 262
2 1 272 267
2 1 277 272
2 1 282 277
2 1 287 282
2 1 288 287
2 1 289 288
2 1 290 289
2 1 291 290