POINTS:
0.0 0.25
0.0 0.3125
0.0 0.375
0.0 0.5
0.0 0.625
0.0 0.6875
0.0 0.75
0.0 0.8125
0.0 0.84375
0.0 0.875
0.03125 0.84375
0.03125 0.875
0.0625 0.25
0.0625 0.3125
0.0625 0.375
0.0625 0.4375
0.0625 0.6875
0.0625 0.75
0.0625 0.8125
0.0625 0.84375
0.0625 0.875
0.09375 0.78125
0.09375 0.8125
0.09375 0.84375
0.09375 0.875
0.109375 0.859375
0.109375 0.875
0.125 0.25
0.125 0.3125
0.125 0.375
0.125 0.4375
0.125 0.5
0.125 0.625
0.125 0.6875
0.125 0.75
0.125 0.78125
0.125 0.8125
0.125 0.84375
0.125 0.859375
0.125 0.875
0.125 0.890625
0.125 0.90625
0.125 0.9375
0.125 0.96875
0.125 1.0
0.140625 0.859375
0.140625 0.875
0.140625 0.890625
0.15625 0.25
0.15625 0.28125
0.15625 0.3125
0.15625 0.34375
0.15625 0.78125
0.15625 0.8125
0.15625 0.84375
0.15625 0.875
0.15625 0.90625
0.15625 0.9375
0.15625 0.96875
0.1875 0.25
0.1875 0.28125
0.1875 0.3125
0.1875 0.34375
0.1875 0.375
0.1875 0.4375
0.1875 0.6875
0.1875 0.75
0.1875 0.78125
0.1875 0.8125
0.1875 0.84375
0.1875 0.875
0.1875 0.90625
0.1875 0.9375
0.1875 1.0
0.21875 0.25
0.21875 0.28125
0.21875 0.3125
0.21875 0.34375
0.21875 0.78125
0.21875 0.8125
0.21875 0.84375
0.21875 0.875
0.21875 0.90625
0.25 0.25
0.25 0.28125
0.25 0.3125
0.25 0.34375
0.25 0.375
0.25 0.4375
0.25 0.5
0.25 0.625
0.25 0.6875
0.25 0.75
0.25 0.8125
0.25 0.875
0.25 0.9375
0.25 1.0
0.28125 0.21875
0.28125 0.25
0.28125 0.28125
0.28125 0.3125
0.28125 0.34375
0.3125 0.1875
0.3125 0.21875
0.3125 0.25
0.3125 0.28125
0.3125 0.3125
0.3125 0.34375
0.3125 0.375
0.3125 0.4375
0.3125 0.6875
0.3125 0.75
0.3125 0.8125
0.3125 0.875
0.3125 0.9375
0.3125 1.0
0.34375 0.15625
0.34375 0.1875
0.34375 0.21875
0.34375 0.25
0.34375 0.28125
0.34375 0.3125
0.34375 0.34375
0.375 0.125
0.375 0.1875
0.375 0.25
0.375 0.3125
0.375 0.375
0.375 0.5
0.375 0.625
0.375 0.75
0.375 0.875
0.375 1.0
0.4375 0.0625
0.4375 0.125
0.4375 0.1875
0.4375 0.25
0.4375 0.3125
0.5 0.0
0.5 0.0625
0.5 0.125
0.5 0.25
0.5 0.375
0.5 0.5
0.5 0.625
0.5 0.75
0.5 1.0
0.5625 0.0
0.5625 0.0625
0.625 0.0
0.625 0.125
0.625 0.25
0.625 0.375
0.625 0.5
0.625 0.625
0.75 0.0
0.75 0.25
0.75 0.5
0.75 0.75
0.75 1.0
1.0 0.0
1.0 0.25
1.0 0.5
1.0 0.75
1.0 1.0
1.25 0.0
1.25 0.25
1.25 0.5
1.25 0.75
1.25 1.0
1.5 0.0
1.5 0.25
1.5 0.5
1.5 0.75
1.5 1.0
1.75 0.0
1.75 0.25
1.75 0.5
1.75 0.75
1.75 1.0
2.0 0.0
2.0 0.25
2.0 0.5
2.0 0.75
2.0 1.0
2.25 0.0
2.25 0.25
2.25 0.5
2.25 0.75
2.25 1.0
2.5 0.0
2.5 0.25
2.5 0.5
2.5 0.75
2.5 1.0
2.75 0.0
2.75 0.25
2.75 0.5
2.75 0.75
2.75 1.0
3.0 0.0
3.0 0.25
3.0 0.5
3.0 0.75
3.0 1.0
CELLS:
3 0 0 12 1
3 0 1 12 13
3 0 12 27 13
3 0 13 27 28
3 0 1 13 2
3 0 2 13 14
3 0 13 28 14
3 0 14 28 29
3 0 2 14 15
3 0 14 29 15
3 0 15 29 30
3 0 15 30 31
3 0 15 31 3
3 0 2 15 3
3 0 3 31 4
3 0 4 31 32
3 0 4 32 16
3 0 4 16 5
3 0 16 32 33
3 0 5 16 6
3 0 6 16 17
3 0 16 33 17
3 0 17 33 34
3 0 6 17 7
3 0 7 17 18
3 0 17 34 21
3 0 21 34 35
3 0 21 35 22
3 0 22 35 36
3 0 18 21 22
3 0 17 21 18
3 0 7 10 8
3 0 7 18 10
3 0 10 18 19
3 0 8 10 9
3 0 9 10 11
3 0 10 19 11
3 0 11 19 20
3 0 18 22 19
3 0 19 22 23
3 0 22 36 23
3 0 23 36 37
3 0 19 23 20
3 0 20 23 24
3 0 23 37 25
3 0 25 37 38
3 0 25 38 39
3 0 25 39 26
3 0 24 25 26
3 0 23 25 24
3 0 27 48 49
3 0 48 59 49
3 0 49 59 60
3 0 59 74 60
3 0 60 74 75
3 0 74 83 75
3 0 75 83 84
3 0 27 49 28
3 0 28 49 50
3 0 49 60 50
3 0 50 60 61
3 0 60 75 61
3 0 61 75 76
3 0 75 84 76
3 0 76 84 85
3 0 28 50 51
3 0 50 61 51
3 0 51 61 62
3 0 61 76 62
3 0 62 76 77
3 0 76 85 77
3 0 77 85 86
3 0 28 51 29
3 0 29 51 63
3 0 51 62 63
3 0 62 77 63
3 0 63 77 87
3 0 77 86 87
3 0 29 63 30
3 0 30 63 64
3 0 63 87 64
3 0 64 87 88
3 0 30 64 31
3 0 31 64 89
3 0 64 88 89
3 0 31 89 32
3 0 32 89 90
3 0 32 65 33
3 0 32 90 65
3 0 65 90 91
3 0 33 65 34
3 0 34 65 66
3 0 65 91 66
3 0 66 91 92
3 0 34 52 35
3 0 34 66 52
3 0 52 66 67
3 0 66 78 67
3 0 66 92 78
3 0 78 92 93
3 0 35 52 36
3 0 36 52 53
3 0 52 67 53
3 0 53 67 68
3 0 67 78 68
3 0 68 78 79
3 0 78 93 79
3 0 36 53 37
3 0 37 53 54
3 0 53 68 54
3 0 54 68 69
3 0 68 79 69
3 0 69 79 80
3 0 79 93 80
3 0 80 93 94
3 0 37 54 45
3 0 45 54 55
3 0 45 55 46
3 0 39 45 46
3 0 38 45 39
3 0 37 45 38
3 0 54 69 55
3 0 55 69 70
3 0 69 80 70
3 0 70 80 81
3 0 80 94 81
3 0 39 46 47
3 0 46 55 47
3 0 47 55 56
3 0 47 56 41
3 0 40 47 41
3 0 39 47 40
3 0 55 70 56
3 0 56 70 71
3 0 70 81 71
3 0 71 81 82
3 0 81 94 82
3 0 82 94 95
3 0 41 56 42
3 0 42 56 57
3 0 56 71 57
3 0 57 71 72
3 0 71 82 72
3 0 72 82 95
3 0 42 57 43
3 0 43 57 58
3 0 57 72 58
3 0 58 72 73
3 0 43 58 44
3 0 44 58 73
3 0 72 95 73
3 0 73 95 96
3 0 116 123 124
3 0 102 116 117
3 0 116 124 117
3 0 97 102 103
3 0 102 117 103
3 0 103 117 118
3 0 117 124 118
3 0 118 124 125
3 0 83 97 98
3 0 97 103 98
3 0 98 103 104
3 0 103 118 104
3 0 104 118 119
3 0 118 125 119
3 0 83 98 84
3 0 84 98 99
3 0 98 104 99
3 0 99 104 105
3 0 104 119 105
3 0 105 119 120
3 0 119 125 120
3 0 120 125 126
3 0 84 99 85
3 0 85 99 100
3 0 99 105 100
3 0 100 105 106
3 0 105 120 106
3 0 106 120 121
3 0 120 126 121
3 0 85 100 86
3 0 86 100 101
3 0 100 106 101
3 0 101 106 107
3 0 106 121 107
3 0 107 121 122
3 0 121 126 122
3 0 122 126 127
3 0 86 101 87
3 0 87 101 108
3 0 101 107 108
3 0 107 122 108
3 0 108 122 127
3 0 87 108 88
3 0 88 108 109
3 0 108 127 109
3 0 109 127 128
3 0 89 109 128
3 0 88 109 89
3 0 89 128 90
3 0 90 128 129
3 0 90 129 110
3 0 110 129 130
3 0 110 130 111
3 0 92 110 111
3 0 91 110 92
3 0 90 110 91
3 0 92 111 93
3 0 93 111 112
3 0 111 130 112
3 0 112 130 131
3 0 93 112 94
3 0 94 112 113
3 0 112 131 113
3 0 94 113 95
3 0 95 113 114
3 0 113 131 114
3 0 114 131 132
3 0 95 114 96
3 0 96 114 115
3 0 114 132 115
3 0 133 138 139
3 0 123 133 134
3 0 133 139 134
3 0 134 139 140
3 0 123 134 124
3 0 124 134 135
3 0 134 140 135
3 0 135 140 141
3 0 124 135 125
3 0 125 135 136
3 0 135 141 136
3 0 125 136 126
3 0 126 136 137
3 0 136 141 137
3 0 137 141 142
3 0 126 137 127
3 0 127 137 142
3 0 127 142 128
3 0 128 142 143
3 0 128 143 129
3 0 129 143 144
3 0 129 144 130
3 0 130 144 145
3 0 130 145 131
3 0 131 145 146
3 0 131 146 132
3 0 138 147 139
3 0 139 147 148
3 0 147 149 148
3 0 148 149 150
3 0 139 148 140
3 0 140 148 150
3 0 149 155 150
3 0 150 155 156
3 0 140 150 141
3 0 141 150 151
3 0 150 156 151
3 0 141 151 142
3 0 142 151 152
3 0 151 156 152
3 0 152 156 157
3 0 142 152 143
3 0 143 152 153
3 0 152 157 153
3 0 143 153 144
3 0 144 153 154
3 0 153 157 154
3 0 154 157 158
3 0 144 154 145
3 0 145 154 158
3 0 145 159 146
3 0 145 158 159
3 0 155 160 156
3 0 156 160 161
3 0 156 161 157
3 0 157 161 162
3 0 157 163 158
3 0 157 162 163
3 0 158 164 159
3 0 158 163 164
3 0 160 165 161
3 0 161 165 166
3 0 161 166 162
3 0 162 166 167
3 0 162 168 163
3 0 162 167 168
3 0 163 169 164
3 0 163 168 169
3 0 165 170 166
3 0 166 170 171
3 0 166 171 167
3 0 167 171 172
3 0 167 173 168
3 0 167 172 173
3 0 168 174 169
3 0 168 173 174
3 0 170 175 171
3 0 171 175 176
3 0 171 176 172
3 0 172 176 177
3 0 172 178 173
3 0 172 177 178
3 0 173 179 174
3 0 173 178 179
3 0 175 180 176
3 0 176 180 181
3 0 176 181 177
3 0 177 181 182
3 0 177 183 178
3 0 177 182 183
3 0 178 184 179
3 0 178 183 184
3 0 180 185 181
3 0 181 185 186
3 0 181 186 182
3 0 182 186 187
3 0 182 188 183
3 0 182 187 188
3 0 183 189 184
3 0 183 188 189
3 0 185 190 186
3 0 186 190 191
3 0 186 191 187
3 0 187 191 192
3 0 187 193 188
3 0 187 192 193
3 0 188 194 189
3 0 188 193 194
3 0 190 195 191
3 0 191 195 196
3 0 191 196 192
3 0 192 196 197
3 0 192 198 193
3 0 192 197 198
3 0 193 199 194
3 0 193 198 199
3 0 195 200 196
3 0 196 200 201
3 0 196 201 197
3 0 197 201 202
3 0 197 203 198
3 0 197 202 203
3 0 198 204 199
3 0 198 203 204
FACES:
2 77 9 8
2 77 8 7
2 77 7 6
2 77 6 5
2 77 5 4
2 77 4 3
2 77 3 2
2 77 2 1
2 77 1 0
2 1 0 12
2 1 12 27
2 1 27 48
2 1 48 59
2 1 59 74
2 1 74 83
2 1 83 97
2 1 97 102
2 1 102 116
2 1 116 123
2 1 123 133
2 1 133 147
2 1 147 149
2 1 149 155
2 1 155 160
2 1 160 165
2 1 165 170
2 1 170 175
2 1 175 180
2 1 180 185
2 1 185 190
2 1 190 195
2 1 195 200
2 1 200 201
2 1 201 202
2 1 202 203
2 1 203 204
2 1 204 199
2 1 199 194
2 1 194 189
2 1 189 184
2 1 184 179
2 1 179 174
2 1 174 169
2 1 169 164
2 1 164 159
2 1 159 146
2 1 146 132
2 1 132 115
2 1 115 96
2 1 96 73
2 1 73 44
2 1 44 43
2 1 43 42
2 1 42 41
2 1 41 40
2 1 40 39
2 1 39 26
2 1 26 24
2 1 24 20
2 1 20 11
2 1 11 9
