POINTS:
0.0 0.0
0.0 0.125
0.0 0.1875
0.0 0.25
0.0 0.3125
0.0 0.34375
0.0 0.375
0.0 0.625
0.0 0.65625
0.0 0.6875
0.0 0.75
0.0 0.8125
0.0 0.875
0.0 1.0
0.03125 0.34375
0.03125 0.375
0.03125 0.625
0.03125 0.65625
0.0625 0.1875
0.0625 0.25
0.0625 0.3125
0.0625 0.34375
0.0625 0.375
0.0625 0.625
0.0625 0.65625
0.0625 0.6875
0.0625 0.75
0.0625 0.8125
0.09375 0.28125
0.09375 0.3125
0.09375 0.34375
0.09375 0.375
0.09375 0.625
0.09375 0.65625
0.09375 0.6875
0.09375 0.71875
0.109375 0.359375
0.109375 0.375
0.109375 0.625
0.109375 0.640625
0.125 0.0
0.125 0.125
0.125 0.1875
0.125 0.25
0.125 0.28125
0.125 0.3125
0.125 0.34375
0.125 0.359375
0.125 0.375
0.125 0.390625
0.125 0.40625
0.125 0.4375
0.125 0.46875
0.125 0.5
0.125 0.53125
0.125 0.5625
0.125 0.59375
0.125 0.609375
0.125 0.625
0.125 0.640625
0.125 0.65625
0.125 0.6875
0.125 0.71875
0.125 0.75
0.125 0.8125
0.125 0.875
0.125 1.0
0.140625 0.359375
0.140625 0.375
0.140625 0.390625
0.140625 0.609375
0.140625 0.625
0.140625 0.640625
0.15625 0.28125
0.15625 0.3125
0.15625 0.34375
0.15625 0.375
0.15625 0.40625
0.15625 0.4375
0.15625 0.46875
0.15625 0.5
0.15625 0.53125
0.15625 0.5625
0.15625 0.59375
0.15625 0.625
0.15625 0.65625
0.15625 0.6875
0.15625 0.71875
0.1875 0.1875
0.1875 0.25
0.1875 0.28125
0.1875 0.3125
0.1875 0.34375
0.1875 0.375
0.1875 0.40625
0.1875 0.4375
0.1875 0.5
0.1875 0.5625
0.1875 0.59375
0.1875 0.625
0.1875 0.65625
0.1875 0.6875
0.1875 0.71875
0.1875 0.75
0.1875 0.8125
0.21875 0.28125
0.21875 0.3125
0.21875 0.34375
0.21875 0.375
0.21875 0.40625
0.21875 0.59375
0.21875 0.625
0.21875 0.65625
0.21875 0.6875
0.21875 0.71875
0.25 0.0
0.25 0.125
0.25 0.1875
0.25 0.25
0.25 0.3125
0.25 0.375
0.25 0.4375
0.25 0.5
0.25 0.5625
0.25 0.625
0.25 0.6875
0.25 0.75
0.25 0.8125
0.25 0.875
0.25 1.0
0.3125 0.1875
0.3125 0.25
0.3125 0.3125
0.3125 0.375
0.3125 0.4375
0.3125 0.5
0.3125 0.5625
0.3125 0.625
0.3125 0.6875
0.3125 0.75
0.3125 0.8125
0.375 0.0
0.375 0.125
0.375 0.25
0.375 0.375
0.375 0.5
0.375 0.625
0.375 0.75
0.375 0.875
0.375 1.0
0.5 0.0
0.5 0.25
0.5 0.5
0.5 0.75
0.5 1.0
0.75 0.0
0.75 0.25
0.75 0.5
0.75 0.75
0.75 1.0
1.0 0.0
1.0 0.25
1.0 0.5
1.0 0.75
1.0 1.0
1.25 0.0
1.25 0.25
1.25 0.5
1.25 0.75
1.25 1.0
1.5 0.0
1.5 0.25
1.5 0.5
1.5 0.75
1.5 1.0
1.75 0.0
1.75 0.25
1.75 0.5
1.75 0.75
1.75 1.0
2.0 0.0
2.0 0.25
2.0 0.5
2.0 0.75
2.0 1.0
2.25 0.0
2.25 0.25
2.25 0.5
2.25 0.75
2.25 1.0
2.5 0.0
2.5 0.25
2.5 0.5
2.5 0.75
2.5 1.0
2.75 0.0
2.75 0.25
2.75 0.5
2.75 0.75
2.75 1.0
3.0 0.0
3.0 0.25
3.0 0.5
3.0 0.75
3.0 1.0
-0.03125 0.34375
-0.03125 0.375
-0.03125 0.625
-0.03125 0.65625
-0.0625 0.1875
-0.0625 0.25
-0.0625 0.3125
-0.0625 0.34375
-0.0625 0.375
-0.0625 0.625
-0.0625 0.65625
-0.0625 0.6875
-0.0625 0.75
-0.0625 0.8125
-0.09375 0.28125
-0.09375 0.3125
-0.09375 0.34375
-0.09375 0.375
-0.09375 0.625
-0.09375 0.65625
-0.09375 0.6875
-0.09375 0.71875
-0.109375 0.359375
-0.109375 0.375
-0.109375 0.625
-0.109375 0.640625
-0.125 0.0
-0.125 0.125
-0.125 0.1875
-0.125 0.25
-0.125 0.28125
-0.125 0.3125
-0.125 0.34375
-0.125 0.359375
-0.125 0.375
-0.125 0.390625
-0.125 0.40625
-0.125 0.4375
-0.125 0.46875
-0.125 0.5
-0.125 0.53125
-0.125 0.5625
-0.125 0.59375
-0.125 0.609375
-0.125 0.625
-0.125 0.640625
-0.125 0.65625
-0.125 0.6875
-0.125 0.71875
-0.125 0.75
-0.125 0.8125
-0.125 0.875
-0.125 1.0
-0.140625 0.359375
-0.140625 0.375
-0.140625 0.390625
-0.140625 0.609375
-0.140625 0.625
-0.140625 0.640625
-0.15625 0.28125
-0.15625 0.3125
-0.15625 0.34375
-0.15625 0.375
-0.15625 0.40625
-0.15625 0.4375
-0.15625 0.46875
-0.15625 0.5
-0.15625 0.53125
-0.15625 0.5625
-0.15625 0.59375
-0.15625 0.625
-0.15625 0.65625
-0.15625 0.6875
-0.15625 0.71875
-0.1875 0.1875
-0.1875 0.25
-0.1875 0.28125
-0.1875 0.3125
-0.1875 0.34375
-0.1875 0.375
-0.1875 0.40625
-0.1875 0.4375
-0.1875 0.5
-0.1875 0.5625
-0.1875 0.59375
-0.1875 0.625
-0.1875 0.65625
-0.1875 0.6875
-0.1875 0.71875
-0.1875 0.75
-0.1875 0.8125
-0.21875 0.28125
-0.21875 0.3125
-0.21875 0.34375
-0.21875 0.375
-0.21875 0.40625
-0.21875 0.59375
-0.21875 0.625
-0.21875 0.65625
-0.21875 0.6875
-0.21875 0.71875
-0.25 0.0
-0.25 0.125
-0.25 0.1875
-0.25 0.25
-0.25 0.3125
-0.25 0.375
-0.25 0.4375
-0.25 0.5
-0.25 0.5625
-0.25 0.625
-0.25 0.6875
-0.25 0.75
-0.25 0.8125
-0.25 0.875
-0.25 1.0
-0.3125 0.1875
-0.3125 0.25
-0.3125 0.3125
-0.3125 0.375
-0.3125 0.4375
-0.3125 0.5
-0.3125 0.5625
-0.3125 0.625
-0.3125 0.6875
-0.3125 0.75
-0.3125 0.8125
-0.375 0.0
-0.375 0.125
-0.375 0.25
-0.375 0.375
-0.375 0.5
-0.375 0.625
-0.375 0.75
-0.375 0.875
-0.375 1.0
-0.5 0.0
-0.5 0.25
-0.5 0.5
-0.5 0.75
-0.5 1.0
-0.75 0.0
-0.75 0.25
-0.75 0.5
-0.75 0.75
-0.75 1.0
-1.0 0.0
-1.0 0.25
-1.0 0.5
-1.0 0.75
-1.0 1.0
-1.25 0.0
-1.25 0.25
-1.25 0.5
-1.25 0.75
-1.25 1.0
-1.5 0.0
-1.5 0.25
-1.5 0.5
-1.5 0.75
-1.5 1.0
-1.75 0.0
-1.75 0.25
-1.75 0.5
-1.75 0.75
-1.75 1.0
-2.0 0.0
-2.0 0.25
-2.0 0.5
-2.0 0.75
-2.0 1.0
-2.25 0.0
-2.25 0.25
-2.25 0.5
-2.25 0.75
-2.25 1.0
-2.5 0.0
-2.5 0.25
-2.5 0.5
-2.5 0.75
-2.5 1.0
-2.75 0.0
-2.75 0.25
-2.75 0.5
-2.75 0.75
-2.75 1.0
-3.0 0.0
-3.0 0.25
-3.0 0.5
-3.0 0.75
-3.0 1.0
CELLS:
3 0 0 40 1
3 0 1 40 41
3 0 1 41 18
3 0 1 18 2
3 0 18 41 42
3 0 2 18 3
3 0 3 18 19
3 0 18 42 19
3 0 19 42 43
3 0 3 19 4
3 0 4 19 20
3 0 19 43 28
3 0 19 28 20
3 0 20 28 29
3 0 28 43 44
3 0 28 44 29
3 0 29 44 45
3 0 4 14 5
3 0 4 20 14
3 0 14 20 21
3 0 20 29 21
3 0 21 29 30
3 0 29 45 30
3 0 30 45 46
3 0 5 14 6
3 0 6 14 15
3 0 14 21 15
3 0 15 21 22
3 0 21 30 22
3 0 22 30 31
3 0 30 46 36
3 0 30 36 31
3 0 36 46 47
3 0 31 36 37
3 0 36 48 37
3 0 36 47 48
3 0 7 16 17
3 0 7 17 8
3 0 16 23 24
3 0 16 24 17
3 0 23 32 33
3 0 23 33 24
3 0 32 38 39
3 0 38 58 39
3 0 39 58 59
3 0 39 59 60
3 0 39 60 33
3 0 32 39 33
3 0 8 17 9
3 0 9 17 25
3 0 17 24 25
3 0 24 33 34
3 0 24 34 25
3 0 33 60 61
3 0 33 61 34
3 0 9 25 26
3 0 9 26 10
3 0 25 34 35
3 0 34 61 62
3 0 34 62 35
3 0 35 62 63
3 0 26 35 63
3 0 25 35 26
3 0 10 26 27
3 0 10 27 11
3 0 26 63 64
3 0 26 64 27
3 0 11 27 12
3 0 12 27 65
3 0 27 64 65
3 0 12 65 66
3 0 12 66 13
3 0 40 115 41
3 0 41 115 116
3 0 41 88 42
3 0 41 116 88
3 0 88 116 117
3 0 42 88 43
3 0 43 88 89
3 0 88 117 89
3 0 89 117 118
3 0 43 73 44
3 0 43 89 73
3 0 73 89 90
3 0 44 73 45
3 0 45 73 74
3 0 73 90 74
3 0 74 90 91
3 0 89 105 90
3 0 89 118 105
3 0 105 118 119
3 0 105 119 106
3 0 91 105 106
3 0 90 105 91
3 0 45 74 46
3 0 46 74 75
3 0 74 91 75
3 0 75 91 92
3 0 91 106 92
3 0 92 106 107
3 0 46 75 67
3 0 67 75 76
3 0 67 76 68
3 0 48 67 68
3 0 47 67 48
3 0 46 67 47
3 0 75 92 76
3 0 76 92 93
3 0 92 107 93
3 0 93 107 108
3 0 106 119 107
3 0 107 119 120
3 0 107 120 108
3 0 48 68 69
3 0 68 76 69
3 0 69 76 77
3 0 50 69 77
3 0 49 69 50
3 0 48 69 49
3 0 76 93 77
3 0 77 93 94
3 0 93 108 94
3 0 94 108 109
3 0 50 77 51
3 0 51 77 78
3 0 77 94 78
3 0 78 94 95
3 0 94 109 95
3 0 95 109 121
3 0 109 120 121
3 0 108 120 109
3 0 51 78 52
3 0 52 78 79
3 0 52 79 53
3 0 53 79 80
3 0 78 95 79
3 0 79 95 96
3 0 79 96 80
3 0 95 121 96
3 0 96 121 122
3 0 53 80 81
3 0 53 81 54
3 0 80 96 81
3 0 81 96 97
3 0 81 97 82
3 0 54 81 82
3 0 54 82 55
3 0 96 122 123
3 0 96 123 97
3 0 55 83 56
3 0 55 82 83
3 0 82 98 83
3 0 82 97 98
3 0 97 110 98
3 0 97 123 110
3 0 110 123 124
3 0 110 124 111
3 0 98 110 111
3 0 98 111 99
3 0 83 98 99
3 0 83 99 84
3 0 56 83 70
3 0 70 83 84
3 0 70 84 71
3 0 58 70 71
3 0 57 70 58
3 0 56 70 57
3 0 58 71 72
3 0 72 71 84
3 0 72 84 85
3 0 60 72 85
3 0 59 72 60
3 0 58 72 59
3 0 84 99 100
3 0 84 100 85
3 0 99 112 100
3 0 99 111 112
3 0 111 124 112
3 0 112 124 125
3 0 60 86 61
3 0 60 85 86
3 0 85 101 86
3 0 85 100 101
3 0 100 113 101
3 0 100 112 113
3 0 112 125 113
3 0 61 87 62
3 0 61 86 87
3 0 86 102 87
3 0 86 101 102
3 0 101 114 102
3 0 101 113 114
3 0 113 125 114
3 0 114 125 126
3 0 62 87 63
3 0 63 87 103
3 0 87 102 103
3 0 102 114 103
3 0 103 114 126
3 0 114 125 126
3 0 63 104 64
3 0 63 103 104
3 0 103 127 104
3 0 103 126 127
3 0 64 104 65
3 0 65 104 128
3 0 104 127 128
3 0 65 129 66
3 0 65 128 129
3 0 115 141 116
3 0 116 141 142
3 0 116 142 130
3 0 130 142 143
3 0 130 143 131
3 0 118 130 131
3 0 117 130 118
3 0 116 130 117
3 0 118 131 119
3 0 119 131 132
3 0 131 143 132
3 0 132 143 144
3 0 132 144 133
3 0 120 132 133
3 0 119 132 120
3 0 120 133 121
3 0 121 133 134
3 0 133 144 134
3 0 134 144 145
3 0 134 145 135
3 0 122 134 135
3 0 121 134 122
3 0 122 136 123
3 0 122 135 136
3 0 135 145 136
3 0 136 145 146
3 0 136 146 137
3 0 123 136 137
3 0 123 137 124
3 0 124 138 125
3 0 124 137 138
3 0 137 146 138
3 0 138 146 147
3 0 138 147 139
3 0 125 138 139
3 0 125 139 126
3 0 126 139 140
3 0 139 147 140
3 0 140 147 148
3 0 140 148 128
3 0 127 140 128
3 0 126 140 127
3 0 128 149 129
3 0 128 148 149
3 0 141 150 142
3 0 142 150 151
3 0 142 151 143
3 0 143 151 144
3 0 144 151 152
3 0 144 152 145
3 0 145 152 146
3 0 146 152 153
3 0 146 153 147
3 0 147 153 148
3 0 148 153 154
3 0 148 154 149
3 0 150 155 151
3 0 151 155 156
3 0 151 156 152
3 0 152 156 157
3 0 152 158 153
3 0 152 157 158
3 0 153 159 154
3 0 153 158 159
3 0 155 160 156
3 0 156 160 161
3 0 156 161 157
3 0 157 161 162
3 0 157 163 158
3 0 157 162 163
3 0 158 164 159
3 0 158 163 164
3 0 160 165 161
3 0 161 165 166
3 0 161 166 162
3 0 162 166 167
3 0 162 168 163
3 0 162 167 168
3 0 163 169 164
3 0 163 168 169
3 0 165 170 166
3 0 166 170 171
3 0 166 171 167
3 0 167 171 172
3 0 167 173 168
3 0 167 172 173
3 0 168 174 169
3 0 168 173 174
3 0 170 175 171
3 0 171 175 176
3 0 171 176 172
3 0 172 176 177
3 0 172 178 173
3 0 172 177 178
3 0 173 179 174
3 0 173 178 179
3 0 175 180 176
3 0 176 180 181
3 0 176 181 177
3 0 177 181 182
3 0 177 183 178
3 0 177 182 183
3 0 178 184 179
3 0 178 183 184
3 0 180 185 181
3 0 181 185 186
3 0 181 186 182
3 0 182 186 187
3 0 182 188 183
3 0 182 187 188
3 0 183 189 184
3 0 183 188 189
3 0 185 190 186
3 0 186 190 191
3 0 186 191 187
3 0 187 191 192
3 0 187 193 188
3 0 187 192 193
3 0 188 194 189
3 0 188 193 194
3 0 190 195 191
3 0 191 195 196
3 0 191 196 192
3 0 192 196 197
3 0 192 198 193
3 0 192 197 198
3 0 193 199 194
3 0 193 198 199
3 0 195 200 196
3 0 196 200 201
3 0 196 201 197
3 0 197 201 202
3 0 197 203 198
3 0 197 202 203
3 0 198 204 199
3 0 198 203 204
3 0 231 0 1
3 0 231 1 232
3 0 232 1 209
3 0 209 1 2
3 0 232 209 233
3 0 209 2 3
3 0 209 3 210
3 0 233 209 210
3 0 233 210 234
3 0 210 3 4
3 0 210 4 211
3 0 234 210 219
3 0 219 210 211
3 0 219 211 220
3 0 234 219 235
3 0 235 219 220
3 0 235 220 236
3 0 205 4 5
3 0 211 4 205
3 0 211 205 212
3 0 220 211 212
3 0 220 212 221
3 0 236 220 221
3 0 236 221 237
3 0 205 5 6
3 0 205 6 206
3 0 212 205 206
3 0 212 206 213
3 0 221 212 213
3 0 221 213 222
3 0 237 221 227
3 0 227 221 222
3 0 237 227 238
3 0 227 222 228
3 0 239 227 228
3 0 238 227 239
3 0 207 7 208
3 0 208 7 8
3 0 214 207 215
3 0 215 207 208
3 0 223 214 224
3 0 224 214 215
3 0 229 223 230
3 0 249 229 230
3 0 249 230 250
3 0 250 230 251
3 0 251 230 224
3 0 230 223 224
3 0 208 8 9
3 0 208 9 216
3 0 215 208 216
3 0 224 215 225
3 0 225 215 216
3 0 251 224 252
3 0 252 224 225
3 0 216 9 217
3 0 217 9 10
3 0 225 216 226
3 0 252 225 253
3 0 253 225 226
3 0 253 226 254
3 0 226 217 254
3 0 226 216 217
3 0 217 10 218
3 0 218 10 11
3 0 254 217 255
3 0 255 217 218
3 0 218 11 12
3 0 218 12 256
3 0 255 218 256
3 0 256 12 257
3 0 257 12 13
3 0 306 231 232
3 0 306 232 307
3 0 279 232 233
3 0 307 232 279
3 0 307 279 308
3 0 279 233 234
3 0 279 234 280
3 0 308 279 280
3 0 308 280 309
3 0 264 234 235
3 0 280 234 264
3 0 280 264 281
3 0 264 235 236
3 0 264 236 265
3 0 281 264 265
3 0 281 265 282
3 0 296 280 281
3 0 309 280 296
3 0 309 296 310
3 0 310 296 297
3 0 296 282 297
3 0 296 281 282
3 0 265 236 237
3 0 265 237 266
3 0 282 265 266
3 0 282 266 283
3 0 297 282 283
3 0 297 283 298
3 0 266 237 258
3 0 266 258 267
3 0 267 258 259
3 0 258 239 259
3 0 258 238 239
3 0 258 237 238
3 0 283 266 267
3 0 283 267 284
3 0 298 283 284
3 0 298 284 299
3 0 310 297 298
3 0 310 298 311
3 0 311 298 299
3 0 259 239 260
3 0 267 259 260
3 0 267 260 268
3 0 260 241 268
3 0 260 240 241
3 0 260 239 240
3 0 284 267 268
3 0 284 268 285
3 0 299 284 285
3 0 299 285 300
3 0 268 241 242
3 0 268 242 269
3 0 285 268 269
3 0 285 269 286
3 0 300 285 286
3 0 300 286 312
3 0 311 300 312
3 0 311 299 300
3 0 269 242 243
3 0 269 243 270
3 0 270 243 244
3 0 270 244 271
3 0 286 269 270
3 0 286 270 287
3 0 287 270 271
3 0 312 286 287
3 0 312 287 313
3 0 271 244 272
3 0 272 244 245
3 0 287 271 272
3 0 287 272 288
3 0 288 272 273
3 0 272 245 273
3 0 273 245 246
3 0 313 287 314
3 0 314 287 288
3 0 274 246 247
3 0 273 246 274
3 0 289 273 274
3 0 288 273 289
3 0 301 288 289
3 0 314 288 301
3 0 314 301 315
3 0 315 301 302
3 0 301 289 302
3 0 302 289 290
3 0 289 274 290
3 0 290 274 275
3 0 274 247 261
3 0 274 261 275
3 0 275 261 262
3 0 261 249 262
3 0 261 248 249
3 0 261 247 248
3 0 262 249 263
3 0 262 263 275
3 0 275 263 276
3 0 263 251 276
3 0 263 250 251
3 0 263 249 250
3 0 290 275 291
3 0 291 275 276
3 0 303 290 291
3 0 302 290 303
3 0 315 302 303
3 0 315 303 316
3 0 277 251 252
3 0 276 251 277
3 0 292 276 277
3 0 291 276 292
3 0 304 291 292
3 0 303 291 304
3 0 316 303 304
3 0 278 252 253
3 0 277 252 278
3 0 293 277 278
3 0 292 277 293
3 0 305 292 293
3 0 304 292 305
3 0 316 304 305
3 0 316 305 317
3 0 278 253 254
3 0 278 254 294
3 0 293 278 294
3 0 305 293 294
3 0 305 294 317
3 0 316 305 317
3 0 295 254 255
3 0 294 254 295
3 0 318 294 295
3 0 317 294 318
3 0 295 255 256
3 0 295 256 319
3 0 318 295 319
3 0 320 256 257
3 0 319 256 320
3 0 332 306 307
3 0 332 307 333
3 0 333 307 321
3 0 333 321 334
3 0 334 321 322
3 0 321 309 322
3 0 321 308 309
3 0 321 307 308
3 0 322 309 310
3 0 322 310 323
3 0 334 322 323
3 0 334 323 335
3 0 335 323 324
3 0 323 311 324
3 0 323 310 311
3 0 324 311 312
3 0 324 312 325
3 0 335 324 325
3 0 335 325 336
3 0 336 325 326
3 0 325 313 326
3 0 325 312 313
3 0 327 313 314
3 0 326 313 327
3 0 336 326 327
3 0 336 327 337
3 0 337 327 328
3 0 327 314 328
3 0 328 314 315
3 0 329 315 316
3 0 328 315 329
3 0 337 328 329
3 0 337 329 338
3 0 338 329 330
3 0 329 316 330
3 0 330 316 317
3 0 330 317 331
3 0 338 330 331
3 0 338 331 339
3 0 339 331 319
3 0 331 318 319
3 0 331 317 318
3 0 340 319 320
3 0 339 319 340
3 0 341 332 333
3 0 341 333 342
3 0 342 333 334
3 0 342 334 335
3 0 342 335 343
3 0 343 335 336
3 0 343 336 337
3 0 343 337 344
3 0 344 337 338
3 0 344 338 339
3 0 344 339 345
3 0 345 339 340
3 0 346 341 342
3 0 346 342 347
3 0 347 342 343
3 0 347 343 348
3 0 349 343 344
3 0 348 343 349
3 0 350 344 345
3 0 349 344 350
3 0 351 346 347
3 0 351 347 352
3 0 352 347 348
3 0 352 348 353
3 0 354 348 349
3 0 353 348 354
3 0 355 349 350
3 0 354 349 355
3 0 356 351 352
3 0 356 352 357
3 0 357 352 353
3 0 357 353 358
3 0 359 353 354
3 0 358 353 359
3 0 360 354 355
3 0 359 354 360
3 0 361 356 357
3 0 361 357 362
3 0 362 357 358
3 0 362 358 363
3 0 364 358 359
3 0 363 358 364
3 0 365 359 360
3 0 364 359 365
3 0 366 361 362
3 0 366 362 367
3 0 367 362 363
3 0 367 363 368
3 0 369 363 364
3 0 368 363 369
3 0 370 364 365
3 0 369 364 370
3 0 371 366 367
3 0 371 367 372
3 0 372 367 368
3 0 372 368 373
3 0 374 368 369
3 0 373 368 374
3 0 375 369 370
3 0 374 369 375
3 0 376 371 372
3 0 376 372 377
3 0 377 372 373
3 0 377 373 378
3 0 379 373 374
3 0 378 373 379
3 0 380 374 375
3 0 379 374 380
3 0 381 376 377
3 0 381 377 382
3 0 382 377 378
3 0 382 378 383
3 0 384 378 379
3 0 383 378 384
3 0 385 379 380
3 0 384 379 385
3 0 386 381 382
3 0 386 382 387
3 0 387 382 383
3 0 387 383 388
3 0 389 383 384
3 0 388 383 389
3 0 390 384 385
3 0 389 384 390
3 0 391 386 387
3 0 391 387 392
3 0 392 387 388
3 0 392 388 393
3 0 394 388 389
3 0 393 388 394
3 0 395 389 390
3 0 394 389 395
FACES:
2 1 7 16
2 1 16 23
2 1 23 32
2 1 32 38
2 1 38 58
2 1 58 57
2 1 57 56
2 1 56 55
2 1 55 54
2 1 54 53
2 1 53 52
2 1 52 51
2 1 51 50
2 1 50 49
2 1 49 48
2 1 48 37
2 1 37 31
2 1 31 22
2 1 22 15
2 1 15 6
2 1 0 40
2 1 40 115
2 1 115 141
2 1 141 150
2 1 150 155
2 1 155 160
2 1 160 165
2 1 165 170
2 1 170 175
2 1 175 180
2 1 180 185
2 1 185 190
2 1 190 195
2 1 195 200
2 1 200 201
2 1 201 202
2 1 202 203
2 1 203 204
2 1 204 199
2 1 199 194
2 1 194 189
2 1 189 184
2 1 184 179
2 1 179 174
2 1 174 169
2 1 169 164
2 1 164 159
2 1 159 154
2 1 154 149
2 1 149 129
2 1 129 66
2 1 66 13
2 1 207 7
2 1 214 207
2 1 223 214
2 1 229 223
2 1 249 229
2 1 248 249
2 1 247 248
2 1 246 247
2 1 245 246
2 1 244 245
2 1 243 244
2 1 242 243
2 1 241 242
2 1 240 241
2 1 239 240
2 1 228 239
2 1 222 228
2 1 213 222
2 1 206 213
2 1 6 206
2 1 231 0
2 1 306 231
2 1 332 306
2 1 341 332
2 1 346 341
2 1 351 346
2 1 356 351
2 1 361 356
2 1 366 361
2 1 371 366
2 1 376 371
2 1 381 376
2 1 386 381
2 1 391 386
2 1 392 391
2 1 393 392
2 1 394 393
2 1 395 394
2 1 390 395
2 1 385 390
2 1 380 385
2 1 375 380
2 1 370 375
2 1 365 370
2 1 360 365
2 1 355 360
2 1 350 355
2 1 345 350
2 1 340 345
2 1 320 340
2 1 257 320
2 1 13 257