POINTS:
0.0 0.0625
0.0 0.078125
0.0 0.09375
0.0 0.109375
0.0 0.125
0.0 0.15625
0.0 0.1875
0.0 0.25
0.0 0.3125
0.0 0.375
0.0 0.5
0.0 0.625
0.0 0.75
0.0 1.0
0.0625 0.0625
0.0625 0.078125
0.0625 0.09375
0.0625 0.109375
0.0625 0.125
0.0625 0.15625
0.0625 0.1875
0.0625 0.25
0.0625 0.3125
0.125 0.046875
0.125 0.0625
0.125 0.078125
0.125 0.09375
0.125 0.109375
0.125 0.125
0.125 0.15625
0.125 0.1875
0.125 0.25
0.125 0.3125
0.125 0.375
0.125 0.5
0.125 0.625
0.1875 0.03125
0.1875 0.046875
0.1875 0.0625
0.1875 0.078125
0.1875 0.09375
0.1875 0.109375
0.1875 0.125
0.1875 0.15625
0.1875 0.1875
0.1875 0.25
0.1875 0.3125
0.21875 0.015625
0.21875 0.03125
0.21875 0.046875
0.21875 0.0625
0.21875 0.078125
0.21875 0.09375
0.21875 0.109375
0.25 0.0
0.25 0.015625
0.25 0.03125
0.25 0.046875
0.25 0.0625
0.25 0.078125
0.25 0.09375
0.25 0.125
0.25 0.15625
0.25 0.1875
0.25 0.25
0.25 0.3125
0.25 0.375
0.25 0.5
0.25 0.625
0.25 0.75
0.25 1.0
0.28125 0.0
0.28125 0.015625
0.28125 0.03125
0.28125 0.046875
0.28125 0.0625
0.28125 0.078125
0.3125 0.0
0.3125 0.015625
0.3125 0.03125
0.3125 0.046875
0.3125 0.0625
0.3125 0.078125
0.3125 0.09375
0.3125 0.125
0.3125 0.15625
0.3125 0.1875
0.3125 0.25
0.3125 0.3125
0.34375 0.0
0.34375 0.015625
0.34375 0.03125
0.34375 0.046875
0.34375 0.0625
0.34375 0.078125
0.375 0.0
0.375 0.015625
0.375 0.03125
0.375 0.046875
0.375 0.0625
0.375 0.09375
0.375 0.125
0.375 0.15625
0.375 0.1875
0.375 0.25
0.375 0.3125
0.375 0.375
0.375 0.5
0.375 0.625
0.40625 0.0
0.40625 0.015625
0.40625 0.03125
0.40625 0.046875
0.4375 0.0
0.4375 0.03125
0.4375 0.0625
0.4375 0.09375
0.4375 0.125
0.4375 0.15625
0.4375 0.1875
0.4375 0.25
0.4375 0.3125
0.5 0.0
0.5 0.03125
0.5 0.0625
0.5 0.09375
0.5 0.125
0.5 0.1875
0.5 0.25
0.5 0.3125
0.5 0.375
0.5 0.5
0.5 0.625
0.5 0.75
0.5 1.0
0.5625 0.0
0.5625 0.03125
0.5625 0.0625
0.5625 0.09375
0.5625 0.125
0.5625 0.1875
0.5625 0.25
0.5625 0.3125
0.625 0.0
0.625 0.0625
0.625 0.125
0.625 0.1875
0.625 0.25
0.625 0.375
0.625 0.5
0.625 0.625
0.6875 0.0
0.6875 0.0625
0.6875 0.125
0.6875 0.1875
0.75 0.0
0.75 0.125
0.75 0.25
0.75 0.5
0.75 0.75
0.75 1.0
0.875 0.0
0.875 0.125
1.0 0.0
1.0 0.25
1.0 0.5
1.0 0.75
1.0 1.0
1.25 0.0
1.25 0.25
1.25 0.5
1.25 0.75
1.25 1.0
1.5 0.0
1.5 0.25
1.5 0.5
1.5 0.75
1.5 1.0
1.75 0.0
1.75 0.25
1.75 0.5
1.75 0.75
1.75 1.0
2.0 0.0
2.0 0.25
2.0 0.5
2.0 0.75
2.0 1.0
2.25 0.0
2.25 0.25
2.25 0.5
2.25 0.75
2.25 1.0
2.5 0.0
2.5 0.25
2.5 0.5
2.5 0.75
2.5 1.0
2.75 0.0
2.75 0.25
2.75 0.5
2.75 0.75
2.75 1.0
3.0 0.0
3.0 0.25
3.0 0.5
3.0 0.75
3.0 1.0
CELLS:
3 0 0 14 1
3 0 1 14 15
3 0 1 15 2
3 0 2 15 16
3 0 2 16 3
3 0 3 16 17
3 0 3 17 4
3 0 4 17 18
3 0 4 18 5
3 0 5 18 19
3 0 5 19 6
3 0 6 19 20
3 0 6 20 7
3 0 7 20 21
3 0 7 21 8
3 0 8 21 22
3 0 14 23 24
3 0 14 24 15
3 0 15 24 25
3 0 15 25 16
3 0 16 25 26
3 0 16 26 17
3 0 17 26 27
3 0 17 27 18
3 0 18 27 28
3 0 18 28 19
3 0 19 28 29
3 0 19 29 20
3 0 20 29 30
3 0 20 30 21
3 0 21 30 31
3 0 21 31 22
3 0 22 31 32
3 0 8 22 9
3 0 9 22 33
3 0 22 32 33
3 0 9 33 10
3 0 10 33 34
3 0 10 34 11
3 0 11 34 35
3 0 23 36 37
3 0 23 37 24
3 0 24 37 38
3 0 24 38 25
3 0 25 38 39
3 0 25 39 26
3 0 26 39 40
3 0 26 40 27
3 0 27 40 41
3 0 27 41 28
3 0 28 41 42
3 0 28 42 29
3 0 29 42 43
3 0 29 43 30
3 0 30 43 44
3 0 30 44 31
3 0 31 44 45
3 0 31 45 32
3 0 32 45 46
3 0 36 47 48
3 0 36 48 37
3 0 37 48 49
3 0 37 49 38
3 0 38 49 50
3 0 38 50 39
3 0 39 50 51
3 0 39 51 40
3 0 40 51 52
3 0 40 52 41
3 0 41 52 53
3 0 47 54 55
3 0 47 55 48
3 0 48 55 56
3 0 48 56 49
3 0 49 56 57
3 0 49 57 50
3 0 50 57 58
3 0 50 58 51
3 0 51 58 59
3 0 51 59 52
3 0 52 59 60
3 0 41 53 42
3 0 42 53 61
3 0 53 60 61
3 0 52 60 53
3 0 42 61 43
3 0 43 61 62
3 0 43 62 44
3 0 44 62 63
3 0 44 63 45
3 0 45 63 64
3 0 45 64 46
3 0 46 64 65
3 0 32 46 33
3 0 33 46 66
3 0 46 65 66
3 0 33 66 34
3 0 34 66 67
3 0 34 67 35
3 0 35 67 68
3 0 11 35 12
3 0 12 35 69
3 0 35 68 69
3 0 12 69 13
3 0 13 69 70
3 0 54 71 55
3 0 55 71 72
3 0 55 72 56
3 0 56 72 73
3 0 56 73 57
3 0 57 73 74
3 0 57 74 58
3 0 58 74 75
3 0 58 75 59
3 0 59 75 76
3 0 71 77 72
3 0 72 77 78
3 0 72 78 73
3 0 73 78 79
3 0 73 79 74
3 0 74 79 80
3 0 74 80 75
3 0 75 80 81
3 0 75 81 76
3 0 76 81 82
3 0 59 76 60
3 0 60 76 83
3 0 76 82 83
3 0 60 83 61
3 0 61 83 84
3 0 61 84 62
3 0 62 84 85
3 0 62 85 63
3 0 63 85 86
3 0 63 86 64
3 0 64 86 87
3 0 64 87 65
3 0 65 87 88
3 0 77 89 78
3 0 78 89 90
3 0 78 90 79
3 0 79 90 91
3 0 79 91 80
3 0 80 91 92
3 0 80 92 81
3 0 81 92 93
3 0 81 93 82
3 0 82 93 94
3 0 89 95 90
3 0 90 95 96
3 0 90 96 91
3 0 91 96 97
3 0 91 97 92
3 0 92 97 98
3 0 92 98 93
3 0 93 98 99
3 0 82 94 83
3 0 83 94 100
3 0 94 99 100
3 0 93 99 94
3 0 83 100 84
3 0 84 100 101
3 0 84 101 85
3 0 85 101 102
3 0 85 102 86
3 0 86 102 103
3 0 86 103 87
3 0 87 103 104
3 0 87 104 88
3 0 88 104 105
3 0 65 88 66
3 0 66 88 106
3 0 88 105 106
3 0 66 106 67
3 0 67 106 107
3 0 67 107 68
3 0 68 107 108
3 0 95 109 96
3 0 96 109 110
3 0 96 110 97
3 0 97 110 111
3 0 97 111 98
3 0 98 111 112
3 0 109 113 110
3 0 110 113 114
3 0 110 114 111
3 0 111 114 112
3 0 112 114 115
3 0 98 112 99
3 0 99 112 115
3 0 99 115 100
3 0 100 115 116
3 0 100 116 101
3 0 101 116 117
3 0 101 117 102
3 0 102 117 118
3 0 102 118 103
3 0 103 118 119
3 0 103 119 104
3 0 104 119 120
3 0 104 120 105
3 0 105 120 121
3 0 113 122 114
3 0 114 122 123
3 0 114 123 115
3 0 115 123 124
3 0 115 124 116
3 0 116 124 125
3 0 116 125 117
3 0 117 125 126
3 0 117 126 118
3 0 118 126 127
3 0 118 127 119
3 0 119 127 120
3 0 120 127 128
3 0 120 128 121
3 0 121 128 129
3 0 105 121 106
3 0 106 121 130
3 0 121 129 130
3 0 106 130 107
3 0 107 130 131
3 0 107 131 108
3 0 108 131 132
3 0 68 108 69
3 0 69 108 133
3 0 108 132 133
3 0 69 133 70
3 0 70 133 134
3 0 122 135 123
3 0 123 135 136
3 0 123 136 124
3 0 124 136 137
3 0 124 137 125
3 0 125 137 138
3 0 125 138 126
3 0 126 138 139
3 0 126 139 127
3 0 127 139 140
3 0 127 140 128
3 0 128 140 141
3 0 128 141 129
3 0 129 141 142
3 0 135 143 136
3 0 136 143 144
3 0 136 144 137
3 0 137 144 138
3 0 138 144 145
3 0 138 145 139
3 0 139 145 140
3 0 140 145 146
3 0 140 146 141
3 0 141 146 147
3 0 129 142 130
3 0 130 142 148
3 0 142 147 148
3 0 141 147 142
3 0 130 148 131
3 0 131 148 149
3 0 131 149 132
3 0 132 149 150
3 0 143 151 144
3 0 144 151 152
3 0 144 152 145
3 0 145 152 153
3 0 145 153 146
3 0 146 153 154
3 0 151 155 152
3 0 152 155 156
3 0 152 156 153
3 0 146 154 147
3 0 147 154 157
3 0 154 156 157
3 0 153 156 154
3 0 147 157 148
3 0 148 157 158
3 0 148 158 149
3 0 149 158 150
3 0 150 158 159
3 0 133 150 159
3 0 132 150 133
3 0 133 159 134
3 0 134 159 160
3 0 155 161 156
3 0 156 161 162
3 0 156 162 157
3 0 157 162 164
3 0 162 163 164
3 0 161 163 162
3 0 157 164 158
3 0 158 164 165
3 0 158 165 159
3 0 159 165 166
3 0 159 166 160
3 0 160 166 167
3 0 163 168 164
3 0 164 168 169
3 0 164 169 165
3 0 165 169 170
3 0 165 170 166
3 0 166 170 171
3 0 166 171 167
3 0 167 171 172
3 0 168 173 169
3 0 169 173 174
3 0 169 174 170
3 0 170 174 175
3 0 170 175 171
3 0 171 175 176
3 0 171 176 172
3 0 172 176 177
3 0 173 178 174
3 0 174 178 179
3 0 174 179 175
3 0 175 179 180
3 0 175 180 176
3 0 176 180 181
3 0 176 181 177
3 0 177 181 182
3 0 178 183 179
3 0 179 183 184
3 0 179 184 180
3 0 180 184 185
3 0 180 185 181
3 0 181 185 186
3 0 181 186 182
3 0 182 186 187
3 0 183 188 184
3 0 184 188 189
3 0 184 189 185
3 0 185 189 190
3 0 185 190 186
3 0 186 190 191
3 0 186 191 187
3 0 187 191 192
3 0 188 193 189
3 0 189 193 194
3 0 189 194 190
3 0 190 194 195
3 0 190 195 191
3 0 191 195 196
3 0 191 196 192
3 0 192 196 197
3 0 193 198 194
3 0 194 198 199
3 0 194 199 195
3 0 195 199 200
3 0 195 200 196
3 0 196 200 201
3 0 196 201 197
3 0 197 201 202
3 0 198 203 199
3 0 199 203 204
3 0 199 204 200
3 0 200 204 205
3 0 200 205 201
3 0 201 205 206
3 0 201 206 202
3 0 202 206 207
FACES:
2 10 0 14
2 10 14 23
2 10 23 36
2 10 36 47
2 10 47 54
2 77 0 1
2 77 1 2
2 77 2 3
2 77 3 4
2 77 4 5
2 77 5 6
2 77 6 7
2 77 7 8
2 77 8 9
2 77 9 10
2 77 10 11
2 77 11 12
2 77 12 13
