POINTS:
0.0 0.0625
0.0 0.078125
0.0 0.09375
0.0 0.109375
0.0 0.125
0.0 0.15625
0.0 0.1875
0.0 0.25
0.0 0.3125
0.0 0.375
0.0 0.5
0.0 0.625
0.0 0.75
0.0 1.0
0.0625 0.0625
0.0625 0.078125
0.0625 0.09375
0.0625 0.109375
0.0625 0.125
0.0625 0.15625
0.0625 0.1875
0.0625 0.25
0.0625 0.3125
0.125 0.046875
0.125 0.0625
0.125 0.078125
0.125 0.09375
0.125 0.109375
0.125 0.125
0.125 0.15625
0.125 0.1875
0.125 0.25
0.125 0.3125
0.125 0.375
0.125 0.5
0.125 0.625
0.1875 0.03125
0.1875 0.046875
0.1875 0.0625
0.1875 0.078125
0.1875 0.09375
0.1875 0.109375
0.1875 0.125
0.1875 0.15625
0.1875 0.1875
0.1875 0.25
0.1875 0.3125
0.21875 0.015625
0.21875 0.03125
0.21875 0.046875
0.21875 0.0625
0.21875 0.078125
0.21875 0.09375
0.21875 0.109375
0.25 0.0
0.25 0.015625
0.25 0.03125
0.25 0.046875
0.25 0.0625
0.25 0.078125
0.25 0.09375
0.25 0.125
0.25 0.15625
0.25 0.1875
0.25 0.25
0.25 0.3125
0.25 0.375
0.25 0.5
0.25 0.625
0.25 0.75
0.25 1.0
0.28125 0.0
0.28125 0.015625
0.28125 0.03125
0.28125 0.046875
0.28125 0.0625
0.28125 0.078125
0.3125 0.0
0.3125 0.015625
0.3125 0.03125
0.3125 0.046875
0.3125 0.0625
0.3125 0.078125
0.3125 0.09375
0.3125 0.125
0.3125 0.15625
0.3125 0.1875
0.3125 0.25
0.3125 0.3125
0.34375 0.0
0.34375 0.015625
0.34375 0.03125
0.34375 0.046875
0.34375 0.0625
0.34375 0.078125
0.375 0.0
0.375 0.015625
0.375 0.03125
0.375 0.046875
0.375 0.0625
0.375 0.09375
0.375 0.125
0.375 0.15625
0.375 0.1875
0.375 0.25
0.375 0.3125
0.375 0.375
0.375 0.5
0.375 0.625
0.40625 0.0
0.40625 0.015625
0.40625 0.03125
0.40625 0.046875
0.4375 0.0
0.4375 0.03125
0.4375 0.0625
0.4375 0.09375
0.4375 0.125
0.4375 0.15625
0.4375 0.1875
0.4375 0.25
0.4375 0.3125
0.5 0.0
0.5 0.03125
0.5 0.0625
0.5 0.09375
0.5 0.125
0.5 0.1875
0.5 0.25
0.5 0.3125
0.5 0.375
0.5 0.5
0.5 0.625
0.5 0.75
0.5 1.0
0.5625 0.0
0.5625 0.03125
0.5625 0.0625
0.5625 0.09375
0.5625 0.125
0.5625 0.1875
0.5625 0.25
0.5625 0.3125
0.625 0.0
0.625 0.0625
0.625 0.125
0.625 0.1875
0.625 0.25
0.625 0.375
0.625 0.5
0.625 0.625
0.6875 0.0
0.6875 0.0625
0.6875 0.125
0.6875 0.1875
0.75 0.0
0.75 0.125
0.75 0.25
0.75 0.5
0.75 0.75
0.75 1.0
0.875 0.0
0.875 0.125
1.0 0.0
1.0 0.25
1.0 0.5
1.0 0.75
1.0 1.0
1.25 0.0
1.25 0.25
1.25 0.5
1.25 0.75
1.25 1.0
1.5 0.0
1.5 0.25
1.5 0.5
1.5 0.75
1.5 1.0
1.75 0.0
1.75 0.25
1.75 0.5
1.75 0.75
1.75 1.0
2.0 0.0
2.0 0.25
2.0 0.5
2.0 0.75
2.0 1.0
2.25 0.0
2.25 0.25
2.25 0.5
2.25 0.75
2.25 1.0
2.5 0.0
2.5 0.25
2.5 0.5
2.5 0.75
2.5 1.0
2.75 0.0
2.75 0.25
2.75 0.5
2.75 0.75
2.75 1.0
3.0 0.0
3.0 0.25
3.0 0.5
3.0 0.75
3.0 1.0
-0.0625 0.0625
-0.0625 0.078125
-0.0625 0.09375
-0.0625 0.109375
-0.0625 0.125
-0.0625 0.15625
-0.0625 0.1875
-0.0625 0.25
-0.0625 0.3125
-0.125 0.046875
-0.125 0.0625
-0.125 0.078125
-0.125 0.09375
-0.125 0.109375
-0.125 0.125
-0.125 0.15625
-0.125 0.1875
-0.125 0.25
-0.125 0.3125
-0.125 0.375
-0.125 0.5
-0.125 0.625
-0.1875 0.03125
-0.1875 0.046875
-0.1875 0.0625
-0.1875 0.078125
-0.1875 0.09375
-0.1875 0.109375
-0.1875 0.125
-0.1875 0.15625
-0.1875 0.1875
-0.1875 0.25
-0.1875 0.3125
-0.21875 0.015625
-0.21875 0.03125
-0.21875 0.046875
-0.21875 0.0625
-0.21875 0.078125
-0.21875 0.09375
-0.21875 0.109375
-0.25 0.0
-0.25 0.015625
-0.25 0.03125
-0.25 0.046875
-0.25 0.0625
-0.25 0.078125
-0.25 0.09375
-0.25 0.125
-0.25 0.15625
-0.25 0.1875
-0.25 0.25
-0.25 0.3125
-0.25 0.375
-0.25 0.5
-0.25 0.625
-0.25 0.75
-0.25 1.0
-0.28125 0.0
-0.28125 0.015625
-0.28125 0.03125
-0.28125 0.046875
-0.28125 0.0625
-0.28125 0.078125
-0.3125 0.0
-0.3125 0.015625
-0.3125 0.03125
-0.3125 0.046875
-0.3125 0.0625
-0.3125 0.078125
-0.3125 0.09375
-0.3125 0.125
-0.3125 0.15625
-0.3125 0.1875
-0.3125 0.25
-0.3125 0.3125
-0.34375 0.0
-0.34375 0.015625
-0.34375 0.03125
-0.34375 0.046875
-0.34375 0.0625
-0.34375 0.078125
-0.375 0.0
-0.375 0.015625
-0.375 0.03125
-0.375 0.046875
-0.375 0.0625
-0.375 0.09375
-0.375 0.125
-0.375 0.15625
-0.375 0.1875
-0.375 0.25
-0.375 0.3125
-0.375 0.375
-0.375 0.5
-0.375 0.625
-0.40625 0.0
-0.40625 0.015625
-0.40625 0.03125
-0.40625 0.046875
-0.4375 0.0
-0.4375 0.03125
-0.4375 0.0625
-0.4375 0.09375
-0.4375 0.125
-0.4375 0.15625
-0.4375 0.1875
-0.4375 0.25
-0.4375 0.3125
-0.5 0.0
-0.5 0.03125
-0.5 0.0625
-0.5 0.09375
-0.5 0.125
-0.5 0.1875
-0.5 0.25
-0.5 0.3125
-0.5 0.375
-0.5 0.5
-0.5 0.625
-0.5 0.75
-0.5 1.0
-0.5625 0.0
-0.5625 0.03125
-0.5625 0.0625
-0.5625 0.09375
-0.5625 0.125
-0.5625 0.1875
-0.5625 0.25
-0.5625 0.3125
-0.625 0.0
-0.625 0.0625
-0.625 0.125
-0.625 0.1875
-0.625 0.25
-0.625 0.375
-0.625 0.5
-0.625 0.625
-0.6875 0.0
-0.6875 0.0625
-0.6875 0.125
-0.6875 0.1875
-0.75 0.0
-0.75 0.125
-0.75 0.25
-0.75 0.5
-0.75 0.75
-0.75 1.0
-0.875 0.0
-0.875 0.125
-1.0 0.0
-1.0 0.25
-1.0 0.5
-1.0 0.75
-1.0 1.0
-1.25 0.0
-1.25 0.25
-1.25 0.5
-1.25 0.75
-1.25 1.0
-1.5 0.0
-1.5 0.25
-1.5 0.5
-1.5 0.75
-1.5 1.0
-1.75 0.0
-1.75 0.25
-1.75 0.5
-1.75 0.75
-1.75 1.0
-2.0 0.0
-2.0 0.25
-2.0 0.5
-2.0 0.75
-2.0 1.0
-2.25 0.0
-2.25 0.25
-2.25 0.5
-2.25 0.75
-2.25 1.0
-2.5 0.0
-2.5 0.25
-2.5 0.5
-2.5 0.75
-2.5 1.0
-2.75 0.0
-2.75 0.25
-2.75 0.5
-2.75 0.75
-2.75 1.0
-3.0 0.0
-3.0 0.25
-3.0 0.5
-3.0 0.75
-3.0 1.0
CELLS:
3 0 0 14 1
3 0 1 14 15
3 0 1 15 2
3 0 2 15 16
3 0 2 16 3
3 0 3 16 17
3 0 3 17 4
3 0 4 17 18
3 0 4 18 5
3 0 5 18 19
3 0 5 19 6
3 0 6 19 20
3 0 6 20 7
3 0 7 20 21
3 0 7 21 8
3 0 8 21 22
3 0 14 23 24
3 0 14 24 15
3 0 15 24 25
3 0 15 25 16
3 0 16 25 26
3 0 16 26 17
3 0 17 26 27
3 0 17 27 18
3 0 18 27 28
3 0 18 28 19
3 0 19 28 29
3 0 19 29 20
3 0 20 29 30
3 0 20 30 21
3 0 21 30 31
3 0 21 31 22
3 0 22 31 32
3 0 8 22 9
3 0 9 22 33
3 0 22 32 33
3 0 9 33 10
3 0 10 33 34
3 0 10 34 11
3 0 11 34 35
3 0 23 36 37
3 0 23 37 24
3 0 24 37 38
3 0 24 38 25
3 0 25 38 39
3 0 25 39 26
3 0 26 39 40
3 0 26 40 27
3 0 27 40 41
3 0 27 41 28
3 0 28 41 42
3 0 28 42 29
3 0 29 42 43
3 0 29 43 30
3 0 30 43 44
3 0 30 44 31
3 0 31 44 45
3 0 31 45 32
3 0 32 45 46
3 0 36 47 48
3 0 36 48 37
3 0 37 48 49
3 0 37 49 38
3 0 38 49 50
3 0 38 50 39
3 0 39 50 51
3 0 39 51 40
3 0 40 51 52
3 0 40 52 41
3 0 41 52 53
3 0 47 54 55
3 0 47 55 48
3 0 48 55 56
3 0 48 56 49
3 0 49 56 57
3 0 49 57 50
3 0 50 57 58
3 0 50 58 51
3 0 51 58 59
3 0 51 59 52
3 0 52 59 60
3 0 41 53 42
3 0 42 53 61
3 0 53 60 61
3 0 52 60 53
3 0 42 61 43
3 0 43 61 62
3 0 43 62 44
3 0 44 62 63
3 0 44 63 45
3 0 45 63 64
3 0 45 64 46
3 0 46 64 65
3 0 32 46 33
3 0 33 46 66
3 0 46 65 66
3 0 33 66 34
3 0 34 66 67
3 0 34 67 35
3 0 35 67 68
3 0 11 35 12
3 0 12 35 69
3 0 35 68 69
3 0 12 69 13
3 0 13 69 70
3 0 54 71 55
3 0 55 71 72
3 0 55 72 56
3 0 56 72 73
3 0 56 73 57
3 0 57 73 74
3 0 57 74 58
3 0 58 74 75
3 0 58 75 59
3 0 59 75 76
3 0 71 77 72
3 0 72 77 78
3 0 72 78 73
3 0 73 78 79
3 0 73 79 74
3 0 74 79 80
3 0 74 80 75
3 0 75 80 81
3 0 75 81 76
3 0 76 81 82
3 0 59 76 60
3 0 60 76 83
3 0 76 82 83
3 0 60 83 61
3 0 61 83 84
3 0 61 84 62
3 0 62 84 85
3 0 62 85 63
3 0 63 85 86
3 0 63 86 64
3 0 64 86 87
3 0 64 87 65
3 0 65 87 88
3 0 77 89 78
3 0 78 89 90
3 0 78 90 79
3 0 79 90 91
3 0 79 91 80
3 0 80 91 92
3 0 80 92 81
3 0 81 92 93
3 0 81 93 82
3 0 82 93 94
3 0 89 95 90
3 0 90 95 96
3 0 90 96 91
3 0 91 96 97
3 0 91 97 92
3 0 92 97 98
3 0 92 98 93
3 0 93 98 99
3 0 82 94 83
3 0 83 94 100
3 0 94 99 100
3 0 93 99 94
3 0 83 100 84
3 0 84 100 101
3 0 84 101 85
3 0 85 101 102
3 0 85 102 86
3 0 86 102 103
3 0 86 103 87
3 0 87 103 104
3 0 87 104 88
3 0 88 104 105
3 0 65 88 66
3 0 66 88 106
3 0 88 105 106
3 0 66 106 67
3 0 67 106 107
3 0 67 107 68
3 0 68 107 108
3 0 95 109 96
3 0 96 109 110
3 0 96 110 97
3 0 97 110 111
3 0 97 111 98
3 0 98 111 112
3 0 109 113 110
3 0 110 113 114
3 0 110 114 111
3 0 111 114 112
3 0 112 114 115
3 0 98 112 99
3 0 99 112 115
3 0 99 115 100
3 0 100 115 116
3 0 100 116 101
3 0 101 116 117
3 0 101 117 102
3 0 102 117 118
3 0 102 118 103
3 0 103 118 119
3 0 103 119 104
3 0 104 119 120
3 0 104 120 105
3 0 105 120 121
3 0 113 122 114
3 0 114 122 123
3 0 114 123 115
3 0 115 123 124
3 0 115 124 116
3 0 116 124 125
3 0 116 125 117
3 0 117 125 126
3 0 117 126 118
3 0 118 126 127
3 0 118 127 119
3 0 119 127 120
3 0 120 127 128
3 0 120 128 121
3 0 121 128 129
3 0 105 121 106
3 0 106 121 130
3 0 121 129 130
3 0 106 130 107
3 0 107 130 131
3 0 107 131 108
3 0 108 131 132
3 0 68 108 69
3 0 69 108 133
3 0 108 132 133
3 0 69 133 70
3 0 70 133 134
3 0 122 135 123
3 0 123 135 136
3 0 123 136 124
3 0 124 136 137
3 0 124 137 125
3 0 125 137 138
3 0 125 138 126
3 0 126 138 139
3 0 126 139 127
3 0 127 139 140
3 0 127 140 128
3 0 128 140 141
3 0 128 141 129
3 0 129 141 142
3 0 135 143 136
3 0 136 143 144
3 0 136 144 137
3 0 137 144 138
3 0 138 144 145
3 0 138 145 139
3 0 139 145 140
3 0 140 145 146
3 0 140 146 141
3 0 141 146 147
3 0 129 142 130
3 0 130 142 148
3 0 142 147 148
3 0 141 147 142
3 0 130 148 131
3 0 131 148 149
3 0 131 149 132
3 0 132 149 150
3 0 143 151 144
3 0 144 151 152
3 0 144 152 145
3 0 145 152 153
3 0 145 153 146
3 0 146 153 154
3 0 151 155 152
3 0 152 155 156
3 0 152 156 153
3 0 146 154 147
3 0 147 154 157
3 0 154 156 157
3 0 153 156 154
3 0 147 157 148
3 0 148 157 158
3 0 148 158 149
3 0 149 158 150
3 0 150 158 159
3 0 133 150 159
3 0 132 150 133
3 0 133 159 134
3 0 134 159 160
3 0 155 161 156
3 0 156 161 162
3 0 156 162 157
3 0 157 162 164
3 0 162 163 164
3 0 161 163 162
3 0 157 164 158
3 0 158 164 165
3 0 158 165 159
3 0 159 165 166
3 0 159 166 160
3 0 160 166 167
3 0 163 168 164
3 0 164 168 169
3 0 164 169 165
3 0 165 169 170
3 0 165 170 166
3 0 166 170 171
3 0 166 171 167
3 0 167 171 172
3 0 168 173 169
3 0 169 173 174
3 0 169 174 170
3 0 170 174 175
3 0 170 175 171
3 0 171 175 176
3 0 171 176 172
3 0 172 176 177
3 0 173 178 174
3 0 174 178 179
3 0 174 179 175
3 0 175 179 180
3 0 175 180 176
3 0 176 180 181
3 0 176 181 177
3 0 177 181 182
3 0 178 183 179
3 0 179 183 184
3 0 179 184 180
3 0 180 184 185
3 0 180 185 181
3 0 181 185 186
3 0 181 186 182
3 0 182 186 187
3 0 183 188 184
3 0 184 188 189
3 0 184 189 185
3 0 185 189 190
3 0 185 190 186
3 0 186 190 191
3 0 186 191 187
3 0 187 191 192
3 0 188 193 189
3 0 189 193 194
3 0 189 194 190
3 0 190 194 195
3 0 190 195 191
3 0 191 195 196
3 0 191 196 192
3 0 192 196 197
3 0 193 198 194
3 0 194 198 199
3 0 194 199 195
3 0 195 199 200
3 0 195 200 196
3 0 196 200 201
3 0 196 201 197
3 0 197 201 202
3 0 198 203 199
3 0 199 203 204
3 0 199 204 200
3 0 200 204 205
3 0 200 205 201
3 0 201 205 206
3 0 201 206 202
3 0 202 206 207
3 0 208 0 1
3 0 208 1 209
3 0 209 1 2
3 0 209 2 210
3 0 210 2 3
3 0 210 3 211
3 0 211 3 4
3 0 211 4 212
3 0 212 4 5
3 0 212 5 213
3 0 213 5 6
3 0 213 6 214
3 0 214 6 7
3 0 214 7 215
3 0 215 7 8
3 0 215 8 216
3 0 217 208 218
3 0 218 208 209
3 0 218 209 219
3 0 219 209 210
3 0 219 210 220
3 0 220 210 211
3 0 220 211 221
3 0 221 211 212
3 0 221 212 222
3 0 222 212 213
3 0 222 213 223
3 0 223 213 214
3 0 223 214 224
3 0 224 214 215
3 0 224 215 225
3 0 225 215 216
3 0 225 216 226
3 0 216 8 9
3 0 216 9 227
3 0 226 216 227
3 0 227 9 10
3 0 227 10 228
3 0 228 10 11
3 0 228 11 229
3 0 230 217 231
3 0 231 217 218
3 0 231 218 232
3 0 232 218 219
3 0 232 219 233
3 0 233 219 220
3 0 233 220 234
3 0 234 220 221
3 0 234 221 235
3 0 235 221 222
3 0 235 222 236
3 0 236 222 223
3 0 236 223 237
3 0 237 223 224
3 0 237 224 238
3 0 238 224 225
3 0 238 225 239
3 0 239 225 226
3 0 239 226 240
3 0 241 230 242
3 0 242 230 231
3 0 242 231 243
3 0 243 231 232
3 0 243 232 244
3 0 244 232 233
3 0 244 233 245
3 0 245 233 234
3 0 245 234 246
3 0 246 234 235
3 0 246 235 247
3 0 248 241 249
3 0 249 241 242
3 0 249 242 250
3 0 250 242 243
3 0 250 243 251
3 0 251 243 244
3 0 251 244 252
3 0 252 244 245
3 0 252 245 253
3 0 253 245 246
3 0 253 246 254
3 0 247 235 236
3 0 247 236 255
3 0 254 247 255
3 0 254 246 247
3 0 255 236 237
3 0 255 237 256
3 0 256 237 238
3 0 256 238 257
3 0 257 238 239
3 0 257 239 258
3 0 258 239 240
3 0 258 240 259
3 0 240 226 227
3 0 240 227 260
3 0 259 240 260
3 0 260 227 228
3 0 260 228 261
3 0 261 228 229
3 0 261 229 262
3 0 229 11 12
3 0 229 12 263
3 0 262 229 263
3 0 263 12 13
3 0 263 13 264
3 0 265 248 249
3 0 265 249 266
3 0 266 249 250
3 0 266 250 267
3 0 267 250 251
3 0 267 251 268
3 0 268 251 252
3 0 268 252 269
3 0 269 252 253
3 0 269 253 270
3 0 271 265 266
3 0 271 266 272
3 0 272 266 267
3 0 272 267 273
3 0 273 267 268
3 0 273 268 274
3 0 274 268 269
3 0 274 269 275
3 0 275 269 270
3 0 275 270 276
3 0 270 253 254
3 0 270 254 277
3 0 276 270 277
3 0 277 254 255
3 0 277 255 278
3 0 278 255 256
3 0 278 256 279
3 0 279 256 257
3 0 279 257 280
3 0 280 257 258
3 0 280 258 281
3 0 281 258 259
3 0 281 259 282
3 0 283 271 272
3 0 283 272 284
3 0 284 272 273
3 0 284 273 285
3 0 285 273 274
3 0 285 274 286
3 0 286 274 275
3 0 286 275 287
3 0 287 275 276
3 0 287 276 288
3 0 289 283 284
3 0 289 284 290
3 0 290 284 285
3 0 290 285 291
3 0 291 285 286
3 0 291 286 292
3 0 292 286 287
3 0 292 287 293
3 0 288 276 277
3 0 288 277 294
3 0 293 288 294
3 0 293 287 288
3 0 294 277 278
3 0 294 278 295
3 0 295 278 279
3 0 295 279 296
3 0 296 279 280
3 0 296 280 297
3 0 297 280 281
3 0 297 281 298
3 0 298 281 282
3 0 298 282 299
3 0 282 259 260
3 0 282 260 300
3 0 299 282 300
3 0 300 260 261
3 0 300 261 301
3 0 301 261 262
3 0 301 262 302
3 0 303 289 290
3 0 303 290 304
3 0 304 290 291
3 0 304 291 305
3 0 305 291 292
3 0 305 292 306
3 0 307 303 304
3 0 307 304 308
3 0 308 304 305
3 0 308 305 306
3 0 308 306 309
3 0 306 292 293
3 0 306 293 309
3 0 309 293 294
3 0 309 294 310
3 0 310 294 295
3 0 310 295 311
3 0 311 295 296
3 0 311 296 312
3 0 312 296 297
3 0 312 297 313
3 0 313 297 298
3 0 313 298 314
3 0 314 298 299
3 0 314 299 315
3 0 316 307 308
3 0 316 308 317
3 0 317 308 309
3 0 317 309 318
3 0 318 309 310
3 0 318 310 319
3 0 319 310 311
3 0 319 311 320
3 0 320 311 312
3 0 320 312 321
3 0 321 312 313
3 0 321 313 314
3 0 321 314 322
3 0 322 314 315
3 0 322 315 323
3 0 315 299 300
3 0 315 300 324
3 0 323 315 324
3 0 324 300 301
3 0 324 301 325
3 0 325 301 302
3 0 325 302 326
3 0 302 262 263
3 0 302 263 327
3 0 326 302 327
3 0 327 263 264
3 0 327 264 328
3 0 329 316 317
3 0 329 317 330
3 0 330 317 318
3 0 330 318 331
3 0 331 318 319
3 0 331 319 332
3 0 332 319 320
3 0 332 320 333
3 0 333 320 321
3 0 333 321 334
3 0 334 321 322
3 0 334 322 335
3 0 335 322 323
3 0 335 323 336
3 0 337 329 330
3 0 337 330 338
3 0 338 330 331
3 0 338 331 332
3 0 338 332 339
3 0 339 332 333
3 0 339 333 334
3 0 339 334 340
3 0 340 334 335
3 0 340 335 341
3 0 336 323 324
3 0 336 324 342
3 0 341 336 342
3 0 341 335 336
3 0 342 324 325
3 0 342 325 343
3 0 343 325 326
3 0 343 326 344
3 0 345 337 338
3 0 345 338 346
3 0 346 338 339
3 0 346 339 347
3 0 347 339 340
3 0 347 340 348
3 0 349 345 346
3 0 349 346 350
3 0 350 346 347
3 0 348 340 341
3 0 348 341 351
3 0 350 348 351
3 0 350 347 348
3 0 351 341 342
3 0 351 342 352
3 0 352 342 343
3 0 352 343 344
3 0 352 344 353
3 0 344 327 353
3 0 344 326 327
3 0 353 327 328
3 0 353 328 354
3 0 355 349 350
3 0 355 350 356
3 0 356 350 351
3 0 356 351 358
3 0 357 356 358
3 0 357 355 356
3 0 358 351 352
3 0 358 352 359
3 0 359 352 353
3 0 359 353 360
3 0 360 353 354
3 0 360 354 361
3 0 362 357 358
3 0 362 358 363
3 0 363 358 359
3 0 363 359 364
3 0 364 359 360
3 0 364 360 365
3 0 365 360 361
3 0 365 361 366
3 0 367 362 363
3 0 367 363 368
3 0 368 363 364
3 0 368 364 369
3 0 369 364 365
3 0 369 365 370
3 0 370 365 366
3 0 370 366 371
3 0 372 367 368
3 0 372 368 373
3 0 373 368 369
3 0 373 369 374
3 0 374 369 370
3 0 374 370 375
3 0 375 370 371
3 0 375 371 376
3 0 377 372 373
3 0 377 373 378
3 0 378 373 374
3 0 378 374 379
3 0 379 374 375
3 0 379 375 380
3 0 380 375 376
3 0 380 376 381
3 0 382 377 378
3 0 382 378 383
3 0 383 378 379
3 0 383 379 384
3 0 384 379 380
3 0 384 380 385
3 0 385 380 381
3 0 385 381 386
3 0 387 382 383
3 0 387 383 388
3 0 388 383 384
3 0 388 384 389
3 0 389 384 385
3 0 389 385 390
3 0 390 385 386
3 0 390 386 391
3 0 392 387 388
3 0 392 388 393
3 0 393 388 389
3 0 393 389 394
3 0 394 389 390
3 0 394 390 395
3 0 395 390 391
3 0 395 391 396
3 0 397 392 393
3 0 397 393 398
3 0 398 393 394
3 0 398 394 399
3 0 399 394 395
3 0 399 395 400
3 0 400 395 396
3 0 400 396 401
FACES:
2 10 0 14
2 10 14 23
2 10 23 36
2 10 36 47
2 10 47 54
2 10 208 0
2 10 217 208
2 10 230 217
2 10 241 230
2 10 248 241