POINTS:
0.0 0.125
0.0 0.1875
0.0 0.25
0.0 0.375
0.0 0.5
0.0 0.625
0.0 0.75
0.0 1.0
0.0625 0.125
0.0625 0.1875
0.0625 0.25
0.0625 0.3125
0.125 0.125
0.125 0.1875
0.125 0.25
0.125 0.3125
0.125 0.375
0.125 0.5
0.125 0.625
0.15625 0.125
0.15625 0.15625
0.15625 0.1875
0.15625 0.21875
0.1875 0.125
0.1875 0.140625
0.1875 0.15625
0.1875 0.1875
0.1875 0.21875
0.1875 0.25
0.1875 0.3125
0.21875 0.125
0.21875 0.140625
0.21875 0.15625
0.21875 0.1875
0.21875 0.21875
0.25 0.125
0.25 0.140625
0.25 0.15625
0.25 0.1875
0.25 0.21875
0.25 0.25
0.25 0.3125
0.25 0.375
0.25 0.5
0.25 0.625
0.25 0.75
0.25 1.0
0.28125 0.109375
0.28125 0.125
0.28125 0.140625
0.28125 0.15625
0.28125 0.1875
0.28125 0.21875
0.3125 0.09375
0.3125 0.109375
0.3125 0.125
0.3125 0.140625
0.3125 0.15625
0.3125 0.1875
0.3125 0.21875
0.3125 0.25
0.3125 0.3125
0.34375 0.078125
0.34375 0.09375
0.34375 0.125
0.34375 0.15625
0.34375 0.1875
0.34375 0.21875
0.375 0.0625
0.375 0.09375
0.375 0.125
0.375 0.1875
0.375 0.25
0.375 0.3125
0.375 0.375
0.375 0.5
0.375 0.625
0.4375 0.03125
0.4375 0.0625
0.4375 0.125
0.4375 0.1875
0.4375 0.25
0.4375 0.3125
0.5 0.0
0.5 0.0625
0.5 0.125
0.5 0.25
0.5 0.375
0.5 0.5
0.5 0.625
0.5 0.75
0.5 1.0
0.5625 0.0
0.5625 0.0625
0.625 0.0
0.625 0.125
0.625 0.25
0.625 0.375
0.625 0.5
0.625 0.625
0.75 0.0
0.75 0.25
0.75 0.5
0.75 0.75
0.75 1.0
1.0 0.0
1.0 0.25
1.0 0.5
1.0 0.75
1.0 1.0
1.25 0.0
1.25 0.25
1.25 0.5
1.25 0.75
1.25 1.0
1.5 0.0
1.5 0.25
1.5 0.5
1.5 0.75
1.5 1.0
1.75 0.0
1.75 0.25
1.75 0.5
1.75 0.75
1.75 1.0
2.0 0.0
2.0 0.25
2.0 0.5
2.0 0.75
2.0 1.0
2.25 0.0
2.25 0.25
2.25 0.5
2.25 0.75
2.25 1.0
2.5 0.0
2.5 0.25
2.5 0.5
2.5 0.75
2.5 1.0
2.75 0.0
2.75 0.25
2.75 0.5
2.75 0.75
2.75 1.0
3.0 0.0
3.0 0.25
3.0 0.5
3.0 0.75
3.0 1.0
CELLS:
3 0 0 8 1
3 0 1 8 9
3 0 1 9 2
3 0 2 9 10
3 0 2 10 11
3 0 2 11 3
3 0 3 11 16
3 0 8 12 9
3 0 9 12 13
3 0 9 13 10
3 0 10 13 14
3 0 10 14 11
3 0 11 14 15
3 0 11 15 16
3 0 3 16 4
3 0 4 16 17
3 0 4 17 5
3 0 5 17 18
3 0 5 18 6
3 0 6 18 45
3 0 12 19 20
3 0 12 20 13
3 0 13 20 21
3 0 13 21 22
3 0 13 22 14
3 0 14 22 28
3 0 19 23 24
3 0 19 24 20
3 0 20 24 25
3 0 20 25 21
3 0 21 25 26
3 0 21 26 22
3 0 22 26 27
3 0 22 27 28
3 0 14 28 15
3 0 15 28 29
3 0 15 29 16
3 0 16 29 42
3 0 23 30 24
3 0 24 30 31
3 0 24 31 25
3 0 25 31 32
3 0 25 32 26
3 0 26 32 33
3 0 26 33 27
3 0 27 33 34
3 0 27 34 28
3 0 28 34 40
3 0 30 35 31
3 0 31 35 36
3 0 31 36 32
3 0 32 36 37
3 0 32 37 33
3 0 33 37 38
3 0 33 38 34
3 0 34 38 39
3 0 34 39 40
3 0 28 40 29
3 0 29 40 41
3 0 29 41 42
3 0 16 42 17
3 0 17 42 43
3 0 17 43 18
3 0 18 43 44
3 0 18 44 45
3 0 6 45 7
3 0 7 45 46
3 0 35 47 48
3 0 35 48 36
3 0 36 48 49
3 0 36 49 37
3 0 37 49 50
3 0 37 50 38
3 0 38 50 51
3 0 38 51 39
3 0 39 51 52
3 0 39 52 40
3 0 40 52 60
3 0 47 53 54
3 0 47 54 48
3 0 48 54 55
3 0 48 55 49
3 0 49 55 56
3 0 49 56 50
3 0 50 56 57
3 0 50 57 51
3 0 51 57 58
3 0 51 58 52
3 0 52 58 59
3 0 52 59 60
3 0 40 60 41
3 0 41 60 61
3 0 41 61 42
3 0 42 61 74
3 0 53 62 63
3 0 53 63 54
3 0 54 63 64
3 0 54 64 55
3 0 55 64 56
3 0 56 64 65
3 0 56 65 57
3 0 57 65 58
3 0 58 65 66
3 0 58 66 67
3 0 58 67 59
3 0 59 67 60
3 0 60 67 72
3 0 62 68 69
3 0 62 69 63
3 0 63 69 70
3 0 63 70 64
3 0 64 70 65
3 0 65 70 71
3 0 65 71 66
3 0 66 71 67
3 0 67 71 72
3 0 60 72 61
3 0 61 72 73
3 0 61 73 74
3 0 42 74 43
3 0 43 74 75
3 0 43 75 44
3 0 44 75 76
3 0 44 76 45
3 0 45 76 90
3 0 68 77 78
3 0 68 78 69
3 0 69 78 79
3 0 69 79 70
3 0 70 79 71
3 0 71 79 80
3 0 71 80 72
3 0 72 80 81
3 0 72 81 82
3 0 72 82 73
3 0 73 82 74
3 0 74 82 87
3 0 77 83 84
3 0 77 84 78
3 0 78 84 79
3 0 79 84 85
3 0 79 85 80
3 0 80 85 86
3 0 80 86 81
3 0 81 86 82
3 0 82 86 87
3 0 74 87 75
3 0 75 87 88
3 0 75 88 76
3 0 76 88 89
3 0 76 89 90
3 0 45 90 46
3 0 46 90 91
3 0 83 92 93
3 0 83 93 84
3 0 84 93 85
3 0 85 93 95
3 0 92 94 93
3 0 93 94 95
3 0 85 95 86
3 0 86 95 96
3 0 86 96 87
3 0 87 96 97
3 0 87 97 88
3 0 88 97 98
3 0 88 98 99
3 0 88 99 89
3 0 89 99 90
3 0 90 99 103
3 0 94 100 95
3 0 95 100 101
3 0 95 101 96
3 0 96 101 97
3 0 97 101 102
3 0 97 102 98
3 0 98 102 99
3 0 99 102 103
3 0 90 103 91
3 0 91 103 104
3 0 100 105 101
3 0 101 105 106
3 0 101 106 102
3 0 102 106 107
3 0 102 107 103
3 0 103 107 108
3 0 103 108 104
3 0 104 108 109
3 0 105 110 106
3 0 106 110 111
3 0 106 111 107
3 0 107 111 112
3 0 107 112 108
3 0 108 112 113
3 0 108 113 109
3 0 109 113 114
3 0 110 115 111
3 0 111 115 116
3 0 111 116 112
3 0 112 116 117
3 0 112 117 113
3 0 113 117 118
3 0 113 118 114
3 0 114 118 119
3 0 115 120 116
3 0 116 120 121
3 0 116 121 117
3 0 117 121 122
3 0 117 122 118
3 0 118 122 123
3 0 118 123 119
3 0 119 123 124
3 0 120 125 121
3 0 121 125 126
3 0 121 126 122
3 0 122 126 127
3 0 122 127 123
3 0 123 127 128
3 0 123 128 124
3 0 124 128 129
3 0 125 130 126
3 0 126 130 131
3 0 126 131 127
3 0 127 131 132
3 0 127 132 128
3 0 128 132 133
3 0 128 133 129
3 0 129 133 134
3 0 130 135 131
3 0 131 135 136
3 0 131 136 132
3 0 132 136 137
3 0 132 137 133
3 0 133 137 138
3 0 133 138 134
3 0 134 138 139
3 0 135 140 136
3 0 136 140 141
3 0 136 141 137
3 0 137 141 142
3 0 137 142 138
3 0 138 142 143
3 0 138 143 139
3 0 139 143 144
3 0 140 145 141
3 0 141 145 146
3 0 141 146 142
3 0 142 146 147
3 0 142 147 143
3 0 143 147 148
3 0 143 148 144
3 0 144 148 149
FACES:
2 1 149 144
2 1 144 139
2 1 139 134
2 1 134 129
2 1 129 124
2 1 124 119
2 1 119 114
2 1 114 109
2 1 109 104
2 1 104 91
2 1 91 46
2 1 46 7
2 77 7 6
2 77 6 5
2 77 5 4
2 77 4 3
2 77 3 2
2 77 2 1
2 77 1 0
2 10 0 8
2 10 8 12
2 10 12 19
2 10 19 23
2 10 23 30
2 10 30 35
2 10 35 47
2 10 47 53
2 10 53 62
2 10 62 68
2 10 68 77
2 10 77 83
2 1 83 92
2 1 92 94
2 1 94 100
2 1 100 105
2 1 105 110
2 1 110 115
2 1 115 120
2 1 120 125
2 1 125 130
2 1 130 135
2 1 135 140
2 1 140 145
2 1 145 146
2 1 146 147
2 1 147 148
2 1 148 149
