POINTS:
0.0 0.46875
0.0 0.5
0.0 0.53125
0.0 0.5625
0.0 0.625
0.0 0.75
0.0 1.0
0.125 0.46875
0.125 0.5
0.125 0.53125
0.125 0.5625
0.25 0.46875
0.25 0.5
0.25 0.53125
0.25 0.5625
0.25 0.625
0.25 0.75
0.25 1.0
0.375 0.46875
0.375 0.5
0.375 0.53125
0.375 0.5625
0.5 0.4375
0.5 0.46875
0.5 0.5
0.5 0.5625
0.5 0.625
0.5 0.75
0.5 1.0
0.625 0.40625
0.625 0.4375
0.625 0.46875
0.625 0.5
0.75 0.375
0.75 0.40625
0.75 0.4375
0.75 0.5
0.75 0.5625
0.75 0.625
0.75 0.75
0.75 1.0
0.875 0.34375
0.875 0.375
0.875 0.40625
0.875 0.4375
1.0 0.3125
1.0 0.34375
1.0 0.375
1.0 0.4375
1.0 0.5
1.0 0.625
1.0 0.75
1.0 1.0
1.125 0.28125
1.125 0.3125
1.125 0.34375
1.125 0.375
1.25 0.25
1.25 0.28125
1.25 0.3125
1.25 0.375
1.25 0.4375
1.25 0.5
1.25 0.75
1.25 1.0
1.375 0.21875
1.375 0.25
1.375 0.28125
1.375 0.3125
1.5 0.1875
1.5 0.21875
1.5 0.25
1.5 0.3125
1.5 0.375
1.5 0.5
1.5 0.75
1.5 1.0
1.625 0.15625
1.625 0.1875
1.625 0.21875
1.625 0.25
1.75 0.125
1.75 0.15625
1.75 0.1875
1.75 0.25
1.75 0.3125
1.75 0.375
1.75 0.5
1.75 0.75
1.75 1.0
1.875 0.09375
1.875 0.125
1.875 0.15625
1.875 0.1875
2.0 0.0625
2.0 0.09375
2.0 0.125
2.0 0.1875
2.0 0.25
2.0 0.375
2.0 0.5
2.0 0.75
2.0 1.0
2.125 0.03125
2.125 0.0625
2.125 0.09375
2.125 0.125
2.25 0.0
2.25 0.03125
2.25 0.0625
2.25 0.125
2.25 0.1875
2.25 0.25
2.25 0.5
2.25 0.75
2.25 1.0
2.375 0.0
2.375 0.03125
2.375 0.0625
2.5 0.0
2.5 0.0625
2.5 0.125
2.5 0.25
2.5 0.5
2.5 0.75
2.5 1.0
2.75 0.0
2.75 0.125
2.75 0.25
2.75 0.5
2.75 0.75
2.75 1.0
3.0 0.0
3.0 0.25
3.0 0.5
3.0 0.75
3.0 1.0
3.25 0.0
3.25 0.25
3.25 0.5
3.25 0.75
3.25 1.0
3.5 0.0
3.5 0.25
3.5 0.5
3.5 0.75
3.5 1.0
3.75 0.0
3.75 0.25
3.75 0.5
3.75 0.75
3.75 1.0
4.0 0.0
4.0 0.25
4.0 0.5
4.0 0.75
4.0 1.0
4.25 0.0
4.25 0.25
4.25 0.5
4.25 0.75
4.25 1.0
4.5 0.0
4.5 0.25
4.5 0.5
4.5 0.75
4.5 1.0
4.75 0.0
4.75 0.25
4.75 0.5
4.75 0.75
4.75 1.0
5.0 0.0
5.0 0.25
5.0 0.5
5.0 0.75
5.0 1.0
CELLS:
3 0 0 7 1
3 0 1 7 8
3 0 1 8 2
3 0 2 8 9
3 0 2 9 3
3 0 3 9 10
3 0 7 11 8
3 0 8 11 12
3 0 8 12 9
3 0 9 12 13
3 0 9 13 10
3 0 10 13 14
3 0 3 10 4
3 0 4 10 15
3 0 10 14 15
3 0 4 15 5
3 0 5 15 16
3 0 5 16 6
3 0 6 16 17
3 0 11 18 12
3 0 12 18 19
3 0 12 19 13
3 0 13 19 20
3 0 13 20 14
3 0 14 20 21
3 0 18 22 23
3 0 18 23 19
3 0 19 23 24
3 0 19 24 20
3 0 20 24 25
3 0 20 25 21
3 0 14 21 15
3 0 15 21 26
3 0 21 25 26
3 0 15 26 16
3 0 16 26 27
3 0 16 27 17
3 0 17 27 28
3 0 22 29 30
3 0 22 30 23
3 0 23 30 31
3 0 23 31 24
3 0 24 31 32
3 0 29 33 34
3 0 29 34 30
3 0 30 34 35
3 0 30 35 31
3 0 31 35 36
3 0 31 36 32
3 0 24 32 25
3 0 25 32 37
3 0 32 36 37
3 0 25 37 26
3 0 26 37 38
3 0 26 38 27
3 0 27 38 39
3 0 27 39 28
3 0 28 39 40
3 0 33 41 42
3 0 33 42 34
3 0 34 42 43
3 0 34 43 35
3 0 35 43 44
3 0 41 45 46
3 0 41 46 42
3 0 42 46 47
3 0 42 47 43
3 0 43 47 48
3 0 43 48 44
3 0 35 44 36
3 0 36 44 49
3 0 44 48 49
3 0 36 49 37
3 0 37 49 50
3 0 37 50 38
3 0 38 50 39
3 0 39 50 51
3 0 39 51 40
3 0 40 51 52
3 0 45 53 54
3 0 45 54 46
3 0 46 54 55
3 0 46 55 47
3 0 47 55 56
3 0 53 57 58
3 0 53 58 54
3 0 54 58 59
3 0 54 59 55
3 0 55 59 60
3 0 55 60 56
3 0 47 56 48
3 0 48 56 61
3 0 56 60 61
3 0 48 61 49
3 0 49 61 62
3 0 49 62 50
3 0 50 62 63
3 0 50 63 51
3 0 51 63 52
3 0 52 63 64
3 0 57 65 66
3 0 57 66 58
3 0 58 66 67
3 0 58 67 59
3 0 59 67 68
3 0 65 69 70
3 0 65 70 66
3 0 66 70 71
3 0 66 71 67
3 0 67 71 72
3 0 67 72 68
3 0 59 68 60
3 0 60 68 73
3 0 68 72 73
3 0 60 73 61
3 0 61 73 74
3 0 61 74 62
3 0 62 74 63
3 0 63 74 75
3 0 63 75 64
3 0 64 75 76
3 0 69 77 78
3 0 69 78 70
3 0 70 78 79
3 0 70 79 71
3 0 71 79 80
3 0 77 81 82
3 0 77 82 78
3 0 78 82 83
3 0 78 83 79
3 0 79 83 84
3 0 79 84 80
3 0 71 80 72
3 0 72 80 85
3 0 80 84 85
3 0 72 85 73
3 0 73 85 86
3 0 73 86 74
3 0 74 86 87
3 0 74 87 75
3 0 75 87 88
3 0 75 88 76
3 0 76 88 89
3 0 81 90 91
3 0 81 91 82
3 0 82 91 92
3 0 82 92 83
3 0 83 92 93
3 0 90 94 95
3 0 90 95 91
3 0 91 95 96
3 0 91 96 92
3 0 92 96 97
3 0 92 97 93
3 0 83 93 84
3 0 84 93 98
3 0 93 97 98
3 0 84 98 85
3 0 85 98 99
3 0 85 99 86
3 0 86 99 87
3 0 87 99 100
3 0 87 100 88
3 0 88 100 101
3 0 88 101 89
3 0 89 101 102
3 0 94 103 104
3 0 94 104 95
3 0 95 104 105
3 0 95 105 96
3 0 96 105 106
3 0 103 107 108
3 0 103 108 104
3 0 104 108 109
3 0 104 109 105
3 0 105 109 110
3 0 105 110 106
3 0 96 106 97
3 0 97 106 111
3 0 106 110 111
3 0 97 111 98
3 0 98 111 112
3 0 98 112 99
3 0 99 112 113
3 0 99 113 100
3 0 100 113 101
3 0 101 113 114
3 0 101 114 102
3 0 102 114 115
3 0 107 116 108
3 0 108 116 117
3 0 108 117 109
3 0 109 117 118
3 0 116 119 117
3 0 117 119 120
3 0 117 120 118
3 0 109 118 110
3 0 110 118 121
3 0 118 120 121
3 0 110 121 111
3 0 111 121 122
3 0 111 122 112
3 0 112 122 113
3 0 113 122 123
3 0 113 123 114
3 0 114 123 124
3 0 114 124 115
3 0 115 124 125
3 0 119 126 120
3 0 120 126 127
3 0 120 127 121
3 0 121 127 122
3 0 122 127 128
3 0 122 128 123
3 0 123 128 129
3 0 123 129 124
3 0 124 129 130
3 0 124 130 125
3 0 125 130 131
3 0 126 132 127
3 0 127 132 133
3 0 127 133 128
3 0 128 133 129
3 0 129 133 134
3 0 129 134 130
3 0 130 134 135
3 0 130 135 131
3 0 131 135 136
3 0 132 137 133
3 0 133 137 138
3 0 133 138 134
3 0 134 138 139
3 0 134 139 135
3 0 135 139 140
3 0 135 140 136
3 0 136 140 141
3 0 137 142 138
3 0 138 142 143
3 0 138 143 139
3 0 139 143 144
3 0 139 144 140
3 0 140 144 145
3 0 140 145 141
3 0 141 145 146
3 0 142 147 143
3 0 143 147 148
3 0 143 148 144
3 0 144 148 149
3 0 144 149 145
3 0 145 149 150
3 0 145 150 146
3 0 146 150 151
3 0 147 152 148
3 0 148 152 153
3 0 148 153 149
3 0 149 153 154
3 0 149 154 150
3 0 150 154 155
3 0 150 155 151
3 0 151 155 156
3 0 152 157 153
3 0 153 157 158
3 0 153 158 154
3 0 154 158 159
3 0 154 159 155
3 0 155 159 160
3 0 155 160 156
3 0 156 160 161
3 0 157 162 158
3 0 158 162 163
3 0 158 163 159
3 0 159 163 164
3 0 159 164 160
3 0 160 164 165
3 0 160 165 161
3 0 161 165 166
3 0 162 167 163
3 0 163 167 168
3 0 163 168 164
3 0 164 168 169
3 0 164 169 165
3 0 165 169 170
3 0 165 170 166
3 0 166 170 171
3 0 167 172 168
3 0 168 172 173
3 0 168 173 169
3 0 169 173 174
3 0 169 174 170
3 0 170 174 175
3 0 170 175 171
3 0 171 175 176
FACES:
2 1 176 171
2 1 171 166
2 1 166 161
2 1 161 156
2 1 156 151
2 1 151 146
2 1 146 141
2 1 141 136
2 1 136 131
2 1 131 125
2 1 125 115
2 1 115 102
2 1 102 89
2 1 89 76
2 1 76 64
2 1 64 52
2 1 52 40
2 1 40 28
2 1 28 17
2 1 17 6
2 77 6 5
2 77 5 4
2 77 4 3
2 77 3 2
2 77 2 1
2 77 1 0
2 10 0 7
2 10 7 11
2 10 11 18
2 10 18 22
2 10 22 29
2 10 29 33
2 10 33 41
2 10 41 45
2 10 45 53
2 10 53 57
2 10 57 65
2 10 65 69
2 10 69 77
2 10 77 81
2 10 81 90
2 10 90 94
2 10 94 103
2 10 103 107
2 1 107 116
2 1 116 119
2 1 119 126
2 1 126 132
2 1 132 137
2 1 137 142
2 1 142 147
2 1 147 152
2 1 152 157
2 1 157 162
2 1 162 167
2 1 167 172
2 1 172 173
2 1 173 174
2 1 174 175
2 1 175 176
