POINTS:
0.0 0.0
0.0 0.25
0.0 0.5
0.0 0.75
0.0 1.0
0.25 0.0
0.25 0.25
0.25 0.5
0.25 0.75
0.25 1.0
0.5 0.0
0.5 0.25
0.5 0.5
0.5 0.75
0.5 1.0
0.75 0.0
0.75 0.25
0.75 0.5
0.75 0.75
0.75 1.0
1.0 0.0
1.0 0.25
1.0 0.5
1.0 0.75
1.0 1.0
1.25 0.0
1.25 0.25
1.25 0.5
1.25 0.75
1.25 1.0
1.5 0.0
1.5 0.25
1.5 0.5
1.5 0.75
1.5 1.0
1.75 0.0
1.75 0.25
1.75 0.5
1.75 0.75
1.75 1.0
2.0 0.0
2.0 0.25
2.0 0.5
2.0 0.75
2.0 1.0
2.25 0.0
2.25 0.25
2.25 0.5
2.25 0.75
2.25 1.0
2.5 0.0
2.5 0.25
2.5 0.5
2.5 0.75
2.5 1.0
2.75 0.0
2.75 0.25
2.75 0.5
2.75 0.75
2.75 1.0
3.0 0.0
3.0 0.25
3.0 0.5
3.0 0.75
3.0 1.0
3.25 0.0
3.25 0.25
3.25 0.5
3.25 0.75
3.25 1.0
3.5 0.0
3.5 0.25
3.5 0.5
3.5 0.75
3.5 1.0
3.75 0.0
3.75 0.25
3.75 0.5
3.75 0.75
3.75 1.0
4.0 0.0
4.0 0.25
4.0 0.5
4.0 0.75
4.0 1.0
4.25 0.0
4.25 0.25
4.25 0.5
4.25 0.75
4.25 1.0
4.5 0.0
4.5 0.25
4.5 0.5
4.5 0.75
4.5 1.0
4.75 0.0
4.75 0.25
4.75 0.5
4.75 0.75
4.75 1.0
5.0 0.0
5.0 0.25
5.0 0.5
5.0 0.75
5.0 1.0
-0.25 0.0
-0.25 0.25
-0.25 0.5
-0.25 0.75
-0.25 1.0
-0.5 0.0
-0.5 0.25
-0.5 0.5
-0.5 0.75
-0.5 1.0
-0.75 0.0
-0.75 0.25
-0.75 0.5
-0.75 0.75
-0.75 1.0
-1.0 0.0
-1.0 0.25
-1.0 0.5
-1.0 0.75
-1.0 1.0
-1.25 0.0
-1.25 0.25
-1.25 0.5
-1.25 0.75
-1.25 1.0
-1.5 0.0
-1.5 0.25
-1.5 0.5
-1.5 0.75
-1.5 1.0
-1.75 0.0
-1.75 0.25
-1.75 0.5
-1.75 0.75
-1.75 1.0
-2.0 0.0
-2.0 0.25
-2.0 0.5
-2.0 0.75
-2.0 1.0
-2.25 0.0
-2.25 0.25
-2.25 0.5
-2.25 0.75
-2.25 1.0
-2.5 0.0
-2.5 0.25
-2.5 0.5
-2.5 0.75
-2.5 1.0
-2.75 0.0
-2.75 0.25
-2.75 0.5
-2.75 0.75
-2.75 1.0
-3.0 0.0
-3.0 0.25
-3.0 0.5
-3.0 0.75
-3.0 1.0
-3.25 0.0
-3.25 0.25
-3.25 0.5
-3.25 0.75
-3.25 1.0
-3.5 0.0
-3.5 0.25
-3.5 0.5
-3.5 0.75
-3.5 1.0
-3.75 0.0
-3.75 0.25
-3.75 0.5
-3.75 0.75
-3.75 1.0
-4.0 0.0
-4.0 0.25
-4.0 0.5
-4.0 0.75
-4.0 1.0
-4.25 0.0
-4.25 0.25
-4.25 0.5
-4.25 0.75
-4.25 1.0
-4.5 0.0
-4.5 0.25
-4.5 0.5
-4.5 0.75
-4.5 1.0
-4.75 0.0
-4.75 0.25
-4.75 0.5
-4.75 0.75
-4.75 1.0
-5.0 0.0
-5.0 0.25
-5.0 0.5
-5.0 0.75
-5.0 1.0
CELLS:
3 0 0 5 1
3 0 1 5 6
3 0 1 6 2
3 0 2 6 7
3 0 2 7 3
3 0 3 7 8
3 0 3 8 4
3 0 4 8 9
3 0 5 10 6
3 0 6 10 11
3 0 6 11 7
3 0 7 11 12
3 0 7 12 8
3 0 8 12 13
3 0 8 13 9
3 0 9 13 14
3 0 10 15 11
3 0 11 15 16
3 0 11 16 12
3 0 12 16 17
3 0 12 17 13
3 0 13 17 18
3 0 13 18 14
3 0 14 18 19
3 0 15 20 16
3 0 16 20 21
3 0 16 21 17
3 0 17 21 22
3 0 17 22 18
3 0 18 22 23
3 0 18 23 19
3 0 19 23 24
3 0 20 25 21
3 0 21 25 26
3 0 21 26 22
3 0 22 26 27
3 0 22 27 23
3 0 23 27 28
3 0 23 28 24
3 0 24 28 29
3 0 25 30 26
3 0 26 30 31
3 0 26 31 27
3 0 27 31 32
3 0 27 32 28
3 0 28 32 33
3 0 28 33 29
3 0 29 33 34
3 0 30 35 31
3 0 31 35 36
3 0 31 36 32
3 0 32 36 37
3 0 32 37 33
3 0 33 37 38
3 0 33 38 34
3 0 34 38 39
3 0 35 40 36
3 0 36 40 41
3 0 36 41 37
3 0 37 41 42
3 0 37 42 38
3 0 38 42 43
3 0 38 43 39
3 0 39 43 44
3 0 40 45 41
3 0 41 45 46
3 0 41 46 42
3 0 42 46 47
3 0 42 47 43
3 0 43 47 48
3 0 43 48 44
3 0 44 48 49
3 0 45 50 46
3 0 46 50 51
3 0 46 51 47
3 0 47 51 52
3 0 47 52 48
3 0 48 52 53
3 0 48 53 49
3 0 49 53 54
3 0 50 55 51
3 0 51 55 56
3 0 51 56 52
3 0 52 56 57
3 0 52 57 53
3 0 53 57 58
3 0 53 58 54
3 0 54 58 59
3 0 55 60 56
3 0 56 60 61
3 0 56 61 57
3 0 57 61 62
3 0 57 62 58
3 0 58 62 63
3 0 58 63 59
3 0 59 63 64
3 0 60 65 61
3 0 61 65 66
3 0 61 66 62
3 0 62 66 67
3 0 62 67 63
3 0 63 67 68
3 0 63 68 64
3 0 64 68 69
3 0 65 70 66
3 0 66 70 71
3 0 66 71 67
3 0 67 71 72
3 0 67 72 68
3 0 68 72 73
3 0 68 73 69
3 0 69 73 74
3 0 70 75 71
3 0 71 75 76
3 0 71 76 72
3 0 72 76 77
3 0 72 77 73
3 0 73 77 78
3 0 73 78 74
3 0 74 78 79
3 0 75 80 76
3 0 76 80 81
3 0 76 81 77
3 0 77 81 82
3 0 77 82 78
3 0 78 82 83
3 0 78 83 79
3 0 79 83 84
3 0 80 85 81
3 0 81 85 86
3 0 81 86 82
3 0 82 86 87
3 0 82 87 83
3 0 83 87 88
3 0 83 88 84
3 0 84 88 89
3 0 85 90 86
3 0 86 90 91
3 0 86 91 87
3 0 87 91 92
3 0 87 92 88
3 0 88 92 93
3 0 88 93 89
3 0 89 93 94
3 0 90 95 91
3 0 91 95 96
3 0 91 96 92
3 0 92 96 97
3 0 92 97 93
3 0 93 97 98
3 0 93 98 94
3 0 94 98 99
3 0 95 100 96
3 0 96 100 101
3 0 96 101 97
3 0 97 101 102
3 0 97 102 98
3 0 98 102 103
3 0 98 103 99
3 0 99 103 104
3 0 105 0 1
3 0 105 1 106
3 0 106 1 2
3 0 106 2 107
3 0 107 2 3
3 0 107 3 108
3 0 108 3 4
3 0 108 4 109
3 0 110 105 106
3 0 110 106 111
3 0 111 106 107
3 0 111 107 112
3 0 112 107 108
3 0 112 108 113
3 0 113 108 109
3 0 113 109 114
3 0 115 110 111
3 0 115 111 116
3 0 116 111 112
3 0 116 112 117
3 0 117 112 113
3 0 117 113 118
3 0 118 113 114
3 0 118 114 119
3 0 120 115 116
3 0 120 116 121
3 0 121 116 117
3 0 121 117 122
3 0 122 117 118
3 0 122 118 123
3 0 123 118 119
3 0 123 119 124
3 0 125 120 121
3 0 125 121 126
3 0 126 121 122
3 0 126 122 127
3 0 127 122 123
3 0 127 123 128
3 0 128 123 124
3 0 128 124 129
3 0 130 125 126
3 0 130 126 131
3 0 131 126 127
3 0 131 127 132
3 0 132 127 128
3 0 132 128 133
3 0 133 128 129
3 0 133 129 134
3 0 135 130 131
3 0 135 131 136
3 0 136 131 132
3 0 136 132 137
3 0 137 132 133
3 0 137 133 138
3 0 138 133 134
3 0 138 134 139
3 0 140 135 136
3 0 140 136 141
3 0 141 136 137
3 0 141 137 142
3 0 142 137 138
3 0 142 138 143
3 0 143 138 139
3 0 143 139 144
3 0 145 140 141
3 0 145 141 146
3 0 146 141 142
3 0 146 142 147
3 0 147 142 143
3 0 147 143 148
3 0 148 143 144
3 0 148 144 149
3 0 150 145 146
3 0 150 146 151
3 0 151 146 147
3 0 151 147 152
3 0 152 147 148
3 0 152 148 153
3 0 153 148 149
3 0 153 149 154
3 0 155 150 151
3 0 155 151 156
3 0 156 151 152
3 0 156 152 157
3 0 157 152 153
3 0 157 153 158
3 0 158 153 154
3 0 158 154 159
3 0 160 155 156
3 0 160 156 161
3 0 161 156 157
3 0 161 157 162
3 0 162 157 158
3 0 162 158 163
3 0 163 158 159
3 0 163 159 164
3 0 165 160 161
3 0 165 161 166
3 0 166 161 162
3 0 166 162 167
3 0 167 162 163
3 0 167 163 168
3 0 168 163 164
3 0 168 164 169
3 0 170 165 166
3 0 170 166 171
3 0 171 166 167
3 0 171 167 172
3 0 172 167 168
3 0 172 168 173
3 0 173 168 169
3 0 173 169 174
3 0 175 170 171
3 0 175 171 176
3 0 176 171 172
3 0 176 172 177
3 0 177 172 173
3 0 177 173 178
3 0 178 173 174
3 0 178 174 179
3 0 180 175 176
3 0 180 176 181
3 0 181 176 177
3 0 181 177 182
3 0 182 177 178
3 0 182 178 183
3 0 183 178 179
3 0 183 179 184
3 0 185 180 181
3 0 185 181 186
3 0 186 181 182
3 0 186 182 187
3 0 187 182 183
3 0 187 183 188
3 0 188 183 184
3 0 188 184 189
3 0 190 185 186
3 0 190 186 191
3 0 191 186 187
3 0 191 187 192
3 0 192 187 188
3 0 192 188 193
3 0 193 188 189
3 0 193 189 194
3 0 195 190 191
3 0 195 191 196
3 0 196 191 192
3 0 196 192 197
3 0 197 192 193
3 0 197 193 198
3 0 198 193 194
3 0 198 194 199
3 0 200 195 196
3 0 200 196 201
3 0 201 196 197
3 0 201 197 202
3 0 202 197 198
3 0 202 198 203
3 0 203 198 199
3 0 203 199 204
FACES:
2 1 104 99
2 1 99 94
2 1 94 89
2 1 89 84
2 1 84 79
2 1 79 74
2 1 74 69
2 1 69 64
2 1 64 59
2 1 59 54
2 1 54 49
2 1 49 44
2 1 44 39
2 1 39 34
2 1 34 29
2 1 29 24
2 1 24 19
2 1 19 14
2 1 14 9
2 1 9 4
2 1 0 5
2 1 5 10
2 1 10 15
2 1 15 20
2 1 20 25
2 1 25 30
2 1 30 35
2 1 35 40
2 1 40 45
2 1 45 50
2 1 50 55
2 1 55 60
2 1 60 65
2 1 65 70
2 1 70 75
2 1 75 80
2 1 80 85
2 1 85 90
2 1 90 95
2 1 95 100
2 1 100 101
2 1 101 102
2 1 102 103
2 1 103 104
2 1 199 204
2 1 194 199
2 1 189 194
2 1 184 189
2 1 179 184
2 1 174 179
2 1 169 174
2 1 164 169
2 1 159 164
2 1 154 159
2 1 149 154
2 1 144 149
2 1 139 144
2 1 134 139
2 1 129 134
2 1 124 129
2 1 119 124
2 1 114 119
2 1 109 114
2 1 4 109
2 1 105 0
2 1 110 105
2 1 115 110
2 1 120 115
2 1 125 120
2 1 130 125
2 1 135 130
2 1 140 135
2 1 145 140
2 1 150 145
2 1 155 150
2 1 160 155
2 1 165 160
2 1 170 165
2 1 175 170
2 1 180 175
2 1 185 180
2 1 190 185
2 1 195 190
2 1 200 195
2 1 201 200
2 1 202 201
2 1 203 202
2 1 204 203