POINTS:
0.0 0.46875
0.0 0.5
0.0 0.53125
0.0 0.5625
0.0 0.625
0.0 0.75
0.0 1.0
0.125 0.46875
0.125 0.5
0.125 0.53125
0.125 0.5625
0.25 0.46875
0.25 0.5
0.25 0.53125
0.25 0.5625
0.25 0.625
0.25 0.75
0.25 1.0
0.375 0.46875
0.375 0.5
0.375 0.53125
0.375 0.5625
0.5 0.4375
0.5 0.46875
0.5 0.5
0.5 0.5625
0.5 0.625
0.5 0.75
0.5 1.0
0.625 0.40625
0.625 0.4375
0.625 0.46875
0.625 0.5
0.75 0.375
0.75 0.40625
0.75 0.4375
0.75 0.5
0.75 0.5625
0.75 0.625
0.75 0.75
0.75 1.0
0.875 0.34375
0.875 0.375
0.875 0.40625
0.875 0.4375
1.0 0.3125
1.0 0.34375
1.0 0.375
1.0 0.4375
1.0 0.5
1.0 0.625
1.0 0.75
1.0 1.0
1.125 0.28125
1.125 0.3125
1.125 0.34375
1.125 0.375
1.25 0.25
1.25 0.28125
1.25 0.3125
1.25 0.375
1.25 0.4375
1.25 0.5
1.25 0.75
1.25 1.0
1.375 0.21875
1.375 0.25
1.375 0.28125
1.375 0.3125
1.5 0.1875
1.5 0.21875
1.5 0.25
1.5 0.3125
1.5 0.375
1.5 0.5
1.5 0.75
1.5 1.0
1.625 0.15625
1.625 0.1875
1.625 0.21875
1.625 0.25
1.75 0.125
1.75 0.15625
1.75 0.1875
1.75 0.25
1.75 0.3125
1.75 0.375
1.75 0.5
1.75 0.75
1.75 1.0
1.875 0.09375
1.875 0.125
1.875 0.15625
1.875 0.1875
2.0 0.0625
2.0 0.09375
2.0 0.125
2.0 0.1875
2.0 0.25
2.0 0.375
2.0 0.5
2.0 0.75
2.0 1.0
2.125 0.03125
2.125 0.0625
2.125 0.09375
2.125 0.125
2.25 0.0
2.25 0.03125
2.25 0.0625
2.25 0.125
2.25 0.1875
2.25 0.25
2.25 0.5
2.25 0.75
2.25 1.0
2.375 0.0
2.375 0.03125
2.375 0.0625
2.5 0.0
2.5 0.0625
2.5 0.125
2.5 0.25
2.5 0.5
2.5 0.75
2.5 1.0
2.75 0.0
2.75 0.125
2.75 0.25
2.75 0.5
2.75 0.75
2.75 1.0
3.0 0.0
3.0 0.25
3.0 0.5
3.0 0.75
3.0 1.0
3.25 0.0
3.25 0.25
3.25 0.5
3.25 0.75
3.25 1.0
3.5 0.0
3.5 0.25
3.5 0.5
3.5 0.75
3.5 1.0
3.75 0.0
3.75 0.25
3.75 0.5
3.75 0.75
3.75 1.0
4.0 0.0
4.0 0.25
4.0 0.5
4.0 0.75
4.0 1.0
4.25 0.0
4.25 0.25
4.25 0.5
4.25 0.75
4.25 1.0
4.5 0.0
4.5 0.25
4.5 0.5
4.5 0.75
4.5 1.0
4.75 0.0
4.75 0.25
4.75 0.5
4.75 0.75
4.75 1.0
5.0 0.0
5.0 0.25
5.0 0.5
5.0 0.75
5.0 1.0
-0.125 0.46875
-0.125 0.5
-0.125 0.53125
-0.125 0.5625
-0.25 0.46875
-0.25 0.5
-0.25 0.53125
-0.25 0.5625
-0.25 0.625
-0.25 0.75
-0.25 1.0
-0.375 0.46875
-0.375 0.5
-0.375 0.53125
-0.375 0.5625
-0.5 0.4375
-0.5 0.46875
-0.5 0.5
-0.5 0.5625
-0.5 0.625
-0.5 0.75
-0.5 1.0
-0.625 0.40625
-0.625 0.4375
-0.625 0.46875
-0.625 0.5
-0.75 0.375
-0.75 0.40625
-0.75 0.4375
-0.75 0.5
-0.75 0.5625
-0.75 0.625
-0.75 0.75
-0.75 1.0
-0.875 0.34375
-0.875 0.375
-0.875 0.40625
-0.875 0.4375
-1.0 0.3125
-1.0 0.34375
-1.0 0.375
-1.0 0.4375
-1.0 0.5
-1.0 0.625
-1.0 0.75
-1.0 1.0
-1.125 0.28125
-1.125 0.3125
-1.125 0.34375
-1.125 0.375
-1.25 0.25
-1.25 0.28125
-1.25 0.3125
-1.25 0.375
-1.25 0.4375
-1.25 0.5
-1.25 0.75
-1.25 1.0
-1.375 0.21875
-1.375 0.25
-1.375 0.28125
-1.375 0.3125
-1.5 0.1875
-1.5 0.21875
-1.5 0.25
-1.5 0.3125
-1.5 0.375
-1.5 0.5
-1.5 0.75
-1.5 1.0
-1.625 0.15625
-1.625 0.1875
-1.625 0.21875
-1.625 0.25
-1.75 0.125
-1.75 0.15625
-1.75 0.1875
-1.75 0.25
-1.75 0.3125
-1.75 0.375
-1.75 0.5
-1.75 0.75
-1.75 1.0
-1.875 0.09375
-1.875 0.125
-1.875 0.15625
-1.875 0.1875
-2.0 0.0625
-2.0 0.09375
-2.0 0.125
-2.0 0.1875
-2.0 0.25
-2.0 0.375
-2.0 0.5
-2.0 0.75
-2.0 1.0
-2.125 0.03125
-2.125 0.0625
-2.125 0.09375
-2.125 0.125
-2.25 0.0
-2.25 0.03125
-2.25 0.0625
-2.25 0.125
-2.25 0.1875
-2.25 0.25
-2.25 0.5
-2.25 0.75
-2.25 1.0
-2.375 0.0
-2.375 0.03125
-2.375 0.0625
-2.5 0.0
-2.5 0.0625
-2.5 0.125
-2.5 0.25
-2.5 0.5
-2.5 0.75
-2.5 1.0
-2.75 0.0
-2.75 0.125
-2.75 0.25
-2.75 0.5
-2.75 0.75
-2.75 1.0
-3.0 0.0
-3.0 0.25
-3.0 0.5
-3.0 0.75
-3.0 1.0
-3.25 0.0
-3.25 0.25
-3.25 0.5
-3.25 0.75
-3.25 1.0
-3.5 0.0
-3.5 0.25
-3.5 0.5
-3.5 0.75
-3.5 1.0
-3.75 0.0
-3.75 0.25
-3.75 0.5
-3.75 0.75
-3.75 1.0
-4.0 0.0
-4.0 0.25
-4.0 0.5
-4.0 0.75
-4.0 1.0
-4.25 0.0
-4.25 0.25
-4.25 0.5
-4.25 0.75
-4.25 1.0
-4.5 0.0
-4.5 0.25
-4.5 0.5
-4.5 0.75
-4.5 1.0
-4.75 0.0
-4.75 0.25
-4.75 0.5
-4.75 0.75
-4.75 1.0
-5.0 0.0
-5.0 0.25
-5.0 0.5
-5.0 0.75
-5.0 1.0
CELLS:
3 0 0 7 1
3 0 1 7 8
3 0 1 8 2
3 0 2 8 9
3 0 2 9 3
3 0 3 9 10
3 0 7 11 8
3 0 8 11 12
3 0 8 12 9
3 0 9 12 13
3 0 9 13 10
3 0 10 13 14
3 0 3 10 4
3 0 4 10 15
3 0 10 14 15
3 0 4 15 5
3 0 5 15 16
3 0 5 16 6
3 0 6 16 17
3 0 11 18 12
3 0 12 18 19
3 0 12 19 13
3 0 13 19 20
3 0 13 20 14
3 0 14 20 21
3 0 18 22 23
3 0 18 23 19
3 0 19 23 24
3 0 19 24 20
3 0 20 24 25
3 0 20 25 21
3 0 14 21 15
3 0 15 21 26
3 0 21 25 26
3 0 15 26 16
3 0 16 26 27
3 0 16 27 17
3 0 17 27 28
3 0 22 29 30
3 0 22 30 23
3 0 23 30 31
3 0 23 31 24
3 0 24 31 32
3 0 29 33 34
3 0 29 34 30
3 0 30 34 35
3 0 30 35 31
3 0 31 35 36
3 0 31 36 32
3 0 24 32 25
3 0 25 32 37
3 0 32 36 37
3 0 25 37 26
3 0 26 37 38
3 0 26 38 27
3 0 27 38 39
3 0 27 39 28
3 0 28 39 40
3 0 33 41 42
3 0 33 42 34
3 0 34 42 43
3 0 34 43 35
3 0 35 43 44
3 0 41 45 46
3 0 41 46 42
3 0 42 46 47
3 0 42 47 43
3 0 43 47 48
3 0 43 48 44
3 0 35 44 36
3 0 36 44 49
3 0 44 48 49
3 0 36 49 37
3 0 37 49 50
3 0 37 50 38
3 0 38 50 39
3 0 39 50 51
3 0 39 51 40
3 0 40 51 52
3 0 45 53 54
3 0 45 54 46
3 0 46 54 55
3 0 46 55 47
3 0 47 55 56
3 0 53 57 58
3 0 53 58 54
3 0 54 58 59
3 0 54 59 55
3 0 55 59 60
3 0 55 60 56
3 0 47 56 48
3 0 48 56 61
3 0 56 60 61
3 0 48 61 49
3 0 49 61 62
3 0 49 62 50
3 0 50 62 63
3 0 50 63 51
3 0 51 63 52
3 0 52 63 64
3 0 57 65 66
3 0 57 66 58
3 0 58 66 67
3 0 58 67 59
3 0 59 67 68
3 0 65 69 70
3 0 65 70 66
3 0 66 70 71
3 0 66 71 67
3 0 67 71 72
3 0 67 72 68
3 0 59 68 60
3 0 60 68 73
3 0 68 72 73
3 0 60 73 61
3 0 61 73 74
3 0 61 74 62
3 0 62 74 63
3 0 63 74 75
3 0 63 75 64
3 0 64 75 76
3 0 69 77 78
3 0 69 78 70
3 0 70 78 79
3 0 70 79 71
3 0 71 79 80
3 0 77 81 82
3 0 77 82 78
3 0 78 82 83
3 0 78 83 79
3 0 79 83 84
3 0 79 84 80
3 0 71 80 72
3 0 72 80 85
3 0 80 84 85
3 0 72 85 73
3 0 73 85 86
3 0 73 86 74
3 0 74 86 87
3 0 74 87 75
3 0 75 87 88
3 0 75 88 76
3 0 76 88 89
3 0 81 90 91
3 0 81 91 82
3 0 82 91 92
3 0 82 92 83
3 0 83 92 93
3 0 90 94 95
3 0 90 95 91
3 0 91 95 96
3 0 91 96 92
3 0 92 96 97
3 0 92 97 93
3 0 83 93 84
3 0 84 93 98
3 0 93 97 98
3 0 84 98 85
3 0 85 98 99
3 0 85 99 86
3 0 86 99 87
3 0 87 99 100
3 0 87 100 88
3 0 88 100 101
3 0 88 101 89
3 0 89 101 102
3 0 94 103 104
3 0 94 104 95
3 0 95 104 105
3 0 95 105 96
3 0 96 105 106
3 0 103 107 108
3 0 103 108 104
3 0 104 108 109
3 0 104 109 105
3 0 105 109 110
3 0 105 110 106
3 0 96 106 97
3 0 97 106 111
3 0 106 110 111
3 0 97 111 98
3 0 98 111 112
3 0 98 112 99
3 0 99 112 113
3 0 99 113 100
3 0 100 113 101
3 0 101 113 114
3 0 101 114 102
3 0 102 114 115
3 0 107 116 108
3 0 108 116 117
3 0 108 117 109
3 0 109 117 118
3 0 116 119 117
3 0 117 119 120
3 0 117 120 118
3 0 109 118 110
3 0 110 118 121
3 0 118 120 121
3 0 110 121 111
3 0 111 121 122
3 0 111 122 112
3 0 112 122 113
3 0 113 122 123
3 0 113 123 114
3 0 114 123 124
3 0 114 124 115
3 0 115 124 125
3 0 119 126 120
3 0 120 126 127
3 0 120 127 121
3 0 121 127 122
3 0 122 127 128
3 0 122 128 123
3 0 123 128 129
3 0 123 129 124
3 0 124 129 130
3 0 124 130 125
3 0 125 130 131
3 0 126 132 127
3 0 127 132 133
3 0 127 133 128
3 0 128 133 129
3 0 129 133 134
3 0 129 134 130
3 0 130 134 135
3 0 130 135 131
3 0 131 135 136
3 0 132 137 133
3 0 133 137 138
3 0 133 138 134
3 0 134 138 139
3 0 134 139 135
3 0 135 139 140
3 0 135 140 136
3 0 136 140 141
3 0 137 142 138
3 0 138 142 143
3 0 138 143 139
3 0 139 143 144
3 0 139 144 140
3 0 140 144 145
3 0 140 145 141
3 0 141 145 146
3 0 142 147 143
3 0 143 147 148
3 0 143 148 144
3 0 144 148 149
3 0 144 149 145
3 0 145 149 150
3 0 145 150 146
3 0 146 150 151
3 0 147 152 148
3 0 148 152 153
3 0 148 153 149
3 0 149 153 154
3 0 149 154 150
3 0 150 154 155
3 0 150 155 151
3 0 151 155 156
3 0 152 157 153
3 0 153 157 158
3 0 153 158 154
3 0 154 158 159
3 0 154 159 155
3 0 155 159 160
3 0 155 160 156
3 0 156 160 161
3 0 157 162 158
3 0 158 162 163
3 0 158 163 159
3 0 159 163 164
3 0 159 164 160
3 0 160 164 165
3 0 160 165 161
3 0 161 165 166
3 0 162 167 163
3 0 163 167 168
3 0 163 168 164
3 0 164 168 169
3 0 164 169 165
3 0 165 169 170
3 0 165 170 166
3 0 166 170 171
3 0 167 172 168
3 0 168 172 173
3 0 168 173 169
3 0 169 173 174
3 0 169 174 170
3 0 170 174 175
3 0 170 175 171
3 0 171 175 176
3 0 177 0 1
3 0 177 1 178
3 0 178 1 2
3 0 178 2 179
3 0 179 2 3
3 0 179 3 180
3 0 181 177 178
3 0 181 178 182
3 0 182 178 179
3 0 182 179 183
3 0 183 179 180
3 0 183 180 184
3 0 180 3 4
3 0 180 4 185
3 0 184 180 185
3 0 185 4 5
3 0 185 5 186
3 0 186 5 6
3 0 186 6 187
3 0 188 181 182
3 0 188 182 189
3 0 189 182 183
3 0 189 183 190
3 0 190 183 184
3 0 190 184 191
3 0 192 188 193
3 0 193 188 189
3 0 193 189 194
3 0 194 189 190
3 0 194 190 195
3 0 195 190 191
3 0 191 184 185
3 0 191 185 196
3 0 195 191 196
3 0 196 185 186
3 0 196 186 197
3 0 197 186 187
3 0 197 187 198
3 0 199 192 200
3 0 200 192 193
3 0 200 193 201
3 0 201 193 194
3 0 201 194 202
3 0 203 199 204
3 0 204 199 200
3 0 204 200 205
3 0 205 200 201
3 0 205 201 206
3 0 206 201 202
3 0 202 194 195
3 0 202 195 207
3 0 206 202 207
3 0 207 195 196
3 0 207 196 208
3 0 208 196 197
3 0 208 197 209
3 0 209 197 198
3 0 209 198 210
3 0 211 203 212
3 0 212 203 204
3 0 212 204 213
3 0 213 204 205
3 0 213 205 214
3 0 215 211 216
3 0 216 211 212
3 0 216 212 217
3 0 217 212 213
3 0 217 213 218
3 0 218 213 214
3 0 214 205 206
3 0 214 206 219
3 0 218 214 219
3 0 219 206 207
3 0 219 207 220
3 0 220 207 208
3 0 220 208 209
3 0 220 209 221
3 0 221 209 210
3 0 221 210 222
3 0 223 215 224
3 0 224 215 216
3 0 224 216 225
3 0 225 216 217
3 0 225 217 226
3 0 227 223 228
3 0 228 223 224
3 0 228 224 229
3 0 229 224 225
3 0 229 225 230
3 0 230 225 226
3 0 226 217 218
3 0 226 218 231
3 0 230 226 231
3 0 231 218 219
3 0 231 219 232
3 0 232 219 220
3 0 232 220 233
3 0 233 220 221
3 0 233 221 222
3 0 233 222 234
3 0 235 227 236
3 0 236 227 228
3 0 236 228 237
3 0 237 228 229
3 0 237 229 238
3 0 239 235 240
3 0 240 235 236
3 0 240 236 241
3 0 241 236 237
3 0 241 237 242
3 0 242 237 238
3 0 238 229 230
3 0 238 230 243
3 0 242 238 243
3 0 243 230 231
3 0 243 231 244
3 0 244 231 232
3 0 244 232 233
3 0 244 233 245
3 0 245 233 234
3 0 245 234 246
3 0 247 239 248
3 0 248 239 240
3 0 248 240 249
3 0 249 240 241
3 0 249 241 250
3 0 251 247 252
3 0 252 247 248
3 0 252 248 253
3 0 253 248 249
3 0 253 249 254
3 0 254 249 250
3 0 250 241 242
3 0 250 242 255
3 0 254 250 255
3 0 255 242 243
3 0 255 243 256
3 0 256 243 244
3 0 256 244 257
3 0 257 244 245
3 0 257 245 258
3 0 258 245 246
3 0 258 246 259
3 0 260 251 261
3 0 261 251 252
3 0 261 252 262
3 0 262 252 253
3 0 262 253 263
3 0 264 260 265
3 0 265 260 261
3 0 265 261 266
3 0 266 261 262
3 0 266 262 267
3 0 267 262 263
3 0 263 253 254
3 0 263 254 268
3 0 267 263 268
3 0 268 254 255
3 0 268 255 269
3 0 269 255 256
3 0 269 256 257
3 0 269 257 270
3 0 270 257 258
3 0 270 258 271
3 0 271 258 259
3 0 271 259 272
3 0 273 264 274
3 0 274 264 265
3 0 274 265 275
3 0 275 265 266
3 0 275 266 276
3 0 277 273 278
3 0 278 273 274
3 0 278 274 279
3 0 279 274 275
3 0 279 275 280
3 0 280 275 276
3 0 276 266 267
3 0 276 267 281
3 0 280 276 281
3 0 281 267 268
3 0 281 268 282
3 0 282 268 269
3 0 282 269 283
3 0 283 269 270
3 0 283 270 271
3 0 283 271 284
3 0 284 271 272
3 0 284 272 285
3 0 286 277 278
3 0 286 278 287
3 0 287 278 279
3 0 287 279 288
3 0 289 286 287
3 0 289 287 290
3 0 290 287 288
3 0 288 279 280
3 0 288 280 291
3 0 290 288 291
3 0 291 280 281
3 0 291 281 292
3 0 292 281 282
3 0 292 282 283
3 0 292 283 293
3 0 293 283 284
3 0 293 284 294
3 0 294 284 285
3 0 294 285 295
3 0 296 289 290
3 0 296 290 297
3 0 297 290 291
3 0 297 291 292
3 0 297 292 298
3 0 298 292 293
3 0 298 293 299
3 0 299 293 294
3 0 299 294 300
3 0 300 294 295
3 0 300 295 301
3 0 302 296 297
3 0 302 297 303
3 0 303 297 298
3 0 303 298 299
3 0 303 299 304
3 0 304 299 300
3 0 304 300 305
3 0 305 300 301
3 0 305 301 306
3 0 307 302 303
3 0 307 303 308
3 0 308 303 304
3 0 308 304 309
3 0 309 304 305
3 0 309 305 310
3 0 310 305 306
3 0 310 306 311
3 0 312 307 308
3 0 312 308 313
3 0 313 308 309
3 0 313 309 314
3 0 314 309 310
3 0 314 310 315
3 0 315 310 311
3 0 315 311 316
3 0 317 312 313
3 0 317 313 318
3 0 318 313 314
3 0 318 314 319
3 0 319 314 315
3 0 319 315 320
3 0 320 315 316
3 0 320 316 321
3 0 322 317 318
3 0 322 318 323
3 0 323 318 319
3 0 323 319 324
3 0 324 319 320
3 0 324 320 325
3 0 325 320 321
3 0 325 321 326
3 0 327 322 323
3 0 327 323 328
3 0 328 323 324
3 0 328 324 329
3 0 329 324 325
3 0 329 325 330
3 0 330 325 326
3 0 330 326 331
3 0 332 327 328
3 0 332 328 333
3 0 333 328 329
3 0 333 329 334
3 0 334 329 330
3 0 334 330 335
3 0 335 330 331
3 0 335 331 336
3 0 337 332 333
3 0 337 333 338
3 0 338 333 334
3 0 338 334 339
3 0 339 334 335
3 0 339 335 340
3 0 340 335 336
3 0 340 336 341
3 0 342 337 338
3 0 342 338 343
3 0 343 338 339
3 0 343 339 344
3 0 344 339 340
3 0 344 340 345
3 0 345 340 341
3 0 345 341 346
FACES:
2 1 176 171
2 1 171 166
2 1 166 161
2 1 161 156
2 1 156 151
2 1 151 146
2 1 146 141
2 1 141 136
2 1 136 131
2 1 131 125
2 1 125 115
2 1 115 102
2 1 102 89
2 1 89 76
2 1 76 64
2 1 64 52
2 1 52 40
2 1 40 28
2 1 28 17
2 1 17 6
2 10 0 7
2 10 7 11
2 10 11 18
2 10 18 22
2 10 22 29
2 10 29 33
2 10 33 41
2 10 41 45
2 10 45 53
2 10 53 57
2 10 57 65
2 10 65 69
2 10 69 77
2 10 77 81
2 10 81 90
2 10 90 94
2 10 94 103
2 10 103 107
2 1 107 116
2 1 116 119
2 1 119 126
2 1 126 132
2 1 132 137
2 1 137 142
2 1 142 147
2 1 147 152
2 1 152 157
2 1 157 162
2 1 162 167
2 1 167 172
2 1 172 173
2 1 173 174
2 1 174 175
2 1 175 176
2 1 341 346
2 1 336 341
2 1 331 336
2 1 326 331
2 1 321 326
2 1 316 321
2 1 311 316
2 1 306 311
2 1 301 306
2 1 295 301
2 1 285 295
2 1 272 285
2 1 259 272
2 1 246 259
2 1 234 246
2 1 222 234
2 1 210 222
2 1 198 210
2 1 187 198
2 1 6 187
2 10 177 0
2 10 181 177
2 10 188 181
2 10 192 188
2 10 199 192
2 10 203 199
2 10 211 203
2 10 215 211
2 10 223 215
2 10 227 223
2 10 235 227
2 10 239 235
2 10 247 239
2 10 251 247
2 10 260 251
2 10 264 260
2 10 273 264
2 10 277 273
2 1 286 277
2 1 289 286
2 1 296 289
2 1 302 296
2 1 307 302
2 1 312 307
2 1 317 312
2 1 322 317
2 1 327 322
2 1 332 327
2 1 337 332
2 1 342 337
2 1 343 342
2 1 344 343
2 1 345 344
2 1 346 345