POINTS:
0.0 0.0
0.0 0.25
0.0 0.5
0.0 0.75
0.0 1.0
0.25 0.0
0.25 0.25
0.25 0.5
0.25 0.75
0.25 1.0
0.5 0.0
0.5 0.25
0.5 0.5
0.5 0.75
0.5 1.0
0.75 0.0
0.75 0.25
0.75 0.5
0.75 0.75
0.75 1.0
1.0 0.0
1.0 0.25
1.0 0.5
1.0 0.75
1.0 1.0
1.25 0.0
1.25 0.25
1.25 0.5
1.25 0.75
1.25 1.0
1.5 0.0
1.5 0.25
1.5 0.5
1.5 0.75
1.5 1.0
1.75 0.0
1.75 0.25
1.75 0.5
1.75 0.75
1.75 1.0
2.0 0.0
2.0 0.25
2.0 0.5
2.0 0.75
2.0 1.0
2.25 0.0
2.25 0.25
2.25 0.5
2.25 0.75
2.25 1.0
2.5 0.0
2.5 0.25
2.5 0.5
2.5 0.75
2.5 1.0
2.75 0.0
2.75 0.25
2.75 0.5
2.75 0.75
2.75 1.0
3.0 0.0
3.0 0.25
3.0 0.5
3.0 0.75
3.0 1.0
3.25 0.0
3.25 0.25
3.25 0.5
3.25 0.75
3.25 1.0
3.5 0.0
3.5 0.25
3.5 0.5
3.5 0.75
3.5 1.0
3.75 0.0
3.75 0.25
3.75 0.5
3.75 0.75
3.75 1.0
4.0 0.0
4.0 0.25
4.0 0.5
4.0 0.75
4.0 1.0
4.25 0.0
4.25 0.25
4.25 0.5
4.25 0.75
4.25 1.0
4.5 0.0
4.5 0.25
4.5 0.5
4.5 0.75
4.5 1.0
4.75 0.0
4.75 0.25
4.75 0.5
4.75 0.75
4.75 1.0
5.0 0.0
5.0 0.25
5.0 0.5
5.0 0.75
5.0 1.0
5.25 0.0
5.25 0.25
5.25 0.5
5.25 0.75
5.25 1.0
5.5 0.0
5.5 0.25
5.5 0.5
5.5 0.75
5.5 1.0
5.75 0.0
5.75 0.25
5.75 0.5
5.75 0.75
5.75 1.0
6.0 0.0
6.0 0.25
6.0 0.5
6.0 0.75
6.0 1.0
6.25 0.0
6.25 0.25
6.25 0.5
6.25 0.75
6.25 1.0
6.5 0.0
6.5 0.25
6.5 0.5
6.5 0.75
6.5 1.0
6.75 0.0
6.75 0.25
6.75 0.5
6.75 0.75
6.75 1.0
7.0 0.0
7.0 0.25
7.0 0.5
7.0 0.75
7.0 1.0
7.25 0.0
7.25 0.25
7.25 0.5
7.25 0.75
7.25 1.0
7.5 0.0
7.5 0.25
7.5 0.5
7.5 0.75
7.5 1.0
7.75 0.0
7.75 0.25
7.75 0.5
7.75 0.75
7.75 1.0
8.0 0.0
8.0 0.25
8.0 0.5
8.0 0.75
8.0 1.0
CELLS:
3 0 0 5 1
3 0 1 5 6
3 0 1 6 2
3 0 2 6 7
3 0 2 7 3
3 0 3 7 8
3 0 3 8 4
3 0 4 8 9
3 0 5 10 6
3 0 6 10 11
3 0 6 11 7
3 0 7 11 12
3 0 7 12 8
3 0 8 12 13
3 0 8 13 9
3 0 9 13 14
3 0 10 15 11
3 0 11 15 16
3 0 11 16 12
3 0 12 16 17
3 0 12 17 13
3 0 13 17 18
3 0 13 18 14
3 0 14 18 19
3 0 15 20 16
3 0 16 20 21
3 0 16 21 17
3 0 17 21 22
3 0 17 22 18
3 0 18 22 23
3 0 18 23 19
3 0 19 23 24
3 0 20 25 21
3 0 21 25 26
3 0 21 26 22
3 0 22 26 27
3 0 22 27 23
3 0 23 27 28
3 0 23 28 24
3 0 24 28 29
3 0 25 30 26
3 0 26 30 31
3 0 26 31 27
3 0 27 31 32
3 0 27 32 28
3 0 28 32 33
3 0 28 33 29
3 0 29 33 34
3 0 30 35 31
3 0 31 35 36
3 0 31 36 32
3 0 32 36 37
3 0 32 37 33
3 0 33 37 38
3 0 33 38 34
3 0 34 38 39
3 0 35 40 36
3 0 36 40 41
3 0 36 41 37
3 0 37 41 42
3 0 37 42 38
3 0 38 42 43
3 0 38 43 39
3 0 39 43 44
3 0 40 45 41
3 0 41 45 46
3 0 41 46 42
3 0 42 46 47
3 0 42 47 43
3 0 43 47 48
3 0 43 48 44
3 0 44 48 49
3 0 45 50 46
3 0 46 50 51
3 0 46 51 47
3 0 47 51 52
3 0 47 52 48
3 0 48 52 53
3 0 48 53 49
3 0 49 53 54
3 0 50 55 51
3 0 51 55 56
3 0 51 56 52
3 0 52 56 57
3 0 52 57 53
3 0 53 57 58
3 0 53 58 54
3 0 54 58 59
3 0 55 60 56
3 0 56 60 61
3 0 56 61 57
3 0 57 61 62
3 0 57 62 58
3 0 58 62 63
3 0 58 63 59
3 0 59 63 64
3 0 60 65 61
3 0 61 65 66
3 0 61 66 62
3 0 62 66 67
3 0 62 67 63
3 0 63 67 68
3 0 63 68 64
3 0 64 68 69
3 0 65 70 66
3 0 66 70 71
3 0 66 71 67
3 0 67 71 72
3 0 67 72 68
3 0 68 72 73
3 0 68 73 69
3 0 69 73 74
3 0 70 75 71
3 0 71 75 76
3 0 71 76 72
3 0 72 76 77
3 0 72 77 73
3 0 73 77 78
3 0 73 78 74
3 0 74 78 79
3 0 75 80 76
3 0 76 80 81
3 0 76 81 77
3 0 77 81 82
3 0 77 82 78
3 0 78 82 83
3 0 78 83 79
3 0 79 83 84
3 0 80 85 81
3 0 81 85 86
3 0 81 86 82
3 0 82 86 87
3 0 82 87 83
3 0 83 87 88
3 0 83 88 84
3 0 84 88 89
3 0 85 90 86
3 0 86 90 91
3 0 86 91 87
3 0 87 91 92
3 0 87 92 88
3 0 88 92 93
3 0 88 93 89
3 0 89 93 94
3 0 90 95 91
3 0 91 95 96
3 0 91 96 92
3 0 92 96 97
3 0 92 97 93
3 0 93 97 98
3 0 93 98 94
3 0 94 98 99
3 0 95 100 96
3 0 96 100 101
3 0 96 101 97
3 0 97 101 102
3 0 97 102 98
3 0 98 102 103
3 0 98 103 99
3 0 99 103 104
3 0 100 105 101
3 0 101 105 106
3 0 101 106 102
3 0 102 106 107
3 0 102 107 103
3 0 103 107 108
3 0 103 108 104
3 0 104 108 109
3 0 105 110 106
3 0 106 110 111
3 0 106 111 107
3 0 107 111 112
3 0 107 112 108
3 0 108 112 113
3 0 108 113 109
3 0 109 113 114
3 0 110 115 111
3 0 111 115 116
3 0 111 116 112
3 0 112 116 117
3 0 112 117 113
3 0 113 117 118
3 0 113 118 114
3 0 114 118 119
3 0 115 120 116
3 0 116 120 121
3 0 116 121 117
3 0 117 121 122
3 0 117 122 118
3 0 118 122 123
3 0 118 123 119
3 0 119 123 124
3 0 120 125 121
3 0 121 125 126
3 0 121 126 122
3 0 122 126 127
3 0 122 127 123
3 0 123 127 128
3 0 123 128 124
3 0 124 128 129
3 0 125 130 126
3 0 126 130 131
3 0 126 131 127
3 0 127 131 132
3 0 127 132 128
3 0 128 132 133
3 0 128 133 129
3 0 129 133 134
3 0 130 135 131
3 0 131 135 136
3 0 131 136 132
3 0 132 136 137
3 0 132 137 133
3 0 133 137 138
3 0 133 138 134
3 0 134 138 139
3 0 135 140 136
3 0 136 140 141
3 0 136 141 137
3 0 137 141 142
3 0 137 142 138
3 0 138 142 143
3 0 138 143 139
3 0 139 143 144
3 0 140 145 141
3 0 141 145 146
3 0 141 146 142
3 0 142 146 147
3 0 142 147 143
3 0 143 147 148
3 0 143 148 144
3 0 144 148 149
3 0 145 150 146
3 0 146 150 151
3 0 146 151 147
3 0 147 151 152
3 0 147 152 148
3 0 148 152 153
3 0 148 153 149
3 0 149 153 154
3 0 150 155 151
3 0 151 155 156
3 0 151 156 152
3 0 152 156 157
3 0 152 157 153
3 0 153 157 158
3 0 153 158 154
3 0 154 158 159
3 0 155 160 156
3 0 156 160 161
3 0 156 161 157
3 0 157 161 162
3 0 157 162 158
3 0 158 162 163
3 0 158 163 159
3 0 159 163 164
FACES:
2 1 164 159
2 1 159 154
2 1 154 149
2 1 149 144
2 1 144 139
2 1 139 134
2 1 134 129
2 1 129 124
2 1 124 119
2 1 119 114
2 1 114 109
2 1 109 104
2 1 104 99
2 1 99 94
2 1 94 89
2 1 89 84
2 1 84 79
2 1 79 74
2 1 74 69
2 1 69 64
2 1 64 59
2 1 59 54
2 1 54 49
2 1 49 44
2 1 44 39
2 1 39 34
2 1 34 29
2 1 29 24
2 1 24 19
2 1 19 14
2 1 14 9
2 1 9 4
2 77 4 3
2 77 3 2
2 77 2 1
2 77 1 0
2 1 0 5
2 1 5 10
2 1 10 15
2 1 15 20
2 1 20 25
2 1 25 30
2 1 30 35
2 1 35 40
2 1 40 45
2 1 45 50
2 1 50 55
2 1 55 60
2 1 60 65
2 1 65 70
2 1 70 75
2 1 75 80
2 1 80 85
2 1 85 90
2 1 90 95
2 1 95 100
2 1 100 105
2 1 105 110
2 1 110 115
2 1 115 120
2 1 120 125
2 1 125 130
2 1 130 135
2 1 135 140
2 1 140 145
2 1 145 150
2 1 150 155
2 1 155 160
2 1 160 161
2 1 161 162
2 1 162 163
2 1 163 164