POINTS:
-2.0 0.0
-2.0 0.25
-2.0 0.5
-2.0 0.75
-2.0 1.0
-1.75 0.0
-1.75 0.25
-1.75 0.5
-1.75 0.75
-1.75 1.0
-1.5 0.0
-1.5 0.25
-1.5 0.5
-1.5 0.75
-1.5 1.0
-1.25 0.0
-1.25 0.25
-1.25 0.5
-1.25 0.75
-1.25 1.0
-1.0 0.0
-1.0 0.25
-1.0 0.5
-1.0 0.75
-1.0 1.0
-0.75 0.0
-0.75 0.25
-0.75 0.5
-0.75 0.75
-0.75 1.0
-0.5 0.0
-0.5 0.25
-0.5 0.5
-0.5 0.75
-0.5 1.0
-0.25 0.25
-0.25 0.5
-0.25 0.75
-0.25 1.0
0.0 0.25
0.0 0.5
0.0 0.75
0.0 1.0
0.25 0.25
0.25 0.5
0.25 0.75
0.25 1.0
0.5 0.0
0.5 0.25
0.5 0.5
0.5 0.75
0.5 1.0
0.75 0.0
0.75 0.25
0.75 0.5
0.75 0.75
0.75 1.0
1.0 0.0
1.0 0.25
1.0 0.5
1.0 0.75
1.0 1.0
1.25 0.0
1.25 0.25
1.25 0.5
1.25 0.75
1.25 1.0
1.5 0.0
1.5 0.25
1.5 0.5
1.5 0.75
1.5 1.0
1.75 0.0
1.75 0.25
1.75 0.5
1.75 0.75
1.75 1.0
2.0 0.0
2.0 0.25
2.0 0.5
2.0 0.75
2.0 1.0
CELLS:
4 1 0 5 6 1
4 1 1 6 7 2
4 1 2 7 8 3
4 1 3 8 9 4
4 1 5 10 11 6
4 1 6 11 12 7
4 1 7 12 13 8
4 1 8 13 14 9
4 1 10 15 16 11
4 1 11 16 17 12
4 1 12 17 18 13
4 1 13 18 19 14
4 1 15 20 21 16
4 1 16 21 22 17
4 1 17 22 23 18
4 1 18 23 24 19
4 1 20 25 26 21
4 1 21 26 27 22
4 1 22 27 28 23
4 1 23 28 29 24
4 1 25 30 31 26
4 1 26 31 32 27
4 1 27 32 33 28
4 1 28 33 34 29
3 1 30 35 31
4 1 31 35 36 32
4 1 32 36 37 33
4 1 33 37 38 34
4 1 35 39 40 36
4 1 36 40 41 37
4 1 37 41 42 38
4 1 39 43 44 40
4 1 40 44 45 41
4 1 41 45 46 42
3 1 43 47 48
4 1 43 48 49 44
4 1 44 49 50 45
4 1 45 50 51 46
4 1 47 52 53 48
4 1 48 53 54 49
4 1 49 54 55 50
4 1 50 55 56 51
4 1 52 57 58 53
4 1 53 58 59 54
4 1 54 59 60 55
4 1 55 60 61 56
4 1 57 62 63 58
4 1 58 63 64 59
4 1 59 64 65 60
4 1 60 65 66 61
4 1 62 67 68 63
4 1 63 68 69 64
4 1 64 69 70 65
4 1 65 70 71 66
4 1 67 72 73 68
4 1 68 73 74 69
4 1 69 74 75 70
4 1 70 75 76 71
4 1 72 77 78 73
4 1 73 78 79 74
4 1 74 79 80 75
4 1 75 80 81 76