POINTS:
0.0 0.25
0.0 0.3125
0.0 0.375
0.0 0.5
0.0 0.625
0.0 0.75
0.0 1.0
0.0625 0.25
0.0625 0.3125
0.0625 0.375
0.0625 0.4375
0.125 0.25
0.125 0.3125
0.125 0.375
0.125 0.4375
0.125 0.5
0.125 0.625
0.15625 0.25
0.15625 0.28125
0.15625 0.3125
0.15625 0.34375
0.1875 0.25
0.1875 0.28125
0.1875 0.3125
0.1875 0.34375
0.1875 0.375
0.1875 0.4375
0.21875 0.25
0.21875 0.28125
0.21875 0.3125
0.21875 0.34375
0.25 0.25
0.25 0.28125
0.25 0.3125
0.25 0.34375
0.25 0.375
0.25 0.4375
0.25 0.5
0.25 0.625
0.25 0.75
0.25 1.0
0.28125 0.21875
0.28125 0.25
0.28125 0.28125
0.28125 0.3125
0.28125 0.34375
0.3125 0.1875
0.3125 0.21875
0.3125 0.25
0.3125 0.28125
0.3125 0.3125
0.3125 0.34375
0.3125 0.375
0.3125 0.4375
0.34375 0.15625
0.34375 0.1875
0.34375 0.21875
0.34375 0.25
0.34375 0.28125
0.34375 0.3125
0.34375 0.34375
0.375 0.125
0.375 0.1875
0.375 0.25
0.375 0.3125
0.375 0.375
0.375 0.4375
0.375 0.5
0.375 0.625
0.4375 0.0625
0.4375 0.125
0.4375 0.1875
0.4375 0.25
0.4375 0.3125
0.4375 0.375
0.4375 0.4375
0.5 0.0
0.5 0.0625
0.5 0.125
0.5 0.25
0.5 0.375
0.5 0.5
0.5 0.625
0.5 0.75
0.5 1.0
0.5625 0.0
0.5625 0.0625
0.625 0.0
0.625 0.125
0.625 0.25
0.625 0.375
0.625 0.5
0.625 0.625
0.75 0.0
0.75 0.25
0.75 0.5
0.75 0.75
0.75 1.0
1.0 0.0
1.0 0.25
1.0 0.5
1.0 0.75
1.0 1.0
1.25 0.0
1.25 0.25
1.25 0.5
1.25 0.75
1.25 1.0
1.5 0.0
1.5 0.25
1.5 0.5
1.5 0.75
1.5 1.0
1.75 0.0
1.75 0.25
1.75 0.5
1.75 0.75
1.75 1.0
2.0 0.0
2.0 0.25
2.0 0.5
2.0 0.75
2.0 1.0
2.25 0.0
2.25 0.25
2.25 0.5
2.25 0.75
2.25 1.0
2.5 0.0
2.5 0.25
2.5 0.5
2.5 0.75
2.5 1.0
2.75 0.0
2.75 0.25
2.75 0.5
2.75 0.75
2.75 1.0
3.0 0.0
3.0 0.25
3.0 0.5
3.0 0.75
3.0 1.0
-0.0625 0.25
-0.0625 0.3125
-0.0625 0.375
-0.0625 0.4375
-0.125 0.25
-0.125 0.3125
-0.125 0.375
-0.125 0.4375
-0.125 0.5
-0.125 0.625
-0.15625 0.25
-0.15625 0.28125
-0.15625 0.3125
-0.15625 0.34375
-0.1875 0.25
-0.1875 0.28125
-0.1875 0.3125
-0.1875 0.34375
-0.1875 0.375
-0.1875 0.4375
-0.21875 0.25
-0.21875 0.28125
-0.21875 0.3125
-0.21875 0.34375
-0.25 0.25
-0.25 0.28125
-0.25 0.3125
-0.25 0.34375
-0.25 0.375
-0.25 0.4375
-0.25 0.5
-0.25 0.625
-0.25 0.75
-0.25 1.0
-0.28125 0.21875
-0.28125 0.25
-0.28125 0.28125
-0.28125 0.3125
-0.28125 0.34375
-0.3125 0.1875
-0.3125 0.21875
-0.3125 0.25
-0.3125 0.28125
-0.3125 0.3125
-0.3125 0.34375
-0.3125 0.375
-0.3125 0.4375
-0.34375 0.15625
-0.34375 0.1875
-0.34375 0.21875
-0.34375 0.25
-0.34375 0.28125
-0.34375 0.3125
-0.34375 0.34375
-0.375 0.125
-0.375 0.1875
-0.375 0.25
-0.375 0.3125
-0.375 0.375
-0.375 0.4375
-0.375 0.5
-0.375 0.625
-0.4375 0.0625
-0.4375 0.125
-0.4375 0.1875
-0.4375 0.25
-0.4375 0.3125
-0.4375 0.375
-0.4375 0.4375
-0.5 0.0
-0.5 0.0625
-0.5 0.125
-0.5 0.25
-0.5 0.375
-0.5 0.5
-0.5 0.625
-0.5 0.75
-0.5 1.0
-0.5625 0.0
-0.5625 0.0625
-0.625 0.0
-0.625 0.125
-0.625 0.25
-0.625 0.375
-0.625 0.5
-0.625 0.625
-0.75 0.0
-0.75 0.25
-0.75 0.5
-0.75 0.75
-0.75 1.0
-1.0 0.0
-1.0 0.25
-1.0 0.5
-1.0 0.75
-1.0 1.0
-1.25 0.0
-1.25 0.25
-1.25 0.5
-1.25 0.75
-1.25 1.0
-1.5 0.0
-1.5 0.25
-1.5 0.5
-1.5 0.75
-1.5 1.0
-1.75 0.0
-1.75 0.25
-1.75 0.5
-1.75 0.75
-1.75 1.0
-2.0 0.0
-2.0 0.25
-2.0 0.5
-2.0 0.75
-2.0 1.0
-2.25 0.0
-2.25 0.25
-2.25 0.5
-2.25 0.75
-2.25 1.0
-2.5 0.0
-2.5 0.25
-2.5 0.5
-2.5 0.75
-2.5 1.0
-2.75 0.0
-2.75 0.25
-2.75 0.5
-2.75 0.75
-2.75 1.0
-3.0 0.0
-3.0 0.25
-3.0 0.5
-3.0 0.75
-3.0 1.0
CELLS:
3 0 0 7 1
3 0 1 8 7
3 0 1 8 2
3 0 2 8 9
3 0 2 9 10
3 0 2 10 3
3 0 3 10 15
3 0 7 11 8
3 0 8 11 12
3 0 8 12 9
3 0 9 12 13
3 0 9 13 10
3 0 10 13 14
3 0 10 14 15
3 0 3 15 4
3 0 4 15 16
3 0 4 16 5
3 0 5 16 39
3 0 11 17 18
3 0 11 18 12
3 0 12 18 19
3 0 12 19 20
3 0 12 20 13
3 0 13 20 25
3 0 17 21 18
3 0 18 21 22
3 0 18 22 19
3 0 19 22 23
3 0 19 23 20
3 0 20 23 24
3 0 20 24 25
3 0 13 25 14
3 0 14 25 26
3 0 14 26 15
3 0 15 26 37
3 0 21 27 22
3 0 22 27 28
3 0 22 28 23
3 0 23 28 29
3 0 23 29 24
3 0 24 29 30
3 0 24 30 25
3 0 25 30 35
3 0 27 31 28
3 0 28 31 32
3 0 28 32 29
3 0 29 32 33
3 0 29 33 30
3 0 30 33 34
3 0 30 34 35
3 0 25 35 26
3 0 26 35 36
3 0 26 36 37
3 0 15 37 16
3 0 16 37 38
3 0 16 38 39
3 0 5 39 6
3 0 6 39 40
3 0 31 41 42
3 0 31 42 32
3 0 32 42 43
3 0 32 43 33
3 0 33 43 44
3 0 33 44 34
3 0 34 44 45
3 0 34 45 35
3 0 35 45 52
3 0 41 46 47
3 0 41 47 42
3 0 42 47 48
3 0 42 48 43
3 0 43 48 49
3 0 43 49 44
3 0 44 49 50
3 0 44 50 45
3 0 45 50 51
3 0 45 51 52
3 0 35 52 36
3 0 36 52 53
3 0 36 53 37
3 0 37 53 67
3 0 46 54 55
3 0 46 55 47
3 0 47 55 56
3 0 47 56 48
3 0 48 56 57
3 0 48 57 49
3 0 49 57 58
3 0 49 58 50
3 0 50 58 59
3 0 50 59 60
3 0 50 60 51
3 0 51 60 52
3 0 52 60 65
3 0 54 61 62
3 0 54 62 55
3 0 55 62 56
3 0 56 62 63
3 0 56 63 57
3 0 57 63 58
3 0 58 63 64
3 0 58 64 59
3 0 59 64 60
3 0 60 64 65
3 0 52 65 53
3 0 53 65 66
3 0 53 66 67
3 0 37 67 38
3 0 38 67 68
3 0 38 68 39
3 0 39 68 83
3 0 61 69 70
3 0 61 70 62
3 0 62 70 71
3 0 62 71 63
3 0 63 71 72
3 0 63 72 64
3 0 64 72 73
3 0 64 73 65
3 0 65 73 74
3 0 65 74 75
3 0 65 75 66
3 0 66 75 67
3 0 67 75 81
3 0 69 76 77
3 0 69 77 70
3 0 70 77 78
3 0 70 78 71
3 0 71 78 79
3 0 71 79 72
3 0 72 79 73
3 0 73 79 80
3 0 73 80 74
3 0 74 80 75
3 0 75 80 81
3 0 67 81 68
3 0 68 81 82
3 0 68 82 83
3 0 39 83 40
3 0 40 83 84
3 0 76 85 86
3 0 76 86 77
3 0 77 86 78
3 0 78 86 88
3 0 85 87 86
3 0 86 87 88
3 0 78 88 79
3 0 79 88 89
3 0 79 89 80
3 0 80 89 90
3 0 80 90 81
3 0 81 90 91
3 0 81 91 92
3 0 81 92 82
3 0 82 92 83
3 0 83 92 96
3 0 87 93 88
3 0 88 93 94
3 0 88 94 89
3 0 89 94 90
3 0 90 94 95
3 0 90 95 91
3 0 91 95 92
3 0 92 95 96
3 0 83 96 84
3 0 84 96 97
3 0 93 98 94
3 0 94 98 99
3 0 94 99 95
3 0 95 99 100
3 0 95 100 96
3 0 96 100 101
3 0 96 101 97
3 0 97 101 102
3 0 98 103 99
3 0 99 103 104
3 0 99 104 100
3 0 100 104 105
3 0 100 105 101
3 0 101 105 106
3 0 101 106 102
3 0 102 106 107
3 0 103 108 104
3 0 104 108 109
3 0 104 109 105
3 0 105 109 110
3 0 105 110 106
3 0 106 110 111
3 0 106 111 107
3 0 107 111 112
3 0 108 113 109
3 0 109 113 114
3 0 109 114 110
3 0 110 114 115
3 0 110 115 111
3 0 111 115 116
3 0 111 116 112
3 0 112 116 117
3 0 113 118 114
3 0 114 118 119
3 0 114 119 115
3 0 115 119 120
3 0 115 120 116
3 0 116 120 121
3 0 116 121 117
3 0 117 121 122
3 0 118 123 119
3 0 119 123 124
3 0 119 124 120
3 0 120 124 125
3 0 120 125 121
3 0 121 125 126
3 0 121 126 122
3 0 122 126 127
3 0 123 128 124
3 0 124 128 129
3 0 124 129 125
3 0 125 129 130
3 0 125 130 126
3 0 126 130 131
3 0 126 131 127
3 0 127 131 132
3 0 128 133 129
3 0 129 133 134
3 0 129 134 130
3 0 130 134 135
3 0 130 135 131
3 0 131 135 136
3 0 131 136 132
3 0 132 136 137
3 0 133 138 134
3 0 134 138 139
3 0 134 139 135
3 0 135 139 140
3 0 135 140 136
3 0 136 140 141
3 0 136 141 137
3 0 137 141 142
3 0 143 0 1
3 0 144 1 143
3 0 144 1 2
3 0 144 2 145
3 0 145 2 146
3 0 146 2 3
3 0 146 3 151
3 0 147 143 144
3 0 147 144 148
3 0 148 144 145
3 0 148 145 149
3 0 149 145 146
3 0 149 146 150
3 0 150 146 151
3 0 151 3 4
3 0 151 4 152
3 0 152 4 5
3 0 152 5 175
3 0 153 147 154
3 0 154 147 148
3 0 154 148 155
3 0 155 148 156
3 0 156 148 149
3 0 156 149 161
3 0 157 153 154
3 0 157 154 158
3 0 158 154 155
3 0 158 155 159
3 0 159 155 156
3 0 159 156 160
3 0 160 156 161
3 0 161 149 150
3 0 161 150 162
3 0 162 150 151
3 0 162 151 173
3 0 163 157 158
3 0 163 158 164
3 0 164 158 159
3 0 164 159 165
3 0 165 159 160
3 0 165 160 166
3 0 166 160 161
3 0 166 161 171
3 0 167 163 164
3 0 167 164 168
3 0 168 164 165
3 0 168 165 169
3 0 169 165 166
3 0 169 166 170
3 0 170 166 171
3 0 171 161 162
3 0 171 162 172
3 0 172 162 173
3 0 173 151 152
3 0 173 152 174
3 0 174 152 175
3 0 175 5 6
3 0 175 6 176
3 0 177 167 178
3 0 178 167 168
3 0 178 168 179
3 0 179 168 169
3 0 179 169 180
3 0 180 169 170
3 0 180 170 181
3 0 181 170 171
3 0 181 171 188
3 0 182 177 183
3 0 183 177 178
3 0 183 178 184
3 0 184 178 179
3 0 184 179 185
3 0 185 179 180
3 0 185 180 186
3 0 186 180 181
3 0 186 181 187
3 0 187 181 188
3 0 188 171 172
3 0 188 172 189
3 0 189 172 173
3 0 189 173 203
3 0 190 182 191
3 0 191 182 183
3 0 191 183 192
3 0 192 183 184
3 0 192 184 193
3 0 193 184 185
3 0 193 185 194
3 0 194 185 186
3 0 194 186 195
3 0 195 186 196
3 0 196 186 187
3 0 196 187 188
3 0 196 188 201
3 0 197 190 198
3 0 198 190 191
3 0 198 191 192
3 0 198 192 199
3 0 199 192 193
3 0 199 193 194
3 0 199 194 200
3 0 200 194 195
3 0 200 195 196
3 0 200 196 201
3 0 201 188 189
3 0 201 189 202
3 0 202 189 203
3 0 203 173 174
3 0 203 174 204
3 0 204 174 175
3 0 204 175 219
3 0 205 197 206
3 0 206 197 198
3 0 206 198 207
3 0 207 198 199
3 0 207 199 208
3 0 208 199 200
3 0 208 200 209
3 0 209 200 201
3 0 209 201 210
3 0 210 201 211
3 0 211 201 202
3 0 211 202 203
3 0 211 203 217
3 0 212 205 213
3 0 213 205 206
3 0 213 206 214
3 0 214 206 207
3 0 214 207 215
3 0 215 207 208
3 0 215 208 209
3 0 215 209 216
3 0 216 209 210
3 0 216 210 211
3 0 216 211 217
3 0 217 203 204
3 0 217 204 218
3 0 218 204 219
3 0 219 175 176
3 0 219 176 220
3 0 221 212 222
3 0 222 212 213
3 0 222 213 214
3 0 222 214 224
3 0 223 221 222
3 0 223 222 224
3 0 224 214 215
3 0 224 215 225
3 0 225 215 216
3 0 225 216 226
3 0 226 216 217
3 0 226 217 227
3 0 227 217 228
3 0 228 217 218
3 0 228 218 219
3 0 228 219 232
3 0 229 223 224
3 0 229 224 230
3 0 230 224 225
3 0 230 225 226
3 0 230 226 231
3 0 231 226 227
3 0 231 227 228
3 0 231 228 232
3 0 232 219 220
3 0 232 220 233
3 0 234 229 230
3 0 234 230 235
3 0 235 230 231
3 0 235 231 236
3 0 236 231 232
3 0 236 232 237
3 0 237 232 233
3 0 237 233 238
3 0 239 234 235
3 0 239 235 240
3 0 240 235 236
3 0 240 236 241
3 0 241 236 237
3 0 241 237 242
3 0 242 237 238
3 0 242 238 243
3 0 244 239 240
3 0 244 240 245
3 0 245 240 241
3 0 245 241 246
3 0 246 241 242
3 0 246 242 247
3 0 247 242 243
3 0 247 243 248
3 0 249 244 245
3 0 249 245 250
3 0 250 245 246
3 0 250 246 251
3 0 251 246 247
3 0 251 247 252
3 0 252 247 248
3 0 252 248 253
3 0 254 249 250
3 0 254 250 255
3 0 255 250 251
3 0 255 251 256
3 0 256 251 252
3 0 256 252 257
3 0 257 252 253
3 0 257 253 258
3 0 259 254 255
3 0 259 255 260
3 0 260 255 256
3 0 260 256 261
3 0 261 256 257
3 0 261 257 262
3 0 262 257 258
3 0 262 258 263
3 0 264 259 260
3 0 264 260 265
3 0 265 260 261
3 0 265 261 266
3 0 266 261 262
3 0 266 262 267
3 0 267 262 263
3 0 267 263 268
3 0 269 264 265
3 0 269 265 270
3 0 270 265 266
3 0 270 266 271
3 0 271 266 267
3 0 271 267 272
3 0 272 267 268
3 0 272 268 273
3 0 274 269 270
3 0 274 270 275
3 0 275 270 271
3 0 275 271 276
3 0 276 271 272
3 0 276 272 277
3 0 277 272 273
3 0 277 273 278
FACES:
2 1 142 137
2 1 137 132
2 1 132 127
2 1 127 122
2 1 122 117
2 1 117 112
2 1 112 107
2 1 107 102
2 1 102 97
2 1 97 84
2 1 84 40
2 1 40 6
2 10 0 7
2 10 7 11
2 10 11 17
2 10 17 21
2 10 21 27
2 10 27 31
2 10 31 41
2 10 41 46
2 10 46 54
2 10 54 61
2 10 61 69
2 10 69 76
2 1 76 85
2 1 85 87
2 1 87 93
2 1 93 98
2 1 98 103
2 1 103 108
2 1 108 113
2 1 113 118
2 1 118 123
2 1 123 128
2 1 128 133
2 1 133 138
2 1 138 139
2 1 139 140
2 1 140 141
2 1 141 142
2 1 273 278
2 1 268 273
2 1 263 268
2 1 258 263
2 1 253 258
2 1 248 253
2 1 243 248
2 1 238 243
2 1 233 238
2 1 220 233
2 1 176 220
2 1 6 176
2 10 143 0
2 10 147 143
2 10 153 147
2 10 157 153
2 10 163 157
2 10 167 163
2 10 177 167
2 10 182 177
2 10 190 182
2 10 197 190
2 10 205 197
2 10 212 205
2 1 221 212
2 1 223 221
2 1 229 223
2 1 234 229
2 1 239 234
2 1 244 239
2 1 249 244
2 1 254 249
2 1 259 254
2 1 264 259
2 1 269 264
2 1 274 269
2 1 275 274
2 1 276 275
2 1 277 276
2 1 278 277