POINTS:
0.0 0.125
0.0 0.1875
0.0 0.25
0.0 0.375
0.0 0.5
0.0 0.75
0.0 1.0
0.03125 0.125
0.03125 0.15625
0.03125 0.1875
0.03125 0.21875
0.0625 0.125
0.0625 0.15625
0.0625 0.1875
0.0625 0.21875
0.0625 0.25
0.0625 0.3125
0.09325 0.125
0.09325 0.15625
0.09325 0.1875
0.09325 0.21875
0.125 0.125
0.125 0.15625
0.125 0.1875
0.125 0.21875
0.125 0.25
0.125 0.3125
0.125 0.375
0.15625 0.09375
0.15625 0.125
0.15625 0.15625
0.15625 0.1875
0.15625 0.21875
0.1875 0.0625
0.1875 0.09375
0.1875 0.125
0.1875 0.15625
0.1875 0.1875
0.1875 0.21875
0.1875 0.25
0.1875 0.3125
0.21875 0.03125
0.21875 0.0625
0.21875 0.09375
0.21875 0.125
0.21875 0.15625
0.21875 0.1875
0.21875 0.21875
0.25 0.0
0.25 0.0625
0.25 0.125
0.25 0.1875
0.25 0.25
0.25 0.3125
0.25 0.375
0.25 0.5
0.25 0.75
0.25 1.0
0.3125 0.0
0.3125 0.0625
0.3125 0.125
0.3125 0.1875
0.3125 0.25
0.3125 0.3125
0.375 0.0
0.375 0.125
0.375 0.25
0.375 0.375
0.5 0.0
0.5 0.25
0.5 0.5
0.5 0.75
0.5 1.0
0.75 0.0
0.75 0.25
0.75 0.5
0.75 0.75
0.75 1.0
1.0 0.0
1.0 0.25
1.0 0.5
1.0 0.75
1.0 1.0
1.25 0.0
1.25 0.25
1.25 0.5
1.25 0.75
1.25 1.0
1.5 0.0
1.5 0.25
1.5 0.5
1.5 0.75
1.5 1.0
1.75 0.0
1.75 0.25
1.75 0.5
1.75 0.75
1.75 1.0
2.0 0.0
2.0 0.25
2.0 0.5
2.0 0.75
2.0 1.0
2.25 0.0
2.25 0.25
2.25 0.5
2.25 0.75
2.25 1.0
2.5 0.0
2.5 0.25
2.5 0.5
2.5 0.75
2.5 1.0
2.75 0.0
2.75 0.25
2.75 0.5
2.75 0.75
2.75 1.0
3.0 0.0
3.0 0.25
3.0 0.5
3.0 0.75
3.0 1.0
-0.03125 0.125
-0.03125 0.15625
-0.03125 0.1875
-0.03125 0.21875
-0.0625 0.125
-0.0625 0.15625
-0.0625 0.1875
-0.0625 0.21875
-0.0625 0.25
-0.0625 0.3125
-0.09325 0.125
-0.09325 0.15625
-0.09325 0.1875
-0.09325 0.21875
-0.125 0.125
-0.125 0.15625
-0.125 0.1875
-0.125 0.21875
-0.125 0.25
-0.125 0.3125
-0.125 0.375
-0.15625 0.09375
-0.15625 0.125
-0.15625 0.15625
-0.15625 0.1875
-0.15625 0.21875
-0.1875 0.0625
-0.1875 0.09375
-0.1875 0.125
-0.1875 0.15625
-0.1875 0.1875
-0.1875 0.21875
-0.1875 0.25
-0.1875 0.3125
-0.21875 0.03125
-0.21875 0.0625
-0.21875 0.09375
-0.21875 0.125
-0.21875 0.15625
-0.21875 0.1875
-0.21875 0.21875
-0.25 0.0
-0.25 0.0625
-0.25 0.125
-0.25 0.1875
-0.25 0.25
-0.25 0.3125
-0.25 0.375
-0.25 0.5
-0.25 0.75
-0.25 1.0
-0.3125 0.0
-0.3125 0.0625
-0.3125 0.125
-0.3125 0.1875
-0.3125 0.25
-0.3125 0.3125
-0.375 0.0
-0.375 0.125
-0.375 0.25
-0.375 0.375
-0.5 0.0
-0.5 0.25
-0.5 0.5
-0.5 0.75
-0.5 1.0
-0.75 0.0
-0.75 0.25
-0.75 0.5
-0.75 0.75
-0.75 1.0
-1.0 0.0
-1.0 0.25
-1.0 0.5
-1.0 0.75
-1.0 1.0
-1.25 0.0
-1.25 0.25
-1.25 0.5
-1.25 0.75
-1.25 1.0
-1.5 0.0
-1.5 0.25
-1.5 0.5
-1.5 0.75
-1.5 1.0
-1.75 0.0
-1.75 0.25
-1.75 0.5
-1.75 0.75
-1.75 1.0
-2.0 0.0
-2.0 0.25
-2.0 0.5
-2.0 0.75
-2.0 1.0
-2.25 0.0
-2.25 0.25
-2.25 0.5
-2.25 0.75
-2.25 1.0
-2.5 0.0
-2.5 0.25
-2.5 0.5
-2.5 0.75
-2.5 1.0
-2.75 0.0
-2.75 0.25
-2.75 0.5
-2.75 0.75
-2.75 1.0
-3.0 0.0
-3.0 0.25
-3.0 0.5
-3.0 0.75
-3.0 1.0
CELLS:
3 0 0 7 8
3 0 0 8 1
3 0 1 8 9
3 0 1 9 10
3 0 1 10 2
3 0 2 10 15
3 0 7 11 8
3 0 8 11 12
3 0 8 12 9
3 0 9 12 13
3 0 9 13 10
3 0 10 13 14
3 0 10 14 15
3 0 2 15 16
3 0 2 16 3
3 0 3 16 27
3 0 11 17 12
3 0 12 17 18
3 0 12 18 13
3 0 13 18 19
3 0 13 19 14
3 0 14 19 20
3 0 14 20 15
3 0 15 20 25
3 0 17 21 18
3 0 18 21 22
3 0 18 22 19
3 0 19 22 23
3 0 19 23 20
3 0 20 23 24
3 0 20 24 25
3 0 15 25 16
3 0 16 25 26
3 0 16 26 27
3 0 3 27 4
3 0 4 27 55
3 0 21 28 29
3 0 21 29 22
3 0 22 29 30
3 0 22 30 23
3 0 23 30 31
3 0 23 31 24
3 0 24 31 32
3 0 24 32 25
3 0 25 32 39
3 0 28 33 34
3 0 28 34 29
3 0 29 34 35
3 0 29 35 30
3 0 30 35 36
3 0 30 36 31
3 0 31 36 37
3 0 31 37 32
3 0 32 37 38
3 0 32 38 39
3 0 25 39 26
3 0 26 39 40
3 0 26 40 27
3 0 27 40 54
3 0 33 41 42
3 0 33 42 34
3 0 34 42 43
3 0 34 43 35
3 0 35 43 44
3 0 35 44 36
3 0 36 44 45
3 0 36 45 37
3 0 37 45 46
3 0 37 46 47
3 0 37 47 38
3 0 38 47 39
3 0 39 47 52
3 0 41 48 49
3 0 41 49 42
3 0 42 49 43
3 0 43 49 50
3 0 43 50 44
3 0 44 50 45
3 0 45 50 51
3 0 45 51 46
3 0 46 51 47
3 0 47 51 52
3 0 39 52 40
3 0 40 52 53
3 0 40 53 54
3 0 27 54 55
3 0 4 55 5
3 0 5 55 56
3 0 5 56 6
3 0 6 56 57
3 0 48 58 59
3 0 48 59 49
3 0 49 59 50
3 0 50 59 60
3 0 50 60 51
3 0 51 60 61
3 0 51 61 52
3 0 52 61 62
3 0 52 62 63
3 0 52 63 53
3 0 53 63 54
3 0 54 63 67
3 0 58 64 59
3 0 59 64 65
3 0 59 65 60
3 0 60 65 61
3 0 61 65 66
3 0 61 66 62
3 0 62 66 63
3 0 63 66 67
3 0 54 67 55
3 0 55 67 70
3 0 64 68 65
3 0 65 68 69
3 0 65 69 66
3 0 66 69 67
3 0 67 69 70
3 0 55 70 56
3 0 56 70 71
3 0 56 71 57
3 0 57 71 72
3 0 68 73 69
3 0 69 73 74
3 0 69 74 70
3 0 70 74 75
3 0 70 75 71
3 0 71 75 76
3 0 71 76 72
3 0 72 76 77
3 0 73 78 74
3 0 74 78 79
3 0 74 79 75
3 0 75 79 80
3 0 75 80 76
3 0 76 80 81
3 0 76 81 77
3 0 77 81 82
3 0 78 83 79
3 0 79 83 84
3 0 79 84 80
3 0 80 84 85
3 0 80 85 81
3 0 81 85 86
3 0 81 86 82
3 0 82 86 87
3 0 83 88 84
3 0 84 88 89
3 0 84 89 85
3 0 85 89 90
3 0 85 90 86
3 0 86 90 91
3 0 86 91 87
3 0 87 91 92
3 0 88 93 89
3 0 89 93 94
3 0 89 94 90
3 0 90 94 95
3 0 90 95 91
3 0 91 95 96
3 0 91 96 92
3 0 92 96 97
3 0 93 98 94
3 0 94 98 99
3 0 94 99 95
3 0 95 99 100
3 0 95 100 96
3 0 96 100 101
3 0 96 101 97
3 0 97 101 102
3 0 98 103 99
3 0 99 103 104
3 0 99 104 100
3 0 100 104 105
3 0 100 105 101
3 0 101 105 106
3 0 101 106 102
3 0 102 106 107
3 0 103 108 104
3 0 104 108 109
3 0 104 109 105
3 0 105 109 110
3 0 105 110 106
3 0 106 110 111
3 0 106 111 107
3 0 107 111 112
3 0 108 113 109
3 0 109 113 114
3 0 109 114 110
3 0 110 114 115
3 0 110 115 111
3 0 111 115 116
3 0 111 116 112
3 0 112 116 117
3 0 113 118 114
3 0 114 118 119
3 0 114 119 115
3 0 115 119 120
3 0 115 120 116
3 0 116 120 121
3 0 116 121 117
3 0 117 121 122
3 0 123 0 124
3 0 124 0 1
3 0 124 1 125
3 0 125 1 126
3 0 126 1 2
3 0 126 2 131
3 0 127 123 124
3 0 127 124 128
3 0 128 124 125
3 0 128 125 129
3 0 129 125 126
3 0 129 126 130
3 0 130 126 131
3 0 131 2 132
3 0 132 2 3
3 0 132 3 143
3 0 133 127 128
3 0 133 128 134
3 0 134 128 129
3 0 134 129 135
3 0 135 129 130
3 0 135 130 136
3 0 136 130 131
3 0 136 131 141
3 0 137 133 134
3 0 137 134 138
3 0 138 134 135
3 0 138 135 139
3 0 139 135 136
3 0 139 136 140
3 0 140 136 141
3 0 141 131 132
3 0 141 132 142
3 0 142 132 143
3 0 143 3 4
3 0 143 4 171
3 0 144 137 145
3 0 145 137 138
3 0 145 138 146
3 0 146 138 139
3 0 146 139 147
3 0 147 139 140
3 0 147 140 148
3 0 148 140 141
3 0 148 141 155
3 0 149 144 150
3 0 150 144 145
3 0 150 145 151
3 0 151 145 146
3 0 151 146 152
3 0 152 146 147
3 0 152 147 153
3 0 153 147 148
3 0 153 148 154
3 0 154 148 155
3 0 155 141 142
3 0 155 142 156
3 0 156 142 143
3 0 156 143 170
3 0 157 149 158
3 0 158 149 150
3 0 158 150 159
3 0 159 150 151
3 0 159 151 160
3 0 160 151 152
3 0 160 152 161
3 0 161 152 153
3 0 161 153 162
3 0 162 153 163
3 0 163 153 154
3 0 163 154 155
3 0 163 155 168
3 0 164 157 165
3 0 165 157 158
3 0 165 158 159
3 0 165 159 166
3 0 166 159 160
3 0 166 160 161
3 0 166 161 167
3 0 167 161 162
3 0 167 162 163
3 0 167 163 168
3 0 168 155 156
3 0 168 156 169
3 0 169 156 170
3 0 170 143 171
3 0 171 4 5
3 0 171 5 172
3 0 172 5 6
3 0 172 6 173
3 0 174 164 175
3 0 175 164 165
3 0 175 165 166
3 0 175 166 176
3 0 176 166 167
3 0 176 167 177
3 0 177 167 168
3 0 177 168 178
3 0 178 168 179
3 0 179 168 169
3 0 179 169 170
3 0 179 170 183
3 0 180 174 175
3 0 180 175 181
3 0 181 175 176
3 0 181 176 177
3 0 181 177 182
3 0 182 177 178
3 0 182 178 179
3 0 182 179 183
3 0 183 170 171
3 0 183 171 186
3 0 184 180 181
3 0 184 181 185
3 0 185 181 182
3 0 185 182 183
3 0 185 183 186
3 0 186 171 172
3 0 186 172 187
3 0 187 172 173
3 0 187 173 188
3 0 189 184 185
3 0 189 185 190
3 0 190 185 186
3 0 190 186 191
3 0 191 186 187
3 0 191 187 192
3 0 192 187 188
3 0 192 188 193
3 0 194 189 190
3 0 194 190 195
3 0 195 190 191
3 0 195 191 196
3 0 196 191 192
3 0 196 192 197
3 0 197 192 193
3 0 197 193 198
3 0 199 194 195
3 0 199 195 200
3 0 200 195 196
3 0 200 196 201
3 0 201 196 197
3 0 201 197 202
3 0 202 197 198
3 0 202 198 203
3 0 204 199 200
3 0 204 200 205
3 0 205 200 201
3 0 205 201 206
3 0 206 201 202
3 0 206 202 207
3 0 207 202 203
3 0 207 203 208
3 0 209 204 205
3 0 209 205 210
3 0 210 205 206
3 0 210 206 211
3 0 211 206 207
3 0 211 207 212
3 0 212 207 208
3 0 212 208 213
3 0 214 209 210
3 0 214 210 215
3 0 215 210 211
3 0 215 211 216
3 0 216 211 212
3 0 216 212 217
3 0 217 212 213
3 0 217 213 218
3 0 219 214 215
3 0 219 215 220
3 0 220 215 216
3 0 220 216 221
3 0 221 216 217
3 0 221 217 222
3 0 222 217 218
3 0 222 218 223
3 0 224 219 220
3 0 224 220 225
3 0 225 220 221
3 0 225 221 226
3 0 226 221 222
3 0 226 222 227
3 0 227 222 223
3 0 227 223 228
3 0 229 224 225
3 0 229 225 230
3 0 230 225 226
3 0 230 226 231
3 0 231 226 227
3 0 231 227 232
3 0 232 227 228
3 0 232 228 233
3 0 234 229 230
3 0 234 230 235
3 0 235 230 231
3 0 235 231 236
3 0 236 231 232
3 0 236 232 237
3 0 237 232 233
3 0 237 233 238
FACES:
2 1 122 117
2 1 117 112
2 1 112 107
2 1 107 102
2 1 102 97
2 1 97 92
2 1 92 87
2 1 87 82
2 1 82 77
2 1 77 72
2 1 72 57
2 1 57 6
2 10 0 7
2 10 7 11
2 10 11 17
2 10 17 21
2 10 21 28
2 10 28 33
2 10 33 41
2 10 41 48
2 1 48 58
2 1 58 64
2 1 64 68
2 1 68 73
2 1 73 78
2 1 78 83
2 1 83 88
2 1 88 93
2 1 93 98
2 1 98 103
2 1 103 108
2 1 108 113
2 1 113 118
2 1 118 119
2 1 119 120
2 1 120 121
2 1 121 122
2 1 233 238
2 1 228 233
2 1 223 228
2 1 218 223
2 1 213 218
2 1 208 213
2 1 203 208
2 1 198 203
2 1 193 198
2 1 188 193
2 1 173 188
2 1 6 173
2 10 123 0
2 10 127 123
2 10 133 127
2 10 137 133
2 10 144 137
2 10 149 144
2 10 157 149
2 10 164 157
2 1 174 164
2 1 180 174
2 1 184 180
2 1 189 184
2 1 194 189
2 1 199 194
2 1 204 199
2 1 209 204
2 1 214 209
2 1 219 214
2 1 224 219
2 1 229 224
2 1 234 229
2 1 235 234
2 1 236 235
2 1 237 236
2 1 238 237