POINTS:
-2.0 0.0
-2.0 0.125
-2.0 0.25
-2.0 0.375
-2.0 0.5
-2.0 0.625
-2.0 0.75
-2.0 0.875
-2.0 1.0
-1.875 0.0
-1.875 0.125
-1.875 0.25
-1.875 0.375
-1.875 0.5
-1.875 0.625
-1.875 0.75
-1.875 0.875
-1.875 1.0
-1.75 0.0
-1.75 0.125
-1.75 0.25
-1.75 0.375
-1.75 0.5
-1.75 0.625
-1.75 0.75
-1.75 0.875
-1.75 1.0
-1.625 0.0
-1.625 0.125
-1.625 0.25
-1.625 0.375
-1.625 0.5
-1.625 0.625
-1.625 0.75
-1.625 0.875
-1.625 1.0
-1.5 0.0
-1.5 0.125
-1.5 0.25
-1.5 0.375
-1.5 0.5
-1.5 0.625
-1.5 0.75
-1.5 0.875
-1.5 1.0
-1.375 0.0
-1.375 0.125
-1.375 0.25
-1.375 0.375
-1.375 0.5
-1.375 0.625
-1.375 0.75
-1.375 0.875
-1.375 1.0
-1.25 0.0
-1.25 0.125
-1.25 0.25
-1.25 0.375
-1.25 0.5
-1.25 0.625
-1.25 0.75
-1.25 0.875
-1.25 1.0
-1.125 0.0
-1.125 0.125
-1.125 0.25
-1.125 0.375
-1.125 0.5
-1.125 0.625
-1.125 0.75
-1.125 0.875
-1.125 1.0
-1.0 0.0
-1.0 0.125
-1.0 0.25
-1.0 0.375
-1.0 0.5
-1.0 0.625
-1.0 0.75
-1.0 0.875
-1.0 1.0
-0.875 0.0
-0.875 0.125
-0.875 0.25
-0.875 0.375
-0.875 0.5
-0.875 0.625
-0.875 0.75
-0.875 0.875
-0.875 1.0
-0.75 0.0
-0.75 0.125
-0.75 0.25
-0.75 0.375
-0.75 0.5
-0.75 0.625
-0.75 0.75
-0.75 0.875
-0.75 1.0
-0.625 0.0
-0.625 0.125
-0.625 0.25
-0.625 0.375
-0.625 0.5
-0.625 0.625
-0.625 0.75
-0.625 0.875
-0.625 1.0
-0.5 0.0
-0.5 0.125
-0.5 0.25
-0.5 0.375
-0.5 0.5
-0.5 0.625
-0.5 0.75
-0.5 0.875
-0.5 1.0
-0.375 0.0
-0.375 0.125
-0.375 0.25
-0.375 0.375
-0.375 0.5
-0.375 0.625
-0.375 0.75
-0.375 0.875
-0.375 1.0
-0.25 0.0
-0.25 0.125
-0.25 0.25
-0.25 0.375
-0.25 0.5
-0.25 0.625
-0.25 0.75
-0.25 0.875
-0.25 1.0
-0.125 0.0
-0.125 0.125
-0.125 0.25
-0.125 0.375
-0.125 0.5
-0.125 0.625
-0.125 0.75
-0.125 0.875
-0.125 1.0
0.0 0.0
0.0 0.125
0.0 0.25
0.0 0.375
0.0 0.625
0.0 0.75
0.0 0.875
0.0 1.0
0.125 0.0
0.125 0.125
0.125 0.25
0.125 0.375
0.125 0.5
0.125 0.625
0.125 0.75
0.125 0.875
0.125 1.0
0.25 0.0
0.25 0.125
0.25 0.25
0.25 0.375
0.25 0.5
0.25 0.625
0.25 0.75
0.25 0.875
0.25 1.0
0.375 0.0
0.375 0.125
0.375 0.25
0.375 0.375
0.375 0.5
0.375 0.625
0.375 0.75
0.375 0.875
0.375 1.0
0.5 0.0
0.5 0.125
0.5 0.25
0.5 0.375
0.5 0.5
0.5 0.625
0.5 0.75
0.5 0.875
0.5 1.0
0.625 0.0
0.625 0.125
0.625 0.25
0.625 0.375
0.625 0.5
0.625 0.625
0.625 0.75
0.625 0.875
0.625 1.0
0.75 0.0
0.75 0.125
0.75 0.25
0.75 0.375
0.75 0.5
0.75 0.625
0.75 0.75
0.75 0.875
0.75 1.0
0.875 0.0
0.875 0.125
0.875 0.25
0.875 0.375
0.875 0.5
0.875 0.625
0.875 0.75
0.875 0.875
0.875 1.0
1.0 0.0
1.0 0.125
1.0 0.25
1.0 0.375
1.0 0.5
1.0 0.625
1.0 0.75
1.0 0.875
1.0 1.0
1.125 0.0
1.125 0.125
1.125 0.25
1.125 0.375
1.125 0.5
1.125 0.625
1.125 0.75
1.125 0.875
1.125 1.0
1.25 0.0
1.25 0.125
1.25 0.25
1.25 0.375
1.25 0.5
1.25 0.625
1.25 0.75
1.25 0.875
1.25 1.0
1.375 0.0
1.375 0.125
1.375 0.25
1.375 0.375
1.375 0.5
1.375 0.625
1.375 0.75
1.375 0.875
1.375 1.0
1.5 0.0
1.5 0.125
1.5 0.25
1.5 0.375
1.5 0.5
1.5 0.625
1.5 0.75
1.5 0.875
1.5 1.0
1.625 0.0
1.625 0.125
1.625 0.25
1.625 0.375
1.625 0.5
1.625 0.625
1.625 0.75
1.625 0.875
1.625 1.0
1.75 0.0
1.75 0.125
1.75 0.25
1.75 0.375
1.75 0.5
1.75 0.625
1.75 0.75
1.75 0.875
1.75 1.0
1.875 0.0
1.875 0.125
1.875 0.25
1.875 0.375
1.875 0.5
1.875 0.625
1.875 0.75
1.875 0.875
1.875 1.0
2.0 0.0
2.0 0.125
2.0 0.25
2.0 0.375
2.0 0.5
2.0 0.625
2.0 0.75
2.0 0.875
2.0 1.0
CELLS:
4 1 0 9 10 1
4 1 1 10 11 2
4 1 2 11 12 3
4 1 3 12 13 4
4 1 4 13 14 5
4 1 5 14 15 6
4 1 6 15 16 7
4 1 7 16 17 8
4 1 9 18 19 10
4 1 10 19 20 11
4 1 11 20 21 12
4 1 12 21 22 13
4 1 13 22 23 14
4 1 14 23 24 15
4 1 15 24 25 16
4 1 16 25 26 17
4 1 18 27 28 19
4 1 19 28 29 20
4 1 20 29 30 21
4 1 21 30 31 22
4 1 22 31 32 23
4 1 23 32 33 24
4 1 24 33 34 25
4 1 25 34 35 26
4 1 27 36 37 28
4 1 28 37 38 29
4 1 29 38 39 30
4 1 30 39 40 31
4 1 31 40 41 32
4 1 32 41 42 33
4 1 33 42 43 34
4 1 34 43 44 35
4 1 36 45 46 37
4 1 37 46 47 38
4 1 38 47 48 39
4 1 39 48 49 40
4 1 40 49 50 41
4 1 41 50 51 42
4 1 42 51 52 43
4 1 43 52 53 44
4 1 45 54 55 46
4 1 46 55 56 47
4 1 47 56 57 48
4 1 48 57 58 49
4 1 49 58 59 50
4 1 50 59 60 51
4 1 51 60 61 52
4 1 52 61 62 53
4 1 54 63 64 55
4 1 55 64 65 56
4 1 56 65 66 57
4 1 57 66 67 58
4 1 58 67 68 59
4 1 59 68 69 60
4 1 60 69 70 61
4 1 61 70 71 62
4 1 63 72 73 64
4 1 64 73 74 65
4 1 65 74 75 66
4 1 66 75 76 67
4 1 67 76 77 68
4 1 68 77 78 69
4 1 69 78 79 70
4 1 70 79 80 71
4 1 72 81 82 73
4 1 73 82 83 74
4 1 74 83 84 75
4 1 75 84 85 76
4 1 76 85 86 77
4 1 77 86 87 78
4 1 78 87 88 79
4 1 79 88 89 80
4 1 81 90 91 82
4 1 82 91 92 83
4 1 83 92 93 84
4 1 84 93 94 85
4 1 85 94 95 86
4 1 86 95 96 87
4 1 87 96 97 88
4 1 88 97 98 89
4 1 90 99 100 91
4 1 91 100 101 92
4 1 92 101 102 93
4 1 93 102 103 94
4 1 94 103 104 95
4 1 95 104 105 96
4 1 96 105 106 97
4 1 97 106 107 98
4 1 99 108 109 100
4 1 100 109 110 101
4 1 101 110 111 102
4 1 102 111 112 103
4 1 103 112 113 104
4 1 104 113 114 105
4 1 105 114 115 106
4 1 106 115 116 107
4 1 108 117 118 109
4 1 109 118 119 110
4 1 110 119 120 111
4 1 111 120 121 112
4 1 112 121 122 113
4 1 113 122 123 114
4 1 114 123 124 115
4 1 115 124 125 116
4 1 117 126 127 118
4 1 118 127 128 119
4 1 119 128 129 120
4 1 120 129 130 121
4 1 121 130 131 122
4 1 122 131 132 123
4 1 123 132 133 124
4 1 124 133 134 125
4 1 126 135 136 127
4 1 127 136 137 128
4 1 128 137 138 129
4 1 129 138 139 130
4 1 130 139 140 131
4 1 131 140 141 132
4 1 132 141 142 133
4 1 133 142 143 134
4 1 135 144 145 136
4 1 136 145 146 137
4 1 137 146 147 138
4 1 140 148 149 141
4 1 141 149 150 142
4 1 142 150 151 143
4 1 144 152 153 145
4 1 145 153 154 146
4 1 146 154 155 147
4 1 148 157 158 149
4 1 149 158 159 150
4 1 150 159 160 151
4 1 152 161 162 153
4 1 153 162 163 154
4 1 154 163 164 155
4 1 155 164 165 156
4 1 156 165 166 157
4 1 157 166 167 158
4 1 158 167 168 159
4 1 159 168 169 160
4 1 161 170 171 162
4 1 162 171 172 163
4 1 163 172 173 164
4 1 164 173 174 165
4 1 165 174 175 166
4 1 166 175 176 167
4 1 167 176 177 168
4 1 168 177 178 169
4 1 170 179 180 171
4 1 171 180 181 172
4 1 172 181 182 173
4 1 173 182 183 174
4 1 174 183 184 175
4 1 175 184 185 176
4 1 176 185 186 177
4 1 177 186 187 178
4 1 179 188 189 180
4 1 180 189 190 181
4 1 181 190 191 182
4 1 182 191 192 183
4 1 183 192 193 184
4 1 184 193 194 185
4 1 185 194 195 186
4 1 186 195 196 187
4 1 188 197 198 189
4 1 189 198 199 190
4 1 190 199 200 191
4 1 191 200 201 192
4 1 192 201 202 193
4 1 193 202 203 194
4 1 194 203 204 195
4 1 195 204 205 196
4 1 197 206 207 198
4 1 198 207 208 199
4 1 199 208 209 200
4 1 200 209 210 201
4 1 201 210 211 202
4 1 202 211 212 203
4 1 203 212 213 204
4 1 204 213 214 205
4 1 206 215 216 207
4 1 207 216 217 208
4 1 208 217 218 209
4 1 209 218 219 210
4 1 210 219 220 211
4 1 211 220 221 212
4 1 212 221 222 213
4 1 213 222 223 214
4 1 215 224 225 216
4 1 216 225 226 217
4 1 217 226 227 218
4 1 218 227 228 219
4 1 219 228 229 220
4 1 220 229 230 221
4 1 221 230 231 222
4 1 222 231 232 223
4 1 224 233 234 225
4 1 225 234 235 226
4 1 226 235 236 227
4 1 227 236 237 228
4 1 228 237 238 229
4 1 229 238 239 230
4 1 230 239 240 231
4 1 231 240 241 232
4 1 233 242 243 234
4 1 234 243 244 235
4 1 235 244 245 236
4 1 236 245 246 237
4 1 237 246 247 238
4 1 238 247 248 239
4 1 239 248 249 240
4 1 240 249 250 241
4 1 242 251 252 243
4 1 243 252 253 244
4 1 244 253 254 245
4 1 245 254 255 246
4 1 246 255 256 247
4 1 247 256 257 248
4 1 248 257 258 249
4 1 249 258 259 250
4 1 251 260 261 252
4 1 252 261 262 253
4 1 253 262 263 254
4 1 254 263 264 255
4 1 255 264 265 256
4 1 256 265 266 257
4 1 257 266 267 258
4 1 258 267 268 259
4 1 260 269 270 261
4 1 261 270 271 262
4 1 262 271 272 263
4 1 263 272 273 264
4 1 264 273 274 265
4 1 265 274 275 266
4 1 266 275 276 267
4 1 267 276 277 268
4 1 269 278 279 270
4 1 270 279 280 271
4 1 271 280 281 272
4 1 272 281 282 273
4 1 273 282 283 274
4 1 274 283 284 275
4 1 275 284 285 276
4 1 276 285 286 277
4 1 278 287 288 279
4 1 279 288 289 280
4 1 280 289 290 281
4 1 281 290 291 282
4 1 282 291 292 283
4 1 283 292 293 284
4 1 284 293 294 285
4 1 285 294 295 286