POINTS:
-3.0 0.0
-3.0 0.25
-3.0 0.5
-3.0 0.75
-3.0 1.0
-2.75 0.0
-2.75 0.25
-2.75 0.5
-2.75 0.75
-2.75 1.0
-2.5 0.0
-2.5 0.25
-2.5 0.5
-2.5 0.75
-2.5 1.0
-2.25 0.0
-2.25 0.25
-2.25 0.5
-2.25 0.75
-2.25 1.0
-2.0 0.0
-2.0 0.25
-2.0 0.5
-2.0 0.75
-2.0 1.0
-1.75 0.0
-1.75 0.25
-1.75 0.5
-1.75 0.75
-1.75 1.0
-1.5 0.0
-1.5 0.25
-1.5 0.5
-1.5 0.75
-1.5 1.0
-1.25 0.0
-1.25 0.25
-1.25 0.5
-1.25 0.75
-1.25 1.0
-1.125 0.0
-1.125 0.125
-1.125 0.25
-1.125 0.375
-1.0625 0.0
-1.0625 0.0625
-1.0 0.0
-1.0 0.0625
-1.0 0.125
-1.0 0.25
-1.0 0.375
-1.0 0.5
-1.0 0.75
-1.0 1.0
-0.9375 0.0625
-0.9375 0.125
-0.9375 0.1875
-0.9375 0.25
-0.9375 0.3125
-0.9375 0.375
-0.9375 0.4375
-0.875 0.125
-0.875 0.1875
-0.875 0.25
-0.875 0.3125
-0.875 0.375
-0.875 0.4375
-0.875 0.5
-0.875 0.625
-0.84375 0.15625
-0.84375 0.1875
-0.84375 0.21875
-0.84375 0.25
-0.84375 0.28125
-0.84375 0.3125
-0.84375 0.34375
-0.8125 0.1875
-0.8125 0.21875
-0.8125 0.25
-0.8125 0.28125
-0.8125 0.3125
-0.8125 0.34375
-0.8125 0.375
-0.8125 0.4375
-0.78125 0.21875
-0.78125 0.25
-0.78125 0.28125
-0.78125 0.3125
-0.78125 0.34375
-0.75 0.25
-0.75 0.28125
-0.75 0.3125
-0.75 0.34375
-0.75 0.375
-0.75 0.4375
-0.75 0.5
-0.75 0.625
-0.75 0.75
-0.75 1.0
-0.71875 0.25
-0.71875 0.28125
-0.71875 0.3125
-0.71875 0.34375
-0.6875 0.25
-0.6875 0.28125
-0.6875 0.3125
-0.6875 0.34375
-0.6875 0.375
-0.6875 0.4375
-0.65625 0.25
-0.65625 0.28125
-0.65625 0.3125
-0.65625 0.34375
-0.625 0.25
-0.625 0.3125
-0.625 0.375
-0.625 0.4375
-0.625 0.5
-0.625 0.625
-0.5625 0.25
-0.5625 0.3125
-0.5625 0.375
-0.5625 0.4375
-0.5 0.25
-0.5 0.375
-0.5 0.5
-0.5 0.625
-0.5 0.75
-0.5 1.0
-0.375 0.25
-0.375 0.375
-0.375 0.5
-0.375 0.625
-0.25 0.25
-0.25 0.375
-0.25 0.5
-0.25 0.625
-0.25 0.75
-0.25 1.0
-0.125 0.25
-0.125 0.375
-0.125 0.5
-0.125 0.625
-0.0625 0.25
-0.0625 0.3125
-0.0625 0.375
-0.0625 0.4375
0.0 0.25
0.0 0.3125
0.0 0.375
0.0 0.4375
0.0 0.5
0.0 0.625
0.0 0.75
0.0 1.0
0.0625 0.3125
0.0625 0.375
0.0625 0.4375
0.0625 0.5
0.0625 0.5625
0.0625 0.625
0.0625 0.6875
0.125 0.375
0.125 0.4375
0.125 0.5
0.125 0.5625
0.125 0.625
0.125 0.6875
0.125 0.75
0.125 0.875
0.15625 0.40625
0.15625 0.4375
0.15625 0.46875
0.15625 0.5
0.15625 0.53125
0.15625 0.5625
0.15625 0.59375
0.1875 0.4375
0.1875 0.46875
0.1875 0.5
0.1875 0.53125
0.1875 0.5625
0.1875 0.59375
0.1875 0.625
0.1875 0.6875
0.21875 0.46875
0.21875 0.5
0.21875 0.53125
0.21875 0.5625
0.21875 0.59375
0.25 0.46875
0.25 0.5
0.25 0.53125
0.25 0.5625
0.25 0.59375
0.25 0.625
0.25 0.6875
0.25 0.75
0.25 0.875
0.25 1.0
0.28125 0.46875
0.28125 0.5
0.28125 0.53125
0.28125 0.5625
0.28125 0.59375
0.3125 0.46875
0.3125 0.5
0.3125 0.5625
0.3125 0.625
0.3125 0.6875
0.375 0.46875
0.375 0.5
0.375 0.5625
0.375 0.625
0.375 0.6875
0.375 0.75
0.375 0.875
0.4375 0.46875
0.4375 0.5
0.4375 0.5625
0.4375 0.625
0.4375 0.6875
0.46875 0.46875
0.46875 0.5
0.46875 0.53125
0.46875 0.5625
0.46875 0.59375
0.5 0.46875
0.5 0.5
0.5 0.53125
0.5 0.5625
0.5 0.59375
0.5 0.625
0.5 0.6875
0.5 0.75
0.5 0.875
0.5 1.0
0.53125 0.46875
0.53125 0.5
0.53125 0.53125
0.53125 0.5625
0.53125 0.59375
0.5625 0.4375
0.5625 0.46875
0.5625 0.5
0.5625 0.53125
0.5625 0.5625
0.5625 0.59375
0.5625 0.625
0.5625 0.6875
0.59375 0.40625
0.59375 0.4375
0.59375 0.46875
0.59375 0.5
0.59375 0.53125
0.59375 0.5625
0.59375 0.59375
0.625 0.375
0.625 0.4375
0.625 0.5
0.625 0.5625
0.625 0.625
0.625 0.6875
0.625 0.75
0.625 0.875
0.6875 0.3125
0.6875 0.375
0.6875 0.4375
0.6875 0.5
0.6875 0.5625
0.6875 0.625
0.6875 0.6875
0.75 0.25
0.75 0.3125
0.75 0.375
0.75 0.4375
0.75 0.5
0.75 0.625
0.75 0.75
0.75 1.0
0.8125 0.1875
0.8125 0.25
0.8125 0.3125
0.8125 0.375
0.8125 0.4375
0.875 0.125
0.875 0.1875
0.875 0.25
0.875 0.3125
0.875 0.375
0.875 0.5
0.875 0.625
0.9375 0.0625
0.9375 0.125
0.9375 0.1875
0.9375 0.25
0.9375 0.3125
1.0 0.0
1.0 0.0625
1.0 0.125
1.0 0.1875
1.0 0.25
1.0 0.375
1.0 0.5
1.0 0.75
1.0 1.0
1.0625 0.0
1.0625 0.0625
1.0625 0.125
1.0625 0.1875
1.125 0.0
1.125 0.125
1.125 0.25
1.125 0.375
1.25 0.0
1.25 0.25
1.25 0.5
1.25 0.75
1.25 1.0
1.5 0.0
1.5 0.25
1.5 0.5
1.5 0.75
1.5 1.0
1.75 0.0
1.75 0.25
1.75 0.5
1.75 0.75
1.75 1.0
2.0 0.0
2.0 0.25
2.0 0.5
2.0 0.75
2.0 1.0
2.25 0.0
2.25 0.25
2.25 0.5
2.25 0.75
2.25 1.0
2.5 0.0
2.5 0.25
2.5 0.5
2.5 0.75
2.5 1.0
2.75 0.0
2.75 0.25
2.75 0.5
2.75 0.75
2.75 1.0
3.0 0.0
3.0 0.25
3.0 0.5
3.0 0.75
3.0 1.0
CELLS:
3 0 0 5 6
3 0 0 6 1
3 0 1 6 7
3 0 1 7 2
3 0 2 7 8
3 0 2 8 3
3 0 3 8 9
3 0 3 9 4
3 0 5 10 11
3 0 5 11 6
3 0 6 11 12
3 0 6 12 7
3 0 7 12 13
3 0 7 13 8
3 0 8 13 14
3 0 8 14 9
3 0 10 15 16
3 0 10 16 11
3 0 11 16 17
3 0 11 17 12
3 0 12 17 18
3 0 12 18 13
3 0 13 18 19
3 0 13 19 14
3 0 15 20 21
3 0 15 21 16
3 0 16 21 22
3 0 16 22 17
3 0 17 22 23
3 0 17 23 18
3 0 18 23 24
3 0 18 24 19
3 0 20 25 26
3 0 20 26 21
3 0 21 26 27
3 0 21 27 22
3 0 22 27 28
3 0 22 28 23
3 0 23 28 29
3 0 23 29 24
3 0 25 30 31
3 0 25 31 26
3 0 26 31 32
3 0 26 32 27
3 0 27 32 33
3 0 27 33 28
3 0 28 33 34
3 0 28 34 29
3 0 30 35 36
3 0 30 36 31
3 0 31 36 37
3 0 31 37 32
3 0 32 37 38
3 0 32 38 33
3 0 33 38 39
3 0 33 39 34
3 0 35 40 41
3 0 35 41 36
3 0 36 41 42
3 0 40 44 45
3 0 40 45 41
3 0 44 46 47
3 0 44 47 45
3 0 45 47 48
3 0 41 45 48
3 0 41 48 49
3 0 41 49 42
3 0 36 42 43
3 0 42 49 50
3 0 42 50 43
3 0 43 50 51
3 0 36 43 37
3 0 37 43 51
3 0 37 51 52
3 0 37 52 38
3 0 38 52 53
3 0 38 53 39
3 0 46 54 47
3 0 47 54 55
3 0 47 55 48
3 0 54 61 55
3 0 55 61 62
3 0 55 62 56
3 0 48 55 56
3 0 48 56 49
3 0 49 56 57
3 0 56 62 63
3 0 56 63 57
3 0 49 57 58
3 0 49 58 50
3 0 50 58 59
3 0 57 63 64
3 0 57 64 58
3 0 58 64 65
3 0 58 65 59
3 0 50 59 60
3 0 50 60 51
3 0 59 65 66
3 0 59 66 60
3 0 60 66 67
3 0 51 60 67
3 0 61 69 62
3 0 62 69 70
3 0 62 70 71
3 0 62 71 63
3 0 63 71 72
3 0 63 72 73
3 0 63 73 64
3 0 64 73 74
3 0 64 74 75
3 0 64 75 65
3 0 69 76 70
3 0 70 76 77
3 0 70 77 71
3 0 71 77 78
3 0 71 78 72
3 0 72 78 79
3 0 72 79 73
3 0 73 79 80
3 0 73 80 74
3 0 74 80 81
3 0 74 81 75
3 0 75 81 82
3 0 65 75 82
3 0 65 82 83
3 0 65 83 66
3 0 66 83 67
3 0 76 84 77
3 0 77 84 85
3 0 77 85 78
3 0 78 85 86
3 0 78 86 79
3 0 79 86 87
3 0 79 87 80
3 0 80 87 88
3 0 80 88 81
3 0 81 88 82
3 0 84 89 85
3 0 85 89 90
3 0 85 90 86
3 0 86 90 91
3 0 86 91 87
3 0 87 91 92
3 0 87 92 88
3 0 88 92 93
3 0 82 88 93
3 0 82 93 94
3 0 82 94 83
3 0 83 94 95
3 0 67 83 95
3 0 51 67 68
3 0 51 68 52
3 0 67 95 96
3 0 67 96 68
3 0 68 96 97
3 0 52 68 97
3 0 52 97 98
3 0 52 98 53
3 0 89 99 100
3 0 89 100 90
3 0 90 100 101
3 0 90 101 91
3 0 91 101 102
3 0 91 102 92
3 0 92 102 93
3 0 99 103 104
3 0 99 104 100
3 0 100 104 105
3 0 100 105 101
3 0 101 105 106
3 0 101 106 102
3 0 102 106 107
3 0 93 102 107
3 0 93 107 108
3 0 93 108 94
3 0 94 108 95
3 0 103 109 110
3 0 103 110 104
3 0 104 110 111
3 0 104 111 105
3 0 105 111 112
3 0 105 112 106
3 0 106 112 107
3 0 109 113 110
3 0 110 113 114
3 0 110 114 111
3 0 111 114 112
3 0 114 115 112
3 0 107 112 115
3 0 107 115 116
3 0 107 116 108
3 0 108 116 117
3 0 95 108 117
3 0 95 117 118
3 0 95 118 96
3 0 96 118 97
3 0 113 119 120
3 0 113 120 114
3 0 114 120 121
3 0 114 121 115
3 0 115 121 122
3 0 115 122 116
3 0 116 122 117
3 0 119 123 120
3 0 120 123 124
3 0 120 124 121
3 0 121 124 122
3 0 122 124 125
3 0 117 122 125
3 0 117 125 126
3 0 117 126 118
3 0 118 126 127
3 0 97 118 127
3 0 97 127 128
3 0 97 128 98
3 0 123 129 130
3 0 123 130 124
3 0 124 130 131
3 0 124 131 125
3 0 125 131 132
3 0 125 132 126
3 0 126 132 127
3 0 129 133 134
3 0 129 134 130
3 0 130 134 135
3 0 130 135 131
3 0 131 135 136
3 0 131 136 132
3 0 132 136 137
3 0 127 132 137
3 0 127 137 138
3 0 127 138 128
3 0 133 139 140
3 0 133 140 134
3 0 134 140 141
3 0 134 141 135
3 0 135 141 142
3 0 135 142 136
3 0 136 142 137
3 0 139 143 144
3 0 139 144 140
3 0 140 144 145
3 0 140 145 146
3 0 140 146 141
3 0 143 147 148
3 0 143 148 144
3 0 144 148 149
3 0 144 149 145
3 0 145 149 150
3 0 145 150 146
3 0 146 150 151
3 0 141 146 151
3 0 141 151 152
3 0 141 152 142
3 0 142 152 153
3 0 137 142 153
3 0 137 153 154
3 0 137 154 138
3 0 147 155 148
3 0 148 155 156
3 0 148 156 149
3 0 149 156 157
3 0 149 157 150
3 0 150 157 158
3 0 150 158 151
3 0 151 158 159
3 0 151 159 152
3 0 152 159 160
3 0 152 160 161
3 0 152 161 153
3 0 155 162 156
3 0 156 162 163
3 0 156 163 157
3 0 157 163 164
3 0 157 164 158
3 0 158 164 165
3 0 158 165 159
3 0 159 165 166
3 0 159 166 160
3 0 160 166 167
3 0 160 167 161
3 0 161 167 168
3 0 153 161 168
3 0 162 170 163
3 0 163 170 171
3 0 163 171 172
3 0 163 172 164
3 0 164 172 173
3 0 164 173 174
3 0 164 174 165
3 0 165 174 175
3 0 165 175 176
3 0 165 176 166
3 0 170 177 171
3 0 171 177 178
3 0 171 178 172
3 0 172 178 179
3 0 172 179 173
3 0 173 179 180
3 0 173 180 174
3 0 174 180 181
3 0 174 181 175
3 0 175 181 182
3 0 175 182 176
3 0 176 182 183
3 0 166 176 183
3 0 166 183 184
3 0 166 184 167
3 0 167 184 168
3 0 177 185 178
3 0 178 185 186
3 0 178 186 179
3 0 179 186 187
3 0 179 187 180
3 0 180 187 188
3 0 180 188 181
3 0 181 188 189
3 0 181 189 182
3 0 182 189 183
3 0 185 190 191
3 0 185 191 186
3 0 186 191 192
3 0 186 192 187
3 0 187 192 193
3 0 187 193 188
3 0 188 193 194
3 0 188 194 189
3 0 189 194 195
3 0 183 189 195
3 0 183 195 196
3 0 183 196 184
3 0 184 196 197
3 0 168 184 197
3 0 153 168 169
3 0 153 169 154
3 0 168 197 198
3 0 168 198 169
3 0 169 198 199
3 0 154 169 199
3 0 190 200 201
3 0 190 201 191
3 0 191 201 202
3 0 191 202 192
3 0 192 202 203
3 0 192 203 193
3 0 193 203 204
3 0 193 204 194
3 0 194 204 195
3 0 200 205 206
3 0 200 206 201
3 0 201 206 202
3 0 202 206 207
3 0 202 207 203
3 0 203 207 204
3 0 204 207 208
3 0 195 204 208
3 0 195 208 209
3 0 195 209 196
3 0 196 209 197
3 0 205 210 211
3 0 205 211 206
3 0 206 211 212
3 0 206 212 207
3 0 207 212 213
3 0 207 213 208
3 0 208 213 214
3 0 208 214 209
3 0 209 214 215
3 0 197 209 215
3 0 197 215 216
3 0 197 216 198
3 0 198 216 199
3 0 210 217 211
3 0 211 217 218
3 0 211 218 212
3 0 212 218 219
3 0 212 219 213
3 0 213 219 220
3 0 213 220 214
3 0 214 220 221
3 0 214 221 215
3 0 217 222 218
3 0 218 222 223
3 0 218 223 224
3 0 218 224 219
3 0 219 224 225
3 0 219 225 226
3 0 219 226 220
3 0 222 227 223
3 0 223 227 228
3 0 223 228 224
3 0 224 228 229
3 0 224 229 225
3 0 225 229 230
3 0 225 230 226
3 0 226 230 231
3 0 226 231 232
3 0 220 226 232
3 0 220 232 221
3 0 221 232 233
3 0 221 233 234
3 0 215 221 234
3 0 215 234 216
3 0 216 234 235
3 0 216 235 236
3 0 199 216 236
3 0 227 237 228
3 0 228 237 238
3 0 228 238 229
3 0 229 238 239
3 0 229 239 230
3 0 230 239 240
3 0 230 240 231
3 0 231 240 241
3 0 231 241 232
3 0 237 242 243
3 0 237 243 238
3 0 238 243 244
3 0 238 244 239
3 0 239 244 245
3 0 239 245 240
3 0 240 245 246
3 0 240 246 241
3 0 241 246 247
3 0 241 247 248
3 0 232 241 248
3 0 232 248 233
3 0 233 248 249
3 0 233 249 234
3 0 242 250 251
3 0 242 251 243
3 0 243 251 252
3 0 243 252 244
3 0 244 252 253
3 0 244 253 245
3 0 245 253 254
3 0 245 254 246
3 0 246 254 255
3 0 246 255 247
3 0 247 255 256
3 0 247 256 248
3 0 250 257 258
3 0 250 258 251
3 0 251 258 252
3 0 252 258 259
3 0 252 259 253
3 0 253 259 254
3 0 254 259 260
3 0 254 260 255
3 0 255 260 256
3 0 256 260 261
3 0 248 256 261
3 0 248 261 249
3 0 249 261 262
3 0 249 262 263
3 0 234 249 263
3 0 234 263 235
3 0 235 263 264
3 0 235 264 236
3 0 257 265 266
3 0 257 266 258
3 0 258 266 267
3 0 258 267 259
3 0 259 267 268
3 0 259 268 260
3 0 260 268 269
3 0 260 269 261
3 0 261 269 270
3 0 261 270 262
3 0 262 270 271
3 0 262 271 263
3 0 265 272 273
3 0 265 273 266
3 0 266 273 274
3 0 266 274 267
3 0 267 274 275
3 0 267 275 268
3 0 268 275 276
3 0 268 276 269
3 0 269 276 277
3 0 269 277 270
3 0 270 277 271
3 0 271 277 278
3 0 263 271 278
3 0 263 278 264
3 0 264 278 279
3 0 236 264 279
3 0 272 280 281
3 0 272 281 273
3 0 273 281 282
3 0 273 282 274
3 0 274 282 283
3 0 274 283 275
3 0 275 283 284
3 0 275 284 276
3 0 280 285 286
3 0 280 286 281
3 0 281 286 287
3 0 281 287 282
3 0 282 287 288
3 0 282 288 283
3 0 283 288 289
3 0 283 289 284
3 0 284 289 290
3 0 276 284 290
3 0 276 290 277
3 0 277 290 291
3 0 277 291 278
3 0 285 292 293
3 0 285 293 286
3 0 286 293 294
3 0 286 294 287
3 0 287 294 295
3 0 287 295 288
3 0 288 295 296
3 0 288 296 289
3 0 292 297 298
3 0 292 298 293
3 0 293 298 299
3 0 293 299 294
3 0 294 299 300
3 0 294 300 295
3 0 295 300 301
3 0 295 301 296
3 0 296 301 302
3 0 289 296 302
3 0 289 302 290
3 0 290 302 303
3 0 290 303 291
3 0 291 303 304
3 0 278 291 304
3 0 278 304 279
3 0 279 304 305
3 0 297 306 298
3 0 298 306 307
3 0 298 307 299
3 0 299 307 308
3 0 299 308 300
3 0 300 308 309
3 0 300 309 301
3 0 306 310 307
3 0 307 310 311
3 0 307 311 308
3 0 308 311 309
3 0 309 311 312
3 0 301 309 312
3 0 301 312 302
3 0 302 312 313
3 0 302 313 303
3 0 310 314 311
3 0 311 314 315
3 0 311 315 312
3 0 312 315 313
3 0 313 315 316
3 0 303 313 316
3 0 303 316 304
3 0 304 316 317
3 0 304 317 305
3 0 305 317 318
3 0 314 319 315
3 0 315 319 320
3 0 315 320 316
3 0 316 320 321
3 0 316 321 317
3 0 317 321 322
3 0 317 322 318
3 0 318 322 323
3 0 319 324 320
3 0 320 324 325
3 0 320 325 321
3 0 321 325 326
3 0 321 326 322
3 0 322 326 327
3 0 322 327 323
3 0 323 327 328
3 0 324 329 325
3 0 325 329 330
3 0 325 330 326
3 0 326 330 331
3 0 326 331 327
3 0 327 331 332
3 0 327 332 328
3 0 328 332 333
3 0 329 334 330
3 0 330 334 335
3 0 330 335 331
3 0 331 335 336
3 0 331 336 332
3 0 332 336 337
3 0 332 337 333
3 0 333 337 338
3 0 334 339 335
3 0 335 339 340
3 0 335 340 336
3 0 336 340 341
3 0 336 341 337
3 0 337 341 342
3 0 337 342 338
3 0 338 342 343
3 0 339 344 340
3 0 340 344 345
3 0 340 345 341
3 0 341 345 346
3 0 341 346 342
3 0 342 346 347
3 0 342 347 343
3 0 343 347 348
3 0 344 349 345
3 0 345 349 350
3 0 345 350 346
3 0 346 350 351
3 0 346 351 347
3 0 347 351 352
3 0 347 352 348
3 0 348 352 353
FACES:
2 1 353 348
2 1 348 343
2 1 343 338
2 1 338 333
2 1 333 328
2 1 328 323
2 1 323 318
2 1 318 305
2 1 305 279
2 1 279 236
2 1 236 199
2 1 199 154
2 1 154 138
2 1 138 128
2 1 128 98
2 1 98 53
2 1 53 39
2 1 39 34
2 1 34 29
2 1 29 24
2 1 24 19
2 1 19 14
2 1 14 9
2 1 9 4
2 1 4 3
2 1 3 2
2 1 2 1
2 1 1 0
2 1 0 5
2 1 5 10
2 1 10 15
2 1 15 20
2 1 20 25
2 1 25 30
2 1 30 35
2 1 35 40
2 1 40 44
2 1 44 46
2 10 46 54
2 10 54 61
2 10 61 69
2 10 69 76
2 10 76 84
2 10 84 89
2 10 89 99
2 10 99 103
2 10 103 109
2 10 109 113
2 10 113 119
2 10 119 123
2 10 123 129
2 10 129 133
2 10 133 139
2 10 139 143
2 10 143 147
2 10 147 155
2 10 155 162
2 10 162 170
2 10 170 177
2 10 177 185
2 10 185 190
2 10 190 200
2 10 200 205
2 10 205 210
2 10 210 217
2 10 217 222
2 10 222 227
2 10 227 237
2 10 237 242
2 10 242 250
2 10 250 257
2 10 257 265
2 10 265 272
2 10 272 280
2 10 280 285
2 10 285 292
2 10 292 297
2 1 297 306
2 1 306 310
2 1 310 314
2 1 314 319
2 1 319 324
2 1 324 329
2 1 329 334
2 1 334 339
2 1 339 344
2 1 344 349
2 1 349 350
2 1 350 351
2 1 351 352
2 1 352 353
