POINTS:
0.0 0.0
0.0 0.125
0.0 0.25
0.0 0.375
0.0 0.5
0.0 0.625
0.0 0.75
0.0 0.875
0.0 1.0
0.125 0.0
0.125 0.125
0.125 0.25
0.125 0.375
0.125 0.5
0.125 0.625
0.125 0.75
0.125 0.875
0.125 1.0
0.25 0.0
0.25 0.125
0.25 0.25
0.25 0.375
0.25 0.5
0.25 0.625
0.25 0.75
0.25 0.875
0.25 1.0
0.375 0.0
0.375 0.125
0.375 0.25
0.375 0.375
0.375 0.5
0.375 0.625
0.375 0.75
0.375 0.875
0.375 1.0
0.5 0.0
0.5 0.125
0.5 0.25
0.5 0.375
0.5 0.5
0.5 0.625
0.5 0.75
0.5 0.875
0.5 1.0
0.625 0.0
0.625 0.125
0.625 0.25
0.625 0.375
0.625 0.5
0.625 0.625
0.625 0.75
0.625 0.875
0.625 1.0
0.75 0.0
0.75 0.125
0.75 0.25
0.75 0.375
0.75 0.5
0.75 0.625
0.75 0.75
0.75 0.875
0.75 1.0
0.875 0.0
0.875 0.125
0.875 0.25
0.875 0.375
0.875 0.5
0.875 0.625
0.875 0.75
0.875 0.875
0.875 1.0
1.0 0.0
1.0 0.125
1.0 0.25
1.0 0.375
1.0 0.5
1.0 0.625
1.0 0.75
1.0 0.875
1.0 1.0
1.125 0.0
1.125 0.125
1.125 0.25
1.125 0.375
1.125 0.5
1.125 0.625
1.125 0.75
1.125 0.875
1.125 1.0
1.25 0.0
1.25 0.125
1.25 0.25
1.25 0.375
1.25 0.5
1.25 0.625
1.25 0.75
1.25 0.875
1.25 1.0
1.375 0.0
1.375 0.125
1.375 0.25
1.375 0.375
1.375 0.5
1.375 0.625
1.375 0.75
1.375 0.875
1.375 1.0
1.5 0.0
1.5 0.125
1.5 0.25
1.5 0.375
1.5 0.5
1.5 0.625
1.5 0.75
1.5 0.875
1.5 1.0
1.625 0.0
1.625 0.125
1.625 0.25
1.625 0.375
1.625 0.5
1.625 0.625
1.625 0.75
1.625 0.875
1.625 1.0
1.75 0.0
1.75 0.125
1.75 0.25
1.75 0.375
1.75 0.5
1.75 0.625
1.75 0.75
1.75 0.875
1.75 1.0
1.875 0.0
1.875 0.125
1.875 0.25
1.875 0.375
1.875 0.5
1.875 0.625
1.875 0.75
1.875 0.875
1.875 1.0
2.0 0.0
2.0 0.125
2.0 0.25
2.0 0.375
2.0 0.5
2.0 0.625
2.0 0.75
2.0 0.875
2.0 1.0
2.125 0.0
2.125 0.125
2.125 0.25
2.125 0.375
2.125 0.5
2.125 0.625
2.125 0.75
2.125 0.875
2.125 1.0
2.25 0.0
2.25 0.125
2.25 0.25
2.25 0.375
2.25 0.5
2.25 0.625
2.25 0.75
2.25 0.875
2.25 1.0
2.375 0.0
2.375 0.125
2.375 0.25
2.375 0.375
2.375 0.5
2.375 0.625
2.375 0.75
2.375 0.875
2.375 1.0
2.5 0.0
2.5 0.125
2.5 0.25
2.5 0.375
2.5 0.5
2.5 0.625
2.5 0.75
2.5 0.875
2.5 1.0
2.625 0.0
2.625 0.125
2.625 0.25
2.625 0.375
2.625 0.5
2.625 0.625
2.625 0.75
2.625 0.875
2.625 1.0
2.75 0.0
2.75 0.125
2.75 0.25
2.75 0.375
2.75 0.5
2.75 0.625
2.75 0.75
2.75 0.875
2.75 1.0
2.875 0.0
2.875 0.125
2.875 0.25
2.875 0.375
2.875 0.5
2.875 0.625
2.875 0.75
2.875 0.875
2.875 1.0
3.0 0.0
3.0 0.125
3.0 0.25
3.0 0.375
3.0 0.5
3.0 0.625
3.0 0.75
3.0 0.875
3.0 1.0
3.125 0.0
3.125 0.125
3.125 0.25
3.125 0.375
3.125 0.5
3.125 0.625
3.125 0.75
3.125 0.875
3.125 1.0
3.25 0.0
3.25 0.125
3.25 0.25
3.25 0.375
3.25 0.5
3.25 0.625
3.25 0.75
3.25 0.875
3.25 1.0
3.375 0.0
3.375 0.125
3.375 0.25
3.375 0.375
3.375 0.5
3.375 0.625
3.375 0.75
3.375 0.875
3.375 1.0
3.5 0.0
3.5 0.125
3.5 0.25
3.5 0.375
3.5 0.5
3.5 0.625
3.5 0.75
3.5 0.875
3.5 1.0
3.625 0.0
3.625 0.125
3.625 0.25
3.625 0.375
3.625 0.5
3.625 0.625
3.625 0.75
3.625 0.875
3.625 1.0
3.75 0.0
3.75 0.125
3.75 0.25
3.75 0.375
3.75 0.5
3.75 0.625
3.75 0.75
3.75 0.875
3.75 1.0
3.875 0.0
3.875 0.125
3.875 0.25
3.875 0.375
3.875 0.5
3.875 0.625
3.875 0.75
3.875 0.875
3.875 1.0
4.0 0.0
4.0 0.125
4.0 0.25
4.0 0.375
4.0 0.5
4.0 0.625
4.0 0.75
4.0 0.875
4.0 1.0
4.125 0.0
4.125 0.125
4.125 0.25
4.125 0.375
4.125 0.5
4.125 0.625
4.125 0.75
4.125 0.875
4.125 1.0
4.25 0.0
4.25 0.125
4.25 0.25
4.25 0.375
4.25 0.5
4.25 0.625
4.25 0.75
4.25 0.875
4.25 1.0
4.375 0.0
4.375 0.125
4.375 0.25
4.375 0.375
4.375 0.5
4.375 0.625
4.375 0.75
4.375 0.875
4.375 1.0
4.5 0.0
4.5 0.125
4.5 0.25
4.5 0.375
4.5 0.5
4.5 0.625
4.5 0.75
4.5 0.875
4.5 1.0
4.625 0.0
4.625 0.125
4.625 0.25
4.625 0.375
4.625 0.5
4.625 0.625
4.625 0.75
4.625 0.875
4.625 1.0
4.75 0.0
4.75 0.125
4.75 0.25
4.75 0.375
4.75 0.5
4.75 0.625
4.75 0.75
4.75 0.875
4.75 1.0
4.875 0.0
4.875 0.125
4.875 0.25
4.875 0.375
4.875 0.5
4.875 0.625
4.875 0.75
4.875 0.875
4.875 1.0
5.0 0.0
5.0 0.125
5.0 0.25
5.0 0.375
5.0 0.5
5.0 0.625
5.0 0.75
5.0 0.875
5.0 1.0
5.125 0.0
5.125 0.125
5.125 0.25
5.125 0.375
5.125 0.5
5.125 0.625
5.125 0.75
5.125 0.875
5.125 1.0
5.25 0.0
5.25 0.25
5.25 0.5
5.25 0.75
5.25 1.0
5.5 0.0
5.5 0.5
5.5 1.0
6.0 0.0
6.0 0.5
6.0 1.0
6.5 0.0
6.5 0.5
6.5 1.0
7.0 0.0
7.0 0.5
7.0 1.0
7.5 0.0
7.5 0.5
7.5 1.0
8.0 0.0
8.0 0.5
8.0 1.0
8.5 0.0
8.5 0.5
8.5 1.0
9.0 0.0
9.0 0.5
9.0 1.0
9.5 0.0
9.5 0.5
9.5 1.0
10.0 0.0
10.0 0.5
10.0 1.0
CELLS:
3 1 0 9 1
3 1 1 9 10
3 1 1 10 2
3 1 2 10 11
3 1 2 11 3
3 1 3 11 12
3 1 3 12 4
3 1 4 12 13
3 1 4 13 5
3 1 5 13 14
3 1 5 14 6
3 1 6 14 15
3 1 6 15 7
3 1 7 15 16
3 1 7 16 8
3 1 8 16 17
3 1 9 18 10
3 1 10 18 19
3 1 10 19 11
3 1 11 19 20
3 1 11 20 12
3 1 12 20 21
3 1 12 21 13
3 1 13 21 22
3 1 13 22 14
3 1 14 22 23
3 1 14 23 15
3 1 15 23 24
3 1 15 24 16
3 1 16 24 25
3 1 16 25 17
3 1 17 25 26
3 1 18 27 19
3 1 19 27 28
3 1 19 28 20
3 1 20 28 29
3 1 20 29 21
3 1 21 29 30
3 1 21 30 22
3 1 22 30 31
3 1 22 31 23
3 1 23 31 32
3 1 23 32 24
3 1 24 32 33
3 1 24 33 25
3 1 25 33 34
3 1 25 34 26
3 1 26 34 35
3 1 27 36 28
3 1 28 36 37
3 1 28 37 29
3 1 29 37 38
3 1 29 38 30
3 1 30 38 39
3 1 30 39 31
3 1 31 39 40
3 1 31 40 32
3 1 32 40 41
3 1 32 41 33
3 1 33 41 42
3 1 33 42 34
3 1 34 42 43
3 1 34 43 35
3 1 35 43 44
3 1 36 45 37
3 1 37 45 46
3 1 37 46 38
3 1 38 46 47
3 1 38 47 39
3 1 39 47 48
3 1 39 48 40
3 1 40 48 49
3 1 40 49 41
3 1 41 49 50
3 1 41 50 42
3 1 42 50 51
3 1 42 51 43
3 1 43 51 52
3 1 43 52 44
3 1 44 52 53
3 1 45 54 46
3 1 46 54 55
3 1 46 55 47
3 1 47 55 56
3 1 47 56 48
3 1 48 56 57
3 1 48 57 49
3 1 49 57 58
3 1 49 58 50
3 1 50 58 59
3 1 50 59 51
3 1 51 59 60
3 1 51 60 52
3 1 52 60 61
3 1 52 61 53
3 1 53 61 62
3 1 54 63 55
3 1 55 63 64
3 1 55 64 56
3 1 56 64 65
3 1 56 65 57
3 1 57 65 66
3 1 57 66 58
3 1 58 66 67
3 1 58 67 59
3 1 59 67 68
3 1 59 68 60
3 1 60 68 69
3 1 60 69 61
3 1 61 69 70
3 1 61 70 62
3 1 62 70 71
3 1 63 72 64
3 1 64 72 73
3 1 64 73 65
3 1 65 73 74
3 1 65 74 66
3 1 66 74 75
3 1 66 75 67
3 1 67 75 76
3 1 67 76 68
3 1 68 76 77
3 1 68 77 69
3 1 69 77 78
3 1 69 78 70
3 1 70 78 79
3 1 70 79 71
3 1 71 79 80
3 1 72 81 73
3 1 73 81 82
3 1 73 82 74
3 1 74 82 83
3 1 74 83 75
3 1 75 83 84
3 1 75 84 76
3 1 76 84 85
3 1 76 85 77
3 1 77 85 86
3 1 77 86 78
3 1 78 86 87
3 1 78 87 79
3 1 79 87 88
3 1 79 88 80
3 1 80 88 89
3 1 81 90 82
3 1 82 90 91
3 1 82 91 83
3 1 83 91 92
3 1 83 92 84
3 1 84 92 93
3 1 84 93 85
3 1 85 93 94
3 1 85 94 86
3 1 86 94 95
3 1 86 95 87
3 1 87 95 96
3 1 87 96 88
3 1 88 96 97
3 1 88 97 89
3 1 89 97 98
3 1 90 99 91
3 1 91 99 100
3 1 91 100 92
3 1 92 100 101
3 1 92 101 93
3 1 93 101 102
3 1 93 102 94
3 1 94 102 103
3 1 94 103 95
3 1 95 103 104
3 1 95 104 96
3 1 96 104 105
3 1 96 105 97
3 1 97 105 106
3 1 97 106 98
3 1 98 106 107
3 1 99 108 100
3 1 100 108 109
3 1 100 109 101
3 1 101 109 110
3 1 101 110 102
3 1 102 110 111
3 1 102 111 103
3 1 103 111 112
3 1 103 112 104
3 1 104 112 113
3 1 104 113 105
3 1 105 113 114
3 1 105 114 106
3 1 106 114 115
3 1 106 115 107
3 1 107 115 116
3 1 108 117 109
3 1 109 117 118
3 1 109 118 110
3 1 110 118 119
3 1 110 119 111
3 1 111 119 120
3 1 111 120 112
3 1 112 120 121
3 1 112 121 113
3 1 113 121 122
3 1 113 122 114
3 1 114 122 123
3 1 114 123 115
3 1 115 123 124
3 1 115 124 116
3 1 116 124 125
3 1 117 126 118
3 1 118 126 127
3 1 118 127 119
3 1 119 127 128
3 1 119 128 120
3 1 120 128 129
3 1 120 129 121
3 1 121 129 130
3 1 121 130 122
3 1 122 130 131
3 1 122 131 123
3 1 123 131 132
3 1 123 132 124
3 1 124 132 133
3 1 124 133 125
3 1 125 133 134
3 1 126 135 127
3 1 127 135 136
3 1 127 136 128
3 1 128 136 137
3 1 128 137 129
3 1 129 137 138
3 1 129 138 130
3 1 130 138 139
3 1 130 139 131
3 1 131 139 140
3 1 131 140 132
3 1 132 140 141
3 1 132 141 133
3 1 133 141 142
3 1 133 142 134
3 1 134 142 143
3 1 135 144 136
3 1 136 144 145
3 1 136 145 137
3 1 137 145 146
3 1 137 146 138
3 1 138 146 147
3 1 138 147 139
3 1 139 147 148
3 1 139 148 140
3 1 140 148 149
3 1 140 149 141
3 1 141 149 150
3 1 141 150 142
3 1 142 150 151
3 1 142 151 143
3 1 143 151 152
3 1 144 153 145
3 1 145 153 154
3 1 145 154 146
3 1 146 154 155
3 1 146 155 147
3 1 147 155 156
3 1 147 156 148
3 1 148 156 157
3 1 148 157 149
3 1 149 157 158
3 1 149 158 150
3 1 150 158 159
3 1 150 159 151
3 1 151 159 160
3 1 151 160 152
3 1 152 160 161
3 1 153 162 154
3 1 154 162 163
3 1 154 163 155
3 1 155 163 164
3 1 155 164 156
3 1 156 164 165
3 1 156 165 157
3 1 157 165 166
3 1 157 166 158
3 1 158 166 167
3 1 158 167 159
3 1 159 167 168
3 1 159 168 160
3 1 160 168 169
3 1 160 169 161
3 1 161 169 170
3 1 162 171 163
3 1 163 171 172
3 1 163 172 164
3 1 164 172 173
3 1 164 173 165
3 1 165 173 174
3 1 165 174 166
3 1 166 174 175
3 1 166 175 167
3 1 167 175 176
3 1 167 176 168
3 1 168 176 177
3 1 168 177 169
3 1 169 177 178
3 1 169 178 170
3 1 170 178 179
3 1 171 180 172
3 1 172 180 181
3 1 172 181 173
3 1 173 181 182
3 1 173 182 174
3 1 174 182 183
3 1 174 183 175
3 1 175 183 184
3 1 175 184 176
3 1 176 184 185
3 1 176 185 177
3 1 177 185 186
3 1 177 186 178
3 1 178 186 187
3 1 178 187 179
3 1 179 187 188
3 1 180 189 181
3 1 181 189 190
3 1 181 190 182
3 1 182 190 191
3 1 182 191 183
3 1 183 191 192
3 1 183 192 184
3 1 184 192 193
3 1 184 193 185
3 1 185 193 194
3 1 185 194 186
3 1 186 194 195
3 1 186 195 187
3 1 187 195 196
3 1 187 196 188
3 1 188 196 197
3 1 189 198 190
3 1 190 198 199
3 1 190 199 191
3 1 191 199 200
3 1 191 200 192
3 1 192 200 201
3 1 192 201 193
3 1 193 201 202
3 1 193 202 194
3 1 194 202 203
3 1 194 203 195
3 1 195 203 204
3 1 195 204 196
3 1 196 204 205
3 1 196 205 197
3 1 197 205 206
3 1 198 207 199
3 1 199 207 208
3 1 199 208 200
3 1 200 208 209
3 1 200 209 201
3 1 201 209 210
3 1 201 210 202
3 1 202 210 211
3 1 202 211 203
3 1 203 211 212
3 1 203 212 204
3 1 204 212 213
3 1 204 213 205
3 1 205 213 214
3 1 205 214 206
3 1 206 214 215
3 1 207 216 208
3 1 208 216 217
3 1 208 217 209
3 1 209 217 218
3 1 209 218 210
3 1 210 218 219
3 1 210 219 211
3 1 211 219 220
3 1 211 220 212
3 1 212 220 221
3 1 212 221 213
3 1 213 221 222
3 1 213 222 214
3 1 214 222 223
3 1 214 223 215
3 1 215 223 224
3 1 216 225 217
3 1 217 225 226
3 1 217 226 218
3 1 218 226 227
3 1 218 227 219
3 1 219 227 228
3 1 219 228 220
3 1 220 228 229
3 1 220 229 221
3 1 221 229 230
3 1 221 230 222
3 1 222 230 231
3 1 222 231 223
3 1 223 231 232
3 1 223 232 224
3 1 224 232 233
3 1 225 234 226
3 1 226 234 235
3 1 226 235 227
3 1 227 235 236
3 1 227 236 228
3 1 228 236 237
3 1 228 237 229
3 1 229 237 238
3 1 229 238 230
3 1 230 238 239
3 1 230 239 231
3 1 231 239 240
3 1 231 240 232
3 1 232 240 241
3 1 232 241 233
3 1 233 241 242
3 1 234 243 235
3 1 235 243 244
3 1 235 244 236
3 1 236 244 245
3 1 236 245 237
3 1 237 245 246
3 1 237 246 238
3 1 238 246 247
3 1 238 247 239
3 1 239 247 248
3 1 239 248 240
3 1 240 248 249
3 1 240 249 241
3 1 241 249 250
3 1 241 250 242
3 1 242 250 251
3 1 243 252 244
3 1 244 252 253
3 1 244 253 245
3 1 245 253 254
3 1 245 254 246
3 1 246 254 255
3 1 246 255 247
3 1 247 255 256
3 1 247 256 248
3 1 248 256 257
3 1 248 257 249
3 1 249 257 258
3 1 249 258 250
3 1 250 258 259
3 1 250 259 251
3 1 251 259 260
3 1 252 261 253
3 1 253 261 262
3 1 253 262 254
3 1 254 262 263
3 1 254 263 255
3 1 255 263 264
3 1 255 264 256
3 1 256 264 265
3 1 256 265 257
3 1 257 265 266
3 1 257 266 258
3 1 258 266 267
3 1 258 267 259
3 1 259 267 268
3 1 259 268 260
3 1 260 268 269
3 1 261 270 262
3 1 262 270 271
3 1 262 271 263
3 1 263 271 272
3 1 263 272 264
3 1 264 272 273
3 1 264 273 265
3 1 265 273 274
3 1 265 274 266
3 1 266 274 275
3 1 266 275 267
3 1 267 275 276
3 1 267 276 268
3 1 268 276 277
3 1 268 277 269
3 1 269 277 278
3 1 270 279 271
3 1 271 279 280
3 1 271 280 272
3 1 272 280 281
3 1 272 281 273
3 1 273 281 282
3 1 273 282 274
3 1 274 282 283
3 1 274 283 275
3 1 275 283 284
3 1 275 284 276
3 1 276 284 285
3 1 276 285 277
3 1 277 285 286
3 1 277 286 278
3 1 278 286 287
3 1 279 288 280
3 1 280 288 289
3 1 280 289 281
3 1 281 289 290
3 1 281 290 282
3 1 282 290 291
3 1 282 291 283
3 1 283 291 292
3 1 283 292 284
3 1 284 292 293
3 1 284 293 285
3 1 285 293 294
3 1 285 294 286
3 1 286 294 295
3 1 286 295 287
3 1 287 295 296
3 1 288 297 289
3 1 289 297 298
3 1 289 298 290
3 1 290 298 299
3 1 290 299 291
3 1 291 299 300
3 1 291 300 292
3 1 292 300 301
3 1 292 301 293
3 1 293 301 302
3 1 293 302 294
3 1 294 302 303
3 1 294 303 295
3 1 295 303 304
3 1 295 304 296
3 1 296 304 305
3 1 297 306 298
3 1 298 306 307
3 1 298 307 299
3 1 299 307 308
3 1 299 308 300
3 1 300 308 309
3 1 300 309 301
3 1 301 309 310
3 1 301 310 302
3 1 302 310 311
3 1 302 311 303
3 1 303 311 312
3 1 303 312 304
3 1 304 312 313
3 1 304 313 305
3 1 305 313 314
3 1 306 315 307
3 1 307 315 316
3 1 307 316 308
3 1 308 316 317
3 1 308 317 309
3 1 309 317 318
3 1 309 318 310
3 1 310 318 319
3 1 310 319 311
3 1 311 319 320
3 1 311 320 312
3 1 312 320 321
3 1 312 321 313
3 1 313 321 322
3 1 313 322 314
3 1 314 322 323
3 1 315 324 316
3 1 316 324 325
3 1 316 325 317
3 1 317 325 326
3 1 317 326 318
3 1 318 326 327
3 1 318 327 319
3 1 319 327 328
3 1 319 328 320
3 1 320 328 329
3 1 320 329 321
3 1 321 329 330
3 1 321 330 322
3 1 322 330 331
3 1 322 331 323
3 1 323 331 332
3 1 324 333 325
3 1 325 333 334
3 1 325 334 326
3 1 326 334 335
3 1 326 335 327
3 1 327 335 336
3 1 327 336 328
3 1 328 336 337
3 1 328 337 329
3 1 329 337 338
3 1 329 338 330
3 1 330 338 339
3 1 330 339 331
3 1 331 339 340
3 1 331 340 332
3 1 332 340 341
3 1 333 342 334
3 1 334 342 343
3 1 334 343 335
3 1 335 343 344
3 1 335 344 336
3 1 336 344 345
3 1 336 345 337
3 1 337 345 346
3 1 337 346 338
3 1 338 346 347
3 1 338 347 339
3 1 339 347 348
3 1 339 348 340
3 1 340 348 349
3 1 340 349 341
3 1 341 349 350
3 1 342 351 343
3 1 343 351 352
3 1 343 352 344
3 1 344 352 353
3 1 344 353 345
3 1 345 353 354
3 1 345 354 346
3 1 346 354 355
3 1 346 355 347
3 1 347 355 356
3 1 347 356 348
3 1 348 356 357
3 1 348 357 349
3 1 349 357 358
3 1 349 358 350
3 1 350 358 359
3 1 351 360 352
3 1 352 360 361
3 1 352 361 353
3 1 353 361 362
3 1 353 362 354
3 1 354 362 363
3 1 354 363 355
3 1 355 363 364
3 1 355 364 356
3 1 356 364 365
3 1 356 365 357
3 1 357 365 366
3 1 357 366 358
3 1 358 366 367
3 1 358 367 359
3 1 359 367 368
3 1 360 369 361
3 1 361 369 370
3 1 361 370 362
3 1 362 370 371
3 1 362 371 363
3 1 363 371 372
3 1 363 372 364
3 1 364 372 373
3 1 364 373 365
3 1 365 373 374
3 1 365 374 366
3 1 366 374 375
3 1 366 375 367
3 1 367 375 376
3 1 367 376 368
3 1 368 376 377
3 1 369 378 370
3 1 370 378 379
3 1 370 379 371
3 1 371 379 372
3 1 372 379 380
3 1 372 380 373
3 1 373 380 374
3 1 374 380 381
3 1 374 381 375
3 1 375 381 376
3 1 376 381 382
3 1 376 382 377
3 1 378 383 379
3 1 379 383 384
3 1 379 384 380
3 1 380 384 381
3 1 381 384 385
3 1 381 385 382
3 1 383 386 384
3 1 384 386 387
3 1 384 387 385
3 1 385 387 388
3 1 386 389 387
3 1 387 389 390
3 1 387 390 388
3 1 388 390 391
3 1 389 392 390
3 1 390 392 393
3 1 390 393 391
3 1 391 393 394
3 1 392 395 393
3 1 393 395 396
3 1 393 396 394
3 1 394 396 397
3 1 395 398 396
3 1 396 398 399
3 1 396 399 397
3 1 397 399 400
3 1 398 401 399
3 1 399 401 402
3 1 399 402 400
3 1 400 402 403
3 1 401 404 402
3 1 402 404 405
3 1 402 405 403
3 1 403 405 406
3 1 404 407 405
3 1 405 407 408
3 1 405 408 406
3 1 406 408 409
3 1 407 410 408
3 1 408 410 411
3 1 408 411 409
3 1 409 411 412
FACES:
2 77 8 7
2 77 7 6
2 77 6 5
2 77 5 4
2 77 4 3
2 77 3 2
2 77 2 1
2 77 1 0
2 1 0 9
2 1 17 8
2 1 9 18
2 1 26 17
2 1 18 27
2 1 35 26
2 1 27 36
2 1 44 35
2 1 36 45
2 1 53 44
2 1 45 54
2 1 62 53
2 1 54 63
2 1 71 62
2 1 63 72
2 1 80 71
2 1 72 81
2 1 89 80
2 1 81 90
2 1 98 89
2 1 90 99
2 1 107 98
2 1 99 108
2 1 116 107
2 1 108 117
2 1 125 116
2 1 117 126
2 1 134 125
2 1 126 135
2 1 143 134
2 1 135 144
2 1 152 143
2 1 144 153
2 1 161 152
2 1 153 162
2 1 170 161
2 1 162 171
2 1 179 170
2 1 171 180
2 1 188 179
2 1 180 189
2 1 197 188
2 1 189 198
2 1 206 197
2 1 198 207
2 1 215 206
2 1 207 216
2 1 224 215
2 1 216 225
2 1 233 224
2 1 225 234
2 1 242 233
2 1 234 243
2 1 251 242
2 1 243 252
2 1 260 251
2 1 252 261
2 1 269 260
2 1 261 270
2 1 278 269
2 1 270 279
2 1 287 278
2 1 279 288
2 1 296 287
2 1 288 297
2 1 305 296
2 1 297 306
2 1 314 305
2 1 306 315
2 1 323 314
2 1 315 324
2 1 332 323
2 1 324 333
2 1 341 332
2 1 333 342
2 1 350 341
2 1 342 351
2 1 359 350
2 1 351 360
2 1 368 359
2 1 360 369
2 1 377 368
2 1 369 378
2 1 382 377
2 1 378 383
2 1 385 382
2 1 383 386
2 1 388 385
2 1 386 389
2 1 391 388
2 1 389 392
2 1 394 391
2 1 392 395
2 1 397 394
2 1 395 398
2 1 400 397
2 1 398 401
2 1 403 400
2 1 401 404
2 1 406 403
2 1 404 407
2 1 409 406
2 1 407 410
2 1 412 409
2 1 410 411
2 1 411 412