POINTS:
0.0 0.0625
0.0 0.09375
0.0 0.125
0.0 0.1875
0.0 0.25
0.0 0.375
0.0 0.5
0.0 0.75
0.0 1.0
0.03125 0.0625
0.03125 0.09375
0.0625 0.0
0.0625 0.03125
0.0625 0.0625
0.0625 0.09375
0.0625 0.125
0.09375 0.0
0.09375 0.03125
0.09375 0.0625
0.09375 0.09375
0.125 0.0
0.125 0.0625
0.125 0.125
0.125 0.1875
0.125 0.25
0.1875 0.0
0.1875 0.125
0.1875 0.1875
0.25 0.0
0.25 0.125
0.25 0.25
0.25 0.375
0.25 0.5
0.375 0.0
0.375 0.25
0.375 0.375
0.5 0.0
0.5 0.25
0.5 0.5
0.5 0.75
0.5 1.0
0.75 0.0
0.75 0.5
0.75 0.75
1.0 0.0
1.0 0.5
1.0 1.0
1.5 0.0
1.5 0.5
1.5 1.0
2.0 0.0
2.0 0.5
2.0 1.0
2.5 0.0
2.5 0.5
2.5 1.0
3.0 0.0
3.0 0.5
3.0 1.0
-0.03125 0.0625
-0.03125 0.09375
-0.0625 0.0
-0.0625 0.03125
-0.0625 0.0625
-0.0625 0.09375
-0.0625 0.125
-0.09375 0.0
-0.09375 0.03125
-0.09375 0.0625
-0.09375 0.09375
-0.125 0.0
-0.125 0.0625
-0.125 0.125
-0.125 0.1875
-0.125 0.25
-0.1875 0.0
-0.1875 0.125
-0.1875 0.1875
-0.25 0.0
-0.25 0.125
-0.25 0.25
-0.25 0.375
-0.25 0.5
-0.375 0.0
-0.375 0.25
-0.375 0.375
-0.5 0.0
-0.5 0.25
-0.5 0.5
-0.5 0.75
-0.5 1.0
-0.75 0.0
-0.75 0.5
-0.75 0.75
-1.0 0.0
-1.0 0.5
-1.0 1.0
-1.5 0.0
-1.5 0.5
-1.5 1.0
-2.0 0.0
-2.0 0.5
-2.0 1.0
-2.5 0.0
-2.5 0.5
-2.5 1.0
-3.0 0.0
-3.0 0.5
-3.0 1.0
CELLS:
3 0 0 9 10
3 0 0 10 1
3 0 1 10 2
3 0 2 10 15
3 0 10 14 15
3 0 10 13 14
3 0 9 13 10
3 0 2 15 3
3 0 3 15 23
3 0 15 22 23
3 0 11 16 17
3 0 11 17 12
3 0 12 17 13
3 0 13 17 18
3 0 13 18 19
3 0 13 19 14
3 0 14 19 15
3 0 15 19 22
3 0 16 20 17
3 0 17 20 21
3 0 17 21 18
3 0 18 21 19
3 0 19 21 22
3 0 3 23 4
3 0 4 23 24
3 0 4 24 5
3 0 5 24 31
3 0 20 25 21
3 0 21 25 26
3 0 21 26 22
3 0 22 26 27
3 0 22 27 23
3 0 23 27 24
3 0 24 27 30
3 0 25 28 26
3 0 26 28 29
3 0 26 29 27
3 0 27 29 30
3 0 24 30 31
3 0 5 31 6
3 0 6 31 32
3 0 6 32 7
3 0 7 32 39
3 0 28 33 29
3 0 29 33 34
3 0 29 34 30
3 0 30 34 35
3 0 30 35 31
3 0 31 35 32
3 0 32 35 38
3 0 33 36 34
3 0 34 36 37
3 0 34 37 35
3 0 35 37 38
3 0 32 38 39
3 0 7 39 8
3 0 8 39 40
3 0 36 41 37
3 0 37 41 42
3 0 37 42 38
3 0 38 42 43
3 0 38 43 39
3 0 39 43 40
3 0 40 43 46
3 0 41 44 42
3 0 42 44 45
3 0 42 45 43
3 0 43 45 46
3 0 44 47 45
3 0 45 47 48
3 0 45 48 49
3 0 45 49 46
3 0 47 50 48
3 0 48 50 51
3 0 48 51 52
3 0 48 52 49
3 0 50 53 51
3 0 51 53 54
3 0 51 54 55
3 0 51 55 52
3 0 53 56 54
3 0 54 56 57
3 0 54 57 58
3 0 54 58 55
3 0 59 0 60
3 0 60 0 1
3 0 60 1 2
3 0 60 2 65
3 0 64 60 65
3 0 63 60 64
3 0 63 59 60
3 0 65 2 3
3 0 65 3 73
3 0 72 65 73
3 0 66 61 67
3 0 67 61 62
3 0 67 62 63
3 0 67 63 68
3 0 68 63 69
3 0 69 63 64
3 0 69 64 65
3 0 69 65 72
3 0 70 66 67
3 0 70 67 71
3 0 71 67 68
3 0 71 68 69
3 0 71 69 72
3 0 73 3 4
3 0 73 4 74
3 0 74 4 5
3 0 74 5 81
3 0 75 70 71
3 0 75 71 76
3 0 76 71 72
3 0 76 72 77
3 0 77 72 73
3 0 77 73 74
3 0 77 74 80
3 0 78 75 76
3 0 78 76 79
3 0 79 76 77
3 0 79 77 80
3 0 80 74 81
3 0 81 5 6
3 0 81 6 82
3 0 82 6 7
3 0 82 7 89
3 0 83 78 79
3 0 83 79 84
3 0 84 79 80
3 0 84 80 85
3 0 85 80 81
3 0 85 81 82
3 0 85 82 88
3 0 86 83 84
3 0 86 84 87
3 0 87 84 85
3 0 87 85 88
3 0 88 82 89
3 0 89 7 8
3 0 89 8 90
3 0 91 86 87
3 0 91 87 92
3 0 92 87 88
3 0 92 88 93
3 0 93 88 89
3 0 93 89 90
3 0 93 90 96
3 0 94 91 92
3 0 94 92 95
3 0 95 92 93
3 0 95 93 96
3 0 97 94 95
3 0 97 95 98
3 0 98 95 99
3 0 99 95 96
3 0 100 97 98
3 0 100 98 101
3 0 101 98 102
3 0 102 98 99
3 0 103 100 101
3 0 103 101 104
3 0 104 101 105
3 0 105 101 102
3 0 106 103 104
3 0 106 104 107
3 0 107 104 108
3 0 108 104 105
FACES:
2 1 58 55
2 1 55 52
2 1 52 49
2 1 49 46
2 1 46 40
2 1 40 8
2 1 0 9
2 1 9 13
2 1 13 12
2 1 12 11
2 1 11 16
2 1 16 20
2 1 20 25
2 1 25 28
2 1 28 33
2 1 33 36
2 1 36 41
2 1 41 44
2 1 44 47
2 1 47 50
2 1 50 53
2 1 53 56
2 1 56 57
2 1 57 58
2 1 105 108
2 1 102 105
2 1 99 102
2 1 96 99
2 1 90 96
2 1 8 90
2 1 59 0
2 1 63 59
2 1 62 63
2 1 61 62
2 1 66 61
2 1 70 66
2 1 75 70
2 1 78 75
2 1 83 78
2 1 86 83
2 1 91 86
2 1 94 91
2 1 97 94
2 1 100 97
2 1 103 100
2 1 106 103
2 1 107 106
2 1 108 107