POINTS:
0.0 0.0
0.0 0.125
0.0 0.25
0.0 0.375
0.0 0.5
0.0 0.625
0.0 0.75
0.0 0.875
0.0 1.0
0.125 0.0
0.125 0.125
0.125 0.25
0.125 0.375
0.125 0.5
0.125 0.625
0.125 0.75
0.125 0.875
0.125 1.0
0.25 0.0
0.25 0.125
0.25 0.25
0.25 0.375
0.25 0.5
0.25 0.625
0.25 0.75
0.25 0.875
0.25 1.0
0.375 0.0
0.375 0.125
0.375 0.25
0.375 0.375
0.375 0.5
0.375 0.625
0.375 0.75
0.375 0.875
0.375 1.0
0.5 0.0
0.5 0.125
0.5 0.25
0.5 0.375
0.5 0.5
0.5 0.625
0.5 0.75
0.5 0.875
0.5 1.0
0.625 0.0
0.625 0.125
0.625 0.25
0.625 0.375
0.625 0.5
0.625 0.625
0.625 0.75
0.625 0.875
0.625 1.0
0.75 0.0
0.75 0.125
0.75 0.25
0.75 0.375
0.75 0.5
0.75 0.625
0.75 0.75
0.75 0.875
0.75 1.0
0.875 0.0
0.875 0.125
0.875 0.25
0.875 0.375
0.875 0.5
0.875 0.625
0.875 0.75
0.875 0.875
0.875 1.0
1.0 0.0
1.0 0.125
1.0 0.25
1.0 0.375
1.0 0.5
1.0 0.625
1.0 0.75
1.0 0.875
1.0 1.0
1.125 0.0
1.125 0.125
1.125 0.25
1.125 0.375
1.125 0.5
1.125 0.625
1.125 0.75
1.125 0.875
1.125 1.0
1.25 0.0
1.25 0.125
1.25 0.25
1.25 0.375
1.25 0.5
1.25 0.625
1.25 0.75
1.25 0.875
1.25 1.0
1.375 0.0
1.375 0.125
1.375 0.25
1.375 0.375
1.375 0.5
1.375 0.625
1.375 0.75
1.375 0.875
1.375 1.0
1.5 0.0
1.5 0.125
1.5 0.25
1.5 0.375
1.5 0.5
1.5 0.625
1.5 0.75
1.5 0.875
1.5 1.0
1.625 0.0
1.625 0.125
1.625 0.25
1.625 0.375
1.625 0.5
1.625 0.625
1.625 0.75
1.625 0.875
1.625 1.0
1.75 0.0
1.75 0.125
1.75 0.25
1.75 0.375
1.75 0.5
1.75 0.625
1.75 0.75
1.75 0.875
1.75 1.0
1.875 0.0
1.875 0.125
1.875 0.25
1.875 0.375
1.875 0.5
1.875 0.625
1.875 0.75
1.875 0.875
1.875 1.0
2.0 0.0
2.0 0.125
2.0 0.25
2.0 0.375
2.0 0.5
2.0 0.625
2.0 0.75
2.0 0.875
2.0 1.0
2.125 0.0
2.125 0.125
2.125 0.25
2.125 0.375
2.125 0.5
2.125 0.625
2.125 0.75
2.125 0.875
2.125 1.0
2.25 0.0
2.25 0.125
2.25 0.25
2.25 0.375
2.25 0.5
2.25 0.625
2.25 0.75
2.25 0.875
2.25 1.0
2.375 0.0
2.375 0.125
2.375 0.25
2.375 0.375
2.375 0.5
2.375 0.625
2.375 0.75
2.375 0.875
2.375 1.0
2.5 0.0
2.5 0.125
2.5 0.25
2.5 0.375
2.5 0.5
2.5 0.625
2.5 0.75
2.5 0.875
2.5 1.0
2.625 0.0
2.625 0.125
2.625 0.25
2.625 0.375
2.625 0.5
2.625 0.625
2.625 0.75
2.625 0.875
2.625 1.0
2.75 0.0
2.75 0.125
2.75 0.25
2.75 0.375
2.75 0.5
2.75 0.625
2.75 0.75
2.75 0.875
2.75 1.0
2.875 0.0
2.875 0.125
2.875 0.25
2.875 0.375
2.875 0.5
2.875 0.625
2.875 0.75
2.875 0.875
2.875 1.0
3.0 0.0
3.0 0.125
3.0 0.25
3.0 0.375
3.0 0.5
3.0 0.625
3.0 0.75
3.0 0.875
3.0 1.0
3.125 0.0
3.125 0.125
3.125 0.25
3.125 0.375
3.125 0.5
3.125 0.625
3.125 0.75
3.125 0.875
3.125 1.0
3.25 0.0
3.25 0.125
3.25 0.25
3.25 0.375
3.25 0.5
3.25 0.625
3.25 0.75
3.25 0.875
3.25 1.0
3.375 0.0
3.375 0.125
3.375 0.25
3.375 0.375
3.375 0.5
3.375 0.625
3.375 0.75
3.375 0.875
3.375 1.0
3.5 0.0
3.5 0.125
3.5 0.25
3.5 0.375
3.5 0.5
3.5 0.625
3.5 0.75
3.5 0.875
3.5 1.0
3.625 0.0
3.625 0.125
3.625 0.25
3.625 0.375
3.625 0.5
3.625 0.625
3.625 0.75
3.625 0.875
3.625 1.0
3.75 0.0
3.75 0.125
3.75 0.25
3.75 0.375
3.75 0.5
3.75 0.625
3.75 0.75
3.75 0.875
3.75 1.0
3.875 0.0
3.875 0.125
3.875 0.25
3.875 0.375
3.875 0.5
3.875 0.625
3.875 0.75
3.875 0.875
3.875 1.0
4.0 0.0
4.0 0.125
4.0 0.25
4.0 0.375
4.0 0.5
4.0 0.625
4.0 0.75
4.0 0.875
4.0 1.0
4.125 0.0
4.125 0.125
4.125 0.25
4.125 0.375
4.125 0.5
4.125 0.625
4.125 0.75
4.125 0.875
4.125 1.0
4.25 0.0
4.25 0.125
4.25 0.25
4.25 0.375
4.25 0.5
4.25 0.625
4.25 0.75
4.25 0.875
4.25 1.0
4.375 0.0
4.375 0.125
4.375 0.25
4.375 0.375
4.375 0.5
4.375 0.625
4.375 0.75
4.375 0.875
4.375 1.0
4.5 0.0
4.5 0.125
4.5 0.25
4.5 0.375
4.5 0.5
4.5 0.625
4.5 0.75
4.5 0.875
4.5 1.0
4.625 0.0
4.625 0.125
4.625 0.25
4.625 0.375
4.625 0.5
4.625 0.625
4.625 0.75
4.625 0.875
4.625 1.0
4.75 0.0
4.75 0.125
4.75 0.25
4.75 0.375
4.75 0.5
4.75 0.625
4.75 0.75
4.75 0.875
4.75 1.0
4.875 0.0
4.875 0.125
4.875 0.25
4.875 0.375
4.875 0.5
4.875 0.625
4.875 0.75
4.875 0.875
4.875 1.0
5.0 0.0
5.0 0.125
5.0 0.25
5.0 0.375
5.0 0.5
5.0 0.625
5.0 0.75
5.0 0.875
5.0 1.0
5.125 0.0
5.125 0.125
5.125 0.25
5.125 0.375
5.125 0.5
5.125 0.625
5.125 0.75
5.125 0.875
5.125 1.0
5.25 0.0
5.25 0.25
5.25 0.5
5.25 0.75
5.25 1.0
5.5 0.0
5.5 0.5
5.5 1.0
6.0 0.0
6.0 0.5
6.0 1.0
6.5 0.0
6.5 0.5
6.5 1.0
7.0 0.0
7.0 0.5
7.0 1.0
7.5 0.0
7.5 0.5
7.5 1.0
8.0 0.0
8.0 0.5
8.0 1.0
8.5 0.0
8.5 0.5
8.5 1.0
9.0 0.0
9.0 0.5
9.0 1.0
9.5 0.0
9.5 0.5
9.5 1.0
10.0 0.0
10.0 0.5
10.0 1.0
-0.125 0.0
-0.125 0.125
-0.125 0.25
-0.125 0.375
-0.125 0.5
-0.125 0.625
-0.125 0.75
-0.125 0.875
-0.125 1.0
-0.25 0.0
-0.25 0.125
-0.25 0.25
-0.25 0.375
-0.25 0.5
-0.25 0.625
-0.25 0.75
-0.25 0.875
-0.25 1.0
-0.375 0.0
-0.375 0.125
-0.375 0.25
-0.375 0.375
-0.375 0.5
-0.375 0.625
-0.375 0.75
-0.375 0.875
-0.375 1.0
-0.5 0.0
-0.5 0.125
-0.5 0.25
-0.5 0.375
-0.5 0.5
-0.5 0.625
-0.5 0.75
-0.5 0.875
-0.5 1.0
-0.625 0.0
-0.625 0.125
-0.625 0.25
-0.625 0.375
-0.625 0.5
-0.625 0.625
-0.625 0.75
-0.625 0.875
-0.625 1.0
-0.75 0.0
-0.75 0.125
-0.75 0.25
-0.75 0.375
-0.75 0.5
-0.75 0.625
-0.75 0.75
-0.75 0.875
-0.75 1.0
-0.875 0.0
-0.875 0.125
-0.875 0.25
-0.875 0.375
-0.875 0.5
-0.875 0.625
-0.875 0.75
-0.875 0.875
-0.875 1.0
-1.0 0.0
-1.0 0.125
-1.0 0.25
-1.0 0.375
-1.0 0.5
-1.0 0.625
-1.0 0.75
-1.0 0.875
-1.0 1.0
-1.125 0.0
-1.125 0.125
-1.125 0.25
-1.125 0.375
-1.125 0.5
-1.125 0.625
-1.125 0.75
-1.125 0.875
-1.125 1.0
-1.25 0.0
-1.25 0.125
-1.25 0.25
-1.25 0.375
-1.25 0.5
-1.25 0.625
-1.25 0.75
-1.25 0.875
-1.25 1.0
-1.375 0.0
-1.375 0.125
-1.375 0.25
-1.375 0.375
-1.375 0.5
-1.375 0.625
-1.375 0.75
-1.375 0.875
-1.375 1.0
-1.5 0.0
-1.5 0.125
-1.5 0.25
-1.5 0.375
-1.5 0.5
-1.5 0.625
-1.5 0.75
-1.5 0.875
-1.5 1.0
-1.625 0.0
-1.625 0.125
-1.625 0.25
-1.625 0.375
-1.625 0.5
-1.625 0.625
-1.625 0.75
-1.625 0.875
-1.625 1.0
-1.75 0.0
-1.75 0.125
-1.75 0.25
-1.75 0.375
-1.75 0.5
-1.75 0.625
-1.75 0.75
-1.75 0.875
-1.75 1.0
-1.875 0.0
-1.875 0.125
-1.875 0.25
-1.875 0.375
-1.875 0.5
-1.875 0.625
-1.875 0.75
-1.875 0.875
-1.875 1.0
-2.0 0.0
-2.0 0.125
-2.0 0.25
-2.0 0.375
-2.0 0.5
-2.0 0.625
-2.0 0.75
-2.0 0.875
-2.0 1.0
-2.125 0.0
-2.125 0.125
-2.125 0.25
-2.125 0.375
-2.125 0.5
-2.125 0.625
-2.125 0.75
-2.125 0.875
-2.125 1.0
-2.25 0.0
-2.25 0.125
-2.25 0.25
-2.25 0.375
-2.25 0.5
-2.25 0.625
-2.25 0.75
-2.25 0.875
-2.25 1.0
-2.375 0.0
-2.375 0.125
-2.375 0.25
-2.375 0.375
-2.375 0.5
-2.375 0.625
-2.375 0.75
-2.375 0.875
-2.375 1.0
-2.5 0.0
-2.5 0.125
-2.5 0.25
-2.5 0.375
-2.5 0.5
-2.5 0.625
-2.5 0.75
-2.5 0.875
-2.5 1.0
-2.625 0.0
-2.625 0.125
-2.625 0.25
-2.625 0.375
-2.625 0.5
-2.625 0.625
-2.625 0.75
-2.625 0.875
-2.625 1.0
-2.75 0.0
-2.75 0.125
-2.75 0.25
-2.75 0.375
-2.75 0.5
-2.75 0.625
-2.75 0.75
-2.75 0.875
-2.75 1.0
-2.875 0.0
-2.875 0.125
-2.875 0.25
-2.875 0.375
-2.875 0.5
-2.875 0.625
-2.875 0.75
-2.875 0.875
-2.875 1.0
-3.0 0.0
-3.0 0.125
-3.0 0.25
-3.0 0.375
-3.0 0.5
-3.0 0.625
-3.0 0.75
-3.0 0.875
-3.0 1.0
-3.125 0.0
-3.125 0.125
-3.125 0.25
-3.125 0.375
-3.125 0.5
-3.125 0.625
-3.125 0.75
-3.125 0.875
-3.125 1.0
-3.25 0.0
-3.25 0.125
-3.25 0.25
-3.25 0.375
-3.25 0.5
-3.25 0.625
-3.25 0.75
-3.25 0.875
-3.25 1.0
-3.375 0.0
-3.375 0.125
-3.375 0.25
-3.375 0.375
-3.375 0.5
-3.375 0.625
-3.375 0.75
-3.375 0.875
-3.375 1.0
-3.5 0.0
-3.5 0.125
-3.5 0.25
-3.5 0.375
-3.5 0.5
-3.5 0.625
-3.5 0.75
-3.5 0.875
-3.5 1.0
-3.625 0.0
-3.625 0.125
-3.625 0.25
-3.625 0.375
-3.625 0.5
-3.625 0.625
-3.625 0.75
-3.625 0.875
-3.625 1.0
-3.75 0.0
-3.75 0.125
-3.75 0.25
-3.75 0.375
-3.75 0.5
-3.75 0.625
-3.75 0.75
-3.75 0.875
-3.75 1.0
-3.875 0.0
-3.875 0.125
-3.875 0.25
-3.875 0.375
-3.875 0.5
-3.875 0.625
-3.875 0.75
-3.875 0.875
-3.875 1.0
-4.0 0.0
-4.0 0.125
-4.0 0.25
-4.0 0.375
-4.0 0.5
-4.0 0.625
-4.0 0.75
-4.0 0.875
-4.0 1.0
-4.125 0.0
-4.125 0.125
-4.125 0.25
-4.125 0.375
-4.125 0.5
-4.125 0.625
-4.125 0.75
-4.125 0.875
-4.125 1.0
-4.25 0.0
-4.25 0.125
-4.25 0.25
-4.25 0.375
-4.25 0.5
-4.25 0.625
-4.25 0.75
-4.25 0.875
-4.25 1.0
-4.375 0.0
-4.375 0.125
-4.375 0.25
-4.375 0.375
-4.375 0.5
-4.375 0.625
-4.375 0.75
-4.375 0.875
-4.375 1.0
-4.5 0.0
-4.5 0.125
-4.5 0.25
-4.5 0.375
-4.5 0.5
-4.5 0.625
-4.5 0.75
-4.5 0.875
-4.5 1.0
-4.625 0.0
-4.625 0.125
-4.625 0.25
-4.625 0.375
-4.625 0.5
-4.625 0.625
-4.625 0.75
-4.625 0.875
-4.625 1.0
-4.75 0.0
-4.75 0.125
-4.75 0.25
-4.75 0.375
-4.75 0.5
-4.75 0.625
-4.75 0.75
-4.75 0.875
-4.75 1.0
-4.875 0.0
-4.875 0.125
-4.875 0.25
-4.875 0.375
-4.875 0.5
-4.875 0.625
-4.875 0.75
-4.875 0.875
-4.875 1.0
-5.0 0.0
-5.0 0.125
-5.0 0.25
-5.0 0.375
-5.0 0.5
-5.0 0.625
-5.0 0.75
-5.0 0.875
-5.0 1.0
-5.125 0.0
-5.125 0.125
-5.125 0.25
-5.125 0.375
-5.125 0.5
-5.125 0.625
-5.125 0.75
-5.125 0.875
-5.125 1.0
-5.25 0.0
-5.25 0.25
-5.25 0.5
-5.25 0.75
-5.25 1.0
-5.5 0.0
-5.5 0.5
-5.5 1.0
-6.0 0.0
-6.0 0.5
-6.0 1.0
-6.5 0.0
-6.5 0.5
-6.5 1.0
-7.0 0.0
-7.0 0.5
-7.0 1.0
-7.5 0.0
-7.5 0.5
-7.5 1.0
-8.0 0.0
-8.0 0.5
-8.0 1.0
-8.5 0.0
-8.5 0.5
-8.5 1.0
-9.0 0.0
-9.0 0.5
-9.0 1.0
-9.5 0.0
-9.5 0.5
-9.5 1.0
-10.0 0.0
-10.0 0.5
-10.0 1.0
CELLS:
3 1 0 9 1
3 1 1 9 10
3 1 1 10 2
3 1 2 10 11
3 1 2 11 3
3 1 3 11 12
3 1 3 12 4
3 1 4 12 13
3 1 4 13 5
3 1 5 13 14
3 1 5 14 6
3 1 6 14 15
3 1 6 15 7
3 1 7 15 16
3 1 7 16 8
3 1 8 16 17
3 1 9 18 10
3 1 10 18 19
3 1 10 19 11
3 1 11 19 20
3 1 11 20 12
3 1 12 20 21
3 1 12 21 13
3 1 13 21 22
3 1 13 22 14
3 1 14 22 23
3 1 14 23 15
3 1 15 23 24
3 1 15 24 16
3 1 16 24 25
3 1 16 25 17
3 1 17 25 26
3 1 18 27 19
3 1 19 27 28
3 1 19 28 20
3 1 20 28 29
3 1 20 29 21
3 1 21 29 30
3 1 21 30 22
3 1 22 30 31
3 1 22 31 23
3 1 23 31 32
3 1 23 32 24
3 1 24 32 33
3 1 24 33 25
3 1 25 33 34
3 1 25 34 26
3 1 26 34 35
3 1 27 36 28
3 1 28 36 37
3 1 28 37 29
3 1 29 37 38
3 1 29 38 30
3 1 30 38 39
3 1 30 39 31
3 1 31 39 40
3 1 31 40 32
3 1 32 40 41
3 1 32 41 33
3 1 33 41 42
3 1 33 42 34
3 1 34 42 43
3 1 34 43 35
3 1 35 43 44
3 1 36 45 37
3 1 37 45 46
3 1 37 46 38
3 1 38 46 47
3 1 38 47 39
3 1 39 47 48
3 1 39 48 40
3 1 40 48 49
3 1 40 49 41
3 1 41 49 50
3 1 41 50 42
3 1 42 50 51
3 1 42 51 43
3 1 43 51 52
3 1 43 52 44
3 1 44 52 53
3 1 45 54 46
3 1 46 54 55
3 1 46 55 47
3 1 47 55 56
3 1 47 56 48
3 1 48 56 57
3 1 48 57 49
3 1 49 57 58
3 1 49 58 50
3 1 50 58 59
3 1 50 59 51
3 1 51 59 60
3 1 51 60 52
3 1 52 60 61
3 1 52 61 53
3 1 53 61 62
3 1 54 63 55
3 1 55 63 64
3 1 55 64 56
3 1 56 64 65
3 1 56 65 57
3 1 57 65 66
3 1 57 66 58
3 1 58 66 67
3 1 58 67 59
3 1 59 67 68
3 1 59 68 60
3 1 60 68 69
3 1 60 69 61
3 1 61 69 70
3 1 61 70 62
3 1 62 70 71
3 1 63 72 64
3 1 64 72 73
3 1 64 73 65
3 1 65 73 74
3 1 65 74 66
3 1 66 74 75
3 1 66 75 67
3 1 67 75 76
3 1 67 76 68
3 1 68 76 77
3 1 68 77 69
3 1 69 77 78
3 1 69 78 70
3 1 70 78 79
3 1 70 79 71
3 1 71 79 80
3 1 72 81 73
3 1 73 81 82
3 1 73 82 74
3 1 74 82 83
3 1 74 83 75
3 1 75 83 84
3 1 75 84 76
3 1 76 84 85
3 1 76 85 77
3 1 77 85 86
3 1 77 86 78
3 1 78 86 87
3 1 78 87 79
3 1 79 87 88
3 1 79 88 80
3 1 80 88 89
3 1 81 90 82
3 1 82 90 91
3 1 82 91 83
3 1 83 91 92
3 1 83 92 84
3 1 84 92 93
3 1 84 93 85
3 1 85 93 94
3 1 85 94 86
3 1 86 94 95
3 1 86 95 87
3 1 87 95 96
3 1 87 96 88
3 1 88 96 97
3 1 88 97 89
3 1 89 97 98
3 1 90 99 91
3 1 91 99 100
3 1 91 100 92
3 1 92 100 101
3 1 92 101 93
3 1 93 101 102
3 1 93 102 94
3 1 94 102 103
3 1 94 103 95
3 1 95 103 104
3 1 95 104 96
3 1 96 104 105
3 1 96 105 97
3 1 97 105 106
3 1 97 106 98
3 1 98 106 107
3 1 99 108 100
3 1 100 108 109
3 1 100 109 101
3 1 101 109 110
3 1 101 110 102
3 1 102 110 111
3 1 102 111 103
3 1 103 111 112
3 1 103 112 104
3 1 104 112 113
3 1 104 113 105
3 1 105 113 114
3 1 105 114 106
3 1 106 114 115
3 1 106 115 107
3 1 107 115 116
3 1 108 117 109
3 1 109 117 118
3 1 109 118 110
3 1 110 118 119
3 1 110 119 111
3 1 111 119 120
3 1 111 120 112
3 1 112 120 121
3 1 112 121 113
3 1 113 121 122
3 1 113 122 114
3 1 114 122 123
3 1 114 123 115
3 1 115 123 124
3 1 115 124 116
3 1 116 124 125
3 1 117 126 118
3 1 118 126 127
3 1 118 127 119
3 1 119 127 128
3 1 119 128 120
3 1 120 128 129
3 1 120 129 121
3 1 121 129 130
3 1 121 130 122
3 1 122 130 131
3 1 122 131 123
3 1 123 131 132
3 1 123 132 124
3 1 124 132 133
3 1 124 133 125
3 1 125 133 134
3 1 126 135 127
3 1 127 135 136
3 1 127 136 128
3 1 128 136 137
3 1 128 137 129
3 1 129 137 138
3 1 129 138 130
3 1 130 138 139
3 1 130 139 131
3 1 131 139 140
3 1 131 140 132
3 1 132 140 141
3 1 132 141 133
3 1 133 141 142
3 1 133 142 134
3 1 134 142 143
3 1 135 144 136
3 1 136 144 145
3 1 136 145 137
3 1 137 145 146
3 1 137 146 138
3 1 138 146 147
3 1 138 147 139
3 1 139 147 148
3 1 139 148 140
3 1 140 148 149
3 1 140 149 141
3 1 141 149 150
3 1 141 150 142
3 1 142 150 151
3 1 142 151 143
3 1 143 151 152
3 1 144 153 145
3 1 145 153 154
3 1 145 154 146
3 1 146 154 155
3 1 146 155 147
3 1 147 155 156
3 1 147 156 148
3 1 148 156 157
3 1 148 157 149
3 1 149 157 158
3 1 149 158 150
3 1 150 158 159
3 1 150 159 151
3 1 151 159 160
3 1 151 160 152
3 1 152 160 161
3 1 153 162 154
3 1 154 162 163
3 1 154 163 155
3 1 155 163 164
3 1 155 164 156
3 1 156 164 165
3 1 156 165 157
3 1 157 165 166
3 1 157 166 158
3 1 158 166 167
3 1 158 167 159
3 1 159 167 168
3 1 159 168 160
3 1 160 168 169
3 1 160 169 161
3 1 161 169 170
3 1 162 171 163
3 1 163 171 172
3 1 163 172 164
3 1 164 172 173
3 1 164 173 165
3 1 165 173 174
3 1 165 174 166
3 1 166 174 175
3 1 166 175 167
3 1 167 175 176
3 1 167 176 168
3 1 168 176 177
3 1 168 177 169
3 1 169 177 178
3 1 169 178 170
3 1 170 178 179
3 1 171 180 172
3 1 172 180 181
3 1 172 181 173
3 1 173 181 182
3 1 173 182 174
3 1 174 182 183
3 1 174 183 175
3 1 175 183 184
3 1 175 184 176
3 1 176 184 185
3 1 176 185 177
3 1 177 185 186
3 1 177 186 178
3 1 178 186 187
3 1 178 187 179
3 1 179 187 188
3 1 180 189 181
3 1 181 189 190
3 1 181 190 182
3 1 182 190 191
3 1 182 191 183
3 1 183 191 192
3 1 183 192 184
3 1 184 192 193
3 1 184 193 185
3 1 185 193 194
3 1 185 194 186
3 1 186 194 195
3 1 186 195 187
3 1 187 195 196
3 1 187 196 188
3 1 188 196 197
3 1 189 198 190
3 1 190 198 199
3 1 190 199 191
3 1 191 199 200
3 1 191 200 192
3 1 192 200 201
3 1 192 201 193
3 1 193 201 202
3 1 193 202 194
3 1 194 202 203
3 1 194 203 195
3 1 195 203 204
3 1 195 204 196
3 1 196 204 205
3 1 196 205 197
3 1 197 205 206
3 1 198 207 199
3 1 199 207 208
3 1 199 208 200
3 1 200 208 209
3 1 200 209 201
3 1 201 209 210
3 1 201 210 202
3 1 202 210 211
3 1 202 211 203
3 1 203 211 212
3 1 203 212 204
3 1 204 212 213
3 1 204 213 205
3 1 205 213 214
3 1 205 214 206
3 1 206 214 215
3 1 207 216 208
3 1 208 216 217
3 1 208 217 209
3 1 209 217 218
3 1 209 218 210
3 1 210 218 219
3 1 210 219 211
3 1 211 219 220
3 1 211 220 212
3 1 212 220 221
3 1 212 221 213
3 1 213 221 222
3 1 213 222 214
3 1 214 222 223
3 1 214 223 215
3 1 215 223 224
3 1 216 225 217
3 1 217 225 226
3 1 217 226 218
3 1 218 226 227
3 1 218 227 219
3 1 219 227 228
3 1 219 228 220
3 1 220 228 229
3 1 220 229 221
3 1 221 229 230
3 1 221 230 222
3 1 222 230 231
3 1 222 231 223
3 1 223 231 232
3 1 223 232 224
3 1 224 232 233
3 1 225 234 226
3 1 226 234 235
3 1 226 235 227
3 1 227 235 236
3 1 227 236 228
3 1 228 236 237
3 1 228 237 229
3 1 229 237 238
3 1 229 238 230
3 1 230 238 239
3 1 230 239 231
3 1 231 239 240
3 1 231 240 232
3 1 232 240 241
3 1 232 241 233
3 1 233 241 242
3 1 234 243 235
3 1 235 243 244
3 1 235 244 236
3 1 236 244 245
3 1 236 245 237
3 1 237 245 246
3 1 237 246 238
3 1 238 246 247
3 1 238 247 239
3 1 239 247 248
3 1 239 248 240
3 1 240 248 249
3 1 240 249 241
3 1 241 249 250
3 1 241 250 242
3 1 242 250 251
3 1 243 252 244
3 1 244 252 253
3 1 244 253 245
3 1 245 253 254
3 1 245 254 246
3 1 246 254 255
3 1 246 255 247
3 1 247 255 256
3 1 247 256 248
3 1 248 256 257
3 1 248 257 249
3 1 249 257 258
3 1 249 258 250
3 1 250 258 259
3 1 250 259 251
3 1 251 259 260
3 1 252 261 253
3 1 253 261 262
3 1 253 262 254
3 1 254 262 263
3 1 254 263 255
3 1 255 263 264
3 1 255 264 256
3 1 256 264 265
3 1 256 265 257
3 1 257 265 266
3 1 257 266 258
3 1 258 266 267
3 1 258 267 259
3 1 259 267 268
3 1 259 268 260
3 1 260 268 269
3 1 261 270 262
3 1 262 270 271
3 1 262 271 263
3 1 263 271 272
3 1 263 272 264
3 1 264 272 273
3 1 264 273 265
3 1 265 273 274
3 1 265 274 266
3 1 266 274 275
3 1 266 275 267
3 1 267 275 276
3 1 267 276 268
3 1 268 276 277
3 1 268 277 269
3 1 269 277 278
3 1 270 279 271
3 1 271 279 280
3 1 271 280 272
3 1 272 280 281
3 1 272 281 273
3 1 273 281 282
3 1 273 282 274
3 1 274 282 283
3 1 274 283 275
3 1 275 283 284
3 1 275 284 276
3 1 276 284 285
3 1 276 285 277
3 1 277 285 286
3 1 277 286 278
3 1 278 286 287
3 1 279 288 280
3 1 280 288 289
3 1 280 289 281
3 1 281 289 290
3 1 281 290 282
3 1 282 290 291
3 1 282 291 283
3 1 283 291 292
3 1 283 292 284
3 1 284 292 293
3 1 284 293 285
3 1 285 293 294
3 1 285 294 286
3 1 286 294 295
3 1 286 295 287
3 1 287 295 296
3 1 288 297 289
3 1 289 297 298
3 1 289 298 290
3 1 290 298 299
3 1 290 299 291
3 1 291 299 300
3 1 291 300 292
3 1 292 300 301
3 1 292 301 293
3 1 293 301 302
3 1 293 302 294
3 1 294 302 303
3 1 294 303 295
3 1 295 303 304
3 1 295 304 296
3 1 296 304 305
3 1 297 306 298
3 1 298 306 307
3 1 298 307 299
3 1 299 307 308
3 1 299 308 300
3 1 300 308 309
3 1 300 309 301
3 1 301 309 310
3 1 301 310 302
3 1 302 310 311
3 1 302 311 303
3 1 303 311 312
3 1 303 312 304
3 1 304 312 313
3 1 304 313 305
3 1 305 313 314
3 1 306 315 307
3 1 307 315 316
3 1 307 316 308
3 1 308 316 317
3 1 308 317 309
3 1 309 317 318
3 1 309 318 310
3 1 310 318 319
3 1 310 319 311
3 1 311 319 320
3 1 311 320 312
3 1 312 320 321
3 1 312 321 313
3 1 313 321 322
3 1 313 322 314
3 1 314 322 323
3 1 315 324 316
3 1 316 324 325
3 1 316 325 317
3 1 317 325 326
3 1 317 326 318
3 1 318 326 327
3 1 318 327 319
3 1 319 327 328
3 1 319 328 320
3 1 320 328 329
3 1 320 329 321
3 1 321 329 330
3 1 321 330 322
3 1 322 330 331
3 1 322 331 323
3 1 323 331 332
3 1 324 333 325
3 1 325 333 334
3 1 325 334 326
3 1 326 334 335
3 1 326 335 327
3 1 327 335 336
3 1 327 336 328
3 1 328 336 337
3 1 328 337 329
3 1 329 337 338
3 1 329 338 330
3 1 330 338 339
3 1 330 339 331
3 1 331 339 340
3 1 331 340 332
3 1 332 340 341
3 1 333 342 334
3 1 334 342 343
3 1 334 343 335
3 1 335 343 344
3 1 335 344 336
3 1 336 344 345
3 1 336 345 337
3 1 337 345 346
3 1 337 346 338
3 1 338 346 347
3 1 338 347 339
3 1 339 347 348
3 1 339 348 340
3 1 340 348 349
3 1 340 349 341
3 1 341 349 350
3 1 342 351 343
3 1 343 351 352
3 1 343 352 344
3 1 344 352 353
3 1 344 353 345
3 1 345 353 354
3 1 345 354 346
3 1 346 354 355
3 1 346 355 347
3 1 347 355 356
3 1 347 356 348
3 1 348 356 357
3 1 348 357 349
3 1 349 357 358
3 1 349 358 350
3 1 350 358 359
3 1 351 360 352
3 1 352 360 361
3 1 352 361 353
3 1 353 361 362
3 1 353 362 354
3 1 354 362 363
3 1 354 363 355
3 1 355 363 364
3 1 355 364 356
3 1 356 364 365
3 1 356 365 357
3 1 357 365 366
3 1 357 366 358
3 1 358 366 367
3 1 358 367 359
3 1 359 367 368
3 1 360 369 361
3 1 361 369 370
3 1 361 370 362
3 1 362 370 371
3 1 362 371 363
3 1 363 371 372
3 1 363 372 364
3 1 364 372 373
3 1 364 373 365
3 1 365 373 374
3 1 365 374 366
3 1 366 374 375
3 1 366 375 367
3 1 367 375 376
3 1 367 376 368
3 1 368 376 377
3 1 369 378 370
3 1 370 378 379
3 1 370 379 371
3 1 371 379 372
3 1 372 379 380
3 1 372 380 373
3 1 373 380 374
3 1 374 380 381
3 1 374 381 375
3 1 375 381 376
3 1 376 381 382
3 1 376 382 377
3 1 378 383 379
3 1 379 383 384
3 1 379 384 380
3 1 380 384 381
3 1 381 384 385
3 1 381 385 382
3 1 383 386 384
3 1 384 386 387
3 1 384 387 385
3 1 385 387 388
3 1 386 389 387
3 1 387 389 390
3 1 387 390 388
3 1 388 390 391
3 1 389 392 390
3 1 390 392 393
3 1 390 393 391
3 1 391 393 394
3 1 392 395 393
3 1 393 395 396
3 1 393 396 394
3 1 394 396 397
3 1 395 398 396
3 1 396 398 399
3 1 396 399 397
3 1 397 399 400
3 1 398 401 399
3 1 399 401 402
3 1 399 402 400
3 1 400 402 403
3 1 401 404 402
3 1 402 404 405
3 1 402 405 403
3 1 403 405 406
3 1 404 407 405
3 1 405 407 408
3 1 405 408 406
3 1 406 408 409
3 1 407 410 408
3 1 408 410 411
3 1 408 411 409
3 1 409 411 412
3 1 413 0 1
3 1 413 1 414
3 1 414 1 2
3 1 414 2 415
3 1 415 2 3
3 1 415 3 416
3 1 416 3 4
3 1 416 4 417
3 1 417 4 5
3 1 417 5 418
3 1 418 5 6
3 1 418 6 419
3 1 419 6 7
3 1 419 7 420
3 1 420 7 8
3 1 420 8 421
3 1 422 413 414
3 1 422 414 423
3 1 423 414 415
3 1 423 415 424
3 1 424 415 416
3 1 424 416 425
3 1 425 416 417
3 1 425 417 426
3 1 426 417 418
3 1 426 418 427
3 1 427 418 419
3 1 427 419 428
3 1 428 419 420
3 1 428 420 429
3 1 429 420 421
3 1 429 421 430
3 1 431 422 423
3 1 431 423 432
3 1 432 423 424
3 1 432 424 433
3 1 433 424 425
3 1 433 425 434
3 1 434 425 426
3 1 434 426 435
3 1 435 426 427
3 1 435 427 436
3 1 436 427 428
3 1 436 428 437
3 1 437 428 429
3 1 437 429 438
3 1 438 429 430
3 1 438 430 439
3 1 440 431 432
3 1 440 432 441
3 1 441 432 433
3 1 441 433 442
3 1 442 433 434
3 1 442 434 443
3 1 443 434 435
3 1 443 435 444
3 1 444 435 436
3 1 444 436 445
3 1 445 436 437
3 1 445 437 446
3 1 446 437 438
3 1 446 438 447
3 1 447 438 439
3 1 447 439 448
3 1 449 440 441
3 1 449 441 450
3 1 450 441 442
3 1 450 442 451
3 1 451 442 443
3 1 451 443 452
3 1 452 443 444
3 1 452 444 453
3 1 453 444 445
3 1 453 445 454
3 1 454 445 446
3 1 454 446 455
3 1 455 446 447
3 1 455 447 456
3 1 456 447 448
3 1 456 448 457
3 1 458 449 450
3 1 458 450 459
3 1 459 450 451
3 1 459 451 460
3 1 460 451 452
3 1 460 452 461
3 1 461 452 453
3 1 461 453 462
3 1 462 453 454
3 1 462 454 463
3 1 463 454 455
3 1 463 455 464
3 1 464 455 456
3 1 464 456 465
3 1 465 456 457
3 1 465 457 466
3 1 467 458 459
3 1 467 459 468
3 1 468 459 460
3 1 468 460 469
3 1 469 460 461
3 1 469 461 470
3 1 470 461 462
3 1 470 462 471
3 1 471 462 463
3 1 471 463 472
3 1 472 463 464
3 1 472 464 473
3 1 473 464 465
3 1 473 465 474
3 1 474 465 466
3 1 474 466 475
3 1 476 467 468
3 1 476 468 477
3 1 477 468 469
3 1 477 469 478
3 1 478 469 470
3 1 478 470 479
3 1 479 470 471
3 1 479 471 480
3 1 480 471 472
3 1 480 472 481
3 1 481 472 473
3 1 481 473 482
3 1 482 473 474
3 1 482 474 483
3 1 483 474 475
3 1 483 475 484
3 1 485 476 477
3 1 485 477 486
3 1 486 477 478
3 1 486 478 487
3 1 487 478 479
3 1 487 479 488
3 1 488 479 480
3 1 488 480 489
3 1 489 480 481
3 1 489 481 490
3 1 490 481 482
3 1 490 482 491
3 1 491 482 483
3 1 491 483 492
3 1 492 483 484
3 1 492 484 493
3 1 494 485 486
3 1 494 486 495
3 1 495 486 487
3 1 495 487 496
3 1 496 487 488
3 1 496 488 497
3 1 497 488 489
3 1 497 489 498
3 1 498 489 490
3 1 498 490 499
3 1 499 490 491
3 1 499 491 500
3 1 500 491 492
3 1 500 492 501
3 1 501 492 493
3 1 501 493 502
3 1 503 494 495
3 1 503 495 504
3 1 504 495 496
3 1 504 496 505
3 1 505 496 497
3 1 505 497 506
3 1 506 497 498
3 1 506 498 507
3 1 507 498 499
3 1 507 499 508
3 1 508 499 500
3 1 508 500 509
3 1 509 500 501
3 1 509 501 510
3 1 510 501 502
3 1 510 502 511
3 1 512 503 504
3 1 512 504 513
3 1 513 504 505
3 1 513 505 514
3 1 514 505 506
3 1 514 506 515
3 1 515 506 507
3 1 515 507 516
3 1 516 507 508
3 1 516 508 517
3 1 517 508 509
3 1 517 509 518
3 1 518 509 510
3 1 518 510 519
3 1 519 510 511
3 1 519 511 520
3 1 521 512 513
3 1 521 513 522
3 1 522 513 514
3 1 522 514 523
3 1 523 514 515
3 1 523 515 524
3 1 524 515 516
3 1 524 516 525
3 1 525 516 517
3 1 525 517 526
3 1 526 517 518
3 1 526 518 527
3 1 527 518 519
3 1 527 519 528
3 1 528 519 520
3 1 528 520 529
3 1 530 521 522
3 1 530 522 531
3 1 531 522 523
3 1 531 523 532
3 1 532 523 524
3 1 532 524 533
3 1 533 524 525
3 1 533 525 534
3 1 534 525 526
3 1 534 526 535
3 1 535 526 527
3 1 535 527 536
3 1 536 527 528
3 1 536 528 537
3 1 537 528 529
3 1 537 529 538
3 1 539 530 531
3 1 539 531 540
3 1 540 531 532
3 1 540 532 541
3 1 541 532 533
3 1 541 533 542
3 1 542 533 534
3 1 542 534 543
3 1 543 534 535
3 1 543 535 544
3 1 544 535 536
3 1 544 536 545
3 1 545 536 537
3 1 545 537 546
3 1 546 537 538
3 1 546 538 547
3 1 548 539 540
3 1 548 540 549
3 1 549 540 541
3 1 549 541 550
3 1 550 541 542
3 1 550 542 551
3 1 551 542 543
3 1 551 543 552
3 1 552 543 544
3 1 552 544 553
3 1 553 544 545
3 1 553 545 554
3 1 554 545 546
3 1 554 546 555
3 1 555 546 547
3 1 555 547 556
3 1 557 548 549
3 1 557 549 558
3 1 558 549 550
3 1 558 550 559
3 1 559 550 551
3 1 559 551 560
3 1 560 551 552
3 1 560 552 561
3 1 561 552 553
3 1 561 553 562
3 1 562 553 554
3 1 562 554 563
3 1 563 554 555
3 1 563 555 564
3 1 564 555 556
3 1 564 556 565
3 1 566 557 558
3 1 566 558 567
3 1 567 558 559
3 1 567 559 568
3 1 568 559 560
3 1 568 560 569
3 1 569 560 561
3 1 569 561 570
3 1 570 561 562
3 1 570 562 571
3 1 571 562 563
3 1 571 563 572
3 1 572 563 564
3 1 572 564 573
3 1 573 564 565
3 1 573 565 574
3 1 575 566 567
3 1 575 567 576
3 1 576 567 568
3 1 576 568 577
3 1 577 568 569
3 1 577 569 578
3 1 578 569 570
3 1 578 570 579
3 1 579 570 571
3 1 579 571 580
3 1 580 571 572
3 1 580 572 581
3 1 581 572 573
3 1 581 573 582
3 1 582 573 574
3 1 582 574 583
3 1 584 575 576
3 1 584 576 585
3 1 585 576 577
3 1 585 577 586
3 1 586 577 578
3 1 586 578 587
3 1 587 578 579
3 1 587 579 588
3 1 588 579 580
3 1 588 580 589
3 1 589 580 581
3 1 589 581 590
3 1 590 581 582
3 1 590 582 591
3 1 591 582 583
3 1 591 583 592
3 1 593 584 585
3 1 593 585 594
3 1 594 585 586
3 1 594 586 595
3 1 595 586 587
3 1 595 587 596
3 1 596 587 588
3 1 596 588 597
3 1 597 588 589
3 1 597 589 598
3 1 598 589 590
3 1 598 590 599
3 1 599 590 591
3 1 599 591 600
3 1 600 591 592
3 1 600 592 601
3 1 602 593 594
3 1 602 594 603
3 1 603 594 595
3 1 603 595 604
3 1 604 595 596
3 1 604 596 605
3 1 605 596 597
3 1 605 597 606
3 1 606 597 598
3 1 606 598 607
3 1 607 598 599
3 1 607 599 608
3 1 608 599 600
3 1 608 600 609
3 1 609 600 601
3 1 609 601 610
3 1 611 602 603
3 1 611 603 612
3 1 612 603 604
3 1 612 604 613
3 1 613 604 605
3 1 613 605 614
3 1 614 605 606
3 1 614 606 615
3 1 615 606 607
3 1 615 607 616
3 1 616 607 608
3 1 616 608 617
3 1 617 608 609
3 1 617 609 618
3 1 618 609 610
3 1 618 610 619
3 1 620 611 612
3 1 620 612 621
3 1 621 612 613
3 1 621 613 622
3 1 622 613 614
3 1 622 614 623
3 1 623 614 615
3 1 623 615 624
3 1 624 615 616
3 1 624 616 625
3 1 625 616 617
3 1 625 617 626
3 1 626 617 618
3 1 626 618 627
3 1 627 618 619
3 1 627 619 628
3 1 629 620 621
3 1 629 621 630
3 1 630 621 622
3 1 630 622 631
3 1 631 622 623
3 1 631 623 632
3 1 632 623 624
3 1 632 624 633
3 1 633 624 625
3 1 633 625 634
3 1 634 625 626
3 1 634 626 635
3 1 635 626 627
3 1 635 627 636
3 1 636 627 628
3 1 636 628 637
3 1 638 629 630
3 1 638 630 639
3 1 639 630 631
3 1 639 631 640
3 1 640 631 632
3 1 640 632 641
3 1 641 632 633
3 1 641 633 642
3 1 642 633 634
3 1 642 634 643
3 1 643 634 635
3 1 643 635 644
3 1 644 635 636
3 1 644 636 645
3 1 645 636 637
3 1 645 637 646
3 1 647 638 639
3 1 647 639 648
3 1 648 639 640
3 1 648 640 649
3 1 649 640 641
3 1 649 641 650
3 1 650 641 642
3 1 650 642 651
3 1 651 642 643
3 1 651 643 652
3 1 652 643 644
3 1 652 644 653
3 1 653 644 645
3 1 653 645 654
3 1 654 645 646
3 1 654 646 655
3 1 656 647 648
3 1 656 648 657
3 1 657 648 649
3 1 657 649 658
3 1 658 649 650
3 1 658 650 659
3 1 659 650 651
3 1 659 651 660
3 1 660 651 652
3 1 660 652 661
3 1 661 652 653
3 1 661 653 662
3 1 662 653 654
3 1 662 654 663
3 1 663 654 655
3 1 663 655 664
3 1 665 656 657
3 1 665 657 666
3 1 666 657 658
3 1 666 658 667
3 1 667 658 659
3 1 667 659 668
3 1 668 659 660
3 1 668 660 669
3 1 669 660 661
3 1 669 661 670
3 1 670 661 662
3 1 670 662 671
3 1 671 662 663
3 1 671 663 672
3 1 672 663 664
3 1 672 664 673
3 1 674 665 666
3 1 674 666 675
3 1 675 666 667
3 1 675 667 676
3 1 676 667 668
3 1 676 668 677
3 1 677 668 669
3 1 677 669 678
3 1 678 669 670
3 1 678 670 679
3 1 679 670 671
3 1 679 671 680
3 1 680 671 672
3 1 680 672 681
3 1 681 672 673
3 1 681 673 682
3 1 683 674 675
3 1 683 675 684
3 1 684 675 676
3 1 684 676 685
3 1 685 676 677
3 1 685 677 686
3 1 686 677 678
3 1 686 678 687
3 1 687 678 679
3 1 687 679 688
3 1 688 679 680
3 1 688 680 689
3 1 689 680 681
3 1 689 681 690
3 1 690 681 682
3 1 690 682 691
3 1 692 683 684
3 1 692 684 693
3 1 693 684 685
3 1 693 685 694
3 1 694 685 686
3 1 694 686 695
3 1 695 686 687
3 1 695 687 696
3 1 696 687 688
3 1 696 688 697
3 1 697 688 689
3 1 697 689 698
3 1 698 689 690
3 1 698 690 699
3 1 699 690 691
3 1 699 691 700
3 1 701 692 693
3 1 701 693 702
3 1 702 693 694
3 1 702 694 703
3 1 703 694 695
3 1 703 695 704
3 1 704 695 696
3 1 704 696 705
3 1 705 696 697
3 1 705 697 706
3 1 706 697 698
3 1 706 698 707
3 1 707 698 699
3 1 707 699 708
3 1 708 699 700
3 1 708 700 709
3 1 710 701 702
3 1 710 702 711
3 1 711 702 703
3 1 711 703 712
3 1 712 703 704
3 1 712 704 713
3 1 713 704 705
3 1 713 705 714
3 1 714 705 706
3 1 714 706 715
3 1 715 706 707
3 1 715 707 716
3 1 716 707 708
3 1 716 708 717
3 1 717 708 709
3 1 717 709 718
3 1 719 710 711
3 1 719 711 720
3 1 720 711 712
3 1 720 712 721
3 1 721 712 713
3 1 721 713 722
3 1 722 713 714
3 1 722 714 723
3 1 723 714 715
3 1 723 715 724
3 1 724 715 716
3 1 724 716 725
3 1 725 716 717
3 1 725 717 726
3 1 726 717 718
3 1 726 718 727
3 1 728 719 720
3 1 728 720 729
3 1 729 720 721
3 1 729 721 730
3 1 730 721 722
3 1 730 722 731
3 1 731 722 723
3 1 731 723 732
3 1 732 723 724
3 1 732 724 733
3 1 733 724 725
3 1 733 725 734
3 1 734 725 726
3 1 734 726 735
3 1 735 726 727
3 1 735 727 736
3 1 737 728 729
3 1 737 729 738
3 1 738 729 730
3 1 738 730 739
3 1 739 730 731
3 1 739 731 740
3 1 740 731 732
3 1 740 732 741
3 1 741 732 733
3 1 741 733 742
3 1 742 733 734
3 1 742 734 743
3 1 743 734 735
3 1 743 735 744
3 1 744 735 736
3 1 744 736 745
3 1 746 737 738
3 1 746 738 747
3 1 747 738 739
3 1 747 739 748
3 1 748 739 740
3 1 748 740 749
3 1 749 740 741
3 1 749 741 750
3 1 750 741 742
3 1 750 742 751
3 1 751 742 743
3 1 751 743 752
3 1 752 743 744
3 1 752 744 753
3 1 753 744 745
3 1 753 745 754
3 1 755 746 747
3 1 755 747 756
3 1 756 747 748
3 1 756 748 757
3 1 757 748 749
3 1 757 749 758
3 1 758 749 750
3 1 758 750 759
3 1 759 750 751
3 1 759 751 760
3 1 760 751 752
3 1 760 752 761
3 1 761 752 753
3 1 761 753 762
3 1 762 753 754
3 1 762 754 763
3 1 764 755 756
3 1 764 756 765
3 1 765 756 757
3 1 765 757 766
3 1 766 757 758
3 1 766 758 767
3 1 767 758 759
3 1 767 759 768
3 1 768 759 760
3 1 768 760 769
3 1 769 760 761
3 1 769 761 770
3 1 770 761 762
3 1 770 762 771
3 1 771 762 763
3 1 771 763 772
3 1 773 764 765
3 1 773 765 774
3 1 774 765 766
3 1 774 766 775
3 1 775 766 767
3 1 775 767 776
3 1 776 767 768
3 1 776 768 777
3 1 777 768 769
3 1 777 769 778
3 1 778 769 770
3 1 778 770 779
3 1 779 770 771
3 1 779 771 780
3 1 780 771 772
3 1 780 772 781
3 1 782 773 774
3 1 782 774 783
3 1 783 774 775
3 1 783 775 776
3 1 783 776 784
3 1 784 776 777
3 1 784 777 778
3 1 784 778 785
3 1 785 778 779
3 1 785 779 780
3 1 785 780 786
3 1 786 780 781
3 1 787 782 783
3 1 787 783 788
3 1 788 783 784
3 1 788 784 785
3 1 788 785 789
3 1 789 785 786
3 1 790 787 788
3 1 790 788 791
3 1 791 788 789
3 1 791 789 792
3 1 793 790 791
3 1 793 791 794
3 1 794 791 792
3 1 794 792 795
3 1 796 793 794
3 1 796 794 797
3 1 797 794 795
3 1 797 795 798
3 1 799 796 797
3 1 799 797 800
3 1 800 797 798
3 1 800 798 801
3 1 802 799 800
3 1 802 800 803
3 1 803 800 801
3 1 803 801 804
3 1 805 802 803
3 1 805 803 806
3 1 806 803 804
3 1 806 804 807
3 1 808 805 806
3 1 808 806 809
3 1 809 806 807
3 1 809 807 810
3 1 811 808 809
3 1 811 809 812
3 1 812 809 810
3 1 812 810 813
3 1 814 811 812
3 1 814 812 815
3 1 815 812 813
3 1 815 813 816
FACES:
2 1 0 9
2 1 17 8
2 1 9 18
2 1 26 17
2 1 18 27
2 1 35 26
2 1 27 36
2 1 44 35
2 1 36 45
2 1 53 44
2 1 45 54
2 1 62 53
2 1 54 63
2 1 71 62
2 1 63 72
2 1 80 71
2 1 72 81
2 1 89 80
2 1 81 90
2 1 98 89
2 1 90 99
2 1 107 98
2 1 99 108
2 1 116 107
2 1 108 117
2 1 125 116
2 1 117 126
2 1 134 125
2 1 126 135
2 1 143 134
2 1 135 144
2 1 152 143
2 1 144 153
2 1 161 152
2 1 153 162
2 1 170 161
2 1 162 171
2 1 179 170
2 1 171 180
2 1 188 179
2 1 180 189
2 1 197 188
2 1 189 198
2 1 206 197
2 1 198 207
2 1 215 206
2 1 207 216
2 1 224 215
2 1 216 225
2 1 233 224
2 1 225 234
2 1 242 233
2 1 234 243
2 1 251 242
2 1 243 252
2 1 260 251
2 1 252 261
2 1 269 260
2 1 261 270
2 1 278 269
2 1 270 279
2 1 287 278
2 1 279 288
2 1 296 287
2 1 288 297
2 1 305 296
2 1 297 306
2 1 314 305
2 1 306 315
2 1 323 314
2 1 315 324
2 1 332 323
2 1 324 333
2 1 341 332
2 1 333 342
2 1 350 341
2 1 342 351
2 1 359 350
2 1 351 360
2 1 368 359
2 1 360 369
2 1 377 368
2 1 369 378
2 1 382 377
2 1 378 383
2 1 385 382
2 1 383 386
2 1 388 385
2 1 386 389
2 1 391 388
2 1 389 392
2 1 394 391
2 1 392 395
2 1 397 394
2 1 395 398
2 1 400 397
2 1 398 401
2 1 403 400
2 1 401 404
2 1 406 403
2 1 404 407
2 1 409 406
2 1 407 410
2 1 412 409
2 1 410 411
2 1 411 412
2 1 413 0
2 1 8 421
2 1 422 413
2 1 421 430
2 1 431 422
2 1 430 439
2 1 440 431
2 1 439 448
2 1 449 440
2 1 448 457
2 1 458 449
2 1 457 466
2 1 467 458
2 1 466 475
2 1 476 467
2 1 475 484
2 1 485 476
2 1 484 493
2 1 494 485
2 1 493 502
2 1 503 494
2 1 502 511
2 1 512 503
2 1 511 520
2 1 521 512
2 1 520 529
2 1 530 521
2 1 529 538
2 1 539 530
2 1 538 547
2 1 548 539
2 1 547 556
2 1 557 548
2 1 556 565
2 1 566 557
2 1 565 574
2 1 575 566
2 1 574 583
2 1 584 575
2 1 583 592
2 1 593 584
2 1 592 601
2 1 602 593
2 1 601 610
2 1 611 602
2 1 610 619
2 1 620 611
2 1 619 628
2 1 629 620
2 1 628 637
2 1 638 629
2 1 637 646
2 1 647 638
2 1 646 655
2 1 656 647
2 1 655 664
2 1 665 656
2 1 664 673
2 1 674 665
2 1 673 682
2 1 683 674
2 1 682 691
2 1 692 683
2 1 691 700
2 1 701 692
2 1 700 709
2 1 710 701
2 1 709 718
2 1 719 710
2 1 718 727
2 1 728 719
2 1 727 736
2 1 737 728
2 1 736 745
2 1 746 737
2 1 745 754
2 1 755 746
2 1 754 763
2 1 764 755
2 1 763 772
2 1 773 764
2 1 772 781
2 1 782 773
2 1 781 786
2 1 787 782
2 1 786 789
2 1 790 787
2 1 789 792
2 1 793 790
2 1 792 795
2 1 796 793
2 1 795 798
2 1 799 796
2 1 798 801
2 1 802 799
2 1 801 804
2 1 805 802
2 1 804 807
2 1 808 805
2 1 807 810
2 1 811 808
2 1 810 813
2 1 814 811
2 1 813 816
2 1 815 814
2 1 816 815