POINTS:
0.0 0.0
0.0 0.25
0.0 0.5
0.0 0.75
0.0 1.0
0.25 0.0
0.25 0.25
0.25 0.5
0.25 0.75
0.25 1.0
0.5 0.0
0.5 0.25
0.5 0.5
0.5 0.75
0.5 1.0
0.75 0.0
0.75 0.25
0.75 0.5
0.75 0.75
0.75 1.0
1.0 0.0
1.0 0.25
1.0 0.5
1.0 0.75
1.0 1.0
1.25 0.0
1.25 0.25
1.25 0.5
1.25 0.75
1.25 1.0
1.5 0.0
1.5 0.25
1.5 0.5
1.5 0.75
1.5 1.0
1.75 0.0
1.75 0.25
1.75 0.5
1.75 0.75
1.75 1.0
2.0 0.0
2.0 0.25
2.0 0.5
2.0 0.75
2.0 1.0
2.25 0.0
2.25 0.25
2.25 0.5
2.25 0.75
2.25 1.0
2.5 0.0
2.5 0.25
2.5 0.5
2.5 0.75
2.5 1.0
2.75 0.0
2.75 0.25
2.75 0.5
2.75 0.75
2.75 1.0
3.0 0.0
3.0 0.25
3.0 0.5
3.0 0.75
3.0 1.0
3.25 0.0
3.25 0.25
3.25 0.5
3.25 0.75
3.25 1.0
3.5 0.0
3.5 0.25
3.5 0.5
3.5 0.75
3.5 1.0
3.75 0.0
3.75 0.25
3.75 0.5
3.75 0.75
3.75 1.0
4.0 0.0
4.0 0.25
4.0 0.5
4.0 0.75
4.0 1.0
4.25 0.0
4.25 0.25
4.25 0.5
4.25 0.75
4.25 1.0
4.5 0.0
4.5 0.25
4.5 0.5
4.5 0.75
4.5 1.0
4.75 0.0
4.75 0.25
4.75 0.5
4.75 0.75
4.75 1.0
5.0 0.0
5.0 0.25
5.0 0.5
5.0 0.75
5.0 1.0
5.25 0.0
5.25 0.25
5.25 0.5
5.25 0.75
5.25 1.0
5.5 0.0
5.5 0.25
5.5 0.5
5.5 0.75
5.5 1.0
5.75 0.0
5.75 0.25
5.75 0.5
5.75 0.75
5.75 1.0
6.0 0.0
6.0 0.25
6.0 0.5
6.0 0.75
6.0 1.0
6.25 0.0
6.25 0.25
6.25 0.5
6.25 0.75
6.25 1.0
6.5 0.0
6.5 0.25
6.5 0.5
6.5 0.75
6.5 1.0
6.75 0.0
6.75 0.25
6.75 0.5
6.75 0.75
6.75 1.0
7.0 0.0
7.0 0.25
7.0 0.5
7.0 0.75
7.0 1.0
7.25 0.0
7.25 0.25
7.25 0.5
7.25 0.75
7.25 1.0
7.5 0.0
7.5 0.25
7.5 0.5
7.5 0.75
7.5 1.0
7.75 0.0
7.75 0.25
7.75 0.5
7.75 0.75
7.75 1.0
8.0 0.0
8.0 0.25
8.0 0.5
8.0 0.75
8.0 1.0
-0.25 0.0
-0.25 0.25
-0.25 0.5
-0.25 0.75
-0.25 1.0
-0.5 0.0
-0.5 0.25
-0.5 0.5
-0.5 0.75
-0.5 1.0
-0.75 0.0
-0.75 0.25
-0.75 0.5
-0.75 0.75
-0.75 1.0
-1.0 0.0
-1.0 0.25
-1.0 0.5
-1.0 0.75
-1.0 1.0
-1.25 0.0
-1.25 0.25
-1.25 0.5
-1.25 0.75
-1.25 1.0
-1.5 0.0
-1.5 0.25
-1.5 0.5
-1.5 0.75
-1.5 1.0
-1.75 0.0
-1.75 0.25
-1.75 0.5
-1.75 0.75
-1.75 1.0
-2.0 0.0
-2.0 0.25
-2.0 0.5
-2.0 0.75
-2.0 1.0
-2.25 0.0
-2.25 0.25
-2.25 0.5
-2.25 0.75
-2.25 1.0
-2.5 0.0
-2.5 0.25
-2.5 0.5
-2.5 0.75
-2.5 1.0
-2.75 0.0
-2.75 0.25
-2.75 0.5
-2.75 0.75
-2.75 1.0
-3.0 0.0
-3.0 0.25
-3.0 0.5
-3.0 0.75
-3.0 1.0
-3.25 0.0
-3.25 0.25
-3.25 0.5
-3.25 0.75
-3.25 1.0
-3.5 0.0
-3.5 0.25
-3.5 0.5
-3.5 0.75
-3.5 1.0
-3.75 0.0
-3.75 0.25
-3.75 0.5
-3.75 0.75
-3.75 1.0
-4.0 0.0
-4.0 0.25
-4.0 0.5
-4.0 0.75
-4.0 1.0
-4.25 0.0
-4.25 0.25
-4.25 0.5
-4.25 0.75
-4.25 1.0
-4.5 0.0
-4.5 0.25
-4.5 0.5
-4.5 0.75
-4.5 1.0
-4.75 0.0
-4.75 0.25
-4.75 0.5
-4.75 0.75
-4.75 1.0
-5.0 0.0
-5.0 0.25
-5.0 0.5
-5.0 0.75
-5.0 1.0
-5.25 0.0
-5.25 0.25
-5.25 0.5
-5.25 0.75
-5.25 1.0
-5.5 0.0
-5.5 0.25
-5.5 0.5
-5.5 0.75
-5.5 1.0
-5.75 0.0
-5.75 0.25
-5.75 0.5
-5.75 0.75
-5.75 1.0
-6.0 0.0
-6.0 0.25
-6.0 0.5
-6.0 0.75
-6.0 1.0
-6.25 0.0
-6.25 0.25
-6.25 0.5
-6.25 0.75
-6.25 1.0
-6.5 0.0
-6.5 0.25
-6.5 0.5
-6.5 0.75
-6.5 1.0
-6.75 0.0
-6.75 0.25
-6.75 0.5
-6.75 0.75
-6.75 1.0
-7.0 0.0
-7.0 0.25
-7.0 0.5
-7.0 0.75
-7.0 1.0
-7.25 0.0
-7.25 0.25
-7.25 0.5
-7.25 0.75
-7.25 1.0
-7.5 0.0
-7.5 0.25
-7.5 0.5
-7.5 0.75
-7.5 1.0
-7.75 0.0
-7.75 0.25
-7.75 0.5
-7.75 0.75
-7.75 1.0
-8.0 0.0
-8.0 0.25
-8.0 0.5
-8.0 0.75
-8.0 1.0
CELLS:
3 0 0 5 1
3 0 1 5 6
3 0 1 6 2
3 0 2 6 7
3 0 2 7 3
3 0 3 7 8
3 0 3 8 4
3 0 4 8 9
3 0 5 10 6
3 0 6 10 11
3 0 6 11 7
3 0 7 11 12
3 0 7 12 8
3 0 8 12 13
3 0 8 13 9
3 0 9 13 14
3 0 10 15 11
3 0 11 15 16
3 0 11 16 12
3 0 12 16 17
3 0 12 17 13
3 0 13 17 18
3 0 13 18 14
3 0 14 18 19
3 0 15 20 16
3 0 16 20 21
3 0 16 21 17
3 0 17 21 22
3 0 17 22 18
3 0 18 22 23
3 0 18 23 19
3 0 19 23 24
3 0 20 25 21
3 0 21 25 26
3 0 21 26 22
3 0 22 26 27
3 0 22 27 23
3 0 23 27 28
3 0 23 28 24
3 0 24 28 29
3 0 25 30 26
3 0 26 30 31
3 0 26 31 27
3 0 27 31 32
3 0 27 32 28
3 0 28 32 33
3 0 28 33 29
3 0 29 33 34
3 0 30 35 31
3 0 31 35 36
3 0 31 36 32
3 0 32 36 37
3 0 32 37 33
3 0 33 37 38
3 0 33 38 34
3 0 34 38 39
3 0 35 40 36
3 0 36 40 41
3 0 36 41 37
3 0 37 41 42
3 0 37 42 38
3 0 38 42 43
3 0 38 43 39
3 0 39 43 44
3 0 40 45 41
3 0 41 45 46
3 0 41 46 42
3 0 42 46 47
3 0 42 47 43
3 0 43 47 48
3 0 43 48 44
3 0 44 48 49
3 0 45 50 46
3 0 46 50 51
3 0 46 51 47
3 0 47 51 52
3 0 47 52 48
3 0 48 52 53
3 0 48 53 49
3 0 49 53 54
3 0 50 55 51
3 0 51 55 56
3 0 51 56 52
3 0 52 56 57
3 0 52 57 53
3 0 53 57 58
3 0 53 58 54
3 0 54 58 59
3 0 55 60 56
3 0 56 60 61
3 0 56 61 57
3 0 57 61 62
3 0 57 62 58
3 0 58 62 63
3 0 58 63 59
3 0 59 63 64
3 0 60 65 61
3 0 61 65 66
3 0 61 66 62
3 0 62 66 67
3 0 62 67 63
3 0 63 67 68
3 0 63 68 64
3 0 64 68 69
3 0 65 70 66
3 0 66 70 71
3 0 66 71 67
3 0 67 71 72
3 0 67 72 68
3 0 68 72 73
3 0 68 73 69
3 0 69 73 74
3 0 70 75 71
3 0 71 75 76
3 0 71 76 72
3 0 72 76 77
3 0 72 77 73
3 0 73 77 78
3 0 73 78 74
3 0 74 78 79
3 0 75 80 76
3 0 76 80 81
3 0 76 81 77
3 0 77 81 82
3 0 77 82 78
3 0 78 82 83
3 0 78 83 79
3 0 79 83 84
3 0 80 85 81
3 0 81 85 86
3 0 81 86 82
3 0 82 86 87
3 0 82 87 83
3 0 83 87 88
3 0 83 88 84
3 0 84 88 89
3 0 85 90 86
3 0 86 90 91
3 0 86 91 87
3 0 87 91 92
3 0 87 92 88
3 0 88 92 93
3 0 88 93 89
3 0 89 93 94
3 0 90 95 91
3 0 91 95 96
3 0 91 96 92
3 0 92 96 97
3 0 92 97 93
3 0 93 97 98
3 0 93 98 94
3 0 94 98 99
3 0 95 100 96
3 0 96 100 101
3 0 96 101 97
3 0 97 101 102
3 0 97 102 98
3 0 98 102 103
3 0 98 103 99
3 0 99 103 104
3 0 100 105 101
3 0 101 105 106
3 0 101 106 102
3 0 102 106 107
3 0 102 107 103
3 0 103 107 108
3 0 103 108 104
3 0 104 108 109
3 0 105 110 106
3 0 106 110 111
3 0 106 111 107
3 0 107 111 112
3 0 107 112 108
3 0 108 112 113
3 0 108 113 109
3 0 109 113 114
3 0 110 115 111
3 0 111 115 116
3 0 111 116 112
3 0 112 116 117
3 0 112 117 113
3 0 113 117 118
3 0 113 118 114
3 0 114 118 119
3 0 115 120 116
3 0 116 120 121
3 0 116 121 117
3 0 117 121 122
3 0 117 122 118
3 0 118 122 123
3 0 118 123 119
3 0 119 123 124
3 0 120 125 121
3 0 121 125 126
3 0 121 126 122
3 0 122 126 127
3 0 122 127 123
3 0 123 127 128
3 0 123 128 124
3 0 124 128 129
3 0 125 130 126
3 0 126 130 131
3 0 126 131 127
3 0 127 131 132
3 0 127 132 128
3 0 128 132 133
3 0 128 133 129
3 0 129 133 134
3 0 130 135 131
3 0 131 135 136
3 0 131 136 132
3 0 132 136 137
3 0 132 137 133
3 0 133 137 138
3 0 133 138 134
3 0 134 138 139
3 0 135 140 136
3 0 136 140 141
3 0 136 141 137
3 0 137 141 142
3 0 137 142 138
3 0 138 142 143
3 0 138 143 139
3 0 139 143 144
3 0 140 145 141
3 0 141 145 146
3 0 141 146 142
3 0 142 146 147
3 0 142 147 143
3 0 143 147 148
3 0 143 148 144
3 0 144 148 149
3 0 145 150 146
3 0 146 150 151
3 0 146 151 147
3 0 147 151 152
3 0 147 152 148
3 0 148 152 153
3 0 148 153 149
3 0 149 153 154
3 0 150 155 151
3 0 151 155 156
3 0 151 156 152
3 0 152 156 157
3 0 152 157 153
3 0 153 157 158
3 0 153 158 154
3 0 154 158 159
3 0 155 160 156
3 0 156 160 161
3 0 156 161 157
3 0 157 161 162
3 0 157 162 158
3 0 158 162 163
3 0 158 163 159
3 0 159 163 164
3 0 165 0 1
3 0 165 1 166
3 0 166 1 2
3 0 166 2 167
3 0 167 2 3
3 0 167 3 168
3 0 168 3 4
3 0 168 4 169
3 0 170 165 166
3 0 170 166 171
3 0 171 166 167
3 0 171 167 172
3 0 172 167 168
3 0 172 168 173
3 0 173 168 169
3 0 173 169 174
3 0 175 170 171
3 0 175 171 176
3 0 176 171 172
3 0 176 172 177
3 0 177 172 173
3 0 177 173 178
3 0 178 173 174
3 0 178 174 179
3 0 180 175 176
3 0 180 176 181
3 0 181 176 177
3 0 181 177 182
3 0 182 177 178
3 0 182 178 183
3 0 183 178 179
3 0 183 179 184
3 0 185 180 181
3 0 185 181 186
3 0 186 181 182
3 0 186 182 187
3 0 187 182 183
3 0 187 183 188
3 0 188 183 184
3 0 188 184 189
3 0 190 185 186
3 0 190 186 191
3 0 191 186 187
3 0 191 187 192
3 0 192 187 188
3 0 192 188 193
3 0 193 188 189
3 0 193 189 194
3 0 195 190 191
3 0 195 191 196
3 0 196 191 192
3 0 196 192 197
3 0 197 192 193
3 0 197 193 198
3 0 198 193 194
3 0 198 194 199
3 0 200 195 196
3 0 200 196 201
3 0 201 196 197
3 0 201 197 202
3 0 202 197 198
3 0 202 198 203
3 0 203 198 199
3 0 203 199 204
3 0 205 200 201
3 0 205 201 206
3 0 206 201 202
3 0 206 202 207
3 0 207 202 203
3 0 207 203 208
3 0 208 203 204
3 0 208 204 209
3 0 210 205 206
3 0 210 206 211
3 0 211 206 207
3 0 211 207 212
3 0 212 207 208
3 0 212 208 213
3 0 213 208 209
3 0 213 209 214
3 0 215 210 211
3 0 215 211 216
3 0 216 211 212
3 0 216 212 217
3 0 217 212 213
3 0 217 213 218
3 0 218 213 214
3 0 218 214 219
3 0 220 215 216
3 0 220 216 221
3 0 221 216 217
3 0 221 217 222
3 0 222 217 218
3 0 222 218 223
3 0 223 218 219
3 0 223 219 224
3 0 225 220 221
3 0 225 221 226
3 0 226 221 222
3 0 226 222 227
3 0 227 222 223
3 0 227 223 228
3 0 228 223 224
3 0 228 224 229
3 0 230 225 226
3 0 230 226 231
3 0 231 226 227
3 0 231 227 232
3 0 232 227 228
3 0 232 228 233
3 0 233 228 229
3 0 233 229 234
3 0 235 230 231
3 0 235 231 236
3 0 236 231 232
3 0 236 232 237
3 0 237 232 233
3 0 237 233 238
3 0 238 233 234
3 0 238 234 239
3 0 240 235 236
3 0 240 236 241
3 0 241 236 237
3 0 241 237 242
3 0 242 237 238
3 0 242 238 243
3 0 243 238 239
3 0 243 239 244
3 0 245 240 241
3 0 245 241 246
3 0 246 241 242
3 0 246 242 247
3 0 247 242 243
3 0 247 243 248
3 0 248 243 244
3 0 248 244 249
3 0 250 245 246
3 0 250 246 251
3 0 251 246 247
3 0 251 247 252
3 0 252 247 248
3 0 252 248 253
3 0 253 248 249
3 0 253 249 254
3 0 255 250 251
3 0 255 251 256
3 0 256 251 252
3 0 256 252 257
3 0 257 252 253
3 0 257 253 258
3 0 258 253 254
3 0 258 254 259
3 0 260 255 256
3 0 260 256 261
3 0 261 256 257
3 0 261 257 262
3 0 262 257 258
3 0 262 258 263
3 0 263 258 259
3 0 263 259 264
3 0 265 260 261
3 0 265 261 266
3 0 266 261 262
3 0 266 262 267
3 0 267 262 263
3 0 267 263 268
3 0 268 263 264
3 0 268 264 269
3 0 270 265 266
3 0 270 266 271
3 0 271 266 267
3 0 271 267 272
3 0 272 267 268
3 0 272 268 273
3 0 273 268 269
3 0 273 269 274
3 0 275 270 271
3 0 275 271 276
3 0 276 271 272
3 0 276 272 277
3 0 277 272 273
3 0 277 273 278
3 0 278 273 274
3 0 278 274 279
3 0 280 275 276
3 0 280 276 281
3 0 281 276 277
3 0 281 277 282
3 0 282 277 278
3 0 282 278 283
3 0 283 278 279
3 0 283 279 284
3 0 285 280 281
3 0 285 281 286
3 0 286 281 282
3 0 286 282 287
3 0 287 282 283
3 0 287 283 288
3 0 288 283 284
3 0 288 284 289
3 0 290 285 286
3 0 290 286 291
3 0 291 286 287
3 0 291 287 292
3 0 292 287 288
3 0 292 288 293
3 0 293 288 289
3 0 293 289 294
3 0 295 290 291
3 0 295 291 296
3 0 296 291 292
3 0 296 292 297
3 0 297 292 293
3 0 297 293 298
3 0 298 293 294
3 0 298 294 299
3 0 300 295 296
3 0 300 296 301
3 0 301 296 297
3 0 301 297 302
3 0 302 297 298
3 0 302 298 303
3 0 303 298 299
3 0 303 299 304
3 0 305 300 301
3 0 305 301 306
3 0 306 301 302
3 0 306 302 307
3 0 307 302 303
3 0 307 303 308
3 0 308 303 304
3 0 308 304 309
3 0 310 305 306
3 0 310 306 311
3 0 311 306 307
3 0 311 307 312
3 0 312 307 308
3 0 312 308 313
3 0 313 308 309
3 0 313 309 314
3 0 315 310 311
3 0 315 311 316
3 0 316 311 312
3 0 316 312 317
3 0 317 312 313
3 0 317 313 318
3 0 318 313 314
3 0 318 314 319
3 0 320 315 316
3 0 320 316 321
3 0 321 316 317
3 0 321 317 322
3 0 322 317 318
3 0 322 318 323
3 0 323 318 319
3 0 323 319 324
FACES:
2 1 164 159
2 1 159 154
2 1 154 149
2 1 149 144
2 1 144 139
2 1 139 134
2 1 134 129
2 1 129 124
2 1 124 119
2 1 119 114
2 1 114 109
2 1 109 104
2 1 104 99
2 1 99 94
2 1 94 89
2 1 89 84
2 1 84 79
2 1 79 74
2 1 74 69
2 1 69 64
2 1 64 59
2 1 59 54
2 1 54 49
2 1 49 44
2 1 44 39
2 1 39 34
2 1 34 29
2 1 29 24
2 1 24 19
2 1 19 14
2 1 14 9
2 1 9 4
2 1 0 5
2 1 5 10
2 1 10 15
2 1 15 20
2 1 20 25
2 1 25 30
2 1 30 35
2 1 35 40
2 1 40 45
2 1 45 50
2 1 50 55
2 1 55 60
2 1 60 65
2 1 65 70
2 1 70 75
2 1 75 80
2 1 80 85
2 1 85 90
2 1 90 95
2 1 95 100
2 1 100 105
2 1 105 110
2 1 110 115
2 1 115 120
2 1 120 125
2 1 125 130
2 1 130 135
2 1 135 140
2 1 140 145
2 1 145 150
2 1 150 155
2 1 155 160
2 1 160 161
2 1 161 162
2 1 162 163
2 1 163 164
2 1 319 324
2 1 314 319
2 1 309 314
2 1 304 309
2 1 299 304
2 1 294 299
2 1 289 294
2 1 284 289
2 1 279 284
2 1 274 279
2 1 269 274
2 1 264 269
2 1 259 264
2 1 254 259
2 1 249 254
2 1 244 249
2 1 239 244
2 1 234 239
2 1 229 234
2 1 224 229
2 1 219 224
2 1 214 219
2 1 209 214
2 1 204 209
2 1 199 204
2 1 194 199
2 1 189 194
2 1 184 189
2 1 179 184
2 1 174 179
2 1 169 174
2 1 4 169
2 1 165 0
2 1 170 165
2 1 175 170
2 1 180 175
2 1 185 180
2 1 190 185
2 1 195 190
2 1 200 195
2 1 205 200
2 1 210 205
2 1 215 210
2 1 220 215
2 1 225 220
2 1 230 225
2 1 235 230
2 1 240 235
2 1 245 240
2 1 250 245
2 1 255 250
2 1 260 255
2 1 265 260
2 1 270 265
2 1 275 270
2 1 280 275
2 1 285 280
2 1 290 285
2 1 295 290
2 1 300 295
2 1 305 300
2 1 310 305
2 1 315 310
2 1 320 315
2 1 321 320
2 1 322 321
2 1 323 322
2 1 324 323