POINTS:
0.0 0.0625
0.0 0.078125
0.0 0.09375
0.0 0.125
0.0 0.15625
0.0 0.1875
0.0 0.25
0.0 0.375
0.0 0.5
0.0 0.75
0.0 1.0
0.0625 0.0625
0.0625 0.078125
0.0625 0.09375
0.0625 0.125
0.0625 0.15625
0.0625 0.1875
0.125 0.046875
0.125 0.0625
0.125 0.078125
0.125 0.09375
0.125 0.125
0.125 0.15625
0.125 0.1875
0.125 0.25
0.1875 0.03125
0.1875 0.046875
0.18755 0.0625
0.1875 0.078125
0.1875 0.09375
0.1875 0.125
0.1875 0.15625
0.1875 0.1875
0.21875 0.015625
0.21875 0.03125
0.21875 0.046875
0.21875 0.0625
0.21875 0.09375
0.25 0.0
0.25 0.015625
0.25 0.03125
0.25 0.046875
0.25 0.0625
0.25 0.09375
0.25 0.125
0.25 0.15625
0.25 0.1875
0.25 0.25
0.25 0.375
0.25 0.5
0.25 0.75
0.25 1.0
0.28125 0.0
0.28125 0.015625
0.28125 0.03125
0.28125 0.0625
0.3125 0.0
0.3125 0.03125
0.3125 0.0625
0.3125 0.09375
0.3125 0.125
0.3125 0.1875
0.375 0.0
0.375 0.0625
0.375 0.125
0.375 0.1875
0.375 0.25
0.5 0.0
0.5 0.0625
0.5 0.125
0.5 0.1875
0.5 0.25
0.5 0.375
0.5 0.5
0.5 0.75
0.5 1.0
0.625 0.0
0.625 0.125
0.625 0.25
0.625 0.5
0.75 0.0
0.75 0.25
0.75 0.5
0.75 0.75
0.75 1.0
1.0 0.0
1.0 0.25
1.0 0.5
1.0 0.75
1.0 1.0
1.25 0.0
1.25 0.25
1.25 0.5
1.25 0.75
1.25 1.0
1.5 0.0
1.5 0.25
1.5 0.5
1.5 0.75
1.5 1.0
1.75 0.0
1.75 0.25
1.75 0.5
1.75 0.75
1.75 1.0
2.0 0.0
2.0 0.25
2.0 0.5
2.0 0.75
2.0 1.0
2.25 0.0
2.25 0.25
2.25 0.5
2.25 0.75
2.25 1.0
2.5 0.0
2.5 0.25
2.5 0.5
2.5 0.75
2.5 1.0
2.75 0.0
2.75 0.25
2.75 0.5
2.75 0.75
2.75 1.0
3.0 0.0
3.0 0.25
3.0 0.5
3.0 0.75
3.0 1.0
-0.0625 0.0625
-0.0625 0.078125
-0.0625 0.09375
-0.0625 0.125
-0.0625 0.15625
-0.0625 0.1875
-0.125 0.046875
-0.125 0.0625
-0.125 0.078125
-0.125 0.09375
-0.125 0.125
-0.125 0.15625
-0.125 0.1875
-0.125 0.25
-0.1875 0.03125
-0.1875 0.046875
-0.18755 0.0625
-0.1875 0.078125
-0.1875 0.09375
-0.1875 0.125
-0.1875 0.15625
-0.1875 0.1875
-0.21875 0.015625
-0.21875 0.03125
-0.21875 0.046875
-0.21875 0.0625
-0.21875 0.09375
-0.25 0.0
-0.25 0.015625
-0.25 0.03125
-0.25 0.046875
-0.25 0.0625
-0.25 0.09375
-0.25 0.125
-0.25 0.15625
-0.25 0.1875
-0.25 0.25
-0.25 0.375
-0.25 0.5
-0.25 0.75
-0.25 1.0
-0.28125 0.0
-0.28125 0.015625
-0.28125 0.03125
-0.28125 0.0625
-0.3125 0.0
-0.3125 0.03125
-0.3125 0.0625
-0.3125 0.09375
-0.3125 0.125
-0.3125 0.1875
-0.375 0.0
-0.375 0.0625
-0.375 0.125
-0.375 0.1875
-0.375 0.25
-0.5 0.0
-0.5 0.0625
-0.5 0.125
-0.5 0.1875
-0.5 0.25
-0.5 0.375
-0.5 0.5
-0.5 0.75
-0.5 1.0
-0.625 0.0
-0.625 0.125
-0.625 0.25
-0.625 0.5
-0.75 0.0
-0.75 0.25
-0.75 0.5
-0.75 0.75
-0.75 1.0
-1.0 0.0
-1.0 0.25
-1.0 0.5
-1.0 0.75
-1.0 1.0
-1.25 0.0
-1.25 0.25
-1.25 0.5
-1.25 0.75
-1.25 1.0
-1.5 0.0
-1.5 0.25
-1.5 0.5
-1.5 0.75
-1.5 1.0
-1.75 0.0
-1.75 0.25
-1.75 0.5
-1.75 0.75
-1.75 1.0
-2.0 0.0
-2.0 0.25
-2.0 0.5
-2.0 0.75
-2.0 1.0
-2.25 0.0
-2.25 0.25
-2.25 0.5
-2.25 0.75
-2.25 1.0
-2.5 0.0
-2.5 0.25
-2.5 0.5
-2.5 0.75
-2.5 1.0
-2.75 0.0
-2.75 0.25
-2.75 0.5
-2.75 0.75
-2.75 1.0
-3.0 0.0
-3.0 0.25
-3.0 0.5
-3.0 0.75
-3.0 1.0
CELLS:
3 0 0 11 1
3 0 1 11 12
3 0 1 12 2
3 0 2 12 13
3 0 2 13 3
3 0 3 13 14
3 0 3 14 4
3 0 4 14 15
3 0 4 15 5
3 0 5 15 16
3 0 5 16 6
3 0 6 16 24
3 0 11 17 18
3 0 11 18 12
3 0 12 18 19
3 0 12 19 13
3 0 13 19 20
3 0 13 20 14
3 0 14 20 21
3 0 14 21 15
3 0 15 21 22
3 0 15 22 16
3 0 16 22 23
3 0 16 23 24
3 0 17 25 26
3 0 17 26 18
3 0 18 26 27
3 0 18 27 19
3 0 19 27 28
3 0 19 28 20
3 0 20 28 29
3 0 20 29 21
3 0 21 29 30
3 0 21 30 22
3 0 22 30 31
3 0 22 31 23
3 0 23 31 32
3 0 23 32 24
3 0 24 32 47
3 0 25 33 34
3 0 25 34 26
3 0 26 34 35
3 0 26 35 27
3 0 27 35 36
3 0 27 36 28
3 0 28 36 37
3 0 28 37 29
3 0 29 37 30
3 0 30 37 44
3 0 33 38 39
3 0 33 39 34
3 0 34 39 40
3 0 34 40 35
3 0 35 40 41
3 0 35 41 36
3 0 36 41 42
3 0 36 42 37
3 0 37 42 43
3 0 37 43 44
3 0 30 44 31
3 0 31 44 45
3 0 31 45 32
3 0 32 45 46
3 0 32 46 47
3 0 38 52 39
3 0 39 52 53
3 0 39 53 40
3 0 40 53 54
3 0 40 54 41
3 0 41 54 55
3 0 41 55 42
3 0 42 55 43
3 0 43 55 59
3 0 52 56 53
3 0 53 56 57
3 0 53 57 54
3 0 54 57 55
3 0 55 57 58
3 0 55 58 59
3 0 43 59 44
3 0 44 59 60
3 0 44 60 45
3 0 45 60 61
3 0 45 61 46
3 0 46 61 47
3 0 47 61 66
3 0 56 62 57
3 0 57 62 63
3 0 57 63 58
3 0 58 63 59
3 0 59 63 64
3 0 59 64 60
3 0 60 64 61
3 0 61 64 65
3 0 61 65 66
3 0 6 24 7
3 0 7 24 48
3 0 24 47 48
3 0 7 48 8
3 0 8 48 49
3 0 8 49 9
3 0 9 49 50
3 0 9 50 10
3 0 10 50 51
3 0 47 66 48
3 0 48 66 72
3 0 62 67 63
3 0 63 67 68
3 0 63 68 64
3 0 64 68 69
3 0 64 69 65
3 0 65 69 70
3 0 65 70 66
3 0 66 70 71
3 0 66 71 72
3 0 48 72 49
3 0 49 72 73
3 0 49 73 50
3 0 50 73 74
3 0 50 74 51
3 0 51 74 75
3 0 67 76 68
3 0 68 76 77
3 0 68 77 69
3 0 69 77 70
3 0 70 77 78
3 0 70 78 71
3 0 71 78 72
3 0 72 78 79
3 0 72 79 73
3 0 73 79 74
3 0 74 79 83
3 0 76 80 77
3 0 77 80 81
3 0 77 81 78
3 0 78 81 79
3 0 79 81 82
3 0 79 82 83
3 0 74 83 75
3 0 75 83 84
3 0 80 85 81
3 0 81 85 86
3 0 81 86 82
3 0 82 86 87
3 0 82 87 83
3 0 83 87 88
3 0 83 88 84
3 0 84 88 89
3 0 85 90 86
3 0 86 90 91
3 0 86 91 87
3 0 87 91 92
3 0 87 92 88
3 0 88 92 93
3 0 88 93 89
3 0 89 93 94
3 0 90 95 91
3 0 91 95 96
3 0 91 96 92
3 0 92 96 97
3 0 92 97 93
3 0 93 97 98
3 0 93 98 94
3 0 94 98 99
3 0 95 100 96
3 0 96 100 101
3 0 96 101 97
3 0 97 101 102
3 0 97 102 98
3 0 98 102 103
3 0 98 103 99
3 0 99 103 104
3 0 100 105 101
3 0 101 105 106
3 0 101 106 102
3 0 102 106 107
3 0 102 107 103
3 0 103 107 108
3 0 103 108 104
3 0 104 108 109
3 0 105 110 106
3 0 106 110 111
3 0 106 111 107
3 0 107 111 112
3 0 107 112 108
3 0 108 112 113
3 0 108 113 109
3 0 109 113 114
3 0 110 115 111
3 0 111 115 116
3 0 111 116 112
3 0 112 116 117
3 0 112 117 113
3 0 113 117 118
3 0 113 118 114
3 0 114 118 119
3 0 115 120 116
3 0 116 120 121
3 0 116 121 117
3 0 117 121 122
3 0 117 122 118
3 0 118 122 123
3 0 118 123 119
3 0 119 123 124
3 0 120 125 121
3 0 121 125 126
3 0 121 126 122
3 0 122 126 127
3 0 122 127 123
3 0 123 127 128
3 0 123 128 124
3 0 124 128 129
3 0 130 0 1
3 0 130 1 131
3 0 131 1 2
3 0 131 2 132
3 0 132 2 3
3 0 132 3 133
3 0 133 3 4
3 0 133 4 134
3 0 134 4 5
3 0 134 5 135
3 0 135 5 6
3 0 135 6 143
3 0 136 130 137
3 0 137 130 131
3 0 137 131 138
3 0 138 131 132
3 0 138 132 139
3 0 139 132 133
3 0 139 133 140
3 0 140 133 134
3 0 140 134 141
3 0 141 134 135
3 0 141 135 142
3 0 142 135 143
3 0 144 136 145
3 0 145 136 137
3 0 145 137 146
3 0 146 137 138
3 0 146 138 147
3 0 147 138 139
3 0 147 139 148
3 0 148 139 140
3 0 148 140 149
3 0 149 140 141
3 0 149 141 150
3 0 150 141 142
3 0 150 142 151
3 0 151 142 143
3 0 151 143 166
3 0 152 144 153
3 0 153 144 145
3 0 153 145 154
3 0 154 145 146
3 0 154 146 155
3 0 155 146 147
3 0 155 147 156
3 0 156 147 148
3 0 156 148 149
3 0 156 149 163
3 0 157 152 158
3 0 158 152 153
3 0 158 153 159
3 0 159 153 154
3 0 159 154 160
3 0 160 154 155
3 0 160 155 161
3 0 161 155 156
3 0 161 156 162
3 0 162 156 163
3 0 163 149 150
3 0 163 150 164
3 0 164 150 151
3 0 164 151 165
3 0 165 151 166
3 0 171 157 158
3 0 171 158 172
3 0 172 158 159
3 0 172 159 173
3 0 173 159 160
3 0 173 160 174
3 0 174 160 161
3 0 174 161 162
3 0 174 162 178
3 0 175 171 172
3 0 175 172 176
3 0 176 172 173
3 0 176 173 174
3 0 176 174 177
3 0 177 174 178
3 0 178 162 163
3 0 178 163 179
3 0 179 163 164
3 0 179 164 180
3 0 180 164 165
3 0 180 165 166
3 0 180 166 185
3 0 181 175 176
3 0 181 176 182
3 0 182 176 177
3 0 182 177 178
3 0 182 178 183
3 0 183 178 179
3 0 183 179 180
3 0 183 180 184
3 0 184 180 185
3 0 143 6 7
3 0 143 7 167
3 0 166 143 167
3 0 167 7 8
3 0 167 8 168
3 0 168 8 9
3 0 168 9 169
3 0 169 9 10
3 0 169 10 170
3 0 185 166 167
3 0 185 167 191
3 0 186 181 182
3 0 186 182 187
3 0 187 182 183
3 0 187 183 188
3 0 188 183 184
3 0 188 184 189
3 0 189 184 185
3 0 189 185 190
3 0 190 185 191
3 0 191 167 168
3 0 191 168 192
3 0 192 168 169
3 0 192 169 193
3 0 193 169 170
3 0 193 170 194
3 0 195 186 187
3 0 195 187 196
3 0 196 187 188
3 0 196 188 189
3 0 196 189 197
3 0 197 189 190
3 0 197 190 191
3 0 197 191 198
3 0 198 191 192
3 0 198 192 193
3 0 198 193 202
3 0 199 195 196
3 0 199 196 200
3 0 200 196 197
3 0 200 197 198
3 0 200 198 201
3 0 201 198 202
3 0 202 193 194
3 0 202 194 203
3 0 204 199 200
3 0 204 200 205
3 0 205 200 201
3 0 205 201 206
3 0 206 201 202
3 0 206 202 207
3 0 207 202 203
3 0 207 203 208
3 0 209 204 205
3 0 209 205 210
3 0 210 205 206
3 0 210 206 211
3 0 211 206 207
3 0 211 207 212
3 0 212 207 208
3 0 212 208 213
3 0 214 209 210
3 0 214 210 215
3 0 215 210 211
3 0 215 211 216
3 0 216 211 212
3 0 216 212 217
3 0 217 212 213
3 0 217 213 218
3 0 219 214 215
3 0 219 215 220
3 0 220 215 216
3 0 220 216 221
3 0 221 216 217
3 0 221 217 222
3 0 222 217 218
3 0 222 218 223
3 0 224 219 220
3 0 224 220 225
3 0 225 220 221
3 0 225 221 226
3 0 226 221 222
3 0 226 222 227
3 0 227 222 223
3 0 227 223 228
3 0 229 224 225
3 0 229 225 230
3 0 230 225 226
3 0 230 226 231
3 0 231 226 227
3 0 231 227 232
3 0 232 227 228
3 0 232 228 233
3 0 234 229 230
3 0 234 230 235
3 0 235 230 231
3 0 235 231 236
3 0 236 231 232
3 0 236 232 237
3 0 237 232 233
3 0 237 233 238
3 0 239 234 235
3 0 239 235 240
3 0 240 235 236
3 0 240 236 241
3 0 241 236 237
3 0 241 237 242
3 0 242 237 238
3 0 242 238 243
3 0 244 239 240
3 0 244 240 245
3 0 245 240 241
3 0 245 241 246
3 0 246 241 242
3 0 246 242 247
3 0 247 242 243
3 0 247 243 248
FACES:
2 1 129 124
2 1 124 119
2 1 119 114
2 1 114 109
2 1 109 104
2 1 104 99
2 1 99 94
2 1 94 89
2 1 89 84
2 1 84 75
2 1 75 51
2 1 51 10
2 10 0 11
2 10 11 17
2 10 17 25
2 10 25 33
2 10 33 38
2 1 38 52
2 1 52 56
2 1 56 62
2 1 62 67
2 1 67 76
2 1 76 80
2 1 80 85
2 1 85 90
2 1 90 95
2 1 95 100
2 1 100 105
2 1 105 110
2 1 110 115
2 1 115 120
2 1 120 125
2 1 125 126
2 1 126 127
2 1 127 128
2 1 128 129
2 1 243 248
2 1 238 243
2 1 233 238
2 1 228 233
2 1 223 228
2 1 218 223
2 1 213 218
2 1 208 213
2 1 203 208
2 1 194 203
2 1 170 194
2 1 10 170
2 10 130 0
2 10 136 130
2 10 144 136
2 10 152 144
2 10 157 152
2 1 171 157
2 1 175 171
2 1 181 175
2 1 186 181
2 1 195 186
2 1 199 195
2 1 204 199
2 1 209 204
2 1 214 209
2 1 219 214
2 1 224 219
2 1 229 224
2 1 234 229
2 1 239 234
2 1 244 239
2 1 245 244
2 1 246 245
2 1 247 246
2 1 248 247