POINTS:
0.0 0.25
0.0 0.3125
0.0 0.375
0.0 0.5
0.0 0.625
0.0 0.75
0.0 1.0
0.0625 0.25
0.0625 0.3125
0.0625 0.375
0.0625 0.4375
0.125 0.25
0.125 0.3125
0.125 0.375
0.125 0.4375
0.125 0.5
0.125 0.625
0.15625 0.25
0.15625 0.28125
0.15625 0.3125
0.15625 0.34375
0.1875 0.25
0.1875 0.28125
0.1875 0.3125
0.1875 0.34375
0.1875 0.375
0.1875 0.4375
0.21875 0.25
0.21875 0.28125
0.21875 0.3125
0.21875 0.34375
0.25 0.25
0.25 0.28125
0.25 0.3125
0.25 0.34375
0.25 0.375
0.25 0.4375
0.25 0.5
0.25 0.625
0.25 0.75
0.25 1.0
0.28125 0.21875
0.28125 0.25
0.28125 0.28125
0.28125 0.3125
0.28125 0.34375
0.3125 0.1875
0.3125 0.21875
0.3125 0.25
0.3125 0.28125
0.3125 0.3125
0.3125 0.34375
0.3125 0.375
0.3125 0.4375
0.34375 0.15625
0.34375 0.1875
0.34375 0.21875
0.34375 0.25
0.34375 0.28125
0.34375 0.3125
0.34375 0.34375
0.375 0.125
0.375 0.1875
0.375 0.25
0.375 0.3125
0.375 0.375
0.375 0.4375
0.375 0.5
0.375 0.625
0.4375 0.0625
0.4375 0.125
0.4375 0.1875
0.4375 0.25
0.4375 0.3125
0.4375 0.375
0.4375 0.4375
0.5 0.0
0.5 0.0625
0.5 0.125
0.5 0.25
0.5 0.375
0.5 0.5
0.5 0.625
0.5 0.75
0.5 1.0
0.5625 0.0
0.5625 0.0625
0.625 0.0
0.625 0.125
0.625 0.25
0.625 0.375
0.625 0.5
0.625 0.625
0.75 0.0
0.75 0.25
0.75 0.5
0.75 0.75
0.75 1.0
1.0 0.0
1.0 0.25
1.0 0.5
1.0 0.75
1.0 1.0
1.25 0.0
1.25 0.25
1.25 0.5
1.25 0.75
1.25 1.0
1.5 0.0
1.5 0.25
1.5 0.5
1.5 0.75
1.5 1.0
1.75 0.0
1.75 0.25
1.75 0.5
1.75 0.75
1.75 1.0
2.0 0.0
2.0 0.25
2.0 0.5
2.0 0.75
2.0 1.0
2.25 0.0
2.25 0.25
2.25 0.5
2.25 0.75
2.25 1.0
2.5 0.0
2.5 0.25
2.5 0.5
2.5 0.75
2.5 1.0
2.75 0.0
2.75 0.25
2.75 0.5
2.75 0.75
2.75 1.0
3.0 0.0
3.0 0.25
3.0 0.5
3.0 0.75
3.0 1.0
CELLS:
3 0 0 7 1
3 0 1 8 7
3 0 1 8 2
3 0 2 8 9
3 0 2 9 10
3 0 2 10 3
3 0 3 10 15
3 0 7 11 8
3 0 8 11 12
3 0 8 12 9
3 0 9 12 13
3 0 9 13 10
3 0 10 13 14
3 0 10 14 15
3 0 3 15 4
3 0 4 15 16
3 0 4 16 5
3 0 5 16 39
3 0 11 17 18
3 0 11 18 12
3 0 12 18 19
3 0 12 19 20
3 0 12 20 13
3 0 13 20 25
3 0 17 21 18
3 0 18 21 22
3 0 18 22 19
3 0 19 22 23
3 0 19 23 20
3 0 20 23 24
3 0 20 24 25
3 0 13 25 14
3 0 14 25 26
3 0 14 26 15
3 0 15 26 37
3 0 21 27 22
3 0 22 27 28
3 0 22 28 23
3 0 23 28 29
3 0 23 29 24
3 0 24 29 30
3 0 24 30 25
3 0 25 30 35
3 0 27 31 28
3 0 28 31 32
3 0 28 32 29
3 0 29 32 33
3 0 29 33 30
3 0 30 33 34
3 0 30 34 35
3 0 25 35 26
3 0 26 35 36
3 0 26 36 37
3 0 15 37 16
3 0 16 37 38
3 0 16 38 39
3 0 5 39 6
3 0 6 39 40
3 0 31 41 42
3 0 31 42 32
3 0 32 42 43
3 0 32 43 33
3 0 33 43 44
3 0 33 44 34
3 0 34 44 45
3 0 34 45 35
3 0 35 45 52
3 0 41 46 47
3 0 41 47 42
3 0 42 47 48
3 0 42 48 43
3 0 43 48 49
3 0 43 49 44
3 0 44 49 50
3 0 44 50 45
3 0 45 50 51
3 0 45 51 52
3 0 35 52 36
3 0 36 52 53
3 0 36 53 37
3 0 37 53 67
3 0 46 54 55
3 0 46 55 47
3 0 47 55 56
3 0 47 56 48
3 0 48 56 57
3 0 48 57 49
3 0 49 57 58
3 0 49 58 50
3 0 50 58 59
3 0 50 59 60
3 0 50 60 51
3 0 51 60 52
3 0 52 60 65
3 0 54 61 62
3 0 54 62 55
3 0 55 62 56
3 0 56 62 63
3 0 56 63 57
3 0 57 63 58
3 0 58 63 64
3 0 58 64 59
3 0 59 64 60
3 0 60 64 65
3 0 52 65 53
3 0 53 65 66
3 0 53 66 67
3 0 37 67 38
3 0 38 67 68
3 0 38 68 39
3 0 39 68 83
3 0 61 69 70
3 0 61 70 62
3 0 62 70 71
3 0 62 71 63
3 0 63 71 72
3 0 63 72 64
3 0 64 72 73
3 0 64 73 65
3 0 65 73 74
3 0 65 74 75
3 0 65 75 66
3 0 66 75 67
3 0 67 75 81
3 0 69 76 77
3 0 69 77 70
3 0 70 77 78
3 0 70 78 71
3 0 71 78 79
3 0 71 79 72
3 0 72 79 73
3 0 73 79 80
3 0 73 80 74
3 0 74 80 75
3 0 75 80 81
3 0 67 81 68
3 0 68 81 82
3 0 68 82 83
3 0 39 83 40
3 0 40 83 84
3 0 76 85 86
3 0 76 86 77
3 0 77 86 78
3 0 78 86 88
3 0 85 87 86
3 0 86 87 88
3 0 78 88 79
3 0 79 88 89
3 0 79 89 80
3 0 80 89 90
3 0 80 90 81
3 0 81 90 91
3 0 81 91 92
3 0 81 92 82
3 0 82 92 83
3 0 83 92 96
3 0 87 93 88
3 0 88 93 94
3 0 88 94 89
3 0 89 94 90
3 0 90 94 95
3 0 90 95 91
3 0 91 95 92
3 0 92 95 96
3 0 83 96 84
3 0 84 96 97
3 0 93 98 94
3 0 94 98 99
3 0 94 99 95
3 0 95 99 100
3 0 95 100 96
3 0 96 100 101
3 0 96 101 97
3 0 97 101 102
3 0 98 103 99
3 0 99 103 104
3 0 99 104 100
3 0 100 104 105
3 0 100 105 101
3 0 101 105 106
3 0 101 106 102
3 0 102 106 107
3 0 103 108 104
3 0 104 108 109
3 0 104 109 105
3 0 105 109 110
3 0 105 110 106
3 0 106 110 111
3 0 106 111 107
3 0 107 111 112
3 0 108 113 109
3 0 109 113 114
3 0 109 114 110
3 0 110 114 115
3 0 110 115 111
3 0 111 115 116
3 0 111 116 112
3 0 112 116 117
3 0 113 118 114
3 0 114 118 119
3 0 114 119 115
3 0 115 119 120
3 0 115 120 116
3 0 116 120 121
3 0 116 121 117
3 0 117 121 122
3 0 118 123 119
3 0 119 123 124
3 0 119 124 120
3 0 120 124 125
3 0 120 125 121
3 0 121 125 126
3 0 121 126 122
3 0 122 126 127
3 0 123 128 124
3 0 124 128 129
3 0 124 129 125
3 0 125 129 130
3 0 125 130 126
3 0 126 130 131
3 0 126 131 127
3 0 127 131 132
3 0 128 133 129
3 0 129 133 134
3 0 129 134 130
3 0 130 134 135
3 0 130 135 131
3 0 131 135 136
3 0 131 136 132
3 0 132 136 137
3 0 133 138 134
3 0 134 138 139
3 0 134 139 135
3 0 135 139 140
3 0 135 140 136
3 0 136 140 141
3 0 136 141 137
3 0 137 141 142
FACES:
2 1 142 137
2 1 137 132
2 1 132 127
2 1 127 122
2 1 122 117
2 1 117 112
2 1 112 107
2 1 107 102
2 1 102 97
2 1 97 84
2 1 84 40
2 1 40 6
2 77 6 5
2 77 5 4
2 77 4 3
2 77 3 2
2 77 2 1
2 77 1 0
2 10 0 7
2 10 7 11
2 10 11 17
2 10 17 21
2 10 21 27
2 10 27 31
2 10 31 41
2 10 41 46
2 10 46 54
2 10 54 61
2 10 61 69
2 10 69 76
2 1 76 85
2 1 85 87
2 1 87 93
2 1 93 98
2 1 98 103
2 1 103 108
2 1 108 113
2 1 113 118
2 1 118 123
2 1 123 128
2 1 128 133
2 1 133 138
2 1 138 139
2 1 139 140
2 1 140 141
2 1 141 142
