POINTS:
0.0 0.25
0.0 0.3125
0.0 0.375
0.0 0.5
0.0 0.625
0.0 0.6875
0.0 0.75
0.0 0.8125
0.0 0.84375
0.0 0.875
0.03125 0.84375
0.03125 0.875
0.0625 0.25
0.0625 0.3125
0.0625 0.375
0.0625 0.4375
0.0625 0.6875
0.0625 0.75
0.0625 0.8125
0.0625 0.84375
0.0625 0.875
0.09375 0.78125
0.09375 0.8125
0.09375 0.84375
0.09375 0.875
0.109375 0.859375
0.109375 0.875
0.125 0.25
0.125 0.3125
0.125 0.375
0.125 0.4375
0.125 0.5
0.125 0.625
0.125 0.6875
0.125 0.75
0.125 0.78125
0.125 0.8125
0.125 0.84375
0.125 0.859375
0.125 0.875
0.125 0.890625
0.125 0.90625
0.125 0.9375
0.125 0.96875
0.125 1.0
0.140625 0.859375
0.140625 0.875
0.140625 0.890625
0.15625 0.25
0.15625 0.28125
0.15625 0.3125
0.15625 0.34375
0.15625 0.78125
0.15625 0.8125
0.15625 0.84375
0.15625 0.875
0.15625 0.90625
0.15625 0.9375
0.15625 0.96875
0.1875 0.25
0.1875 0.28125
0.1875 0.3125
0.1875 0.34375
0.1875 0.375
0.1875 0.4375
0.1875 0.6875
0.1875 0.75
0.1875 0.78125
0.1875 0.8125
0.1875 0.84375
0.1875 0.875
0.1875 0.90625
0.1875 0.9375
0.1875 1.0
0.21875 0.25
0.21875 0.28125
0.21875 0.3125
0.21875 0.34375
0.21875 0.78125
0.21875 0.8125
0.21875 0.84375
0.21875 0.875
0.21875 0.90625
0.25 0.25
0.25 0.28125
0.25 0.3125
0.25 0.34375
0.25 0.375
0.25 0.4375
0.25 0.5
0.25 0.625
0.25 0.6875
0.25 0.75
0.25 0.8125
0.25 0.875
0.25 0.9375
0.25 1.0
0.28125 0.21875
0.28125 0.25
0.28125 0.28125
0.28125 0.3125
0.28125 0.34375
0.3125 0.1875
0.3125 0.21875
0.3125 0.25
0.3125 0.28125
0.3125 0.3125
0.3125 0.34375
0.3125 0.375
0.3125 0.4375
0.3125 0.6875
0.3125 0.75
0.3125 0.8125
0.3125 0.875
0.3125 0.9375
0.3125 1.0
0.34375 0.15625
0.34375 0.1875
0.34375 0.21875
0.34375 0.25
0.34375 0.28125
0.34375 0.3125
0.34375 0.34375
0.375 0.125
0.375 0.1875
0.375 0.25
0.375 0.3125
0.375 0.375
0.375 0.5
0.375 0.625
0.375 0.75
0.375 0.875
0.375 1.0
0.4375 0.0625
0.4375 0.125
0.4375 0.1875
0.4375 0.25
0.4375 0.3125
0.5 0.0
0.5 0.0625
0.5 0.125
0.5 0.25
0.5 0.375
0.5 0.5
0.5 0.625
0.5 0.75
0.5 1.0
0.5625 0.0
0.5625 0.0625
0.625 0.0
0.625 0.125
0.625 0.25
0.625 0.375
0.625 0.5
0.625 0.625
0.75 0.0
0.75 0.25
0.75 0.5
0.75 0.75
0.75 1.0
1.0 0.0
1.0 0.25
1.0 0.5
1.0 0.75
1.0 1.0
1.25 0.0
1.25 0.25
1.25 0.5
1.25 0.75
1.25 1.0
1.5 0.0
1.5 0.25
1.5 0.5
1.5 0.75
1.5 1.0
1.75 0.0
1.75 0.25
1.75 0.5
1.75 0.75
1.75 1.0
2.0 0.0
2.0 0.25
2.0 0.5
2.0 0.75
2.0 1.0
2.25 0.0
2.25 0.25
2.25 0.5
2.25 0.75
2.25 1.0
2.5 0.0
2.5 0.25
2.5 0.5
2.5 0.75
2.5 1.0
2.75 0.0
2.75 0.25
2.75 0.5
2.75 0.75
2.75 1.0
3.0 0.0
3.0 0.25
3.0 0.5
3.0 0.75
3.0 1.0
-0.03125 0.84375
-0.03125 0.875
-0.0625 0.25
-0.0625 0.3125
-0.0625 0.375
-0.0625 0.4375
-0.0625 0.6875
-0.0625 0.75
-0.0625 0.8125
-0.0625 0.84375
-0.0625 0.875
-0.09375 0.78125
-0.09375 0.8125
-0.09375 0.84375
-0.09375 0.875
-0.109375 0.859375
-0.109375 0.875
-0.125 0.25
-0.125 0.3125
-0.125 0.375
-0.125 0.4375
-0.125 0.5
-0.125 0.625
-0.125 0.6875
-0.125 0.75
-0.125 0.78125
-0.125 0.8125
-0.125 0.84375
-0.125 0.859375
-0.125 0.875
-0.125 0.890625
-0.125 0.90625
-0.125 0.9375
-0.125 0.96875
-0.125 1.0
-0.140625 0.859375
-0.140625 0.875
-0.140625 0.890625
-0.15625 0.25
-0.15625 0.28125
-0.15625 0.3125
-0.15625 0.34375
-0.15625 0.78125
-0.15625 0.8125
-0.15625 0.84375
-0.15625 0.875
-0.15625 0.90625
-0.15625 0.9375
-0.15625 0.96875
-0.1875 0.25
-0.1875 0.28125
-0.1875 0.3125
-0.1875 0.34375
-0.1875 0.375
-0.1875 0.4375
-0.1875 0.6875
-0.1875 0.75
-0.1875 0.78125
-0.1875 0.8125
-0.1875 0.84375
-0.1875 0.875
-0.1875 0.90625
-0.1875 0.9375
-0.1875 1.0
-0.21875 0.25
-0.21875 0.28125
-0.21875 0.3125
-0.21875 0.34375
-0.21875 0.78125
-0.21875 0.8125
-0.21875 0.84375
-0.21875 0.875
-0.21875 0.90625
-0.25 0.25
-0.25 0.28125
-0.25 0.3125
-0.25 0.34375
-0.25 0.375
-0.25 0.4375
-0.25 0.5
-0.25 0.625
-0.25 0.6875
-0.25 0.75
-0.25 0.8125
-0.25 0.875
-0.25 0.9375
-0.25 1.0
-0.28125 0.21875
-0.28125 0.25
-0.28125 0.28125
-0.28125 0.3125
-0.28125 0.34375
-0.3125 0.1875
-0.3125 0.21875
-0.3125 0.25
-0.3125 0.28125
-0.3125 0.3125
-0.3125 0.34375
-0.3125 0.375
-0.3125 0.4375
-0.3125 0.6875
-0.3125 0.75
-0.3125 0.8125
-0.3125 0.875
-0.3125 0.9375
-0.3125 1.0
-0.34375 0.15625
-0.34375 0.1875
-0.34375 0.21875
-0.34375 0.25
-0.34375 0.28125
-0.34375 0.3125
-0.34375 0.34375
-0.375 0.125
-0.375 0.1875
-0.375 0.25
-0.375 0.3125
-0.375 0.375
-0.375 0.5
-0.375 0.625
-0.375 0.75
-0.375 0.875
-0.375 1.0
-0.4375 0.0625
-0.4375 0.125
-0.4375 0.1875
-0.4375 0.25
-0.4375 0.3125
-0.5 0.0
-0.5 0.0625
-0.5 0.125
-0.5 0.25
-0.5 0.375
-0.5 0.5
-0.5 0.625
-0.5 0.75
-0.5 1.0
-0.5625 0.0
-0.5625 0.0625
-0.625 0.0
-0.625 0.125
-0.625 0.25
-0.625 0.375
-0.625 0.5
-0.625 0.625
-0.75 0.0
-0.75 0.25
-0.75 0.5
-0.75 0.75
-0.75 1.0
-1.0 0.0
-1.0 0.25
-1.0 0.5
-1.0 0.75
-1.0 1.0
-1.25 0.0
-1.25 0.25
-1.25 0.5
-1.25 0.75
-1.25 1.0
-1.5 0.0
-1.5 0.25
-1.5 0.5
-1.5 0.75
-1.5 1.0
-1.75 0.0
-1.75 0.25
-1.75 0.5
-1.75 0.75
-1.75 1.0
-2.0 0.0
-2.0 0.25
-2.0 0.5
-2.0 0.75
-2.0 1.0
-2.25 0.0
-2.25 0.25
-2.25 0.5
-2.25 0.75
-2.25 1.0
-2.5 0.0
-2.5 0.25
-2.5 0.5
-2.5 0.75
-2.5 1.0
-2.75 0.0
-2.75 0.25
-2.75 0.5
-2.75 0.75
-2.75 1.0
-3.0 0.0
-3.0 0.25
-3.0 0.5
-3.0 0.75
-3.0 1.0
CELLS:
3 0 0 12 1
3 0 1 12 13
3 0 12 27 13
3 0 13 27 28
3 0 1 13 2
3 0 2 13 14
3 0 13 28 14
3 0 14 28 29
3 0 2 14 15
3 0 14 29 15
3 0 15 29 30
3 0 15 30 31
3 0 15 31 3
3 0 2 15 3
3 0 3 31 4
3 0 4 31 32
3 0 4 32 16
3 0 4 16 5
3 0 16 32 33
3 0 5 16 6
3 0 6 16 17
3 0 16 33 17
3 0 17 33 34
3 0 6 17 7
3 0 7 17 18
3 0 17 34 21
3 0 21 34 35
3 0 21 35 22
3 0 22 35 36
3 0 18 21 22
3 0 17 21 18
3 0 7 10 8
3 0 7 18 10
3 0 10 18 19
3 0 8 10 9
3 0 9 10 11
3 0 10 19 11
3 0 11 19 20
3 0 18 22 19
3 0 19 22 23
3 0 22 36 23
3 0 23 36 37
3 0 19 23 20
3 0 20 23 24
3 0 23 37 25
3 0 25 37 38
3 0 25 38 39
3 0 25 39 26
3 0 24 25 26
3 0 23 25 24
3 0 27 48 49
3 0 48 59 49
3 0 49 59 60
3 0 59 74 60
3 0 60 74 75
3 0 74 83 75
3 0 75 83 84
3 0 27 49 28
3 0 28 49 50
3 0 49 60 50
3 0 50 60 61
3 0 60 75 61
3 0 61 75 76
3 0 75 84 76
3 0 76 84 85
3 0 28 50 51
3 0 50 61 51
3 0 51 61 62
3 0 61 76 62
3 0 62 76 77
3 0 76 85 77
3 0 77 85 86
3 0 28 51 29
3 0 29 51 63
3 0 51 62 63
3 0 62 77 63
3 0 63 77 87
3 0 77 86 87
3 0 29 63 30
3 0 30 63 64
3 0 63 87 64
3 0 64 87 88
3 0 30 64 31
3 0 31 64 89
3 0 64 88 89
3 0 31 89 32
3 0 32 89 90
3 0 32 65 33
3 0 32 90 65
3 0 65 90 91
3 0 33 65 34
3 0 34 65 66
3 0 65 91 66
3 0 66 91 92
3 0 34 52 35
3 0 34 66 52
3 0 52 66 67
3 0 66 78 67
3 0 66 92 78
3 0 78 92 93
3 0 35 52 36
3 0 36 52 53
3 0 52 67 53
3 0 53 67 68
3 0 67 78 68
3 0 68 78 79
3 0 78 93 79
3 0 36 53 37
3 0 37 53 54
3 0 53 68 54
3 0 54 68 69
3 0 68 79 69
3 0 69 79 80
3 0 79 93 80
3 0 80 93 94
3 0 37 54 45
3 0 45 54 55
3 0 45 55 46
3 0 39 45 46
3 0 38 45 39
3 0 37 45 38
3 0 54 69 55
3 0 55 69 70
3 0 69 80 70
3 0 70 80 81
3 0 80 94 81
3 0 39 46 47
3 0 46 55 47
3 0 47 55 56
3 0 47 56 41
3 0 40 47 41
3 0 39 47 40
3 0 55 70 56
3 0 56 70 71
3 0 70 81 71
3 0 71 81 82
3 0 81 94 82
3 0 82 94 95
3 0 41 56 42
3 0 42 56 57
3 0 56 71 57
3 0 57 71 72
3 0 71 82 72
3 0 72 82 95
3 0 42 57 43
3 0 43 57 58
3 0 57 72 58
3 0 58 72 73
3 0 43 58 44
3 0 44 58 73
3 0 72 95 73
3 0 73 95 96
3 0 116 123 124
3 0 102 116 117
3 0 116 124 117
3 0 97 102 103
3 0 102 117 103
3 0 103 117 118
3 0 117 124 118
3 0 118 124 125
3 0 83 97 98
3 0 97 103 98
3 0 98 103 104
3 0 103 118 104
3 0 104 118 119
3 0 118 125 119
3 0 83 98 84
3 0 84 98 99
3 0 98 104 99
3 0 99 104 105
3 0 104 119 105
3 0 105 119 120
3 0 119 125 120
3 0 120 125 126
3 0 84 99 85
3 0 85 99 100
3 0 99 105 100
3 0 100 105 106
3 0 105 120 106
3 0 106 120 121
3 0 120 126 121
3 0 85 100 86
3 0 86 100 101
3 0 100 106 101
3 0 101 106 107
3 0 106 121 107
3 0 107 121 122
3 0 121 126 122
3 0 122 126 127
3 0 86 101 87
3 0 87 101 108
3 0 101 107 108
3 0 107 122 108
3 0 108 122 127
3 0 87 108 88
3 0 88 108 109
3 0 108 127 109
3 0 109 127 128
3 0 89 109 128
3 0 88 109 89
3 0 89 128 90
3 0 90 128 129
3 0 90 129 110
3 0 110 129 130
3 0 110 130 111
3 0 92 110 111
3 0 91 110 92
3 0 90 110 91
3 0 92 111 93
3 0 93 111 112
3 0 111 130 112
3 0 112 130 131
3 0 93 112 94
3 0 94 112 113
3 0 112 131 113
3 0 94 113 95
3 0 95 113 114
3 0 113 131 114
3 0 114 131 132
3 0 95 114 96
3 0 96 114 115
3 0 114 132 115
3 0 133 138 139
3 0 123 133 134
3 0 133 139 134
3 0 134 139 140
3 0 123 134 124
3 0 124 134 135
3 0 134 140 135
3 0 135 140 141
3 0 124 135 125
3 0 125 135 136
3 0 135 141 136
3 0 125 136 126
3 0 126 136 137
3 0 136 141 137
3 0 137 141 142
3 0 126 137 127
3 0 127 137 142
3 0 127 142 128
3 0 128 142 143
3 0 128 143 129
3 0 129 143 144
3 0 129 144 130
3 0 130 144 145
3 0 130 145 131
3 0 131 145 146
3 0 131 146 132
3 0 138 147 139
3 0 139 147 148
3 0 147 149 148
3 0 148 149 150
3 0 139 148 140
3 0 140 148 150
3 0 149 155 150
3 0 150 155 156
3 0 140 150 141
3 0 141 150 151
3 0 150 156 151
3 0 141 151 142
3 0 142 151 152
3 0 151 156 152
3 0 152 156 157
3 0 142 152 143
3 0 143 152 153
3 0 152 157 153
3 0 143 153 144
3 0 144 153 154
3 0 153 157 154
3 0 154 157 158
3 0 144 154 145
3 0 145 154 158
3 0 145 159 146
3 0 145 158 159
3 0 155 160 156
3 0 156 160 161
3 0 156 161 157
3 0 157 161 162
3 0 157 163 158
3 0 157 162 163
3 0 158 164 159
3 0 158 163 164
3 0 160 165 161
3 0 161 165 166
3 0 161 166 162
3 0 162 166 167
3 0 162 168 163
3 0 162 167 168
3 0 163 169 164
3 0 163 168 169
3 0 165 170 166
3 0 166 170 171
3 0 166 171 167
3 0 167 171 172
3 0 167 173 168
3 0 167 172 173
3 0 168 174 169
3 0 168 173 174
3 0 170 175 171
3 0 171 175 176
3 0 171 176 172
3 0 172 176 177
3 0 172 178 173
3 0 172 177 178
3 0 173 179 174
3 0 173 178 179
3 0 175 180 176
3 0 176 180 181
3 0 176 181 177
3 0 177 181 182
3 0 177 183 178
3 0 177 182 183
3 0 178 184 179
3 0 178 183 184
3 0 180 185 181
3 0 181 185 186
3 0 181 186 182
3 0 182 186 187
3 0 182 188 183
3 0 182 187 188
3 0 183 189 184
3 0 183 188 189
3 0 185 190 186
3 0 186 190 191
3 0 186 191 187
3 0 187 191 192
3 0 187 193 188
3 0 187 192 193
3 0 188 194 189
3 0 188 193 194
3 0 190 195 191
3 0 191 195 196
3 0 191 196 192
3 0 192 196 197
3 0 192 198 193
3 0 192 197 198
3 0 193 199 194
3 0 193 198 199
3 0 195 200 196
3 0 196 200 201
3 0 196 201 197
3 0 197 201 202
3 0 197 203 198
3 0 197 202 203
3 0 198 204 199
3 0 198 203 204
3 0 207 0 1
3 0 207 1 208
3 0 222 207 208
3 0 222 208 223
3 0 208 1 2
3 0 208 2 209
3 0 223 208 209
3 0 223 209 224
3 0 209 2 210
3 0 224 209 210
3 0 224 210 225
3 0 225 210 226
3 0 226 210 3
3 0 210 2 3
3 0 226 3 4
3 0 226 4 227
3 0 227 4 211
3 0 211 4 5
3 0 227 211 228
3 0 211 5 6
3 0 211 6 212
3 0 228 211 212
3 0 228 212 229
3 0 212 6 7
3 0 212 7 213
3 0 229 212 216
3 0 229 216 230
3 0 230 216 217
3 0 230 217 231
3 0 216 213 217
3 0 216 212 213
3 0 205 7 8
3 0 213 7 205
3 0 213 205 214
3 0 205 8 9
3 0 205 9 206
3 0 214 205 206
3 0 214 206 215
3 0 217 213 214
3 0 217 214 218
3 0 231 217 218
3 0 231 218 232
3 0 218 214 215
3 0 218 215 219
3 0 232 218 220
3 0 232 220 233
3 0 233 220 234
3 0 234 220 221
3 0 220 219 221
3 0 220 218 219
3 0 243 222 244
3 0 254 243 244
3 0 254 244 255
3 0 269 254 255
3 0 269 255 270
3 0 278 269 270
3 0 278 270 279
3 0 244 222 223
3 0 244 223 245
3 0 255 244 245
3 0 255 245 256
3 0 270 255 256
3 0 270 256 271
3 0 279 270 271
3 0 279 271 280
3 0 245 223 246
3 0 256 245 246
3 0 256 246 257
3 0 271 256 257
3 0 271 257 272
3 0 280 271 272
3 0 280 272 281
3 0 246 223 224
3 0 246 224 258
3 0 257 246 258
3 0 272 257 258
3 0 272 258 282
3 0 281 272 282
3 0 258 224 225
3 0 258 225 259
3 0 282 258 259
3 0 282 259 283
3 0 259 225 226
3 0 259 226 284
3 0 283 259 284
3 0 284 226 227
3 0 284 227 285
3 0 260 227 228
3 0 285 227 260
3 0 285 260 286
3 0 260 228 229
3 0 260 229 261
3 0 286 260 261
3 0 286 261 287
3 0 247 229 230
3 0 261 229 247
3 0 261 247 262
3 0 273 261 262
3 0 287 261 273
3 0 287 273 288
3 0 247 230 231
3 0 247 231 248
3 0 262 247 248
3 0 262 248 263
3 0 273 262 263
3 0 273 263 274
3 0 288 273 274
3 0 248 231 232
3 0 248 232 249
3 0 263 248 249
3 0 263 249 264
3 0 274 263 264
3 0 274 264 275
3 0 288 274 275
3 0 288 275 289
3 0 249 232 240
3 0 249 240 250
3 0 250 240 241
3 0 240 234 241
3 0 240 233 234
3 0 240 232 233
3 0 264 249 250
3 0 264 250 265
3 0 275 264 265
3 0 275 265 276
3 0 289 275 276
3 0 241 234 242
3 0 250 241 242
3 0 250 242 251
3 0 251 242 236
3 0 242 235 236
3 0 242 234 235
3 0 265 250 251
3 0 265 251 266
3 0 276 265 266
3 0 276 266 277
3 0 289 276 277
3 0 289 277 290
3 0 251 236 237
3 0 251 237 252
3 0 266 251 252
3 0 266 252 267
3 0 277 266 267
3 0 277 267 290
3 0 252 237 238
3 0 252 238 253
3 0 267 252 253
3 0 267 253 268
3 0 253 238 239
3 0 253 239 268
3 0 290 267 268
3 0 290 268 291
3 0 318 311 319
3 0 311 297 312
3 0 319 311 312
3 0 297 292 298
3 0 312 297 298
3 0 312 298 313
3 0 319 312 313
3 0 319 313 320
3 0 292 278 293
3 0 298 292 293
3 0 298 293 299
3 0 313 298 299
3 0 313 299 314
3 0 320 313 314
3 0 293 278 279
3 0 293 279 294
3 0 299 293 294
3 0 299 294 300
3 0 314 299 300
3 0 314 300 315
3 0 320 314 315
3 0 320 315 321
3 0 294 279 280
3 0 294 280 295
3 0 300 294 295
3 0 300 295 301
3 0 315 300 301
3 0 315 301 316
3 0 321 315 316
3 0 295 280 281
3 0 295 281 296
3 0 301 295 296
3 0 301 296 302
3 0 316 301 302
3 0 316 302 317
3 0 321 316 317
3 0 321 317 322
3 0 296 281 282
3 0 296 282 303
3 0 302 296 303
3 0 317 302 303
3 0 317 303 322
3 0 303 282 283
3 0 303 283 304
3 0 322 303 304
3 0 322 304 323
3 0 304 284 323
3 0 304 283 284
3 0 323 284 285
3 0 323 285 324
3 0 324 285 305
3 0 324 305 325
3 0 325 305 306
3 0 305 287 306
3 0 305 286 287
3 0 305 285 286
3 0 306 287 288
3 0 306 288 307
3 0 325 306 307
3 0 325 307 326
3 0 307 288 289
3 0 307 289 308
3 0 326 307 308
3 0 308 289 290
3 0 308 290 309
3 0 326 308 309
3 0 326 309 327
3 0 309 290 291
3 0 309 291 310
3 0 327 309 310
3 0 333 328 334
3 0 328 318 329
3 0 334 328 329
3 0 334 329 335
3 0 329 318 319
3 0 329 319 330
3 0 335 329 330
3 0 335 330 336
3 0 330 319 320
3 0 330 320 331
3 0 336 330 331
3 0 331 320 321
3 0 331 321 332
3 0 336 331 332
3 0 336 332 337
3 0 332 321 322
3 0 332 322 337
3 0 337 322 323
3 0 337 323 338
3 0 338 323 324
3 0 338 324 339
3 0 339 324 325
3 0 339 325 340
3 0 340 325 326
3 0 340 326 341
3 0 341 326 327
3 0 342 333 334
3 0 342 334 343
3 0 344 342 343
3 0 344 343 345
3 0 343 334 335
3 0 343 335 345
3 0 350 344 345
3 0 350 345 351
3 0 345 335 336
3 0 345 336 346
3 0 351 345 346
3 0 346 336 337
3 0 346 337 347
3 0 351 346 347
3 0 351 347 352
3 0 347 337 338
3 0 347 338 348
3 0 352 347 348
3 0 348 338 339
3 0 348 339 349
3 0 352 348 349
3 0 352 349 353
3 0 349 339 340
3 0 349 340 353
3 0 354 340 341
3 0 353 340 354
3 0 355 350 351
3 0 355 351 356
3 0 356 351 352
3 0 356 352 357
3 0 358 352 353
3 0 357 352 358
3 0 359 353 354
3 0 358 353 359
3 0 360 355 356
3 0 360 356 361
3 0 361 356 357
3 0 361 357 362
3 0 363 357 358
3 0 362 357 363
3 0 364 358 359
3 0 363 358 364
3 0 365 360 361
3 0 365 361 366
3 0 366 361 362
3 0 366 362 367
3 0 368 362 363
3 0 367 362 368
3 0 369 363 364
3 0 368 363 369
3 0 370 365 366
3 0 370 366 371
3 0 371 366 367
3 0 371 367 372
3 0 373 367 368
3 0 372 367 373
3 0 374 368 369
3 0 373 368 374
3 0 375 370 371
3 0 375 371 376
3 0 376 371 372
3 0 376 372 377
3 0 378 372 373
3 0 377 372 378
3 0 379 373 374
3 0 378 373 379
3 0 380 375 376
3 0 380 376 381
3 0 381 376 377
3 0 381 377 382
3 0 383 377 378
3 0 382 377 383
3 0 384 378 379
3 0 383 378 384
3 0 385 380 381
3 0 385 381 386
3 0 386 381 382
3 0 386 382 387
3 0 388 382 383
3 0 387 382 388
3 0 389 383 384
3 0 388 383 389
3 0 390 385 386
3 0 390 386 391
3 0 391 386 387
3 0 391 387 392
3 0 393 387 388
3 0 392 387 393
3 0 394 388 389
3 0 393 388 394
3 0 395 390 391
3 0 395 391 396
3 0 396 391 392
3 0 396 392 397
3 0 398 392 393
3 0 397 392 398
3 0 399 393 394
3 0 398 393 399
FACES:
2 1 0 12
2 1 12 27
2 1 27 48
2 1 48 59
2 1 59 74
2 1 74 83
2 1 83 97
2 1 97 102
2 1 102 116
2 1 116 123
2 1 123 133
2 1 133 147
2 1 147 149
2 1 149 155
2 1 155 160
2 1 160 165
2 1 165 170
2 1 170 175
2 1 175 180
2 1 180 185
2 1 185 190
2 1 190 195
2 1 195 200
2 1 200 201
2 1 201 202
2 1 202 203
2 1 203 204
2 1 204 199
2 1 199 194
2 1 194 189
2 1 189 184
2 1 184 179
2 1 179 174
2 1 174 169
2 1 169 164
2 1 164 159
2 1 159 146
2 1 146 132
2 1 132 115
2 1 115 96
2 1 96 73
2 1 73 44
2 1 44 43
2 1 43 42
2 1 42 41
2 1 41 40
2 1 40 39
2 1 39 26
2 1 26 24
2 1 24 20
2 1 20 11
2 1 11 9
2 1 207 0
2 1 222 207
2 1 243 222
2 1 254 243
2 1 269 254
2 1 278 269
2 1 292 278
2 1 297 292
2 1 311 297
2 1 318 311
2 1 328 318
2 1 342 328
2 1 344 342
2 1 350 344
2 1 355 350
2 1 360 355
2 1 365 360
2 1 370 365
2 1 375 370
2 1 380 375
2 1 385 380
2 1 390 385
2 1 395 390
2 1 396 395
2 1 397 396
2 1 398 397
2 1 399 398
2 1 394 399
2 1 389 394
2 1 384 389
2 1 379 384
2 1 374 379
2 1 369 374
2 1 364 369
2 1 359 364
2 1 354 359
2 1 341 354
2 1 327 341
2 1 310 327
2 1 291 310
2 1 268 291
2 1 239 268
2 1 238 239
2 1 237 238
2 1 236 237
2 1 235 236
2 1 234 235
2 1 221 234
2 1 219 221
2 1 215 219
2 1 206 215
2 1 9 206