POINTS:
-7 0
-7 1
-6 0
-6 1
-5 0
-5 1
-4 0
-4 1
-3 0
-3 1
-2 0
-2 1
-1 0
-1 1
0 0
0 1
1 0
1 1
2 0
2 1
3 0
3 1
4 0
4 1
5 0
5 1
6 0
6 1
7 0
7 1
CELLS:
4 1 0 2 3 1
4 1 2 4 5 3
4 1 4 6 7 5
4 1 6 8 9 7
4 1 8 10 11 9
4 1 10 12 13 11
4 1 12 14 15 13
4 1 14 16 17 15
4 1 16 18 19 17
4 1 18 20 21 19
4 1 20 22 23 21
4 1 22 24 25 23
4 1 24 26 27 25
4 1 26 28 29 27