POINTS:
0.0 0.46875
0.0 0.5
0.0 0.5625
0.0 0.625
0.0 0.75
0.0 0.875
0.0 1.0
0.0625 0.46875
0.0625 0.5
0.0625 0.5625
0.125 0.46875
0.125 0.5
0.125 0.5625
0.125 0.625
0.125 0.75
0.1875 0.46875
0.1875 0.5
0.1875 0.5625
0.25 0.46875
0.25 0.5
0.25 0.5625
0.25 0.625
0.25 0.75
0.25 0.875
0.25 1.0
0.3125 0.46875
0.3125 0.5
0.3125 0.5625
0.375 0.46875
0.375 0.5
0.375 0.5625
0.375 0.625
0.375 0.75
0.4375 0.46875
0.4375 0.5
0.4375 0.5625
0.5 0.46875
0.5 0.5
0.5 0.5625
0.5 0.625
0.5 0.75
0.5 0.875
0.5 1.0
0.5625 0.46875
0.5625 0.5
0.5625 0.5625
0.5625 0.625
0.5625 0.6875
0.625 0.46875
0.625 0.5
0.625 0.5625
0.625 0.625
0.625 0.6875
0.625 0.75
0.625 0.875
0.65625 0.46875
0.65625 0.5
0.65625 0.53125
0.6875 0.46875
0.6875 0.5
0.6875 0.53125
0.6875 0.5625
0.6875 0.625
0.6875 0.6875
0.703125 0.46875
0.703125 0.484375
0.71875 0.0
0.71875 0.0625
0.71875 0.125
0.71875 0.1875
0.71875 0.25
0.71875 0.3125
0.71875 0.375
0.71875 0.40625
0.71875 0.4375
0.71875 0.453125
0.71875 0.46875
0.71875 0.484375
0.71875 0.5
0.71875 0.53125
0.734375 0.453125
0.734375 0.46875
0.734375 0.484375
0.75 0.0
0.75 0.0625
0.75 0.125
0.75 0.1875
0.75 0.25
0.75 0.3125
0.75 0.375
0.75 0.40625
0.75 0.4375
0.75 0.46875
0.75 0.5
0.75 0.53125
0.75 0.5625
0.75 0.625
0.75 0.6875
0.75 0.75
0.75 0.875
0.75 1.0
0.78125 0.40625
0.78125 0.4375
0.78125 0.46875
0.78125 0.5
0.78125 0.53125
0.8125 0.0
0.8125 0.0625
0.8125 0.125
0.8125 0.1875
0.8125 0.25
0.8125 0.3125
0.8125 0.375
0.8125 0.4375
0.8125 0.5
0.8125 0.5625
0.8125 0.625
0.8125 0.6875
0.875 0.0
0.875 0.0625
0.875 0.125
0.875 0.1875
0.875 0.25
0.875 0.3125
0.875 0.375
0.875 0.4375
0.875 0.5
0.875 0.5625
0.875 0.625
0.875 0.6875
0.875 0.75
0.875 0.875
0.9375 0.0
0.9375 0.0625
0.9375 0.125
0.9375 0.1875
0.9375 0.25
0.9375 0.3125
0.9375 0.375
0.9375 0.4375
0.9375 0.5
0.9375 0.5625
0.9375 0.625
0.9375 0.6875
1.0 0.0
1.0 0.125
1.0 0.25
1.0 0.375
1.0 0.5
1.0 0.625
1.0 0.75
1.0 0.875
1.0 1.0
1.125 0.0
1.125 0.125
1.125 0.25
1.125 0.375
1.125 0.5
1.125 0.625
1.125 0.75
1.125 0.875
1.25 0.0
1.25 0.25
1.25 0.5
1.25 0.75
1.25 1.0
1.5 0.0
1.5 0.25
1.5 0.5
1.5 0.75
1.5 1.0
1.75 0.0
1.75 0.25
1.75 0.5
1.75 0.75
1.75 1.0
2.0 0.0
2.0 0.25
2.0 0.5
2.0 0.75
2.0 1.0
2.25 0.0
2.25 0.25
2.25 0.5
2.25 0.75
2.25 1.0
2.5 0.0
2.5 0.25
2.5 0.5
2.5 0.75
2.5 1.0
2.75 0.0
2.75 0.25
2.75 0.5
2.75 0.75
2.75 1.0
3.0 0.0
3.0 0.25
3.0 0.5
3.0 0.75
3.0 1.0
CELLS:
3 0 0 7 8
3 0 0 8 1
3 0 1 8 9
3 0 1 9 2
3 0 7 10 11
3 0 7 11 8
3 0 8 11 12
3 0 8 12 9
3 0 2 9 3
3 0 3 9 13
3 0 9 12 13
3 0 10 15 16
3 0 10 16 11
3 0 11 16 17
3 0 11 17 12
3 0 15 18 19
3 0 15 19 16
3 0 16 19 20
3 0 16 20 17
3 0 12 17 13
3 0 13 17 21
3 0 17 20 21
3 0 3 13 14
3 0 3 14 4
3 0 13 21 22
3 0 13 22 14
3 0 4 14 5
3 0 5 14 23
3 0 14 22 23
3 0 5 23 24
3 0 5 24 6
3 0 18 25 26
3 0 18 26 19
3 0 19 26 27
3 0 19 27 20
3 0 25 28 29
3 0 25 29 26
3 0 26 29 30
3 0 26 30 27
3 0 20 27 21
3 0 21 27 31
3 0 27 30 31
3 0 28 33 34
3 0 28 34 29
3 0 29 34 35
3 0 29 35 30
3 0 33 36 37
3 0 33 37 34
3 0 34 37 38
3 0 34 38 35
3 0 30 35 31
3 0 31 35 39
3 0 35 38 39
3 0 21 31 32
3 0 21 32 22
3 0 31 39 40
3 0 31 40 32
3 0 22 32 23
3 0 23 32 41
3 0 32 40 41
3 0 23 41 42
3 0 23 42 24
3 0 36 43 44
3 0 36 44 37
3 0 37 44 45
3 0 37 45 38
3 0 38 45 46
3 0 38 46 39
3 0 43 48 49
3 0 43 49 44
3 0 44 49 50
3 0 44 50 45
3 0 45 50 51
3 0 45 51 46
3 0 48 55 56
3 0 48 56 49
3 0 55 58 59
3 0 55 59 56
3 0 49 56 57
3 0 49 57 50
3 0 50 57 61
3 0 57 60 61
3 0 56 59 60
3 0 56 60 57
3 0 50 61 62
3 0 50 62 51
3 0 66 83 84
3 0 66 84 67
3 0 67 84 85
3 0 67 85 68
3 0 68 85 86
3 0 68 86 69
3 0 69 86 87
3 0 69 87 70
3 0 70 87 88
3 0 70 88 71
3 0 71 88 89
3 0 71 89 72
3 0 72 89 90
3 0 72 90 73
3 0 73 90 91
3 0 73 91 74
3 0 74 91 80
3 0 80 91 92
3 0 80 92 81
3 0 76 80 81
3 0 74 80 75
3 0 75 80 76
3 0 76 81 82
3 0 82 81 92
3 0 82 92 93
3 0 78 82 93
3 0 77 82 78
3 0 76 82 77
3 0 58 64 65
3 0 64 76 65
3 0 65 76 77
3 0 65 77 78
3 0 59 65 78
3 0 58 65 59
3 0 59 78 79
3 0 59 79 60
3 0 78 93 94
3 0 78 94 79
3 0 60 79 61
3 0 61 79 95
3 0 79 94 95
3 0 61 95 96
3 0 61 96 62
3 0 39 46 47
3 0 46 51 52
3 0 46 52 47
3 0 51 62 63
3 0 51 63 52
3 0 62 96 97
3 0 62 97 63
3 0 39 47 40
3 0 40 47 53
3 0 47 52 53
3 0 52 63 53
3 0 53 63 98
3 0 63 97 98
3 0 40 53 54
3 0 40 54 41
3 0 53 98 99
3 0 53 99 54
3 0 41 54 42
3 0 42 54 100
3 0 54 99 100
3 0 83 106 107
3 0 83 107 84
3 0 84 107 108
3 0 84 108 85
3 0 85 108 109
3 0 85 109 86
3 0 86 109 110
3 0 86 110 87
3 0 87 110 111
3 0 87 111 88
3 0 88 111 112
3 0 88 112 89
3 0 89 112 101
3 0 101 112 113
3 0 101 113 102
3 0 89 101 90
3 0 90 101 102
3 0 90 102 91
3 0 91 102 103
3 0 91 103 92
3 0 92 103 104
3 0 92 104 93
3 0 102 113 103
3 0 103 113 114
3 0 103 114 104
3 0 93 104 105
3 0 93 105 94
3 0 94 105 95
3 0 104 114 105
3 0 105 114 115
3 0 95 105 115
3 0 95 115 116
3 0 95 116 96
3 0 96 116 117
3 0 96 117 97
3 0 106 118 119
3 0 106 119 107
3 0 107 119 120
3 0 107 120 108
3 0 108 120 121
3 0 108 121 109
3 0 109 121 122
3 0 109 122 110
3 0 110 122 123
3 0 110 123 111
3 0 111 123 124
3 0 111 124 112
3 0 112 124 125
3 0 112 125 113
3 0 113 125 126
3 0 113 126 114
3 0 114 126 127
3 0 114 127 115
3 0 115 127 128
3 0 115 128 116
3 0 116 128 129
3 0 116 129 117
3 0 97 117 98
3 0 98 117 130
3 0 117 129 130
3 0 118 132 133
3 0 118 133 119
3 0 119 133 134
3 0 119 134 120
3 0 120 134 135
3 0 120 135 121
3 0 121 135 136
3 0 121 136 122
3 0 122 136 137
3 0 122 137 123
3 0 123 137 138
3 0 123 138 124
3 0 124 138 139
3 0 124 139 125
3 0 125 139 140
3 0 125 140 126
3 0 126 140 141
3 0 126 141 127
3 0 127 141 142
3 0 127 142 128
3 0 128 142 143
3 0 128 143 129
3 0 132 144 133
3 0 133 144 145
3 0 133 145 134
3 0 134 145 135
3 0 135 145 146
3 0 135 146 136
3 0 136 146 137
3 0 137 146 147
3 0 137 147 138
3 0 138 147 139
3 0 139 147 148
3 0 139 148 140
3 0 140 148 141
3 0 141 148 149
3 0 141 149 142
3 0 142 149 143
3 0 143 149 150
3 0 130 143 150
3 0 129 143 130
3 0 98 130 131
3 0 98 131 99
3 0 130 150 151
3 0 130 151 131
3 0 99 131 100
3 0 100 131 152
3 0 131 151 152
3 0 144 153 154
3 0 144 154 145
3 0 145 154 155
3 0 145 155 146
3 0 146 155 156
3 0 146 156 147
3 0 147 156 157
3 0 147 157 148
3 0 148 157 158
3 0 148 158 149
3 0 149 158 159
3 0 149 159 150
3 0 150 159 160
3 0 150 160 151
3 0 153 161 154
3 0 154 161 162
3 0 154 162 155
3 0 155 162 156
3 0 156 162 163
3 0 156 163 157
3 0 157 163 158
3 0 158 163 164
3 0 158 164 159
3 0 159 164 160
3 0 160 164 165
3 0 151 160 152
3 0 152 160 165
3 0 161 166 167
3 0 161 167 162
3 0 162 167 168
3 0 162 168 163
3 0 163 168 169
3 0 163 169 164
3 0 164 169 170
3 0 164 170 165
3 0 166 171 172
3 0 166 172 167
3 0 167 172 173
3 0 167 173 168
3 0 168 173 174
3 0 168 174 169
3 0 169 174 175
3 0 169 175 170
3 0 171 176 177
3 0 171 177 172
3 0 172 177 178
3 0 172 178 173
3 0 173 178 179
3 0 173 179 174
3 0 174 179 180
3 0 174 180 175
3 0 176 181 182
3 0 176 182 177
3 0 177 182 183
3 0 177 183 178
3 0 178 183 184
3 0 178 184 179
3 0 179 184 185
3 0 179 185 180
3 0 181 186 187
3 0 181 187 182
3 0 182 187 188
3 0 182 188 183
3 0 183 188 189
3 0 183 189 184
3 0 184 189 190
3 0 184 190 185
3 0 186 191 192
3 0 186 192 187
3 0 187 192 193
3 0 187 193 188
3 0 188 193 194
3 0 188 194 189
3 0 189 194 195
3 0 189 195 190
3 0 191 196 197
3 0 191 197 192
3 0 192 197 198
3 0 192 198 193
3 0 193 198 199
3 0 193 199 194
3 0 194 199 200
3 0 194 200 195
FACES:
2 1 200 195
2 1 195 190
2 1 190 185
2 1 185 180
2 1 180 175
2 1 175 170
2 1 170 165
2 1 165 152
2 1 152 100
2 1 100 42
2 1 42 24
2 1 24 6
2 77 6 5
2 77 5 4
2 77 4 3
2 77 3 2
2 77 2 1
2 77 1 0
2 10 0 7
2 10 7 10
2 10 10 15
2 10 15 18
2 10 18 25
2 10 25 28
2 10 28 33
2 10 33 36
2 10 36 43
2 10 43 48
2 10 48 55
2 10 55 58
2 10 58 64
2 10 64 76
2 10 76 75
2 10 75 74
2 10 74 73
2 10 73 72
2 10 72 71
2 10 71 70
2 10 70 69
2 10 69 68
2 10 68 67
2 10 67 66
2 1 66 83
2 1 83 106
2 1 106 118
2 1 118 132
2 1 132 144
2 1 144 153
2 1 153 161
2 1 161 166
2 1 166 171
2 1 171 176
2 1 176 181
2 1 181 186
2 1 186 191
2 1 191 196
2 1 196 197
2 1 197 198
2 1 198 199
2 1 199 200
