POINTS:
0.0 0.0625
0.0 0.078125
0.0 0.09375
0.0 0.125
0.0 0.15625
0.0 0.1875
0.0 0.25
0.0 0.375
0.0 0.5
0.0 0.75
0.0 1.0
0.0625 0.0625
0.0625 0.078125
0.0625 0.09375
0.0625 0.125
0.0625 0.15625
0.0625 0.1875
0.125 0.046875
0.125 0.0625
0.125 0.078125
0.125 0.09375
0.125 0.125
0.125 0.15625
0.125 0.1875
0.125 0.25
0.1875 0.03125
0.1875 0.046875
0.18755 0.0625
0.1875 0.078125
0.1875 0.09375
0.1875 0.125
0.1875 0.15625
0.1875 0.1875
0.21875 0.015625
0.21875 0.03125
0.21875 0.046875
0.21875 0.0625
0.21875 0.09375
0.25 0.0
0.25 0.015625
0.25 0.03125
0.25 0.046875
0.25 0.0625
0.25 0.09375
0.25 0.125
0.25 0.15625
0.25 0.1875
0.25 0.25
0.25 0.375
0.25 0.5
0.25 0.75
0.25 1.0
0.28125 0.0
0.28125 0.015625
0.28125 0.03125
0.28125 0.0625
0.3125 0.0
0.3125 0.03125
0.3125 0.0625
0.3125 0.09375
0.3125 0.125
0.3125 0.1875
0.375 0.0
0.375 0.0625
0.375 0.125
0.375 0.1875
0.375 0.25
0.5 0.0
0.5 0.0625
0.5 0.125
0.5 0.1875
0.5 0.25
0.5 0.375
0.5 0.5
0.5 0.75
0.5 1.0
0.625 0.0
0.625 0.125
0.625 0.25
0.625 0.5
0.75 0.0
0.75 0.25
0.75 0.5
0.75 0.75
0.75 1.0
1.0 0.0
1.0 0.25
1.0 0.5
1.0 0.75
1.0 1.0
1.25 0.0
1.25 0.25
1.25 0.5
1.25 0.75
1.25 1.0
1.5 0.0
1.5 0.25
1.5 0.5
1.5 0.75
1.5 1.0
1.75 0.0
1.75 0.25
1.75 0.5
1.75 0.75
1.75 1.0
2.0 0.0
2.0 0.25
2.0 0.5
2.0 0.75
2.0 1.0
2.25 0.0
2.25 0.25
2.25 0.5
2.25 0.75
2.25 1.0
2.5 0.0
2.5 0.25
2.5 0.5
2.5 0.75
2.5 1.0
2.75 0.0
2.75 0.25
2.75 0.5
2.75 0.75
2.75 1.0
3.0 0.0
3.0 0.25
3.0 0.5
3.0 0.75
3.0 1.0
CELLS:
3 0 0 11 1
3 0 1 11 12
3 0 1 12 2
3 0 2 12 13
3 0 2 13 3
3 0 3 13 14
3 0 3 14 4
3 0 4 14 15
3 0 4 15 5
3 0 5 15 16
3 0 5 16 6
3 0 6 16 24
3 0 11 17 18
3 0 11 18 12
3 0 12 18 19
3 0 12 19 13
3 0 13 19 20
3 0 13 20 14
3 0 14 20 21
3 0 14 21 15
3 0 15 21 22
3 0 15 22 16
3 0 16 22 23
3 0 16 23 24
3 0 17 25 26
3 0 17 26 18
3 0 18 26 27
3 0 18 27 19
3 0 19 27 28
3 0 19 28 20
3 0 20 28 29
3 0 20 29 21
3 0 21 29 30
3 0 21 30 22
3 0 22 30 31
3 0 22 31 23
3 0 23 31 32
3 0 23 32 24
3 0 24 32 47
3 0 25 33 34
3 0 25 34 26
3 0 26 34 35
3 0 26 35 27
3 0 27 35 36
3 0 27 36 28
3 0 28 36 37
3 0 28 37 29
3 0 29 37 30
3 0 30 37 44
3 0 33 38 39
3 0 33 39 34
3 0 34 39 40
3 0 34 40 35
3 0 35 40 41
3 0 35 41 36
3 0 36 41 42
3 0 36 42 37
3 0 37 42 43
3 0 37 43 44
3 0 30 44 31
3 0 31 44 45
3 0 31 45 32
3 0 32 45 46
3 0 32 46 47
3 0 38 52 39
3 0 39 52 53
3 0 39 53 40
3 0 40 53 54
3 0 40 54 41
3 0 41 54 55
3 0 41 55 42
3 0 42 55 43
3 0 43 55 59
3 0 52 56 53
3 0 53 56 57
3 0 53 57 54
3 0 54 57 55
3 0 55 57 58
3 0 55 58 59
3 0 43 59 44
3 0 44 59 60
3 0 44 60 45
3 0 45 60 61
3 0 45 61 46
3 0 46 61 47
3 0 47 61 66
3 0 56 62 57
3 0 57 62 63
3 0 57 63 58
3 0 58 63 59
3 0 59 63 64
3 0 59 64 60
3 0 60 64 61
3 0 61 64 65
3 0 61 65 66
3 0 6 24 7
3 0 7 24 48
3 0 24 47 48
3 0 7 48 8
3 0 8 48 49
3 0 8 49 9
3 0 9 49 50
3 0 9 50 10
3 0 10 50 51
3 0 47 66 48
3 0 48 66 72
3 0 62 67 63
3 0 63 67 68
3 0 63 68 64
3 0 64 68 69
3 0 64 69 65
3 0 65 69 70
3 0 65 70 66
3 0 66 70 71
3 0 66 71 72
3 0 48 72 49
3 0 49 72 73
3 0 49 73 50
3 0 50 73 74
3 0 50 74 51
3 0 51 74 75
3 0 67 76 68
3 0 68 76 77
3 0 68 77 69
3 0 69 77 70
3 0 70 77 78
3 0 70 78 71
3 0 71 78 72
3 0 72 78 79
3 0 72 79 73
3 0 73 79 74
3 0 74 79 83
3 0 76 80 77
3 0 77 80 81
3 0 77 81 78
3 0 78 81 79
3 0 79 81 82
3 0 79 82 83
3 0 74 83 75
3 0 75 83 84
3 0 80 85 81
3 0 81 85 86
3 0 81 86 82
3 0 82 86 87
3 0 82 87 83
3 0 83 87 88
3 0 83 88 84
3 0 84 88 89
3 0 85 90 86
3 0 86 90 91
3 0 86 91 87
3 0 87 91 92
3 0 87 92 88
3 0 88 92 93
3 0 88 93 89
3 0 89 93 94
3 0 90 95 91
3 0 91 95 96
3 0 91 96 92
3 0 92 96 97
3 0 92 97 93
3 0 93 97 98
3 0 93 98 94
3 0 94 98 99
3 0 95 100 96
3 0 96 100 101
3 0 96 101 97
3 0 97 101 102
3 0 97 102 98
3 0 98 102 103
3 0 98 103 99
3 0 99 103 104
3 0 100 105 101
3 0 101 105 106
3 0 101 106 102
3 0 102 106 107
3 0 102 107 103
3 0 103 107 108
3 0 103 108 104
3 0 104 108 109
3 0 105 110 106
3 0 106 110 111
3 0 106 111 107
3 0 107 111 112
3 0 107 112 108
3 0 108 112 113
3 0 108 113 109
3 0 109 113 114
3 0 110 115 111
3 0 111 115 116
3 0 111 116 112
3 0 112 116 117
3 0 112 117 113
3 0 113 117 118
3 0 113 118 114
3 0 114 118 119
3 0 115 120 116
3 0 116 120 121
3 0 116 121 117
3 0 117 121 122
3 0 117 122 118
3 0 118 122 123
3 0 118 123 119
3 0 119 123 124
3 0 120 125 121
3 0 121 125 126
3 0 121 126 122
3 0 122 126 127
3 0 122 127 123
3 0 123 127 128
3 0 123 128 124
3 0 124 128 129
FACES:
2 1 129 124
2 1 124 119
2 1 119 114
2 1 114 109
2 1 109 104
2 1 104 99
2 1 99 94
2 1 94 89
2 1 89 84
2 1 84 75
2 1 75 51
2 1 51 10
2 77 10 9
2 77 9 8
2 77 8 7
2 77 7 6
2 77 6 5
2 77 5 4
2 77 4 3
2 77 3 2
2 77 2 1
2 77 1 0
2 10 0 11
2 10 11 17
2 10 17 25
2 10 25 33
2 10 33 38
2 1 38 52
2 1 52 56
2 1 56 62
2 1 62 67
2 1 67 76
2 1 76 80
2 1 80 85
2 1 85 90
2 1 90 95
2 1 95 100
2 1 100 105
2 1 105 110
2 1 110 115
2 1 115 120
2 1 120 125
2 1 125 126
2 1 126 127
2 1 127 128
2 1 128 129
