POINTS:
0 0
1 0
2 0
3 0
0 1
1 1
2 1
3 1
0 2
1 2
2 2
3 2
0 3
1 3
2 3
3 3
CELLS:
4 1 ? ? ? ?
4 1 ? ? ? ?
4 1 ? ? ? ?
4 1 ? ? ? ?
4 1 ? ? ? ?
4 1 ? ? ? ?
4 1 ? ? ? ?
4 1 ? ? ? ?
FACES:
2 ? 0 1
2 ? 1 5
2 ? 5 6
2 ? 6 2
2 ? 2 3
2 ? 3 7
2 ? 7 11
2 ? 11 15
2 ? 15 14
2 ? 14 13
2 ? 13 12
2 ? 12 8
2 ? 8 4
2 ? 4 0
