POINTS:
0 0
1 0
2 0
3 0
0 1
1 1
2 1
3 1
0 2
1 2
2 2
3 2
0 3
1 3
2 3
3 3
CELLS:
4 1 0 1 5 4
4 1 1 2 6 5
4 1 2 3 7 6
4 1 4 5 9 8
4 1 6 7 11 10
4 1 8 9 13 12
4 1 9 10 14 13
4 1 10 11 15 14
FACES:
2 1 0 1
2 1 1 2
2 1 2 3
2 0 0 4
2 0 4 8
2 0 8 12
2 0 3 7
2 0 7 11
2 0 11 15
2 2 12 13
2 2 13 14
2 2 14 15
2 0 5 6
2 0 6 10
2 0 9 10
2 0 5 9
