POINTS
0	-5	0
600	-50	0
600	 50	0
0	  5	0
0	-5	100
600	-50	100
600	50	100
0	5	100
CELLS
8 0 0 1 2 3 4 5 6 7
FACES
4 3 4 5 6 7  // top
4 1 1 2 6 5  // right
4 3 0 1 5 4  // front
4 2 3 0 4 7  // left
4 3 2 3 7 6  // back
4 3 0 1 2 3  // bottom
