POINTS
0.00   0.00   0.00
1.00   0.00   0.00
1.00   1.00   0.00
0.00   1.00   0.00
0.00   0.00   1.00
1.00   0.00   1.00
1.00   1.00   1.00
0.00   1.00   1.00
CELLS
8 0 0 1 2 3 4 5 6 7
FACES
4 1 4 5 6 7  // top
4 1 1 2 6 5  // right
4 1 0 1 5 4  // front
4 1 3 0 4 7  // left
4 1 2 3 7 6  // back
4 1 0 1 2 3  // bottom