POINTS:
  0.000000   0.000000
  0.000000   0.062500
  0.000000   0.125000
  0.000000   0.187500
  0.000000   0.250000
  0.000000   0.312500
  0.000000   0.375000
  0.000000   0.437500
  0.000000   0.500000
  0.000000   0.562500
  0.000000   0.625000
  0.000000   0.687500
  0.000000   0.750000
  0.000000   0.812500
  0.000000   0.875000
  0.000000   0.937500
  0.000000   1.000000
  0.062500   0.000000
  0.062500   0.062500
  0.062500   0.125000
  0.062500   0.187500
  0.062500   0.250000
  0.062500   0.312500
  0.062500   0.375000
  0.062500   0.437500
  0.062500   0.500000
  0.062500   0.562500
  0.062500   0.625000
  0.062500   0.687500
  0.062500   0.750000
  0.062500   0.812500
  0.062500   0.875000
  0.062500   0.937500
  0.062500   1.000000
  0.125000   0.000000
  0.125000   0.062500
  0.125000   0.125000
  0.125000   0.187500
  0.125000   0.250000
  0.125000   0.312500
  0.125000   0.375000
  0.125000   0.437500
  0.125000   0.500000
  0.125000   0.562500
  0.125000   0.625000
  0.125000   0.687500
  0.125000   0.750000
  0.125000   0.812500
  0.125000   0.875000
  0.125000   0.937500
  0.125000   1.000000
  0.187500   0.000000
  0.187500   0.062500
  0.187500   0.125000
  0.187500   0.187500
  0.187500   0.250000
  0.187500   0.312500
  0.187500   0.375000
  0.187500   0.437500
  0.187500   0.500000
  0.187500   0.562500
  0.187500   0.625000
  0.187500   0.687500
  0.187500   0.750000
  0.187500   0.812500
  0.187500   0.875000
  0.187500   0.937500
  0.187500   1.000000
  0.250000   0.000000
  0.250000   0.062500
  0.250000   0.125000
  0.250000   0.187500
  0.250000   0.250000
  0.250000   0.312500
  0.250000   0.375000
  0.250000   0.437500
  0.250000   0.500000
  0.250000   0.562500
  0.250000   0.625000
  0.250000   0.687500
  0.250000   0.750000
  0.250000   0.812500
  0.250000   0.875000
  0.250000   0.937500
  0.250000   1.000000
  0.312500   0.000000
  0.312500   0.062500
  0.312500   0.125000
  0.312500   0.187500
  0.312500   0.250000
  0.312500   0.312500
  0.312500   0.375000
  0.312500   0.437500
  0.312500   0.500000
  0.312500   0.562500
  0.312500   0.625000
  0.312500   0.687500
  0.312500   0.750000
  0.312500   0.812500
  0.312500   0.875000
  0.312500   0.937500
  0.312500   1.000000
  0.375000   0.000000
  0.375000   0.062500
  0.375000   0.125000
  0.375000   0.187500
  0.375000   0.250000
  0.375000   0.312500
  0.375000   0.375000
  0.375000   0.437500
  0.375000   0.500000
  0.375000   0.562500
  0.375000   0.625000
  0.375000   0.687500
  0.375000   0.750000
  0.375000   0.812500
  0.375000   0.875000
  0.375000   0.937500
  0.375000   1.000000
  0.437500   0.000000
  0.437500   0.062500
  0.437500   0.125000
  0.437500   0.187500
  0.437500   0.250000
  0.437500   0.312500
  0.437500   0.375000
  0.437500   0.437500
  0.437500   0.500000
  0.437500   0.562500
  0.437500   0.625000
  0.437500   0.687500
  0.437500   0.750000
  0.437500   0.812500
  0.437500   0.875000
  0.437500   0.937500
  0.437500   1.000000
  0.500000   0.000000
  0.500000   0.062500
  0.500000   0.125000
  0.500000   0.187500
  0.500000   0.250000
  0.500000   0.312500
  0.500000   0.375000
  0.500000   0.437500
  0.500000   0.500000
  0.500000   0.562500
  0.500000   0.625000
  0.500000   0.687500
  0.500000   0.750000
  0.500000   0.812500
  0.500000   0.875000
  0.500000   0.937500
  0.500000   1.000000
  0.562500   0.000000
  0.562500   0.062500
  0.562500   0.125000
  0.562500   0.187500
  0.562500   0.250000
  0.562500   0.312500
  0.562500   0.375000
  0.562500   0.437500
  0.562500   0.500000
  0.562500   0.562500
  0.562500   0.625000
  0.562500   0.687500
  0.562500   0.750000
  0.562500   0.812500
  0.562500   0.875000
  0.562500   0.937500
  0.562500   1.000000
  0.625000   0.000000
  0.625000   0.062500
  0.625000   0.125000
  0.625000   0.187500
  0.625000   0.250000
  0.625000   0.312500
  0.625000   0.375000
  0.625000   0.437500
  0.625000   0.500000
  0.625000   0.562500
  0.625000   0.625000
  0.625000   0.687500
  0.625000   0.750000
  0.625000   0.812500
  0.625000   0.875000
  0.625000   0.937500
  0.625000   1.000000
  0.687500   0.000000
  0.687500   0.062500
  0.687500   0.125000
  0.687500   0.187500
  0.687500   0.250000
  0.687500   0.312500
  0.687500   0.375000
  0.687500   0.437500
  0.687500   0.500000
  0.687500   0.562500
  0.687500   0.625000
  0.687500   0.687500
  0.687500   0.750000
  0.687500   0.812500
  0.687500   0.875000
  0.687500   0.937500
  0.687500   1.000000
  0.750000   0.000000
  0.750000   0.062500
  0.750000   0.125000
  0.750000   0.187500
  0.750000   0.250000
  0.750000   0.312500
  0.750000   0.375000
  0.750000   0.437500
  0.750000   0.500000
  0.750000   0.562500
  0.750000   0.625000
  0.750000   0.687500
  0.750000   0.750000
  0.750000   0.812500
  0.750000   0.875000
  0.750000   0.937500
  0.750000   1.000000
  0.812500   0.000000
  0.812500   0.062500
  0.812500   0.125000
  0.812500   0.187500
  0.812500   0.250000
  0.812500   0.312500
  0.812500   0.375000
  0.812500   0.437500
  0.812500   0.500000
  0.812500   0.562500
  0.812500   0.625000
  0.812500   0.687500
  0.812500   0.750000
  0.812500   0.812500
  0.812500   0.875000
  0.812500   0.937500
  0.812500   1.000000
  0.875000   0.000000
  0.875000   0.062500
  0.875000   0.125000
  0.875000   0.187500
  0.875000   0.250000
  0.875000   0.312500
  0.875000   0.375000
  0.875000   0.437500
  0.875000   0.500000
  0.875000   0.562500
  0.875000   0.625000
  0.875000   0.687500
  0.875000   0.750000
  0.875000   0.812500
  0.875000   0.875000
  0.875000   0.937500
  0.875000   1.000000
  0.937500   0.000000
  0.937500   0.062500
  0.937500   0.125000
  0.937500   0.187500
  0.937500   0.250000
  0.937500   0.312500
  0.937500   0.375000
  0.937500   0.437500
  0.937500   0.500000
  0.937500   0.562500
  0.937500   0.625000
  0.937500   0.687500
  0.937500   0.750000
  0.937500   0.812500
  0.937500   0.875000
  0.937500   0.937500
  0.937500   1.000000
  1.000000   0.000000
  1.000000   0.062500
  1.000000   0.125000
  1.000000   0.187500
  1.000000   0.250000
  1.000000   0.312500
  1.000000   0.375000
  1.000000   0.437500
  1.000000   0.500000
  1.000000   0.562500
  1.000000   0.625000
  1.000000   0.687500
  1.000000   0.750000
  1.000000   0.812500
  1.000000   0.875000
  1.000000   0.937500
  1.000000   1.000000
CELLS:
3 1 150 167 151
3 1 213 230 214
3 1 236 253 237
3 1 11 29 12
3 1 137 155 138
3 1 196 212 213
3 1 5 22 6
3 1 63 80 81
3 1 68 85 69
3 1 189 206 207
3 1 98 97 115
3 1 160 178 161
3 1 91 108 92
3 1 74 90 91
3 1 200 217 201
3 1 263 280 264
3 1 27 44 45
3 1 153 170 171
3 1 62 61 79
3 1 183 199 200
3 1 188 187 205
3 1 131 113 130
3 1 176 193 194
3 1 257 239 256
3 1 210 228 211
3 1 285 286 269
3 1 38 54 55
3 1 262 279 280
3 1 140 141 124
3 1 250 267 251
3 1 26 25 43
3 1 147 163 164
3 1 14 31 32
3 1 140 157 158
3 1 48 66 49
3 1 112 111 129
3 1 175 174 192
3 1 249 250 233
3 1 100 117 118
3 1 226 243 244
3 1 134 152 135
3 1 105 122 106
3 1 2 18 19
3 1 261 260 278
3 1 41 42 25
3 1 104 105 88
3 1 151 168 152
3 1 214 231 215
3 1 12 30 13
3 1 138 156 139
3 1 197 213 214
3 1 6 23 7
3 1 64 81 82
3 1 127 144 145
3 1 69 86 70
3 1 190 207 208
3 1 98 116 99
3 1 236 237 220
3 1 225 224 242
3 1 92 109 93
3 1 52 68 69
3 1 75 91 92
3 1 201 218 202
3 1 264 281 265
3 1 28 45 46
3 1 154 171 172
3 1 62 80 63
3 1 200 201 184
3 1 189 188 206
3 1 56 73 57
3 1 177 194 195
3 1 119 136 120
3 1 240 257 258
3 1 286 287 270
3 1 211 229 212
3 1 39 55 56
3 1 165 182 166
3 1 141 142 125
3 1 26 44 27
3 1 148 164 165
3 1 15 32 33
3 1 96 78 95
3 1 21 20 37
3 1 141 158 159
3 1 49 67 50
3 1 113 112 130
3 1 176 175 193
3 1 204 221 222
3 1 234 250 251
3 1 239 238 256
3 1 106 123 107
3 1 227 244 245
3 1 3 19 20
3 1 262 261 279
3 1 105 106 89
3 1 215 232 216
3 1 42 59 60
3 1 13 31 14
3 1 77 76 94
3 1 139 157 140
3 1 198 214 215
3 1 7 24 8
3 1 128 145 146
3 1 70 87 71
3 1 100 99 117
3 1 191 208 209
3 1 226 225 243
3 1 53 69 70
3 1 179 196 180
3 1 92 93 76
3 1 202 219 203
3 1 265 282 266
3 1 162 178 179
3 1 29 46 47
3 1 34 51 35
3 1 64 63 81
3 1 155 172 173
3 1 185 201 202
3 1 264 265 248
3 1 190 189 207
3 1 133 115 132
3 1 57 74 58
3 1 259 241 258
3 1 287 288 271
3 1 56 57 40
3 1 103 119 120
3 1 167 166 183
3 1 229 246 230
3 1 142 143 126
3 1 28 27 45
3 1 252 269 253
3 1 149 165 166
3 1 154 153 171
3 1 97 79 96
3 1 21 38 22
3 1 114 113 131
3 1 142 159 160
3 1 223 205 222
3 1 235 251 252
3 1 176 194 177
3 1 240 239 257
3 1 107 124 108
3 1 228 245 246
3 1 4 20 21
3 1 262 280 263
3 1 90 106 107
3 1 216 233 217
3 1 61 43 60
3 1 14 32 15
3 1 199 215 216
3 1 140 158 141
3 1 66 83 84
3 1 71 88 72
3 1 100 118 101
3 1 129 146 147
3 1 192 209 210
3 1 255 272 273
3 1 226 244 227
3 1 54 70 71
3 1 181 180 197
3 1 266 283 267
3 1 163 179 180
3 1 35 52 36
3 1 65 64 82
3 1 93 110 111
3 1 202 203 186
3 1 128 127 145
3 1 249 265 266
3 1 190 208 191
3 1 116 133 134
3 1 58 75 59
3 1 121 138 122
3 1 242 259 260
3 1 18 34 35
3 1 144 161 145
3 1 41 57 58
3 1 120 121 104
3 1 167 184 168
3 1 231 230 247
3 1 143 144 127
3 1 28 46 29
3 1 253 270 254
3 1 150 166 167
3 1 213 229 230
3 1 154 172 155
3 1 80 97 98
3 1 23 22 39
3 1 85 102 86
3 1 143 160 161
3 1 224 206 223
3 1 252 253 236
3 1 177 195 178
3 1 241 240 258
3 1 108 125 109
3 1 5 21 22
3 1 91 107 108
3 1 217 234 218
3 1 44 61 62
3 1 15 33 16
3 1 170 187 188
3 1 79 78 96
3 1 216 217 200
3 1 141 159 142
3 1 205 204 222
3 1 72 89 73
3 1 130 147 148
3 1 193 210 211
3 1 256 273 274
3 1 228 227 245
3 1 55 71 72
3 1 182 181 198
3 1 8 25 26
3 1 267 284 268
3 1 43 42 60
3 1 164 180 181
3 1 31 48 49
3 1 37 36 53
3 1 94 111 112
3 1 157 174 175
3 1 129 128 146
3 1 192 191 209
3 1 266 267 250
3 1 117 134 135
3 1 122 139 123
3 1 261 243 260
3 1 19 35 36
3 1 145 162 146
3 1 105 121 122
3 1 168 185 169
3 1 231 248 232
3 1 0 17 1
3 1 30 29 47
3 1 151 167 168
3 1 214 230 231
3 1 156 155 173
3 1 81 98 99
3 1 23 40 24
3 1 87 86 103
3 1 225 207 224
3 1 116 115 133
3 1 253 254 237
3 1 242 241 259
3 1 6 22 23
3 1 69 85 86
3 1 195 212 196
3 1 108 109 92
3 1 45 62 63
3 1 80 79 97
3 1 142 160 143
3 1 217 218 201
3 1 280 281 264
3 1 206 205 223
3 1 73 90 74
3 1 131 148 149
3 1 194 211 212
3 1 257 274 275
3 1 228 246 229
3 1 182 199 183
3 1 9 26 27
3 1 268 285 269
3 1 44 43 61
3 1 32 49 50
3 1 38 37 54
3 1 113 95 112
3 1 158 175 176
3 1 66 84 67
3 1 221 238 239
3 1 130 129 147
3 1 193 192 210
3 1 251 267 268
3 1 256 255 273
3 1 123 140 124
3 1 244 261 262
3 1 146 163 147
3 1 122 123 106
3 1 232 249 233
3 1 1 18 2
3 1 59 76 77
3 1 168 169 152
3 1 94 93 111
3 1 215 231 232
3 1 82 99 100
3 1 24 41 25
3 1 87 104 88
3 1 208 225 226
3 1 116 134 117
3 1 243 242 260
3 1 7 23 24
3 1 70 86 87
3 1 197 196 213
3 1 109 110 93
3 1 219 236 220
3 1 46 63 64
3 1 51 68 52
3 1 172 189 190
3 1 80 98 81
3 1 143 161 144
3 1 218 219 202
3 1 207 206 224
3 1 281 282 265
3 1 132 149 150
3 1 74 91 75
3 1 258 275 276
3 1 73 74 57
3 1 136 137 120
3 1 183 200 184
3 1 10 27 28
3 1 269 286 270
3 1 136 153 154
3 1 44 62 45
3 1 166 182 183
3 1 171 170 188
3 1 114 96 113
3 1 38 55 39
3 1 159 176 177
3 1 131 130 148
3 1 194 193 211
3 1 222 239 240
3 1 257 256 274
3 1 124 141 125
3 1 245 262 263
3 1 21 37 38
3 1 147 164 148
3 1 107 123 124
3 1 233 250 234
3 1 8 26 9
3 1 60 77 78
3 1 2 19 3
3 1 32 31 49
3 1 95 94 112
3 1 232 233 216
3 1 158 157 175
3 1 83 100 101
3 1 88 105 89
3 1 117 135 118
3 1 209 226 227
3 1 244 243 261
3 1 24 25 8
3 1 71 87 88
3 1 198 197 214
3 1 180 196 197
3 1 65 47 64
3 1 110 127 128
3 1 53 52 69
3 1 81 99 82
3 1 173 190 191
3 1 219 220 203
3 1 282 283 266
3 1 208 207 225
3 1 133 150 151
3 1 75 92 76
3 1 35 51 52
3 1 259 276 277
3 1 161 178 162
3 1 74 75 58
3 1 184 201 185
3 1 247 264 248
3 1 11 28 29
3 1 270 287 271
3 1 45 63 46
3 1 137 154 155
3 1 167 183 184
3 1 230 246 247
3 1 97 114 115
3 1 39 56 40
3 1 160 177 178
3 1 102 119 103
3 1 132 131 149
3 1 253 269 270
3 1 194 212 195
3 1 258 257 275
3 1 125 142 126
3 1 22 38 39
3 1 148 165 149
3 1 124 125 108
3 1 235 234 251
3 1 9 27 10
3 1 61 78 79
3 1 3 20 4
3 1 32 50 33
3 1 113 96 95
3 1 217 233 234
3 1 187 204 205
3 1 158 176 159
3 1 222 221 239
3 1 89 106 90
3 1 210 227 228
3 1 244 262 245
3 1 88 89 72
3 1 199 198 215
3 1 25 42 43
3 1 60 59 77
3 1 198 181 197
3 1 48 65 66
3 1 129 111 128
3 1 54 53 70
3 1 82 100 83
3 1 174 191 192
3 1 283 284 267
3 1 208 226 209
3 1 134 151 152
3 1 260 277 278
3 1 36 52 53
3 1 163 162 179
3 1 75 76 59
3 1 138 139 122
3 1 185 202 186
3 1 248 265 249
3 1 145 161 162
3 1 12 29 30
3 1 17 34 18
3 1 47 46 64
3 1 138 155 156
3 1 184 185 168
3 1 231 247 248
3 1 172 190 173
3 1 40 57 41
3 1 98 115 116
3 1 103 120 104
3 1 133 132 150
3 1 270 271 254
3 1 242 224 241
3 1 259 258 276
3 1 126 143 127
3 1 23 39 40
3 1 86 102 103
3 1 149 166 150
3 1 212 229 213
3 1 109 125 126
3 1 235 252 236
3 1 10 28 11
3 1 136 154 137
3 1 4 21 5
3 1 62 79 80
3 1 188 205 206
3 1 97 96 114
3 1 218 234 235
3 1 160 159 177
3 1 223 222 240
3 1 91 90 107
3 1 211 228 229
3 1 245 263 246
3 1 73 89 90
3 1 199 216 200
3 1 26 43 44
3 1 182 198 199
3 1 61 60 78
3 1 49 66 67
3 1 55 54 71
3 1 112 129 130
3 1 193 175 192
3 1 83 101 84
3 1 238 255 256
3 1 284 285 268
3 1 209 227 210
3 1 261 278 279
3 1 54 37 53
3 1 163 180 164
3 1 139 140 123
3 1 249 266 250
3 1 146 162 163
3 1 13 30 31
3 1 76 93 94
3 1 19 18 35
3 1 139 156 157
3 1 48 47 65
3 1 185 186 169
3 1 111 110 128
3 1 173 191 174
3 1 248 249 232
3 1 99 116 117
3 1 225 242 243
3 1 134 133 151
3 1 104 121 105
3 1 1 17 18
3 1 260 259 277
3 1 40 41 24
3 1 87 103 104
FACES:
2 0 12 11
2 0 138 137
2 0 6 5
2 1 68 85
2 0 264 263
2 1 153 170
2 0 285 286
2 0 279 280
2 2 152 135
2 0 41 42
2 0 13 12
2 0 7 6
2 2 237 220
2 0 171 172
2 0 189 188
2 0 56 73
2 1 119 136
2 0 286 287
2 0 55 56
2 0 165 182
2 0 164 165
2 0 78 95
2 0 20 37
2 2 67 50
2 1 204 221
2 0 19 20
2 0 42 59
2 0 14 13
2 0 94 77
2 0 8 7
2 0 179 196
2 0 178 179
2 1 34 51
2 0 115 132
2 0 287 288
2 2 288 271
2 0 252 269
2 0 131 114
2 0 251 252
2 0 15 14
2 0 66 83
2 2 118 101
2 1 255 272
2 0 272 273
2 0 82 65
2 2 203 186
2 0 59 58
2 0 121 138
2 0 58 41
2 0 120 121
2 1 85 102
2 0 223 224
2 0 195 178
2 0 241 240
2 2 33 16
2 0 16 15
2 1 170 187
2 0 73 72
2 0 273 274
2 0 72 55
2 0 182 181
2 0 181 164
2 0 31 48
2 0 37 36
2 0 157 174
2 0 36 19
2 1 0 17
2 0 1 0
2 0 47 30
2 0 173 156
2 2 254 237
2 0 196 195
2 0 280 281
2 0 274 275
2 0 269 268
2 2 84 67
2 1 221 238
2 0 268 251
2 0 2 1
2 2 169 152
2 0 109 110
2 0 219 236
2 1 51 68
2 0 172 189
2 0 218 219
2 0 281 282
2 0 275 276
2 0 137 120
2 1 136 153
2 0 188 171
2 0 9 8
2 0 77 78
2 0 3 2
2 0 95 94
2 2 135 118
2 0 110 127
2 2 220 203
2 0 282 283
2 0 276 277
2 0 247 264
2 0 246 247
2 0 114 115
2 1 102 119
2 0 132 131
2 0 10 9
2 0 4 3
2 2 50 33
2 1 187 204
2 0 65 66
2 0 83 82
2 0 283 284
2 0 277 278
2 1 17 34
2 2 271 254
2 0 224 241
2 0 127 126
2 0 126 109
2 0 236 235
2 0 11 10
2 0 5 4
2 0 235 218
2 0 240 223
2 0 263 246
2 2 101 84
2 1 238 255
2 0 284 285
2 0 278 279
2 0 30 31
2 0 156 157
2 0 48 47
2 2 186 169
2 0 174 173
