POINTS:
  0.0000000  -0.1250000  -0.1250000
  0.0000000   0.1250000  -0.1250000
  0.0000000   0.1250000   0.1250000
  0.0000000  -0.1250000   0.1250000
  0.2500000  -0.1250000  -0.1250000
  0.2500000   0.1250000  -0.1250000
  0.2500000   0.1250000   0.1250000
  0.2500000  -0.1250000   0.1250000
  0.5000000  -0.1250000  -0.1250000
  0.5000000   0.1250000  -0.1250000
  0.5000000   0.1250000   0.1250000
  0.5000000  -0.1250000   0.1250000
  0.7500000  -0.1250000  -0.1250000
  0.7500000   0.1250000  -0.1250000
  0.7500000   0.1250000   0.1250000
  0.7500000  -0.1250000   0.1250000
  1.0000000  -0.1250000  -0.1250000
  1.0000000   0.1250000  -0.1250000
  1.0000000   0.1250000   0.1250000
  1.0000000  -0.1250000   0.1250000
CELLS:
8 1 0 4 5 1 3 7 6 2
8 1 4 8 9 5 7 11 10 6
8 1 8 12 13 9 11 15 14 10
8 1 12 16 17 13 15 19 18 14
FACES:
4 2 0 1 3 2
4 0 0 4 5 1
4 0 0 4 7 3
4 0 5 1 6 2
4 0 3 7 6 2
4 0 4 8 9 5
4 0 4 8 11 7
4 0 9 5 10 6
4 0 7 11 10 6
4 0 8 12 13 9
4 0 8 12 15 11
4 0 13 9 14 10
4 0 11 15 14 10
4 0 12 16 17 13
4 0 12 16 19 15
4 0 17 13 18 14
4 0 15 19 18 14
4 2 16 17 19 18
