POINTS:
  0.00000  -0.03125   0.00000
  0.00000   0.03125   0.00000
  0.06250  -0.03125   0.00000
  0.06250   0.03125   0.00000
  0.12500  -0.03125   0.00000
  0.12500   0.03125   0.00000
  0.18750  -0.03125   0.00000
  0.18750   0.03125   0.00000
  0.25000  -0.03125   0.00000
  0.25000   0.03125   0.00000
  0.31250  -0.03125   0.00000
  0.31250   0.03125   0.00000
  0.37500  -0.03125   0.00000
  0.37500   0.03125   0.00000
  0.43750  -0.03125   0.00000
  0.43750   0.03125   0.00000
  0.50000  -0.03125   0.00000
  0.50000   0.03125   0.00000
  0.56250  -0.03125   0.00000
  0.56250   0.03125   0.00000
  0.62500  -0.03125   0.00000
  0.62500   0.03125   0.00000
  0.68750  -0.03125   0.00000
  0.68750   0.03125   0.00000
  0.75000  -0.03125   0.00000
  0.75000   0.03125   0.00000
  0.81250  -0.03125   0.00000
  0.81250   0.03125   0.00000
  0.87500  -0.03125   0.00000
  0.87500   0.03125   0.00000
  0.93750  -0.03125   0.00000
  0.93750   0.03125   0.00000
  1.00000  -0.03125   0.00000
  1.00000   0.03125   0.00000
CELLS:
4 1 0 2 3 1
4 1 2 4 5 3
4 1 4 6 7 5
4 1 6 8 9 7
4 1 8 10 11 9
4 1 10 12 13 11
4 1 12 14 15 13
4 1 14 16 17 15
4 1 16 18 19 17
4 1 18 20 21 19
4 1 20 22 23 21
4 1 22 24 25 23
4 1 24 26 27 25
4 1 26 28 29 27
4 1 28 30 31 29
4 1 30 32 33 31
FACES:
2 2 0 1
2 0 0 2
2 0 1 3
2 0 2 4
2 0 3 5
2 0 4 6
2 0 5 7
2 0 6 8
2 0 7 9
2 0 8 10
2 0 9 11
2 0 10 12
2 0 11 13
2 0 12 14
2 0 13 15
2 0 14 16
2 0 15 17
2 0 16 18
2 0 17 19
2 0 18 20
2 0 19 21
2 0 20 22
2 0 21 23
2 0 22 24
2 0 23 25
2 0 24 26
2 0 25 27
2 0 26 28
2 0 27 29
2 0 28 30
2 0 29 31
2 0 30 32
2 0 31 33
2 2 32 33
