POINTS:
0 0
0.5 0
1 0
0 0.5
0.5 0.5
1 0.5
0 1
0.5 1
1 1
CELLS:
3 1 0 1 3
3 1 1 4 3
3 1 1 2 5
3 1 5 4 1
3 1 5 7 4
3 1 5 8 7
3 1 3 4 7
3 1 7 6 3
FACES:
2 1 0 1
2 1 1 2
2 1 2 5
2 1 5 8
2 1 8 7
2 1 7 6
2 1 6 3
2 1 3 0