POINTS:
0.0000 0.0000 0.0000
0.0000 1.0000 0.0000
0.0000 -1.0000 0.0000
-1.0000 0.0000 0.0000
1.0000 0.0000 0.0000
-1.0000 1.0000 0.0000
1.0000 1.0000 0.0000
1.0000 -1.0000 0.0000
0.0000 0.0000 1.0000
0.0000 1.0000 1.0000
0.0000 -1.0000 1.0000
-1.0000 0.0000 1.0000
1.0000 0.0000 1.0000
-1.0000 1.0000 1.0000
1.0000 1.0000 1.0000
1.0000 -1.0000 1.0000
CELLS:
8 0000 0 1 5 3 8 9 13 11
8 0000 0 1 6 4 8 9 14 12
8 0000 0 2 7 4 8 10 15 12
FACES:
4 1 3 5 13 11
4 1 4 6 14 12
4 1 4 7 15 12
4 1 0 2 10 8
4 1 2 7 15 10
4 1 1 6 14 9
4 1 1 5 13 9
4 1 0 3 11 8
VDATA:
12 1.0 0.0 0.0 0.0 1.0 0.0 0.0 0.0 1.0 -10.0 0.0 0.0
12 1.0 0.0 0.0 0.0 1.0 0.0 0.0 0.0 1.0 -10.0 0.0 0.0
12 1.0 0.0 0.0 0.0 1.0 0.0 0.0 0.0 1.0 -10.0 0.0 0.0
12 1.0 0.0 0.0 0.0 1.0 0.0 0.0 0.0 1.0 -10.0 0.0 0.0
12 1.0 0.0 0.0 0.0 1.0 0.0 0.0 0.0 1.0 -10.0 0.0 0.0
12 1.0 0.0 0.0 0.0 1.0 0.0 0.0 0.0 1.0 -10.0 0.0 0.0
12 1.0 0.0 0.0 0.0 1.0 0.0 0.0 0.0 1.0 -10.0 0.0 0.0
12 1.0 0.0 0.0 0.0 1.0 0.0 0.0 0.0 1.0 -10.0 0.0 0.0
12 1.0 0.0 0.0 0.0 1.0 0.0 0.0 0.0 1.0 -10.0 0.0 0.0
12 1.0 0.0 0.0 0.0 1.0 0.0 0.0 0.0 1.0 -10.0 0.0 0.0
12 1.0 0.0 0.0 0.0 1.0 0.0 0.0 0.0 1.0 -10.0 0.0 0.0
12 1.0 0.0 0.0 0.0 1.0 0.0 0.0 0.0 1.0 -10.0 0.0 0.0
12 1.0 0.0 0.0 0.0 1.0 0.0 0.0 0.0 1.0 -10.0 0.0 0.0
12 1.0 0.0 0.0 0.0 1.0 0.0 0.0 0.0 1.0 -10.0 0.0 0.0
12 1.0 0.0 0.0 0.0 1.0 0.0 0.0 0.0 1.0 -10.0 0.0 0.0
12 1.0 0.0 0.0 0.0 1.0 0.0 0.0 0.0 1.0 -10.0 0.0 0.0
