POINTS:
0.0000 0.0000 0.0000
0.0000 0.0000 1.0000
0.0000 1.0000 0.0000
0.0000 1.0000 1.0000
1.0000 0.0000 0.0000
1.0000 0.0000 1.0000
1.0000 1.0000 0.0000
1.0000 1.0000 1.0000
2.0000 0.0000 0.0000
2.0000 0.0000 1.0000
2.0000 1.0000 0.0000
2.0000 1.0000 1.0000
3.0000 0.0000 0.0000
3.0000 0.0000 1.0000
3.0000 1.0000 0.0000
3.0000 1.0000 1.0000
4.0000 0.0000 0.0000
4.0000 0.0000 1.0000
4.0000 1.0000 0.0000
4.0000 1.0000 1.0000
5.0000 0.0000 0.0000
5.0000 0.0000 1.0000
5.0000 1.0000 0.0000
5.0000 1.0000 1.0000
6.0000 0.0000 0.0000
6.0000 0.0000 1.0000
6.0000 1.0000 0.0000
6.0000 1.0000 1.0000
7.0000 0.0000 0.0000
7.0000 0.0000 1.0000
7.0000 1.0000 0.0000
7.0000 1.0000 1.0000
8.0000 0.0000 0.0000
8.0000 0.0000 1.0000
8.0000 1.0000 0.0000
8.0000 1.0000 1.0000
9.0000 0.0000 0.0000
9.0000 0.0000 1.0000
9.0000 1.0000 0.0000
9.0000 1.0000 1.0000
10.0000 0.0000 0.0000
10.0000 0.0000 1.0000
10.0000 1.0000 0.0000
10.0000 1.0000 1.0000
CELLS:
8 0000 0 2 6 4 1 3 7 5
8 0000 4 6 10 8 5 7 11 9
8 0000 8 10 14 12 9 11 15 13
8 0000 12 14 18 16 13 15 19 17
8 0000 16 18 22 20 17 19 23 21
8 0000 20 22 26 24 21 23 27 25
8 0000 24 26 30 28 25 27 31 29
8 0000 28 30 34 32 29 31 35 33
8 0000 32 34 38 36 33 35 39 37
8 0000 36 38 42 40 37 39 43 41
FACES:
4 1 0 2 3 1
4 2 40 42 43 41
4 2 7 3 1 5
4 2 6 2 0 4
4 2 11 7 5 9
4 2 10 6 4 8
4 2 15 11 9 13
4 2 14 10 8 12
4 2 19 15 13 17
4 2 18 14 12 16
4 2 23 19 17 21
4 2 22 18 16 20
4 2 27 23 21 25
4 2 26 22 20 24
4 2 31 27 25 29
4 2 30 26 24 28
4 2 35 31 29 33
4 2 34 30 28 32
4 2 39 35 33 37
4 2 38 34 32 36
4 2 43 39 37 41
4 2 42 38 36 40
4 2 0 4 5 1
4 2 2 6 7 3
4 2 4 8 9 5
4 2 6 10 11 7
4 2 8 12 13 9
4 2 10 14 15 11
4 2 12 16 17 13
4 2 14 18 19 15
4 2 16 20 21 17
4 2 18 22 23 19
4 2 20 24 25 21
4 2 22 26 27 23
4 2 24 28 29 25
4 2 26 30 31 27
4 2 28 32 33 29
4 2 30 34 35 31
4 2 32 36 37 33
4 2 34 38 39 35
4 2 36 40 41 37
4 2 38 42 43 39
VDATA:
12 1.0 0.0 0.0 0.0 1.0 0.0 0.0 0.0 1.0 -10.0 0.0 0.0
12 1.0 0.0 0.0 0.0 1.0 0.0 0.0 0.0 1.0 -10.0 0.0 0.0
12 1.0 0.0 0.0 0.0 1.0 0.0 0.0 0.0 1.0 -10.0 0.0 0.0
12 1.0 0.0 0.0 0.0 1.0 0.0 0.0 0.0 1.0 -10.0 0.0 0.0
12 1.0 0.0 0.0 0.0 1.0 0.0 0.0 0.0 1.0 -10.0 0.0 0.0
12 1.0 0.0 0.0 0.0 1.0 0.0 0.0 0.0 1.0 -10.0 0.0 0.0
12 1.0 0.0 0.0 0.0 1.0 0.0 0.0 0.0 1.0 -10.0 0.0 0.0
12 1.0 0.0 0.0 0.0 1.0 0.0 0.0 0.0 1.0 -10.0 0.0 0.0
12 1.0 0.0 0.0 0.0 1.0 0.0 0.0 0.0 1.0 -10.0 0.0 0.0
12 1.0 0.0 0.0 0.0 1.0 0.0 0.0 0.0 1.0 -10.0 0.0 0.0
12 1.0 0.0 0.0 0.0 1.0 0.0 0.0 0.0 1.0 -10.0 0.0 0.0
12 1.0 0.0 0.0 0.0 1.0 0.0 0.0 0.0 1.0 -10.0 0.0 0.0
12 1.0 0.0 0.0 0.0 1.0 0.0 0.0 0.0 1.0 -10.0 0.0 0.0
12 1.0 0.0 0.0 0.0 1.0 0.0 0.0 0.0 1.0 -10.0 0.0 0.0
12 1.0 0.0 0.0 0.0 1.0 0.0 0.0 0.0 1.0 -10.0 0.0 0.0
12 1.0 0.0 0.0 0.0 1.0 0.0 0.0 0.0 1.0 -10.0 0.0 0.0
12 1.0 0.0 0.0 0.0 1.0 0.0 0.0 0.0 1.0 -10.0 0.0 0.0
12 1.0 0.0 0.0 0.0 1.0 0.0 0.0 0.0 1.0 -10.0 0.0 0.0
12 1.0 0.0 0.0 0.0 1.0 0.0 0.0 0.0 1.0 -10.0 0.0 0.0
12 1.0 0.0 0.0 0.0 1.0 0.0 0.0 0.0 1.0 -10.0 0.0 0.0
12 1.0 0.0 0.0 0.0 1.0 0.0 0.0 0.0 1.0 -10.0 0.0 0.0
12 1.0 0.0 0.0 0.0 1.0 0.0 0.0 0.0 1.0 -10.0 0.0 0.0
12 1.0 0.0 0.0 0.0 1.0 0.0 0.0 0.0 1.0 -10.0 0.0 0.0
12 1.0 0.0 0.0 0.0 1.0 0.0 0.0 0.0 1.0 -10.0 0.0 0.0
12 1.0 0.0 0.0 0.0 1.0 0.0 0.0 0.0 1.0 -10.0 0.0 0.0
12 1.0 0.0 0.0 0.0 1.0 0.0 0.0 0.0 1.0 -10.0 0.0 0.0
12 1.0 0.0 0.0 0.0 1.0 0.0 0.0 0.0 1.0 -10.0 0.0 0.0
12 1.0 0.0 0.0 0.0 1.0 0.0 0.0 0.0 1.0 -10.0 0.0 0.0
12 1.0 0.0 0.0 0.0 1.0 0.0 0.0 0.0 1.0 -10.0 0.0 0.0
12 1.0 0.0 0.0 0.0 1.0 0.0 0.0 0.0 1.0 -10.0 0.0 0.0
12 1.0 0.0 0.0 0.0 1.0 0.0 0.0 0.0 1.0 -10.0 0.0 0.0
12 1.0 0.0 0.0 0.0 1.0 0.0 0.0 0.0 1.0 -10.0 0.0 0.0
12 1.0 0.0 0.0 0.0 1.0 0.0 0.0 0.0 1.0 -10.0 0.0 0.0
12 1.0 0.0 0.0 0.0 1.0 0.0 0.0 0.0 1.0 -10.0 0.0 0.0
12 1.0 0.0 0.0 0.0 1.0 0.0 0.0 0.0 1.0 -10.0 0.0 0.0
12 1.0 0.0 0.0 0.0 1.0 0.0 0.0 0.0 1.0 -10.0 0.0 0.0
12 1.0 0.0 0.0 0.0 1.0 0.0 0.0 0.0 1.0 -10.0 0.0 0.0
12 1.0 0.0 0.0 0.0 1.0 0.0 0.0 0.0 1.0 -10.0 0.0 0.0
12 1.0 0.0 0.0 0.0 1.0 0.0 0.0 0.0 1.0 -10.0 0.0 0.0
12 1.0 0.0 0.0 0.0 1.0 0.0 0.0 0.0 1.0 -10.0 0.0 0.0
12 1.0 0.0 0.0 0.0 1.0 0.0 0.0 0.0 1.0 -10.0 0.0 0.0
12 1.0 0.0 0.0 0.0 1.0 0.0 0.0 0.0 1.0 -10.0 0.0 0.0
12 1.0 0.0 0.0 0.0 1.0 0.0 0.0 0.0 1.0 -10.0 0.0 0.0
12 1.0 0.0 0.0 0.0 1.0 0.0 0.0 0.0 1.0 -10.0 0.0 0.0
