POINTS:
0.0000 0.0000 0.0000
0.0000 0.0000 1.0000
0.0000 1.0000 0.0000
0.0000 1.0000 1.0000
1.0000 0.0000 0.0000
1.0000 0.0000 1.0000
1.0000 1.0000 0.0000
1.0000 1.0000 1.0000
2.0000 0.0000 0.0000
2.0000 0.0000 1.0000
2.0000 1.0000 0.0000
2.0000 1.0000 1.0000
3.0000 0.0000 0.0000
3.0000 0.0000 1.0000
3.0000 1.0000 0.0000
3.0000 1.0000 1.0000
4.0000 0.0000 0.0000
4.0000 0.0000 1.0000
4.0000 1.0000 0.0000
4.0000 1.0000 1.0000
5.0000 0.0000 0.0000
5.0000 0.0000 1.0000
5.0000 1.0000 0.0000
5.0000 1.0000 1.0000
6.0000 0.0000 0.0000
6.0000 0.0000 1.0000
6.0000 1.0000 0.0000
6.0000 1.0000 1.0000
7.0000 0.0000 0.0000
7.0000 0.0000 1.0000
7.0000 1.0000 0.0000
7.0000 1.0000 1.0000
8.0000 0.0000 0.0000
8.0000 0.0000 1.0000
8.0000 1.0000 0.0000
8.0000 1.0000 1.0000
9.0000 0.0000 0.0000
9.0000 0.0000 1.0000
9.0000 1.0000 0.0000
9.0000 1.0000 1.0000
10.0000 0.0000 0.0000
10.0000 0.0000 1.0000
10.0000 1.0000 0.0000
10.0000 1.0000 1.0000
CELLS:
4 0000  0 2 6 3
4 0000  0 6 4 5
4 0000  0 3 1 5
4 0000  6 7 3 5
4 0000  0 6 5 3
4 0000  4 8 5 6
4 0000  7 5 11 6
4 0000  10 6 8 11
4 0000  9 11 5 8
4 0000  6 8 11 5
4 0000  8 10 14 11
4 0000  8 14 12 13
4 0000  8 11 9 13
4 0000  14 15 11 13
4 0000  8 14 13 11
4 0000  12 16 13 14
4 0000  15 13 19 14
4 0000  18 14 16 19
4 0000  17 19 13 16
4 0000  14 16 19 13
4 0000  16 18 22 19
4 0000  16 22 20 21
4 0000  16 19 17 21
4 0000  22 23 19 21
4 0000  16 22 21 19
4 0000  20 24 21 22
4 0000  23 21 27 22
4 0000  26 22 24 27
4 0000  25 27 21 24
4 0000  22 24 27 21
4 0000  24 26 30 27
4 0000  24 30 28 29
4 0000  24 27 25 29
4 0000  30 31 27 29
4 0000  24 30 29 27
4 0000  28 32 29 30
4 0000  31 29 35 30
4 0000  34 30 32 35
4 0000  33 35 29 32
4 0000  30 32 35 29
4 0000  32 34 38 35
4 0000  32 38 36 37
4 0000  32 35 33 37
4 0000  38 39 35 37
4 0000  32 38 37 35
4 0000  36 40 37 38
4 0000  39 37 43 38
4 0000  42 38 40 43
4 0000  41 43 37 40
4 0000  38 40 43 37
FACES:
3 199 0 2 3
3 199 0 3 1
3 230 6 2 0
3 230 6 0 4
3 230 10 6 8
3 230 6 4 8
3 230 14 10 8
3 230 14 8 12
3 230 18 14 16
3 230 14 12 16
3 230 22 18 16
3 230 22 16 20
3 230 26 22 24
3 230 22 20 24
3 230 30 26 24
3 230 30 24 28
3 230 34 30 32
3 230 30 28 32
3 230 38 34 32
3 230 38 32 36
3 230 42 38 40
3 230 38 36 40
VDATA:
12 1.0 0.0 0.0 0.0 1.0 0.0 0.0 0.0 1.0 -10.0 0.0 0.0
12 1.0 0.0 0.0 0.0 1.0 0.0 0.0 0.0 1.0 -10.0 0.0 0.0
12 1.0 0.0 0.0 0.0 1.0 0.0 0.0 0.0 1.0 -10.0 0.0 0.0
12 1.0 0.0 0.0 0.0 1.0 0.0 0.0 0.0 1.0 -10.0 0.0 0.0
12 1.0 0.0 0.0 0.0 1.0 0.0 0.0 0.0 1.0 -10.0 0.0 0.0
12 1.0 0.0 0.0 0.0 1.0 0.0 0.0 0.0 1.0 -10.0 0.0 0.0
12 1.0 0.0 0.0 0.0 1.0 0.0 0.0 0.0 1.0 -10.0 0.0 0.0
12 1.0 0.0 0.0 0.0 1.0 0.0 0.0 0.0 1.0 -10.0 0.0 0.0
12 1.0 0.0 0.0 0.0 1.0 0.0 0.0 0.0 1.0 -10.0 0.0 0.0
12 1.0 0.0 0.0 0.0 1.0 0.0 0.0 0.0 1.0 -10.0 0.0 0.0
12 1.0 0.0 0.0 0.0 1.0 0.0 0.0 0.0 1.0 -10.0 0.0 0.0
12 1.0 0.0 0.0 0.0 1.0 0.0 0.0 0.0 1.0 -10.0 0.0 0.0
12 1.0 0.0 0.0 0.0 1.0 0.0 0.0 0.0 1.0 -10.0 0.0 0.0
12 1.0 0.0 0.0 0.0 1.0 0.0 0.0 0.0 1.0 -10.0 0.0 0.0
12 1.0 0.0 0.0 0.0 1.0 0.0 0.0 0.0 1.0 -10.0 0.0 0.0
12 1.0 0.0 0.0 0.0 1.0 0.0 0.0 0.0 1.0 -10.0 0.0 0.0
12 1.0 0.0 0.0 0.0 1.0 0.0 0.0 0.0 1.0 -10.0 0.0 0.0
12 1.0 0.0 0.0 0.0 1.0 0.0 0.0 0.0 1.0 -10.0 0.0 0.0
12 1.0 0.0 0.0 0.0 1.0 0.0 0.0 0.0 1.0 -10.0 0.0 0.0
12 1.0 0.0 0.0 0.0 1.0 0.0 0.0 0.0 1.0 -10.0 0.0 0.0
12 1.0 0.0 0.0 0.0 1.0 0.0 0.0 0.0 1.0 -10.0 0.0 0.0
12 1.0 0.0 0.0 0.0 1.0 0.0 0.0 0.0 1.0 -10.0 0.0 0.0
12 1.0 0.0 0.0 0.0 1.0 0.0 0.0 0.0 1.0 -10.0 0.0 0.0
12 1.0 0.0 0.0 0.0 1.0 0.0 0.0 0.0 1.0 -10.0 0.0 0.0
12 1.0 0.0 0.0 0.0 1.0 0.0 0.0 0.0 1.0 -10.0 0.0 0.0
12 1.0 0.0 0.0 0.0 1.0 0.0 0.0 0.0 1.0 -10.0 0.0 0.0
12 1.0 0.0 0.0 0.0 1.0 0.0 0.0 0.0 1.0 -10.0 0.0 0.0
12 1.0 0.0 0.0 0.0 1.0 0.0 0.0 0.0 1.0 -10.0 0.0 0.0
12 1.0 0.0 0.0 0.0 1.0 0.0 0.0 0.0 1.0 -10.0 0.0 0.0
12 1.0 0.0 0.0 0.0 1.0 0.0 0.0 0.0 1.0 -10.0 0.0 0.0
12 1.0 0.0 0.0 0.0 1.0 0.0 0.0 0.0 1.0 -10.0 0.0 0.0
12 1.0 0.0 0.0 0.0 1.0 0.0 0.0 0.0 1.0 -10.0 0.0 0.0
12 1.0 0.0 0.0 0.0 1.0 0.0 0.0 0.0 1.0 -10.0 0.0 0.0
12 1.0 0.0 0.0 0.0 1.0 0.0 0.0 0.0 1.0 -10.0 0.0 0.0
12 1.0 0.0 0.0 0.0 1.0 0.0 0.0 0.0 1.0 -10.0 0.0 0.0
12 1.0 0.0 0.0 0.0 1.0 0.0 0.0 0.0 1.0 -10.0 0.0 0.0
12 1.0 0.0 0.0 0.0 1.0 0.0 0.0 0.0 1.0 -10.0 0.0 0.0
12 1.0 0.0 0.0 0.0 1.0 0.0 0.0 0.0 1.0 -10.0 0.0 0.0
12 1.0 0.0 0.0 0.0 1.0 0.0 0.0 0.0 1.0 -10.0 0.0 0.0
12 1.0 0.0 0.0 0.0 1.0 0.0 0.0 0.0 1.0 -10.0 0.0 0.0
12 1.0 0.0 0.0 0.0 1.0 0.0 0.0 0.0 1.0 -10.0 0.0 0.0
12 1.0 0.0 0.0 0.0 1.0 0.0 0.0 0.0 1.0 -10.0 0.0 0.0
12 1.0 0.0 0.0 0.0 1.0 0.0 0.0 0.0 1.0 -10.0 0.0 0.0
12 1.0 0.0 0.0 0.0 1.0 0.0 0.0 0.0 1.0 -10.0 0.0 0.0
