POINTS:
0.0 0.0
0.0 0.5
0.0 1.0
0.0 1.5
0.0 2.0
0.0 2.5
0.0 3.0
0.0 3.5
0.0 4.0
0.0 4.5
0.0 5.0
0.0 5.5
0.0 6.0
0.0 6.5
0.0 7.0
0.5 0.0
0.5 0.5
0.5 1.0
0.5 1.5
0.5 2.0
0.5 2.5
0.5 3.0
0.5 3.5
0.5 4.0
0.5 4.5
0.5 5.0
0.5 5.5
0.5 6.0
0.5 6.5
0.5 7.0
1.0 0.0
1.0 0.5
1.0 1.0
1.0 1.5
1.0 2.0
1.0 2.5
1.0 3.0
1.0 3.5
1.0 4.0
1.0 4.5
1.0 5.0
1.0 5.5
1.0 6.0
1.0 6.5
1.0 7.0
1.5 0.0
1.5 0.5
1.5 1.0
1.5 1.5
1.5 2.0
1.5 2.5
1.5 3.0
1.5 3.5
1.5 4.0
1.5 4.5
1.5 5.0
1.5 5.5
1.5 6.0
1.5 6.5
1.5 7.0
2.0 0.0
2.0 0.5
2.0 1.0
2.0 1.5
2.0 2.0
2.0 2.5
2.0 3.0
2.0 3.5
2.0 4.0
2.0 4.5
2.0 5.0
2.0 5.5
2.0 6.0
2.0 6.5
2.0 7.0
2.5 0.0
2.5 0.5
2.5 1.0
2.5 1.5
2.5 2.0
2.5 2.5
2.5 3.0
2.5 3.5
2.5 4.0
2.5 4.5
2.5 5.0
2.5 5.5
2.5 6.0
2.5 6.5
2.5 7.0
3.0 0.0
3.0 0.5
3.0 1.0
3.0 1.5
3.0 2.0
3.0 2.5
3.0 3.0
3.0 3.5
3.0 4.0
3.0 4.5
3.0 5.0
3.0 5.5
3.0 6.0
3.0 6.5
3.0 7.0
3.5 0.0
3.5 0.5
3.5 1.0
3.5 1.5
3.5 2.0
3.5 2.5
3.5 3.0
3.5 3.5
3.5 4.0
3.5 4.5
3.5 5.0
3.5 5.5
3.5 6.0
3.5 6.5
3.5 7.0
4.0 0.0
4.0 0.5
4.0 1.0
4.0 1.5
4.0 2.0
4.0 2.5
4.0 3.0
4.0 3.5
4.0 4.0
4.0 4.5
4.0 5.0
4.0 5.5
4.0 6.0
4.0 6.5
4.0 7.0
4.5 0.0
4.5 0.5
4.5 1.0
4.5 1.5
4.5 2.0
4.5 2.5
4.5 3.0
4.5 3.5
4.5 4.0
4.5 4.5
4.5 5.0
4.5 5.5
4.5 6.0
4.5 6.5
4.5 7.0
5.0 0.0
5.0 0.5
5.0 1.0
5.0 1.5
5.0 2.0
5.0 2.5
5.0 3.0
5.0 3.5
5.0 4.0
5.0 4.5
5.0 5.0
5.0 5.5
5.0 6.0
5.0 6.5
5.0 7.0
5.5 0.0
5.5 0.5
5.5 1.0
5.5 1.5
5.5 2.0
5.5 2.5
5.5 3.0
5.5 3.5
5.5 4.0
5.5 4.5
5.5 5.0
5.5 5.5
5.5 6.0
5.5 6.5
5.5 7.0
6.0 0.0
6.0 0.5
6.0 1.0
6.0 1.5
6.0 2.0
6.0 2.5
6.0 3.0
6.0 3.5
6.0 4.0
6.0 4.5
6.0 5.0
6.0 5.5
6.0 6.0
6.0 6.5
6.0 7.0
6.5 0.0
6.5 0.5
6.5 1.0
6.5 1.5
6.5 2.0
6.5 2.5
6.5 3.0
6.5 3.5
6.5 4.0
6.5 4.5
6.5 5.0
6.5 5.5
6.5 6.0
6.5 6.5
6.5 7.0
7.0 0.0
7.0 0.5
7.0 1.0
7.0 1.5
7.0 2.0
7.0 2.5
7.0 3.0
7.0 3.5
7.0 4.0
7.0 4.5
7.0 5.0
7.0 5.5
7.0 6.0
7.0 6.5
7.0 7.0
7.5 0.0
7.5 0.5
7.5 1.0
7.5 1.5
7.5 2.0
7.5 2.5
7.5 3.0
7.5 3.5
7.5 4.0
7.5 4.5
7.5 5.0
7.5 5.5
7.5 6.0
7.5 6.5
7.5 7.0
8.0 0.0
8.0 0.5
8.0 1.0
8.0 1.5
8.0 2.0
8.0 2.5
8.0 3.0
8.0 3.5
8.0 4.0
8.0 4.5
8.0 5.0
8.0 5.5
8.0 6.0
8.0 6.5
8.0 7.0
8.5 0.0
8.5 0.5
8.5 1.0
8.5 1.5
8.5 2.0
8.5 2.5
8.5 3.0
8.5 3.5
8.5 4.0
8.5 4.5
8.5 5.0
8.5 5.5
8.5 6.0
8.5 6.5
8.5 7.0
9.0 0.0
9.0 0.5
9.0 1.0
9.0 1.5
9.0 2.0
9.0 2.5
9.0 3.0
9.0 3.5
9.0 4.0
9.0 4.5
9.0 5.0
9.0 5.5
9.0 6.0
9.0 6.5
9.0 7.0
9.5 0.0
9.5 0.5
9.5 1.0
9.5 1.5
9.5 2.0
9.5 2.5
9.5 3.0
9.5 3.5
9.5 4.0
9.5 4.5
9.5 5.0
9.5 5.5
9.5 6.0
9.5 6.5
9.5 7.0
10.0 0.0
10.0 0.5
10.0 1.0
10.0 1.5
10.0 2.0
10.0 2.5
10.0 3.0
10.0 3.5
10.0 4.0
10.0 4.5
10.0 5.0
10.0 5.5
10.0 6.0
10.0 6.5
10.0 7.0
10.5 0.0
10.5 0.5
10.5 1.0
10.5 1.5
10.5 2.0
10.5 2.5
10.5 3.0
10.5 3.5
10.5 4.0
10.5 4.5
10.5 5.0
10.5 5.5
10.5 6.0
10.5 6.5
10.5 7.0
11.0 0.0
11.0 0.5
11.0 1.0
11.0 1.5
11.0 2.0
11.0 2.5
11.0 3.0
11.0 3.5
11.0 4.0
11.0 4.5
11.0 5.0
11.0 5.5
11.0 6.0
11.0 6.5
11.0 7.0
11.5 0.0
11.5 0.5
11.5 1.0
11.5 1.5
11.5 2.0
11.5 2.5
11.5 3.0
11.5 3.5
11.5 4.0
11.5 4.5
11.5 5.0
11.5 5.5
11.5 6.0
11.5 6.5
11.5 7.0
12.0 0.0
12.0 0.5
12.0 1.0
12.0 1.5
12.0 2.0
12.0 2.5
12.0 3.0
12.0 3.5
12.0 4.0
12.0 4.5
12.0 5.0
12.0 5.5
12.0 6.0
12.0 6.5
12.0 7.0
12.5 0.0
12.5 0.5
12.5 1.0
12.5 1.5
12.5 2.0
12.5 2.5
12.5 3.0
12.5 3.5
12.5 4.0
12.5 4.5
12.5 5.0
12.5 5.5
12.5 6.0
12.5 6.5
12.5 7.0
13.0 0.0
13.0 0.5
13.0 1.0
13.0 1.5
13.0 2.0
13.0 2.5
13.0 3.0
13.0 3.5
13.0 4.0
13.0 4.5
13.0 5.0
13.0 5.5
13.0 6.0
13.0 6.5
13.0 7.0
13.5 0.0
13.5 0.5
13.5 1.0
13.5 1.5
13.5 2.0
13.5 2.5
13.5 3.0
13.5 3.5
13.5 4.0
13.5 4.5
13.5 5.0
13.5 5.5
13.5 6.0
13.5 6.5
13.5 7.0
14.0 0.0
14.0 0.5
14.0 1.0
14.0 1.5
14.0 2.0
14.0 2.5
14.0 3.0
14.0 3.5
14.0 4.0
14.0 4.5
14.0 5.0
14.0 5.5
14.0 6.0
14.0 6.5
14.0 7.0
14.5 0.0
14.5 0.5
14.5 1.0
14.5 1.5
14.5 2.0
14.5 2.5
14.5 3.0
14.5 3.5
14.5 4.0
14.5 4.5
14.5 5.0
14.5 5.5
14.5 6.0
14.5 6.5
14.5 7.0
15.0 0.0
15.0 0.5
15.0 1.0
15.0 1.5
15.0 2.0
15.0 2.5
15.0 3.0
15.0 3.5
15.0 4.0
15.0 4.5
15.0 5.0
15.0 5.5
15.0 6.0
15.0 6.5
15.0 7.0
15.5 0.0
15.5 0.5
15.5 1.0
15.5 1.5
15.5 2.0
15.5 2.5
15.5 3.0
15.5 3.5
15.5 4.0
15.5 4.5
15.5 5.0
15.5 5.5
15.5 6.0
15.5 6.5
15.5 7.0
16.0 0.0
16.0 0.5
16.0 1.0
16.0 1.5
16.0 2.0
16.0 2.5
16.0 3.0
16.0 3.5
16.0 4.0
16.0 4.5
16.0 5.0
16.0 5.5
16.0 6.0
16.0 6.5
16.0 7.0
16.5 0.0
16.5 0.5
16.5 1.0
16.5 1.5
16.5 2.0
16.5 2.5
16.5 3.0
16.5 3.5
16.5 4.0
16.5 4.5
16.5 5.0
16.5 5.5
16.5 6.0
16.5 6.5
16.5 7.0
17.0 0.0
17.0 0.5
17.0 1.0
17.0 1.5
17.0 2.0
17.0 2.5
17.0 3.0
17.0 3.5
17.0 4.0
17.0 4.5
17.0 5.0
17.0 5.5
17.0 6.0
17.0 6.5
17.0 7.0
17.5 0.0
17.5 0.5
17.5 1.0
17.5 1.5
17.5 2.0
17.5 2.5
17.5 3.0
17.5 3.5
17.5 4.0
17.5 4.5
17.5 5.0
17.5 5.5
17.5 6.0
17.5 6.5
17.5 7.0
18.0 0.0
18.0 0.5
18.0 1.0
18.0 1.5
18.0 2.0
18.0 2.5
18.0 3.0
18.0 3.5
18.0 4.0
18.0 4.5
18.0 5.0
18.0 5.5
18.0 6.0
18.0 6.5
18.0 7.0
18.5 0.0
18.5 0.5
18.5 1.0
18.5 1.5
18.5 2.0
18.5 2.5
18.5 3.0
18.5 3.5
18.5 4.0
18.5 4.5
18.5 5.0
18.5 5.5
18.5 6.0
18.5 6.5
18.5 7.0
19.0 0.0
19.0 0.5
19.0 1.0
19.0 1.5
19.0 2.0
19.0 2.5
19.0 3.0
19.0 3.5
19.0 4.0
19.0 4.5
19.0 5.0
19.0 5.5
19.0 6.0
19.0 6.5
19.0 7.0
19.5 0.0
19.5 0.5
19.5 1.0
19.5 1.5
19.5 2.0
19.5 2.5
19.5 3.0
19.5 3.5
19.5 4.0
19.5 4.5
19.5 5.0
19.5 5.5
19.5 6.0
19.5 6.5
19.5 7.0
20.0 0.0
20.0 0.5
20.0 1.0
20.0 1.5
20.0 2.0
20.0 2.5
20.0 3.0
20.0 3.5
20.0 4.0
20.0 4.5
20.0 5.0
20.0 5.5
20.0 6.0
20.0 6.5
20.0 7.0
CELLS:
3 0 0 15 16
3 0 0 16 1
3 0 1 16 17
3 0 1 17 2
3 0 2 17 18
3 0 2 18 3
3 0 3 18 19
3 0 3 19 4
3 0 4 19 20
3 0 4 20 5
3 0 5 20 21
3 0 5 21 6
3 0 6 21 22
3 0 6 22 7
3 0 7 22 23
3 0 7 23 8
3 0 8 23 24
3 0 8 24 9
3 0 9 24 25
3 0 9 25 10
3 0 10 25 26
3 0 10 26 11
3 0 11 26 27
3 0 11 27 12
3 0 12 27 28
3 0 12 28 13
3 0 13 28 29
3 0 13 29 14
3 0 15 30 31
3 0 15 31 16
3 0 16 31 32
3 0 16 32 17
3 0 17 32 33
3 0 17 33 18
3 0 18 33 34
3 0 18 34 19
3 0 19 34 35
3 0 19 35 20
3 0 20 35 36
3 0 20 36 21
3 0 21 36 37
3 0 21 37 22
3 0 22 37 38
3 0 22 38 23
3 0 23 38 39
3 0 23 39 24
3 0 24 39 40
3 0 24 40 25
3 0 25 40 41
3 0 25 41 26
3 0 26 41 42
3 0 26 42 27
3 0 27 42 43
3 0 27 43 28
3 0 28 43 44
3 0 28 44 29
3 0 30 45 46
3 0 30 46 31
3 0 31 46 47
3 0 31 47 32
3 0 32 47 48
3 0 32 48 33
3 0 33 48 49
3 0 33 49 34
3 0 34 49 50
3 0 34 50 35
3 0 35 50 51
3 0 35 51 36
3 0 36 51 52
3 0 36 52 37
3 0 37 52 53
3 0 37 53 38
3 0 38 53 54
3 0 38 54 39
3 0 39 54 55
3 0 39 55 40
3 0 40 55 56
3 0 40 56 41
3 0 41 56 57
3 0 41 57 42
3 0 42 57 58
3 0 42 58 43
3 0 43 58 59
3 0 43 59 44
3 0 45 60 61
3 0 45 61 46
3 0 46 61 62
3 0 46 62 47
3 0 47 62 63
3 0 47 63 48
3 0 48 63 64
3 0 48 64 49
3 0 49 64 65
3 0 49 65 50
3 0 50 65 66
3 0 50 66 51
3 0 51 66 67
3 0 51 67 52
3 0 52 67 68
3 0 52 68 53
3 0 53 68 69
3 0 53 69 54
3 0 54 69 70
3 0 54 70 55
3 0 55 70 71
3 0 55 71 56
3 0 56 71 72
3 0 56 72 57
3 0 57 72 73
3 0 57 73 58
3 0 58 73 74
3 0 58 74 59
3 0 60 75 76
3 0 60 76 61
3 0 61 76 77
3 0 61 77 62
3 0 62 77 78
3 0 62 78 63
3 0 63 78 79
3 0 63 79 64
3 0 64 79 80
3 0 64 80 65
3 0 65 80 81
3 0 65 81 66
3 0 66 81 82
3 0 66 82 67
3 0 67 82 83
3 0 67 83 68
3 0 68 83 84
3 0 68 84 69
3 0 69 84 85
3 0 69 85 70
3 0 70 85 86
3 0 70 86 71
3 0 71 86 87
3 0 71 87 72
3 0 72 87 88
3 0 72 88 73
3 0 73 88 89
3 0 73 89 74
3 0 75 90 91
3 0 75 91 76
3 0 76 91 92
3 0 76 92 77
3 0 77 92 93
3 0 77 93 78
3 0 78 93 94
3 0 78 94 79
3 0 79 94 95
3 0 79 95 80
3 0 80 95 96
3 0 80 96 81
3 0 81 96 97
3 0 81 97 82
3 0 82 97 98
3 0 82 98 83
3 0 83 98 99
3 0 83 99 84
3 0 84 99 100
3 0 84 100 85
3 0 85 100 101
3 0 85 101 86
3 0 86 101 102
3 0 86 102 87
3 0 87 102 103
3 0 87 103 88
3 0 88 103 104
3 0 88 104 89
3 0 90 105 106
3 0 90 106 91
3 0 91 106 107
3 0 91 107 92
3 0 92 107 108
3 0 92 108 93
3 0 93 108 109
3 0 93 109 94
3 0 94 109 110
3 0 94 110 95
3 0 95 110 111
3 0 95 111 96
3 0 96 111 112
3 0 96 112 97
3 0 97 112 113
3 0 97 113 98
3 0 98 113 114
3 0 98 114 99
3 0 99 114 115
3 0 99 115 100
3 0 100 115 116
3 0 100 116 101
3 0 101 116 117
3 0 101 117 102
3 0 102 117 118
3 0 102 118 103
3 0 103 118 119
3 0 103 119 104
3 0 105 120 121
3 0 105 121 106
3 0 106 121 122
3 0 106 122 107
3 0 107 122 123
3 0 107 123 108
3 0 108 123 124
3 0 108 124 109
3 0 109 124 125
3 0 109 125 110
3 0 110 125 126
3 0 110 126 111
3 0 111 126 127
3 0 111 127 112
3 0 112 127 128
3 0 112 128 113
3 0 113 128 129
3 0 113 129 114
3 0 114 129 130
3 0 114 130 115
3 0 115 130 131
3 0 115 131 116
3 0 116 131 132
3 0 116 132 117
3 0 117 132 133
3 0 117 133 118
3 0 118 133 134
3 0 118 134 119
3 0 120 135 136
3 0 120 136 121
3 0 121 136 137
3 0 121 137 122
3 0 122 137 138
3 0 122 138 123
3 0 123 138 139
3 0 123 139 124
3 0 124 139 140
3 0 124 140 125
3 0 125 140 141
3 0 125 141 126
3 0 126 141 142
3 0 126 142 127
3 0 127 142 143
3 0 127 143 128
3 0 128 143 144
3 0 128 144 129
3 0 129 144 145
3 0 129 145 130
3 0 130 145 146
3 0 130 146 131
3 0 131 146 147
3 0 131 147 132
3 0 132 147 148
3 0 132 148 133
3 0 133 148 149
3 0 133 149 134
3 0 135 150 151
3 0 135 151 136
3 0 136 151 152
3 0 136 152 137
3 0 137 152 153
3 0 137 153 138
3 0 138 153 154
3 0 138 154 139
3 0 139 154 155
3 0 139 155 140
3 0 140 155 156
3 0 140 156 141
3 0 141 156 157
3 0 141 157 142
3 0 142 157 158
3 0 142 158 143
3 0 143 158 159
3 0 143 159 144
3 0 144 159 160
3 0 144 160 145
3 0 145 160 161
3 0 145 161 146
3 0 146 161 162
3 0 146 162 147
3 0 147 162 163
3 0 147 163 148
3 0 148 163 164
3 0 148 164 149
3 0 150 165 166
3 0 150 166 151
3 0 151 166 167
3 0 151 167 152
3 0 152 167 168
3 0 152 168 153
3 0 153 168 169
3 0 153 169 154
3 0 154 169 170
3 0 154 170 155
3 0 155 170 171
3 0 155 171 156
3 0 156 171 172
3 0 156 172 157
3 0 157 172 173
3 0 157 173 158
3 0 158 173 174
3 0 158 174 159
3 0 159 174 175
3 0 159 175 160
3 0 160 175 176
3 0 160 176 161
3 0 161 176 177
3 0 161 177 162
3 0 162 177 178
3 0 162 178 163
3 0 163 178 179
3 0 163 179 164
3 0 165 180 181
3 0 165 181 166
3 0 166 181 182
3 0 166 182 167
3 0 167 182 183
3 0 167 183 168
3 0 168 183 184
3 0 168 184 169
3 0 169 184 185
3 0 169 185 170
3 0 170 185 186
3 0 170 186 171
3 0 171 186 187
3 0 171 187 172
3 0 172 187 188
3 0 172 188 173
3 0 173 188 189
3 0 173 189 174
3 0 174 189 190
3 0 174 190 175
3 0 175 190 191
3 0 175 191 176
3 0 176 191 192
3 0 176 192 177
3 0 177 192 193
3 0 177 193 178
3 0 178 193 194
3 0 178 194 179
3 0 180 195 196
3 0 180 196 181
3 0 181 196 197
3 0 181 197 182
3 0 182 197 198
3 0 182 198 183
3 0 183 198 199
3 0 183 199 184
3 0 184 199 200
3 0 184 200 185
3 0 185 200 201
3 0 185 201 186
3 0 186 201 202
3 0 186 202 187
3 0 187 202 203
3 0 187 203 188
3 0 188 203 204
3 0 188 204 189
3 0 189 204 205
3 0 189 205 190
3 0 190 205 206
3 0 190 206 191
3 0 191 206 207
3 0 191 207 192
3 0 192 207 208
3 0 192 208 193
3 0 193 208 209
3 0 193 209 194
3 0 195 210 211
3 0 195 211 196
3 0 196 211 212
3 0 196 212 197
3 0 197 212 213
3 0 197 213 198
3 0 198 213 214
3 0 198 214 199
3 0 199 214 215
3 0 199 215 200
3 0 200 215 216
3 0 200 216 201
3 0 201 216 217
3 0 201 217 202
3 0 202 217 218
3 0 202 218 203
3 0 203 218 219
3 0 203 219 204
3 0 204 219 220
3 0 204 220 205
3 0 205 220 221
3 0 205 221 206
3 0 206 221 222
3 0 206 222 207
3 0 207 222 223
3 0 207 223 208
3 0 208 223 224
3 0 208 224 209
3 0 210 225 226
3 0 210 226 211
3 0 211 226 227
3 0 211 227 212
3 0 212 227 228
3 0 212 228 213
3 0 213 228 229
3 0 213 229 214
3 0 214 229 230
3 0 214 230 215
3 0 215 230 231
3 0 215 231 216
3 0 216 231 232
3 0 216 232 217
3 0 217 232 233
3 0 217 233 218
3 0 218 233 234
3 0 218 234 219
3 0 219 234 235
3 0 219 235 220
3 0 220 235 236
3 0 220 236 221
3 0 221 236 237
3 0 221 237 222
3 0 222 237 238
3 0 222 238 223
3 0 223 238 239
3 0 223 239 224
3 0 225 240 241
3 0 225 241 226
3 0 226 241 242
3 0 226 242 227
3 0 227 242 243
3 0 227 243 228
3 0 228 243 244
3 0 228 244 229
3 0 229 244 245
3 0 229 245 230
3 0 230 245 246
3 0 230 246 231
3 0 231 246 247
3 0 231 247 232
3 0 232 247 248
3 0 232 248 233
3 0 233 248 249
3 0 233 249 234
3 0 234 249 250
3 0 234 250 235
3 0 235 250 251
3 0 235 251 236
3 0 236 251 252
3 0 236 252 237
3 0 237 252 253
3 0 237 253 238
3 0 238 253 254
3 0 238 254 239
3 0 240 255 256
3 0 240 256 241
3 0 241 256 257
3 0 241 257 242
3 0 242 257 258
3 0 242 258 243
3 0 243 258 259
3 0 243 259 244
3 0 244 259 260
3 0 244 260 245
3 0 245 260 261
3 0 245 261 246
3 0 246 261 262
3 0 246 262 247
3 0 247 262 263
3 0 247 263 248
3 0 248 263 264
3 0 248 264 249
3 0 249 264 265
3 0 249 265 250
3 0 250 265 266
3 0 250 266 251
3 0 251 266 267
3 0 251 267 252
3 0 252 267 268
3 0 252 268 253
3 0 253 268 269
3 0 253 269 254
3 0 255 270 271
3 0 255 271 256
3 0 256 271 272
3 0 256 272 257
3 0 257 272 273
3 0 257 273 258
3 0 258 273 274
3 0 258 274 259
3 0 259 274 275
3 0 259 275 260
3 0 260 275 276
3 0 260 276 261
3 0 261 276 277
3 0 261 277 262
3 0 262 277 278
3 0 262 278 263
3 0 263 278 279
3 0 263 279 264
3 0 264 279 280
3 0 264 280 265
3 0 265 280 281
3 0 265 281 266
3 0 266 281 282
3 0 266 282 267
3 0 267 282 283
3 0 267 283 268
3 0 268 283 284
3 0 268 284 269
3 0 270 285 286
3 0 270 286 271
3 0 271 286 287
3 0 271 287 272
3 0 272 287 288
3 0 272 288 273
3 0 273 288 289
3 0 273 289 274
3 0 274 289 290
3 0 274 290 275
3 0 275 290 291
3 0 275 291 276
3 0 276 291 292
3 0 276 292 277
3 0 277 292 293
3 0 277 293 278
3 0 278 293 294
3 0 278 294 279
3 0 279 294 295
3 0 279 295 280
3 0 280 295 296
3 0 280 296 281
3 0 281 296 297
3 0 281 297 282
3 0 282 297 298
3 0 282 298 283
3 0 283 298 299
3 0 283 299 284
3 0 285 300 301
3 0 285 301 286
3 0 286 301 302
3 0 286 302 287
3 0 287 302 303
3 0 287 303 288
3 0 288 303 304
3 0 288 304 289
3 0 289 304 305
3 0 289 305 290
3 0 290 305 306
3 0 290 306 291
3 0 291 306 307
3 0 291 307 292
3 0 292 307 308
3 0 292 308 293
3 0 293 308 309
3 0 293 309 294
3 0 294 309 310
3 0 294 310 295
3 0 295 310 311
3 0 295 311 296
3 0 296 311 312
3 0 296 312 297
3 0 297 312 313
3 0 297 313 298
3 0 298 313 314
3 0 298 314 299
3 0 300 315 316
3 0 300 316 301
3 0 301 316 317
3 0 301 317 302
3 0 302 317 318
3 0 302 318 303
3 0 303 318 319
3 0 303 319 304
3 0 304 319 320
3 0 304 320 305
3 0 305 320 321
3 0 305 321 306
3 0 306 321 322
3 0 306 322 307
3 0 307 322 323
3 0 307 323 308
3 0 308 323 324
3 0 308 324 309
3 0 309 324 325
3 0 309 325 310
3 0 310 325 326
3 0 310 326 311
3 0 311 326 327
3 0 311 327 312
3 0 312 327 328
3 0 312 328 313
3 0 313 328 329
3 0 313 329 314
3 0 315 330 331
3 0 315 331 316
3 0 316 331 332
3 0 316 332 317
3 0 317 332 333
3 0 317 333 318
3 0 318 333 334
3 0 318 334 319
3 0 319 334 335
3 0 319 335 320
3 0 320 335 336
3 0 320 336 321
3 0 321 336 337
3 0 321 337 322
3 0 322 337 338
3 0 322 338 323
3 0 323 338 339
3 0 323 339 324
3 0 324 339 340
3 0 324 340 325
3 0 325 340 341
3 0 325 341 326
3 0 326 341 342
3 0 326 342 327
3 0 327 342 343
3 0 327 343 328
3 0 328 343 344
3 0 328 344 329
3 0 330 345 346
3 0 330 346 331
3 0 331 346 347
3 0 331 347 332
3 0 332 347 348
3 0 332 348 333
3 0 333 348 349
3 0 333 349 334
3 0 334 349 350
3 0 334 350 335
3 0 335 350 351
3 0 335 351 336
3 0 336 351 352
3 0 336 352 337
3 0 337 352 353
3 0 337 353 338
3 0 338 353 354
3 0 338 354 339
3 0 339 354 355
3 0 339 355 340
3 0 340 355 356
3 0 340 356 341
3 0 341 356 357
3 0 341 357 342
3 0 342 357 358
3 0 342 358 343
3 0 343 358 359
3 0 343 359 344
3 0 345 360 361
3 0 345 361 346
3 0 346 361 362
3 0 346 362 347
3 0 347 362 363
3 0 347 363 348
3 0 348 363 364
3 0 348 364 349
3 0 349 364 365
3 0 349 365 350
3 0 350 365 366
3 0 350 366 351
3 0 351 366 367
3 0 351 367 352
3 0 352 367 368
3 0 352 368 353
3 0 353 368 369
3 0 353 369 354
3 0 354 369 370
3 0 354 370 355
3 0 355 370 371
3 0 355 371 356
3 0 356 371 372
3 0 356 372 357
3 0 357 372 373
3 0 357 373 358
3 0 358 373 374
3 0 358 374 359
3 0 360 375 376
3 0 360 376 361
3 0 361 376 377
3 0 361 377 362
3 0 362 377 378
3 0 362 378 363
3 0 363 378 379
3 0 363 379 364
3 0 364 379 380
3 0 364 380 365
3 0 365 380 381
3 0 365 381 366
3 0 366 381 382
3 0 366 382 367
3 0 367 382 383
3 0 367 383 368
3 0 368 383 384
3 0 368 384 369
3 0 369 384 385
3 0 369 385 370
3 0 370 385 386
3 0 370 386 371
3 0 371 386 387
3 0 371 387 372
3 0 372 387 388
3 0 372 388 373
3 0 373 388 389
3 0 373 389 374
3 0 375 390 391
3 0 375 391 376
3 0 376 391 392
3 0 376 392 377
3 0 377 392 393
3 0 377 393 378
3 0 378 393 394
3 0 378 394 379
3 0 379 394 395
3 0 379 395 380
3 0 380 395 396
3 0 380 396 381
3 0 381 396 397
3 0 381 397 382
3 0 382 397 398
3 0 382 398 383
3 0 383 398 399
3 0 383 399 384
3 0 384 399 400
3 0 384 400 385
3 0 385 400 401
3 0 385 401 386
3 0 386 401 402
3 0 386 402 387
3 0 387 402 403
3 0 387 403 388
3 0 388 403 404
3 0 388 404 389
3 0 390 405 406
3 0 390 406 391
3 0 391 406 407
3 0 391 407 392
3 0 392 407 408
3 0 392 408 393
3 0 393 408 409
3 0 393 409 394
3 0 394 409 410
3 0 394 410 395
3 0 395 410 411
3 0 395 411 396
3 0 396 411 412
3 0 396 412 397
3 0 397 412 413
3 0 397 413 398
3 0 398 413 414
3 0 398 414 399
3 0 399 414 415
3 0 399 415 400
3 0 400 415 416
3 0 400 416 401
3 0 401 416 417
3 0 401 417 402
3 0 402 417 418
3 0 402 418 403
3 0 403 418 419
3 0 403 419 404
3 0 405 420 421
3 0 405 421 406
3 0 406 421 422
3 0 406 422 407
3 0 407 422 423
3 0 407 423 408
3 0 408 423 424
3 0 408 424 409
3 0 409 424 425
3 0 409 425 410
3 0 410 425 426
3 0 410 426 411
3 0 411 426 427
3 0 411 427 412
3 0 412 427 428
3 0 412 428 413
3 0 413 428 429
3 0 413 429 414
3 0 414 429 430
3 0 414 430 415
3 0 415 430 431
3 0 415 431 416
3 0 416 431 432
3 0 416 432 417
3 0 417 432 433
3 0 417 433 418
3 0 418 433 434
3 0 418 434 419
3 0 420 435 436
3 0 420 436 421
3 0 421 436 437
3 0 421 437 422
3 0 422 437 438
3 0 422 438 423
3 0 423 438 439
3 0 423 439 424
3 0 424 439 440
3 0 424 440 425
3 0 425 440 441
3 0 425 441 426
3 0 426 441 442
3 0 426 442 427
3 0 427 442 443
3 0 427 443 428
3 0 428 443 444
3 0 428 444 429
3 0 429 444 445
3 0 429 445 430
3 0 430 445 446
3 0 430 446 431
3 0 431 446 447
3 0 431 447 432
3 0 432 447 448
3 0 432 448 433
3 0 433 448 449
3 0 433 449 434
3 0 435 450 451
3 0 435 451 436
3 0 436 451 452
3 0 436 452 437
3 0 437 452 453
3 0 437 453 438
3 0 438 453 454
3 0 438 454 439
3 0 439 454 455
3 0 439 455 440
3 0 440 455 456
3 0 440 456 441
3 0 441 456 457
3 0 441 457 442
3 0 442 457 458
3 0 442 458 443
3 0 443 458 459
3 0 443 459 444
3 0 444 459 460
3 0 444 460 445
3 0 445 460 461
3 0 445 461 446
3 0 446 461 462
3 0 446 462 447
3 0 447 462 463
3 0 447 463 448
3 0 448 463 464
3 0 448 464 449
3 0 450 465 466
3 0 450 466 451
3 0 451 466 467
3 0 451 467 452
3 0 452 467 468
3 0 452 468 453
3 0 453 468 469
3 0 453 469 454
3 0 454 469 470
3 0 454 470 455
3 0 455 470 471
3 0 455 471 456
3 0 456 471 472
3 0 456 472 457
3 0 457 472 473
3 0 457 473 458
3 0 458 473 474
3 0 458 474 459
3 0 459 474 475
3 0 459 475 460
3 0 460 475 476
3 0 460 476 461
3 0 461 476 477
3 0 461 477 462
3 0 462 477 478
3 0 462 478 463
3 0 463 478 479
3 0 463 479 464
3 0 465 480 481
3 0 465 481 466
3 0 466 481 482
3 0 466 482 467
3 0 467 482 483
3 0 467 483 468
3 0 468 483 484
3 0 468 484 469
3 0 469 484 485
3 0 469 485 470
3 0 470 485 486
3 0 470 486 471
3 0 471 486 487
3 0 471 487 472
3 0 472 487 488
3 0 472 488 473
3 0 473 488 489
3 0 473 489 474
3 0 474 489 490
3 0 474 490 475
3 0 475 490 491
3 0 475 491 476
3 0 476 491 492
3 0 476 492 477
3 0 477 492 493
3 0 477 493 478
3 0 478 493 494
3 0 478 494 479
3 0 480 495 496
3 0 480 496 481
3 0 481 496 497
3 0 481 497 482
3 0 482 497 498
3 0 482 498 483
3 0 483 498 499
3 0 483 499 484
3 0 484 499 500
3 0 484 500 485
3 0 485 500 501
3 0 485 501 486
3 0 486 501 502
3 0 486 502 487
3 0 487 502 503
3 0 487 503 488
3 0 488 503 504
3 0 488 504 489
3 0 489 504 505
3 0 489 505 490
3 0 490 505 506
3 0 490 506 491
3 0 491 506 507
3 0 491 507 492
3 0 492 507 508
3 0 492 508 493
3 0 493 508 509
3 0 493 509 494
3 0 495 510 511
3 0 495 511 496
3 0 496 511 512
3 0 496 512 497
3 0 497 512 513
3 0 497 513 498
3 0 498 513 514
3 0 498 514 499
3 0 499 514 515
3 0 499 515 500
3 0 500 515 516
3 0 500 516 501
3 0 501 516 517
3 0 501 517 502
3 0 502 517 518
3 0 502 518 503
3 0 503 518 519
3 0 503 519 504
3 0 504 519 520
3 0 504 520 505
3 0 505 520 521
3 0 505 521 506
3 0 506 521 522
3 0 506 522 507
3 0 507 522 523
3 0 507 523 508
3 0 508 523 524
3 0 508 524 509
3 0 510 525 526
3 0 510 526 511
3 0 511 526 527
3 0 511 527 512
3 0 512 527 528
3 0 512 528 513
3 0 513 528 529
3 0 513 529 514
3 0 514 529 530
3 0 514 530 515
3 0 515 530 531
3 0 515 531 516
3 0 516 531 532
3 0 516 532 517
3 0 517 532 533
3 0 517 533 518
3 0 518 533 534
3 0 518 534 519
3 0 519 534 535
3 0 519 535 520
3 0 520 535 536
3 0 520 536 521
3 0 521 536 537
3 0 521 537 522
3 0 522 537 538
3 0 522 538 523
3 0 523 538 539
3 0 523 539 524
3 0 525 540 541
3 0 525 541 526
3 0 526 541 542
3 0 526 542 527
3 0 527 542 543
3 0 527 543 528
3 0 528 543 544
3 0 528 544 529
3 0 529 544 545
3 0 529 545 530
3 0 530 545 546
3 0 530 546 531
3 0 531 546 547
3 0 531 547 532
3 0 532 547 548
3 0 532 548 533
3 0 533 548 549
3 0 533 549 534
3 0 534 549 550
3 0 534 550 535
3 0 535 550 551
3 0 535 551 536
3 0 536 551 552
3 0 536 552 537
3 0 537 552 553
3 0 537 553 538
3 0 538 553 554
3 0 538 554 539
3 0 540 555 556
3 0 540 556 541
3 0 541 556 557
3 0 541 557 542
3 0 542 557 558
3 0 542 558 543
3 0 543 558 559
3 0 543 559 544
3 0 544 559 560
3 0 544 560 545
3 0 545 560 561
3 0 545 561 546
3 0 546 561 562
3 0 546 562 547
3 0 547 562 563
3 0 547 563 548
3 0 548 563 564
3 0 548 564 549
3 0 549 564 565
3 0 549 565 550
3 0 550 565 566
3 0 550 566 551
3 0 551 566 567
3 0 551 567 552
3 0 552 567 568
3 0 552 568 553
3 0 553 568 569
3 0 553 569 554
3 0 555 570 571
3 0 555 571 556
3 0 556 571 572
3 0 556 572 557
3 0 557 572 573
3 0 557 573 558
3 0 558 573 574
3 0 558 574 559
3 0 559 574 575
3 0 559 575 560
3 0 560 575 576
3 0 560 576 561
3 0 561 576 577
3 0 561 577 562
3 0 562 577 578
3 0 562 578 563
3 0 563 578 579
3 0 563 579 564
3 0 564 579 580
3 0 564 580 565
3 0 565 580 581
3 0 565 581 566
3 0 566 581 582
3 0 566 582 567
3 0 567 582 583
3 0 567 583 568
3 0 568 583 584
3 0 568 584 569
3 0 570 585 586
3 0 570 586 571
3 0 571 586 587
3 0 571 587 572
3 0 572 587 588
3 0 572 588 573
3 0 573 588 589
3 0 573 589 574
3 0 574 589 590
3 0 574 590 575
3 0 575 590 591
3 0 575 591 576
3 0 576 591 592
3 0 576 592 577
3 0 577 592 593
3 0 577 593 578
3 0 578 593 594
3 0 578 594 579
3 0 579 594 595
3 0 579 595 580
3 0 580 595 596
3 0 580 596 581
3 0 581 596 597
3 0 581 597 582
3 0 582 597 598
3 0 582 598 583
3 0 583 598 599
3 0 583 599 584
3 0 585 600 601
3 0 585 601 586
3 0 586 601 602
3 0 586 602 587
3 0 587 602 603
3 0 587 603 588
3 0 588 603 604
3 0 588 604 589
3 0 589 604 605
3 0 589 605 590
3 0 590 605 606
3 0 590 606 591
3 0 591 606 607
3 0 591 607 592
3 0 592 607 608
3 0 592 608 593
3 0 593 608 609
3 0 593 609 594
3 0 594 609 610
3 0 594 610 595
3 0 595 610 611
3 0 595 611 596
3 0 596 611 612
3 0 596 612 597
3 0 597 612 613
3 0 597 613 598
3 0 598 613 614
3 0 598 614 599
FACES:
VDATA:
3 0.0 0.002 20
3 0.0 0.002 20
3 0.0 0.002 20
3 0.0 0.002 20
3 -10.0 0.0 0.0
3 -10.0 0.0 0.0
3 -10.0 0.0 0.0
3 -10.0 0.0 0.0
3 -10.0 0.0 0.0
3 -10.0 0.0 0.0
3 -10.0 0.0 0.0
3 -10.0 0.0 0.0
3 -10.0 0.0 0.0
3 -10.0 0.0 0.0
3 -10.0 0.0 0.0
3 0.0 0.002 20
3 0.0 0.002 20
3 0.0 0.002 20
3 0.0 0.002 20
3 -10.0 0.0 0.0
3 -10.0 0.0 0.0
3 -10.0 0.0 0.0
3 -10.0 0.0 0.0
3 -10.0 0.0 0.0
3 -10.0 0.0 0.0
3 -10.0 0.0 0.0
3 -10.0 0.0 0.0
3 -10.0 0.0 0.0
3 -10.0 0.0 0.0
3 -10.0 0.0 0.0
3 0.0 0.002 20
3 0.0 0.002 20
3 0.0 0.002 20
3 0.0 0.002 20
3 -10.0 0.0 0.0
3 -10.0 0.0 0.0
3 -10.0 0.0 0.0
3 -10.0 0.0 0.0
3 -10.0 0.0 0.0
3 -10.0 0.0 0.0
3 -10.0 0.0 0.0
3 -10.0 0.0 0.0
3 -10.0 0.0 0.0
3 -10.0 0.0 0.0
3 -10.0 0.0 0.0
3 0.0 0.002 20
3 0.0 0.002 20
3 0.0 0.002 20
3 0.0 0.002 20
3 -10.0 0.0 0.0
3 -10.0 0.0 0.0
3 -10.0 0.0 0.0
3 -10.0 0.0 0.0
3 -10.0 0.0 0.0
3 -10.0 0.0 0.0
3 -10.0 0.0 0.0
3 -10.0 0.0 0.0
3 -10.0 0.0 0.0
3 -10.0 0.0 0.0
3 -10.0 0.0 0.0
3 -10.0 0.0 0.0
3 -10.0 0.0 0.0
3 -10.0 0.0 0.0
3 -10.0 0.0 0.0
3 -10.0 0.0 0.0
3 -10.0 0.0 0.0
3 -10.0 0.0 0.0
3 -10.0 0.0 0.0
3 -10.0 0.0 0.0
3 -10.0 0.0 0.0
3 -10.0 0.0 0.0
3 -10.0 0.0 0.0
3 -10.0 0.0 0.0
3 -10.0 0.0 0.0
3 -10.0 0.0 0.0
3 -10.0 0.0 0.0
3 -10.0 0.0 0.0
3 -10.0 0.0 0.0
3 -10.0 0.0 0.0
3 -10.0 0.0 0.0
3 -10.0 0.0 0.0
3 -10.0 0.0 0.0
3 -10.0 0.0 0.0
3 -10.0 0.0 0.0
3 -10.0 0.0 0.0
3 -10.0 0.0 0.0
3 -10.0 0.0 0.0
3 -10.0 0.0 0.0
3 -10.0 0.0 0.0
3 -10.0 0.0 0.0
3 -10.0 0.0 0.0
3 -10.0 0.0 0.0
3 -10.0 0.0 0.0
3 -10.0 0.0 0.0
3 -10.0 0.0 0.0
3 -10.0 0.0 0.0
3 -10.0 0.0 0.0
3 -10.0 0.0 0.0
3 -10.0 0.0 0.0
3 -10.0 0.0 0.0
3 -10.0 0.0 0.0
3 -10.0 0.0 0.0
3 -10.0 0.0 0.0
3 -10.0 0.0 0.0
3 -10.0 0.0 0.0
3 -10.0 0.0 0.0
3 -10.0 0.0 0.0
3 -10.0 0.0 0.0
3 -10.0 0.0 0.0
3 -10.0 0.0 0.0
3 -10.0 0.0 0.0
3 -10.0 0.0 0.0
3 -10.0 0.0 0.0
3 -10.0 0.0 0.0
3 -10.0 0.0 0.0
3 -10.0 0.0 0.0
3 -10.0 0.0 0.0
3 -10.0 0.0 0.0
3 -10.0 0.0 0.0
3 -10.0 0.0 0.0
3 -10.0 0.0 0.0
3 -10.0 0.0 0.0
3 -10.0 0.0 0.0
3 -10.0 0.0 0.0
3 -10.0 0.0 0.0
3 -10.0 0.0 0.0
3 -10.0 0.0 0.0
3 -10.0 0.0 0.0
3 -10.0 0.0 0.0
3 -10.0 0.0 0.0
3 -10.0 0.0 0.0
3 -10.0 0.0 0.0
3 -10.0 0.0 0.0
3 -10.0 0.0 0.0
3 -10.0 0.0 0.0
3 -10.0 0.0 0.0
3 -10.0 0.0 0.0
3 -10.0 0.0 0.0
3 -10.0 0.0 0.0
3 -10.0 0.0 0.0
3 -10.0 0.0 0.0
3 -10.0 0.0 0.0
3 -10.0 0.0 0.0
3 -10.0 0.0 0.0
3 -10.0 0.0 0.0
3 -10.0 0.0 0.0
3 -10.0 0.0 0.0
3 -10.0 0.0 0.0
3 -10.0 0.0 0.0
3 -10.0 0.0 0.0
3 -10.0 0.0 0.0
3 -10.0 0.0 0.0
3 -10.0 0.0 0.0
3 -10.0 0.0 0.0
3 -10.0 0.0 0.0
3 -10.0 0.0 0.0
3 -10.0 0.0 0.0
3 -10.0 0.0 0.0
3 -10.0 0.0 0.0
3 -10.0 0.0 0.0
3 -10.0 0.0 0.0
3 -10.0 0.0 0.0
3 -10.0 0.0 0.0
3 -10.0 0.0 0.0
3 -10.0 0.0 0.0
3 -10.0 0.0 0.0
3 -10.0 0.0 0.0
3 -10.0 0.0 0.0
3 -10.0 0.0 0.0
3 -10.0 0.0 0.0
3 -10.0 0.0 0.0
3 -10.0 0.0 0.0
3 -10.0 0.0 0.0
3 -10.0 0.0 0.0
3 -10.0 0.0 0.0
3 -10.0 0.0 0.0
3 -10.0 0.0 0.0
3 -10.0 0.0 0.0
3 -10.0 0.0 0.0
3 -10.0 0.0 0.0
3 -10.0 0.0 0.0
3 -10.0 0.0 0.0
3 -10.0 0.0 0.0
3 -10.0 0.0 0.0
3 -10.0 0.0 0.0
3 -10.0 0.0 0.0
3 -10.0 0.0 0.0
3 -10.0 0.0 0.0
3 -10.0 0.0 0.0
3 -10.0 0.0 0.0
3 -10.0 0.0 0.0
3 -10.0 0.0 0.0
3 -10.0 0.0 0.0
3 -10.0 0.0 0.0
3 -10.0 0.0 0.0
3 -10.0 0.0 0.0
3 -10.0 0.0 0.0
3 -10.0 0.0 0.0
3 -10.0 0.0 0.0
3 -10.0 0.0 0.0
3 -10.0 0.0 0.0
3 -10.0 0.0 0.0
3 -10.0 0.0 0.0
3 -10.0 0.0 0.0
3 -10.0 0.0 0.0
3 -10.0 0.0 0.0
3 -10.0 0.0 0.0
3 -10.0 0.0 0.0
3 -10.0 0.0 0.0
3 -10.0 0.0 0.0
3 -10.0 0.0 0.0
3 -10.0 0.0 0.0
3 -10.0 0.0 0.0
3 -10.0 0.0 0.0
3 -10.0 0.0 0.0
3 -10.0 0.0 0.0
3 -10.0 0.0 0.0
3 -10.0 0.0 0.0
3 -10.0 0.0 0.0
3 -10.0 0.0 0.0
3 -10.0 0.0 0.0
3 -10.0 0.0 0.0
3 -10.0 0.0 0.0
3 -10.0 0.0 0.0
3 -10.0 0.0 0.0
3 -10.0 0.0 0.0
3 -10.0 0.0 0.0
3 -10.0 0.0 0.0
3 -10.0 0.0 0.0
3 -10.0 0.0 0.0
3 -10.0 0.0 0.0
3 -10.0 0.0 0.0
3 -10.0 0.0 0.0
3 -10.0 0.0 0.0
3 -10.0 0.0 0.0
3 -10.0 0.0 0.0
3 -10.0 0.0 0.0
3 -10.0 0.0 0.0
3 -10.0 0.0 0.0
3 -10.0 0.0 0.0
3 -10.0 0.0 0.0
3 -10.0 0.0 0.0
3 -10.0 0.0 0.0
3 -10.0 0.0 0.0
3 -10.0 0.0 0.0
3 -10.0 0.0 0.0
3 -10.0 0.0 0.0
3 -10.0 0.0 0.0
3 -10.0 0.0 0.0
3 -10.0 0.0 0.0
3 -10.0 0.0 0.0
3 -10.0 0.0 0.0
3 -10.0 0.0 0.0
3 -10.0 0.0 0.0
3 -10.0 0.0 0.0
3 -10.0 0.0 0.0
3 -10.0 0.0 0.0
3 -10.0 0.0 0.0
3 -10.0 0.0 0.0
3 -10.0 0.0 0.0
3 -10.0 0.0 0.0
3 -10.0 0.0 0.0
3 -10.0 0.0 0.0
3 -10.0 0.0 0.0
3 -10.0 0.0 0.0
3 -10.0 0.0 0.0
3 -10.0 0.0 0.0
3 -10.0 0.0 0.0
3 -10.0 0.0 0.0
3 -10.0 0.0 0.0
3 -10.0 0.0 0.0
3 -10.0 0.0 0.0
3 -10.0 0.0 0.0
3 -10.0 0.0 0.0
3 -10.0 0.0 0.0
3 -10.0 0.0 0.0
3 -10.0 0.0 0.0
3 -10.0 0.0 0.0
3 -10.0 0.0 0.0
3 -10.0 0.0 0.0
3 -10.0 0.0 0.0
3 -10.0 0.0 0.0
3 -10.0 0.0 0.0
3 -10.0 0.0 0.0
3 -10.0 0.0 0.0
3 -10.0 0.0 0.0
3 -10.0 0.0 0.0
3 -10.0 0.0 0.0
3 -10.0 0.0 0.0
3 -10.0 0.0 0.0
3 -10.0 0.0 0.0
3 -10.0 0.0 0.0
3 -10.0 0.0 0.0
3 -10.0 0.0 0.0
3 -10.0 0.0 0.0
3 -10.0 0.0 0.0
3 -10.0 0.0 0.0
3 -10.0 0.0 0.0
3 -10.0 0.0 0.0
3 -10.0 0.0 0.0
3 -10.0 0.0 0.0
3 -10.0 0.0 0.0
3 -10.0 0.0 0.0
3 -10.0 0.0 0.0
3 -10.0 0.0 0.0
3 -10.0 0.0 0.0
3 -10.0 0.0 0.0
3 -10.0 0.0 0.0
3 -10.0 0.0 0.0
3 -10.0 0.0 0.0
3 -10.0 0.0 0.0
3 -10.0 0.0 0.0
3 -10.0 0.0 0.0
3 -10.0 0.0 0.0
3 -10.0 0.0 0.0
3 -10.0 0.0 0.0
3 -10.0 0.0 0.0
3 -10.0 0.0 0.0
3 -10.0 0.0 0.0
3 -10.0 0.0 0.0
3 -10.0 0.0 0.0
3 -10.0 0.0 0.0
3 -10.0 0.0 0.0
3 -10.0 0.0 0.0
3 -10.0 0.0 0.0
3 -10.0 0.0 0.0
3 -10.0 0.0 0.0
3 -10.0 0.0 0.0
3 -10.0 0.0 0.0
3 -10.0 0.0 0.0
3 -10.0 0.0 0.0
3 -10.0 0.0 0.0
3 -10.0 0.0 0.0
3 -10.0 0.0 0.0
3 -10.0 0.0 0.0
3 -10.0 0.0 0.0
3 -10.0 0.0 0.0
3 -10.0 0.0 0.0
3 -10.0 0.0 0.0
3 -10.0 0.0 0.0
3 -10.0 0.0 0.0
3 -10.0 0.0 0.0
3 -10.0 0.0 0.0
3 -10.0 0.0 0.0
3 -10.0 0.0 0.0
3 -10.0 0.0 0.0
3 -10.0 0.0 0.0
3 -10.0 0.0 0.0
3 -10.0 0.0 0.0
3 -10.0 0.0 0.0
3 -10.0 0.0 0.0
3 -10.0 0.0 0.0
3 -10.0 0.0 0.0
3 -10.0 0.0 0.0
3 -10.0 0.0 0.0
3 -10.0 0.0 0.0
3 -10.0 0.0 0.0
3 -10.0 0.0 0.0
3 -10.0 0.0 0.0
3 -10.0 0.0 0.0
3 -10.0 0.0 0.0
3 -10.0 0.0 0.0
3 -10.0 0.0 0.0
3 -10.0 0.0 0.0
3 -10.0 0.0 0.0
3 -10.0 0.0 0.0
3 -10.0 0.0 0.0
3 -10.0 0.0 0.0
3 -10.0 0.0 0.0
3 -10.0 0.0 0.0
3 -10.0 0.0 0.0
3 -10.0 0.0 0.0
3 -10.0 0.0 0.0
3 -10.0 0.0 0.0
3 -10.0 0.0 0.0
3 -10.0 0.0 0.0
3 -10.0 0.0 0.0
3 -10.0 0.0 0.0
3 -10.0 0.0 0.0
3 -10.0 0.0 0.0
3 -10.0 0.0 0.0
3 -10.0 0.0 0.0
3 -10.0 0.0 0.0
3 -10.0 0.0 0.0
3 -10.0 0.0 0.0
3 -10.0 0.0 0.0
3 -10.0 0.0 0.0
3 -10.0 0.0 0.0
3 -10.0 0.0 0.0
3 -10.0 0.0 0.0
3 -10.0 0.0 0.0
3 -10.0 0.0 0.0
3 -10.0 0.0 0.0
3 -10.0 0.0 0.0
3 -10.0 0.0 0.0
3 -10.0 0.0 0.0
3 -10.0 0.0 0.0
3 -10.0 0.0 0.0
3 -10.0 0.0 0.0
3 -10.0 0.0 0.0
3 -10.0 0.0 0.0
3 -10.0 0.0 0.0
3 -10.0 0.0 0.0
3 -10.0 0.0 0.0
3 -10.0 0.0 0.0
3 -10.0 0.0 0.0
3 -10.0 0.0 0.0
3 -10.0 0.0 0.0
3 -10.0 0.0 0.0
3 -10.0 0.0 0.0
3 -10.0 0.0 0.0
3 -10.0 0.0 0.0
3 -10.0 0.0 0.0
3 -10.0 0.0 0.0
3 -10.0 0.0 0.0
3 -10.0 0.0 0.0
3 -10.0 0.0 0.0
3 -10.0 0.0 0.0
3 -10.0 0.0 0.0
3 -10.0 0.0 0.0
3 -10.0 0.0 0.0
3 -10.0 0.0 0.0
3 -10.0 0.0 0.0
3 -10.0 0.0 0.0
3 -10.0 0.0 0.0
3 -10.0 0.0 0.0
3 -10.0 0.0 0.0
3 -10.0 0.0 0.0
3 -10.0 0.0 0.0
3 -10.0 0.0 0.0
3 -10.0 0.0 0.0
3 -10.0 0.0 0.0
3 -10.0 0.0 0.0
3 -10.0 0.0 0.0
3 -10.0 0.0 0.0
3 -10.0 0.0 0.0
3 -10.0 0.0 0.0
3 -10.0 0.0 0.0
3 -10.0 0.0 0.0
3 -10.0 0.0 0.0
3 -10.0 0.0 0.0
3 -10.0 0.0 0.0
3 -10.0 0.0 0.0
3 -10.0 0.0 0.0
3 -10.0 0.0 0.0
3 -10.0 0.0 0.0
3 -10.0 0.0 0.0
3 -10.0 0.0 0.0
3 -10.0 0.0 0.0
3 -10.0 0.0 0.0
3 -10.0 0.0 0.0
3 -10.0 0.0 0.0
3 -10.0 0.0 0.0
3 -10.0 0.0 0.0
3 -10.0 0.0 0.0
3 -10.0 0.0 0.0
3 -10.0 0.0 0.0
3 -10.0 0.0 0.0
3 -10.0 0.0 0.0
3 -10.0 0.0 0.0
3 -10.0 0.0 0.0
3 -10.0 0.0 0.0
3 -10.0 0.0 0.0
3 -10.0 0.0 0.0
3 -10.0 0.0 0.0
3 -10.0 0.0 0.0
3 -10.0 0.0 0.0
3 -10.0 0.0 0.0
3 -10.0 0.0 0.0
3 -10.0 0.0 0.0
3 -10.0 0.0 0.0
3 -10.0 0.0 0.0
3 -10.0 0.0 0.0
3 -10.0 0.0 0.0
3 -10.0 0.0 0.0
3 -10.0 0.0 0.0
3 -10.0 0.0 0.0
3 -10.0 0.0 0.0
3 -10.0 0.0 0.0
3 -10.0 0.0 0.0
3 -10.0 0.0 0.0
3 -10.0 0.0 0.0
3 -10.0 0.0 0.0
3 -10.0 0.0 0.0
3 -10.0 0.0 0.0
3 -10.0 0.0 0.0
3 -10.0 0.0 0.0
3 -10.0 0.0 0.0
3 -10.0 0.0 0.0
3 -10.0 0.0 0.0
3 -10.0 0.0 0.0
3 -10.0 0.0 0.0
3 -10.0 0.0 0.0
3 -10.0 0.0 0.0
3 -10.0 0.0 0.0
3 -10.0 0.0 0.0
3 -10.0 0.0 0.0
3 -10.0 0.0 0.0
3 -10.0 0.0 0.0
3 -10.0 0.0 0.0
3 -10.0 0.0 0.0
3 -10.0 0.0 0.0
3 -10.0 0.0 0.0
3 -10.0 0.0 0.0
3 -10.0 0.0 0.0
3 -10.0 0.0 0.0
3 -10.0 0.0 0.0
3 -10.0 0.0 0.0
3 -10.0 0.0 0.0
3 -10.0 0.0 0.0
3 -10.0 0.0 0.0
3 -10.0 0.0 0.0
3 -10.0 0.0 0.0
3 -10.0 0.0 0.0
3 -10.0 0.0 0.0
3 -10.0 0.0 0.0
3 -10.0 0.0 0.0
3 -10.0 0.0 0.0
3 -10.0 0.0 0.0
3 -10.0 0.0 0.0
3 -10.0 0.0 0.0
3 -10.0 0.0 0.0
3 -10.0 0.0 0.0
3 -10.0 0.0 0.0
3 -10.0 0.0 0.0
3 -10.0 0.0 0.0
3 -10.0 0.0 0.0
3 -10.0 0.0 0.0
3 -10.0 0.0 0.0
3 -10.0 0.0 0.0
3 -10.0 0.0 0.0
3 -10.0 0.0 0.0
3 -10.0 0.0 0.0
3 -10.0 0.0 0.0
3 -10.0 0.0 0.0
3 -10.0 0.0 0.0
3 -10.0 0.0 0.0
3 -10.0 0.0 0.0
3 -10.0 0.0 0.0
3 -10.0 0.0 0.0
3 -10.0 0.0 0.0
3 -10.0 0.0 0.0
3 -10.0 0.0 0.0
3 -10.0 0.0 0.0
3 -10.0 0.0 0.0
3 -10.0 0.0 0.0
3 -10.0 0.0 0.0
3 -10.0 0.0 0.0
3 -10.0 0.0 0.0
3 -10.0 0.0 0.0
3 -10.0 0.0 0.0
3 -10.0 0.0 0.0
3 -10.0 0.0 0.0
3 -10.0 0.0 0.0
3 -10.0 0.0 0.0
3 -10.0 0.0 0.0
3 -10.0 0.0 0.0
3 -10.0 0.0 0.0
3 -10.0 0.0 0.0
3 -10.0 0.0 0.0
3 -10.0 0.0 0.0
3 -10.0 0.0 0.0
3 -10.0 0.0 0.0
3 -10.0 0.0 0.0
3 -10.0 0.0 0.0
3 -10.0 0.0 0.0
3 -10.0 0.0 0.0
3 -10.0 0.0 0.0
3 -10.0 0.0 0.0
3 -10.0 0.0 0.0
3 -10.0 0.0 0.0
3 -10.0 0.0 0.0
3 -10.0 0.0 0.0
3 -10.0 0.0 0.0
3 -10.0 0.0 0.0
3 -10.0 0.0 0.0
3 -10.0 0.0 0.0
3 -10.0 0.0 0.0
3 -10.0 0.0 0.0
3 -10.0 0.0 0.0
3 -10.0 0.0 0.0
3 -10.0 0.0 0.0
3 -10.0 0.0 0.0
3 -10.0 0.0 0.0
3 -10.0 0.0 0.0
3 -10.0 0.0 0.0
3 -10.0 0.0 0.0
3 -10.0 0.0 0.0
3 -10.0 0.0 0.0
3 -10.0 0.0 0.0
3 -10.0 0.0 0.0
3 -10.0 0.0 0.0
3 -10.0 0.0 0.0
3 -10.0 0.0 0.0
3 -10.0 0.0 0.0
3 -10.0 0.0 0.0
3 -10.0 0.0 0.0
3 -10.0 0.0 0.0
3 -10.0 0.0 0.0
3 -10.0 0.0 0.0
3 -10.0 0.0 0.0
3 -10.0 0.0 0.0
3 -10.0 0.0 0.0
3 -10.0 0.0 0.0
3 -10.0 0.0 0.0
3 -10.0 0.0 0.0
3 -10.0 0.0 0.0
3 -10.0 0.0 0.0
3 -10.0 0.0 0.0
3 -10.0 0.0 0.0
3 -10.0 0.0 0.0
3 -10.0 0.0 0.0
3 -10.0 0.0 0.0
3 -10.0 0.0 0.0
3 -10.0 0.0 0.0
CDATA:
9 1 0 0 0 1 0 0 0 1
9 1 0 0 0 1 0 0 0 1
9 1 0 0 0 1 0 0 0 1
9 1 0 0 0 1 0 0 0 1
9 1 0 0 0 1 0 0 0 1
9 1 0 0 0 1 0 0 0 1
9 1 0 0 0 1 0 0 0 1
9 1 0 0 0 1 0 0 0 1
9 1 0 0 0 1 0 0 0 1
9 1 0 0 0 1 0 0 0 1
9 1 0 0 0 1 0 0 0 1
9 1 0 0 0 1 0 0 0 1
9 1 0 0 0 1 0 0 0 1
9 1 0 0 0 1 0 0 0 1
9 1 0 0 0 1 0 0 0 1
9 1 0 0 0 1 0 0 0 1
9 1 0 0 0 1 0 0 0 1
9 1 0 0 0 1 0 0 0 1
9 1 0 0 0 1 0 0 0 1
9 1 0 0 0 1 0 0 0 1
9 1 0 0 0 1 0 0 0 1
9 1 0 0 0 1 0 0 0 1
9 1 0 0 0 1 0 0 0 1
9 1 0 0 0 1 0 0 0 1
9 1 0 0 0 1 0 0 0 1
9 1 0 0 0 1 0 0 0 1
9 1 0 0 0 1 0 0 0 1
9 1 0 0 0 1 0 0 0 1
9 1 0 0 0 1 0 0 0 1
9 1 0 0 0 1 0 0 0 1
9 1 0 0 0 1 0 0 0 1
9 1 0 0 0 1 0 0 0 1
9 1 0 0 0 1 0 0 0 1
9 1 0 0 0 1 0 0 0 1
9 1 0 0 0 1 0 0 0 1
9 1 0 0 0 1 0 0 0 1
9 1 0 0 0 1 0 0 0 1
9 1 0 0 0 1 0 0 0 1
9 1 0 0 0 1 0 0 0 1
9 1 0 0 0 1 0 0 0 1
9 1 0 0 0 1 0 0 0 1
9 1 0 0 0 1 0 0 0 1
9 1 0 0 0 1 0 0 0 1
9 1 0 0 0 1 0 0 0 1
9 1 0 0 0 1 0 0 0 1
9 1 0 0 0 1 0 0 0 1
9 1 0 0 0 1 0 0 0 1
9 1 0 0 0 1 0 0 0 1
9 1 0 0 0 1 0 0 0 1
9 1 0 0 0 1 0 0 0 1
9 1 0 0 0 1 0 0 0 1
9 1 0 0 0 1 0 0 0 1
9 1 0 0 0 1 0 0 0 1
9 1 0 0 0 1 0 0 0 1
9 1 0 0 0 1 0 0 0 1
9 1 0 0 0 1 0 0 0 1
9 1 0 0 0 1 0 0 0 1
9 1 0 0 0 1 0 0 0 1
9 1 0 0 0 1 0 0 0 1
9 1 0 0 0 1 0 0 0 1
9 1 0 0 0 1 0 0 0 1
9 1 0 0 0 1 0 0 0 1
9 1 0 0 0 1 0 0 0 1
9 1 0 0 0 1 0 0 0 1
9 1 0 0 0 1 0 0 0 1
9 1 0 0 0 1 0 0 0 1
9 1 0 0 0 1 0 0 0 1
9 1 0 0 0 1 0 0 0 1
9 1 0 0 0 1 0 0 0 1
9 1 0 0 0 1 0 0 0 1
9 1 0 0 0 1 0 0 0 1
9 1 0 0 0 1 0 0 0 1
9 1 0 0 0 1 0 0 0 1
9 1 0 0 0 1 0 0 0 1
9 1 0 0 0 1 0 0 0 1
9 1 0 0 0 1 0 0 0 1
9 1 0 0 0 1 0 0 0 1
9 1 0 0 0 1 0 0 0 1
9 1 0 0 0 1 0 0 0 1
9 1 0 0 0 1 0 0 0 1
9 1 0 0 0 1 0 0 0 1
9 1 0 0 0 1 0 0 0 1
9 1 0 0 0 1 0 0 0 1
9 1 0 0 0 1 0 0 0 1
9 1 0 0 0 1 0 0 0 1
9 1 0 0 0 1 0 0 0 1
9 1 0 0 0 1 0 0 0 1
9 1 0 0 0 1 0 0 0 1
9 1 0 0 0 1 0 0 0 1
9 1 0 0 0 1 0 0 0 1
9 1 0 0 0 1 0 0 0 1
9 1 0 0 0 1 0 0 0 1
9 1 0 0 0 1 0 0 0 1
9 1 0 0 0 1 0 0 0 1
9 1 0 0 0 1 0 0 0 1
9 1 0 0 0 1 0 0 0 1
9 1 0 0 0 1 0 0 0 1
9 1 0 0 0 1 0 0 0 1
9 1 0 0 0 1 0 0 0 1
9 1 0 0 0 1 0 0 0 1
9 1 0 0 0 1 0 0 0 1
9 1 0 0 0 1 0 0 0 1
9 1 0 0 0 1 0 0 0 1
9 1 0 0 0 1 0 0 0 1
9 1 0 0 0 1 0 0 0 1
9 1 0 0 0 1 0 0 0 1
9 1 0 0 0 1 0 0 0 1
9 1 0 0 0 1 0 0 0 1
9 1 0 0 0 1 0 0 0 1
9 1 0 0 0 1 0 0 0 1
9 1 0 0 0 1 0 0 0 1
9 1 0 0 0 1 0 0 0 1
9 1 0 0 0 1 0 0 0 1
9 1 0 0 0 1 0 0 0 1
9 1 0 0 0 1 0 0 0 1
9 1 0 0 0 1 0 0 0 1
9 1 0 0 0 1 0 0 0 1
9 1 0 0 0 1 0 0 0 1
9 1 0 0 0 1 0 0 0 1
9 1 0 0 0 1 0 0 0 1
9 1 0 0 0 1 0 0 0 1
9 1 0 0 0 1 0 0 0 1
9 1 0 0 0 1 0 0 0 1
9 1 0 0 0 1 0 0 0 1
9 1 0 0 0 1 0 0 0 1
9 1 0 0 0 1 0 0 0 1
9 1 0 0 0 1 0 0 0 1
9 1 0 0 0 1 0 0 0 1
9 1 0 0 0 1 0 0 0 1
9 1 0 0 0 1 0 0 0 1
9 1 0 0 0 1 0 0 0 1
9 1 0 0 0 1 0 0 0 1
9 1 0 0 0 1 0 0 0 1
9 1 0 0 0 1 0 0 0 1
9 1 0 0 0 1 0 0 0 1
9 1 0 0 0 1 0 0 0 1
9 1 0 0 0 1 0 0 0 1
9 1 0 0 0 1 0 0 0 1
9 1 0 0 0 1 0 0 0 1
9 1 0 0 0 1 0 0 0 1
9 1 0 0 0 1 0 0 0 1
9 1 0 0 0 1 0 0 0 1
9 1 0 0 0 1 0 0 0 1
9 1 0 0 0 1 0 0 0 1
9 1 0 0 0 1 0 0 0 1
9 1 0 0 0 1 0 0 0 1
9 1 0 0 0 1 0 0 0 1
9 1 0 0 0 1 0 0 0 1
9 1 0 0 0 1 0 0 0 1
9 1 0 0 0 1 0 0 0 1
9 1 0 0 0 1 0 0 0 1
9 1 0 0 0 1 0 0 0 1
9 1 0 0 0 1 0 0 0 1
9 1 0 0 0 1 0 0 0 1
9 1 0 0 0 1 0 0 0 1
9 1 0 0 0 1 0 0 0 1
9 1 0 0 0 1 0 0 0 1
9 1 0 0 0 1 0 0 0 1
9 1 0 0 0 1 0 0 0 1
9 1 0 0 0 1 0 0 0 1
9 1 0 0 0 1 0 0 0 1
9 1 0 0 0 1 0 0 0 1
9 1 0 0 0 1 0 0 0 1
9 1 0 0 0 1 0 0 0 1
9 1 0 0 0 1 0 0 0 1
9 1 0 0 0 1 0 0 0 1
9 1 0 0 0 1 0 0 0 1
9 1 0 0 0 1 0 0 0 1
9 1 0 0 0 1 0 0 0 1
9 1 0 0 0 1 0 0 0 1
9 1 0 0 0 1 0 0 0 1
9 1 0 0 0 1 0 0 0 1
9 1 0 0 0 1 0 0 0 1
9 1 0 0 0 1 0 0 0 1
9 1 0 0 0 1 0 0 0 1
9 1 0 0 0 1 0 0 0 1
9 1 0 0 0 1 0 0 0 1
9 1 0 0 0 1 0 0 0 1
9 1 0 0 0 1 0 0 0 1
9 1 0 0 0 1 0 0 0 1
9 1 0 0 0 1 0 0 0 1
9 1 0 0 0 1 0 0 0 1
9 1 0 0 0 1 0 0 0 1
9 1 0 0 0 1 0 0 0 1
9 1 0 0 0 1 0 0 0 1
9 1 0 0 0 1 0 0 0 1
9 1 0 0 0 1 0 0 0 1
9 1 0 0 0 1 0 0 0 1
9 1 0 0 0 1 0 0 0 1
9 1 0 0 0 1 0 0 0 1
9 1 0 0 0 1 0 0 0 1
9 1 0 0 0 1 0 0 0 1
9 1 0 0 0 1 0 0 0 1
9 1 0 0 0 1 0 0 0 1
9 1 0 0 0 1 0 0 0 1
9 1 0 0 0 1 0 0 0 1
9 1 0 0 0 1 0 0 0 1
9 1 0 0 0 1 0 0 0 1
9 1 0 0 0 1 0 0 0 1
9 1 0 0 0 1 0 0 0 1
9 1 0 0 0 1 0 0 0 1
9 1 0 0 0 1 0 0 0 1
9 1 0 0 0 1 0 0 0 1
9 1 0 0 0 1 0 0 0 1
9 1 0 0 0 1 0 0 0 1
9 1 0 0 0 1 0 0 0 1
9 1 0 0 0 1 0 0 0 1
9 1 0 0 0 1 0 0 0 1
9 1 0 0 0 1 0 0 0 1
9 1 0 0 0 1 0 0 0 1
9 1 0 0 0 1 0 0 0 1
9 1 0 0 0 1 0 0 0 1
9 1 0 0 0 1 0 0 0 1
9 1 0 0 0 1 0 0 0 1
9 1 0 0 0 1 0 0 0 1
9 1 0 0 0 1 0 0 0 1
9 1 0 0 0 1 0 0 0 1
9 1 0 0 0 1 0 0 0 1
9 1 0 0 0 1 0 0 0 1
9 1 0 0 0 1 0 0 0 1
9 1 0 0 0 1 0 0 0 1
9 1 0 0 0 1 0 0 0 1
9 1 0 0 0 1 0 0 0 1
9 1 0 0 0 1 0 0 0 1
9 1 0 0 0 1 0 0 0 1
9 1 0 0 0 1 0 0 0 1
9 1 0 0 0 1 0 0 0 1
9 1 0 0 0 1 0 0 0 1
9 1 0 0 0 1 0 0 0 1
9 1 0 0 0 1 0 0 0 1
9 1 0 0 0 1 0 0 0 1
9 1 0 0 0 1 0 0 0 1
9 1 0 0 0 1 0 0 0 1
9 1 0 0 0 1 0 0 0 1
9 1 0 0 0 1 0 0 0 1
9 1 0 0 0 1 0 0 0 1
9 1 0 0 0 1 0 0 0 1
9 1 0 0 0 1 0 0 0 1
9 1 0 0 0 1 0 0 0 1
9 1 0 0 0 1 0 0 0 1
9 1 0 0 0 1 0 0 0 1
9 1 0 0 0 1 0 0 0 1
9 1 0 0 0 1 0 0 0 1
9 1 0 0 0 1 0 0 0 1
9 1 0 0 0 1 0 0 0 1
9 1 0 0 0 1 0 0 0 1
9 1 0 0 0 1 0 0 0 1
9 1 0 0 0 1 0 0 0 1
9 1 0 0 0 1 0 0 0 1
9 1 0 0 0 1 0 0 0 1
9 1 0 0 0 1 0 0 0 1
9 1 0 0 0 1 0 0 0 1
9 1 0 0 0 1 0 0 0 1
9 1 0 0 0 1 0 0 0 1
9 1 0 0 0 1 0 0 0 1
9 1 0 0 0 1 0 0 0 1
9 1 0 0 0 1 0 0 0 1
9 1 0 0 0 1 0 0 0 1
9 1 0 0 0 1 0 0 0 1
9 1 0 0 0 1 0 0 0 1
9 1 0 0 0 1 0 0 0 1
9 1 0 0 0 1 0 0 0 1
9 1 0 0 0 1 0 0 0 1
9 1 0 0 0 1 0 0 0 1
9 1 0 0 0 1 0 0 0 1
9 1 0 0 0 1 0 0 0 1
9 1 0 0 0 1 0 0 0 1
9 1 0 0 0 1 0 0 0 1
9 1 0 0 0 1 0 0 0 1
9 1 0 0 0 1 0 0 0 1
9 1 0 0 0 1 0 0 0 1
9 1 0 0 0 1 0 0 0 1
9 1 0 0 0 1 0 0 0 1
9 1 0 0 0 1 0 0 0 1
9 1 0 0 0 1 0 0 0 1
9 1 0 0 0 1 0 0 0 1
9 1 0 0 0 1 0 0 0 1
9 1 0 0 0 1 0 0 0 1
9 1 0 0 0 1 0 0 0 1
9 1 0 0 0 1 0 0 0 1
9 1 0 0 0 1 0 0 0 1
9 1 0 0 0 1 0 0 0 1
9 1 0 0 0 1 0 0 0 1
9 1 0 0 0 1 0 0 0 1
9 1 0 0 0 1 0 0 0 1
9 1 0 0 0 1 0 0 0 1
9 1 0 0 0 1 0 0 0 1
9 1 0 0 0 1 0 0 0 1
9 1 0 0 0 1 0 0 0 1
9 1 0 0 0 1 0 0 0 1
9 1 0 0 0 1 0 0 0 1
9 1 0 0 0 1 0 0 0 1
9 1 0 0 0 1 0 0 0 1
9 1 0 0 0 1 0 0 0 1
9 1 0 0 0 1 0 0 0 1
9 1 0 0 0 1 0 0 0 1
9 1 0 0 0 1 0 0 0 1
9 1 0 0 0 1 0 0 0 1
9 1 0 0 0 1 0 0 0 1
9 1 0 0 0 1 0 0 0 1
9 1 0 0 0 1 0 0 0 1
9 1 0 0 0 1 0 0 0 1
9 1 0 0 0 1 0 0 0 1
9 1 0 0 0 1 0 0 0 1
9 1 0 0 0 1 0 0 0 1
9 1 0 0 0 1 0 0 0 1
9 1 0 0 0 1 0 0 0 1
9 1 0 0 0 1 0 0 0 1
9 1 0 0 0 1 0 0 0 1
9 1 0 0 0 1 0 0 0 1
9 1 0 0 0 1 0 0 0 1
9 1 0 0 0 1 0 0 0 1
9 1 0 0 0 1 0 0 0 1
9 1 0 0 0 1 0 0 0 1
9 1 0 0 0 1 0 0 0 1
9 1 0 0 0 1 0 0 0 1
9 1 0 0 0 1 0 0 0 1
9 1 0 0 0 1 0 0 0 1
9 1 0 0 0 1 0 0 0 1
9 1 0 0 0 1 0 0 0 1
9 1 0 0 0 1 0 0 0 1
9 1 0 0 0 1 0 0 0 1
9 1 0 0 0 1 0 0 0 1
9 1 0 0 0 1 0 0 0 1
9 1 0 0 0 1 0 0 0 1
9 1 0 0 0 1 0 0 0 1
9 1 0 0 0 1 0 0 0 1
9 1 0 0 0 1 0 0 0 1
9 1 0 0 0 1 0 0 0 1
9 1 0 0 0 1 0 0 0 1
9 1 0 0 0 1 0 0 0 1
9 1 0 0 0 1 0 0 0 1
9 1 0 0 0 1 0 0 0 1
9 1 0 0 0 1 0 0 0 1
9 1 0 0 0 1 0 0 0 1
9 1 0 0 0 1 0 0 0 1
9 1 0 0 0 1 0 0 0 1
9 1 0 0 0 1 0 0 0 1
9 1 0 0 0 1 0 0 0 1
9 1 0 0 0 1 0 0 0 1
9 1 0 0 0 1 0 0 0 1
9 1 0 0 0 1 0 0 0 1
9 1 0 0 0 1 0 0 0 1
9 1 0 0 0 1 0 0 0 1
9 1 0 0 0 1 0 0 0 1
9 1 0 0 0 1 0 0 0 1
9 1 0 0 0 1 0 0 0 1
9 1 0 0 0 1 0 0 0 1
9 1 0 0 0 1 0 0 0 1
9 1 0 0 0 1 0 0 0 1
9 1 0 0 0 1 0 0 0 1
9 1 0 0 0 1 0 0 0 1
9 1 0 0 0 1 0 0 0 1
9 1 0 0 0 1 0 0 0 1
9 1 0 0 0 1 0 0 0 1
9 1 0 0 0 1 0 0 0 1
9 1 0 0 0 1 0 0 0 1
9 1 0 0 0 1 0 0 0 1
9 1 0 0 0 1 0 0 0 1
9 1 0 0 0 1 0 0 0 1
9 1 0 0 0 1 0 0 0 1
9 1 0 0 0 1 0 0 0 1
9 1 0 0 0 1 0 0 0 1
9 1 0 0 0 1 0 0 0 1
9 1 0 0 0 1 0 0 0 1
9 1 0 0 0 1 0 0 0 1
9 1 0 0 0 1 0 0 0 1
9 1 0 0 0 1 0 0 0 1
9 1 0 0 0 1 0 0 0 1
9 1 0 0 0 1 0 0 0 1
9 1 0 0 0 1 0 0 0 1
9 1 0 0 0 1 0 0 0 1
9 1 0 0 0 1 0 0 0 1
9 1 0 0 0 1 0 0 0 1
9 1 0 0 0 1 0 0 0 1
9 1 0 0 0 1 0 0 0 1
9 1 0 0 0 1 0 0 0 1
9 1 0 0 0 1 0 0 0 1
9 1 0 0 0 1 0 0 0 1
9 1 0 0 0 1 0 0 0 1
9 1 0 0 0 1 0 0 0 1
9 1 0 0 0 1 0 0 0 1
9 1 0 0 0 1 0 0 0 1
9 1 0 0 0 1 0 0 0 1
9 1 0 0 0 1 0 0 0 1
9 1 0 0 0 1 0 0 0 1
9 1 0 0 0 1 0 0 0 1
9 1 0 0 0 1 0 0 0 1
9 1 0 0 0 1 0 0 0 1
9 1 0 0 0 1 0 0 0 1
9 1 0 0 0 1 0 0 0 1
9 1 0 0 0 1 0 0 0 1
9 1 0 0 0 1 0 0 0 1
9 1 0 0 0 1 0 0 0 1
9 1 0 0 0 1 0 0 0 1
9 1 0 0 0 1 0 0 0 1
9 1 0 0 0 1 0 0 0 1
9 1 0 0 0 1 0 0 0 1
9 1 0 0 0 1 0 0 0 1
9 1 0 0 0 1 0 0 0 1
9 1 0 0 0 1 0 0 0 1
9 1 0 0 0 1 0 0 0 1
9 1 0 0 0 1 0 0 0 1
9 1 0 0 0 1 0 0 0 1
9 1 0 0 0 1 0 0 0 1
9 1 0 0 0 1 0 0 0 1
9 1 0 0 0 1 0 0 0 1
9 1 0 0 0 1 0 0 0 1
9 1 0 0 0 1 0 0 0 1
9 1 0 0 0 1 0 0 0 1
9 1 0 0 0 1 0 0 0 1
9 1 0 0 0 1 0 0 0 1
9 1 0 0 0 1 0 0 0 1
9 1 0 0 0 1 0 0 0 1
9 1 0 0 0 1 0 0 0 1
9 1 0 0 0 1 0 0 0 1
9 1 0 0 0 1 0 0 0 1
9 1 0 0 0 1 0 0 0 1
9 1 0 0 0 1 0 0 0 1
9 1 0 0 0 1 0 0 0 1
9 1 0 0 0 1 0 0 0 1
9 1 0 0 0 1 0 0 0 1
9 1 0 0 0 1 0 0 0 1
9 1 0 0 0 1 0 0 0 1
9 1 0 0 0 1 0 0 0 1
9 1 0 0 0 1 0 0 0 1
9 1 0 0 0 1 0 0 0 1
9 1 0 0 0 1 0 0 0 1
9 1 0 0 0 1 0 0 0 1
9 1 0 0 0 1 0 0 0 1
9 1 0 0 0 1 0 0 0 1
9 1 0 0 0 1 0 0 0 1
9 1 0 0 0 1 0 0 0 1
9 1 0 0 0 1 0 0 0 1
9 1 0 0 0 1 0 0 0 1
9 1 0 0 0 1 0 0 0 1
9 1 0 0 0 1 0 0 0 1
9 1 0 0 0 1 0 0 0 1
9 1 0 0 0 1 0 0 0 1
9 1 0 0 0 1 0 0 0 1
9 1 0 0 0 1 0 0 0 1
9 1 0 0 0 1 0 0 0 1
9 1 0 0 0 1 0 0 0 1
9 1 0 0 0 1 0 0 0 1
9 1 0 0 0 1 0 0 0 1
9 1 0 0 0 1 0 0 0 1
9 1 0 0 0 1 0 0 0 1
9 1 0 0 0 1 0 0 0 1
9 1 0 0 0 1 0 0 0 1
9 1 0 0 0 1 0 0 0 1
9 1 0 0 0 1 0 0 0 1
9 1 0 0 0 1 0 0 0 1
9 1 0 0 0 1 0 0 0 1
9 1 0 0 0 1 0 0 0 1
9 1 0 0 0 1 0 0 0 1
9 1 0 0 0 1 0 0 0 1
9 1 0 0 0 1 0 0 0 1
9 1 0 0 0 1 0 0 0 1
9 1 0 0 0 1 0 0 0 1
9 1 0 0 0 1 0 0 0 1
9 1 0 0 0 1 0 0 0 1
9 1 0 0 0 1 0 0 0 1
9 1 0 0 0 1 0 0 0 1
9 1 0 0 0 1 0 0 0 1
9 1 0 0 0 1 0 0 0 1
9 1 0 0 0 1 0 0 0 1
9 1 0 0 0 1 0 0 0 1
9 1 0 0 0 1 0 0 0 1
9 1 0 0 0 1 0 0 0 1
9 1 0 0 0 1 0 0 0 1
9 1 0 0 0 1 0 0 0 1
9 1 0 0 0 1 0 0 0 1
9 1 0 0 0 1 0 0 0 1
9 1 0 0 0 1 0 0 0 1
9 1 0 0 0 1 0 0 0 1
9 1 0 0 0 1 0 0 0 1
9 1 0 0 0 1 0 0 0 1
9 1 0 0 0 1 0 0 0 1
9 1 0 0 0 1 0 0 0 1
9 1 0 0 0 1 0 0 0 1
9 1 0 0 0 1 0 0 0 1
9 1 0 0 0 1 0 0 0 1
9 1 0 0 0 1 0 0 0 1
9 1 0 0 0 1 0 0 0 1
9 1 0 0 0 1 0 0 0 1
9 1 0 0 0 1 0 0 0 1
9 1 0 0 0 1 0 0 0 1
9 1 0 0 0 1 0 0 0 1
9 1 0 0 0 1 0 0 0 1
9 1 0 0 0 1 0 0 0 1
9 1 0 0 0 1 0 0 0 1
9 1 0 0 0 1 0 0 0 1
9 1 0 0 0 1 0 0 0 1
9 1 0 0 0 1 0 0 0 1
9 1 0 0 0 1 0 0 0 1
9 1 0 0 0 1 0 0 0 1
9 1 0 0 0 1 0 0 0 1
9 1 0 0 0 1 0 0 0 1
9 1 0 0 0 1 0 0 0 1
9 1 0 0 0 1 0 0 0 1
9 1 0 0 0 1 0 0 0 1
9 1 0 0 0 1 0 0 0 1
9 1 0 0 0 1 0 0 0 1
9 1 0 0 0 1 0 0 0 1
9 1 0 0 0 1 0 0 0 1
9 1 0 0 0 1 0 0 0 1
9 1 0 0 0 1 0 0 0 1
9 1 0 0 0 1 0 0 0 1
9 1 0 0 0 1 0 0 0 1
9 1 0 0 0 1 0 0 0 1
9 1 0 0 0 1 0 0 0 1
9 1 0 0 0 1 0 0 0 1
9 1 0 0 0 1 0 0 0 1
9 1 0 0 0 1 0 0 0 1
9 1 0 0 0 1 0 0 0 1
9 1 0 0 0 1 0 0 0 1
9 1 0 0 0 1 0 0 0 1
9 1 0 0 0 1 0 0 0 1
9 1 0 0 0 1 0 0 0 1
9 1 0 0 0 1 0 0 0 1
9 1 0 0 0 1 0 0 0 1
9 1 0 0 0 1 0 0 0 1
9 1 0 0 0 1 0 0 0 1
9 1 0 0 0 1 0 0 0 1
9 1 0 0 0 1 0 0 0 1
9 1 0 0 0 1 0 0 0 1
9 1 0 0 0 1 0 0 0 1
9 1 0 0 0 1 0 0 0 1
9 1 0 0 0 1 0 0 0 1
9 1 0 0 0 1 0 0 0 1
9 1 0 0 0 1 0 0 0 1
9 1 0 0 0 1 0 0 0 1
9 1 0 0 0 1 0 0 0 1
9 1 0 0 0 1 0 0 0 1
9 1 0 0 0 1 0 0 0 1
9 1 0 0 0 1 0 0 0 1
9 1 0 0 0 1 0 0 0 1
9 1 0 0 0 1 0 0 0 1
9 1 0 0 0 1 0 0 0 1
9 1 0 0 0 1 0 0 0 1
9 1 0 0 0 1 0 0 0 1
9 1 0 0 0 1 0 0 0 1
9 1 0 0 0 1 0 0 0 1
9 1 0 0 0 1 0 0 0 1
9 1 0 0 0 1 0 0 0 1
9 1 0 0 0 1 0 0 0 1
9 1 0 0 0 1 0 0 0 1
9 1 0 0 0 1 0 0 0 1
9 1 0 0 0 1 0 0 0 1
9 1 0 0 0 1 0 0 0 1
9 1 0 0 0 1 0 0 0 1
9 1 0 0 0 1 0 0 0 1
9 1 0 0 0 1 0 0 0 1
9 1 0 0 0 1 0 0 0 1
9 1 0 0 0 1 0 0 0 1
9 1 0 0 0 1 0 0 0 1
9 1 0 0 0 1 0 0 0 1
9 1 0 0 0 1 0 0 0 1
9 1 0 0 0 1 0 0 0 1
9 1 0 0 0 1 0 0 0 1
9 1 0 0 0 1 0 0 0 1
9 1 0 0 0 1 0 0 0 1
9 1 0 0 0 1 0 0 0 1
9 1 0 0 0 1 0 0 0 1
9 1 0 0 0 1 0 0 0 1
9 1 0 0 0 1 0 0 0 1
9 1 0 0 0 1 0 0 0 1
9 1 0 0 0 1 0 0 0 1
9 1 0 0 0 1 0 0 0 1
9 1 0 0 0 1 0 0 0 1
9 1 0 0 0 1 0 0 0 1
9 1 0 0 0 1 0 0 0 1
9 1 0 0 0 1 0 0 0 1
9 1 0 0 0 1 0 0 0 1
9 1 0 0 0 1 0 0 0 1
9 1 0 0 0 1 0 0 0 1
9 1 0 0 0 1 0 0 0 1
9 1 0 0 0 1 0 0 0 1
9 1 0 0 0 1 0 0 0 1
9 1 0 0 0 1 0 0 0 1
9 1 0 0 0 1 0 0 0 1
9 1 0 0 0 1 0 0 0 1
9 1 0 0 0 1 0 0 0 1
9 1 0 0 0 1 0 0 0 1
9 1 0 0 0 1 0 0 0 1
9 1 0 0 0 1 0 0 0 1
9 1 0 0 0 1 0 0 0 1
9 1 0 0 0 1 0 0 0 1
9 1 0 0 0 1 0 0 0 1
9 1 0 0 0 1 0 0 0 1
9 1 0 0 0 1 0 0 0 1
9 1 0 0 0 1 0 0 0 1
9 1 0 0 0 1 0 0 0 1
9 1 0 0 0 1 0 0 0 1
9 1 0 0 0 1 0 0 0 1
9 1 0 0 0 1 0 0 0 1
9 1 0 0 0 1 0 0 0 1
9 1 0 0 0 1 0 0 0 1
9 1 0 0 0 1 0 0 0 1
9 1 0 0 0 1 0 0 0 1
9 1 0 0 0 1 0 0 0 1
9 1 0 0 0 1 0 0 0 1
9 1 0 0 0 1 0 0 0 1
9 1 0 0 0 1 0 0 0 1
9 1 0 0 0 1 0 0 0 1
9 1 0 0 0 1 0 0 0 1
9 1 0 0 0 1 0 0 0 1
9 1 0 0 0 1 0 0 0 1
9 1 0 0 0 1 0 0 0 1
9 1 0 0 0 1 0 0 0 1
9 1 0 0 0 1 0 0 0 1
9 1 0 0 0 1 0 0 0 1
9 1 0 0 0 1 0 0 0 1
9 1 0 0 0 1 0 0 0 1
9 1 0 0 0 1 0 0 0 1
9 1 0 0 0 1 0 0 0 1
9 1 0 0 0 1 0 0 0 1
9 1 0 0 0 1 0 0 0 1
9 1 0 0 0 1 0 0 0 1
9 1 0 0 0 1 0 0 0 1
9 1 0 0 0 1 0 0 0 1
9 1 0 0 0 1 0 0 0 1
9 1 0 0 0 1 0 0 0 1
9 1 0 0 0 1 0 0 0 1
9 1 0 0 0 1 0 0 0 1
9 1 0 0 0 1 0 0 0 1
9 1 0 0 0 1 0 0 0 1
9 1 0 0 0 1 0 0 0 1
9 1 0 0 0 1 0 0 0 1
9 1 0 0 0 1 0 0 0 1
9 1 0 0 0 1 0 0 0 1
9 1 0 0 0 1 0 0 0 1
9 1 0 0 0 1 0 0 0 1
9 1 0 0 0 1 0 0 0 1
9 1 0 0 0 1 0 0 0 1
9 1 0 0 0 1 0 0 0 1
9 1 0 0 0 1 0 0 0 1
9 1 0 0 0 1 0 0 0 1
9 1 0 0 0 1 0 0 0 1
9 1 0 0 0 1 0 0 0 1
9 1 0 0 0 1 0 0 0 1
9 1 0 0 0 1 0 0 0 1
9 1 0 0 0 1 0 0 0 1
9 1 0 0 0 1 0 0 0 1
9 1 0 0 0 1 0 0 0 1
9 1 0 0 0 1 0 0 0 1
9 1 0 0 0 1 0 0 0 1
9 1 0 0 0 1 0 0 0 1
9 1 0 0 0 1 0 0 0 1
9 1 0 0 0 1 0 0 0 1
9 1 0 0 0 1 0 0 0 1
9 1 0 0 0 1 0 0 0 1
9 1 0 0 0 1 0 0 0 1
9 1 0 0 0 1 0 0 0 1
9 1 0 0 0 1 0 0 0 1
9 1 0 0 0 1 0 0 0 1
9 1 0 0 0 1 0 0 0 1
9 1 0 0 0 1 0 0 0 1
9 1 0 0 0 1 0 0 0 1
9 1 0 0 0 1 0 0 0 1
9 1 0 0 0 1 0 0 0 1
9 1 0 0 0 1 0 0 0 1
9 1 0 0 0 1 0 0 0 1
9 1 0 0 0 1 0 0 0 1
9 1 0 0 0 1 0 0 0 1
9 1 0 0 0 1 0 0 0 1
9 1 0 0 0 1 0 0 0 1
9 1 0 0 0 1 0 0 0 1
9 1 0 0 0 1 0 0 0 1
9 1 0 0 0 1 0 0 0 1
9 1 0 0 0 1 0 0 0 1
9 1 0 0 0 1 0 0 0 1
9 1 0 0 0 1 0 0 0 1
9 1 0 0 0 1 0 0 0 1
9 1 0 0 0 1 0 0 0 1
9 1 0 0 0 1 0 0 0 1
9 1 0 0 0 1 0 0 0 1
9 1 0 0 0 1 0 0 0 1
9 1 0 0 0 1 0 0 0 1
9 1 0 0 0 1 0 0 0 1
9 1 0 0 0 1 0 0 0 1
9 1 0 0 0 1 0 0 0 1
9 1 0 0 0 1 0 0 0 1
9 1 0 0 0 1 0 0 0 1
9 1 0 0 0 1 0 0 0 1
9 1 0 0 0 1 0 0 0 1
9 1 0 0 0 1 0 0 0 1
9 1 0 0 0 1 0 0 0 1
9 1 0 0 0 1 0 0 0 1
9 1 0 0 0 1 0 0 0 1
9 1 0 0 0 1 0 0 0 1
9 1 0 0 0 1 0 0 0 1
9 1 0 0 0 1 0 0 0 1
9 1 0 0 0 1 0 0 0 1
9 1 0 0 0 1 0 0 0 1
9 1 0 0 0 1 0 0 0 1
9 1 0 0 0 1 0 0 0 1
9 1 0 0 0 1 0 0 0 1
9 1 0 0 0 1 0 0 0 1
9 1 0 0 0 1 0 0 0 1
9 1 0 0 0 1 0 0 0 1
9 1 0 0 0 1 0 0 0 1
9 1 0 0 0 1 0 0 0 1
9 1 0 0 0 1 0 0 0 1
9 1 0 0 0 1 0 0 0 1
9 1 0 0 0 1 0 0 0 1
9 1 0 0 0 1 0 0 0 1
9 1 0 0 0 1 0 0 0 1
9 1 0 0 0 1 0 0 0 1
9 1 0 0 0 1 0 0 0 1
9 1 0 0 0 1 0 0 0 1
9 1 0 0 0 1 0 0 0 1
9 1 0 0 0 1 0 0 0 1
9 1 0 0 0 1 0 0 0 1
9 1 0 0 0 1 0 0 0 1
9 1 0 0 0 1 0 0 0 1
9 1 0 0 0 1 0 0 0 1
9 1 0 0 0 1 0 0 0 1
9 1 0 0 0 1 0 0 0 1
9 1 0 0 0 1 0 0 0 1
9 1 0 0 0 1 0 0 0 1
9 1 0 0 0 1 0 0 0 1
9 1 0 0 0 1 0 0 0 1
9 1 0 0 0 1 0 0 0 1
9 1 0 0 0 1 0 0 0 1
9 1 0 0 0 1 0 0 0 1
9 1 0 0 0 1 0 0 0 1
9 1 0 0 0 1 0 0 0 1
9 1 0 0 0 1 0 0 0 1
9 1 0 0 0 1 0 0 0 1
9 1 0 0 0 1 0 0 0 1
9 1 0 0 0 1 0 0 0 1
9 1 0 0 0 1 0 0 0 1
9 1 0 0 0 1 0 0 0 1
9 1 0 0 0 1 0 0 0 1
9 1 0 0 0 1 0 0 0 1
9 1 0 0 0 1 0 0 0 1
9 1 0 0 0 1 0 0 0 1
9 1 0 0 0 1 0 0 0 1
9 1 0 0 0 1 0 0 0 1
9 1 0 0 0 1 0 0 0 1
9 1 0 0 0 1 0 0 0 1
9 1 0 0 0 1 0 0 0 1
9 1 0 0 0 1 0 0 0 1
9 1 0 0 0 1 0 0 0 1
9 1 0 0 0 1 0 0 0 1
9 1 0 0 0 1 0 0 0 1
9 1 0 0 0 1 0 0 0 1
9 1 0 0 0 1 0 0 0 1
9 1 0 0 0 1 0 0 0 1
9 1 0 0 0 1 0 0 0 1
9 1 0 0 0 1 0 0 0 1
9 1 0 0 0 1 0 0 0 1
9 1 0 0 0 1 0 0 0 1
9 1 0 0 0 1 0 0 0 1
9 1 0 0 0 1 0 0 0 1
9 1 0 0 0 1 0 0 0 1
9 1 0 0 0 1 0 0 0 1
9 1 0 0 0 1 0 0 0 1
9 1 0 0 0 1 0 0 0 1
9 1 0 0 0 1 0 0 0 1
9 1 0 0 0 1 0 0 0 1
9 1 0 0 0 1 0 0 0 1
9 1 0 0 0 1 0 0 0 1
9 1 0 0 0 1 0 0 0 1
9 1 0 0 0 1 0 0 0 1
9 1 0 0 0 1 0 0 0 1
9 1 0 0 0 1 0 0 0 1
9 1 0 0 0 1 0 0 0 1
9 1 0 0 0 1 0 0 0 1
9 1 0 0 0 1 0 0 0 1
9 1 0 0 0 1 0 0 0 1
9 1 0 0 0 1 0 0 0 1
9 1 0 0 0 1 0 0 0 1
9 1 0 0 0 1 0 0 0 1
9 1 0 0 0 1 0 0 0 1
9 1 0 0 0 1 0 0 0 1
9 1 0 0 0 1 0 0 0 1
9 1 0 0 0 1 0 0 0 1
9 1 0 0 0 1 0 0 0 1
9 1 0 0 0 1 0 0 0 1
9 1 0 0 0 1 0 0 0 1
9 1 0 0 0 1 0 0 0 1
9 1 0 0 0 1 0 0 0 1
9 1 0 0 0 1 0 0 0 1
9 1 0 0 0 1 0 0 0 1
9 1 0 0 0 1 0 0 0 1
9 1 0 0 0 1 0 0 0 1
9 1 0 0 0 1 0 0 0 1
9 1 0 0 0 1 0 0 0 1
9 1 0 0 0 1 0 0 0 1
9 1 0 0 0 1 0 0 0 1
9 1 0 0 0 1 0 0 0 1
9 1 0 0 0 1 0 0 0 1
9 1 0 0 0 1 0 0 0 1
9 1 0 0 0 1 0 0 0 1
9 1 0 0 0 1 0 0 0 1
9 1 0 0 0 1 0 0 0 1
9 1 0 0 0 1 0 0 0 1
9 1 0 0 0 1 0 0 0 1
9 1 0 0 0 1 0 0 0 1
9 1 0 0 0 1 0 0 0 1
9 1 0 0 0 1 0 0 0 1
9 1 0 0 0 1 0 0 0 1
9 1 0 0 0 1 0 0 0 1
9 1 0 0 0 1 0 0 0 1
9 1 0 0 0 1 0 0 0 1
9 1 0 0 0 1 0 0 0 1
9 1 0 0 0 1 0 0 0 1
9 1 0 0 0 1 0 0 0 1
9 1 0 0 0 1 0 0 0 1
9 1 0 0 0 1 0 0 0 1
9 1 0 0 0 1 0 0 0 1
9 1 0 0 0 1 0 0 0 1
9 1 0 0 0 1 0 0 0 1
9 1 0 0 0 1 0 0 0 1
9 1 0 0 0 1 0 0 0 1
9 1 0 0 0 1 0 0 0 1
9 1 0 0 0 1 0 0 0 1
9 1 0 0 0 1 0 0 0 1
9 1 0 0 0 1 0 0 0 1
9 1 0 0 0 1 0 0 0 1
9 1 0 0 0 1 0 0 0 1
9 1 0 0 0 1 0 0 0 1
9 1 0 0 0 1 0 0 0 1
9 1 0 0 0 1 0 0 0 1
9 1 0 0 0 1 0 0 0 1
9 1 0 0 0 1 0 0 0 1
9 1 0 0 0 1 0 0 0 1
9 1 0 0 0 1 0 0 0 1
9 1 0 0 0 1 0 0 0 1
9 1 0 0 0 1 0 0 0 1
9 1 0 0 0 1 0 0 0 1
9 1 0 0 0 1 0 0 0 1
9 1 0 0 0 1 0 0 0 1
9 1 0 0 0 1 0 0 0 1
9 1 0 0 0 1 0 0 0 1
9 1 0 0 0 1 0 0 0 1
9 1 0 0 0 1 0 0 0 1
9 1 0 0 0 1 0 0 0 1
9 1 0 0 0 1 0 0 0 1
9 1 0 0 0 1 0 0 0 1
9 1 0 0 0 1 0 0 0 1
9 1 0 0 0 1 0 0 0 1
9 1 0 0 0 1 0 0 0 1
9 1 0 0 0 1 0 0 0 1
9 1 0 0 0 1 0 0 0 1
9 1 0 0 0 1 0 0 0 1
9 1 0 0 0 1 0 0 0 1
9 1 0 0 0 1 0 0 0 1
9 1 0 0 0 1 0 0 0 1
9 1 0 0 0 1 0 0 0 1
9 1 0 0 0 1 0 0 0 1
9 1 0 0 0 1 0 0 0 1
9 1 0 0 0 1 0 0 0 1
9 1 0 0 0 1 0 0 0 1
9 1 0 0 0 1 0 0 0 1
9 1 0 0 0 1 0 0 0 1
9 1 0 0 0 1 0 0 0 1
9 1 0 0 0 1 0 0 0 1
9 1 0 0 0 1 0 0 0 1
9 1 0 0 0 1 0 0 0 1
9 1 0 0 0 1 0 0 0 1
9 1 0 0 0 1 0 0 0 1
9 1 0 0 0 1 0 0 0 1
9 1 0 0 0 1 0 0 0 1
9 1 0 0 0 1 0 0 0 1
9 1 0 0 0 1 0 0 0 1
9 1 0 0 0 1 0 0 0 1
9 1 0 0 0 1 0 0 0 1
9 1 0 0 0 1 0 0 0 1
9 1 0 0 0 1 0 0 0 1
9 1 0 0 0 1 0 0 0 1
9 1 0 0 0 1 0 0 0 1
9 1 0 0 0 1 0 0 0 1
9 1 0 0 0 1 0 0 0 1
9 1 0 0 0 1 0 0 0 1
9 1 0 0 0 1 0 0 0 1
9 1 0 0 0 1 0 0 0 1
9 1 0 0 0 1 0 0 0 1
9 1 0 0 0 1 0 0 0 1
9 1 0 0 0 1 0 0 0 1
9 1 0 0 0 1 0 0 0 1
9 1 0 0 0 1 0 0 0 1
9 1 0 0 0 1 0 0 0 1
9 1 0 0 0 1 0 0 0 1
9 1 0 0 0 1 0 0 0 1
9 1 0 0 0 1 0 0 0 1
9 1 0 0 0 1 0 0 0 1
9 1 0 0 0 1 0 0 0 1
9 1 0 0 0 1 0 0 0 1
9 1 0 0 0 1 0 0 0 1
9 1 0 0 0 1 0 0 0 1
9 1 0 0 0 1 0 0 0 1
9 1 0 0 0 1 0 0 0 1
9 1 0 0 0 1 0 0 0 1
9 1 0 0 0 1 0 0 0 1
9 1 0 0 0 1 0 0 0 1
9 1 0 0 0 1 0 0 0 1
9 1 0 0 0 1 0 0 0 1
9 1 0 0 0 1 0 0 0 1
9 1 0 0 0 1 0 0 0 1
9 1 0 0 0 1 0 0 0 1
9 1 0 0 0 1 0 0 0 1
9 1 0 0 0 1 0 0 0 1
9 1 0 0 0 1 0 0 0 1
9 1 0 0 0 1 0 0 0 1
9 1 0 0 0 1 0 0 0 1
9 1 0 0 0 1 0 0 0 1
9 1 0 0 0 1 0 0 0 1
9 1 0 0 0 1 0 0 0 1
9 1 0 0 0 1 0 0 0 1
9 1 0 0 0 1 0 0 0 1
9 1 0 0 0 1 0 0 0 1
9 1 0 0 0 1 0 0 0 1
9 1 0 0 0 1 0 0 0 1
9 1 0 0 0 1 0 0 0 1
9 1 0 0 0 1 0 0 0 1
9 1 0 0 0 1 0 0 0 1
9 1 0 0 0 1 0 0 0 1
9 1 0 0 0 1 0 0 0 1
9 1 0 0 0 1 0 0 0 1
9 1 0 0 0 1 0 0 0 1
9 1 0 0 0 1 0 0 0 1
9 1 0 0 0 1 0 0 0 1
9 1 0 0 0 1 0 0 0 1
9 1 0 0 0 1 0 0 0 1
9 1 0 0 0 1 0 0 0 1
9 1 0 0 0 1 0 0 0 1
9 1 0 0 0 1 0 0 0 1
9 1 0 0 0 1 0 0 0 1
9 1 0 0 0 1 0 0 0 1
9 1 0 0 0 1 0 0 0 1
9 1 0 0 0 1 0 0 0 1
9 1 0 0 0 1 0 0 0 1
9 1 0 0 0 1 0 0 0 1
9 1 0 0 0 1 0 0 0 1
9 1 0 0 0 1 0 0 0 1
9 1 0 0 0 1 0 0 0 1
9 1 0 0 0 1 0 0 0 1
9 1 0 0 0 1 0 0 0 1
9 1 0 0 0 1 0 0 0 1
9 1 0 0 0 1 0 0 0 1
9 1 0 0 0 1 0 0 0 1
9 1 0 0 0 1 0 0 0 1
9 1 0 0 0 1 0 0 0 1
9 1 0 0 0 1 0 0 0 1
9 1 0 0 0 1 0 0 0 1
9 1 0 0 0 1 0 0 0 1
9 1 0 0 0 1 0 0 0 1
9 1 0 0 0 1 0 0 0 1
9 1 0 0 0 1 0 0 0 1
9 1 0 0 0 1 0 0 0 1
9 1 0 0 0 1 0 0 0 1
9 1 0 0 0 1 0 0 0 1
9 1 0 0 0 1 0 0 0 1
9 1 0 0 0 1 0 0 0 1
9 1 0 0 0 1 0 0 0 1
9 1 0 0 0 1 0 0 0 1
9 1 0 0 0 1 0 0 0 1
9 1 0 0 0 1 0 0 0 1
9 1 0 0 0 1 0 0 0 1
9 1 0 0 0 1 0 0 0 1
9 1 0 0 0 1 0 0 0 1
9 1 0 0 0 1 0 0 0 1
9 1 0 0 0 1 0 0 0 1
9 1 0 0 0 1 0 0 0 1
9 1 0 0 0 1 0 0 0 1
9 1 0 0 0 1 0 0 0 1
9 1 0 0 0 1 0 0 0 1
9 1 0 0 0 1 0 0 0 1
9 1 0 0 0 1 0 0 0 1
9 1 0 0 0 1 0 0 0 1
9 1 0 0 0 1 0 0 0 1
9 1 0 0 0 1 0 0 0 1
9 1 0 0 0 1 0 0 0 1
9 1 0 0 0 1 0 0 0 1
9 1 0 0 0 1 0 0 0 1
9 1 0 0 0 1 0 0 0 1
9 1 0 0 0 1 0 0 0 1
9 1 0 0 0 1 0 0 0 1
9 1 0 0 0 1 0 0 0 1
9 1 0 0 0 1 0 0 0 1
9 1 0 0 0 1 0 0 0 1
9 1 0 0 0 1 0 0 0 1
9 1 0 0 0 1 0 0 0 1
9 1 0 0 0 1 0 0 0 1
9 1 0 0 0 1 0 0 0 1
9 1 0 0 0 1 0 0 0 1
9 1 0 0 0 1 0 0 0 1
9 1 0 0 0 1 0 0 0 1
9 1 0 0 0 1 0 0 0 1
9 1 0 0 0 1 0 0 0 1
9 1 0 0 0 1 0 0 0 1
9 1 0 0 0 1 0 0 0 1
9 1 0 0 0 1 0 0 0 1
9 1 0 0 0 1 0 0 0 1
9 1 0 0 0 1 0 0 0 1
9 1 0 0 0 1 0 0 0 1
9 1 0 0 0 1 0 0 0 1
9 1 0 0 0 1 0 0 0 1
9 1 0 0 0 1 0 0 0 1
9 1 0 0 0 1 0 0 0 1
9 1 0 0 0 1 0 0 0 1
9 1 0 0 0 1 0 0 0 1
9 1 0 0 0 1 0 0 0 1
9 1 0 0 0 1 0 0 0 1
9 1 0 0 0 1 0 0 0 1
9 1 0 0 0 1 0 0 0 1
9 1 0 0 0 1 0 0 0 1
9 1 0 0 0 1 0 0 0 1
9 1 0 0 0 1 0 0 0 1
9 1 0 0 0 1 0 0 0 1
9 1 0 0 0 1 0 0 0 1
9 1 0 0 0 1 0 0 0 1
9 1 0 0 0 1 0 0 0 1
9 1 0 0 0 1 0 0 0 1
9 1 0 0 0 1 0 0 0 1
9 1 0 0 0 1 0 0 0 1
9 1 0 0 0 1 0 0 0 1
9 1 0 0 0 1 0 0 0 1
9 1 0 0 0 1 0 0 0 1
9 1 0 0 0 1 0 0 0 1
9 1 0 0 0 1 0 0 0 1
9 1 0 0 0 1 0 0 0 1
9 1 0 0 0 1 0 0 0 1
9 1 0 0 0 1 0 0 0 1
9 1 0 0 0 1 0 0 0 1
9 1 0 0 0 1 0 0 0 1
9 1 0 0 0 1 0 0 0 1
9 1 0 0 0 1 0 0 0 1
9 1 0 0 0 1 0 0 0 1
9 1 0 0 0 1 0 0 0 1
9 1 0 0 0 1 0 0 0 1
9 1 0 0 0 1 0 0 0 1
9 1 0 0 0 1 0 0 0 1
9 1 0 0 0 1 0 0 0 1
9 1 0 0 0 1 0 0 0 1
9 1 0 0 0 1 0 0 0 1
9 1 0 0 0 1 0 0 0 1
9 1 0 0 0 1 0 0 0 1
9 1 0 0 0 1 0 0 0 1
9 1 0 0 0 1 0 0 0 1
9 1 0 0 0 1 0 0 0 1
9 1 0 0 0 1 0 0 0 1
9 1 0 0 0 1 0 0 0 1
9 1 0 0 0 1 0 0 0 1
9 1 0 0 0 1 0 0 0 1
9 1 0 0 0 1 0 0 0 1
9 1 0 0 0 1 0 0 0 1
9 1 0 0 0 1 0 0 0 1
9 1 0 0 0 1 0 0 0 1
9 1 0 0 0 1 0 0 0 1
9 1 0 0 0 1 0 0 0 1
9 1 0 0 0 1 0 0 0 1
9 1 0 0 0 1 0 0 0 1
9 1 0 0 0 1 0 0 0 1
9 1 0 0 0 1 0 0 0 1
9 1 0 0 0 1 0 0 0 1
9 1 0 0 0 1 0 0 0 1
9 1 0 0 0 1 0 0 0 1
9 1 0 0 0 1 0 0 0 1
9 1 0 0 0 1 0 0 0 1
9 1 0 0 0 1 0 0 0 1
9 1 0 0 0 1 0 0 0 1
9 1 0 0 0 1 0 0 0 1
9 1 0 0 0 1 0 0 0 1
9 1 0 0 0 1 0 0 0 1
9 1 0 0 0 1 0 0 0 1
9 1 0 0 0 1 0 0 0 1
9 1 0 0 0 1 0 0 0 1
9 1 0 0 0 1 0 0 0 1
9 1 0 0 0 1 0 0 0 1
9 1 0 0 0 1 0 0 0 1
9 1 0 0 0 1 0 0 0 1
9 1 0 0 0 1 0 0 0 1
9 1 0 0 0 1 0 0 0 1
9 1 0 0 0 1 0 0 0 1
9 1 0 0 0 1 0 0 0 1
9 1 0 0 0 1 0 0 0 1
9 1 0 0 0 1 0 0 0 1
9 1 0 0 0 1 0 0 0 1
9 1 0 0 0 1 0 0 0 1
9 1 0 0 0 1 0 0 0 1
9 1 0 0 0 1 0 0 0 1
9 1 0 0 0 1 0 0 0 1
9 1 0 0 0 1 0 0 0 1
9 1 0 0 0 1 0 0 0 1
9 1 0 0 0 1 0 0 0 1
9 1 0 0 0 1 0 0 0 1
9 1 0 0 0 1 0 0 0 1
9 1 0 0 0 1 0 0 0 1
9 1 0 0 0 1 0 0 0 1
9 1 0 0 0 1 0 0 0 1
9 1 0 0 0 1 0 0 0 1
9 1 0 0 0 1 0 0 0 1
9 1 0 0 0 1 0 0 0 1
9 1 0 0 0 1 0 0 0 1
9 1 0 0 0 1 0 0 0 1
9 1 0 0 0 1 0 0 0 1
9 1 0 0 0 1 0 0 0 1
9 1 0 0 0 1 0 0 0 1
9 1 0 0 0 1 0 0 0 1
9 1 0 0 0 1 0 0 0 1
9 1 0 0 0 1 0 0 0 1
9 1 0 0 0 1 0 0 0 1
9 1 0 0 0 1 0 0 0 1
9 1 0 0 0 1 0 0 0 1
9 1 0 0 0 1 0 0 0 1
9 1 0 0 0 1 0 0 0 1
9 1 0 0 0 1 0 0 0 1
9 1 0 0 0 1 0 0 0 1
9 1 0 0 0 1 0 0 0 1
9 1 0 0 0 1 0 0 0 1
9 1 0 0 0 1 0 0 0 1
9 1 0 0 0 1 0 0 0 1
9 1 0 0 0 1 0 0 0 1
9 1 0 0 0 1 0 0 0 1
9 1 0 0 0 1 0 0 0 1
9 1 0 0 0 1 0 0 0 1
