HEADER:
Checked=true
WithData=true
Cellformat=Vtu
POINTS:
0 0 0
0 1 0
0 2 0
0 3 0
0 4 0
0 5 0
0 6 0
1 0 0
1 1 0
1 2 0
1 3 0
1 4 0
1 5 0
1 6 0
2 0 0
2 1 0
2 2 0
2 3 0
2 4 0
2 5 0
2 6 0
3 0 0
3 1 0
3 2 0
3 3 0
3 4 0
3 5 0
3 6 0
4 0 0
4 1 0
4 2 0
4 3 0
4 4 0
4 5 0
4 6 0
5 0 0
5 1 0
5 2 0
5 3 0
5 4 0
5 5 0
5 6 0
6 0 0
6 1 0
6 2 0
6 3 0
6 4 0
6 5 0
6 6 0
0.5 0.5 0
0.5 1.5 0
0.5 2.5 0
0.5 3.5 0
0.5 4.5 0
0.5 5.5 0
1.5 0.5 0
1.5 2.5 0
1.5 3.5 0
1.5 5.5 0
2.5 0.5 0
2.5 1.5 0
2.5 2.5 0
2.5 3.5 0
2.5 4.5 0
2.5 5.5 0
3.5 0.5 0
3.5 1.5 0
3.5 2.5 0
3.5 3.5 0
3.5 4.5 0
3.5 5.5 0
4.5 0.5 0
4.5 2.5 0
4.5 3.5 0
4.5 5.5 0
5.5 0.5 0
5.5 1.5 0
5.5 2.5 0
5.5 3.5 0
5.5 4.5 0
5.5 5.5 0
CELLS:
5 0 0 7 49 
5 0 7 8 49 
5 0 8 1 49 
5 0 1 0 49 
5 0 1 8 50 
5 0 8 9 50 
5 0 9 2 50 
5 0 2 1 50 
5 0 2 9 51 
5 0 9 10 51 
5 0 10 3 51 
5 0 3 2 51 
5 0 3 10 52 
5 0 10 11 52 
5 0 11 4 52 
5 0 4 3 52 
5 0 4 11 53 
5 0 11 12 53 
5 0 12 5 53 
5 0 5 4 53 
5 0 5 12 54 
5 0 12 13 54 
5 0 13 6 54 
5 0 6 5 54 
5 0 7 14 55 
5 0 14 15 55 
5 0 15 8 55 
5 0 8 7 55 
5 0 9 16 56 
5 0 16 17 56 
5 0 17 10 56 
5 0 10 9 56 
5 0 10 17 57 
5 0 17 18 57 
5 0 18 11 57 
5 0 11 10 57 
5 0 12 19 58 
5 0 19 20 58 
5 0 20 13 58 
5 0 13 12 58 
5 0 14 21 59 
5 0 21 22 59 
5 0 22 15 59 
5 0 15 14 59 
5 0 15 22 60 
5 0 22 23 60 
5 0 23 16 60 
5 0 16 15 60 
5 0 16 23 61 
5 0 23 24 61 
5 0 24 17 61 
5 0 17 16 61 
5 0 17 24 62 
5 0 24 25 62 
5 0 25 18 62 
5 0 18 17 62 
5 0 18 25 63 
5 0 25 26 63 
5 0 26 19 63 
5 0 19 18 63 
5 0 19 26 64 
5 0 26 27 64 
5 0 27 20 64 
5 0 20 19 64 
5 0 21 28 65 
5 0 28 29 65 
5 0 29 22 65 
5 0 22 21 65 
5 0 22 29 66 
5 0 29 30 66 
5 0 30 23 66 
5 0 23 22 66 
5 0 23 30 67 
5 0 30 31 67 
5 0 31 24 67 
5 0 24 23 67 
5 0 24 31 68 
5 0 31 32 68 
5 0 32 25 68 
5 0 25 24 68 
5 0 25 32 69 
5 0 32 33 69 
5 0 33 26 69 
5 0 26 25 69 
5 0 26 33 70 
5 0 33 34 70 
5 0 34 27 70 
5 0 27 26 70 
5 0 28 35 71 
5 0 35 36 71 
5 0 36 29 71 
5 0 29 28 71 
5 0 30 37 72 
5 0 37 38 72 
5 0 38 31 72 
5 0 31 30 72 
5 0 31 38 73 
5 0 38 39 73 
5 0 39 32 73 
5 0 32 31 73 
5 0 33 40 74 
5 0 40 41 74 
5 0 41 34 74 
5 0 34 33 74 
5 0 35 42 75 
5 0 42 43 75 
5 0 43 36 75 
5 0 36 35 75 
5 0 36 43 76 
5 0 43 44 76 
5 0 44 37 76 
5 0 37 36 76 
5 0 37 44 77 
5 0 44 45 77 
5 0 45 38 77 
5 0 38 37 77 
5 0 38 45 78 
5 0 45 46 78 
5 0 46 39 78 
5 0 39 38 78 
5 0 39 46 79 
5 0 46 47 79 
5 0 47 40 79 
5 0 40 39 79 
5 0 40 47 80 
5 0 47 48 80 
5 0 48 41 80 
5 0 41 40 80 
FACES:
1 0 1 
1 42 43 
1 1 2 
1 43 44 
1 2 3 
1 44 45 
1 3 4 
1 45 46 
1 4 5 
1 46 47 
1 5 6 
1 47 48 
1 0 7 
1 6 13 
1 7 14 
1 13 20 
1 14 21 
1 20 27 
1 21 28 
1 27 34 
1 28 35 
1 34 41 
1 35 42 
1 41 48 
230 8 9 
230 15 16 
230 8 15 
230 9 16 
231 29 30 
231 36 37 
231 29 36 
231 30 37 
232 11 12 
232 18 19 
232 11 18 
232 12 19 
233 32 33 
233 39 40 
233 32 39 
233 33 40 
VDATA:
-10 0 0 
-10 0 0 
-10 0 0 
-10 0 0 
-10 0 0 
-10 0 0 
-10 0 0 
-10 0 0 
-10 0 0 
-10 0 0 
-10 0 0 
-10 0 0 
-10 0 0 
-10 0 0 
-10 0 0 
-10 0 0 
-10 0 0 
-10 0 0 
-10 0 0 
-10 0 0 
-10 0 0 
-10 0 0 
-10 0 0 
-10 0 0 
-10 0 0 
-10 0 0 
-10 0 0 
-10 0 0 
-10 0 0 
-10 0 0 
-10 0 0 
-10 0 0 
-10 0 0 
-10 0 0 
-10 0 0 
-10 0 0 
-10 0 0 
-10 0 0 
-10 0 0 
-10 0 0 
-10 0 0 
-10 0 0 
-10 0 0 
-10 0 0 
-10 0 0 
-10 0 0 
-10 0 0 
-10 0 0 
-10 0 0 
-10 0 0 
-10 0 0 
-10 0 0 
-10 0 0 
-10 0 0 
-10 0 0 
-10 0 0 
-10 0 0 
-10 0 0 
-10 0 0 
-10 0 0 
-10 0 0 
-10 0 0 
-10 0 0 
-10 0 0 
-10 0 0 
-10 0 0 
-10 0 0 
-10 0 0 
-10 0 0 
-10 0 0 
-10 0 0 
-10 0 0 
-10 0 0 
-10 0 0 
-10 0 0 
-10 0 0 
-10 0 0 
-10 0 0 
-10 0 0 
-10 0 0 
-10 0 0 
CDATA:
1 0 0 0 1 0 0 0 1 
1 0 0 0 1 0 0 0 1 
1 0 0 0 1 0 0 0 1 
1 0 0 0 1 0 0 0 1 
1 0 0 0 1 0 0 0 1 
1 0 0 0 1 0 0 0 1 
1 0 0 0 1 0 0 0 1 
1 0 0 0 1 0 0 0 1 
1 0 0 0 1 0 0 0 1 
1 0 0 0 1 0 0 0 1 
1 0 0 0 1 0 0 0 1 
1 0 0 0 1 0 0 0 1 
1 0 0 0 1 0 0 0 1 
1 0 0 0 1 0 0 0 1 
1 0 0 0 1 0 0 0 1 
1 0 0 0 1 0 0 0 1 
1 0 0 0 1 0 0 0 1 
1 0 0 0 1 0 0 0 1 
1 0 0 0 1 0 0 0 1 
1 0 0 0 1 0 0 0 1 
1 0 0 0 1 0 0 0 1 
1 0 0 0 1 0 0 0 1 
1 0 0 0 1 0 0 0 1 
1 0 0 0 1 0 0 0 1 
1 0 0 0 1 0 0 0 1 
1 0 0 0 1 0 0 0 1 
1 0 0 0 1 0 0 0 1 
1 0 0 0 1 0 0 0 1 
1 0 0 0 1 0 0 0 1 
1 0 0 0 1 0 0 0 1 
1 0 0 0 1 0 0 0 1 
1 0 0 0 1 0 0 0 1 
1 0 0 0 1 0 0 0 1 
1 0 0 0 1 0 0 0 1 
1 0 0 0 1 0 0 0 1 
1 0 0 0 1 0 0 0 1 
1 0 0 0 1 0 0 0 1 
1 0 0 0 1 0 0 0 1 
1 0 0 0 1 0 0 0 1 
1 0 0 0 1 0 0 0 1 
1 0 0 0 1 0 0 0 1 
1 0 0 0 1 0 0 0 1 
1 0 0 0 1 0 0 0 1 
1 0 0 0 1 0 0 0 1 
1 0 0 0 1 0 0 0 1 
1 0 0 0 1 0 0 0 1 
1 0 0 0 1 0 0 0 1 
1 0 0 0 1 0 0 0 1 
1 0 0 0 1 0 0 0 1 
1 0 0 0 1 0 0 0 1 
1 0 0 0 1 0 0 0 1 
1 0 0 0 1 0 0 0 1 
1 0 0 0 1 0 0 0 1 
1 0 0 0 1 0 0 0 1 
1 0 0 0 1 0 0 0 1 
1 0 0 0 1 0 0 0 1 
1 0 0 0 1 0 0 0 1 
1 0 0 0 1 0 0 0 1 
1 0 0 0 1 0 0 0 1 
1 0 0 0 1 0 0 0 1 
1 0 0 0 1 0 0 0 1 
1 0 0 0 1 0 0 0 1 
1 0 0 0 1 0 0 0 1 
1 0 0 0 1 0 0 0 1 
1 0 0 0 1 0 0 0 1 
1 0 0 0 1 0 0 0 1 
1 0 0 0 1 0 0 0 1 
1 0 0 0 1 0 0 0 1 
1 0 0 0 1 0 0 0 1 
1 0 0 0 1 0 0 0 1 
1 0 0 0 1 0 0 0 1 
1 0 0 0 1 0 0 0 1 
1 0 0 0 1 0 0 0 1 
1 0 0 0 1 0 0 0 1 
1 0 0 0 1 0 0 0 1 
1 0 0 0 1 0 0 0 1 
1 0 0 0 1 0 0 0 1 
1 0 0 0 1 0 0 0 1 
1 0 0 0 1 0 0 0 1 
1 0 0 0 1 0 0 0 1 
1 0 0 0 1 0 0 0 1 
1 0 0 0 1 0 0 0 1 
1 0 0 0 1 0 0 0 1 
1 0 0 0 1 0 0 0 1 
1 0 0 0 1 0 0 0 1 
1 0 0 0 1 0 0 0 1 
1 0 0 0 1 0 0 0 1 
1 0 0 0 1 0 0 0 1 
1 0 0 0 1 0 0 0 1 
1 0 0 0 1 0 0 0 1 
1 0 0 0 1 0 0 0 1 
1 0 0 0 1 0 0 0 1 
1 0 0 0 1 0 0 0 1 
1 0 0 0 1 0 0 0 1 
1 0 0 0 1 0 0 0 1 
1 0 0 0 1 0 0 0 1 
1 0 0 0 1 0 0 0 1 
1 0 0 0 1 0 0 0 1 
1 0 0 0 1 0 0 0 1 
1 0 0 0 1 0 0 0 1 
1 0 0 0 1 0 0 0 1 
1 0 0 0 1 0 0 0 1 
1 0 0 0 1 0 0 0 1 
1 0 0 0 1 0 0 0 1 
1 0 0 0 1 0 0 0 1 
1 0 0 0 1 0 0 0 1 
1 0 0 0 1 0 0 0 1 
1 0 0 0 1 0 0 0 1 
1 0 0 0 1 0 0 0 1 
1 0 0 0 1 0 0 0 1 
1 0 0 0 1 0 0 0 1 
1 0 0 0 1 0 0 0 1 
1 0 0 0 1 0 0 0 1 
1 0 0 0 1 0 0 0 1 
1 0 0 0 1 0 0 0 1 
1 0 0 0 1 0 0 0 1 
1 0 0 0 1 0 0 0 1 
1 0 0 0 1 0 0 0 1 
1 0 0 0 1 0 0 0 1 
1 0 0 0 1 0 0 0 1 
1 0 0 0 1 0 0 0 1 
1 0 0 0 1 0 0 0 1 
1 0 0 0 1 0 0 0 1 
1 0 0 0 1 0 0 0 1 
1 0 0 0 1 0 0 0 1 
1 0 0 0 1 0 0 0 1 
1 0 0 0 1 0 0 0 1 
1 0 0 0 1 0 0 0 1 
