HEADER:
Checked=true
WithData=true
Cellformat=Vtu
POINTS:
0 0 0
0 0 1
0 1 0
0 1 1
1 0 0
1 0 1
1 1 0
1 1 1
CELLS:
12 0 4 6 2 0 5 7 3 1 
FACES:
199 0 2 3 1 
230 4 6 7 5 
232 6 4 0 2 
232 7 5 1 3 
232 0 4 5 1 
232 2 6 7 3 
VDATA:
-10 0 0 
-10 0 0 
-10 0 0 
-10 0 0 
-10 0 0 
-10 0 0 
-10 0 0 
-10 0 0 
CDATA:
1 0 0 0 1 0 0 0 1 
