POINTS
0.0 0.0 0.0
1.0 0.0 0.0
1.0 1.0 0.0
0.0 1.0 0.0
0.0 0.0 1.0
1.0 0.0 1.0
1.0 1.0 1.0
0.0 1.0 1.0
0.5 0.5 0.0
0.5 0.0 0.5
1.0 0.5 0.5
0.5 1.0 0.5
0.0 0.5 0.5
0.5 0.5 1.0
0.5 0.5 0.5
2.0 0.0 0.0
2.0 1.0 0.0 
2.0 0.0 1.0
2.0 1.0 1.0
1.5 0.5 0.0
1.5 0.0 0.5 
2.0 0.5 0.5 
1.5 1.0 0.5
1.5 0.5 1.0
1.5 0.5 0.5
3.0 0.0 0.0
3.0 1.0 0.0 
3.0 0.0 1.0
3.0 1.0 1.0
2.5 0.5 0.0
2.5 0.0 0.5 
3.0 0.5 0.5 
2.5 1.0 0.5
2.5 0.5 1.0
2.5 0.5 0.5
4.0 0.0 0.0
4.0 1.0 0.0 
4.0 0.0 1.0
4.0 1.0 1.0
3.5 0.5 0.0
3.5 0.0 0.5 
4.0 0.5 0.5 
3.5 1.0 0.5
3.5 0.5 1.0
3.5 0.5 0.5
5.0 0.0 0.0
5.0 1.0 0.0 
5.0 0.0 1.0
5.0 1.0 1.0
4.5 0.5 0.0
4.5 0.0 0.5 
5.0 0.5 0.5 
4.5 1.0 0.5
4.5 0.5 1.0
4.5 0.5 0.5
6.0 0.0 0.0
6.0 1.0 0.0 
6.0 0.0 1.0
6.0 1.0 1.0
5.5 0.5 0.0
5.5 0.0 0.5 
6.0 0.5 0.5 
5.5 1.0 0.5
5.5 0.5 1.0
5.5 0.5 0.5
7.0 0.0 0.0
7.0 1.0 0.0 
7.0 0.0 1.0
7.0 1.0 1.0
6.5 0.5 0.0
6.5 0.0 0.5 
7.0 0.5 0.5 
6.5 1.0 0.5
6.5 0.5 1.0
6.5 0.5 0.5
8.0 0.0 0.0
8.0 1.0 0.0 
8.0 0.0 1.0
8.0 1.0 1.0
7.5 0.5 0.0
7.5 0.0 0.5 
8.0 0.5 0.5 
7.5 1.0 0.5
7.5 0.5 1.0
7.5 0.5 0.5
9.0 0.0 0.0
9.0 1.0 0.0 
9.0 0.0 1.0
9.0 1.0 1.0
8.5 0.5 0.0
8.5 0.0 0.5 
9.0 0.5 0.5 
8.5 1.0 0.5
8.5 0.5 1.0
8.5 0.5 0.5
10.0 0.0 0.0
10.0 1.0 0.0 
10.0 0.0 1.0
10.0 1.0 1.0
9.5 0.5 0.0
9.5 0.0 0.5 
10.0 0.5 0.5 
9.5 1.0 0.5
9.5 0.5 1.0
9.5 0.5 0.5
CELLS
4 0 14 8 0 1
4 0 14 8 1 2
4 0 14 8 2 3
4 0 14 8 3 0
4 0 14 9 0 1
4 0 14 9 1 5
4 0 14 9 5 4
4 0 14 9 4 0
4 0 14 10 1 2
4 0 14 10 2 6
4 0 14 10 6 5
4 0 14 10 5 1
4 0 14 11 2 3
4 0 14 11 3 7
4 0 14 11 7 6
4 0 14 11 6 2
4 0 14 12 3 0
4 0 14 12 0 4
4 0 14 12 4 7
4 0 14 12 7 3
4 0 14 13 4 5
4 0 14 13 5 6
4 0 14 13 6 7
4 0 14 13 7 4
4 0 24 19 1 15
4 0 24 19 15 16
4 0 24 19 16 2
4 0 24 19 2 1
4 0 24 20 1 15
4 0 24 20 15 17
4 0 24 20 17 5
4 0 24 20 5 1
4 0 24 21 15 16
4 0 24 21 16 18
4 0 24 21 18 17
4 0 24 21 17 15
4 0 24 22 16 2
4 0 24 22 2 6
4 0 24 22 6 18
4 0 24 22 18 16
4 0 24 10 2 1
4 0 24 10 1 5
4 0 24 10 5 6
4 0 24 10 6 2
4 0 24 23 5 17
4 0 24 23 17 18
4 0 24 23 18 6
4 0 24 23 6 5
4 0 34 29 15 25
4 0 34 29 25 26
4 0 34 29 26 16
4 0 34 29 16 15
4 0 34 30 15 25
4 0 34 30 25 27
4 0 34 30 27 17
4 0 34 30 17 15
4 0 34 31 25 26
4 0 34 31 26 28
4 0 34 31 28 27
4 0 34 31 27 25
4 0 34 32 26 16
4 0 34 32 16 18
4 0 34 32 18 28
4 0 34 32 28 26
4 0 34 21 16 15
4 0 34 21 15 17
4 0 34 21 17 18
4 0 34 21 18 16
4 0 34 33 17 27
4 0 34 33 27 28
4 0 34 33 28 18
4 0 34 33 18 17
4 0 44 39 25 35
4 0 44 39 35 36
4 0 44 39 36 26
4 0 44 39 26 25
4 0 44 40 25 35
4 0 44 40 35 37
4 0 44 40 37 27
4 0 44 40 27 25
4 0 44 41 35 36
4 0 44 41 36 38
4 0 44 41 38 37
4 0 44 41 37 35
4 0 44 42 36 26
4 0 44 42 26 28
4 0 44 42 28 38
4 0 44 42 38 36
4 0 44 31 26 25
4 0 44 31 25 27
4 0 44 31 27 28
4 0 44 31 28 26
4 0 44 43 27 37
4 0 44 43 37 38
4 0 44 43 38 28
4 0 44 43 28 27
4 0 54 49 35 45
4 0 54 49 45 46
4 0 54 49 46 36
4 0 54 49 36 35
4 0 54 50 35 45
4 0 54 50 45 47
4 0 54 50 47 37
4 0 54 50 37 35
4 0 54 51 45 46
4 0 54 51 46 48
4 0 54 51 48 47
4 0 54 51 47 45
4 0 54 52 46 36
4 0 54 52 36 38
4 0 54 52 38 48
4 0 54 52 48 46
4 0 54 41 36 35
4 0 54 41 35 37
4 0 54 41 37 38
4 0 54 41 38 36
4 0 54 53 37 47
4 0 54 53 47 48
4 0 54 53 48 38
4 0 54 53 38 37
4 0 64 59 45 55
4 0 64 59 55 56
4 0 64 59 56 46
4 0 64 59 46 45
4 0 64 60 45 55
4 0 64 60 55 57
4 0 64 60 57 47
4 0 64 60 47 45
4 0 64 61 55 56
4 0 64 61 56 58
4 0 64 61 58 57
4 0 64 61 57 55
4 0 64 62 56 46
4 0 64 62 46 48
4 0 64 62 48 58
4 0 64 62 58 56
4 0 64 51 46 45
4 0 64 51 45 47
4 0 64 51 47 48
4 0 64 51 48 46
4 0 64 63 47 57
4 0 64 63 57 58
4 0 64 63 58 48
4 0 64 63 48 47
4 0 74 69 55 65
4 0 74 69 65 66
4 0 74 69 66 56
4 0 74 69 56 55
4 0 74 70 55 65
4 0 74 70 65 67
4 0 74 70 67 57
4 0 74 70 57 55
4 0 74 71 65 66
4 0 74 71 66 68
4 0 74 71 68 67
4 0 74 71 67 65
4 0 74 72 66 56
4 0 74 72 56 58
4 0 74 72 58 68
4 0 74 72 68 66
4 0 74 61 56 55
4 0 74 61 55 57
4 0 74 61 57 58
4 0 74 61 58 56
4 0 74 73 57 67
4 0 74 73 67 68
4 0 74 73 68 58
4 0 74 73 58 57
4 0 84 79 65 75
4 0 84 79 75 76
4 0 84 79 76 66
4 0 84 79 66 65
4 0 84 80 65 75
4 0 84 80 75 77
4 0 84 80 77 67
4 0 84 80 67 65
4 0 84 81 75 76
4 0 84 81 76 78
4 0 84 81 78 77
4 0 84 81 77 75
4 0 84 82 76 66
4 0 84 82 66 68
4 0 84 82 68 78
4 0 84 82 78 76
4 0 84 71 66 65
4 0 84 71 65 67
4 0 84 71 67 68
4 0 84 71 68 66
4 0 84 83 67 77
4 0 84 83 77 78
4 0 84 83 78 68
4 0 84 83 68 67
4 0 94 89 75 85
4 0 94 89 85 86
4 0 94 89 86 76
4 0 94 89 76 75
4 0 94 90 75 85
4 0 94 90 85 87
4 0 94 90 87 77
4 0 94 90 77 75
4 0 94 91 85 86
4 0 94 91 86 88
4 0 94 91 88 87
4 0 94 91 87 85
4 0 94 92 86 76
4 0 94 92 76 78
4 0 94 92 78 88
4 0 94 92 88 86
4 0 94 81 76 75
4 0 94 81 75 77
4 0 94 81 77 78
4 0 94 81 78 76
4 0 94 93 77 87
4 0 94 93 87 88
4 0 94 93 88 78
4 0 94 93 78 77
4 0 104 99 85 95
4 0 104 99 95 96
4 0 104 99 96 86
4 0 104 99 86 85
4 0 104 100 85 95
4 0 104 100 95 97
4 0 104 100 97 87
4 0 104 100 87 85
4 0 104 101 95 96
4 0 104 101 96 98
4 0 104 101 98 97
4 0 104 101 97 95
4 0 104 102 96 86
4 0 104 102 86 88
4 0 104 102 88 98
4 0 104 102 98 96
4 0 104 91 86 85
4 0 104 91 85 87
4 0 104 91 87 88
4 0 104 91 88 86
4 0 104 103 87 97
4 0 104 103 97 98
4 0 104 103 98 88
4 0 104 103 88 87
FACES
3 232 0 1 8
3 232 1 2 8
3 232 2 3 8
3 199 3 0 8
3 232 0 1 9
3 0 1 5 9
3 231 5 4 9
3 0 4 0 9
3 232 1 2 10
3 0 2 6 10
3 231 6 5 10
3 0 5 1 10
3 232 2 3 11
3 0 3 7 11
3 231 7 6 11
3 0 6 2 11
3 232 0 3 12
3 199 3 7 12
3 199 7 4 12
3 199 4 0 12
3 231 4 5 13
3 231 5 6 13
3 231 6 7 13
3 231 7 4 13
3 232 1 15 19
3 232 15 16 19
3 232 16 2 19
3 232 2 1 19
3 232 1 15 20
3 0 15 17 20
3 231 17 5 20
3 0 5 1 20
3 232 15 16 21
3 0 16 18 21
3 231 18 17 21
3 0 17 15 21
3 232 16 2 22
3 0 2 6 22
3 231 6 18 22
3 0 18 16 22
3 232 1 2 10
3 0 2 6 10
3 231 6 5 10
3 0 5 1 10
3 231 5 17 23
3 231 17 18 23
3 231 18 6 23
3 231 6 5 23
3 232 15 25 29
3 232 25 26 29
3 232 26 16 29
3 232 16 15 29
3 232 15 25 30
3 0 25 27 30
3 231 27 17 30
3 0 17 15 30
3 232 25 26 31
3 0 26 28 31
3 231 28 27 31
3 0 27 25 31
3 232 26 16 32
3 0 16 18 32
3 231 18 28 32
3 0 28 26 32
3 232 15 16 21
3 0 16 18 21
3 231 18 17 21
3 0 17 15 21
3 231 17 27 33
3 231 27 28 33
3 231 28 18 33
3 231 18 17 33
3 232 25 35 39
3 232 35 36 39
3 232 36 26 39
3 232 26 25 39
3 232 25 35 40
3 0 35 37 40
3 231 37 27 40
3 0 27 25 40
3 232 35 36 41
3 0 36 38 41
3 231 38 37 41
3 0 37 35 41
3 232 36 26 42
3 0 26 28 42
3 231 28 38 42
3 0 38 36 42
3 232 25 26 31
3 0 26 28 31
3 231 28 27 31
3 0 27 25 31
3 231 27 37 43
3 231 37 38 43
3 231 38 28 43
3 231 28 27 43
3 232 35 45 49
3 232 45 46 49
3 232 46 36 49
3 232 36 35 49
3 232 35 45 50
3 0 45 47 50
3 231 47 37 50
3 0 37 35 50
3 232 45 46 51
3 0 46 48 51
3 231 48 47 51
3 0 47 45 51
3 232 46 36 52
3 0 36 38 52
3 231 38 48 52
3 0 48 46 52
3 232 35 36 41
3 0 36 38 41
3 231 38 37 41
3 0 37 35 41
3 231 37 47 53
3 231 47 48 53
3 231 48 38 53
3 231 38 37 53
3 232 45 55 59
3 232 55 56 59
3 232 56 46 59
3 232 46 45 59
3 232 45 55 60
3 0 55 57 60
3 231 57 47 60
3 0 47 45 60
3 232 55 56 61
3 0 56 58 61
3 231 58 57 61
3 0 57 55 61
3 232 56 46 62
3 0 46 48 62
3 231 48 58 62
3 0 58 56 62
3 232 45 46 51
3 0 46 48 51
3 231 48 47 51
3 0 47 45 51
3 231 47 57 63
3 231 57 58 63
3 231 58 48 63
3 231 48 47 63
3 232 55 65 69
3 232 65 66 69
3 232 66 56 69
3 232 56 55 69
3 232 55 65 70
3 0 65 67 70
3 231 67 57 70
3 0 57 55 70
3 232 65 66 71
3 0 66 68 71
3 231 68 67 71
3 0 67 65 71
3 232 66 56 72
3 0 56 58 72
3 231 58 68 72
3 0 68 66 72
3 232 55 56 61
3 0 56 58 61
3 231 58 57 61
3 0 57 55 61
3 231 57 67 73
3 231 67 68 73
3 231 68 58 73
3 231 58 57 73
3 232 65 75 79
3 232 75 76 79
3 232 76 66 79
3 232 66 65 79
3 232 65 75 80
3 0 75 77 80
3 231 77 67 80
3 0 7 65 80
3 232 75 76 81
3 0 76 78 81
3 231 78 77 81
3 0 77 75 81
3 232 76 66 82
3 0 66 68 82
3 231 68 78 82
3 0 78 76 82
3 232 65 66 71
3 0 66 68 71
3 231 68 67 71
3 0 67 65 71
3 231 67 77 83
3 231 77 78 83
3 231 78 68 83
3 231 68 67 83
3 232 75 85 89
3 232 85 86 89
3 232 86 76 89
3 232 76 75 89
3 232 75 85 90
3 0 85 87 90
3 231 87 77 90
3 0 77 75 90
3 232 85 86 91
3 0 86 88 91
3 231 88 87 91
3 0 87 85 91
3 232 86 76 92
3 0 76 78 92
3 231 78 88 92
3 0 88 86 92
3 232 75 76 81
3 0 76 78 81
3 231 78 77 81
3 0 77 75 81
3 231 77 87 93
3 231 87 88 93
3 231 88 78 93
3 231 78 77 93
3 232 85 95 99
3 232 95 96 99
3 232 96 86 99
3 232 86 85 99
3 232 85 95 100
3 0 95 97 100
3 231 97 87 100
3 0 87 85 100
3 232 95 96 101
3 0 96 98 101
3 231 98 97 101
3 0 97 95 101
3 232 96 86 102
3 0 86 88 102
3 231 88 98 102
3 0 98 96 102
3 232 85 86 91
3 0 86 88 91
3 231 88 87 91
3 0 87 85 91
3 231 87 97 103
3 231 97 98 103
3 231 98 88 103
3 231 88 87 103
VDATA:
3 -10.0 0.0 0.0
3 -10.0 0.0 0.0
3 -10.0 0.0 0.0
3 -10.0 0.0 0.0
3 -10.0 0.0 0.0
3 -10.0 0.0 0.0
3 -10.0 0.0 0.0
3 -10.0 0.0 0.0
3 -10.0 0.0 0.0
3 -10.0 0.0 0.0
3 -10.0 0.0 0.0
3 -10.0 0.0 0.0
3 -10.0 0.0 0.0
3 -10.0 0.0 0.0
3 -10.0 0.0 0.0
3 -10.0 0.0 0.0
3 -10.0 0.0 0.0
3 -10.0 0.0 0.0
3 -10.0 0.0 0.0
3 -10.0 0.0 0.0
3 -10.0 0.0 0.0
3 -10.0 0.0 0.0
3 -10.0 0.0 0.0
3 -10.0 0.0 0.0
3 -10.0 0.0 0.0
3 -10.0 0.0 0.0
3 -10.0 0.0 0.0
3 -10.0 0.0 0.0
3 -10.0 0.0 0.0
3 -10.0 0.0 0.0
3 -10.0 0.0 0.0
3 -10.0 0.0 0.0
3 -10.0 0.0 0.0
3 -10.0 0.0 0.0
3 -10.0 0.0 0.0
3 -10.0 0.0 0.0
3 -10.0 0.0 0.0
3 -10.0 0.0 0.0
3 -10.0 0.0 0.0
3 -10.0 0.0 0.0
3 -10.0 0.0 0.0
3 -10.0 0.0 0.0
3 -10.0 0.0 0.0
3 -10.0 0.0 0.0
3 -10.0 0.0 0.0
3 -10.0 0.0 0.0
3 -10.0 0.0 0.0
3 -10.0 0.0 0.0
3 -10.0 0.0 0.0
3 -10.0 0.0 0.0
3 -10.0 0.0 0.0
3 -10.0 0.0 0.0
3 -10.0 0.0 0.0
3 -10.0 0.0 0.0
3 -10.0 0.0 0.0
3 -10.0 0.0 0.0
3 -10.0 0.0 0.0
3 -10.0 0.0 0.0
3 -10.0 0.0 0.0
3 -10.0 0.0 0.0
3 -10.0 0.0 0.0
3 -10.0 0.0 0.0
3 -10.0 0.0 0.0
3 -10.0 0.0 0.0
3 -10.0 0.0 0.0
3 -10.0 0.0 0.0
3 -10.0 0.0 0.0
3 -10.0 0.0 0.0
3 -10.0 0.0 0.0
3 -10.0 0.0 0.0
3 -10.0 0.0 0.0
3 -10.0 0.0 0.0
3 -10.0 0.0 0.0
3 -10.0 0.0 0.0
3 -10.0 0.0 0.0
3 -10.0 0.0 0.0
3 -10.0 0.0 0.0
3 -10.0 0.0 0.0
3 -10.0 0.0 0.0
3 -10.0 0.0 0.0
3 -10.0 0.0 0.0
3 -10.0 0.0 0.0
3 -10.0 0.0 0.0
3 -10.0 0.0 0.0
3 -10.0 0.0 0.0
3 -10.0 0.0 0.0
3 -10.0 0.0 0.0
3 -10.0 0.0 0.0
3 -10.0 0.0 0.0
3 -10.0 0.0 0.0
3 -10.0 0.0 0.0
3 -10.0 0.0 0.0
3 -10.0 0.0 0.0
3 -10.0 0.0 0.0
3 -10.0 0.0 0.0
3 -10.0 0.0 0.0
3 -10.0 0.0 0.0
3 -10.0 0.0 0.0
3 -10.0 0.0 0.0
3 -10.0 0.0 0.0
3 -10.0 0.0 0.0
3 -10.0 0.0 0.0
3 -10.0 0.0 0.0
3 -10.0 0.0 0.0
3 -10.0 0.0 0.0
CDATA:
9 1 0 0 0 1 0 0 0 1
9 1 0 0 0 1 0 0 0 1
9 1 0 0 0 1 0 0 0 1
9 1 0 0 0 1 0 0 0 1
9 1 0 0 0 1 0 0 0 1
9 1 0 0 0 1 0 0 0 1
9 1 0 0 0 1 0 0 0 1
9 1 0 0 0 1 0 0 0 1
9 1 0 0 0 1 0 0 0 1
9 1 0 0 0 1 0 0 0 1
9 1 0 0 0 1 0 0 0 1
9 1 0 0 0 1 0 0 0 1
9 1 0 0 0 1 0 0 0 1
9 1 0 0 0 1 0 0 0 1
9 1 0 0 0 1 0 0 0 1
9 1 0 0 0 1 0 0 0 1
9 1 0 0 0 1 0 0 0 1
9 1 0 0 0 1 0 0 0 1
9 1 0 0 0 1 0 0 0 1
9 1 0 0 0 1 0 0 0 1
9 1 0 0 0 1 0 0 0 1
9 1 0 0 0 1 0 0 0 1
9 1 0 0 0 1 0 0 0 1
9 1 0 0 0 1 0 0 0 1
9 1 0 0 0 1 0 0 0 1
9 1 0 0 0 1 0 0 0 1
9 1 0 0 0 1 0 0 0 1
9 1 0 0 0 1 0 0 0 1
9 1 0 0 0 1 0 0 0 1
9 1 0 0 0 1 0 0 0 1
9 1 0 0 0 1 0 0 0 1
9 1 0 0 0 1 0 0 0 1
9 1 0 0 0 1 0 0 0 1
9 1 0 0 0 1 0 0 0 1
9 1 0 0 0 1 0 0 0 1
9 1 0 0 0 1 0 0 0 1
9 1 0 0 0 1 0 0 0 1
9 1 0 0 0 1 0 0 0 1
9 1 0 0 0 1 0 0 0 1
9 1 0 0 0 1 0 0 0 1
9 1 0 0 0 1 0 0 0 1
9 1 0 0 0 1 0 0 0 1
9 1 0 0 0 1 0 0 0 1
9 1 0 0 0 1 0 0 0 1
9 1 0 0 0 1 0 0 0 1
9 1 0 0 0 1 0 0 0 1
9 1 0 0 0 1 0 0 0 1
9 1 0 0 0 1 0 0 0 1
9 1 0 0 0 1 0 0 0 1
9 1 0 0 0 1 0 0 0 1
9 1 0 0 0 1 0 0 0 1
9 1 0 0 0 1 0 0 0 1
9 1 0 0 0 1 0 0 0 1
9 1 0 0 0 1 0 0 0 1
9 1 0 0 0 1 0 0 0 1
9 1 0 0 0 1 0 0 0 1
9 1 0 0 0 1 0 0 0 1
9 1 0 0 0 1 0 0 0 1
9 1 0 0 0 1 0 0 0 1
9 1 0 0 0 1 0 0 0 1
9 1 0 0 0 1 0 0 0 1
9 1 0 0 0 1 0 0 0 1
9 1 0 0 0 1 0 0 0 1
9 1 0 0 0 1 0 0 0 1
9 1 0 0 0 1 0 0 0 1
9 1 0 0 0 1 0 0 0 1
9 1 0 0 0 1 0 0 0 1
9 1 0 0 0 1 0 0 0 1
9 1 0 0 0 1 0 0 0 1
9 1 0 0 0 1 0 0 0 1
9 1 0 0 0 1 0 0 0 1
9 1 0 0 0 1 0 0 0 1
9 1 0 0 0 1 0 0 0 1
9 1 0 0 0 1 0 0 0 1
9 1 0 0 0 1 0 0 0 1
9 1 0 0 0 1 0 0 0 1
9 1 0 0 0 1 0 0 0 1
9 1 0 0 0 1 0 0 0 1
9 1 0 0 0 1 0 0 0 1
9 1 0 0 0 1 0 0 0 1
9 1 0 0 0 1 0 0 0 1
9 1 0 0 0 1 0 0 0 1
9 1 0 0 0 1 0 0 0 1
9 1 0 0 0 1 0 0 0 1
9 1 0 0 0 1 0 0 0 1
9 1 0 0 0 1 0 0 0 1
9 1 0 0 0 1 0 0 0 1
9 1 0 0 0 1 0 0 0 1
9 1 0 0 0 1 0 0 0 1
9 1 0 0 0 1 0 0 0 1
9 1 0 0 0 1 0 0 0 1
9 1 0 0 0 1 0 0 0 1
9 1 0 0 0 1 0 0 0 1
9 1 0 0 0 1 0 0 0 1
9 1 0 0 0 1 0 0 0 1
9 1 0 0 0 1 0 0 0 1
9 1 0 0 0 1 0 0 0 1
9 1 0 0 0 1 0 0 0 1
9 1 0 0 0 1 0 0 0 1
9 1 0 0 0 1 0 0 0 1
9 1 0 0 0 1 0 0 0 1
9 1 0 0 0 1 0 0 0 1
9 1 0 0 0 1 0 0 0 1
9 1 0 0 0 1 0 0 0 1
9 1 0 0 0 1 0 0 0 1
9 1 0 0 0 1 0 0 0 1
9 1 0 0 0 1 0 0 0 1
9 1 0 0 0 1 0 0 0 1
9 1 0 0 0 1 0 0 0 1
9 1 0 0 0 1 0 0 0 1
9 1 0 0 0 1 0 0 0 1
9 1 0 0 0 1 0 0 0 1
9 1 0 0 0 1 0 0 0 1
9 1 0 0 0 1 0 0 0 1
9 1 0 0 0 1 0 0 0 1
9 1 0 0 0 1 0 0 0 1
9 1 0 0 0 1 0 0 0 1
9 1 0 0 0 1 0 0 0 1
9 1 0 0 0 1 0 0 0 1
9 1 0 0 0 1 0 0 0 1
9 1 0 0 0 1 0 0 0 1
9 1 0 0 0 1 0 0 0 1
9 1 0 0 0 1 0 0 0 1
9 1 0 0 0 1 0 0 0 1
9 1 0 0 0 1 0 0 0 1
9 1 0 0 0 1 0 0 0 1
9 1 0 0 0 1 0 0 0 1
9 1 0 0 0 1 0 0 0 1
9 1 0 0 0 1 0 0 0 1
9 1 0 0 0 1 0 0 0 1
9 1 0 0 0 1 0 0 0 1
9 1 0 0 0 1 0 0 0 1
9 1 0 0 0 1 0 0 0 1
9 1 0 0 0 1 0 0 0 1
9 1 0 0 0 1 0 0 0 1
9 1 0 0 0 1 0 0 0 1
9 1 0 0 0 1 0 0 0 1
9 1 0 0 0 1 0 0 0 1
9 1 0 0 0 1 0 0 0 1
9 1 0 0 0 1 0 0 0 1
9 1 0 0 0 1 0 0 0 1
9 1 0 0 0 1 0 0 0 1
9 1 0 0 0 1 0 0 0 1
9 1 0 0 0 1 0 0 0 1
9 1 0 0 0 1 0 0 0 1
9 1 0 0 0 1 0 0 0 1
9 1 0 0 0 1 0 0 0 1
9 1 0 0 0 1 0 0 0 1
9 1 0 0 0 1 0 0 0 1
9 1 0 0 0 1 0 0 0 1
9 1 0 0 0 1 0 0 0 1
9 1 0 0 0 1 0 0 0 1
9 1 0 0 0 1 0 0 0 1
9 1 0 0 0 1 0 0 0 1
9 1 0 0 0 1 0 0 0 1
9 1 0 0 0 1 0 0 0 1
9 1 0 0 0 1 0 0 0 1
9 1 0 0 0 1 0 0 0 1
9 1 0 0 0 1 0 0 0 1
9 1 0 0 0 1 0 0 0 1
9 1 0 0 0 1 0 0 0 1
9 1 0 0 0 1 0 0 0 1
9 1 0 0 0 1 0 0 0 1
9 1 0 0 0 1 0 0 0 1
9 1 0 0 0 1 0 0 0 1
9 1 0 0 0 1 0 0 0 1
9 1 0 0 0 1 0 0 0 1
9 1 0 0 0 1 0 0 0 1
9 1 0 0 0 1 0 0 0 1
9 1 0 0 0 1 0 0 0 1
9 1 0 0 0 1 0 0 0 1
9 1 0 0 0 1 0 0 0 1
9 1 0 0 0 1 0 0 0 1
9 1 0 0 0 1 0 0 0 1
9 1 0 0 0 1 0 0 0 1
9 1 0 0 0 1 0 0 0 1
9 1 0 0 0 1 0 0 0 1
9 1 0 0 0 1 0 0 0 1
9 1 0 0 0 1 0 0 0 1
9 1 0 0 0 1 0 0 0 1
9 1 0 0 0 1 0 0 0 1
9 1 0 0 0 1 0 0 0 1
9 1 0 0 0 1 0 0 0 1
9 1 0 0 0 1 0 0 0 1
9 1 0 0 0 1 0 0 0 1
9 1 0 0 0 1 0 0 0 1
9 1 0 0 0 1 0 0 0 1
9 1 0 0 0 1 0 0 0 1
9 1 0 0 0 1 0 0 0 1
9 1 0 0 0 1 0 0 0 1
9 1 0 0 0 1 0 0 0 1
9 1 0 0 0 1 0 0 0 1
9 1 0 0 0 1 0 0 0 1
9 1 0 0 0 1 0 0 0 1
9 1 0 0 0 1 0 0 0 1
9 1 0 0 0 1 0 0 0 1
9 1 0 0 0 1 0 0 0 1
9 1 0 0 0 1 0 0 0 1
9 1 0 0 0 1 0 0 0 1
9 1 0 0 0 1 0 0 0 1
9 1 0 0 0 1 0 0 0 1
9 1 0 0 0 1 0 0 0 1
9 1 0 0 0 1 0 0 0 1
9 1 0 0 0 1 0 0 0 1
9 1 0 0 0 1 0 0 0 1
9 1 0 0 0 1 0 0 0 1
9 1 0 0 0 1 0 0 0 1
9 1 0 0 0 1 0 0 0 1
9 1 0 0 0 1 0 0 0 1
9 1 0 0 0 1 0 0 0 1
9 1 0 0 0 1 0 0 0 1
9 1 0 0 0 1 0 0 0 1
9 1 0 0 0 1 0 0 0 1
9 1 0 0 0 1 0 0 0 1
9 1 0 0 0 1 0 0 0 1
9 1 0 0 0 1 0 0 0 1
9 1 0 0 0 1 0 0 0 1
9 1 0 0 0 1 0 0 0 1
9 1 0 0 0 1 0 0 0 1
9 1 0 0 0 1 0 0 0 1
9 1 0 0 0 1 0 0 0 1
9 1 0 0 0 1 0 0 0 1
9 1 0 0 0 1 0 0 0 1
9 1 0 0 0 1 0 0 0 1
9 1 0 0 0 1 0 0 0 1
9 1 0 0 0 1 0 0 0 1
9 1 0 0 0 1 0 0 0 1
9 1 0 0 0 1 0 0 0 1
9 1 0 0 0 1 0 0 0 1
9 1 0 0 0 1 0 0 0 1
9 1 0 0 0 1 0 0 0 1
9 1 0 0 0 1 0 0 0 1
9 1 0 0 0 1 0 0 0 1
9 1 0 0 0 1 0 0 0 1
9 1 0 0 0 1 0 0 0 1
9 1 0 0 0 1 0 0 0 1
9 1 0 0 0 1 0 0 0 1
9 1 0 0 0 1 0 0 0 1
9 1 0 0 0 1 0 0 0 1
9 1 0 0 0 1 0 0 0 1