POINTS:
0.0 0.0
0.0 1.0
1.0 0.0
1.0 1.0
2.0 0.0
2.0 1.0
3.0 0.0
3.0 1.0
4.0 0.0
4.0 1.0
5.0 0.0
5.0 1.0
6.0 0.0
6.0 1.0
7.0 0.0
7.0 1.0
8.0 0.0
8.0 1.0
9.0 0.0
9.0 1.0
10.0 0.0
10.0 1.0
CELLS:
3 0 0 2 3
3 0 0 3 1
3 0 2 4 5
3 0 2 5 3
3 0 4 6 7
3 0 4 7 5
3 0 6 8 9
3 0 6 9 7
3 0 8 10 11
3 0 8 11 9
3 0 10 12 13
3 0 10 13 11
3 0 12 14 15
3 0 12 15 13
3 0 14 16 17
3 0 14 17 15
3 0 16 18 19
3 0 16 19 17
3 0 18 20 21
3 0 18 21 19
FACES:
2 199 0 1
2 230 20 21
2 231 1 3
2 232 0 2
2 231 3 5
2 232 2 4
2 231 5 7
2 232 4 6
2 231 7 9
2 232 6 8
2 231 9 11
2 232 8 10
2 231 11 13
2 232 10 12
2 231 13 15
2 232 12 14
2 231 15 17
2 232 14 16
2 231 17 19
2 232 16 18
2 231 19 21
2 232 18 20
VDATA:
3 0.0 0.002 20
3 0.0 0.002 20
3 0.0 0.002 20
3 0.0 0.002 20
3 -10.0 0.0 0.0
3 -10.0 0.0 0.0
3 -10.0 0.0 0.0
3 -10.0 0.0 0.0
3 -10.0 0.0 0.0
3 -10.0 0.0 0.0
3 -10.0 0.0 0.0
3 -10.0 0.0 0.0
3 -10.0 0.0 0.0
3 -10.0 0.0 0.0
3 -10.0 0.0 0.0
3 -10.0 0.0 0.0
3 -10.0 0.0 0.0
3 -10.0 0.0 0.0
3 -10.0 0.0 0.0
3 -10.0 0.0 0.0
3 -10.0 0.0 0.0
3 -10.0 0.0 0.0
CDATA:
9 1 0 0 0 1 0 0 0 1
9 1 0 0 0 1 0 0 0 1
9 1 0 0 0 1 0 0 0 1
9 1 0 0 0 1 0 0 0 1
9 1 0 0 0 1 0 0 0 1
9 1 0 0 0 1 0 0 0 1
9 1 0 0 0 1 0 0 0 1
9 1 0 0 0 1 0 0 0 1
9 1 0 0 0 1 0 0 0 1
9 1 0 0 0 1 0 0 0 1
9 1 0 0 0 1 0 0 0 1
9 1 0 0 0 1 0 0 0 1
9 1 0 0 0 1 0 0 0 1
9 1 0 0 0 1 0 0 0 1
9 1 0 0 0 1 0 0 0 1
9 1 0 0 0 1 0 0 0 1
9 1 0 0 0 1 0 0 0 1
9 1 0 0 0 1 0 0 0 1
9 1 0 0 0 1 0 0 0 1
9 1 0 0 0 1 0 0 0 1
