POINTS:
0.0000 0.0000
0.0000 1.0000
0.0000 -1.0000
-1.0000 0.0000
1.0000 0.0000
-1.0000 1.0000
1.0000 1.0000
1.0000 -1.0000
CELLS:
3 0000 0 1 3
3 0000 1 5 3
3 0000 0 1 4
3 0000 1 6 4
3 0000 0 2 4
3 0000 2 7 4
FACES:
2 1 3 5
2 1 4 6
2 1 4 7
2 1 0 2
2 1 2 7
2 1 1 6
2 1 1 5
2 1 0 3
VDATA:
12 1.0 0.0 0.0 0.0 1.0 0.0 0.0 0.0 1.0 -10.0 0.0 0.0
12 1.0 0.0 0.0 0.0 1.0 0.0 0.0 0.0 1.0 -10.0 0.0 0.0
12 1.0 0.0 0.0 0.0 1.0 0.0 0.0 0.0 1.0 -10.0 0.0 0.0
12 1.0 0.0 0.0 0.0 1.0 0.0 0.0 0.0 1.0 -10.0 0.0 0.0
12 1.0 0.0 0.0 0.0 1.0 0.0 0.0 0.0 1.0 -10.0 0.0 0.0
12 1.0 0.0 0.0 0.0 1.0 0.0 0.0 0.0 1.0 -10.0 0.0 0.0
12 1.0 0.0 0.0 0.0 1.0 0.0 0.0 0.0 1.0 -10.0 0.0 0.0
12 1.0 0.0 0.0 0.0 1.0 0.0 0.0 0.0 1.0 -10.0 0.0 0.0
