POINTS:
0.0 0.0 0.0
0.0 0.0 0.5
0.0 0.0 1.0
0.0 0.5 0.0
0.0 0.5 0.5
0.0 0.5 1.0
0.0 1.0 0.0
0.0 1.0 0.5
0.0 1.0 1.0
0.5 0.0 0.0
0.5 0.0 0.5
0.5 0.0 1.0
0.5 0.5 0.0
0.5 0.5 0.5
0.5 0.5 1.0
0.5 1.0 0.0
0.5 1.0 0.5
0.5 1.0 1.0
1.0 0.0 0.0
1.0 0.0 0.5
1.0 0.0 1.0
1.0 0.5 0.0
1.0 0.5 0.5
1.0 0.5 1.0
1.0 1.0 0.0
1.0 1.0 0.5
1.0 1.0 1.0
CELLS:
8 0 0 3 12 9 1 4 13 10
8 0 1 4 13 10 2 5 14 11
8 0 3 6 15 12 4 7 16 13
8 0 4 7 16 13 5 8 17 14
8 0 9 12 21 18 10 13 22 19
8 0 10 13 22 19 11 14 23 20
8 0 12 15 24 21 13 16 25 22
8 0 13 16 25 22 14 17 26 23
FACES:
4 1 0 3 4 1
4 1 18 21 22 19
4 1 1 4 5 2
4 1 19 22 23 20
4 1 3 6 7 4
4 1 21 24 25 22
4 1 4 7 8 5
4 1 22 25 26 23
4 1 12 9 0 3
4 1 14 11 2 5
4 1 15 12 3 6
4 1 17 14 5 8
4 1 21 18 9 12
4 1 23 20 11 14
4 1 24 21 12 15
4 1 26 23 14 17
4 1 0 9 10 1
4 1 6 15 16 7
4 1 1 10 11 2
4 1 7 16 17 8
4 1 9 18 19 10
4 1 15 24 25 16
4 1 10 19 20 11
4 1 16 25 26 17
VDATA:
3 -10 0 0
3 -10 0 0
3 -10 0 0
3 -10 0 0
3 -10 0 0
3 -10 0 0
3 -10 0 0
3 -10 0 0
3 -10 0 0
3 -10 0 0
3 -10 0 0
3 -10 0 0
3 -10 0 0
3 -10 0 0
3 -10 0 0
3 -10 0 0
3 -10 0 0
3 -10 0 0
3 -10 0 0
3 -10 0 0
3 -10 0 0
3 -10 0 0
3 -10 0 0
3 -10 0 0
3 -10 0 0
3 -10 0 0
3 -10 0 0
CDATA:
9 1 0 0 0 1 0 0 0 1
9 1 0 0 0 1 0 0 0 1
9 1 0 0 0 1 0 0 0 1
9 1 0 0 0 1 0 0 0 1
9 1 0 0 0 1 0 0 0 1
9 1 0 0 0 1 0 0 0 1
9 1 0 0 0 1 0 0 0 1
9 1 0 0 0 1 0 0 0 1
