POINTS:
0.0 0.0 0.0
0.0 0.0 1.0
0.0 1.0 0.0
0.0 1.0 1.0
1.0 0.0 0.0
1.0 0.0 1.0
1.0 1.0 0.0
1.0 1.0 1.0
2.0 0.0 0.0
2.0 0.0 1.0
2.0 1.0 0.0
2.0 1.0 1.0
3.0 0.0 0.0
3.0 0.0 1.0
3.0 1.0 0.0
3.0 1.0 1.0
4.0 0.0 0.0
4.0 0.0 1.0
4.0 1.0 0.0
4.0 1.0 1.0
5.0 0.0 0.0
5.0 0.0 1.0
5.0 1.0 0.0
5.0 1.0 1.0
6.0 0.0 0.0
6.0 0.0 1.0
6.0 1.0 0.0
6.0 1.0 1.0
7.0 0.0 0.0
7.0 0.0 1.0
7.0 1.0 0.0
7.0 1.0 1.0
8.0 0.0 0.0
8.0 0.0 1.0
8.0 1.0 0.0
8.0 1.0 1.0
9.0 0.0 0.0
9.0 0.0 1.0
9.0 1.0 0.0
9.0 1.0 1.0
10.0 0.0 0.0
10.0 0.0 1.0
10.0 1.0 0.0
10.0 1.0 1.0
CELLS:
8 0 0 2 6 4 1 3 7 5
8 0 4 6 10 8 5 7 11 9
8 0 8 10 14 12 9 11 15 13
8 0 12 14 18 16 13 15 19 17
8 0 16 18 22 20 17 19 23 21
8 0 20 22 26 24 21 23 27 25
8 0 24 26 30 28 25 27 31 29
8 0 28 30 34 32 29 31 35 33
8 0 32 34 38 36 33 35 39 37
8 0 36 38 42 40 37 39 43 41
FACES:
4 199 0 2 3 1
4 230 40 42 43 41
4 231 6 4 0 2
4 231 7 5 1 3
4 231 10 8 4 6
4 231 11 9 5 7
4 231 14 12 8 10
4 231 15 13 9 11
4 231 18 16 12 14
4 231 19 17 13 15
4 231 22 20 16 18
4 231 23 21 17 19
4 231 26 24 20 22
4 231 27 25 21 23
4 231 30 28 24 26
4 231 31 29 25 27
4 231 34 32 28 30
4 231 35 33 29 31
4 231 38 36 32 34
4 231 39 37 33 35
4 231 42 40 36 38
4 231 43 41 37 39
4 231 0 4 5 1
4 231 2 6 7 3
4 231 4 8 9 5
4 231 6 10 11 7
4 231 8 12 13 9
4 231 10 14 15 11
4 231 12 16 17 13
4 231 14 18 19 15
4 231 16 20 21 17
4 231 18 22 23 19
4 231 20 24 25 21
4 231 22 26 27 23
4 231 24 28 29 25
4 231 26 30 31 27
4 231 28 32 33 29
4 231 30 34 35 31
4 231 32 36 37 33
4 231 34 38 39 35
4 231 36 40 41 37
4 231 38 42 43 39
VDATA:
3 0.0 0.002 20
3 0.0 0.002 20
3 0.0 0.002 20
3 0.0 0.002 20
3 0.0 0.002 20
3 0.0 0.002 20
3 0.0 0.002 20
3 0.0 0.002 20
3 -10.0 0.0 0.0
3 -10.0 0.0 0.0
3 -10.0 0.0 0.0
3 -10.0 0.0 0.0
3 -10.0 0.0 0.0
3 -10.0 0.0 0.0
3 -10.0 0.0 0.0
3 -10.0 0.0 0.0
3 -10.0 0.0 0.0
3 -10.0 0.0 0.0
3 -10.0 0.0 0.0
3 -10.0 0.0 0.0
3 -10.0 0.0 0.0
3 -10.0 0.0 0.0
3 -10.0 0.0 0.0
3 -10.0 0.0 0.0
3 -10.0 0.0 0.0
3 -10.0 0.0 0.0
3 -10.0 0.0 0.0
3 -10.0 0.0 0.0
3 -10.0 0.0 0.0
3 -10.0 0.0 0.0
3 -10.0 0.0 0.0
3 -10.0 0.0 0.0
3 -10.0 0.0 0.0
3 -10.0 0.0 0.0
3 -10.0 0.0 0.0
3 -10.0 0.0 0.0
3 -10.0 0.0 0.0
3 -10.0 0.0 0.0
3 -10.0 0.0 0.0
3 -10.0 0.0 0.0
3 -10.0 0.0 0.0
3 -10.0 0.0 0.0
3 -10.0 0.0 0.0
3 -10.0 0.0 0.0
CDATA:
9 1 0 0 0 1 0 0 0 1
9 1 0 0 0 1 0 0 0 1
9 1 0 0 0 1 0 0 0 1
9 1 0 0 0 1 0 0 0 1
9 1 0 0 0 1 0 0 0 1
9 1 0 0 0 1 0 0 0 1
9 1 0 0 0 1 0 0 0 1
9 1 0 0 0 1 0 0 0 1
9 1 0 0 0 1 0 0 0 1
9 1 0 0 0 1 0 0 0 1

