POINTS:
0.0 0.0
0.0 0.5
0.0 1.0
0.0 1.5
0.0 2.0
0.0 2.5
0.0 3.0
0.0 3.5
0.0 4.0
0.5 0.0
0.5 0.5
0.5 1.0
0.5 1.5
0.5 2.0
0.5 2.5
0.5 3.0
0.5 3.5
0.5 4.0
1.0 0.0
1.0 0.5
1.0 1.0
1.0 1.5
1.0 2.0
1.0 2.5
1.0 3.0
1.0 3.5
1.0 4.0
1.5 0.0
1.5 0.5
1.5 1.0
1.5 1.5
1.5 2.0
1.5 2.5
1.5 3.0
1.5 3.5
1.5 4.0
2.0 0.0
2.0 0.5
2.0 1.0
2.0 1.5
2.0 2.0
2.0 2.5
2.0 3.0
2.0 3.5
2.0 4.0
2.5 0.0
2.5 0.5
2.5 1.0
2.5 1.5
2.5 2.0
2.5 2.5
2.5 3.0
2.5 3.5
2.5 4.0
3.0 0.0
3.0 0.5
3.0 1.0
3.0 1.5
3.0 2.0
3.0 2.5
3.0 3.0
3.0 3.5
3.0 4.0
3.5 0.0
3.5 0.5
3.5 1.0
3.5 1.5
3.5 2.0
3.5 2.5
3.5 3.0
3.5 3.5
3.5 4.0
4.0 0.0
4.0 0.5
4.0 1.0
4.0 1.5
4.0 2.0
4.0 2.5
4.0 3.0
4.0 3.5
4.0 4.0
4.5 0.0
4.5 0.5
4.5 1.0
4.5 1.5
4.5 2.0
4.5 2.5
4.5 3.0
4.5 3.5
4.5 4.0
5.0 0.0
5.0 0.5
5.0 1.0
5.0 1.5
5.0 2.0
5.0 2.5
5.0 3.0
5.0 3.5
5.0 4.0
CELLS:
4 0 0 9 10 1
4 0 1 10 11 2
4 0 2 11 12 3
4 0 3 12 13 4
4 0 4 13 14 5
4 0 5 14 15 6
4 0 6 15 16 7
4 0 7 16 17 8
4 0 9 18 19 10
4 0 10 19 20 11
4 0 11 20 21 12
4 0 12 21 22 13
4 0 13 22 23 14
4 0 14 23 24 15
4 0 15 24 25 16
4 0 16 25 26 17
4 0 18 27 28 19
4 0 19 28 29 20
4 0 20 29 30 21
4 0 21 30 31 22
4 0 22 31 32 23
4 0 23 32 33 24
4 0 24 33 34 25
4 0 25 34 35 26
4 0 27 36 37 28
4 0 28 37 38 29
4 0 29 38 39 30
4 0 30 39 40 31
4 0 31 40 41 32
4 0 32 41 42 33
4 0 33 42 43 34
4 0 34 43 44 35
4 0 36 45 46 37
4 0 37 46 47 38
4 0 38 47 48 39
4 0 39 48 49 40
4 0 40 49 50 41
4 0 41 50 51 42
4 0 42 51 52 43
4 0 43 52 53 44
4 0 45 54 55 46
4 0 46 55 56 47
4 0 47 56 57 48
4 0 48 57 58 49
4 0 49 58 59 50
4 0 50 59 60 51
4 0 51 60 61 52
4 0 52 61 62 53
4 0 54 63 64 55
4 0 55 64 65 56
4 0 56 65 66 57
4 0 57 66 67 58
4 0 58 67 68 59
4 0 59 68 69 60
4 0 60 69 70 61
4 0 61 70 71 62
4 0 63 72 73 64
4 0 64 73 74 65
4 0 65 74 75 66
4 0 66 75 76 67
4 0 67 76 77 68
4 0 68 77 78 69
4 0 69 78 79 70
4 0 70 79 80 71
4 0 72 81 82 73
4 0 73 82 83 74
4 0 74 83 84 75
4 0 75 84 85 76
4 0 76 85 86 77
4 0 77 86 87 78
4 0 78 87 88 79
4 0 79 88 89 80
4 0 81 90 91 82
4 0 82 91 92 83
4 0 83 92 93 84
4 0 84 93 94 85
4 0 85 94 95 86
4 0 86 95 96 87
4 0 87 96 97 88
4 0 88 97 98 89
FACES:
2 100 0 1
2 100 1 2
2 100 2 3
2 100 3 4
2 100 4 5
2 100 5 6
2 100 6 7
2 100 7 8
2 102 0 9
2 102 9 18
2 102 18 27
2 102 27 36
2 102 36 45
2 102 45 54
2 102 54 63
2 102 63 72
2 102 72 81
2 102 81 90
VDATA:
3 0.0 0.002 20
3 0.0 0.002 20
3 0.0 0.002 20
3 0.0 0.002 20
3 -10.0 0.0 0.0
3 -10.0 0.0 0.0
3 -10.0 0.0 0.0
3 -10.0 0.0 0.0
3 -10.0 0.0 0.0
3 0.0 0.002 20
3 0.0 0.002 20
3 0.0 0.002 20
3 0.0 0.002 20
3 -10.0 0.0 0.0
3 -10.0 0.0 0.0
3 -10.0 0.0 0.0
3 -10.0 0.0 0.0
3 -10.0 0.0 0.0
3 0.0 0.002 20
3 0.0 0.002 20
3 0.0 0.002 20
3 0.0 0.002 20
3 -10.0 0.0 0.0
3 -10.0 0.0 0.0
3 -10.0 0.0 0.0
3 -10.0 0.0 0.0
3 -10.0 0.0 0.0
3 0.0 0.002 20
3 0.0 0.002 20
3 0.0 0.002 20
3 0.0 0.002 20
3 -10.0 0.0 0.0
3 -10.0 0.0 0.0
3 -10.0 0.0 0.0
3 -10.0 0.0 0.0
3 -10.0 0.0 0.0
3 -10.0 0.0 0.0
3 -10.0 0.0 0.0
3 -10.0 0.0 0.0
3 -10.0 0.0 0.0
3 -10.0 0.0 0.0
3 -10.0 0.0 0.0
3 -10.0 0.0 0.0
3 -10.0 0.0 0.0
3 -10.0 0.0 0.0
3 -10.0 0.0 0.0
3 -10.0 0.0 0.0
3 -10.0 0.0 0.0
3 -10.0 0.0 0.0
3 -10.0 0.0 0.0
3 -10.0 0.0 0.0
3 -10.0 0.0 0.0
3 -10.0 0.0 0.0
3 -10.0 0.0 0.0
3 -10.0 0.0 0.0
3 -10.0 0.0 0.0
3 -10.0 0.0 0.0
3 -10.0 0.0 0.0
3 -10.0 0.0 0.0
3 -10.0 0.0 0.0
3 -10.0 0.0 0.0
3 -10.0 0.0 0.0
3 -10.0 0.0 0.0
3 -10.0 0.0 0.0
3 -10.0 0.0 0.0
3 -10.0 0.0 0.0
3 -10.0 0.0 0.0
3 -10.0 0.0 0.0
3 -10.0 0.0 0.0
3 -10.0 0.0 0.0
3 -10.0 0.0 0.0
3 -10.0 0.0 0.0
3 -10.0 0.0 0.0
3 -10.0 0.0 0.0
3 -10.0 0.0 0.0
3 -10.0 0.0 0.0
3 -10.0 0.0 0.0
3 -10.0 0.0 0.0
3 -10.0 0.0 0.0
3 -10.0 0.0 0.0
3 -10.0 0.0 0.0
3 -10.0 0.0 0.0
3 -10.0 0.0 0.0
3 -10.0 0.0 0.0
3 -10.0 0.0 0.0
3 -10.0 0.0 0.0
3 -10.0 0.0 0.0
3 -10.0 0.0 0.0
3 -10.0 0.0 0.0
3 -10.0 0.0 0.0
3 -10.0 0.0 0.0
3 -10.0 0.0 0.0
3 -10.0 0.0 0.0
3 -10.0 0.0 0.0
3 -10.0 0.0 0.0
3 -10.0 0.0 0.0
3 -10.0 0.0 0.0
3 -10.0 0.0 0.0
3 -10.0 0.0 0.0
CDATA:
9 1 0 0 0 1 0 0 0 1
9 1 0 0 0 1 0 0 0 1
9 1 0 0 0 1 0 0 0 1
9 1 0 0 0 1 0 0 0 1
9 1 0 0 0 1 0 0 0 1
9 1 0 0 0 1 0 0 0 1
9 1 0 0 0 1 0 0 0 1
9 1 0 0 0 1 0 0 0 1
9 1 0 0 0 1 0 0 0 1
9 1 0 0 0 1 0 0 0 1
9 1 0 0 0 1 0 0 0 1
9 1 0 0 0 1 0 0 0 1
9 1 0 0 0 1 0 0 0 1
9 1 0 0 0 1 0 0 0 1
9 1 0 0 0 1 0 0 0 1
9 1 0 0 0 1 0 0 0 1
9 1 0 0 0 1 0 0 0 1
9 1 0 0 0 1 0 0 0 1
9 1 0 0 0 1 0 0 0 1
9 1 0 0 0 1 0 0 0 1
9 1 0 0 0 1 0 0 0 1
9 1 0 0 0 1 0 0 0 1
9 1 0 0 0 1 0 0 0 1
9 1 0 0 0 1 0 0 0 1
9 1 0 0 0 1 0 0 0 1
9 1 0 0 0 1 0 0 0 1
9 1 0 0 0 1 0 0 0 1
9 1 0 0 0 1 0 0 0 1
9 1 0 0 0 1 0 0 0 1
9 1 0 0 0 1 0 0 0 1
9 1 0 0 0 1 0 0 0 1
9 1 0 0 0 1 0 0 0 1
9 1 0 0 0 1 0 0 0 1
9 1 0 0 0 1 0 0 0 1
9 1 0 0 0 1 0 0 0 1
9 1 0 0 0 1 0 0 0 1
9 1 0 0 0 1 0 0 0 1
9 1 0 0 0 1 0 0 0 1
9 1 0 0 0 1 0 0 0 1
9 1 0 0 0 1 0 0 0 1
9 1 0 0 0 1 0 0 0 1
9 1 0 0 0 1 0 0 0 1
9 1 0 0 0 1 0 0 0 1
9 1 0 0 0 1 0 0 0 1
9 1 0 0 0 1 0 0 0 1
9 1 0 0 0 1 0 0 0 1
9 1 0 0 0 1 0 0 0 1
9 1 0 0 0 1 0 0 0 1
9 1 0 0 0 1 0 0 0 1
9 1 0 0 0 1 0 0 0 1
9 1 0 0 0 1 0 0 0 1
9 1 0 0 0 1 0 0 0 1
9 1 0 0 0 1 0 0 0 1
9 1 0 0 0 1 0 0 0 1
9 1 0 0 0 1 0 0 0 1
9 1 0 0 0 1 0 0 0 1
9 1 0 0 0 1 0 0 0 1
9 1 0 0 0 1 0 0 0 1
9 1 0 0 0 1 0 0 0 1
9 1 0 0 0 1 0 0 0 1
9 1 0 0 0 1 0 0 0 1
9 1 0 0 0 1 0 0 0 1
9 1 0 0 0 1 0 0 0 1
9 1 0 0 0 1 0 0 0 1
9 1 0 0 0 1 0 0 0 1
9 1 0 0 0 1 0 0 0 1
9 1 0 0 0 1 0 0 0 1
9 1 0 0 0 1 0 0 0 1
9 1 0 0 0 1 0 0 0 1
9 1 0 0 0 1 0 0 0 1
9 1 0 0 0 1 0 0 0 1
9 1 0 0 0 1 0 0 0 1
9 1 0 0 0 1 0 0 0 1
9 1 0 0 0 1 0 0 0 1
9 1 0 0 0 1 0 0 0 1
9 1 0 0 0 1 0 0 0 1
9 1 0 0 0 1 0 0 0 1
9 1 0 0 0 1 0 0 0 1
9 1 0 0 0 1 0 0 0 1
9 1 0 0 0 1 0 0 0 1
