POINTS:
0.0 0.0 0.0
0.0 0.0 1.0
0.0 0.0 2.0
0.0 0.0 3.0
0.0 1.0 0.0
0.0 1.0 1.0
0.0 1.0 2.0
0.0 1.0 3.0
0.0 2.0 0.0
0.0 2.0 1.0
0.0 2.0 2.0
0.0 2.0 3.0
0.0 3.0 0.0
0.0 3.0 1.0
0.0 3.0 2.0
0.0 3.0 3.0
0.0 4.0 0.0
0.0 4.0 1.0
0.0 4.0 2.0
0.0 4.0 3.0
1.0 0.0 0.0
1.0 0.0 1.0
1.0 0.0 2.0
1.0 0.0 3.0
1.0 1.0 0.0
1.0 1.0 1.0
1.0 1.0 2.0
1.0 1.0 3.0
1.0 2.0 0.0
1.0 2.0 1.0
1.0 2.0 2.0
1.0 2.0 3.0
1.0 3.0 0.0
1.0 3.0 1.0
1.0 3.0 2.0
1.0 3.0 3.0
1.0 4.0 0.0
1.0 4.0 1.0
1.0 4.0 2.0
1.0 4.0 3.0
2.0 0.0 0.0
2.0 0.0 1.0
2.0 0.0 2.0
2.0 0.0 3.0
2.0 1.0 0.0
2.0 1.0 1.0
2.0 1.0 2.0
2.0 1.0 3.0
2.0 2.0 0.0
2.0 2.0 1.0
2.0 2.0 2.0
2.0 2.0 3.0
2.0 3.0 0.0
2.0 3.0 1.0
2.0 3.0 2.0
2.0 3.0 3.0
2.0 4.0 0.0
2.0 4.0 1.0
2.0 4.0 2.0
2.0 4.0 3.0
3.0 0.0 0.0
3.0 0.0 1.0
3.0 0.0 2.0
3.0 0.0 3.0
3.0 1.0 0.0
3.0 1.0 1.0
3.0 1.0 2.0
3.0 1.0 3.0
3.0 2.0 0.0
3.0 2.0 1.0
3.0 2.0 2.0
3.0 2.0 3.0
3.0 3.0 0.0
3.0 3.0 1.0
3.0 3.0 2.0
3.0 3.0 3.0
3.0 4.0 0.0
3.0 4.0 1.0
3.0 4.0 2.0
3.0 4.0 3.0
4.0 0.0 0.0
4.0 0.0 1.0
4.0 0.0 2.0
4.0 0.0 3.0
4.0 1.0 0.0
4.0 1.0 1.0
4.0 1.0 2.0
4.0 1.0 3.0
4.0 2.0 0.0
4.0 2.0 1.0
4.0 2.0 2.0
4.0 2.0 3.0
4.0 3.0 0.0
4.0 3.0 1.0
4.0 3.0 2.0
4.0 3.0 3.0
4.0 4.0 0.0
4.0 4.0 1.0
4.0 4.0 2.0
4.0 4.0 3.0
CELLS:
8 9000 0 4 24 20 1 5 25 21
8 9000 1 5 25 21 2 6 26 22
8 9000 2 6 26 22 3 7 27 23
8 9000 4 8 28 24 5 9 29 25
8 9000 5 9 29 25 6 10 30 26
8 9000 6 10 30 26 7 11 31 27
8 9000 8 12 32 28 9 13 33 29
8 9000 9 13 33 29 10 14 34 30
8 9000 10 14 34 30 11 15 35 31
8 9000 12 16 36 32 13 17 37 33
8 9000 13 17 37 33 14 18 38 34
8 9000 14 18 38 34 15 19 39 35
8 9000 20 24 44 40 21 25 45 41
8 9000 21 25 45 41 22 26 46 42
8 9000 22 26 46 42 23 27 47 43
8 9000 24 28 48 44 25 29 49 45
8 0 25 29 49 45 26 30 50 46
8 9000 26 30 50 46 27 31 51 47
8 9000 28 32 52 48 29 33 53 49
8 2000 29 33 53 49 30 34 54 50
8 9000 30 34 54 50 31 35 55 51
8 9000 32 36 56 52 33 37 57 53
8 9000 33 37 57 53 34 38 58 54
8 9000 34 38 58 54 35 39 59 55
8 9000 40 44 64 60 41 45 65 61
8 9000 41 45 65 61 42 46 66 62
8 9000 42 46 66 62 43 47 67 63
8 9000 44 48 68 64 45 49 69 65
8 1000 45 49 69 65 46 50 70 66
8 9000 46 50 70 66 47 51 71 67
8 9000 48 52 72 68 49 53 73 69
8 3000 49 53 73 69 50 54 74 70
8 9000 50 54 74 70 51 55 75 71
8 9000 52 56 76 72 53 57 77 73
8 9000 53 57 77 73 54 58 78 74
8 9000 54 58 78 74 55 59 79 75
8 9000 60 64 84 80 61 65 85 81
8 9000 61 65 85 81 62 66 86 82
8 9000 62 66 86 82 63 67 87 83
8 9000 64 68 88 84 65 69 89 85
8 9000 65 69 89 85 66 70 90 86
8 9000 66 70 90 86 67 71 91 87
8 9000 68 72 92 88 69 73 93 89
8 9000 69 73 93 89 70 74 94 90
8 9000 70 74 94 90 71 75 95 91
8 9000 72 76 96 92 73 77 97 93
8 9000 73 77 97 93 74 78 98 94
8 9000 74 78 98 94 75 79 99 95
FACES:
4 1 0 4 5 1
4 1 80 84 85 81
4 1 1 5 6 2
4 1 81 85 86 82
4 1 2 6 7 3
4 1 82 86 87 83
4 1 4 8 9 5
4 1 84 88 89 85
4 1 5 9 10 6
4 1 85 89 90 86
4 1 6 10 11 7
4 1 86 90 91 87
4 1 8 12 13 9
4 1 88 92 93 89
4 1 9 13 14 10
4 1 89 93 94 90
4 1 10 14 15 11
4 1 90 94 95 91
4 1 12 16 17 13
4 1 92 96 97 93
4 1 13 17 18 14
4 1 93 97 98 94
4 1 14 18 19 15
4 1 94 98 99 95
4 1 24 20 0 4
4 1 27 23 3 7
4 1 28 24 4 8
4 1 31 27 7 11
4 1 32 28 8 12
4 1 35 31 11 15
4 1 36 32 12 16
4 1 39 35 15 19
4 1 44 40 20 24
4 1 47 43 23 27
4 1 48 44 24 28
4 1 51 47 27 31
4 1 52 48 28 32
4 1 55 51 31 35
4 1 56 52 32 36
4 1 59 55 35 39
4 1 64 60 40 44
4 1 67 63 43 47
4 1 68 64 44 48
4 1 71 67 47 51
4 1 72 68 48 52
4 1 75 71 51 55
4 1 76 72 52 56
4 1 79 75 55 59
4 1 84 80 60 64
4 1 87 83 63 67
4 1 88 84 64 68
4 1 91 87 67 71
4 1 92 88 68 72
4 1 95 91 71 75
4 1 96 92 72 76
4 1 99 95 75 79
4 1 0 20 21 1
4 1 16 36 37 17
4 1 1 21 22 2
4 1 17 37 38 18
4 1 2 22 23 3
4 1 18 38 39 19
4 1 20 40 41 21
4 1 36 56 57 37
4 1 21 41 42 22
4 1 37 57 58 38
4 1 22 42 43 23
4 1 38 58 59 39
4 1 40 60 61 41
4 1 56 76 77 57
4 1 41 61 62 42
4 1 57 77 78 58
4 1 42 62 63 43
4 1 58 78 79 59
4 1 60 80 81 61
4 1 76 96 97 77
4 1 61 81 82 62
4 1 77 97 98 78
4 1 62 82 83 63
4 1 78 98 99 79
VDATA:
3 -10 0 0
3 -10 0 0
3 -10 0 0
3 -10 0 0
3 -10 0 0
3 -10 0 0
3 -10 0 0
3 -10 0 0
3 -10 0 0
3 -10 0 0
3 -10 0 0
3 -10 0 0
3 -10 0 0
3 -10 0 0
3 -10 0 0
3 -10 0 0
3 -10 0 0
3 -10 0 0
3 -10 0 0
3 -10 0 0
3 -10 0 0
3 -10 0 0
3 -10 0 0
3 -10 0 0
3 -10 0 0
3 -10 0 0
3 -10 0 0
3 -10 0 0
3 -10 0 0
3 -10 0 0
3 -10 0 0
3 -10 0 0
3 -10 0 0
3 -10 0 0
3 -10 0 0
3 -10 0 0
3 -10 0 0
3 -10 0 0
3 -10 0 0
3 -10 0 0
3 -10 0 0
3 -10 0 0
3 -10 0 0
3 -10 0 0
3 -10 0 0
3 -10 0 0
3 -10 0 0
3 -10 0 0
3 -10 0 0
3 -10 0 0
3 -10 0 0
3 -10 0 0
3 -10 0 0
3 -10 0 0
3 -10 0 0
3 -10 0 0
3 -10 0 0
3 -10 0 0
3 -10 0 0
3 -10 0 0
3 -10 0 0
3 -10 0 0
3 -10 0 0
3 -10 0 0
3 -10 0 0
3 -10 0 0
3 -10 0 0
3 -10 0 0
3 -10 0 0
3 -10 0 0
3 -10 0 0
3 -10 0 0
3 -10 0 0
3 -10 0 0
3 -10 0 0
3 -10 0 0
3 -10 0 0
3 -10 0 0
3 -10 0 0
3 -10 0 0
3 -10 0 0
3 -10 0 0
3 -10 0 0
3 -10 0 0
3 -10 0 0
3 -10 0 0
3 -10 0 0
3 -10 0 0
3 -10 0 0
3 -10 0 0
3 -10 0 0
3 -10 0 0
3 -10 0 0
3 -10 0 0
3 -10 0 0
3 -10 0 0
3 -10 0 0
3 -10 0 0
3 -10 0 0
3 -10 0 0
CDATA:
9 1 0 0 0 1 0 0 0 1
9 1 0 0 0 1 0 0 0 1
9 1 0 0 0 1 0 0 0 1
9 1 0 0 0 1 0 0 0 1
9 1 0 0 0 1 0 0 0 1
9 1 0 0 0 1 0 0 0 1
9 1 0 0 0 1 0 0 0 1
9 1 0 0 0 1 0 0 0 1
9 1 0 0 0 1 0 0 0 1
9 1 0 0 0 1 0 0 0 1
9 1 0 0 0 1 0 0 0 1
9 1 0 0 0 1 0 0 0 1
9 1 0 0 0 1 0 0 0 1
9 1 0 0 0 1 0 0 0 1
9 1 0 0 0 1 0 0 0 1
9 1 0 0 0 1 0 0 0 1
9 1 0 0 0 1 0 0 0 1
9 1 0 0 0 1 0 0 0 1
9 1 0 0 0 1 0 0 0 1
9 1 0 0 0 1 0 0 0 1
9 1 0 0 0 1 0 0 0 1
9 1 0 0 0 1 0 0 0 1
9 1 0 0 0 1 0 0 0 1
9 1 0 0 0 1 0 0 0 1
9 1 0 0 0 1 0 0 0 1
9 1 0 0 0 1 0 0 0 1
9 1 0 0 0 1 0 0 0 1
9 1 0 0 0 1 0 0 0 1
9 1 0 0 0 1 0 0 0 1
9 1 0 0 0 1 0 0 0 1
9 1 0 0 0 1 0 0 0 1
9 1 0 0 0 1 0 0 0 1
9 1 0 0 0 1 0 0 0 1
9 1 0 0 0 1 0 0 0 1
9 1 0 0 0 1 0 0 0 1
9 1 0 0 0 1 0 0 0 1
9 1 0 0 0 1 0 0 0 1
9 1 0 0 0 1 0 0 0 1
9 1 0 0 0 1 0 0 0 1
9 1 0 0 0 1 0 0 0 1
9 1 0 0 0 1 0 0 0 1
9 1 0 0 0 1 0 0 0 1
9 1 0 0 0 1 0 0 0 1
9 1 0 0 0 1 0 0 0 1
9 1 0 0 0 1 0 0 0 1
9 1 0 0 0 1 0 0 0 1
9 1 0 0 0 1 0 0 0 1
9 1 0 0 0 1 0 0 0 1
