POINTS:
0.0 0.0 0.0
0.0 0.0 1.0
0.0 1.0 0.0
0.0 1.0 1.0
1.0 0.0 0.0
1.0 0.0 1.0
1.0 1.0 0.0
1.0 1.0 1.0
CELLS:
8 0 0 2 6 4 1 3 7 5
FACES:
4 1 0 2 3 1
4 1 4 6 7 5
4 1 6 4 0 2
4 1 7 5 1 3
4 1 0 4 5 1
4 1 2 6 7 3
VDATA:
3 -10 0 0
3 -10 0 0
3 -10 0 0
3 -10 0 0
3 -10 0 0
3 -10 0 0
3 -10 0 0
3 -10 0 0
CDATA:
9 1 0 0 0 1 0 0 0 1
