HEADER:
Checked=true
WithData=true
Cellformat=Vtu
POINTS:
0 0 0
0 0.5 0
0 1 0
0 1.5 0
0 2 0
0 2.5 0
0 3 0
0 3.5 0
0 4 0
0 4.5 0
0 5 0
0 5.5 0
0 6 0
0.5 0 0
0.5 0.5 0
0.5 1 0
0.5 1.5 0
0.5 2 0
0.5 2.5 0
0.5 3 0
0.5 3.5 0
0.5 4 0
0.5 4.5 0
0.5 5 0
0.5 5.5 0
0.5 6 0
1 0 0
1 0.5 0
1 1 0
1 1.5 0
1 2 0
1 2.5 0
1 3 0
1 3.5 0
1 4 0
1 4.5 0
1 5 0
1 5.5 0
1 6 0
1.5 0 0
1.5 0.5 0
1.5 1 0
1.5 2 0
1.5 2.5 0
1.5 3 0
1.5 3.5 0
1.5 4 0
1.5 5 0
1.5 5.5 0
1.5 6 0
2 0 0
2 0.5 0
2 1 0
2 1.5 0
2 2 0
2 2.5 0
2 3 0
2 3.5 0
2 4 0
2 4.5 0
2 5 0
2 5.5 0
2 6 0
2.5 0 0
2.5 0.5 0
2.5 1 0
2.5 1.5 0
2.5 2 0
2.5 2.5 0
2.5 3 0
2.5 3.5 0
2.5 4 0
2.5 4.5 0
2.5 5 0
2.5 5.5 0
2.5 6 0
3 0 0
3 0.5 0
3 1 0
3 1.5 0
3 2 0
3 2.5 0
3 3 0
3 3.5 0
3 4 0
3 4.5 0
3 5 0
3 5.5 0
3 6 0
3.5 0 0
3.5 0.5 0
3.5 1 0
3.5 1.5 0
3.5 2 0
3.5 2.5 0
3.5 3 0
3.5 3.5 0
3.5 4 0
3.5 4.5 0
3.5 5 0
3.5 5.5 0
3.5 6 0
4 0 0
4 0.5 0
4 1 0
4 1.5 0
4 2 0
4 2.5 0
4 3 0
4 3.5 0
4 4 0
4 4.5 0
4 5 0
4 5.5 0
4 6 0
4.5 0 0
4.5 0.5 0
4.5 1 0
4.5 2 0
4.5 2.5 0
4.5 3 0
4.5 3.5 0
4.5 4 0
4.5 5 0
4.5 5.5 0
4.5 6 0
5 0 0
5 0.5 0
5 1 0
5 1.5 0
5 2 0
5 2.5 0
5 3 0
5 3.5 0
5 4 0
5 4.5 0
5 5 0
5 5.5 0
5 6 0
5.5 0 0
5.5 0.5 0
5.5 1 0
5.5 1.5 0
5.5 2 0
5.5 2.5 0
5.5 3 0
5.5 3.5 0
5.5 4 0
5.5 4.5 0
5.5 5 0
5.5 5.5 0
5.5 6 0
6 0 0
6 0.5 0
6 1 0
6 1.5 0
6 2 0
6 2.5 0
6 3 0
6 3.5 0
6 4 0
6 4.5 0
6 5 0
6 5.5 0
6 6 0
CELLS:
9 0 0 13 14 1 
9 0 1 14 15 2 
9 0 2 15 16 3 
9 0 3 16 17 4 
9 0 4 17 18 5 
9 0 5 18 19 6 
9 0 6 19 20 7 
9 0 7 20 21 8 
9 0 8 21 22 9 
9 0 9 22 23 10 
9 0 10 23 24 11 
9 0 11 24 25 12 
9 0 13 26 27 14 
9 0 14 27 28 15 
9 0 15 28 29 16 
9 0 16 29 30 17 
9 0 17 30 31 18 
9 0 18 31 32 19 
9 0 19 32 33 20 
9 0 20 33 34 21 
9 0 21 34 35 22 
9 0 22 35 36 23 
9 0 23 36 37 24 
9 0 24 37 38 25 
9 0 26 39 40 27 
9 0 27 40 41 28 
9 0 30 42 43 31 
9 0 31 43 44 32 
9 0 32 44 45 33 
9 0 33 45 46 34 
9 0 36 47 48 37 
9 0 37 48 49 38 
9 0 39 50 51 40 
9 0 40 51 52 41 
9 0 42 54 55 43 
9 0 43 55 56 44 
9 0 44 56 57 45 
9 0 45 57 58 46 
9 0 47 60 61 48 
9 0 48 61 62 49 
9 0 50 63 64 51 
9 0 51 64 65 52 
9 0 52 65 66 53 
9 0 53 66 67 54 
9 0 54 67 68 55 
9 0 55 68 69 56 
9 0 56 69 70 57 
9 0 57 70 71 58 
9 0 58 71 72 59 
9 0 59 72 73 60 
9 0 60 73 74 61 
9 0 61 74 75 62 
9 0 63 76 77 64 
9 0 64 77 78 65 
9 0 65 78 79 66 
9 0 66 79 80 67 
9 0 67 80 81 68 
9 0 68 81 82 69 
9 0 69 82 83 70 
9 0 70 83 84 71 
9 0 71 84 85 72 
9 0 72 85 86 73 
9 0 73 86 87 74 
9 0 74 87 88 75 
9 0 76 89 90 77 
9 0 77 90 91 78 
9 0 78 91 92 79 
9 0 79 92 93 80 
9 0 80 93 94 81 
9 0 81 94 95 82 
9 0 82 95 96 83 
9 0 83 96 97 84 
9 0 84 97 98 85 
9 0 85 98 99 86 
9 0 86 99 100 87 
9 0 87 100 101 88 
9 0 89 102 103 90 
9 0 90 103 104 91 
9 0 91 104 105 92 
9 0 92 105 106 93 
9 0 93 106 107 94 
9 0 94 107 108 95 
9 0 95 108 109 96 
9 0 96 109 110 97 
9 0 97 110 111 98 
9 0 98 111 112 99 
9 0 99 112 113 100 
9 0 100 113 114 101 
9 0 102 115 116 103 
9 0 103 116 117 104 
9 0 106 118 119 107 
9 0 107 119 120 108 
9 0 108 120 121 109 
9 0 109 121 122 110 
9 0 112 123 124 113 
9 0 113 124 125 114 
9 0 115 126 127 116 
9 0 116 127 128 117 
9 0 118 130 131 119 
9 0 119 131 132 120 
9 0 120 132 133 121 
9 0 121 133 134 122 
9 0 123 136 137 124 
9 0 124 137 138 125 
9 0 126 139 140 127 
9 0 127 140 141 128 
9 0 128 141 142 129 
9 0 129 142 143 130 
9 0 130 143 144 131 
9 0 131 144 145 132 
9 0 132 145 146 133 
9 0 133 146 147 134 
9 0 134 147 148 135 
9 0 135 148 149 136 
9 0 136 149 150 137 
9 0 137 150 151 138 
9 0 139 152 153 140 
9 0 140 153 154 141 
9 0 141 154 155 142 
9 0 142 155 156 143 
9 0 143 156 157 144 
9 0 144 157 158 145 
9 0 145 158 159 146 
9 0 146 159 160 147 
9 0 147 160 161 148 
9 0 148 161 162 149 
9 0 149 162 163 150 
9 0 150 163 164 151 
FACES:
1 0 1 
1 152 153 
1 1 2 
1 153 154 
1 2 3 
1 154 155 
1 3 4 
1 155 156 
1 4 5 
1 156 157 
1 5 6 
1 157 158 
1 6 7 
1 158 159 
1 7 8 
1 159 160 
1 8 9 
1 160 161 
1 9 10 
1 161 162 
1 10 11 
1 162 163 
1 11 12 
1 163 164 
1 0 13 
1 12 25 
1 13 26 
1 25 38 
1 26 39 
1 38 49 
1 39 50 
1 49 62 
1 50 63 
1 62 75 
1 63 76 
1 75 88 
1 76 89 
1 88 101 
1 89 102 
1 101 114 
1 102 115 
1 114 125 
1 115 126 
1 125 138 
1 126 139 
1 138 151 
1 139 152 
1 151 164 
230 28 29 
230 52 53 
230 29 30 
230 53 54 
230 28 41 
230 30 42 
230 41 52 
230 42 54 
231 104 105 
231 128 129 
231 105 106 
231 129 130 
231 104 117 
231 106 118 
231 117 128 
231 118 130 
232 34 35 
232 58 59 
232 35 36 
232 59 60 
232 34 46 
232 36 47 
232 46 58 
232 47 60 
233 110 111 
233 134 135 
233 111 112 
233 135 136 
233 110 122 
233 112 123 
233 122 134 
233 123 136 
VDATA:
-10 0 0 
-10 0 0 
-10 0 0 
-10 0 0 
-10 0 0 
-10 0 0 
-10 0 0 
-10 0 0 
-10 0 0 
-10 0 0 
-10 0 0 
-10 0 0 
-10 0 0 
-10 0 0 
-10 0 0 
-10 0 0 
-10 0 0 
-10 0 0 
-10 0 0 
-10 0 0 
-10 0 0 
-10 0 0 
-10 0 0 
-10 0 0 
-10 0 0 
-10 0 0 
-10 0 0 
-10 0 0 
-10 0 0 
-10 0 0 
-10 0 0 
-10 0 0 
-10 0 0 
-10 0 0 
-10 0 0 
-10 0 0 
-10 0 0 
-10 0 0 
-10 0 0 
-10 0 0 
-10 0 0 
-10 0 0 
-10 0 0 
-10 0 0 
-10 0 0 
-10 0 0 
-10 0 0 
-10 0 0 
-10 0 0 
-10 0 0 
-10 0 0 
-10 0 0 
-10 0 0 
-10 0 0 
-10 0 0 
-10 0 0 
-10 0 0 
-10 0 0 
-10 0 0 
-10 0 0 
-10 0 0 
-10 0 0 
-10 0 0 
-10 0 0 
-10 0 0 
-10 0 0 
-10 0 0 
-10 0 0 
-10 0 0 
-10 0 0 
-10 0 0 
-10 0 0 
-10 0 0 
-10 0 0 
-10 0 0 
-10 0 0 
-10 0 0 
-10 0 0 
-10 0 0 
-10 0 0 
-10 0 0 
-10 0 0 
-10 0 0 
-10 0 0 
-10 0 0 
-10 0 0 
-10 0 0 
-10 0 0 
-10 0 0 
-10 0 0 
-10 0 0 
-10 0 0 
-10 0 0 
-10 0 0 
-10 0 0 
-10 0 0 
-10 0 0 
-10 0 0 
-10 0 0 
-10 0 0 
-10 0 0 
-10 0 0 
-10 0 0 
-10 0 0 
-10 0 0 
-10 0 0 
-10 0 0 
-10 0 0 
-10 0 0 
-10 0 0 
-10 0 0 
-10 0 0 
-10 0 0 
-10 0 0 
-10 0 0 
-10 0 0 
-10 0 0 
-10 0 0 
-10 0 0 
-10 0 0 
-10 0 0 
-10 0 0 
-10 0 0 
-10 0 0 
-10 0 0 
-10 0 0 
-10 0 0 
-10 0 0 
-10 0 0 
-10 0 0 
-10 0 0 
-10 0 0 
-10 0 0 
-10 0 0 
-10 0 0 
-10 0 0 
-10 0 0 
-10 0 0 
-10 0 0 
-10 0 0 
-10 0 0 
-10 0 0 
-10 0 0 
-10 0 0 
-10 0 0 
-10 0 0 
-10 0 0 
-10 0 0 
-10 0 0 
-10 0 0 
-10 0 0 
-10 0 0 
-10 0 0 
-10 0 0 
-10 0 0 
-10 0 0 
-10 0 0 
-10 0 0 
-10 0 0 
-10 0 0 
-10 0 0 
-10 0 0 
-10 0 0 
-10 0 0 
-10 0 0 
CDATA:
1 0 0 0 1 0 0 0 1 
1 0 0 0 1 0 0 0 1 
1 0 0 0 1 0 0 0 1 
1 0 0 0 1 0 0 0 1 
1 0 0 0 1 0 0 0 1 
1 0 0 0 1 0 0 0 1 
1 0 0 0 1 0 0 0 1 
1 0 0 0 1 0 0 0 1 
1 0 0 0 1 0 0 0 1 
1 0 0 0 1 0 0 0 1 
1 0 0 0 1 0 0 0 1 
1 0 0 0 1 0 0 0 1 
1 0 0 0 1 0 0 0 1 
1 0 0 0 1 0 0 0 1 
1 0 0 0 1 0 0 0 1 
1 0 0 0 1 0 0 0 1 
1 0 0 0 1 0 0 0 1 
1 0 0 0 1 0 0 0 1 
1 0 0 0 1 0 0 0 1 
1 0 0 0 1 0 0 0 1 
1 0 0 0 1 0 0 0 1 
1 0 0 0 1 0 0 0 1 
1 0 0 0 1 0 0 0 1 
1 0 0 0 1 0 0 0 1 
1 0 0 0 1 0 0 0 1 
1 0 0 0 1 0 0 0 1 
1 0 0 0 1 0 0 0 1 
1 0 0 0 1 0 0 0 1 
1 0 0 0 1 0 0 0 1 
1 0 0 0 1 0 0 0 1 
1 0 0 0 1 0 0 0 1 
1 0 0 0 1 0 0 0 1 
1 0 0 0 1 0 0 0 1 
1 0 0 0 1 0 0 0 1 
1 0 0 0 1 0 0 0 1 
1 0 0 0 1 0 0 0 1 
1 0 0 0 1 0 0 0 1 
1 0 0 0 1 0 0 0 1 
1 0 0 0 1 0 0 0 1 
1 0 0 0 1 0 0 0 1 
1 0 0 0 1 0 0 0 1 
1 0 0 0 1 0 0 0 1 
1 0 0 0 1 0 0 0 1 
1 0 0 0 1 0 0 0 1 
1 0 0 0 1 0 0 0 1 
1 0 0 0 1 0 0 0 1 
1 0 0 0 1 0 0 0 1 
1 0 0 0 1 0 0 0 1 
1 0 0 0 1 0 0 0 1 
1 0 0 0 1 0 0 0 1 
1 0 0 0 1 0 0 0 1 
1 0 0 0 1 0 0 0 1 
1 0 0 0 1 0 0 0 1 
1 0 0 0 1 0 0 0 1 
1 0 0 0 1 0 0 0 1 
1 0 0 0 1 0 0 0 1 
1 0 0 0 1 0 0 0 1 
1 0 0 0 1 0 0 0 1 
1 0 0 0 1 0 0 0 1 
1 0 0 0 1 0 0 0 1 
1 0 0 0 1 0 0 0 1 
1 0 0 0 1 0 0 0 1 
1 0 0 0 1 0 0 0 1 
1 0 0 0 1 0 0 0 1 
1 0 0 0 1 0 0 0 1 
1 0 0 0 1 0 0 0 1 
1 0 0 0 1 0 0 0 1 
1 0 0 0 1 0 0 0 1 
1 0 0 0 1 0 0 0 1 
1 0 0 0 1 0 0 0 1 
1 0 0 0 1 0 0 0 1 
1 0 0 0 1 0 0 0 1 
1 0 0 0 1 0 0 0 1 
1 0 0 0 1 0 0 0 1 
1 0 0 0 1 0 0 0 1 
1 0 0 0 1 0 0 0 1 
1 0 0 0 1 0 0 0 1 
1 0 0 0 1 0 0 0 1 
1 0 0 0 1 0 0 0 1 
1 0 0 0 1 0 0 0 1 
1 0 0 0 1 0 0 0 1 
1 0 0 0 1 0 0 0 1 
1 0 0 0 1 0 0 0 1 
1 0 0 0 1 0 0 0 1 
1 0 0 0 1 0 0 0 1 
1 0 0 0 1 0 0 0 1 
1 0 0 0 1 0 0 0 1 
1 0 0 0 1 0 0 0 1 
1 0 0 0 1 0 0 0 1 
1 0 0 0 1 0 0 0 1 
1 0 0 0 1 0 0 0 1 
1 0 0 0 1 0 0 0 1 
1 0 0 0 1 0 0 0 1 
1 0 0 0 1 0 0 0 1 
1 0 0 0 1 0 0 0 1 
1 0 0 0 1 0 0 0 1 
1 0 0 0 1 0 0 0 1 
1 0 0 0 1 0 0 0 1 
1 0 0 0 1 0 0 0 1 
1 0 0 0 1 0 0 0 1 
1 0 0 0 1 0 0 0 1 
1 0 0 0 1 0 0 0 1 
1 0 0 0 1 0 0 0 1 
1 0 0 0 1 0 0 0 1 
1 0 0 0 1 0 0 0 1 
1 0 0 0 1 0 0 0 1 
1 0 0 0 1 0 0 0 1 
1 0 0 0 1 0 0 0 1 
1 0 0 0 1 0 0 0 1 
1 0 0 0 1 0 0 0 1 
1 0 0 0 1 0 0 0 1 
1 0 0 0 1 0 0 0 1 
1 0 0 0 1 0 0 0 1 
1 0 0 0 1 0 0 0 1 
1 0 0 0 1 0 0 0 1 
1 0 0 0 1 0 0 0 1 
1 0 0 0 1 0 0 0 1 
1 0 0 0 1 0 0 0 1 
1 0 0 0 1 0 0 0 1 
1 0 0 0 1 0 0 0 1 
1 0 0 0 1 0 0 0 1 
1 0 0 0 1 0 0 0 1 
1 0 0 0 1 0 0 0 1 
1 0 0 0 1 0 0 0 1 
1 0 0 0 1 0 0 0 1 
1 0 0 0 1 0 0 0 1 
1 0 0 0 1 0 0 0 1 
1 0 0 0 1 0 0 0 1 
