POINTS:
0.0 0.0
0.0 1.0
0.0 2.0
0.0 3.0
0.0 4.0
0.0 5.0
0.0 6.0
0.0 7.0
0.0 8.0
0.0 9.0
0.0 10.0
1.0 0.0
1.0 1.0
1.0 2.0
1.0 3.0
1.0 4.0
1.0 5.0
1.0 6.0
1.0 7.0
1.0 8.0
1.0 9.0
1.0 10.0
2.0 0.0
2.0 1.0
2.0 2.0
2.0 3.0
2.0 4.0
2.0 5.0
2.0 6.0
2.0 7.0
2.0 8.0
2.0 9.0
2.0 10.0
3.0 0.0
3.0 1.0
3.0 2.0
3.0 3.0
3.0 4.0
3.0 5.0
3.0 6.0
3.0 7.0
3.0 8.0
3.0 9.0
3.0 10.0
4.0 0.0
4.0 1.0
4.0 2.0
4.0 3.0
4.0 4.0
4.0 5.0
4.0 6.0
4.0 7.0
4.0 8.0
4.0 9.0
4.0 10.0
5.0 0.0
5.0 1.0
5.0 2.0
5.0 3.0
5.0 4.0
5.0 5.0
5.0 6.0
5.0 7.0
5.0 8.0
5.0 9.0
5.0 10.0
CELLS:
3 0 0 11 12
3 0 0 12 1
3 0 1 12 13
3 0 1 13 2
3 0 2 13 14
3 0 2 14 3
3 0 3 14 15
3 0 3 15 4
3 0 4 15 16
3 0 4 16 5
3 0 5 16 17
3 0 5 17 6
3 0 6 17 18
3 0 6 18 7
3 0 7 18 19
3 0 7 19 8
3 0 8 19 20
3 0 8 20 9
3 0 9 20 21
3 0 9 21 10
3 0 11 22 23
3 0 11 23 12
3 0 12 23 24
3 0 12 24 13
3 0 13 24 25
3 0 13 25 14
3 0 14 25 26
3 0 14 26 15
3 0 15 26 27
3 0 15 27 16
3 0 16 27 28
3 0 16 28 17
3 0 17 28 29
3 0 17 29 18
3 0 18 29 30
3 0 18 30 19
3 0 19 30 31
3 0 19 31 20
3 0 20 31 32
3 0 20 32 21
3 0 22 33 34
3 0 22 34 23
3 0 23 34 35
3 0 23 35 24
3 0 24 35 36
3 0 24 36 25
3 0 25 36 37
3 0 25 37 26
3 0 26 37 38
3 0 26 38 27
3 0 27 38 39
3 0 27 39 28
3 0 28 39 40
3 0 28 40 29
3 0 29 40 41
3 0 29 41 30
3 0 30 41 42
3 0 30 42 31
3 0 31 42 43
3 0 31 43 32
3 0 33 44 45
3 0 33 45 34
3 0 34 45 46
3 0 34 46 35
3 0 35 46 47
3 0 35 47 36
3 0 36 47 48
3 0 36 48 37
3 0 37 48 49
3 0 37 49 38
3 0 38 49 50
3 0 38 50 39
3 0 39 50 51
3 0 39 51 40
3 0 40 51 52
3 0 40 52 41
3 0 41 52 53
3 0 41 53 42
3 0 42 53 54
3 0 42 54 43
3 0 44 55 56
3 0 44 56 45
3 0 45 56 57
3 0 45 57 46
3 0 46 57 58
3 0 46 58 47
3 0 47 58 59
3 0 47 59 48
3 0 48 59 60
3 0 48 60 49
3 0 49 60 61
3 0 49 61 50
3 0 50 61 62
3 0 50 62 51
3 0 51 62 63
3 0 51 63 52
3 0 52 63 64
3 0 52 64 53
3 0 53 64 65
3 0 53 65 54
FACES:
2 100 0 1
2 230 55 56
2 100 1 2
2 230 56 57
2 100 2 3
2 230 57 58
2 100 3 4
2 230 58 59
2 100 4 5
2 230 59 60
2 100 5 6
2 230 60 61
2 100 6 7
2 230 61 62
2 100 7 8
2 230 62 63
2 100 8 9
2 230 63 64
2 100 9 10
2 230 64 65
2 231 10 21
2 101 0 11
2 231 21 32
2 101 11 22
2 231 32 43
2 101 22 33
2 231 43 54
2 101 33 44
2 231 54 65
2 101 44 55
VDATA:
3 -10 0 0
3 -10 0 0
3 -10 0 0
3 -10 0 0
3 -10 0 0
3 -10 0 0
3 -10 0 0
3 -10 0 0
3 -10 0 0
3 -10 0 0
3 -10 0 0
3 -10 0 0
3 -10 0 0
3 -10 0 0
3 -10 0 0
3 -10 0 0
3 -10 0 0
3 -10 0 0
3 -10 0 0
3 -10 0 0
3 -10 0 0
3 -10 0 0
3 -10 0 0
3 -10 0 0
3 -10 0 0
3 -10 0 0
3 -10 0 0
3 -10 0 0
3 -10 0 0
3 -10 0 0
3 -10 0 0
3 -10 0 0
3 -10 0 0
3 -10 0 0
3 -10 0 0
3 -10 0 0
3 -10 0 0
3 -10 0 0
3 -10 0 0
3 -10 0 0
3 -10 0 0
3 -10 0 0
3 -10 0 0
3 -10 0 0
3 -10 0 0
3 -10 0 0
3 -10 0 0
3 -10 0 0
3 -10 0 0
3 -10 0 0
3 -10 0 0
3 -10 0 0
3 -10 0 0
3 -10 0 0
3 -10 0 0
3 -10 0 0
3 -10 0 0
3 -10 0 0
3 -10 0 0
3 -10 0 0
3 -10 0 0
3 -10 0 0
3 -10 0 0
3 -10 0 0
3 -10 0 0
3 -10 0 0
CDATA:
9 1 0 0 0 1 0 0 0 1
9 1 0 0 0 1 0 0 0 1
9 1 0 0 0 1 0 0 0 1
9 1 0 0 0 1 0 0 0 1
9 1 0 0 0 1 0 0 0 1
9 1 0 0 0 1 0 0 0 1
9 1 0 0 0 1 0 0 0 1
9 1 0 0 0 1 0 0 0 1
9 1 0 0 0 1 0 0 0 1
9 1 0 0 0 1 0 0 0 1
9 1 0 0 0 1 0 0 0 1
9 1 0 0 0 1 0 0 0 1
9 1 0 0 0 1 0 0 0 1
9 1 0 0 0 1 0 0 0 1
9 1 0 0 0 1 0 0 0 1
9 1 0 0 0 1 0 0 0 1
9 1 0 0 0 1 0 0 0 1
9 1 0 0 0 1 0 0 0 1
9 1 0 0 0 1 0 0 0 1
9 1 0 0 0 1 0 0 0 1
9 1 0 0 0 1 0 0 0 1
9 1 0 0 0 1 0 0 0 1
9 1 0 0 0 1 0 0 0 1
9 1 0 0 0 1 0 0 0 1
9 1 0 0 0 1 0 0 0 1
9 1 0 0 0 1 0 0 0 1
9 1 0 0 0 1 0 0 0 1
9 1 0 0 0 1 0 0 0 1
9 1 0 0 0 1 0 0 0 1
9 1 0 0 0 1 0 0 0 1
9 1 0 0 0 1 0 0 0 1
9 1 0 0 0 1 0 0 0 1
9 1 0 0 0 1 0 0 0 1
9 1 0 0 0 1 0 0 0 1
9 1 0 0 0 1 0 0 0 1
9 1 0 0 0 1 0 0 0 1
9 1 0 0 0 1 0 0 0 1
9 1 0 0 0 1 0 0 0 1
9 1 0 0 0 1 0 0 0 1
9 1 0 0 0 1 0 0 0 1
9 1 0 0 0 1 0 0 0 1
9 1 0 0 0 1 0 0 0 1
9 1 0 0 0 1 0 0 0 1
9 1 0 0 0 1 0 0 0 1
9 1 0 0 0 1 0 0 0 1
9 1 0 0 0 1 0 0 0 1
9 1 0 0 0 1 0 0 0 1
9 1 0 0 0 1 0 0 0 1
9 1 0 0 0 1 0 0 0 1
9 1 0 0 0 1 0 0 0 1
9 1 0 0 0 1 0 0 0 1
9 1 0 0 0 1 0 0 0 1
9 1 0 0 0 1 0 0 0 1
9 1 0 0 0 1 0 0 0 1
9 1 0 0 0 1 0 0 0 1
9 1 0 0 0 1 0 0 0 1
9 1 0 0 0 1 0 0 0 1
9 1 0 0 0 1 0 0 0 1
9 1 0 0 0 1 0 0 0 1
9 1 0 0 0 1 0 0 0 1
9 1 0 0 0 1 0 0 0 1
9 1 0 0 0 1 0 0 0 1
9 1 0 0 0 1 0 0 0 1
9 1 0 0 0 1 0 0 0 1
9 1 0 0 0 1 0 0 0 1
9 1 0 0 0 1 0 0 0 1
9 1 0 0 0 1 0 0 0 1
9 1 0 0 0 1 0 0 0 1
9 1 0 0 0 1 0 0 0 1
9 1 0 0 0 1 0 0 0 1
9 1 0 0 0 1 0 0 0 1
9 1 0 0 0 1 0 0 0 1
9 1 0 0 0 1 0 0 0 1
9 1 0 0 0 1 0 0 0 1
9 1 0 0 0 1 0 0 0 1
9 1 0 0 0 1 0 0 0 1
9 1 0 0 0 1 0 0 0 1
9 1 0 0 0 1 0 0 0 1
9 1 0 0 0 1 0 0 0 1
9 1 0 0 0 1 0 0 0 1
9 1 0 0 0 1 0 0 0 1
9 1 0 0 0 1 0 0 0 1
9 1 0 0 0 1 0 0 0 1
9 1 0 0 0 1 0 0 0 1
9 1 0 0 0 1 0 0 0 1
9 1 0 0 0 1 0 0 0 1
9 1 0 0 0 1 0 0 0 1
9 1 0 0 0 1 0 0 0 1
9 1 0 0 0 1 0 0 0 1
9 1 0 0 0 1 0 0 0 1
9 1 0 0 0 1 0 0 0 1
9 1 0 0 0 1 0 0 0 1
9 1 0 0 0 1 0 0 0 1
9 1 0 0 0 1 0 0 0 1
9 1 0 0 0 1 0 0 0 1
9 1 0 0 0 1 0 0 0 1
9 1 0 0 0 1 0 0 0 1
9 1 0 0 0 1 0 0 0 1
9 1 0 0 0 1 0 0 0 1
9 1 0 0 0 1 0 0 0 1
