POINTS:
0.0 0.0 0.0
0.0 0.0 1.0
0.0 0.0 2.0
0.0 0.0 3.0
0.0 1.0 0.0
0.0 1.0 1.0
0.0 1.0 2.0
0.0 1.0 3.0
0.0 2.0 0.0
0.0 2.0 1.0
0.0 2.0 2.0
0.0 2.0 3.0
0.0 3.0 0.0
0.0 3.0 1.0
0.0 3.0 2.0
0.0 3.0 3.0
1.0 0.0 0.0
1.0 0.0 1.0
1.0 0.0 2.0
1.0 0.0 3.0
1.0 1.0 0.0
1.0 1.0 1.0
1.0 1.0 2.0
1.0 1.0 3.0
1.0 2.0 0.0
1.0 2.0 1.0
1.0 2.0 2.0
1.0 2.0 3.0
1.0 3.0 0.0
1.0 3.0 1.0
1.0 3.0 2.0
1.0 3.0 3.0
2.0 0.0 0.0
2.0 0.0 1.0
2.0 0.0 2.0
2.0 0.0 3.0
2.0 1.0 0.0
2.0 1.0 1.0
2.0 1.0 2.0
2.0 1.0 3.0
2.0 2.0 0.0
2.0 2.0 1.0
2.0 2.0 2.0
2.0 2.0 3.0
2.0 3.0 0.0
2.0 3.0 1.0
2.0 3.0 2.0
2.0 3.0 3.0
3.0 0.0 0.0
3.0 0.0 1.0
3.0 0.0 2.0
3.0 0.0 3.0
3.0 1.0 0.0
3.0 1.0 1.0
3.0 1.0 2.0
3.0 1.0 3.0
3.0 2.0 0.0
3.0 2.0 1.0
3.0 2.0 2.0
3.0 2.0 3.0
3.0 3.0 0.0
3.0 3.0 1.0
3.0 3.0 2.0
3.0 3.0 3.0
CELLS:
4 0 0 4 5 21
4 0 0 4 20 21
4 0 0 16 20 21
4 0 0 16 17 21
4 0 0 1 17 21
4 0 0 1 5 21
4 0 1 5 6 22
4 0 1 5 21 22
4 0 1 17 21 22
4 0 1 17 18 22
4 0 1 2 18 22
4 0 1 2 6 22
4 0 2 6 7 23
4 0 2 6 22 23
4 0 2 18 22 23
4 0 2 18 19 23
4 0 2 3 19 23
4 0 2 3 7 23
4 0 4 8 9 25
4 0 4 8 24 25
4 0 4 20 24 25
4 0 4 20 21 25
4 0 4 5 21 25
4 0 4 5 9 25
4 0 5 9 10 26
4 0 5 9 25 26
4 0 5 21 25 26
4 0 5 21 22 26
4 0 5 6 22 26
4 0 5 6 10 26
4 0 6 10 11 27
4 0 6 10 26 27
4 0 6 22 26 27
4 0 6 22 23 27
4 0 6 7 23 27
4 0 6 7 11 27
4 0 8 12 13 29
4 0 8 12 28 29
4 0 8 24 28 29
4 0 8 24 25 29
4 0 8 9 25 29
4 0 8 9 13 29
4 0 9 13 14 30
4 0 9 13 29 30
4 0 9 25 29 30
4 0 9 25 26 30
4 0 9 10 26 30
4 0 9 10 14 30
4 0 10 14 15 31
4 0 10 14 30 31
4 0 10 26 30 31
4 0 10 26 27 31
4 0 10 11 27 31
4 0 10 11 15 31
4 0 16 20 21 37
4 0 16 20 36 37
4 0 16 32 36 37
4 0 16 32 33 37
4 0 16 17 33 37
4 0 16 17 21 37
4 0 17 21 22 38
4 0 17 21 37 38
4 0 17 33 37 38
4 0 17 33 34 38
4 0 17 18 34 38
4 0 17 18 22 38
4 0 18 22 23 39
4 0 18 22 38 39
4 0 18 34 38 39
4 0 18 34 35 39
4 0 18 19 35 39
4 0 18 19 23 39
4 0 20 24 25 41
4 0 20 24 40 41
4 0 20 36 40 41
4 0 20 36 37 41
4 0 20 21 37 41
4 0 20 21 25 41
4 0 21 25 26 42
4 0 21 25 41 42
4 0 21 37 41 42
4 0 21 37 38 42
4 0 21 22 38 42
4 0 21 22 26 42
4 0 22 26 27 43
4 0 22 26 42 43
4 0 22 38 42 43
4 0 22 38 39 43
4 0 22 23 39 43
4 0 22 23 27 43
4 0 24 28 29 45
4 0 24 28 44 45
4 0 24 40 44 45
4 0 24 40 41 45
4 0 24 25 41 45
4 0 24 25 29 45
4 0 25 29 30 46
4 0 25 29 45 46
4 0 25 41 45 46
4 0 25 41 42 46
4 0 25 26 42 46
4 0 25 26 30 46
4 0 26 30 31 47
4 0 26 30 46 47
4 0 26 42 46 47
4 0 26 42 43 47
4 0 26 27 43 47
4 0 26 27 31 47
4 0 32 36 37 53
4 0 32 36 52 53
4 0 32 48 52 53
4 0 32 48 49 53
4 0 32 33 49 53
4 0 32 33 37 53
4 0 33 37 38 54
4 0 33 37 53 54
4 0 33 49 53 54
4 0 33 49 50 54
4 0 33 34 50 54
4 0 33 34 38 54
4 0 34 38 39 55
4 0 34 38 54 55
4 0 34 50 54 55
4 0 34 50 51 55
4 0 34 35 51 55
4 0 34 35 39 55
4 0 36 40 41 57
4 0 36 40 56 57
4 0 36 52 56 57
4 0 36 52 53 57
4 0 36 37 53 57
4 0 36 37 41 57
4 0 37 41 42 58
4 0 37 41 57 58
4 0 37 53 57 58
4 0 37 53 54 58
4 0 37 38 54 58
4 0 37 38 42 58
4 0 38 42 43 59
4 0 38 42 58 59
4 0 38 54 58 59
4 0 38 54 55 59
4 0 38 39 55 59
4 0 38 39 43 59
4 0 40 44 45 61
4 0 40 44 60 61
4 0 40 56 60 61
4 0 40 56 57 61
4 0 40 41 57 61
4 0 40 41 45 61
4 0 41 45 46 62
4 0 41 45 61 62
4 0 41 57 61 62
4 0 41 57 58 62
4 0 41 42 58 62
4 0 41 42 46 62
4 0 42 46 47 63
4 0 42 46 62 63
4 0 42 58 62 63
4 0 42 58 59 63
4 0 42 43 59 63
4 0 42 43 47 63
FACES:
3 0 0 4 5
3 0 0 5 1
3 0 48 52 53
3 0 48 53 49
3 0 1 5 6
3 0 1 6 2
3 0 49 53 54
3 0 49 54 50
3 0 2 6 7
3 0 2 7 3
3 0 50 54 55
3 0 50 55 51
3 0 4 8 9
3 0 4 9 5
3 0 52 56 57
3 0 52 57 53
3 0 5 9 10
3 0 5 10 6
3 0 53 57 58
3 0 53 58 54
3 0 6 10 11
3 0 6 11 7
3 0 54 58 59
3 0 54 59 55
3 0 8 12 13
3 0 8 13 9
3 0 56 60 61
3 0 56 61 57
3 0 9 13 14
3 0 9 14 10
3 0 57 61 62
3 0 57 62 58
3 0 10 14 15
3 0 10 15 11
3 0 58 62 63
3 0 58 63 59
3 0 23 19 3
3 0 23 3 7
3 0 20 16 0
3 0 20 0 4
3 0 27 23 7
3 0 27 7 11
3 0 24 20 4
3 0 24 4 8
3 0 31 27 11
3 0 31 11 15
3 0 28 24 8
3 0 28 8 12
3 0 39 35 19
3 0 39 19 23
3 0 36 32 16
3 0 36 16 20
3 0 43 39 23
3 0 43 23 27
3 0 40 36 20
3 0 40 20 24
3 0 47 43 27
3 0 47 27 31
3 0 44 40 24
3 0 44 24 28
3 0 55 51 35
3 0 55 35 39
3 0 52 48 32
3 0 52 32 36
3 0 59 55 39
3 0 59 39 43
3 0 56 52 36
3 0 56 36 40
3 0 63 59 43
3 0 63 43 47
3 0 60 56 40
3 0 60 40 44
3 0 0 16 17
3 0 0 17 1
3 0 12 28 29
3 0 12 29 13
3 0 1 17 18
3 0 1 18 2
3 0 13 29 30
3 0 13 30 14
3 0 2 18 19
3 0 2 19 3
3 0 14 30 31
3 0 14 31 15
3 0 16 32 33
3 0 16 33 17
3 0 28 44 45
3 0 28 45 29
3 0 17 33 34
3 0 17 34 18
3 0 29 45 46
3 0 29 46 30
3 0 18 34 35
3 0 18 35 19
3 0 30 46 47
3 0 30 47 31
3 0 32 48 49
3 0 32 49 33
3 0 44 60 61
3 0 44 61 45
3 0 33 49 50
3 0 33 50 34
3 0 45 61 62
3 0 45 62 46
3 0 34 50 51
3 0 34 51 35
3 0 46 62 63
3 0 46 63 47
VDATA:
3 0.0 0.002 20
3 0.0 0.002 20
3 -10.0 0.0 0.0
3 -10.0 0.0 0.0
3 0.0 0.002 20
3 0.0 0.002 20
3 -10.0 0.0 0.0
3 -10.0 0.0 0.0
3 -10.0 0.0 0.0
3 -10.0 0.0 0.0
3 -10.0 0.0 0.0
3 -10.0 0.0 0.0
3 -10.0 0.0 0.0
3 -10.0 0.0 0.0
3 -10.0 0.0 0.0
3 -10.0 0.0 0.0
3 0.0 0.002 20
3 0.0 0.002 20
3 -10.0 0.0 0.0
3 -10.0 0.0 0.0
3 0.0 0.002 20
3 0.0 0.002 20
3 -10.0 0.0 0.0
3 -10.0 0.0 0.0
3 -10.0 0.0 0.0
3 -10.0 0.0 0.0
3 -10.0 0.0 0.0
3 -10.0 0.0 0.0
3 -10.0 0.0 0.0
3 -10.0 0.0 0.0
3 -10.0 0.0 0.0
3 -10.0 0.0 0.0
3 -10.0 0.0 0.0
3 -10.0 0.0 0.0
3 -10.0 0.0 0.0
3 -10.0 0.0 0.0
3 -10.0 0.0 0.0
3 -10.0 0.0 0.0
3 -10.0 0.0 0.0
3 -10.0 0.0 0.0
3 -10.0 0.0 0.0
3 -10.0 0.0 0.0
3 -10.0 0.0 0.0
3 -10.0 0.0 0.0
3 -10.0 0.0 0.0
3 -10.0 0.0 0.0
3 -10.0 0.0 0.0
3 -10.0 0.0 0.0
3 -10.0 0.0 0.0
3 -10.0 0.0 0.0
3 -10.0 0.0 0.0
3 -10.0 0.0 0.0
3 -10.0 0.0 0.0
3 -10.0 0.0 0.0
3 -10.0 0.0 0.0
3 -10.0 0.0 0.0
3 -10.0 0.0 0.0
3 -10.0 0.0 0.0
3 -10.0 0.0 0.0
3 -10.0 0.0 0.0
3 -10.0 0.0 0.0
3 -10.0 0.0 0.0
3 -10.0 0.0 0.0
3 -10.0 0.0 0.0
CDATA:
9 1 0 0 0 1 0 0 0 1
9 1 0 0 0 1 0 0 0 1
9 1 0 0 0 1 0 0 0 1
9 1 0 0 0 1 0 0 0 1
9 1 0 0 0 1 0 0 0 1
9 1 0 0 0 1 0 0 0 1
9 1 0 0 0 1 0 0 0 1
9 1 0 0 0 1 0 0 0 1
9 1 0 0 0 1 0 0 0 1
9 1 0 0 0 1 0 0 0 1
9 1 0 0 0 1 0 0 0 1
9 1 0 0 0 1 0 0 0 1
9 1 0 0 0 1 0 0 0 1
9 1 0 0 0 1 0 0 0 1
9 1 0 0 0 1 0 0 0 1
9 1 0 0 0 1 0 0 0 1
9 1 0 0 0 1 0 0 0 1
9 1 0 0 0 1 0 0 0 1
9 1 0 0 0 1 0 0 0 1
9 1 0 0 0 1 0 0 0 1
9 1 0 0 0 1 0 0 0 1
9 1 0 0 0 1 0 0 0 1
9 1 0 0 0 1 0 0 0 1
9 1 0 0 0 1 0 0 0 1
9 1 0 0 0 1 0 0 0 1
9 1 0 0 0 1 0 0 0 1
9 1 0 0 0 1 0 0 0 1
9 1 0 0 0 1 0 0 0 1
9 1 0 0 0 1 0 0 0 1
9 1 0 0 0 1 0 0 0 1
9 1 0 0 0 1 0 0 0 1
9 1 0 0 0 1 0 0 0 1
9 1 0 0 0 1 0 0 0 1
9 1 0 0 0 1 0 0 0 1
9 1 0 0 0 1 0 0 0 1
9 1 0 0 0 1 0 0 0 1
9 1 0 0 0 1 0 0 0 1
9 1 0 0 0 1 0 0 0 1
9 1 0 0 0 1 0 0 0 1
9 1 0 0 0 1 0 0 0 1
9 1 0 0 0 1 0 0 0 1
9 1 0 0 0 1 0 0 0 1
9 1 0 0 0 1 0 0 0 1
9 1 0 0 0 1 0 0 0 1
9 1 0 0 0 1 0 0 0 1
9 1 0 0 0 1 0 0 0 1
9 1 0 0 0 1 0 0 0 1
9 1 0 0 0 1 0 0 0 1
9 1 0 0 0 1 0 0 0 1
9 1 0 0 0 1 0 0 0 1
9 1 0 0 0 1 0 0 0 1
9 1 0 0 0 1 0 0 0 1
9 1 0 0 0 1 0 0 0 1
9 1 0 0 0 1 0 0 0 1
9 1 0 0 0 1 0 0 0 1
9 1 0 0 0 1 0 0 0 1
9 1 0 0 0 1 0 0 0 1
9 1 0 0 0 1 0 0 0 1
9 1 0 0 0 1 0 0 0 1
9 1 0 0 0 1 0 0 0 1
9 1 0 0 0 1 0 0 0 1
9 1 0 0 0 1 0 0 0 1
9 1 0 0 0 1 0 0 0 1
9 1 0 0 0 1 0 0 0 1
9 1 0 0 0 1 0 0 0 1
9 1 0 0 0 1 0 0 0 1
9 1 0 0 0 1 0 0 0 1
9 1 0 0 0 1 0 0 0 1
9 1 0 0 0 1 0 0 0 1
9 1 0 0 0 1 0 0 0 1
9 1 0 0 0 1 0 0 0 1
9 1 0 0 0 1 0 0 0 1
9 1 0 0 0 1 0 0 0 1
9 1 0 0 0 1 0 0 0 1
9 1 0 0 0 1 0 0 0 1
9 1 0 0 0 1 0 0 0 1
9 1 0 0 0 1 0 0 0 1
9 1 0 0 0 1 0 0 0 1
9 1 0 0 0 1 0 0 0 1
9 1 0 0 0 1 0 0 0 1
9 1 0 0 0 1 0 0 0 1
9 1 0 0 0 1 0 0 0 1
9 1 0 0 0 1 0 0 0 1
9 1 0 0 0 1 0 0 0 1
9 1 0 0 0 1 0 0 0 1
9 1 0 0 0 1 0 0 0 1
9 1 0 0 0 1 0 0 0 1
9 1 0 0 0 1 0 0 0 1
9 1 0 0 0 1 0 0 0 1
9 1 0 0 0 1 0 0 0 1
9 1 0 0 0 1 0 0 0 1
9 1 0 0 0 1 0 0 0 1
9 1 0 0 0 1 0 0 0 1
9 1 0 0 0 1 0 0 0 1
9 1 0 0 0 1 0 0 0 1
9 1 0 0 0 1 0 0 0 1
9 1 0 0 0 1 0 0 0 1
9 1 0 0 0 1 0 0 0 1
9 1 0 0 0 1 0 0 0 1
9 1 0 0 0 1 0 0 0 1
9 1 0 0 0 1 0 0 0 1
9 1 0 0 0 1 0 0 0 1
9 1 0 0 0 1 0 0 0 1
9 1 0 0 0 1 0 0 0 1
9 1 0 0 0 1 0 0 0 1
9 1 0 0 0 1 0 0 0 1
9 1 0 0 0 1 0 0 0 1
9 1 0 0 0 1 0 0 0 1
9 1 0 0 0 1 0 0 0 1
9 1 0 0 0 1 0 0 0 1
9 1 0 0 0 1 0 0 0 1
9 1 0 0 0 1 0 0 0 1
9 1 0 0 0 1 0 0 0 1
9 1 0 0 0 1 0 0 0 1
9 1 0 0 0 1 0 0 0 1
9 1 0 0 0 1 0 0 0 1
9 1 0 0 0 1 0 0 0 1
9 1 0 0 0 1 0 0 0 1
9 1 0 0 0 1 0 0 0 1
9 1 0 0 0 1 0 0 0 1
9 1 0 0 0 1 0 0 0 1
9 1 0 0 0 1 0 0 0 1
9 1 0 0 0 1 0 0 0 1
9 1 0 0 0 1 0 0 0 1
9 1 0 0 0 1 0 0 0 1
9 1 0 0 0 1 0 0 0 1
9 1 0 0 0 1 0 0 0 1
9 1 0 0 0 1 0 0 0 1
9 1 0 0 0 1 0 0 0 1
9 1 0 0 0 1 0 0 0 1
9 1 0 0 0 1 0 0 0 1
9 1 0 0 0 1 0 0 0 1
9 1 0 0 0 1 0 0 0 1
9 1 0 0 0 1 0 0 0 1
9 1 0 0 0 1 0 0 0 1
9 1 0 0 0 1 0 0 0 1
9 1 0 0 0 1 0 0 0 1
9 1 0 0 0 1 0 0 0 1
9 1 0 0 0 1 0 0 0 1
9 1 0 0 0 1 0 0 0 1
9 1 0 0 0 1 0 0 0 1
9 1 0 0 0 1 0 0 0 1
9 1 0 0 0 1 0 0 0 1
9 1 0 0 0 1 0 0 0 1
9 1 0 0 0 1 0 0 0 1
9 1 0 0 0 1 0 0 0 1
9 1 0 0 0 1 0 0 0 1
9 1 0 0 0 1 0 0 0 1
9 1 0 0 0 1 0 0 0 1
9 1 0 0 0 1 0 0 0 1
9 1 0 0 0 1 0 0 0 1
9 1 0 0 0 1 0 0 0 1
9 1 0 0 0 1 0 0 0 1
9 1 0 0 0 1 0 0 0 1
9 1 0 0 0 1 0 0 0 1
9 1 0 0 0 1 0 0 0 1
9 1 0 0 0 1 0 0 0 1
9 1 0 0 0 1 0 0 0 1
9 1 0 0 0 1 0 0 0 1
9 1 0 0 0 1 0 0 0 1
9 1 0 0 0 1 0 0 0 1
9 1 0 0 0 1 0 0 0 1
