POINTS:
0.0 0.0
0.0 0.5
0.0 1.0
0.0 1.5
0.0 2.0
0.0 2.5
0.0 3.0
0.0 3.5
0.0 4.0
0.0 4.5
0.0 5.0
0.0 5.5
0.0 6.0
0.0 6.5
0.0 7.0
0.5 0.0
0.5 0.5
0.5 1.0
0.5 1.5
0.5 2.0
0.5 2.5
0.5 3.0
0.5 3.5
0.5 4.0
0.5 4.5
0.5 5.0
0.5 5.5
0.5 6.0
0.5 6.5
0.5 7.0
1.0 0.0
1.0 0.5
1.0 1.0
1.0 1.5
1.0 2.0
1.0 2.5
1.0 3.0
1.0 3.5
1.0 4.0
1.0 4.5
1.0 5.0
1.0 5.5
1.0 6.0
1.0 6.5
1.0 7.0
1.5 0.0
1.5 0.5
1.5 1.0
1.5 1.5
1.5 2.0
1.5 2.5
1.5 3.0
1.5 3.5
1.5 4.0
1.5 4.5
1.5 5.0
1.5 5.5
1.5 6.0
1.5 6.5
1.5 7.0
2.0 0.0
2.0 0.5
2.0 1.0
2.0 1.5
2.0 2.0
2.0 2.5
2.0 3.0
2.0 3.5
2.0 4.0
2.0 4.5
2.0 5.0
2.0 5.5
2.0 6.0
2.0 6.5
2.0 7.0
2.5 0.0
2.5 0.5
2.5 1.0
2.5 1.5
2.5 2.0
2.5 2.5
2.5 3.0
2.5 3.5
2.5 4.0
2.5 4.5
2.5 5.0
2.5 5.5
2.5 6.0
2.5 6.5
2.5 7.0
3.0 0.0
3.0 0.5
3.0 1.0
3.0 1.5
3.0 2.0
3.0 2.5
3.0 3.0
3.0 3.5
3.0 4.0
3.0 4.5
3.0 5.0
3.0 5.5
3.0 6.0
3.0 6.5
3.0 7.0
3.5 0.0
3.5 0.5
3.5 1.0
3.5 1.5
3.5 2.0
3.5 2.5
3.5 3.0
3.5 3.5
3.5 4.0
3.5 4.5
3.5 5.0
3.5 5.5
3.5 6.0
3.5 6.5
3.5 7.0
4.0 0.0
4.0 0.5
4.0 1.0
4.0 1.5
4.0 2.0
4.0 2.5
4.0 3.0
4.0 3.5
4.0 4.0
4.0 4.5
4.0 5.0
4.0 5.5
4.0 6.0
4.0 6.5
4.0 7.0
4.5 0.0
4.5 0.5
4.5 1.0
4.5 1.5
4.5 2.0
4.5 2.5
4.5 3.0
4.5 3.5
4.5 4.0
4.5 4.5
4.5 5.0
4.5 5.5
4.5 6.0
4.5 6.5
4.5 7.0
5.0 0.0
5.0 0.5
5.0 1.0
5.0 1.5
5.0 2.0
5.0 2.5
5.0 3.0
5.0 3.5
5.0 4.0
5.0 4.5
5.0 5.0
5.0 5.5
5.0 6.0
5.0 6.5
5.0 7.0
5.5 0.0
5.5 0.5
5.5 1.0
5.5 1.5
5.5 2.0
5.5 2.5
5.5 3.0
5.5 3.5
5.5 4.0
5.5 4.5
5.5 5.0
5.5 5.5
5.5 6.0
5.5 6.5
5.5 7.0
6.0 0.0
6.0 0.5
6.0 1.0
6.0 1.5
6.0 2.0
6.0 2.5
6.0 3.0
6.0 3.5
6.0 4.0
6.0 4.5
6.0 5.0
6.0 5.5
6.0 6.0
6.0 6.5
6.0 7.0
6.5 0.0
6.5 0.5
6.5 1.0
6.5 1.5
6.5 2.0
6.5 2.5
6.5 3.0
6.5 3.5
6.5 4.0
6.5 4.5
6.5 5.0
6.5 5.5
6.5 6.0
6.5 6.5
6.5 7.0
7.0 0.0
7.0 0.5
7.0 1.0
7.0 1.5
7.0 2.0
7.0 2.5
7.0 3.0
7.0 3.5
7.0 4.0
7.0 4.5
7.0 5.0
7.0 5.5
7.0 6.0
7.0 6.5
7.0 7.0
7.5 0.0
7.5 0.5
7.5 1.0
7.5 1.5
7.5 2.0
7.5 2.5
7.5 3.0
7.5 3.5
7.5 4.0
7.5 4.5
7.5 5.0
7.5 5.5
7.5 6.0
7.5 6.5
7.5 7.0
8.0 0.0
8.0 0.5
8.0 1.0
8.0 1.5
8.0 2.0
8.0 2.5
8.0 3.0
8.0 3.5
8.0 4.0
8.0 4.5
8.0 5.0
8.0 5.5
8.0 6.0
8.0 6.5
8.0 7.0
8.5 0.0
8.5 0.5
8.5 1.0
8.5 1.5
8.5 2.0
8.5 2.5
8.5 3.0
8.5 3.5
8.5 4.0
8.5 4.5
8.5 5.0
8.5 5.5
8.5 6.0
8.5 6.5
8.5 7.0
9.0 0.0
9.0 0.5
9.0 1.0
9.0 1.5
9.0 2.0
9.0 2.5
9.0 3.0
9.0 3.5
9.0 4.0
9.0 4.5
9.0 5.0
9.0 5.5
9.0 6.0
9.0 6.5
9.0 7.0
9.5 0.0
9.5 0.5
9.5 1.0
9.5 1.5
9.5 2.0
9.5 2.5
9.5 3.0
9.5 3.5
9.5 4.0
9.5 4.5
9.5 5.0
9.5 5.5
9.5 6.0
9.5 6.5
9.5 7.0
10.0 0.0
10.0 0.5
10.0 1.0
10.0 1.5
10.0 2.0
10.0 2.5
10.0 3.0
10.0 3.5
10.0 4.0
10.0 4.5
10.0 5.0
10.0 5.5
10.0 6.0
10.0 6.5
10.0 7.0
10.5 0.0
10.5 0.5
10.5 1.0
10.5 1.5
10.5 2.0
10.5 2.5
10.5 3.0
10.5 3.5
10.5 4.0
10.5 4.5
10.5 5.0
10.5 5.5
10.5 6.0
10.5 6.5
10.5 7.0
11.0 0.0
11.0 0.5
11.0 1.0
11.0 1.5
11.0 2.0
11.0 2.5
11.0 3.0
11.0 3.5
11.0 4.0
11.0 4.5
11.0 5.0
11.0 5.5
11.0 6.0
11.0 6.5
11.0 7.0
11.5 0.0
11.5 0.5
11.5 1.0
11.5 1.5
11.5 2.0
11.5 2.5
11.5 3.0
11.5 3.5
11.5 4.0
11.5 4.5
11.5 5.0
11.5 5.5
11.5 6.0
11.5 6.5
11.5 7.0
12.0 0.0
12.0 0.5
12.0 1.0
12.0 1.5
12.0 2.0
12.0 2.5
12.0 3.0
12.0 3.5
12.0 4.0
12.0 4.5
12.0 5.0
12.0 5.5
12.0 6.0
12.0 6.5
12.0 7.0
12.5 0.0
12.5 0.5
12.5 1.0
12.5 1.5
12.5 2.0
12.5 2.5
12.5 3.0
12.5 3.5
12.5 4.0
12.5 4.5
12.5 5.0
12.5 5.5
12.5 6.0
12.5 6.5
12.5 7.0
13.0 0.0
13.0 0.5
13.0 1.0
13.0 1.5
13.0 2.0
13.0 2.5
13.0 3.0
13.0 3.5
13.0 4.0
13.0 4.5
13.0 5.0
13.0 5.5
13.0 6.0
13.0 6.5
13.0 7.0
13.5 0.0
13.5 0.5
13.5 1.0
13.5 1.5
13.5 2.0
13.5 2.5
13.5 3.0
13.5 3.5
13.5 4.0
13.5 4.5
13.5 5.0
13.5 5.5
13.5 6.0
13.5 6.5
13.5 7.0
14.0 0.0
14.0 0.5
14.0 1.0
14.0 1.5
14.0 2.0
14.0 2.5
14.0 3.0
14.0 3.5
14.0 4.0
14.0 4.5
14.0 5.0
14.0 5.5
14.0 6.0
14.0 6.5
14.0 7.0
14.5 0.0
14.5 0.5
14.5 1.0
14.5 1.5
14.5 2.0
14.5 2.5
14.5 3.0
14.5 3.5
14.5 4.0
14.5 4.5
14.5 5.0
14.5 5.5
14.5 6.0
14.5 6.5
14.5 7.0
15.0 0.0
15.0 0.5
15.0 1.0
15.0 1.5
15.0 2.0
15.0 2.5
15.0 3.0
15.0 3.5
15.0 4.0
15.0 4.5
15.0 5.0
15.0 5.5
15.0 6.0
15.0 6.5
15.0 7.0
15.5 0.0
15.5 0.5
15.5 1.0
15.5 1.5
15.5 2.0
15.5 2.5
15.5 3.0
15.5 3.5
15.5 4.0
15.5 4.5
15.5 5.0
15.5 5.5
15.5 6.0
15.5 6.5
15.5 7.0
16.0 0.0
16.0 0.5
16.0 1.0
16.0 1.5
16.0 2.0
16.0 2.5
16.0 3.0
16.0 3.5
16.0 4.0
16.0 4.5
16.0 5.0
16.0 5.5
16.0 6.0
16.0 6.5
16.0 7.0
16.5 0.0
16.5 0.5
16.5 1.0
16.5 1.5
16.5 2.0
16.5 2.5
16.5 3.0
16.5 3.5
16.5 4.0
16.5 4.5
16.5 5.0
16.5 5.5
16.5 6.0
16.5 6.5
16.5 7.0
17.0 0.0
17.0 0.5
17.0 1.0
17.0 1.5
17.0 2.0
17.0 2.5
17.0 3.0
17.0 3.5
17.0 4.0
17.0 4.5
17.0 5.0
17.0 5.5
17.0 6.0
17.0 6.5
17.0 7.0
17.5 0.0
17.5 0.5
17.5 1.0
17.5 1.5
17.5 2.0
17.5 2.5
17.5 3.0
17.5 3.5
17.5 4.0
17.5 4.5
17.5 5.0
17.5 5.5
17.5 6.0
17.5 6.5
17.5 7.0
18.0 0.0
18.0 0.5
18.0 1.0
18.0 1.5
18.0 2.0
18.0 2.5
18.0 3.0
18.0 3.5
18.0 4.0
18.0 4.5
18.0 5.0
18.0 5.5
18.0 6.0
18.0 6.5
18.0 7.0
18.5 0.0
18.5 0.5
18.5 1.0
18.5 1.5
18.5 2.0
18.5 2.5
18.5 3.0
18.5 3.5
18.5 4.0
18.5 4.5
18.5 5.0
18.5 5.5
18.5 6.0
18.5 6.5
18.5 7.0
19.0 0.0
19.0 0.5
19.0 1.0
19.0 1.5
19.0 2.0
19.0 2.5
19.0 3.0
19.0 3.5
19.0 4.0
19.0 4.5
19.0 5.0
19.0 5.5
19.0 6.0
19.0 6.5
19.0 7.0
19.5 0.0
19.5 0.5
19.5 1.0
19.5 1.5
19.5 2.0
19.5 2.5
19.5 3.0
19.5 3.5
19.5 4.0
19.5 4.5
19.5 5.0
19.5 5.5
19.5 6.0
19.5 6.5
19.5 7.0
20.0 0.0
20.0 0.5
20.0 1.0
20.0 1.5
20.0 2.0
20.0 2.5
20.0 3.0
20.0 3.5
20.0 4.0
20.0 4.5
20.0 5.0
20.0 5.5
20.0 6.0
20.0 6.5
20.0 7.0
CELLS:
4 0 0 15 16 1
4 0 1 16 17 2
4 0 2 17 18 3
4 0 3 18 19 4
4 0 4 19 20 5
4 0 5 20 21 6
4 0 6 21 22 7
4 0 7 22 23 8
4 0 8 23 24 9
4 0 9 24 25 10
4 0 10 25 26 11
4 0 11 26 27 12
4 0 12 27 28 13
4 0 13 28 29 14
4 0 15 30 31 16
4 0 16 31 32 17
4 0 17 32 33 18
4 0 18 33 34 19
4 0 19 34 35 20
4 0 20 35 36 21
4 0 21 36 37 22
4 0 22 37 38 23
4 0 23 38 39 24
4 0 24 39 40 25
4 0 25 40 41 26
4 0 26 41 42 27
4 0 27 42 43 28
4 0 28 43 44 29
4 0 30 45 46 31
4 0 31 46 47 32
4 0 32 47 48 33
4 0 33 48 49 34
4 0 34 49 50 35
4 0 35 50 51 36
4 0 36 51 52 37
4 0 37 52 53 38
4 0 38 53 54 39
4 0 39 54 55 40
4 0 40 55 56 41
4 0 41 56 57 42
4 0 42 57 58 43
4 0 43 58 59 44
4 0 45 60 61 46
4 0 46 61 62 47
4 0 47 62 63 48
4 0 48 63 64 49
4 0 49 64 65 50
4 0 50 65 66 51
4 0 51 66 67 52
4 0 52 67 68 53
4 0 53 68 69 54
4 0 54 69 70 55
4 0 55 70 71 56
4 0 56 71 72 57
4 0 57 72 73 58
4 0 58 73 74 59
4 0 60 75 76 61
4 0 61 76 77 62
4 0 62 77 78 63
4 0 63 78 79 64
4 0 64 79 80 65
4 0 65 80 81 66
4 0 66 81 82 67
4 0 67 82 83 68
4 0 68 83 84 69
4 0 69 84 85 70
4 0 70 85 86 71
4 0 71 86 87 72
4 0 72 87 88 73
4 0 73 88 89 74
4 0 75 90 91 76
4 0 76 91 92 77
4 0 77 92 93 78
4 0 78 93 94 79
4 0 79 94 95 80
4 0 80 95 96 81
4 0 81 96 97 82
4 0 82 97 98 83
4 0 83 98 99 84
4 0 84 99 100 85
4 0 85 100 101 86
4 0 86 101 102 87
4 0 87 102 103 88
4 0 88 103 104 89
4 0 90 105 106 91
4 0 91 106 107 92
4 0 92 107 108 93
4 0 93 108 109 94
4 0 94 109 110 95
4 0 95 110 111 96
4 0 96 111 112 97
4 0 97 112 113 98
4 0 98 113 114 99
4 0 99 114 115 100
4 0 100 115 116 101
4 0 101 116 117 102
4 0 102 117 118 103
4 0 103 118 119 104
4 0 105 120 121 106
4 0 106 121 122 107
4 0 107 122 123 108
4 0 108 123 124 109
4 0 109 124 125 110
4 0 110 125 126 111
4 0 111 126 127 112
4 0 112 127 128 113
4 0 113 128 129 114
4 0 114 129 130 115
4 0 115 130 131 116
4 0 116 131 132 117
4 0 117 132 133 118
4 0 118 133 134 119
4 0 120 135 136 121
4 0 121 136 137 122
4 0 122 137 138 123
4 0 123 138 139 124
4 0 124 139 140 125
4 0 125 140 141 126
4 0 126 141 142 127
4 0 127 142 143 128
4 0 128 143 144 129
4 0 129 144 145 130
4 0 130 145 146 131
4 0 131 146 147 132
4 0 132 147 148 133
4 0 133 148 149 134
4 0 135 150 151 136
4 0 136 151 152 137
4 0 137 152 153 138
4 0 138 153 154 139
4 0 139 154 155 140
4 0 140 155 156 141
4 0 141 156 157 142
4 0 142 157 158 143
4 0 143 158 159 144
4 0 144 159 160 145
4 0 145 160 161 146
4 0 146 161 162 147
4 0 147 162 163 148
4 0 148 163 164 149
4 0 150 165 166 151
4 0 151 166 167 152
4 0 152 167 168 153
4 0 153 168 169 154
4 0 154 169 170 155
4 0 155 170 171 156
4 0 156 171 172 157
4 0 157 172 173 158
4 0 158 173 174 159
4 0 159 174 175 160
4 0 160 175 176 161
4 0 161 176 177 162
4 0 162 177 178 163
4 0 163 178 179 164
4 0 165 180 181 166
4 0 166 181 182 167
4 0 167 182 183 168
4 0 168 183 184 169
4 0 169 184 185 170
4 0 170 185 186 171
4 0 171 186 187 172
4 0 172 187 188 173
4 0 173 188 189 174
4 0 174 189 190 175
4 0 175 190 191 176
4 0 176 191 192 177
4 0 177 192 193 178
4 0 178 193 194 179
4 0 180 195 196 181
4 0 181 196 197 182
4 0 182 197 198 183
4 0 183 198 199 184
4 0 184 199 200 185
4 0 185 200 201 186
4 0 186 201 202 187
4 0 187 202 203 188
4 0 188 203 204 189
4 0 189 204 205 190
4 0 190 205 206 191
4 0 191 206 207 192
4 0 192 207 208 193
4 0 193 208 209 194
4 0 195 210 211 196
4 0 196 211 212 197
4 0 197 212 213 198
4 0 198 213 214 199
4 0 199 214 215 200
4 0 200 215 216 201
4 0 201 216 217 202
4 0 202 217 218 203
4 0 203 218 219 204
4 0 204 219 220 205
4 0 205 220 221 206
4 0 206 221 222 207
4 0 207 222 223 208
4 0 208 223 224 209
4 0 210 225 226 211
4 0 211 226 227 212
4 0 212 227 228 213
4 0 213 228 229 214
4 0 214 229 230 215
4 0 215 230 231 216
4 0 216 231 232 217
4 0 217 232 233 218
4 0 218 233 234 219
4 0 219 234 235 220
4 0 220 235 236 221
4 0 221 236 237 222
4 0 222 237 238 223
4 0 223 238 239 224
4 0 225 240 241 226
4 0 226 241 242 227
4 0 227 242 243 228
4 0 228 243 244 229
4 0 229 244 245 230
4 0 230 245 246 231
4 0 231 246 247 232
4 0 232 247 248 233
4 0 233 248 249 234
4 0 234 249 250 235
4 0 235 250 251 236
4 0 236 251 252 237
4 0 237 252 253 238
4 0 238 253 254 239
4 0 240 255 256 241
4 0 241 256 257 242
4 0 242 257 258 243
4 0 243 258 259 244
4 0 244 259 260 245
4 0 245 260 261 246
4 0 246 261 262 247
4 0 247 262 263 248
4 0 248 263 264 249
4 0 249 264 265 250
4 0 250 265 266 251
4 0 251 266 267 252
4 0 252 267 268 253
4 0 253 268 269 254
4 0 255 270 271 256
4 0 256 271 272 257
4 0 257 272 273 258
4 0 258 273 274 259
4 0 259 274 275 260
4 0 260 275 276 261
4 0 261 276 277 262
4 0 262 277 278 263
4 0 263 278 279 264
4 0 264 279 280 265
4 0 265 280 281 266
4 0 266 281 282 267
4 0 267 282 283 268
4 0 268 283 284 269
4 0 270 285 286 271
4 0 271 286 287 272
4 0 272 287 288 273
4 0 273 288 289 274
4 0 274 289 290 275
4 0 275 290 291 276
4 0 276 291 292 277
4 0 277 292 293 278
4 0 278 293 294 279
4 0 279 294 295 280
4 0 280 295 296 281
4 0 281 296 297 282
4 0 282 297 298 283
4 0 283 298 299 284
4 0 285 300 301 286
4 0 286 301 302 287
4 0 287 302 303 288
4 0 288 303 304 289
4 0 289 304 305 290
4 0 290 305 306 291
4 0 291 306 307 292
4 0 292 307 308 293
4 0 293 308 309 294
4 0 294 309 310 295
4 0 295 310 311 296
4 0 296 311 312 297
4 0 297 312 313 298
4 0 298 313 314 299
4 0 300 315 316 301
4 0 301 316 317 302
4 0 302 317 318 303
4 0 303 318 319 304
4 0 304 319 320 305
4 0 305 320 321 306
4 0 306 321 322 307
4 0 307 322 323 308
4 0 308 323 324 309
4 0 309 324 325 310
4 0 310 325 326 311
4 0 311 326 327 312
4 0 312 327 328 313
4 0 313 328 329 314
4 0 315 330 331 316
4 0 316 331 332 317
4 0 317 332 333 318
4 0 318 333 334 319
4 0 319 334 335 320
4 0 320 335 336 321
4 0 321 336 337 322
4 0 322 337 338 323
4 0 323 338 339 324
4 0 324 339 340 325
4 0 325 340 341 326
4 0 326 341 342 327
4 0 327 342 343 328
4 0 328 343 344 329
4 0 330 345 346 331
4 0 331 346 347 332
4 0 332 347 348 333
4 0 333 348 349 334
4 0 334 349 350 335
4 0 335 350 351 336
4 0 336 351 352 337
4 0 337 352 353 338
4 0 338 353 354 339
4 0 339 354 355 340
4 0 340 355 356 341
4 0 341 356 357 342
4 0 342 357 358 343
4 0 343 358 359 344
4 0 345 360 361 346
4 0 346 361 362 347
4 0 347 362 363 348
4 0 348 363 364 349
4 0 349 364 365 350
4 0 350 365 366 351
4 0 351 366 367 352
4 0 352 367 368 353
4 0 353 368 369 354
4 0 354 369 370 355
4 0 355 370 371 356
4 0 356 371 372 357
4 0 357 372 373 358
4 0 358 373 374 359
4 0 360 375 376 361
4 0 361 376 377 362
4 0 362 377 378 363
4 0 363 378 379 364
4 0 364 379 380 365
4 0 365 380 381 366
4 0 366 381 382 367
4 0 367 382 383 368
4 0 368 383 384 369
4 0 369 384 385 370
4 0 370 385 386 371
4 0 371 386 387 372
4 0 372 387 388 373
4 0 373 388 389 374
4 0 375 390 391 376
4 0 376 391 392 377
4 0 377 392 393 378
4 0 378 393 394 379
4 0 379 394 395 380
4 0 380 395 396 381
4 0 381 396 397 382
4 0 382 397 398 383
4 0 383 398 399 384
4 0 384 399 400 385
4 0 385 400 401 386
4 0 386 401 402 387
4 0 387 402 403 388
4 0 388 403 404 389
4 0 390 405 406 391
4 0 391 406 407 392
4 0 392 407 408 393
4 0 393 408 409 394
4 0 394 409 410 395
4 0 395 410 411 396
4 0 396 411 412 397
4 0 397 412 413 398
4 0 398 413 414 399
4 0 399 414 415 400
4 0 400 415 416 401
4 0 401 416 417 402
4 0 402 417 418 403
4 0 403 418 419 404
4 0 405 420 421 406
4 0 406 421 422 407
4 0 407 422 423 408
4 0 408 423 424 409
4 0 409 424 425 410
4 0 410 425 426 411
4 0 411 426 427 412
4 0 412 427 428 413
4 0 413 428 429 414
4 0 414 429 430 415
4 0 415 430 431 416
4 0 416 431 432 417
4 0 417 432 433 418
4 0 418 433 434 419
4 0 420 435 436 421
4 0 421 436 437 422
4 0 422 437 438 423
4 0 423 438 439 424
4 0 424 439 440 425
4 0 425 440 441 426
4 0 426 441 442 427
4 0 427 442 443 428
4 0 428 443 444 429
4 0 429 444 445 430
4 0 430 445 446 431
4 0 431 446 447 432
4 0 432 447 448 433
4 0 433 448 449 434
4 0 435 450 451 436
4 0 436 451 452 437
4 0 437 452 453 438
4 0 438 453 454 439
4 0 439 454 455 440
4 0 440 455 456 441
4 0 441 456 457 442
4 0 442 457 458 443
4 0 443 458 459 444
4 0 444 459 460 445
4 0 445 460 461 446
4 0 446 461 462 447
4 0 447 462 463 448
4 0 448 463 464 449
4 0 450 465 466 451
4 0 451 466 467 452
4 0 452 467 468 453
4 0 453 468 469 454
4 0 454 469 470 455
4 0 455 470 471 456
4 0 456 471 472 457
4 0 457 472 473 458
4 0 458 473 474 459
4 0 459 474 475 460
4 0 460 475 476 461
4 0 461 476 477 462
4 0 462 477 478 463
4 0 463 478 479 464
4 0 465 480 481 466
4 0 466 481 482 467
4 0 467 482 483 468
4 0 468 483 484 469
4 0 469 484 485 470
4 0 470 485 486 471
4 0 471 486 487 472
4 0 472 487 488 473
4 0 473 488 489 474
4 0 474 489 490 475
4 0 475 490 491 476
4 0 476 491 492 477
4 0 477 492 493 478
4 0 478 493 494 479
4 0 480 495 496 481
4 0 481 496 497 482
4 0 482 497 498 483
4 0 483 498 499 484
4 0 484 499 500 485
4 0 485 500 501 486
4 0 486 501 502 487
4 0 487 502 503 488
4 0 488 503 504 489
4 0 489 504 505 490
4 0 490 505 506 491
4 0 491 506 507 492
4 0 492 507 508 493
4 0 493 508 509 494
4 0 495 510 511 496
4 0 496 511 512 497
4 0 497 512 513 498
4 0 498 513 514 499
4 0 499 514 515 500
4 0 500 515 516 501
4 0 501 516 517 502
4 0 502 517 518 503
4 0 503 518 519 504
4 0 504 519 520 505
4 0 505 520 521 506
4 0 506 521 522 507
4 0 507 522 523 508
4 0 508 523 524 509
4 0 510 525 526 511
4 0 511 526 527 512
4 0 512 527 528 513
4 0 513 528 529 514
4 0 514 529 530 515
4 0 515 530 531 516
4 0 516 531 532 517
4 0 517 532 533 518
4 0 518 533 534 519
4 0 519 534 535 520
4 0 520 535 536 521
4 0 521 536 537 522
4 0 522 537 538 523
4 0 523 538 539 524
4 0 525 540 541 526
4 0 526 541 542 527
4 0 527 542 543 528
4 0 528 543 544 529
4 0 529 544 545 530
4 0 530 545 546 531
4 0 531 546 547 532
4 0 532 547 548 533
4 0 533 548 549 534
4 0 534 549 550 535
4 0 535 550 551 536
4 0 536 551 552 537
4 0 537 552 553 538
4 0 538 553 554 539
4 0 540 555 556 541
4 0 541 556 557 542
4 0 542 557 558 543
4 0 543 558 559 544
4 0 544 559 560 545
4 0 545 560 561 546
4 0 546 561 562 547
4 0 547 562 563 548
4 0 548 563 564 549
4 0 549 564 565 550
4 0 550 565 566 551
4 0 551 566 567 552
4 0 552 567 568 553
4 0 553 568 569 554
4 0 555 570 571 556
4 0 556 571 572 557
4 0 557 572 573 558
4 0 558 573 574 559
4 0 559 574 575 560
4 0 560 575 576 561
4 0 561 576 577 562
4 0 562 577 578 563
4 0 563 578 579 564
4 0 564 579 580 565
4 0 565 580 581 566
4 0 566 581 582 567
4 0 567 582 583 568
4 0 568 583 584 569
4 0 570 585 586 571
4 0 571 586 587 572
4 0 572 587 588 573
4 0 573 588 589 574
4 0 574 589 590 575
4 0 575 590 591 576
4 0 576 591 592 577
4 0 577 592 593 578
4 0 578 593 594 579
4 0 579 594 595 580
4 0 580 595 596 581
4 0 581 596 597 582
4 0 582 597 598 583
4 0 583 598 599 584
4 0 585 600 601 586
4 0 586 601 602 587
4 0 587 602 603 588
4 0 588 603 604 589
4 0 589 604 605 590
4 0 590 605 606 591
4 0 591 606 607 592
4 0 592 607 608 593
4 0 593 608 609 594
4 0 594 609 610 595
4 0 595 610 611 596
4 0 596 611 612 597
4 0 597 612 613 598
4 0 598 613 614 599
FACES:
VDATA:
3 0.0 0.002 20
3 0.0 0.002 20
3 0.0 0.002 20
3 0.0 0.002 20
3 -10.0 0.0 0.0
3 -10.0 0.0 0.0
3 -10.0 0.0 0.0
3 -10.0 0.0 0.0
3 -10.0 0.0 0.0
3 -10.0 0.0 0.0
3 -10.0 0.0 0.0
3 -10.0 0.0 0.0
3 -10.0 0.0 0.0
3 -10.0 0.0 0.0
3 -10.0 0.0 0.0
3 0.0 0.002 20
3 0.0 0.002 20
3 0.0 0.002 20
3 0.0 0.002 20
3 -10.0 0.0 0.0
3 -10.0 0.0 0.0
3 -10.0 0.0 0.0
3 -10.0 0.0 0.0
3 -10.0 0.0 0.0
3 -10.0 0.0 0.0
3 -10.0 0.0 0.0
3 -10.0 0.0 0.0
3 -10.0 0.0 0.0
3 -10.0 0.0 0.0
3 -10.0 0.0 0.0
3 0.0 0.002 20
3 0.0 0.002 20
3 0.0 0.002 20
3 0.0 0.002 20
3 -10.0 0.0 0.0
3 -10.0 0.0 0.0
3 -10.0 0.0 0.0
3 -10.0 0.0 0.0
3 -10.0 0.0 0.0
3 -10.0 0.0 0.0
3 -10.0 0.0 0.0
3 -10.0 0.0 0.0
3 -10.0 0.0 0.0
3 -10.0 0.0 0.0
3 -10.0 0.0 0.0
3 0.0 0.002 20
3 0.0 0.002 20
3 0.0 0.002 20
3 0.0 0.002 20
3 -10.0 0.0 0.0
3 -10.0 0.0 0.0
3 -10.0 0.0 0.0
3 -10.0 0.0 0.0
3 -10.0 0.0 0.0
3 -10.0 0.0 0.0
3 -10.0 0.0 0.0
3 -10.0 0.0 0.0
3 -10.0 0.0 0.0
3 -10.0 0.0 0.0
3 -10.0 0.0 0.0
3 -10.0 0.0 0.0
3 -10.0 0.0 0.0
3 -10.0 0.0 0.0
3 -10.0 0.0 0.0
3 -10.0 0.0 0.0
3 -10.0 0.0 0.0
3 -10.0 0.0 0.0
3 -10.0 0.0 0.0
3 -10.0 0.0 0.0
3 -10.0 0.0 0.0
3 -10.0 0.0 0.0
3 -10.0 0.0 0.0
3 -10.0 0.0 0.0
3 -10.0 0.0 0.0
3 -10.0 0.0 0.0
3 -10.0 0.0 0.0
3 -10.0 0.0 0.0
3 -10.0 0.0 0.0
3 -10.0 0.0 0.0
3 -10.0 0.0 0.0
3 -10.0 0.0 0.0
3 -10.0 0.0 0.0
3 -10.0 0.0 0.0
3 -10.0 0.0 0.0
3 -10.0 0.0 0.0
3 -10.0 0.0 0.0
3 -10.0 0.0 0.0
3 -10.0 0.0 0.0
3 -10.0 0.0 0.0
3 -10.0 0.0 0.0
3 -10.0 0.0 0.0
3 -10.0 0.0 0.0
3 -10.0 0.0 0.0
3 -10.0 0.0 0.0
3 -10.0 0.0 0.0
3 -10.0 0.0 0.0
3 -10.0 0.0 0.0
3 -10.0 0.0 0.0
3 -10.0 0.0 0.0
3 -10.0 0.0 0.0
3 -10.0 0.0 0.0
3 -10.0 0.0 0.0
3 -10.0 0.0 0.0
3 -10.0 0.0 0.0
3 -10.0 0.0 0.0
3 -10.0 0.0 0.0
3 -10.0 0.0 0.0
3 -10.0 0.0 0.0
3 -10.0 0.0 0.0
3 -10.0 0.0 0.0
3 -10.0 0.0 0.0
3 -10.0 0.0 0.0
3 -10.0 0.0 0.0
3 -10.0 0.0 0.0
3 -10.0 0.0 0.0
3 -10.0 0.0 0.0
3 -10.0 0.0 0.0
3 -10.0 0.0 0.0
3 -10.0 0.0 0.0
3 -10.0 0.0 0.0
3 -10.0 0.0 0.0
3 -10.0 0.0 0.0
3 -10.0 0.0 0.0
3 -10.0 0.0 0.0
3 -10.0 0.0 0.0
3 -10.0 0.0 0.0
3 -10.0 0.0 0.0
3 -10.0 0.0 0.0
3 -10.0 0.0 0.0
3 -10.0 0.0 0.0
3 -10.0 0.0 0.0
3 -10.0 0.0 0.0
3 -10.0 0.0 0.0
3 -10.0 0.0 0.0
3 -10.0 0.0 0.0
3 -10.0 0.0 0.0
3 -10.0 0.0 0.0
3 -10.0 0.0 0.0
3 -10.0 0.0 0.0
3 -10.0 0.0 0.0
3 -10.0 0.0 0.0
3 -10.0 0.0 0.0
3 -10.0 0.0 0.0
3 -10.0 0.0 0.0
3 -10.0 0.0 0.0
3 -10.0 0.0 0.0
3 -10.0 0.0 0.0
3 -10.0 0.0 0.0
3 -10.0 0.0 0.0
3 -10.0 0.0 0.0
3 -10.0 0.0 0.0
3 -10.0 0.0 0.0
3 -10.0 0.0 0.0
3 -10.0 0.0 0.0
3 -10.0 0.0 0.0
3 -10.0 0.0 0.0
3 -10.0 0.0 0.0
3 -10.0 0.0 0.0
3 -10.0 0.0 0.0
3 -10.0 0.0 0.0
3 -10.0 0.0 0.0
3 -10.0 0.0 0.0
3 -10.0 0.0 0.0
3 -10.0 0.0 0.0
3 -10.0 0.0 0.0
3 -10.0 0.0 0.0
3 -10.0 0.0 0.0
3 -10.0 0.0 0.0
3 -10.0 0.0 0.0
3 -10.0 0.0 0.0
3 -10.0 0.0 0.0
3 -10.0 0.0 0.0
3 -10.0 0.0 0.0
3 -10.0 0.0 0.0
3 -10.0 0.0 0.0
3 -10.0 0.0 0.0
3 -10.0 0.0 0.0
3 -10.0 0.0 0.0
3 -10.0 0.0 0.0
3 -10.0 0.0 0.0
3 -10.0 0.0 0.0
3 -10.0 0.0 0.0
3 -10.0 0.0 0.0
3 -10.0 0.0 0.0
3 -10.0 0.0 0.0
3 -10.0 0.0 0.0
3 -10.0 0.0 0.0
3 -10.0 0.0 0.0
3 -10.0 0.0 0.0
3 -10.0 0.0 0.0
3 -10.0 0.0 0.0
3 -10.0 0.0 0.0
3 -10.0 0.0 0.0
3 -10.0 0.0 0.0
3 -10.0 0.0 0.0
3 -10.0 0.0 0.0
3 -10.0 0.0 0.0
3 -10.0 0.0 0.0
3 -10.0 0.0 0.0
3 -10.0 0.0 0.0
3 -10.0 0.0 0.0
3 -10.0 0.0 0.0
3 -10.0 0.0 0.0
3 -10.0 0.0 0.0
3 -10.0 0.0 0.0
3 -10.0 0.0 0.0
3 -10.0 0.0 0.0
3 -10.0 0.0 0.0
3 -10.0 0.0 0.0
3 -10.0 0.0 0.0
3 -10.0 0.0 0.0
3 -10.0 0.0 0.0
3 -10.0 0.0 0.0
3 -10.0 0.0 0.0
3 -10.0 0.0 0.0
3 -10.0 0.0 0.0
3 -10.0 0.0 0.0
3 -10.0 0.0 0.0
3 -10.0 0.0 0.0
3 -10.0 0.0 0.0
3 -10.0 0.0 0.0
3 -10.0 0.0 0.0
3 -10.0 0.0 0.0
3 -10.0 0.0 0.0
3 -10.0 0.0 0.0
3 -10.0 0.0 0.0
3 -10.0 0.0 0.0
3 -10.0 0.0 0.0
3 -10.0 0.0 0.0
3 -10.0 0.0 0.0
3 -10.0 0.0 0.0
3 -10.0 0.0 0.0
3 -10.0 0.0 0.0
3 -10.0 0.0 0.0
3 -10.0 0.0 0.0
3 -10.0 0.0 0.0
3 -10.0 0.0 0.0
3 -10.0 0.0 0.0
3 -10.0 0.0 0.0
3 -10.0 0.0 0.0
3 -10.0 0.0 0.0
3 -10.0 0.0 0.0
3 -10.0 0.0 0.0
3 -10.0 0.0 0.0
3 -10.0 0.0 0.0
3 -10.0 0.0 0.0
3 -10.0 0.0 0.0
3 -10.0 0.0 0.0
3 -10.0 0.0 0.0
3 -10.0 0.0 0.0
3 -10.0 0.0 0.0
3 -10.0 0.0 0.0
3 -10.0 0.0 0.0
3 -10.0 0.0 0.0
3 -10.0 0.0 0.0
3 -10.0 0.0 0.0
3 -10.0 0.0 0.0
3 -10.0 0.0 0.0
3 -10.0 0.0 0.0
3 -10.0 0.0 0.0
3 -10.0 0.0 0.0
3 -10.0 0.0 0.0
3 -10.0 0.0 0.0
3 -10.0 0.0 0.0
3 -10.0 0.0 0.0
3 -10.0 0.0 0.0
3 -10.0 0.0 0.0
3 -10.0 0.0 0.0
3 -10.0 0.0 0.0
3 -10.0 0.0 0.0
3 -10.0 0.0 0.0
3 -10.0 0.0 0.0
3 -10.0 0.0 0.0
3 -10.0 0.0 0.0
3 -10.0 0.0 0.0
3 -10.0 0.0 0.0
3 -10.0 0.0 0.0
3 -10.0 0.0 0.0
3 -10.0 0.0 0.0
3 -10.0 0.0 0.0
3 -10.0 0.0 0.0
3 -10.0 0.0 0.0
3 -10.0 0.0 0.0
3 -10.0 0.0 0.0
3 -10.0 0.0 0.0
3 -10.0 0.0 0.0
3 -10.0 0.0 0.0
3 -10.0 0.0 0.0
3 -10.0 0.0 0.0
3 -10.0 0.0 0.0
3 -10.0 0.0 0.0
3 -10.0 0.0 0.0
3 -10.0 0.0 0.0
3 -10.0 0.0 0.0
3 -10.0 0.0 0.0
3 -10.0 0.0 0.0
3 -10.0 0.0 0.0
3 -10.0 0.0 0.0
3 -10.0 0.0 0.0
3 -10.0 0.0 0.0
3 -10.0 0.0 0.0
3 -10.0 0.0 0.0
3 -10.0 0.0 0.0
3 -10.0 0.0 0.0
3 -10.0 0.0 0.0
3 -10.0 0.0 0.0
3 -10.0 0.0 0.0
3 -10.0 0.0 0.0
3 -10.0 0.0 0.0
3 -10.0 0.0 0.0
3 -10.0 0.0 0.0
3 -10.0 0.0 0.0
3 -10.0 0.0 0.0
3 -10.0 0.0 0.0
3 -10.0 0.0 0.0
3 -10.0 0.0 0.0
3 -10.0 0.0 0.0
3 -10.0 0.0 0.0
3 -10.0 0.0 0.0
3 -10.0 0.0 0.0
3 -10.0 0.0 0.0
3 -10.0 0.0 0.0
3 -10.0 0.0 0.0
3 -10.0 0.0 0.0
3 -10.0 0.0 0.0
3 -10.0 0.0 0.0
3 -10.0 0.0 0.0
3 -10.0 0.0 0.0
3 -10.0 0.0 0.0
3 -10.0 0.0 0.0
3 -10.0 0.0 0.0
3 -10.0 0.0 0.0
3 -10.0 0.0 0.0
3 -10.0 0.0 0.0
3 -10.0 0.0 0.0
3 -10.0 0.0 0.0
3 -10.0 0.0 0.0
3 -10.0 0.0 0.0
3 -10.0 0.0 0.0
3 -10.0 0.0 0.0
3 -10.0 0.0 0.0
3 -10.0 0.0 0.0
3 -10.0 0.0 0.0
3 -10.0 0.0 0.0
3 -10.0 0.0 0.0
3 -10.0 0.0 0.0
3 -10.0 0.0 0.0
3 -10.0 0.0 0.0
3 -10.0 0.0 0.0
3 -10.0 0.0 0.0
3 -10.0 0.0 0.0
3 -10.0 0.0 0.0
3 -10.0 0.0 0.0
3 -10.0 0.0 0.0
3 -10.0 0.0 0.0
3 -10.0 0.0 0.0
3 -10.0 0.0 0.0
3 -10.0 0.0 0.0
3 -10.0 0.0 0.0
3 -10.0 0.0 0.0
3 -10.0 0.0 0.0
3 -10.0 0.0 0.0
3 -10.0 0.0 0.0
3 -10.0 0.0 0.0
3 -10.0 0.0 0.0
3 -10.0 0.0 0.0
3 -10.0 0.0 0.0
3 -10.0 0.0 0.0
3 -10.0 0.0 0.0
3 -10.0 0.0 0.0
3 -10.0 0.0 0.0
3 -10.0 0.0 0.0
3 -10.0 0.0 0.0
3 -10.0 0.0 0.0
3 -10.0 0.0 0.0
3 -10.0 0.0 0.0
3 -10.0 0.0 0.0
3 -10.0 0.0 0.0
3 -10.0 0.0 0.0
3 -10.0 0.0 0.0
3 -10.0 0.0 0.0
3 -10.0 0.0 0.0
3 -10.0 0.0 0.0
3 -10.0 0.0 0.0
3 -10.0 0.0 0.0
3 -10.0 0.0 0.0
3 -10.0 0.0 0.0
3 -10.0 0.0 0.0
3 -10.0 0.0 0.0
3 -10.0 0.0 0.0
3 -10.0 0.0 0.0
3 -10.0 0.0 0.0
3 -10.0 0.0 0.0
3 -10.0 0.0 0.0
3 -10.0 0.0 0.0
3 -10.0 0.0 0.0
3 -10.0 0.0 0.0
3 -10.0 0.0 0.0
3 -10.0 0.0 0.0
3 -10.0 0.0 0.0
3 -10.0 0.0 0.0
3 -10.0 0.0 0.0
3 -10.0 0.0 0.0
3 -10.0 0.0 0.0
3 -10.0 0.0 0.0
3 -10.0 0.0 0.0
3 -10.0 0.0 0.0
3 -10.0 0.0 0.0
3 -10.0 0.0 0.0
3 -10.0 0.0 0.0
3 -10.0 0.0 0.0
3 -10.0 0.0 0.0
3 -10.0 0.0 0.0
3 -10.0 0.0 0.0
3 -10.0 0.0 0.0
3 -10.0 0.0 0.0
3 -10.0 0.0 0.0
3 -10.0 0.0 0.0
3 -10.0 0.0 0.0
3 -10.0 0.0 0.0
3 -10.0 0.0 0.0
3 -10.0 0.0 0.0
3 -10.0 0.0 0.0
3 -10.0 0.0 0.0
3 -10.0 0.0 0.0
3 -10.0 0.0 0.0
3 -10.0 0.0 0.0
3 -10.0 0.0 0.0
3 -10.0 0.0 0.0
3 -10.0 0.0 0.0
3 -10.0 0.0 0.0
3 -10.0 0.0 0.0
3 -10.0 0.0 0.0
3 -10.0 0.0 0.0
3 -10.0 0.0 0.0
3 -10.0 0.0 0.0
3 -10.0 0.0 0.0
3 -10.0 0.0 0.0
3 -10.0 0.0 0.0
3 -10.0 0.0 0.0
3 -10.0 0.0 0.0
3 -10.0 0.0 0.0
3 -10.0 0.0 0.0
3 -10.0 0.0 0.0
3 -10.0 0.0 0.0
3 -10.0 0.0 0.0
3 -10.0 0.0 0.0
3 -10.0 0.0 0.0
3 -10.0 0.0 0.0
3 -10.0 0.0 0.0
3 -10.0 0.0 0.0
3 -10.0 0.0 0.0
3 -10.0 0.0 0.0
3 -10.0 0.0 0.0
3 -10.0 0.0 0.0
3 -10.0 0.0 0.0
3 -10.0 0.0 0.0
3 -10.0 0.0 0.0
3 -10.0 0.0 0.0
3 -10.0 0.0 0.0
3 -10.0 0.0 0.0
3 -10.0 0.0 0.0
3 -10.0 0.0 0.0
3 -10.0 0.0 0.0
3 -10.0 0.0 0.0
3 -10.0 0.0 0.0
3 -10.0 0.0 0.0
3 -10.0 0.0 0.0
3 -10.0 0.0 0.0
3 -10.0 0.0 0.0
3 -10.0 0.0 0.0
3 -10.0 0.0 0.0
3 -10.0 0.0 0.0
3 -10.0 0.0 0.0
3 -10.0 0.0 0.0
3 -10.0 0.0 0.0
3 -10.0 0.0 0.0
3 -10.0 0.0 0.0
3 -10.0 0.0 0.0
3 -10.0 0.0 0.0
3 -10.0 0.0 0.0
3 -10.0 0.0 0.0
3 -10.0 0.0 0.0
3 -10.0 0.0 0.0
3 -10.0 0.0 0.0
3 -10.0 0.0 0.0
3 -10.0 0.0 0.0
3 -10.0 0.0 0.0
3 -10.0 0.0 0.0
3 -10.0 0.0 0.0
3 -10.0 0.0 0.0
3 -10.0 0.0 0.0
3 -10.0 0.0 0.0
3 -10.0 0.0 0.0
3 -10.0 0.0 0.0
3 -10.0 0.0 0.0
3 -10.0 0.0 0.0
3 -10.0 0.0 0.0
3 -10.0 0.0 0.0
3 -10.0 0.0 0.0
3 -10.0 0.0 0.0
3 -10.0 0.0 0.0
3 -10.0 0.0 0.0
3 -10.0 0.0 0.0
3 -10.0 0.0 0.0
3 -10.0 0.0 0.0
3 -10.0 0.0 0.0
3 -10.0 0.0 0.0
3 -10.0 0.0 0.0
3 -10.0 0.0 0.0
3 -10.0 0.0 0.0
3 -10.0 0.0 0.0
3 -10.0 0.0 0.0
3 -10.0 0.0 0.0
3 -10.0 0.0 0.0
3 -10.0 0.0 0.0
3 -10.0 0.0 0.0
3 -10.0 0.0 0.0
3 -10.0 0.0 0.0
3 -10.0 0.0 0.0
3 -10.0 0.0 0.0
3 -10.0 0.0 0.0
3 -10.0 0.0 0.0
3 -10.0 0.0 0.0
3 -10.0 0.0 0.0
3 -10.0 0.0 0.0
3 -10.0 0.0 0.0
3 -10.0 0.0 0.0
3 -10.0 0.0 0.0
3 -10.0 0.0 0.0
3 -10.0 0.0 0.0
3 -10.0 0.0 0.0
3 -10.0 0.0 0.0
3 -10.0 0.0 0.0
3 -10.0 0.0 0.0
3 -10.0 0.0 0.0
3 -10.0 0.0 0.0
3 -10.0 0.0 0.0
3 -10.0 0.0 0.0
3 -10.0 0.0 0.0
3 -10.0 0.0 0.0
3 -10.0 0.0 0.0
3 -10.0 0.0 0.0
3 -10.0 0.0 0.0
3 -10.0 0.0 0.0
3 -10.0 0.0 0.0
3 -10.0 0.0 0.0
3 -10.0 0.0 0.0
3 -10.0 0.0 0.0
3 -10.0 0.0 0.0
3 -10.0 0.0 0.0
3 -10.0 0.0 0.0
3 -10.0 0.0 0.0
3 -10.0 0.0 0.0
3 -10.0 0.0 0.0
3 -10.0 0.0 0.0
3 -10.0 0.0 0.0
3 -10.0 0.0 0.0
3 -10.0 0.0 0.0
3 -10.0 0.0 0.0
3 -10.0 0.0 0.0
3 -10.0 0.0 0.0
3 -10.0 0.0 0.0
3 -10.0 0.0 0.0
3 -10.0 0.0 0.0
3 -10.0 0.0 0.0
3 -10.0 0.0 0.0
3 -10.0 0.0 0.0
3 -10.0 0.0 0.0
3 -10.0 0.0 0.0
3 -10.0 0.0 0.0
3 -10.0 0.0 0.0
3 -10.0 0.0 0.0
3 -10.0 0.0 0.0
3 -10.0 0.0 0.0
3 -10.0 0.0 0.0
3 -10.0 0.0 0.0
3 -10.0 0.0 0.0
3 -10.0 0.0 0.0
3 -10.0 0.0 0.0
3 -10.0 0.0 0.0
3 -10.0 0.0 0.0
3 -10.0 0.0 0.0
3 -10.0 0.0 0.0
3 -10.0 0.0 0.0
3 -10.0 0.0 0.0
3 -10.0 0.0 0.0
3 -10.0 0.0 0.0
3 -10.0 0.0 0.0
3 -10.0 0.0 0.0
3 -10.0 0.0 0.0
3 -10.0 0.0 0.0
3 -10.0 0.0 0.0
3 -10.0 0.0 0.0
3 -10.0 0.0 0.0
3 -10.0 0.0 0.0
3 -10.0 0.0 0.0
3 -10.0 0.0 0.0
3 -10.0 0.0 0.0
3 -10.0 0.0 0.0
3 -10.0 0.0 0.0
3 -10.0 0.0 0.0
3 -10.0 0.0 0.0
3 -10.0 0.0 0.0
3 -10.0 0.0 0.0
3 -10.0 0.0 0.0
3 -10.0 0.0 0.0
3 -10.0 0.0 0.0
3 -10.0 0.0 0.0
3 -10.0 0.0 0.0
3 -10.0 0.0 0.0
3 -10.0 0.0 0.0
3 -10.0 0.0 0.0
3 -10.0 0.0 0.0
3 -10.0 0.0 0.0
CDATA:
9 1 0 0 0 1 0 0 0 1
9 1 0 0 0 1 0 0 0 1
9 1 0 0 0 1 0 0 0 1
9 1 0 0 0 1 0 0 0 1
9 1 0 0 0 1 0 0 0 1
9 1 0 0 0 1 0 0 0 1
9 1 0 0 0 1 0 0 0 1
9 1 0 0 0 1 0 0 0 1
9 1 0 0 0 1 0 0 0 1
9 1 0 0 0 1 0 0 0 1
9 1 0 0 0 1 0 0 0 1
9 1 0 0 0 1 0 0 0 1
9 1 0 0 0 1 0 0 0 1
9 1 0 0 0 1 0 0 0 1
9 1 0 0 0 1 0 0 0 1
9 1 0 0 0 1 0 0 0 1
9 1 0 0 0 1 0 0 0 1
9 1 0 0 0 1 0 0 0 1
9 1 0 0 0 1 0 0 0 1
9 1 0 0 0 1 0 0 0 1
9 1 0 0 0 1 0 0 0 1
9 1 0 0 0 1 0 0 0 1
9 1 0 0 0 1 0 0 0 1
9 1 0 0 0 1 0 0 0 1
9 1 0 0 0 1 0 0 0 1
9 1 0 0 0 1 0 0 0 1
9 1 0 0 0 1 0 0 0 1
9 1 0 0 0 1 0 0 0 1
9 1 0 0 0 1 0 0 0 1
9 1 0 0 0 1 0 0 0 1
9 1 0 0 0 1 0 0 0 1
9 1 0 0 0 1 0 0 0 1
9 1 0 0 0 1 0 0 0 1
9 1 0 0 0 1 0 0 0 1
9 1 0 0 0 1 0 0 0 1
9 1 0 0 0 1 0 0 0 1
9 1 0 0 0 1 0 0 0 1
9 1 0 0 0 1 0 0 0 1
9 1 0 0 0 1 0 0 0 1
9 1 0 0 0 1 0 0 0 1
9 1 0 0 0 1 0 0 0 1
9 1 0 0 0 1 0 0 0 1
9 1 0 0 0 1 0 0 0 1
9 1 0 0 0 1 0 0 0 1
9 1 0 0 0 1 0 0 0 1
9 1 0 0 0 1 0 0 0 1
9 1 0 0 0 1 0 0 0 1
9 1 0 0 0 1 0 0 0 1
9 1 0 0 0 1 0 0 0 1
9 1 0 0 0 1 0 0 0 1
9 1 0 0 0 1 0 0 0 1
9 1 0 0 0 1 0 0 0 1
9 1 0 0 0 1 0 0 0 1
9 1 0 0 0 1 0 0 0 1
9 1 0 0 0 1 0 0 0 1
9 1 0 0 0 1 0 0 0 1
9 1 0 0 0 1 0 0 0 1
9 1 0 0 0 1 0 0 0 1
9 1 0 0 0 1 0 0 0 1
9 1 0 0 0 1 0 0 0 1
9 1 0 0 0 1 0 0 0 1
9 1 0 0 0 1 0 0 0 1
9 1 0 0 0 1 0 0 0 1
9 1 0 0 0 1 0 0 0 1
9 1 0 0 0 1 0 0 0 1
9 1 0 0 0 1 0 0 0 1
9 1 0 0 0 1 0 0 0 1
9 1 0 0 0 1 0 0 0 1
9 1 0 0 0 1 0 0 0 1
9 1 0 0 0 1 0 0 0 1
9 1 0 0 0 1 0 0 0 1
9 1 0 0 0 1 0 0 0 1
9 1 0 0 0 1 0 0 0 1
9 1 0 0 0 1 0 0 0 1
9 1 0 0 0 1 0 0 0 1
9 1 0 0 0 1 0 0 0 1
9 1 0 0 0 1 0 0 0 1
9 1 0 0 0 1 0 0 0 1
9 1 0 0 0 1 0 0 0 1
9 1 0 0 0 1 0 0 0 1
9 1 0 0 0 1 0 0 0 1
9 1 0 0 0 1 0 0 0 1
9 1 0 0 0 1 0 0 0 1
9 1 0 0 0 1 0 0 0 1
9 1 0 0 0 1 0 0 0 1
9 1 0 0 0 1 0 0 0 1
9 1 0 0 0 1 0 0 0 1
9 1 0 0 0 1 0 0 0 1
9 1 0 0 0 1 0 0 0 1
9 1 0 0 0 1 0 0 0 1
9 1 0 0 0 1 0 0 0 1
9 1 0 0 0 1 0 0 0 1
9 1 0 0 0 1 0 0 0 1
9 1 0 0 0 1 0 0 0 1
9 1 0 0 0 1 0 0 0 1
9 1 0 0 0 1 0 0 0 1
9 1 0 0 0 1 0 0 0 1
9 1 0 0 0 1 0 0 0 1
9 1 0 0 0 1 0 0 0 1
9 1 0 0 0 1 0 0 0 1
9 1 0 0 0 1 0 0 0 1
9 1 0 0 0 1 0 0 0 1
9 1 0 0 0 1 0 0 0 1
9 1 0 0 0 1 0 0 0 1
9 1 0 0 0 1 0 0 0 1
9 1 0 0 0 1 0 0 0 1
9 1 0 0 0 1 0 0 0 1
9 1 0 0 0 1 0 0 0 1
9 1 0 0 0 1 0 0 0 1
9 1 0 0 0 1 0 0 0 1
9 1 0 0 0 1 0 0 0 1
9 1 0 0 0 1 0 0 0 1
9 1 0 0 0 1 0 0 0 1
9 1 0 0 0 1 0 0 0 1
9 1 0 0 0 1 0 0 0 1
9 1 0 0 0 1 0 0 0 1
9 1 0 0 0 1 0 0 0 1
9 1 0 0 0 1 0 0 0 1
9 1 0 0 0 1 0 0 0 1
9 1 0 0 0 1 0 0 0 1
9 1 0 0 0 1 0 0 0 1
9 1 0 0 0 1 0 0 0 1
9 1 0 0 0 1 0 0 0 1
9 1 0 0 0 1 0 0 0 1
9 1 0 0 0 1 0 0 0 1
9 1 0 0 0 1 0 0 0 1
9 1 0 0 0 1 0 0 0 1
9 1 0 0 0 1 0 0 0 1
9 1 0 0 0 1 0 0 0 1
9 1 0 0 0 1 0 0 0 1
9 1 0 0 0 1 0 0 0 1
9 1 0 0 0 1 0 0 0 1
9 1 0 0 0 1 0 0 0 1
9 1 0 0 0 1 0 0 0 1
9 1 0 0 0 1 0 0 0 1
9 1 0 0 0 1 0 0 0 1
9 1 0 0 0 1 0 0 0 1
9 1 0 0 0 1 0 0 0 1
9 1 0 0 0 1 0 0 0 1
9 1 0 0 0 1 0 0 0 1
9 1 0 0 0 1 0 0 0 1
9 1 0 0 0 1 0 0 0 1
9 1 0 0 0 1 0 0 0 1
9 1 0 0 0 1 0 0 0 1
9 1 0 0 0 1 0 0 0 1
9 1 0 0 0 1 0 0 0 1
9 1 0 0 0 1 0 0 0 1
9 1 0 0 0 1 0 0 0 1
9 1 0 0 0 1 0 0 0 1
9 1 0 0 0 1 0 0 0 1
9 1 0 0 0 1 0 0 0 1
9 1 0 0 0 1 0 0 0 1
9 1 0 0 0 1 0 0 0 1
9 1 0 0 0 1 0 0 0 1
9 1 0 0 0 1 0 0 0 1
9 1 0 0 0 1 0 0 0 1
9 1 0 0 0 1 0 0 0 1
9 1 0 0 0 1 0 0 0 1
9 1 0 0 0 1 0 0 0 1
9 1 0 0 0 1 0 0 0 1
9 1 0 0 0 1 0 0 0 1
9 1 0 0 0 1 0 0 0 1
9 1 0 0 0 1 0 0 0 1
9 1 0 0 0 1 0 0 0 1
9 1 0 0 0 1 0 0 0 1
9 1 0 0 0 1 0 0 0 1
9 1 0 0 0 1 0 0 0 1
9 1 0 0 0 1 0 0 0 1
9 1 0 0 0 1 0 0 0 1
9 1 0 0 0 1 0 0 0 1
9 1 0 0 0 1 0 0 0 1
9 1 0 0 0 1 0 0 0 1
9 1 0 0 0 1 0 0 0 1
9 1 0 0 0 1 0 0 0 1
9 1 0 0 0 1 0 0 0 1
9 1 0 0 0 1 0 0 0 1
9 1 0 0 0 1 0 0 0 1
9 1 0 0 0 1 0 0 0 1
9 1 0 0 0 1 0 0 0 1
9 1 0 0 0 1 0 0 0 1
9 1 0 0 0 1 0 0 0 1
9 1 0 0 0 1 0 0 0 1
9 1 0 0 0 1 0 0 0 1
9 1 0 0 0 1 0 0 0 1
9 1 0 0 0 1 0 0 0 1
9 1 0 0 0 1 0 0 0 1
9 1 0 0 0 1 0 0 0 1
9 1 0 0 0 1 0 0 0 1
9 1 0 0 0 1 0 0 0 1
9 1 0 0 0 1 0 0 0 1
9 1 0 0 0 1 0 0 0 1
9 1 0 0 0 1 0 0 0 1
9 1 0 0 0 1 0 0 0 1
9 1 0 0 0 1 0 0 0 1
9 1 0 0 0 1 0 0 0 1
9 1 0 0 0 1 0 0 0 1
9 1 0 0 0 1 0 0 0 1
9 1 0 0 0 1 0 0 0 1
9 1 0 0 0 1 0 0 0 1
9 1 0 0 0 1 0 0 0 1
9 1 0 0 0 1 0 0 0 1
9 1 0 0 0 1 0 0 0 1
9 1 0 0 0 1 0 0 0 1
9 1 0 0 0 1 0 0 0 1
9 1 0 0 0 1 0 0 0 1
9 1 0 0 0 1 0 0 0 1
9 1 0 0 0 1 0 0 0 1
9 1 0 0 0 1 0 0 0 1
9 1 0 0 0 1 0 0 0 1
9 1 0 0 0 1 0 0 0 1
9 1 0 0 0 1 0 0 0 1
9 1 0 0 0 1 0 0 0 1
9 1 0 0 0 1 0 0 0 1
9 1 0 0 0 1 0 0 0 1
9 1 0 0 0 1 0 0 0 1
9 1 0 0 0 1 0 0 0 1
9 1 0 0 0 1 0 0 0 1
9 1 0 0 0 1 0 0 0 1
9 1 0 0 0 1 0 0 0 1
9 1 0 0 0 1 0 0 0 1
9 1 0 0 0 1 0 0 0 1
9 1 0 0 0 1 0 0 0 1
9 1 0 0 0 1 0 0 0 1
9 1 0 0 0 1 0 0 0 1
9 1 0 0 0 1 0 0 0 1
9 1 0 0 0 1 0 0 0 1
9 1 0 0 0 1 0 0 0 1
9 1 0 0 0 1 0 0 0 1
9 1 0 0 0 1 0 0 0 1
9 1 0 0 0 1 0 0 0 1
9 1 0 0 0 1 0 0 0 1
9 1 0 0 0 1 0 0 0 1
9 1 0 0 0 1 0 0 0 1
9 1 0 0 0 1 0 0 0 1
9 1 0 0 0 1 0 0 0 1
9 1 0 0 0 1 0 0 0 1
9 1 0 0 0 1 0 0 0 1
9 1 0 0 0 1 0 0 0 1
9 1 0 0 0 1 0 0 0 1
9 1 0 0 0 1 0 0 0 1
9 1 0 0 0 1 0 0 0 1
9 1 0 0 0 1 0 0 0 1
9 1 0 0 0 1 0 0 0 1
9 1 0 0 0 1 0 0 0 1
9 1 0 0 0 1 0 0 0 1
9 1 0 0 0 1 0 0 0 1
9 1 0 0 0 1 0 0 0 1
9 1 0 0 0 1 0 0 0 1
9 1 0 0 0 1 0 0 0 1
9 1 0 0 0 1 0 0 0 1
9 1 0 0 0 1 0 0 0 1
9 1 0 0 0 1 0 0 0 1
9 1 0 0 0 1 0 0 0 1
9 1 0 0 0 1 0 0 0 1
9 1 0 0 0 1 0 0 0 1
9 1 0 0 0 1 0 0 0 1
9 1 0 0 0 1 0 0 0 1
9 1 0 0 0 1 0 0 0 1
9 1 0 0 0 1 0 0 0 1
9 1 0 0 0 1 0 0 0 1
9 1 0 0 0 1 0 0 0 1
9 1 0 0 0 1 0 0 0 1
9 1 0 0 0 1 0 0 0 1
9 1 0 0 0 1 0 0 0 1
9 1 0 0 0 1 0 0 0 1
9 1 0 0 0 1 0 0 0 1
9 1 0 0 0 1 0 0 0 1
9 1 0 0 0 1 0 0 0 1
9 1 0 0 0 1 0 0 0 1
9 1 0 0 0 1 0 0 0 1
9 1 0 0 0 1 0 0 0 1
9 1 0 0 0 1 0 0 0 1
9 1 0 0 0 1 0 0 0 1
9 1 0 0 0 1 0 0 0 1
9 1 0 0 0 1 0 0 0 1
9 1 0 0 0 1 0 0 0 1
9 1 0 0 0 1 0 0 0 1
9 1 0 0 0 1 0 0 0 1
9 1 0 0 0 1 0 0 0 1
9 1 0 0 0 1 0 0 0 1
9 1 0 0 0 1 0 0 0 1
9 1 0 0 0 1 0 0 0 1
9 1 0 0 0 1 0 0 0 1
9 1 0 0 0 1 0 0 0 1
9 1 0 0 0 1 0 0 0 1
9 1 0 0 0 1 0 0 0 1
9 1 0 0 0 1 0 0 0 1
9 1 0 0 0 1 0 0 0 1
9 1 0 0 0 1 0 0 0 1
9 1 0 0 0 1 0 0 0 1
9 1 0 0 0 1 0 0 0 1
9 1 0 0 0 1 0 0 0 1
9 1 0 0 0 1 0 0 0 1
9 1 0 0 0 1 0 0 0 1
9 1 0 0 0 1 0 0 0 1
9 1 0 0 0 1 0 0 0 1
9 1 0 0 0 1 0 0 0 1
9 1 0 0 0 1 0 0 0 1
9 1 0 0 0 1 0 0 0 1
9 1 0 0 0 1 0 0 0 1
9 1 0 0 0 1 0 0 0 1
9 1 0 0 0 1 0 0 0 1
9 1 0 0 0 1 0 0 0 1
9 1 0 0 0 1 0 0 0 1
9 1 0 0 0 1 0 0 0 1
9 1 0 0 0 1 0 0 0 1
9 1 0 0 0 1 0 0 0 1
9 1 0 0 0 1 0 0 0 1
9 1 0 0 0 1 0 0 0 1
9 1 0 0 0 1 0 0 0 1
9 1 0 0 0 1 0 0 0 1
9 1 0 0 0 1 0 0 0 1
9 1 0 0 0 1 0 0 0 1
9 1 0 0 0 1 0 0 0 1
9 1 0 0 0 1 0 0 0 1
9 1 0 0 0 1 0 0 0 1
9 1 0 0 0 1 0 0 0 1
9 1 0 0 0 1 0 0 0 1
9 1 0 0 0 1 0 0 0 1
9 1 0 0 0 1 0 0 0 1
9 1 0 0 0 1 0 0 0 1
9 1 0 0 0 1 0 0 0 1
9 1 0 0 0 1 0 0 0 1
9 1 0 0 0 1 0 0 0 1
9 1 0 0 0 1 0 0 0 1
9 1 0 0 0 1 0 0 0 1
9 1 0 0 0 1 0 0 0 1
9 1 0 0 0 1 0 0 0 1
9 1 0 0 0 1 0 0 0 1
9 1 0 0 0 1 0 0 0 1
9 1 0 0 0 1 0 0 0 1
9 1 0 0 0 1 0 0 0 1
9 1 0 0 0 1 0 0 0 1
9 1 0 0 0 1 0 0 0 1
9 1 0 0 0 1 0 0 0 1
9 1 0 0 0 1 0 0 0 1
9 1 0 0 0 1 0 0 0 1
9 1 0 0 0 1 0 0 0 1
9 1 0 0 0 1 0 0 0 1
9 1 0 0 0 1 0 0 0 1
9 1 0 0 0 1 0 0 0 1
9 1 0 0 0 1 0 0 0 1
9 1 0 0 0 1 0 0 0 1
9 1 0 0 0 1 0 0 0 1
9 1 0 0 0 1 0 0 0 1
9 1 0 0 0 1 0 0 0 1
9 1 0 0 0 1 0 0 0 1
9 1 0 0 0 1 0 0 0 1
9 1 0 0 0 1 0 0 0 1
9 1 0 0 0 1 0 0 0 1
9 1 0 0 0 1 0 0 0 1
9 1 0 0 0 1 0 0 0 1
9 1 0 0 0 1 0 0 0 1
9 1 0 0 0 1 0 0 0 1
9 1 0 0 0 1 0 0 0 1
9 1 0 0 0 1 0 0 0 1
9 1 0 0 0 1 0 0 0 1
9 1 0 0 0 1 0 0 0 1
9 1 0 0 0 1 0 0 0 1
9 1 0 0 0 1 0 0 0 1
9 1 0 0 0 1 0 0 0 1
9 1 0 0 0 1 0 0 0 1
9 1 0 0 0 1 0 0 0 1
9 1 0 0 0 1 0 0 0 1
9 1 0 0 0 1 0 0 0 1
9 1 0 0 0 1 0 0 0 1
9 1 0 0 0 1 0 0 0 1
9 1 0 0 0 1 0 0 0 1
9 1 0 0 0 1 0 0 0 1
9 1 0 0 0 1 0 0 0 1
9 1 0 0 0 1 0 0 0 1
9 1 0 0 0 1 0 0 0 1
9 1 0 0 0 1 0 0 0 1
9 1 0 0 0 1 0 0 0 1
9 1 0 0 0 1 0 0 0 1
9 1 0 0 0 1 0 0 0 1
9 1 0 0 0 1 0 0 0 1
9 1 0 0 0 1 0 0 0 1
9 1 0 0 0 1 0 0 0 1
9 1 0 0 0 1 0 0 0 1
9 1 0 0 0 1 0 0 0 1
9 1 0 0 0 1 0 0 0 1
9 1 0 0 0 1 0 0 0 1
9 1 0 0 0 1 0 0 0 1
9 1 0 0 0 1 0 0 0 1
9 1 0 0 0 1 0 0 0 1
9 1 0 0 0 1 0 0 0 1
9 1 0 0 0 1 0 0 0 1
9 1 0 0 0 1 0 0 0 1
9 1 0 0 0 1 0 0 0 1
9 1 0 0 0 1 0 0 0 1
9 1 0 0 0 1 0 0 0 1
9 1 0 0 0 1 0 0 0 1
9 1 0 0 0 1 0 0 0 1
9 1 0 0 0 1 0 0 0 1
9 1 0 0 0 1 0 0 0 1
9 1 0 0 0 1 0 0 0 1
9 1 0 0 0 1 0 0 0 1
9 1 0 0 0 1 0 0 0 1
9 1 0 0 0 1 0 0 0 1
9 1 0 0 0 1 0 0 0 1
9 1 0 0 0 1 0 0 0 1
9 1 0 0 0 1 0 0 0 1
9 1 0 0 0 1 0 0 0 1
9 1 0 0 0 1 0 0 0 1
9 1 0 0 0 1 0 0 0 1
9 1 0 0 0 1 0 0 0 1
9 1 0 0 0 1 0 0 0 1
9 1 0 0 0 1 0 0 0 1
9 1 0 0 0 1 0 0 0 1
9 1 0 0 0 1 0 0 0 1
9 1 0 0 0 1 0 0 0 1
9 1 0 0 0 1 0 0 0 1
9 1 0 0 0 1 0 0 0 1
9 1 0 0 0 1 0 0 0 1
9 1 0 0 0 1 0 0 0 1
9 1 0 0 0 1 0 0 0 1
9 1 0 0 0 1 0 0 0 1
9 1 0 0 0 1 0 0 0 1
9 1 0 0 0 1 0 0 0 1
9 1 0 0 0 1 0 0 0 1
9 1 0 0 0 1 0 0 0 1
9 1 0 0 0 1 0 0 0 1
9 1 0 0 0 1 0 0 0 1
9 1 0 0 0 1 0 0 0 1
9 1 0 0 0 1 0 0 0 1
9 1 0 0 0 1 0 0 0 1
9 1 0 0 0 1 0 0 0 1
9 1 0 0 0 1 0 0 0 1
9 1 0 0 0 1 0 0 0 1
9 1 0 0 0 1 0 0 0 1
9 1 0 0 0 1 0 0 0 1
9 1 0 0 0 1 0 0 0 1
9 1 0 0 0 1 0 0 0 1
9 1 0 0 0 1 0 0 0 1
9 1 0 0 0 1 0 0 0 1
9 1 0 0 0 1 0 0 0 1
9 1 0 0 0 1 0 0 0 1
9 1 0 0 0 1 0 0 0 1
9 1 0 0 0 1 0 0 0 1
9 1 0 0 0 1 0 0 0 1
9 1 0 0 0 1 0 0 0 1
9 1 0 0 0 1 0 0 0 1
9 1 0 0 0 1 0 0 0 1
9 1 0 0 0 1 0 0 0 1
9 1 0 0 0 1 0 0 0 1
9 1 0 0 0 1 0 0 0 1
9 1 0 0 0 1 0 0 0 1
9 1 0 0 0 1 0 0 0 1
9 1 0 0 0 1 0 0 0 1
9 1 0 0 0 1 0 0 0 1
9 1 0 0 0 1 0 0 0 1
9 1 0 0 0 1 0 0 0 1
9 1 0 0 0 1 0 0 0 1
9 1 0 0 0 1 0 0 0 1
9 1 0 0 0 1 0 0 0 1
9 1 0 0 0 1 0 0 0 1
9 1 0 0 0 1 0 0 0 1
9 1 0 0 0 1 0 0 0 1
9 1 0 0 0 1 0 0 0 1
9 1 0 0 0 1 0 0 0 1
9 1 0 0 0 1 0 0 0 1
9 1 0 0 0 1 0 0 0 1
9 1 0 0 0 1 0 0 0 1
9 1 0 0 0 1 0 0 0 1
9 1 0 0 0 1 0 0 0 1
9 1 0 0 0 1 0 0 0 1
9 1 0 0 0 1 0 0 0 1
9 1 0 0 0 1 0 0 0 1
9 1 0 0 0 1 0 0 0 1
9 1 0 0 0 1 0 0 0 1
9 1 0 0 0 1 0 0 0 1
9 1 0 0 0 1 0 0 0 1
9 1 0 0 0 1 0 0 0 1
9 1 0 0 0 1 0 0 0 1
9 1 0 0 0 1 0 0 0 1
9 1 0 0 0 1 0 0 0 1
9 1 0 0 0 1 0 0 0 1
9 1 0 0 0 1 0 0 0 1
9 1 0 0 0 1 0 0 0 1
9 1 0 0 0 1 0 0 0 1
9 1 0 0 0 1 0 0 0 1
9 1 0 0 0 1 0 0 0 1
9 1 0 0 0 1 0 0 0 1
9 1 0 0 0 1 0 0 0 1
9 1 0 0 0 1 0 0 0 1
9 1 0 0 0 1 0 0 0 1
9 1 0 0 0 1 0 0 0 1
9 1 0 0 0 1 0 0 0 1
9 1 0 0 0 1 0 0 0 1
9 1 0 0 0 1 0 0 0 1
9 1 0 0 0 1 0 0 0 1
9 1 0 0 0 1 0 0 0 1
9 1 0 0 0 1 0 0 0 1
9 1 0 0 0 1 0 0 0 1
9 1 0 0 0 1 0 0 0 1
9 1 0 0 0 1 0 0 0 1
9 1 0 0 0 1 0 0 0 1
9 1 0 0 0 1 0 0 0 1
9 1 0 0 0 1 0 0 0 1
9 1 0 0 0 1 0 0 0 1
9 1 0 0 0 1 0 0 0 1
9 1 0 0 0 1 0 0 0 1
9 1 0 0 0 1 0 0 0 1
9 1 0 0 0 1 0 0 0 1
9 1 0 0 0 1 0 0 0 1
9 1 0 0 0 1 0 0 0 1
9 1 0 0 0 1 0 0 0 1
9 1 0 0 0 1 0 0 0 1
9 1 0 0 0 1 0 0 0 1
9 1 0 0 0 1 0 0 0 1
9 1 0 0 0 1 0 0 0 1
9 1 0 0 0 1 0 0 0 1
9 1 0 0 0 1 0 0 0 1
9 1 0 0 0 1 0 0 0 1
9 1 0 0 0 1 0 0 0 1
9 1 0 0 0 1 0 0 0 1
9 1 0 0 0 1 0 0 0 1
9 1 0 0 0 1 0 0 0 1
9 1 0 0 0 1 0 0 0 1
9 1 0 0 0 1 0 0 0 1
9 1 0 0 0 1 0 0 0 1
9 1 0 0 0 1 0 0 0 1
9 1 0 0 0 1 0 0 0 1
9 1 0 0 0 1 0 0 0 1
9 1 0 0 0 1 0 0 0 1
9 1 0 0 0 1 0 0 0 1
9 1 0 0 0 1 0 0 0 1
9 1 0 0 0 1 0 0 0 1
9 1 0 0 0 1 0 0 0 1
9 1 0 0 0 1 0 0 0 1
9 1 0 0 0 1 0 0 0 1
9 1 0 0 0 1 0 0 0 1
9 1 0 0 0 1 0 0 0 1
9 1 0 0 0 1 0 0 0 1
9 1 0 0 0 1 0 0 0 1
9 1 0 0 0 1 0 0 0 1
9 1 0 0 0 1 0 0 0 1
9 1 0 0 0 1 0 0 0 1
9 1 0 0 0 1 0 0 0 1
9 1 0 0 0 1 0 0 0 1
9 1 0 0 0 1 0 0 0 1
9 1 0 0 0 1 0 0 0 1
9 1 0 0 0 1 0 0 0 1
9 1 0 0 0 1 0 0 0 1
9 1 0 0 0 1 0 0 0 1
9 1 0 0 0 1 0 0 0 1
9 1 0 0 0 1 0 0 0 1
9 1 0 0 0 1 0 0 0 1
9 1 0 0 0 1 0 0 0 1
9 1 0 0 0 1 0 0 0 1
9 1 0 0 0 1 0 0 0 1
9 1 0 0 0 1 0 0 0 1
9 1 0 0 0 1 0 0 0 1
9 1 0 0 0 1 0 0 0 1
9 1 0 0 0 1 0 0 0 1
9 1 0 0 0 1 0 0 0 1
9 1 0 0 0 1 0 0 0 1
9 1 0 0 0 1 0 0 0 1
9 1 0 0 0 1 0 0 0 1
