POINTS:
0.0 0.0
0.0 0.25
0.0 0.5
0.0 0.75
0.0 1.0
0.0 1.25
0.0 1.5
0.0 1.75
0.0 2.0
0.0 2.25
0.0 2.5
0.0 2.75
0.0 3.0
0.25 0.0
0.25 0.25
0.25 0.5
0.25 0.75
0.25 1.0
0.25 1.25
0.25 1.5
0.25 1.75
0.25 2.0
0.25 2.25
0.25 2.5
0.25 2.75
0.25 3.0
0.5 0.0
0.5 0.25
0.5 0.5
0.5 0.75
0.5 1.0
0.5 1.25
0.5 1.5
0.5 1.75
0.5 2.0
0.5 2.25
0.5 2.5
0.5 2.75
0.5 3.0
0.75 0.0
0.75 0.25
0.75 0.5
0.75 0.75
0.75 1.0
0.75 1.25
0.75 1.5
0.75 1.75
0.75 2.0
0.75 2.25
0.75 2.5
0.75 2.75
0.75 3.0
1.0 0.0
1.0 0.25
1.0 0.5
1.0 0.75
1.0 1.0
1.0 1.25
1.0 1.5
1.0 1.75
1.0 2.0
1.0 2.25
1.0 2.5
1.0 2.75
1.0 3.0
1.25 0.0
1.25 0.25
1.25 0.5
1.25 0.75
1.25 1.0
1.25 1.25
1.25 1.5
1.25 1.75
1.25 2.0
1.25 2.25
1.25 2.5
1.25 2.75
1.25 3.0
1.5 0.0
1.5 0.25
1.5 0.5
1.5 0.75
1.5 1.0
1.5 1.25
1.5 1.5
1.5 1.75
1.5 2.0
1.5 2.25
1.5 2.5
1.5 2.75
1.5 3.0
1.75 0.0
1.75 0.25
1.75 0.5
1.75 0.75
1.75 1.0
1.75 1.25
1.75 1.5
1.75 1.75
1.75 2.0
1.75 2.25
1.75 2.5
1.75 2.75
1.75 3.0
2.0 0.0
2.0 0.25
2.0 0.5
2.0 0.75
2.0 1.0
2.0 1.25
2.0 1.5
2.0 1.75
2.0 2.0
2.0 2.25
2.0 2.5
2.0 2.75
2.0 3.0
2.25 0.0
2.25 0.25
2.25 0.5
2.25 0.75
2.25 1.0
2.25 1.25
2.25 1.5
2.25 1.75
2.25 2.0
2.25 2.25
2.25 2.5
2.25 2.75
2.25 3.0
2.5 0.0
2.5 0.25
2.5 0.5
2.5 0.75
2.5 1.0
2.5 1.25
2.5 1.5
2.5 1.75
2.5 2.0
2.5 2.25
2.5 2.5
2.5 2.75
2.5 3.0
2.75 0.0
2.75 0.25
2.75 0.5
2.75 0.75
2.75 1.0
2.75 1.25
2.75 1.5
2.75 1.75
2.75 2.0
2.75 2.25
2.75 2.5
2.75 2.75
2.75 3.0
3.0 0.0
3.0 0.25
3.0 0.5
3.0 0.75
3.0 1.0
3.0 1.25
3.0 1.5
3.0 1.75
3.0 2.0
3.0 2.25
3.0 2.5
3.0 2.75
3.0 3.0
3.25 0.0
3.25 0.25
3.25 0.5
3.25 0.75
3.25 1.0
3.25 1.25
3.25 1.5
3.25 1.75
3.25 2.0
3.25 2.25
3.25 2.5
3.25 2.75
3.25 3.0
3.5 0.0
3.5 0.25
3.5 0.5
3.5 0.75
3.5 1.0
3.5 1.25
3.5 1.5
3.5 1.75
3.5 2.0
3.5 2.25
3.5 2.5
3.5 2.75
3.5 3.0
3.75 0.0
3.75 0.25
3.75 0.5
3.75 0.75
3.75 1.0
3.75 1.25
3.75 1.5
3.75 1.75
3.75 2.0
3.75 2.25
3.75 2.5
3.75 2.75
3.75 3.0
4.0 0.0
4.0 0.25
4.0 0.5
4.0 0.75
4.0 1.0
4.0 1.25
4.0 1.5
4.0 1.75
4.0 2.0
4.0 2.25
4.0 2.5
4.0 2.75
4.0 3.0
4.25 0.0
4.25 0.25
4.25 0.5
4.25 0.75
4.25 1.0
4.25 1.25
4.25 1.5
4.25 1.75
4.25 2.0
4.25 2.25
4.25 2.5
4.25 2.75
4.25 3.0
4.5 0.0
4.5 0.25
4.5 0.5
4.5 0.75
4.5 1.0
4.5 1.25
4.5 1.5
4.5 1.75
4.5 2.0
4.5 2.25
4.5 2.5
4.5 2.75
4.5 3.0
4.75 0.0
4.75 0.25
4.75 0.5
4.75 0.75
4.75 1.0
4.75 1.25
4.75 1.5
4.75 1.75
4.75 2.0
4.75 2.25
4.75 2.5
4.75 2.75
4.75 3.0
5.0 0.0
5.0 0.25
5.0 0.5
5.0 0.75
5.0 1.0
5.0 1.25
5.0 1.5
5.0 1.75
5.0 2.0
5.0 2.25
5.0 2.5
5.0 2.75
5.0 3.0
CELLS:
4 0 0 13 14 1
4 0 1 14 15 2
4 0 2 15 16 3
4 0 3 16 17 4
4 0 4 17 18 5
4 0 5 18 19 6
4 0 6 19 20 7
4 0 7 20 21 8
4 0 8 21 22 9
4 0 9 22 23 10
4 0 10 23 24 11
4 0 11 24 25 12
4 0 13 26 27 14
4 0 14 27 28 15
4 0 15 28 29 16
4 0 16 29 30 17
4 0 17 30 31 18
4 0 18 31 32 19
4 0 19 32 33 20
4 0 20 33 34 21
4 0 21 34 35 22
4 0 22 35 36 23
4 0 23 36 37 24
4 0 24 37 38 25
4 0 26 39 40 27
4 0 27 40 41 28
4 0 28 41 42 29
4 0 29 42 43 30
4 0 30 43 44 31
4 0 31 44 45 32
4 0 32 45 46 33
4 0 33 46 47 34
4 0 34 47 48 35
4 0 35 48 49 36
4 0 36 49 50 37
4 0 37 50 51 38
4 0 39 52 53 40
4 0 40 53 54 41
4 0 41 54 55 42
4 0 42 55 56 43
4 0 43 56 57 44
4 0 44 57 58 45
4 0 45 58 59 46
4 0 46 59 60 47
4 0 47 60 61 48
4 0 48 61 62 49
4 0 49 62 63 50
4 0 50 63 64 51
4 0 52 65 66 53
4 0 53 66 67 54
4 0 54 67 68 55
4 0 55 68 69 56
4 0 56 69 70 57
4 0 57 70 71 58
4 0 58 71 72 59
4 0 59 72 73 60
4 0 60 73 74 61
4 0 61 74 75 62
4 0 62 75 76 63
4 0 63 76 77 64
4 0 65 78 79 66
4 0 66 79 80 67
4 0 67 80 81 68
4 0 68 81 82 69
4 0 69 82 83 70
4 0 70 83 84 71
4 0 71 84 85 72
4 0 72 85 86 73
4 0 73 86 87 74
4 0 74 87 88 75
4 0 75 88 89 76
4 0 76 89 90 77
4 0 78 91 92 79
4 0 79 92 93 80
4 0 80 93 94 81
4 0 81 94 95 82
4 0 82 95 96 83
4 0 83 96 97 84
4 0 84 97 98 85
4 0 85 98 99 86
4 0 86 99 100 87
4 0 87 100 101 88
4 0 88 101 102 89
4 0 89 102 103 90
4 0 91 104 105 92
4 0 92 105 106 93
4 0 93 106 107 94
4 0 94 107 108 95
4 0 95 108 109 96
4 0 96 109 110 97
4 0 97 110 111 98
4 0 98 111 112 99
4 0 99 112 113 100
4 0 100 113 114 101
4 0 101 114 115 102
4 0 102 115 116 103
4 0 104 117 118 105
4 0 105 118 119 106
4 0 106 119 120 107
4 0 107 120 121 108
4 0 108 121 122 109
4 0 109 122 123 110
4 0 110 123 124 111
4 0 111 124 125 112
4 0 112 125 126 113
4 0 113 126 127 114
4 0 114 127 128 115
4 0 115 128 129 116
4 0 117 130 131 118
4 0 118 131 132 119
4 0 119 132 133 120
4 0 120 133 134 121
4 0 121 134 135 122
4 0 122 135 136 123
4 0 123 136 137 124
4 0 124 137 138 125
4 0 125 138 139 126
4 0 126 139 140 127
4 0 127 140 141 128
4 0 128 141 142 129
4 0 130 143 144 131
4 0 131 144 145 132
4 0 132 145 146 133
4 0 133 146 147 134
4 0 134 147 148 135
4 0 135 148 149 136
4 0 136 149 150 137
4 0 137 150 151 138
4 0 138 151 152 139
4 0 139 152 153 140
4 0 140 153 154 141
4 0 141 154 155 142
4 0 143 156 157 144
4 0 144 157 158 145
4 0 145 158 159 146
4 0 146 159 160 147
4 0 147 160 161 148
4 0 148 161 162 149
4 0 149 162 163 150
4 0 150 163 164 151
4 0 151 164 165 152
4 0 152 165 166 153
4 0 153 166 167 154
4 0 154 167 168 155
4 0 156 169 170 157
4 0 157 170 171 158
4 0 158 171 172 159
4 0 159 172 173 160
4 0 160 173 174 161
4 0 161 174 175 162
4 0 162 175 176 163
4 0 163 176 177 164
4 0 164 177 178 165
4 0 165 178 179 166
4 0 166 179 180 167
4 0 167 180 181 168
4 0 169 182 183 170
4 0 170 183 184 171
4 0 171 184 185 172
4 0 172 185 186 173
4 0 173 186 187 174
4 0 174 187 188 175
4 0 175 188 189 176
4 0 176 189 190 177
4 0 177 190 191 178
4 0 178 191 192 179
4 0 179 192 193 180
4 0 180 193 194 181
4 0 182 195 196 183
4 0 183 196 197 184
4 0 184 197 198 185
4 0 185 198 199 186
4 0 186 199 200 187
4 0 187 200 201 188
4 0 188 201 202 189
4 0 189 202 203 190
4 0 190 203 204 191
4 0 191 204 205 192
4 0 192 205 206 193
4 0 193 206 207 194
4 0 195 208 209 196
4 0 196 209 210 197
4 0 197 210 211 198
4 0 198 211 212 199
4 0 199 212 213 200
4 0 200 213 214 201
4 0 201 214 215 202
4 0 202 215 216 203
4 0 203 216 217 204
4 0 204 217 218 205
4 0 205 218 219 206
4 0 206 219 220 207
4 0 208 221 222 209
4 0 209 222 223 210
4 0 210 223 224 211
4 0 211 224 225 212
4 0 212 225 226 213
4 0 213 226 227 214
4 0 214 227 228 215
4 0 215 228 229 216
4 0 216 229 230 217
4 0 217 230 231 218
4 0 218 231 232 219
4 0 219 232 233 220
4 0 221 234 235 222
4 0 222 235 236 223
4 0 223 236 237 224
4 0 224 237 238 225
4 0 225 238 239 226
4 0 226 239 240 227
4 0 227 240 241 228
4 0 228 241 242 229
4 0 229 242 243 230
4 0 230 243 244 231
4 0 231 244 245 232
4 0 232 245 246 233
4 0 234 247 248 235
4 0 235 248 249 236
4 0 236 249 250 237
4 0 237 250 251 238
4 0 238 251 252 239
4 0 239 252 253 240
4 0 240 253 254 241
4 0 241 254 255 242
4 0 242 255 256 243
4 0 243 256 257 244
4 0 244 257 258 245
4 0 245 258 259 246
4 0 247 260 261 248
4 0 248 261 262 249
4 0 249 262 263 250
4 0 250 263 264 251
4 0 251 264 265 252
4 0 252 265 266 253
4 0 253 266 267 254
4 0 254 267 268 255
4 0 255 268 269 256
4 0 256 269 270 257
4 0 257 270 271 258
4 0 258 271 272 259
FACES:
VDATA:
3 0.0 0.002 20
3 0.0 0.002 20
3 0.0 0.002 20
3 0.0 0.002 20
3 0.0 0.002 20
3 0.0 0.002 20
3 0.0 0.002 20
3 -10.0 0.0 0.0
3 -10.0 0.0 0.0
3 -10.0 0.0 0.0
3 -10.0 0.0 0.0
3 -10.0 0.0 0.0
3 -10.0 0.0 0.0
3 0.0 0.002 20
3 0.0 0.002 20
3 0.0 0.002 20
3 0.0 0.002 20
3 0.0 0.002 20
3 0.0 0.002 20
3 0.0 0.002 20
3 -10.0 0.0 0.0
3 -10.0 0.0 0.0
3 -10.0 0.0 0.0
3 -10.0 0.0 0.0
3 -10.0 0.0 0.0
3 -10.0 0.0 0.0
3 0.0 0.002 20
3 0.0 0.002 20
3 0.0 0.002 20
3 0.0 0.002 20
3 0.0 0.002 20
3 0.0 0.002 20
3 0.0 0.002 20
3 -10.0 0.0 0.0
3 -10.0 0.0 0.0
3 -10.0 0.0 0.0
3 -10.0 0.0 0.0
3 -10.0 0.0 0.0
3 -10.0 0.0 0.0
3 0.0 0.002 20
3 0.0 0.002 20
3 0.0 0.002 20
3 0.0 0.002 20
3 0.0 0.002 20
3 0.0 0.002 20
3 0.0 0.002 20
3 -10.0 0.0 0.0
3 -10.0 0.0 0.0
3 -10.0 0.0 0.0
3 -10.0 0.0 0.0
3 -10.0 0.0 0.0
3 -10.0 0.0 0.0
3 0.0 0.002 20
3 0.0 0.002 20
3 0.0 0.002 20
3 0.0 0.002 20
3 0.0 0.002 20
3 0.0 0.002 20
3 0.0 0.002 20
3 -10.0 0.0 0.0
3 -10.0 0.0 0.0
3 -10.0 0.0 0.0
3 -10.0 0.0 0.0
3 -10.0 0.0 0.0
3 -10.0 0.0 0.0
3 0.0 0.002 20
3 0.0 0.002 20
3 0.0 0.002 20
3 0.0 0.002 20
3 0.0 0.002 20
3 0.0 0.002 20
3 0.0 0.002 20
3 -10.0 0.0 0.0
3 -10.0 0.0 0.0
3 -10.0 0.0 0.0
3 -10.0 0.0 0.0
3 -10.0 0.0 0.0
3 -10.0 0.0 0.0
3 0.0 0.002 20
3 0.0 0.002 20
3 0.0 0.002 20
3 0.0 0.002 20
3 0.0 0.002 20
3 0.0 0.002 20
3 0.0 0.002 20
3 -10.0 0.0 0.0
3 -10.0 0.0 0.0
3 -10.0 0.0 0.0
3 -10.0 0.0 0.0
3 -10.0 0.0 0.0
3 -10.0 0.0 0.0
3 -10.0 0.0 0.0
3 -10.0 0.0 0.0
3 -10.0 0.0 0.0
3 -10.0 0.0 0.0
3 -10.0 0.0 0.0
3 -10.0 0.0 0.0
3 -10.0 0.0 0.0
3 -10.0 0.0 0.0
3 -10.0 0.0 0.0
3 -10.0 0.0 0.0
3 -10.0 0.0 0.0
3 -10.0 0.0 0.0
3 -10.0 0.0 0.0
3 -10.0 0.0 0.0
3 -10.0 0.0 0.0
3 -10.0 0.0 0.0
3 -10.0 0.0 0.0
3 -10.0 0.0 0.0
3 -10.0 0.0 0.0
3 -10.0 0.0 0.0
3 -10.0 0.0 0.0
3 -10.0 0.0 0.0
3 -10.0 0.0 0.0
3 -10.0 0.0 0.0
3 -10.0 0.0 0.0
3 -10.0 0.0 0.0
3 -10.0 0.0 0.0
3 -10.0 0.0 0.0
3 -10.0 0.0 0.0
3 -10.0 0.0 0.0
3 -10.0 0.0 0.0
3 -10.0 0.0 0.0
3 -10.0 0.0 0.0
3 -10.0 0.0 0.0
3 -10.0 0.0 0.0
3 -10.0 0.0 0.0
3 -10.0 0.0 0.0
3 -10.0 0.0 0.0
3 -10.0 0.0 0.0
3 -10.0 0.0 0.0
3 -10.0 0.0 0.0
3 -10.0 0.0 0.0
3 -10.0 0.0 0.0
3 -10.0 0.0 0.0
3 -10.0 0.0 0.0
3 -10.0 0.0 0.0
3 -10.0 0.0 0.0
3 -10.0 0.0 0.0
3 -10.0 0.0 0.0
3 -10.0 0.0 0.0
3 -10.0 0.0 0.0
3 -10.0 0.0 0.0
3 -10.0 0.0 0.0
3 -10.0 0.0 0.0
3 -10.0 0.0 0.0
3 -10.0 0.0 0.0
3 -10.0 0.0 0.0
3 -10.0 0.0 0.0
3 -10.0 0.0 0.0
3 -10.0 0.0 0.0
3 -10.0 0.0 0.0
3 -10.0 0.0 0.0
3 -10.0 0.0 0.0
3 -10.0 0.0 0.0
3 -10.0 0.0 0.0
3 -10.0 0.0 0.0
3 -10.0 0.0 0.0
3 -10.0 0.0 0.0
3 -10.0 0.0 0.0
3 -10.0 0.0 0.0
3 -10.0 0.0 0.0
3 -10.0 0.0 0.0
3 -10.0 0.0 0.0
3 -10.0 0.0 0.0
3 -10.0 0.0 0.0
3 -10.0 0.0 0.0
3 -10.0 0.0 0.0
3 -10.0 0.0 0.0
3 -10.0 0.0 0.0
3 -10.0 0.0 0.0
3 -10.0 0.0 0.0
3 -10.0 0.0 0.0
3 -10.0 0.0 0.0
3 -10.0 0.0 0.0
3 -10.0 0.0 0.0
3 -10.0 0.0 0.0
3 -10.0 0.0 0.0
3 -10.0 0.0 0.0
3 -10.0 0.0 0.0
3 -10.0 0.0 0.0
3 -10.0 0.0 0.0
3 -10.0 0.0 0.0
3 -10.0 0.0 0.0
3 -10.0 0.0 0.0
3 -10.0 0.0 0.0
3 -10.0 0.0 0.0
3 -10.0 0.0 0.0
3 -10.0 0.0 0.0
3 -10.0 0.0 0.0
3 -10.0 0.0 0.0
3 -10.0 0.0 0.0
3 -10.0 0.0 0.0
3 -10.0 0.0 0.0
3 -10.0 0.0 0.0
3 -10.0 0.0 0.0
3 -10.0 0.0 0.0
3 -10.0 0.0 0.0
3 -10.0 0.0 0.0
3 -10.0 0.0 0.0
3 -10.0 0.0 0.0
3 -10.0 0.0 0.0
3 -10.0 0.0 0.0
3 -10.0 0.0 0.0
3 -10.0 0.0 0.0
3 -10.0 0.0 0.0
3 -10.0 0.0 0.0
3 -10.0 0.0 0.0
3 -10.0 0.0 0.0
3 -10.0 0.0 0.0
3 -10.0 0.0 0.0
3 -10.0 0.0 0.0
3 -10.0 0.0 0.0
3 -10.0 0.0 0.0
3 -10.0 0.0 0.0
3 -10.0 0.0 0.0
3 -10.0 0.0 0.0
3 -10.0 0.0 0.0
3 -10.0 0.0 0.0
3 -10.0 0.0 0.0
3 -10.0 0.0 0.0
3 -10.0 0.0 0.0
3 -10.0 0.0 0.0
3 -10.0 0.0 0.0
3 -10.0 0.0 0.0
3 -10.0 0.0 0.0
3 -10.0 0.0 0.0
3 -10.0 0.0 0.0
3 -10.0 0.0 0.0
3 -10.0 0.0 0.0
3 -10.0 0.0 0.0
3 -10.0 0.0 0.0
3 -10.0 0.0 0.0
3 -10.0 0.0 0.0
3 -10.0 0.0 0.0
3 -10.0 0.0 0.0
3 -10.0 0.0 0.0
3 -10.0 0.0 0.0
3 -10.0 0.0 0.0
3 -10.0 0.0 0.0
3 -10.0 0.0 0.0
3 -10.0 0.0 0.0
3 -10.0 0.0 0.0
3 -10.0 0.0 0.0
3 -10.0 0.0 0.0
3 -10.0 0.0 0.0
3 -10.0 0.0 0.0
3 -10.0 0.0 0.0
3 -10.0 0.0 0.0
3 -10.0 0.0 0.0
3 -10.0 0.0 0.0
3 -10.0 0.0 0.0
3 -10.0 0.0 0.0
3 -10.0 0.0 0.0
3 -10.0 0.0 0.0
3 -10.0 0.0 0.0
3 -10.0 0.0 0.0
3 -10.0 0.0 0.0
3 -10.0 0.0 0.0
3 -10.0 0.0 0.0
3 -10.0 0.0 0.0
3 -10.0 0.0 0.0
3 -10.0 0.0 0.0
3 -10.0 0.0 0.0
3 -10.0 0.0 0.0
3 -10.0 0.0 0.0
3 -10.0 0.0 0.0
3 -10.0 0.0 0.0
3 -10.0 0.0 0.0
3 -10.0 0.0 0.0
3 -10.0 0.0 0.0
3 -10.0 0.0 0.0
3 -10.0 0.0 0.0
CDATA:
9 1 0 0 0 1 0 0 0 1
9 1 0 0 0 1 0 0 0 1
9 1 0 0 0 1 0 0 0 1
9 1 0 0 0 1 0 0 0 1
9 1 0 0 0 1 0 0 0 1
9 1 0 0 0 1 0 0 0 1
9 1 0 0 0 1 0 0 0 1
9 1 0 0 0 1 0 0 0 1
9 1 0 0 0 1 0 0 0 1
9 1 0 0 0 1 0 0 0 1
9 1 0 0 0 1 0 0 0 1
9 1 0 0 0 1 0 0 0 1
9 1 0 0 0 1 0 0 0 1
9 1 0 0 0 1 0 0 0 1
9 1 0 0 0 1 0 0 0 1
9 1 0 0 0 1 0 0 0 1
9 1 0 0 0 1 0 0 0 1
9 1 0 0 0 1 0 0 0 1
9 1 0 0 0 1 0 0 0 1
9 1 0 0 0 1 0 0 0 1
9 1 0 0 0 1 0 0 0 1
9 1 0 0 0 1 0 0 0 1
9 1 0 0 0 1 0 0 0 1
9 1 0 0 0 1 0 0 0 1
9 1 0 0 0 1 0 0 0 1
9 1 0 0 0 1 0 0 0 1
9 1 0 0 0 1 0 0 0 1
9 1 0 0 0 1 0 0 0 1
9 1 0 0 0 1 0 0 0 1
9 1 0 0 0 1 0 0 0 1
9 1 0 0 0 1 0 0 0 1
9 1 0 0 0 1 0 0 0 1
9 1 0 0 0 1 0 0 0 1
9 1 0 0 0 1 0 0 0 1
9 1 0 0 0 1 0 0 0 1
9 1 0 0 0 1 0 0 0 1
9 1 0 0 0 1 0 0 0 1
9 1 0 0 0 1 0 0 0 1
9 1 0 0 0 1 0 0 0 1
9 1 0 0 0 1 0 0 0 1
9 1 0 0 0 1 0 0 0 1
9 1 0 0 0 1 0 0 0 1
9 1 0 0 0 1 0 0 0 1
9 1 0 0 0 1 0 0 0 1
9 1 0 0 0 1 0 0 0 1
9 1 0 0 0 1 0 0 0 1
9 1 0 0 0 1 0 0 0 1
9 1 0 0 0 1 0 0 0 1
9 1 0 0 0 1 0 0 0 1
9 1 0 0 0 1 0 0 0 1
9 1 0 0 0 1 0 0 0 1
9 1 0 0 0 1 0 0 0 1
9 1 0 0 0 1 0 0 0 1
9 1 0 0 0 1 0 0 0 1
9 1 0 0 0 1 0 0 0 1
9 1 0 0 0 1 0 0 0 1
9 1 0 0 0 1 0 0 0 1
9 1 0 0 0 1 0 0 0 1
9 1 0 0 0 1 0 0 0 1
9 1 0 0 0 1 0 0 0 1
9 1 0 0 0 1 0 0 0 1
9 1 0 0 0 1 0 0 0 1
9 1 0 0 0 1 0 0 0 1
9 1 0 0 0 1 0 0 0 1
9 1 0 0 0 1 0 0 0 1
9 1 0 0 0 1 0 0 0 1
9 1 0 0 0 1 0 0 0 1
9 1 0 0 0 1 0 0 0 1
9 1 0 0 0 1 0 0 0 1
9 1 0 0 0 1 0 0 0 1
9 1 0 0 0 1 0 0 0 1
9 1 0 0 0 1 0 0 0 1
9 1 0 0 0 1 0 0 0 1
9 1 0 0 0 1 0 0 0 1
9 1 0 0 0 1 0 0 0 1
9 1 0 0 0 1 0 0 0 1
9 1 0 0 0 1 0 0 0 1
9 1 0 0 0 1 0 0 0 1
9 1 0 0 0 1 0 0 0 1
9 1 0 0 0 1 0 0 0 1
9 1 0 0 0 1 0 0 0 1
9 1 0 0 0 1 0 0 0 1
9 1 0 0 0 1 0 0 0 1
9 1 0 0 0 1 0 0 0 1
9 1 0 0 0 1 0 0 0 1
9 1 0 0 0 1 0 0 0 1
9 1 0 0 0 1 0 0 0 1
9 1 0 0 0 1 0 0 0 1
9 1 0 0 0 1 0 0 0 1
9 1 0 0 0 1 0 0 0 1
9 1 0 0 0 1 0 0 0 1
9 1 0 0 0 1 0 0 0 1
9 1 0 0 0 1 0 0 0 1
9 1 0 0 0 1 0 0 0 1
9 1 0 0 0 1 0 0 0 1
9 1 0 0 0 1 0 0 0 1
9 1 0 0 0 1 0 0 0 1
9 1 0 0 0 1 0 0 0 1
9 1 0 0 0 1 0 0 0 1
9 1 0 0 0 1 0 0 0 1
9 1 0 0 0 1 0 0 0 1
9 1 0 0 0 1 0 0 0 1
9 1 0 0 0 1 0 0 0 1
9 1 0 0 0 1 0 0 0 1
9 1 0 0 0 1 0 0 0 1
9 1 0 0 0 1 0 0 0 1
9 1 0 0 0 1 0 0 0 1
9 1 0 0 0 1 0 0 0 1
9 1 0 0 0 1 0 0 0 1
9 1 0 0 0 1 0 0 0 1
9 1 0 0 0 1 0 0 0 1
9 1 0 0 0 1 0 0 0 1
9 1 0 0 0 1 0 0 0 1
9 1 0 0 0 1 0 0 0 1
9 1 0 0 0 1 0 0 0 1
9 1 0 0 0 1 0 0 0 1
9 1 0 0 0 1 0 0 0 1
9 1 0 0 0 1 0 0 0 1
9 1 0 0 0 1 0 0 0 1
9 1 0 0 0 1 0 0 0 1
9 1 0 0 0 1 0 0 0 1
9 1 0 0 0 1 0 0 0 1
9 1 0 0 0 1 0 0 0 1
9 1 0 0 0 1 0 0 0 1
9 1 0 0 0 1 0 0 0 1
9 1 0 0 0 1 0 0 0 1
9 1 0 0 0 1 0 0 0 1
9 1 0 0 0 1 0 0 0 1
9 1 0 0 0 1 0 0 0 1
9 1 0 0 0 1 0 0 0 1
9 1 0 0 0 1 0 0 0 1
9 1 0 0 0 1 0 0 0 1
9 1 0 0 0 1 0 0 0 1
9 1 0 0 0 1 0 0 0 1
9 1 0 0 0 1 0 0 0 1
9 1 0 0 0 1 0 0 0 1
9 1 0 0 0 1 0 0 0 1
9 1 0 0 0 1 0 0 0 1
9 1 0 0 0 1 0 0 0 1
9 1 0 0 0 1 0 0 0 1
9 1 0 0 0 1 0 0 0 1
9 1 0 0 0 1 0 0 0 1
9 1 0 0 0 1 0 0 0 1
9 1 0 0 0 1 0 0 0 1
9 1 0 0 0 1 0 0 0 1
9 1 0 0 0 1 0 0 0 1
9 1 0 0 0 1 0 0 0 1
9 1 0 0 0 1 0 0 0 1
9 1 0 0 0 1 0 0 0 1
9 1 0 0 0 1 0 0 0 1
9 1 0 0 0 1 0 0 0 1
9 1 0 0 0 1 0 0 0 1
9 1 0 0 0 1 0 0 0 1
9 1 0 0 0 1 0 0 0 1
9 1 0 0 0 1 0 0 0 1
9 1 0 0 0 1 0 0 0 1
9 1 0 0 0 1 0 0 0 1
9 1 0 0 0 1 0 0 0 1
9 1 0 0 0 1 0 0 0 1
9 1 0 0 0 1 0 0 0 1
9 1 0 0 0 1 0 0 0 1
9 1 0 0 0 1 0 0 0 1
9 1 0 0 0 1 0 0 0 1
9 1 0 0 0 1 0 0 0 1
9 1 0 0 0 1 0 0 0 1
9 1 0 0 0 1 0 0 0 1
9 1 0 0 0 1 0 0 0 1
9 1 0 0 0 1 0 0 0 1
9 1 0 0 0 1 0 0 0 1
9 1 0 0 0 1 0 0 0 1
9 1 0 0 0 1 0 0 0 1
9 1 0 0 0 1 0 0 0 1
9 1 0 0 0 1 0 0 0 1
9 1 0 0 0 1 0 0 0 1
9 1 0 0 0 1 0 0 0 1
9 1 0 0 0 1 0 0 0 1
9 1 0 0 0 1 0 0 0 1
9 1 0 0 0 1 0 0 0 1
9 1 0 0 0 1 0 0 0 1
9 1 0 0 0 1 0 0 0 1
9 1 0 0 0 1 0 0 0 1
9 1 0 0 0 1 0 0 0 1
9 1 0 0 0 1 0 0 0 1
9 1 0 0 0 1 0 0 0 1
9 1 0 0 0 1 0 0 0 1
9 1 0 0 0 1 0 0 0 1
9 1 0 0 0 1 0 0 0 1
9 1 0 0 0 1 0 0 0 1
9 1 0 0 0 1 0 0 0 1
9 1 0 0 0 1 0 0 0 1
9 1 0 0 0 1 0 0 0 1
9 1 0 0 0 1 0 0 0 1
9 1 0 0 0 1 0 0 0 1
9 1 0 0 0 1 0 0 0 1
9 1 0 0 0 1 0 0 0 1
9 1 0 0 0 1 0 0 0 1
9 1 0 0 0 1 0 0 0 1
9 1 0 0 0 1 0 0 0 1
9 1 0 0 0 1 0 0 0 1
9 1 0 0 0 1 0 0 0 1
9 1 0 0 0 1 0 0 0 1
9 1 0 0 0 1 0 0 0 1
9 1 0 0 0 1 0 0 0 1
9 1 0 0 0 1 0 0 0 1
9 1 0 0 0 1 0 0 0 1
9 1 0 0 0 1 0 0 0 1
9 1 0 0 0 1 0 0 0 1
9 1 0 0 0 1 0 0 0 1
9 1 0 0 0 1 0 0 0 1
9 1 0 0 0 1 0 0 0 1
9 1 0 0 0 1 0 0 0 1
9 1 0 0 0 1 0 0 0 1
9 1 0 0 0 1 0 0 0 1
9 1 0 0 0 1 0 0 0 1
9 1 0 0 0 1 0 0 0 1
9 1 0 0 0 1 0 0 0 1
9 1 0 0 0 1 0 0 0 1
9 1 0 0 0 1 0 0 0 1
9 1 0 0 0 1 0 0 0 1
9 1 0 0 0 1 0 0 0 1
9 1 0 0 0 1 0 0 0 1
9 1 0 0 0 1 0 0 0 1
9 1 0 0 0 1 0 0 0 1
9 1 0 0 0 1 0 0 0 1
9 1 0 0 0 1 0 0 0 1
9 1 0 0 0 1 0 0 0 1
9 1 0 0 0 1 0 0 0 1
9 1 0 0 0 1 0 0 0 1
9 1 0 0 0 1 0 0 0 1
9 1 0 0 0 1 0 0 0 1
9 1 0 0 0 1 0 0 0 1
9 1 0 0 0 1 0 0 0 1
9 1 0 0 0 1 0 0 0 1
9 1 0 0 0 1 0 0 0 1
9 1 0 0 0 1 0 0 0 1
9 1 0 0 0 1 0 0 0 1
9 1 0 0 0 1 0 0 0 1
9 1 0 0 0 1 0 0 0 1
9 1 0 0 0 1 0 0 0 1
9 1 0 0 0 1 0 0 0 1
