POINTS:
0.0000 0.0000
0.0000 1.0000
1.0000 0.0000
1.0000 1.0000
2.0000 0.0000
2.0000 1.0000
3.0000 0.0000
3.0000 1.0000
4.0000 0.0000
4.0000 1.0000
5.0000 0.0000
5.0000 1.0000
6.0000 0.0000
6.0000 1.0000
7.0000 0.0000
7.0000 1.0000
8.0000 0.0000
8.0000 1.0000
9.0000 0.0000
9.0000 1.0000
10.0000 0.0000
10.0000 1.0000
CELLS:
4 0000 0 2 3 1
4 0000 2 4 5 3
4 0000 4 6 7 5
4 0000 6 8 9 7
4 0000 8 10 11 9
4 0000 10 12 13 11
4 0000 12 14 15 13
4 0000 14 16 17 15
4 0000 16 18 19 17
4 0000 18 20 21 19
FACES:
2 1 0 1
2 2 2 3
2 2 1 3
2 2 0 2
2 2 3 5
2 2 2 4
2 2 5 7
2 2 4 6
2 2 7 9
2 2 6 8
2 2 9 11
2 2 8 10
2 2 11 13
2 2 10 12
2 2 13 15
2 2 12 14
2 2 15 17
2 2 14 16
2 2 17 19
2 2 16 18
2 2 19 21
2 2 18 20
VDATA:
12 1.0 0.0 0.0 0.0 1.0 0.0 0.0 0.0 1.0 -10.0 0.0 0.0
12 1.0 0.0 0.0 0.0 1.0 0.0 0.0 0.0 1.0 -10.0 0.0 0.0
12 1.0 0.0 0.0 0.0 1.0 0.0 0.0 0.0 1.0 -10.0 0.0 0.0
12 1.0 0.0 0.0 0.0 1.0 0.0 0.0 0.0 1.0 -10.0 0.0 0.0
12 1.0 0.0 0.0 0.0 1.0 0.0 0.0 0.0 1.0 -10.0 0.0 0.0
12 1.0 0.0 0.0 0.0 1.0 0.0 0.0 0.0 1.0 -10.0 0.0 0.0
12 1.0 0.0 0.0 0.0 1.0 0.0 0.0 0.0 1.0 -10.0 0.0 0.0
12 1.0 0.0 0.0 0.0 1.0 0.0 0.0 0.0 1.0 -10.0 0.0 0.0
12 1.0 0.0 0.0 0.0 1.0 0.0 0.0 0.0 1.0 -10.0 0.0 0.0
12 1.0 0.0 0.0 0.0 1.0 0.0 0.0 0.0 1.0 -10.0 0.0 0.0
12 1.0 0.0 0.0 0.0 1.0 0.0 0.0 0.0 1.0 -10.0 0.0 0.0
12 1.0 0.0 0.0 0.0 1.0 0.0 0.0 0.0 1.0 -10.0 0.0 0.0
12 1.0 0.0 0.0 0.0 1.0 0.0 0.0 0.0 1.0 -10.0 0.0 0.0
12 1.0 0.0 0.0 0.0 1.0 0.0 0.0 0.0 1.0 -10.0 0.0 0.0
12 1.0 0.0 0.0 0.0 1.0 0.0 0.0 0.0 1.0 -10.0 0.0 0.0
12 1.0 0.0 0.0 0.0 1.0 0.0 0.0 0.0 1.0 -10.0 0.0 0.0
12 1.0 0.0 0.0 0.0 1.0 0.0 0.0 0.0 1.0 -10.0 0.0 0.0
12 1.0 0.0 0.0 0.0 1.0 0.0 0.0 0.0 1.0 -10.0 0.0 0.0
12 1.0 0.0 0.0 0.0 1.0 0.0 0.0 0.0 1.0 -10.0 0.0 0.0
12 1.0 0.0 0.0 0.0 1.0 0.0 0.0 0.0 1.0 -10.0 0.0 0.0
12 1.0 0.0 0.0 0.0 1.0 0.0 0.0 0.0 1.0 -10.0 0.0 0.0
12 1.0 0.0 0.0 0.0 1.0 0.0 0.0 0.0 1.0 -10.0 0.0 0.0
