\relax 
\@writefile{toc}{\contentsline {section}{\tocsection {}{2}{A fully coupled model in cardiac electrophysiolgy}}{2}}
\citation{cherry2017introduction,franzone2014mathematical,quarteroni2017integrated}
\citation{andreianov2015solvability}
\citation{pathmanathan2013existence}
\citation{colli2017effects}
\citation{augustin2016anatomically,franzone2015parallel,pavarino2017scalable,santiago2018fully}
\@setckpt{FullModel}{
\setcounter{page}{4}
\setcounter{equation}{0}
\setcounter{enumi}{0}
\setcounter{enumii}{0}
\setcounter{enumiii}{0}
\setcounter{enumiv}{0}
\setcounter{footnote}{0}
\setcounter{mpfootnote}{0}
\setcounter{parentequation}{0}
\setcounter{part}{0}
\setcounter{section}{2}
\setcounter{subsection}{0}
\setcounter{subsubsection}{0}
\setcounter{paragraph}{0}
\setcounter{subparagraph}{0}
\setcounter{figure}{0}
\setcounter{table}{0}
\setcounter{thrm}{0}
\setcounter{float@type}{8}
\setcounter{ContinuedFloat}{0}
\setcounter{subfigure}{0}
\setcounter{subtable}{0}
\setcounter{algorithm}{0}
\setcounter{ALC@unique}{0}
\setcounter{ALC@line}{0}
\setcounter{ALC@rem}{0}
\setcounter{ALC@depth}{0}
\setcounter{theorem}{0}
}
