POINTS:
0.0 0.0 0.0
0.0 0.0 0.5
0.0 0.0 1.0
0.0 0.0 1.5
0.0 0.0 2.0
0.0 0.0 2.5
0.0 0.0 3.0
0.0 0.5 0.0
0.0 0.5 0.5
0.0 0.5 1.0
0.0 0.5 1.5
0.0 0.5 2.0
0.0 0.5 2.5
0.0 0.5 3.0
0.0 1.0 0.0
0.0 1.0 0.5
0.0 1.0 1.0
0.0 1.0 1.5
0.0 1.0 2.0
0.0 1.0 2.5
0.0 1.0 3.0
0.0 1.5 0.0
0.0 1.5 0.5
0.0 1.5 1.0
0.0 1.5 1.5
0.0 1.5 2.0
0.0 1.5 2.5
0.0 1.5 3.0
0.0 2.0 0.0
0.0 2.0 0.5
0.0 2.0 1.0
0.0 2.0 1.5
0.0 2.0 2.0
0.0 2.0 2.5
0.0 2.0 3.0
0.0 2.5 0.0
0.0 2.5 0.5
0.0 2.5 1.0
0.0 2.5 1.5
0.0 2.5 2.0
0.0 2.5 2.5
0.0 2.5 3.0
0.0 3.0 0.0
0.0 3.0 0.5
0.0 3.0 1.0
0.0 3.0 1.5
0.0 3.0 2.0
0.0 3.0 2.5
0.0 3.0 3.0
0.5 0.0 0.0
0.5 0.0 0.5
0.5 0.0 1.0
0.5 0.0 1.5
0.5 0.0 2.0
0.5 0.0 2.5
0.5 0.0 3.0
0.5 0.5 0.0
0.5 0.5 0.5
0.5 0.5 1.0
0.5 0.5 1.5
0.5 0.5 2.0
0.5 0.5 2.5
0.5 0.5 3.0
0.5 1.0 0.0
0.5 1.0 0.5
0.5 1.0 1.0
0.5 1.0 1.5
0.5 1.0 2.0
0.5 1.0 2.5
0.5 1.0 3.0
0.5 1.5 0.0
0.5 1.5 0.5
0.5 1.5 1.0
0.5 1.5 1.5
0.5 1.5 2.0
0.5 1.5 2.5
0.5 1.5 3.0
0.5 2.0 0.0
0.5 2.0 0.5
0.5 2.0 1.0
0.5 2.0 1.5
0.5 2.0 2.0
0.5 2.0 2.5
0.5 2.0 3.0
0.5 2.5 0.0
0.5 2.5 0.5
0.5 2.5 1.0
0.5 2.5 1.5
0.5 2.5 2.0
0.5 2.5 2.5
0.5 2.5 3.0
0.5 3.0 0.0
0.5 3.0 0.5
0.5 3.0 1.0
0.5 3.0 1.5
0.5 3.0 2.0
0.5 3.0 2.5
0.5 3.0 3.0
1.0 0.0 0.0
1.0 0.0 0.5
1.0 0.0 1.0
1.0 0.0 1.5
1.0 0.0 2.0
1.0 0.0 2.5
1.0 0.0 3.0
1.0 0.5 0.0
1.0 0.5 0.5
1.0 0.5 1.0
1.0 0.5 1.5
1.0 0.5 2.0
1.0 0.5 2.5
1.0 0.5 3.0
1.0 1.0 0.0
1.0 1.0 0.5
1.0 1.0 1.0
1.0 1.0 1.5
1.0 1.0 2.0
1.0 1.0 2.5
1.0 1.0 3.0
1.0 1.5 0.0
1.0 1.5 0.5
1.0 1.5 1.0
1.0 1.5 1.5
1.0 1.5 2.0
1.0 1.5 2.5
1.0 1.5 3.0
1.0 2.0 0.0
1.0 2.0 0.5
1.0 2.0 1.0
1.0 2.0 1.5
1.0 2.0 2.0
1.0 2.0 2.5
1.0 2.0 3.0
1.0 2.5 0.0
1.0 2.5 0.5
1.0 2.5 1.0
1.0 2.5 1.5
1.0 2.5 2.0
1.0 2.5 2.5
1.0 2.5 3.0
1.0 3.0 0.0
1.0 3.0 0.5
1.0 3.0 1.0
1.0 3.0 1.5
1.0 3.0 2.0
1.0 3.0 2.5
1.0 3.0 3.0
1.5 0.0 0.0
1.5 0.0 0.5
1.5 0.0 1.0
1.5 0.0 1.5
1.5 0.0 2.0
1.5 0.0 2.5
1.5 0.0 3.0
1.5 0.5 0.0
1.5 0.5 0.5
1.5 0.5 1.0
1.5 0.5 1.5
1.5 0.5 2.0
1.5 0.5 2.5
1.5 0.5 3.0
1.5 1.0 0.0
1.5 1.0 0.5
1.5 1.0 1.0
1.5 1.0 1.5
1.5 1.0 2.0
1.5 1.0 2.5
1.5 1.0 3.0
1.5 1.5 0.0
1.5 1.5 0.5
1.5 1.5 1.0
1.5 1.5 1.5
1.5 1.5 2.0
1.5 1.5 2.5
1.5 1.5 3.0
1.5 2.0 0.0
1.5 2.0 0.5
1.5 2.0 1.0
1.5 2.0 1.5
1.5 2.0 2.0
1.5 2.0 2.5
1.5 2.0 3.0
1.5 2.5 0.0
1.5 2.5 0.5
1.5 2.5 1.0
1.5 2.5 1.5
1.5 2.5 2.0
1.5 2.5 2.5
1.5 2.5 3.0
1.5 3.0 0.0
1.5 3.0 0.5
1.5 3.0 1.0
1.5 3.0 1.5
1.5 3.0 2.0
1.5 3.0 2.5
1.5 3.0 3.0
2.0 0.0 0.0
2.0 0.0 0.5
2.0 0.0 1.0
2.0 0.0 1.5
2.0 0.0 2.0
2.0 0.0 2.5
2.0 0.0 3.0
2.0 0.5 0.0
2.0 0.5 0.5
2.0 0.5 1.0
2.0 0.5 1.5
2.0 0.5 2.0
2.0 0.5 2.5
2.0 0.5 3.0
2.0 1.0 0.0
2.0 1.0 0.5
2.0 1.0 1.0
2.0 1.0 1.5
2.0 1.0 2.0
2.0 1.0 2.5
2.0 1.0 3.0
2.0 1.5 0.0
2.0 1.5 0.5
2.0 1.5 1.0
2.0 1.5 1.5
2.0 1.5 2.0
2.0 1.5 2.5
2.0 1.5 3.0
2.0 2.0 0.0
2.0 2.0 0.5
2.0 2.0 1.0
2.0 2.0 1.5
2.0 2.0 2.0
2.0 2.0 2.5
2.0 2.0 3.0
2.0 2.5 0.0
2.0 2.5 0.5
2.0 2.5 1.0
2.0 2.5 1.5
2.0 2.5 2.0
2.0 2.5 2.5
2.0 2.5 3.0
2.0 3.0 0.0
2.0 3.0 0.5
2.0 3.0 1.0
2.0 3.0 1.5
2.0 3.0 2.0
2.0 3.0 2.5
2.0 3.0 3.0
2.5 0.0 0.0
2.5 0.0 0.5
2.5 0.0 1.0
2.5 0.0 1.5
2.5 0.0 2.0
2.5 0.0 2.5
2.5 0.0 3.0
2.5 0.5 0.0
2.5 0.5 0.5
2.5 0.5 1.0
2.5 0.5 1.5
2.5 0.5 2.0
2.5 0.5 2.5
2.5 0.5 3.0
2.5 1.0 0.0
2.5 1.0 0.5
2.5 1.0 1.0
2.5 1.0 1.5
2.5 1.0 2.0
2.5 1.0 2.5
2.5 1.0 3.0
2.5 1.5 0.0
2.5 1.5 0.5
2.5 1.5 1.0
2.5 1.5 1.5
2.5 1.5 2.0
2.5 1.5 2.5
2.5 1.5 3.0
2.5 2.0 0.0
2.5 2.0 0.5
2.5 2.0 1.0
2.5 2.0 1.5
2.5 2.0 2.0
2.5 2.0 2.5
2.5 2.0 3.0
2.5 2.5 0.0
2.5 2.5 0.5
2.5 2.5 1.0
2.5 2.5 1.5
2.5 2.5 2.0
2.5 2.5 2.5
2.5 2.5 3.0
2.5 3.0 0.0
2.5 3.0 0.5
2.5 3.0 1.0
2.5 3.0 1.5
2.5 3.0 2.0
2.5 3.0 2.5
2.5 3.0 3.0
3.0 0.0 0.0
3.0 0.0 0.5
3.0 0.0 1.0
3.0 0.0 1.5
3.0 0.0 2.0
3.0 0.0 2.5
3.0 0.0 3.0
3.0 0.5 0.0
3.0 0.5 0.5
3.0 0.5 1.0
3.0 0.5 1.5
3.0 0.5 2.0
3.0 0.5 2.5
3.0 0.5 3.0
3.0 1.0 0.0
3.0 1.0 0.5
3.0 1.0 1.0
3.0 1.0 1.5
3.0 1.0 2.0
3.0 1.0 2.5
3.0 1.0 3.0
3.0 1.5 0.0
3.0 1.5 0.5
3.0 1.5 1.0
3.0 1.5 1.5
3.0 1.5 2.0
3.0 1.5 2.5
3.0 1.5 3.0
3.0 2.0 0.0
3.0 2.0 0.5
3.0 2.0 1.0
3.0 2.0 1.5
3.0 2.0 2.0
3.0 2.0 2.5
3.0 2.0 3.0
3.0 2.5 0.0
3.0 2.5 0.5
3.0 2.5 1.0
3.0 2.5 1.5
3.0 2.5 2.0
3.0 2.5 2.5
3.0 2.5 3.0
3.0 3.0 0.0
3.0 3.0 0.5
3.0 3.0 1.0
3.0 3.0 1.5
3.0 3.0 2.0
3.0 3.0 2.5
3.0 3.0 3.0
CELLS:
8 0 0 7 56 49 1 8 57 50
8 0 1 8 57 50 2 9 58 51
8 0 2 9 58 51 3 10 59 52
8 0 3 10 59 52 4 11 60 53
8 0 4 11 60 53 5 12 61 54
8 0 5 12 61 54 6 13 62 55
8 0 7 14 63 56 8 15 64 57
8 0 8 15 64 57 9 16 65 58
8 0 9 16 65 58 10 17 66 59
8 0 10 17 66 59 11 18 67 60
8 0 11 18 67 60 12 19 68 61
8 0 12 19 68 61 13 20 69 62
8 0 14 21 70 63 15 22 71 64
8 0 15 22 71 64 16 23 72 65
8 0 16 23 72 65 17 24 73 66
8 0 17 24 73 66 18 25 74 67
8 0 18 25 74 67 19 26 75 68
8 0 19 26 75 68 20 27 76 69
8 0 21 28 77 70 22 29 78 71
8 0 22 29 78 71 23 30 79 72
8 0 23 30 79 72 24 31 80 73
8 0 24 31 80 73 25 32 81 74
8 0 25 32 81 74 26 33 82 75
8 0 26 33 82 75 27 34 83 76
8 0 28 35 84 77 29 36 85 78
8 0 29 36 85 78 30 37 86 79
8 0 30 37 86 79 31 38 87 80
8 0 31 38 87 80 32 39 88 81
8 0 32 39 88 81 33 40 89 82
8 0 33 40 89 82 34 41 90 83
8 0 35 42 91 84 36 43 92 85
8 0 36 43 92 85 37 44 93 86
8 0 37 44 93 86 38 45 94 87
8 0 38 45 94 87 39 46 95 88
8 0 39 46 95 88 40 47 96 89
8 0 40 47 96 89 41 48 97 90
8 0 49 56 105 98 50 57 106 99
8 0 50 57 106 99 51 58 107 100
8 0 51 58 107 100 52 59 108 101
8 0 52 59 108 101 53 60 109 102
8 0 53 60 109 102 54 61 110 103
8 0 54 61 110 103 55 62 111 104
8 0 56 63 112 105 57 64 113 106
8 0 57 64 113 106 58 65 114 107
8 0 58 65 114 107 59 66 115 108
8 0 59 66 115 108 60 67 116 109
8 0 60 67 116 109 61 68 117 110
8 0 61 68 117 110 62 69 118 111
8 0 63 70 119 112 64 71 120 113
8 0 64 71 120 113 65 72 121 114
8 0 65 72 121 114 66 73 122 115
8 0 66 73 122 115 67 74 123 116
8 0 67 74 123 116 68 75 124 117
8 0 68 75 124 117 69 76 125 118
8 0 70 77 126 119 71 78 127 120
8 0 71 78 127 120 72 79 128 121
8 0 72 79 128 121 73 80 129 122
8 0 73 80 129 122 74 81 130 123
8 0 74 81 130 123 75 82 131 124
8 0 75 82 131 124 76 83 132 125
8 0 77 84 133 126 78 85 134 127
8 0 78 85 134 127 79 86 135 128
8 0 79 86 135 128 80 87 136 129
8 0 80 87 136 129 81 88 137 130
8 0 81 88 137 130 82 89 138 131
8 0 82 89 138 131 83 90 139 132
8 0 84 91 140 133 85 92 141 134
8 0 85 92 141 134 86 93 142 135
8 0 86 93 142 135 87 94 143 136
8 0 87 94 143 136 88 95 144 137
8 0 88 95 144 137 89 96 145 138
8 0 89 96 145 138 90 97 146 139
8 0 98 105 154 147 99 106 155 148
8 0 99 106 155 148 100 107 156 149
8 0 100 107 156 149 101 108 157 150
8 0 101 108 157 150 102 109 158 151
8 0 102 109 158 151 103 110 159 152
8 0 103 110 159 152 104 111 160 153
8 0 105 112 161 154 106 113 162 155
8 0 106 113 162 155 107 114 163 156
8 0 107 114 163 156 108 115 164 157
8 0 108 115 164 157 109 116 165 158
8 0 109 116 165 158 110 117 166 159
8 0 110 117 166 159 111 118 167 160
8 0 112 119 168 161 113 120 169 162
8 0 113 120 169 162 114 121 170 163
8 0 114 121 170 163 115 122 171 164
8 0 115 122 171 164 116 123 172 165
8 0 116 123 172 165 117 124 173 166
8 0 117 124 173 166 118 125 174 167
8 0 119 126 175 168 120 127 176 169
8 0 120 127 176 169 121 128 177 170
8 0 121 128 177 170 122 129 178 171
8 0 122 129 178 171 123 130 179 172
8 0 123 130 179 172 124 131 180 173
8 0 124 131 180 173 125 132 181 174
8 0 126 133 182 175 127 134 183 176
8 0 127 134 183 176 128 135 184 177
8 0 128 135 184 177 129 136 185 178
8 0 129 136 185 178 130 137 186 179
8 0 130 137 186 179 131 138 187 180
8 0 131 138 187 180 132 139 188 181
8 0 133 140 189 182 134 141 190 183
8 0 134 141 190 183 135 142 191 184
8 0 135 142 191 184 136 143 192 185
8 0 136 143 192 185 137 144 193 186
8 0 137 144 193 186 138 145 194 187
8 0 138 145 194 187 139 146 195 188
8 0 147 154 203 196 148 155 204 197
8 0 148 155 204 197 149 156 205 198
8 0 149 156 205 198 150 157 206 199
8 0 150 157 206 199 151 158 207 200
8 0 151 158 207 200 152 159 208 201
8 0 152 159 208 201 153 160 209 202
8 0 154 161 210 203 155 162 211 204
8 0 155 162 211 204 156 163 212 205
8 0 156 163 212 205 157 164 213 206
8 0 157 164 213 206 158 165 214 207
8 0 158 165 214 207 159 166 215 208
8 0 159 166 215 208 160 167 216 209
8 0 161 168 217 210 162 169 218 211
8 0 162 169 218 211 163 170 219 212
8 0 163 170 219 212 164 171 220 213
8 0 164 171 220 213 165 172 221 214
8 0 165 172 221 214 166 173 222 215
8 0 166 173 222 215 167 174 223 216
8 0 168 175 224 217 169 176 225 218
8 0 169 176 225 218 170 177 226 219
8 0 170 177 226 219 171 178 227 220
8 0 171 178 227 220 172 179 228 221
8 0 172 179 228 221 173 180 229 222
8 0 173 180 229 222 174 181 230 223
8 0 175 182 231 224 176 183 232 225
8 0 176 183 232 225 177 184 233 226
8 0 177 184 233 226 178 185 234 227
8 0 178 185 234 227 179 186 235 228
8 0 179 186 235 228 180 187 236 229
8 0 180 187 236 229 181 188 237 230
8 0 182 189 238 231 183 190 239 232
8 0 183 190 239 232 184 191 240 233
8 0 184 191 240 233 185 192 241 234
8 0 185 192 241 234 186 193 242 235
8 0 186 193 242 235 187 194 243 236
8 0 187 194 243 236 188 195 244 237
8 0 196 203 252 245 197 204 253 246
8 0 197 204 253 246 198 205 254 247
8 0 198 205 254 247 199 206 255 248
8 0 199 206 255 248 200 207 256 249
8 0 200 207 256 249 201 208 257 250
8 0 201 208 257 250 202 209 258 251
8 0 203 210 259 252 204 211 260 253
8 0 204 211 260 253 205 212 261 254
8 0 205 212 261 254 206 213 262 255
8 0 206 213 262 255 207 214 263 256
8 0 207 214 263 256 208 215 264 257
8 0 208 215 264 257 209 216 265 258
8 0 210 217 266 259 211 218 267 260
8 0 211 218 267 260 212 219 268 261
8 0 212 219 268 261 213 220 269 262
8 0 213 220 269 262 214 221 270 263
8 0 214 221 270 263 215 222 271 264
8 0 215 222 271 264 216 223 272 265
8 0 217 224 273 266 218 225 274 267
8 0 218 225 274 267 219 226 275 268
8 0 219 226 275 268 220 227 276 269
8 0 220 227 276 269 221 228 277 270
8 0 221 228 277 270 222 229 278 271
8 0 222 229 278 271 223 230 279 272
8 0 224 231 280 273 225 232 281 274
8 0 225 232 281 274 226 233 282 275
8 0 226 233 282 275 227 234 283 276
8 0 227 234 283 276 228 235 284 277
8 0 228 235 284 277 229 236 285 278
8 0 229 236 285 278 230 237 286 279
8 0 231 238 287 280 232 239 288 281
8 0 232 239 288 281 233 240 289 282
8 0 233 240 289 282 234 241 290 283
8 0 234 241 290 283 235 242 291 284
8 0 235 242 291 284 236 243 292 285
8 0 236 243 292 285 237 244 293 286
8 0 245 252 301 294 246 253 302 295
8 0 246 253 302 295 247 254 303 296
8 0 247 254 303 296 248 255 304 297
8 0 248 255 304 297 249 256 305 298
8 0 249 256 305 298 250 257 306 299
8 0 250 257 306 299 251 258 307 300
8 0 252 259 308 301 253 260 309 302
8 0 253 260 309 302 254 261 310 303
8 0 254 261 310 303 255 262 311 304
8 0 255 262 311 304 256 263 312 305
8 0 256 263 312 305 257 264 313 306
8 0 257 264 313 306 258 265 314 307
8 0 259 266 315 308 260 267 316 309
8 0 260 267 316 309 261 268 317 310
8 0 261 268 317 310 262 269 318 311
8 0 262 269 318 311 263 270 319 312
8 0 263 270 319 312 264 271 320 313
8 0 264 271 320 313 265 272 321 314
8 0 266 273 322 315 267 274 323 316
8 0 267 274 323 316 268 275 324 317
8 0 268 275 324 317 269 276 325 318
8 0 269 276 325 318 270 277 326 319
8 0 270 277 326 319 271 278 327 320
8 0 271 278 327 320 272 279 328 321
8 0 273 280 329 322 274 281 330 323
8 0 274 281 330 323 275 282 331 324
8 0 275 282 331 324 276 283 332 325
8 0 276 283 332 325 277 284 333 326
8 0 277 284 333 326 278 285 334 327
8 0 278 285 334 327 279 286 335 328
8 0 280 287 336 329 281 288 337 330
8 0 281 288 337 330 282 289 338 331
8 0 282 289 338 331 283 290 339 332
8 0 283 290 339 332 284 291 340 333
8 0 284 291 340 333 285 292 341 334
8 0 285 292 341 334 286 293 342 335
FACES:
VDATA:
3 0.0 0.002 20
3 0.0 0.002 20
3 0.0 0.002 20
3 0.0 0.002 20
3 -10.0 0.0 0.0
3 -10.0 0.0 0.0
3 -10.0 0.0 0.0
3 0.0 0.002 20
3 0.0 0.002 20
3 0.0 0.002 20
3 0.0 0.002 20
3 -10.0 0.0 0.0
3 -10.0 0.0 0.0
3 -10.0 0.0 0.0
3 0.0 0.002 20
3 0.0 0.002 20
3 0.0 0.002 20
3 0.0 0.002 20
3 -10.0 0.0 0.0
3 -10.0 0.0 0.0
3 -10.0 0.0 0.0
3 0.0 0.002 20
3 0.0 0.002 20
3 0.0 0.002 20
3 0.0 0.002 20
3 -10.0 0.0 0.0
3 -10.0 0.0 0.0
3 -10.0 0.0 0.0
3 -10.0 0.0 0.0
3 -10.0 0.0 0.0
3 -10.0 0.0 0.0
3 -10.0 0.0 0.0
3 -10.0 0.0 0.0
3 -10.0 0.0 0.0
3 -10.0 0.0 0.0
3 -10.0 0.0 0.0
3 -10.0 0.0 0.0
3 -10.0 0.0 0.0
3 -10.0 0.0 0.0
3 -10.0 0.0 0.0
3 -10.0 0.0 0.0
3 -10.0 0.0 0.0
3 -10.0 0.0 0.0
3 -10.0 0.0 0.0
3 -10.0 0.0 0.0
3 -10.0 0.0 0.0
3 -10.0 0.0 0.0
3 -10.0 0.0 0.0
3 -10.0 0.0 0.0
3 0.0 0.002 20
3 0.0 0.002 20
3 0.0 0.002 20
3 0.0 0.002 20
3 -10.0 0.0 0.0
3 -10.0 0.0 0.0
3 -10.0 0.0 0.0
3 0.0 0.002 20
3 0.0 0.002 20
3 0.0 0.002 20
3 0.0 0.002 20
3 -10.0 0.0 0.0
3 -10.0 0.0 0.0
3 -10.0 0.0 0.0
3 0.0 0.002 20
3 0.0 0.002 20
3 0.0 0.002 20
3 0.0 0.002 20
3 -10.0 0.0 0.0
3 -10.0 0.0 0.0
3 -10.0 0.0 0.0
3 0.0 0.002 20
3 0.0 0.002 20
3 0.0 0.002 20
3 0.0 0.002 20
3 -10.0 0.0 0.0
3 -10.0 0.0 0.0
3 -10.0 0.0 0.0
3 -10.0 0.0 0.0
3 -10.0 0.0 0.0
3 -10.0 0.0 0.0
3 -10.0 0.0 0.0
3 -10.0 0.0 0.0
3 -10.0 0.0 0.0
3 -10.0 0.0 0.0
3 -10.0 0.0 0.0
3 -10.0 0.0 0.0
3 -10.0 0.0 0.0
3 -10.0 0.0 0.0
3 -10.0 0.0 0.0
3 -10.0 0.0 0.0
3 -10.0 0.0 0.0
3 -10.0 0.0 0.0
3 -10.0 0.0 0.0
3 -10.0 0.0 0.0
3 -10.0 0.0 0.0
3 -10.0 0.0 0.0
3 -10.0 0.0 0.0
3 -10.0 0.0 0.0
3 0.0 0.002 20
3 0.0 0.002 20
3 0.0 0.002 20
3 0.0 0.002 20
3 -10.0 0.0 0.0
3 -10.0 0.0 0.0
3 -10.0 0.0 0.0
3 0.0 0.002 20
3 0.0 0.002 20
3 0.0 0.002 20
3 0.0 0.002 20
3 -10.0 0.0 0.0
3 -10.0 0.0 0.0
3 -10.0 0.0 0.0
3 0.0 0.002 20
3 0.0 0.002 20
3 0.0 0.002 20
3 0.0 0.002 20
3 -10.0 0.0 0.0
3 -10.0 0.0 0.0
3 -10.0 0.0 0.0
3 0.0 0.002 20
3 0.0 0.002 20
3 0.0 0.002 20
3 0.0 0.002 20
3 -10.0 0.0 0.0
3 -10.0 0.0 0.0
3 -10.0 0.0 0.0
3 -10.0 0.0 0.0
3 -10.0 0.0 0.0
3 -10.0 0.0 0.0
3 -10.0 0.0 0.0
3 -10.0 0.0 0.0
3 -10.0 0.0 0.0
3 -10.0 0.0 0.0
3 -10.0 0.0 0.0
3 -10.0 0.0 0.0
3 -10.0 0.0 0.0
3 -10.0 0.0 0.0
3 -10.0 0.0 0.0
3 -10.0 0.0 0.0
3 -10.0 0.0 0.0
3 -10.0 0.0 0.0
3 -10.0 0.0 0.0
3 -10.0 0.0 0.0
3 -10.0 0.0 0.0
3 -10.0 0.0 0.0
3 -10.0 0.0 0.0
3 -10.0 0.0 0.0
3 0.0 0.002 20
3 0.0 0.002 20
3 0.0 0.002 20
3 0.0 0.002 20
3 -10.0 0.0 0.0
3 -10.0 0.0 0.0
3 -10.0 0.0 0.0
3 0.0 0.002 20
3 0.0 0.002 20
3 0.0 0.002 20
3 0.0 0.002 20
3 -10.0 0.0 0.0
3 -10.0 0.0 0.0
3 -10.0 0.0 0.0
3 0.0 0.002 20
3 0.0 0.002 20
3 0.0 0.002 20
3 0.0 0.002 20
3 -10.0 0.0 0.0
3 -10.0 0.0 0.0
3 -10.0 0.0 0.0
3 0.0 0.002 20
3 0.0 0.002 20
3 0.0 0.002 20
3 0.0 0.002 20
3 -10.0 0.0 0.0
3 -10.0 0.0 0.0
3 -10.0 0.0 0.0
3 -10.0 0.0 0.0
3 -10.0 0.0 0.0
3 -10.0 0.0 0.0
3 -10.0 0.0 0.0
3 -10.0 0.0 0.0
3 -10.0 0.0 0.0
3 -10.0 0.0 0.0
3 -10.0 0.0 0.0
3 -10.0 0.0 0.0
3 -10.0 0.0 0.0
3 -10.0 0.0 0.0
3 -10.0 0.0 0.0
3 -10.0 0.0 0.0
3 -10.0 0.0 0.0
3 -10.0 0.0 0.0
3 -10.0 0.0 0.0
3 -10.0 0.0 0.0
3 -10.0 0.0 0.0
3 -10.0 0.0 0.0
3 -10.0 0.0 0.0
3 -10.0 0.0 0.0
3 -10.0 0.0 0.0
3 -10.0 0.0 0.0
3 -10.0 0.0 0.0
3 -10.0 0.0 0.0
3 -10.0 0.0 0.0
3 -10.0 0.0 0.0
3 -10.0 0.0 0.0
3 -10.0 0.0 0.0
3 -10.0 0.0 0.0
3 -10.0 0.0 0.0
3 -10.0 0.0 0.0
3 -10.0 0.0 0.0
3 -10.0 0.0 0.0
3 -10.0 0.0 0.0
3 -10.0 0.0 0.0
3 -10.0 0.0 0.0
3 -10.0 0.0 0.0
3 -10.0 0.0 0.0
3 -10.0 0.0 0.0
3 -10.0 0.0 0.0
3 -10.0 0.0 0.0
3 -10.0 0.0 0.0
3 -10.0 0.0 0.0
3 -10.0 0.0 0.0
3 -10.0 0.0 0.0
3 -10.0 0.0 0.0
3 -10.0 0.0 0.0
3 -10.0 0.0 0.0
3 -10.0 0.0 0.0
3 -10.0 0.0 0.0
3 -10.0 0.0 0.0
3 -10.0 0.0 0.0
3 -10.0 0.0 0.0
3 -10.0 0.0 0.0
3 -10.0 0.0 0.0
3 -10.0 0.0 0.0
3 -10.0 0.0 0.0
3 -10.0 0.0 0.0
3 -10.0 0.0 0.0
3 -10.0 0.0 0.0
3 -10.0 0.0 0.0
3 -10.0 0.0 0.0
3 -10.0 0.0 0.0
3 -10.0 0.0 0.0
3 -10.0 0.0 0.0
3 -10.0 0.0 0.0
3 -10.0 0.0 0.0
3 -10.0 0.0 0.0
3 -10.0 0.0 0.0
3 -10.0 0.0 0.0
3 -10.0 0.0 0.0
3 -10.0 0.0 0.0
3 -10.0 0.0 0.0
3 -10.0 0.0 0.0
3 -10.0 0.0 0.0
3 -10.0 0.0 0.0
3 -10.0 0.0 0.0
3 -10.0 0.0 0.0
3 -10.0 0.0 0.0
3 -10.0 0.0 0.0
3 -10.0 0.0 0.0
3 -10.0 0.0 0.0
3 -10.0 0.0 0.0
3 -10.0 0.0 0.0
3 -10.0 0.0 0.0
3 -10.0 0.0 0.0
3 -10.0 0.0 0.0
3 -10.0 0.0 0.0
3 -10.0 0.0 0.0
3 -10.0 0.0 0.0
3 -10.0 0.0 0.0
3 -10.0 0.0 0.0
3 -10.0 0.0 0.0
3 -10.0 0.0 0.0
3 -10.0 0.0 0.0
3 -10.0 0.0 0.0
3 -10.0 0.0 0.0
3 -10.0 0.0 0.0
3 -10.0 0.0 0.0
3 -10.0 0.0 0.0
3 -10.0 0.0 0.0
3 -10.0 0.0 0.0
3 -10.0 0.0 0.0
3 -10.0 0.0 0.0
3 -10.0 0.0 0.0
3 -10.0 0.0 0.0
3 -10.0 0.0 0.0
3 -10.0 0.0 0.0
3 -10.0 0.0 0.0
3 -10.0 0.0 0.0
3 -10.0 0.0 0.0
3 -10.0 0.0 0.0
3 -10.0 0.0 0.0
3 -10.0 0.0 0.0
3 -10.0 0.0 0.0
3 -10.0 0.0 0.0
3 -10.0 0.0 0.0
3 -10.0 0.0 0.0
3 -10.0 0.0 0.0
3 -10.0 0.0 0.0
3 -10.0 0.0 0.0
3 -10.0 0.0 0.0
3 -10.0 0.0 0.0
3 -10.0 0.0 0.0
3 -10.0 0.0 0.0
3 -10.0 0.0 0.0
3 -10.0 0.0 0.0
3 -10.0 0.0 0.0
3 -10.0 0.0 0.0
3 -10.0 0.0 0.0
3 -10.0 0.0 0.0
3 -10.0 0.0 0.0
3 -10.0 0.0 0.0
3 -10.0 0.0 0.0
3 -10.0 0.0 0.0
3 -10.0 0.0 0.0
3 -10.0 0.0 0.0
3 -10.0 0.0 0.0
3 -10.0 0.0 0.0
3 -10.0 0.0 0.0
3 -10.0 0.0 0.0
3 -10.0 0.0 0.0
3 -10.0 0.0 0.0
3 -10.0 0.0 0.0
3 -10.0 0.0 0.0
3 -10.0 0.0 0.0
3 -10.0 0.0 0.0
3 -10.0 0.0 0.0
3 -10.0 0.0 0.0
3 -10.0 0.0 0.0
3 -10.0 0.0 0.0
3 -10.0 0.0 0.0
3 -10.0 0.0 0.0
3 -10.0 0.0 0.0
3 -10.0 0.0 0.0
3 -10.0 0.0 0.0
3 -10.0 0.0 0.0
3 -10.0 0.0 0.0
3 -10.0 0.0 0.0
3 -10.0 0.0 0.0
3 -10.0 0.0 0.0
3 -10.0 0.0 0.0
3 -10.0 0.0 0.0
3 -10.0 0.0 0.0
3 -10.0 0.0 0.0
3 -10.0 0.0 0.0
3 -10.0 0.0 0.0
CDATA:
9 1 0 0 0 1 0 0 0 1
9 1 0 0 0 1 0 0 0 1
9 1 0 0 0 1 0 0 0 1
9 1 0 0 0 1 0 0 0 1
9 1 0 0 0 1 0 0 0 1
9 1 0 0 0 1 0 0 0 1
9 1 0 0 0 1 0 0 0 1
9 1 0 0 0 1 0 0 0 1
9 1 0 0 0 1 0 0 0 1
9 1 0 0 0 1 0 0 0 1
9 1 0 0 0 1 0 0 0 1
9 1 0 0 0 1 0 0 0 1
9 1 0 0 0 1 0 0 0 1
9 1 0 0 0 1 0 0 0 1
9 1 0 0 0 1 0 0 0 1
9 1 0 0 0 1 0 0 0 1
9 1 0 0 0 1 0 0 0 1
9 1 0 0 0 1 0 0 0 1
9 1 0 0 0 1 0 0 0 1
9 1 0 0 0 1 0 0 0 1
9 1 0 0 0 1 0 0 0 1
9 1 0 0 0 1 0 0 0 1
9 1 0 0 0 1 0 0 0 1
9 1 0 0 0 1 0 0 0 1
9 1 0 0 0 1 0 0 0 1
9 1 0 0 0 1 0 0 0 1
9 1 0 0 0 1 0 0 0 1
9 1 0 0 0 1 0 0 0 1
9 1 0 0 0 1 0 0 0 1
9 1 0 0 0 1 0 0 0 1
9 1 0 0 0 1 0 0 0 1
9 1 0 0 0 1 0 0 0 1
9 1 0 0 0 1 0 0 0 1
9 1 0 0 0 1 0 0 0 1
9 1 0 0 0 1 0 0 0 1
9 1 0 0 0 1 0 0 0 1
9 1 0 0 0 1 0 0 0 1
9 1 0 0 0 1 0 0 0 1
9 1 0 0 0 1 0 0 0 1
9 1 0 0 0 1 0 0 0 1
9 1 0 0 0 1 0 0 0 1
9 1 0 0 0 1 0 0 0 1
9 1 0 0 0 1 0 0 0 1
9 1 0 0 0 1 0 0 0 1
9 1 0 0 0 1 0 0 0 1
9 1 0 0 0 1 0 0 0 1
9 1 0 0 0 1 0 0 0 1
9 1 0 0 0 1 0 0 0 1
9 1 0 0 0 1 0 0 0 1
9 1 0 0 0 1 0 0 0 1
9 1 0 0 0 1 0 0 0 1
9 1 0 0 0 1 0 0 0 1
9 1 0 0 0 1 0 0 0 1
9 1 0 0 0 1 0 0 0 1
9 1 0 0 0 1 0 0 0 1
9 1 0 0 0 1 0 0 0 1
9 1 0 0 0 1 0 0 0 1
9 1 0 0 0 1 0 0 0 1
9 1 0 0 0 1 0 0 0 1
9 1 0 0 0 1 0 0 0 1
9 1 0 0 0 1 0 0 0 1
9 1 0 0 0 1 0 0 0 1
9 1 0 0 0 1 0 0 0 1
9 1 0 0 0 1 0 0 0 1
9 1 0 0 0 1 0 0 0 1
9 1 0 0 0 1 0 0 0 1
9 1 0 0 0 1 0 0 0 1
9 1 0 0 0 1 0 0 0 1
9 1 0 0 0 1 0 0 0 1
9 1 0 0 0 1 0 0 0 1
9 1 0 0 0 1 0 0 0 1
9 1 0 0 0 1 0 0 0 1
9 1 0 0 0 1 0 0 0 1
9 1 0 0 0 1 0 0 0 1
9 1 0 0 0 1 0 0 0 1
9 1 0 0 0 1 0 0 0 1
9 1 0 0 0 1 0 0 0 1
9 1 0 0 0 1 0 0 0 1
9 1 0 0 0 1 0 0 0 1
9 1 0 0 0 1 0 0 0 1
9 1 0 0 0 1 0 0 0 1
9 1 0 0 0 1 0 0 0 1
9 1 0 0 0 1 0 0 0 1
9 1 0 0 0 1 0 0 0 1
9 1 0 0 0 1 0 0 0 1
9 1 0 0 0 1 0 0 0 1
9 1 0 0 0 1 0 0 0 1
9 1 0 0 0 1 0 0 0 1
9 1 0 0 0 1 0 0 0 1
9 1 0 0 0 1 0 0 0 1
9 1 0 0 0 1 0 0 0 1
9 1 0 0 0 1 0 0 0 1
9 1 0 0 0 1 0 0 0 1
9 1 0 0 0 1 0 0 0 1
9 1 0 0 0 1 0 0 0 1
9 1 0 0 0 1 0 0 0 1
9 1 0 0 0 1 0 0 0 1
9 1 0 0 0 1 0 0 0 1
9 1 0 0 0 1 0 0 0 1
9 1 0 0 0 1 0 0 0 1
9 1 0 0 0 1 0 0 0 1
9 1 0 0 0 1 0 0 0 1
9 1 0 0 0 1 0 0 0 1
9 1 0 0 0 1 0 0 0 1
9 1 0 0 0 1 0 0 0 1
9 1 0 0 0 1 0 0 0 1
9 1 0 0 0 1 0 0 0 1
9 1 0 0 0 1 0 0 0 1
9 1 0 0 0 1 0 0 0 1
9 1 0 0 0 1 0 0 0 1
9 1 0 0 0 1 0 0 0 1
9 1 0 0 0 1 0 0 0 1
9 1 0 0 0 1 0 0 0 1
9 1 0 0 0 1 0 0 0 1
9 1 0 0 0 1 0 0 0 1
9 1 0 0 0 1 0 0 0 1
9 1 0 0 0 1 0 0 0 1
9 1 0 0 0 1 0 0 0 1
9 1 0 0 0 1 0 0 0 1
9 1 0 0 0 1 0 0 0 1
9 1 0 0 0 1 0 0 0 1
9 1 0 0 0 1 0 0 0 1
9 1 0 0 0 1 0 0 0 1
9 1 0 0 0 1 0 0 0 1
9 1 0 0 0 1 0 0 0 1
9 1 0 0 0 1 0 0 0 1
9 1 0 0 0 1 0 0 0 1
9 1 0 0 0 1 0 0 0 1
9 1 0 0 0 1 0 0 0 1
9 1 0 0 0 1 0 0 0 1
9 1 0 0 0 1 0 0 0 1
9 1 0 0 0 1 0 0 0 1
9 1 0 0 0 1 0 0 0 1
9 1 0 0 0 1 0 0 0 1
9 1 0 0 0 1 0 0 0 1
9 1 0 0 0 1 0 0 0 1
9 1 0 0 0 1 0 0 0 1
9 1 0 0 0 1 0 0 0 1
9 1 0 0 0 1 0 0 0 1
9 1 0 0 0 1 0 0 0 1
9 1 0 0 0 1 0 0 0 1
9 1 0 0 0 1 0 0 0 1
9 1 0 0 0 1 0 0 0 1
9 1 0 0 0 1 0 0 0 1
9 1 0 0 0 1 0 0 0 1
9 1 0 0 0 1 0 0 0 1
9 1 0 0 0 1 0 0 0 1
9 1 0 0 0 1 0 0 0 1
9 1 0 0 0 1 0 0 0 1
9 1 0 0 0 1 0 0 0 1
9 1 0 0 0 1 0 0 0 1
9 1 0 0 0 1 0 0 0 1
9 1 0 0 0 1 0 0 0 1
9 1 0 0 0 1 0 0 0 1
9 1 0 0 0 1 0 0 0 1
9 1 0 0 0 1 0 0 0 1
9 1 0 0 0 1 0 0 0 1
9 1 0 0 0 1 0 0 0 1
9 1 0 0 0 1 0 0 0 1
9 1 0 0 0 1 0 0 0 1
9 1 0 0 0 1 0 0 0 1
9 1 0 0 0 1 0 0 0 1
9 1 0 0 0 1 0 0 0 1
9 1 0 0 0 1 0 0 0 1
9 1 0 0 0 1 0 0 0 1
9 1 0 0 0 1 0 0 0 1
9 1 0 0 0 1 0 0 0 1
9 1 0 0 0 1 0 0 0 1
9 1 0 0 0 1 0 0 0 1
9 1 0 0 0 1 0 0 0 1
9 1 0 0 0 1 0 0 0 1
9 1 0 0 0 1 0 0 0 1
9 1 0 0 0 1 0 0 0 1
9 1 0 0 0 1 0 0 0 1
9 1 0 0 0 1 0 0 0 1
9 1 0 0 0 1 0 0 0 1
9 1 0 0 0 1 0 0 0 1
9 1 0 0 0 1 0 0 0 1
9 1 0 0 0 1 0 0 0 1
9 1 0 0 0 1 0 0 0 1
9 1 0 0 0 1 0 0 0 1
9 1 0 0 0 1 0 0 0 1
9 1 0 0 0 1 0 0 0 1
9 1 0 0 0 1 0 0 0 1
9 1 0 0 0 1 0 0 0 1
9 1 0 0 0 1 0 0 0 1
9 1 0 0 0 1 0 0 0 1
9 1 0 0 0 1 0 0 0 1
9 1 0 0 0 1 0 0 0 1
9 1 0 0 0 1 0 0 0 1
9 1 0 0 0 1 0 0 0 1
9 1 0 0 0 1 0 0 0 1
9 1 0 0 0 1 0 0 0 1
9 1 0 0 0 1 0 0 0 1
9 1 0 0 0 1 0 0 0 1
9 1 0 0 0 1 0 0 0 1
9 1 0 0 0 1 0 0 0 1
9 1 0 0 0 1 0 0 0 1
9 1 0 0 0 1 0 0 0 1
9 1 0 0 0 1 0 0 0 1
9 1 0 0 0 1 0 0 0 1
9 1 0 0 0 1 0 0 0 1
9 1 0 0 0 1 0 0 0 1
9 1 0 0 0 1 0 0 0 1
9 1 0 0 0 1 0 0 0 1
9 1 0 0 0 1 0 0 0 1
9 1 0 0 0 1 0 0 0 1
9 1 0 0 0 1 0 0 0 1
9 1 0 0 0 1 0 0 0 1
9 1 0 0 0 1 0 0 0 1
9 1 0 0 0 1 0 0 0 1
9 1 0 0 0 1 0 0 0 1
9 1 0 0 0 1 0 0 0 1
9 1 0 0 0 1 0 0 0 1
9 1 0 0 0 1 0 0 0 1
9 1 0 0 0 1 0 0 0 1
