POINTS:
0.0 0.0
0.0 1.0
0.0 2.0
0.0 3.0
1.0 0.0
1.0 1.0
1.0 2.0
1.0 3.0
2.0 0.0
2.0 1.0
2.0 2.0
2.0 3.0
3.0 0.0
3.0 1.0
3.0 2.0
3.0 3.0
CELLS:
4 0 0 4 5 1
4 0 1 5 6 2
4 0 2 6 7 3
4 0 4 8 9 5
4 0 5 9 10 6
4 0 6 10 11 7
4 0 8 12 13 9
4 0 9 13 14 10
4 0 10 14 15 11
FACES:
VDATA:
3 0.0 0.002 20
3 0.0 0.002 20
3 -10.0 0.0 0.0
3 -10.0 0.0 0.0
3 0.0 0.002 20
3 0.0 0.002 20
3 -10.0 0.0 0.0
3 -10.0 0.0 0.0
3 -10.0 0.0 0.0
3 -10.0 0.0 0.0
3 -10.0 0.0 0.0
3 -10.0 0.0 0.0
3 -10.0 0.0 0.0
3 -10.0 0.0 0.0
3 -10.0 0.0 0.0
3 -10.0 0.0 0.0
CDATA:
9 1 0 0 0 1 0 0 0 1
9 1 0 0 0 1 0 0 0 1
9 1 0 0 0 1 0 0 0 1
9 1 0 0 0 1 0 0 0 1
9 1 0 0 0 1 0 0 0 1
9 1 0 0 0 1 0 0 0 1
9 1 0 0 0 1 0 0 0 1
9 1 0 0 0 1 0 0 0 1
9 1 0 0 0 1 0 0 0 1
