\relax 
\@writefile{toc}{\contentsline {section}{\tocsection {}{9}{The circulartory system}}{23}}
\newlabel{sec:circulartory}{{9}{23}}
\@writefile{lof}{\contentsline {figure}{\numberline {1}{\ignorespaces Schematic of the circulatory system model with the pressure values $p$, resistances $R$, and compliances $C$.\relax }}{23}}
\providecommand*\caption@xref[2]{\@setref\relax\@undefined{#1}}
\newlabel{fig:CircModel}{{1}{23}}
\newlabel{eq:v}{{27}{24}}
\@writefile{toc}{\contentsline {paragraph}{\tocparagraph {}{}{\bf  The incremental realization}}{24}}
\@setckpt{Circulartory}{
\setcounter{page}{25}
\setcounter{equation}{27}
\setcounter{enumi}{3}
\setcounter{enumii}{0}
\setcounter{enumiii}{0}
\setcounter{enumiv}{0}
\setcounter{footnote}{0}
\setcounter{mpfootnote}{0}
\setcounter{parentequation}{20}
\setcounter{part}{0}
\setcounter{section}{9}
\setcounter{subsection}{0}
\setcounter{subsubsection}{0}
\setcounter{paragraph}{0}
\setcounter{subparagraph}{0}
\setcounter{figure}{1}
\setcounter{table}{0}
\setcounter{thrm}{0}
\setcounter{float@type}{8}
\setcounter{ContinuedFloat}{0}
\setcounter{subfigure}{0}
\setcounter{subtable}{0}
\setcounter{algorithm}{0}
\setcounter{ALC@unique}{0}
\setcounter{ALC@line}{0}
\setcounter{ALC@rem}{0}
\setcounter{ALC@depth}{0}
\setcounter{theorem}{0}
}
