POINTS:
0 0 0
0 0 1
0 1 0
0 1 1
1 0 0
1 0 1
1 1 0
1 1 1
CELLS:
8 0 0 4 6 2 1 5 7 3
FACES:
4 1 0 2 6 4
4 1 0 4 5 1
4 1 4 6 7 5
4 1 6 2 3 7
4 1 2 0 1 3
4 1 1 5 7 3
VDATA:
3 -10.0 0.0 0.0
3 -10.0 0.0 0.0
3 -10.0 0.0 0.0
3 -10.0 0.0 0.0
3 -10.0 0.0 0.0
3 -10.0 0.0 0.0
3 -10.0 0.0 0.0
3 -10.0 0.0 0.0
CDATA:
9 1 0 0 0 1 0 0 0 1
