/* XPM */
static char * NoFigure_xpm[] = {
"237 82 11 1",
" 	c None",
".	c #FFFFFF",
"+	c #555555",
"@	c #727272",
"#	c #8E8E8E",
"$	c #C7C7C7",
"%	c #1D1D1D",
"&	c #000000",
"*	c #AAAAAA",
"=	c #E3E3E3",
"-	c #393939",
".............................................................................................................................................................................................................................................",
".............................................................................................................................................................................................................................................",
".............................................................................................................................................................................................................................................",
".............................................................................................................................................................................................................................................",
".............................................................................................................................................................................................................................................",
".............................................................................................................................................................................................................................................",
".............................................................................................................................................................................................................................................",
".............................................................................................................................................................................................................................................",
".............................................................................................................................................................................................................................................",
".............................................................................................................................................................................................................................................",
".............................................................................................................................................................................................................................................",
".............................................................................................................................................................................................................................................",
".............................................................................................................................................................................................................................................",
".............................................................................................................................................................................................................................................",
".............................................................................................................................................................................................................................................",
".............................................................................................................................................................................................................................................",
".............................................................................................................................................................................................................................................",
".............................................................................................................................................................................................................................................",
".............................................................................................................................................................................................................................................",
".............................................................................................................................................................................................................................................",
".............................................................................................................................................................................................................................................",
".............................................................................................................................................................................................................................................",
".............................................................................................................................................................................................................................................",
".............................................................................................................................................................................................................................................",
".............................................................................................................................................................................................................................................",
".............................................................................................................................................................................................................................................",
".............................................................................................................................................................................................................................................",
".............................................................................................................................................................................................................................................",
".............................................................................................................................................................................................................................................",
".............................................................................................................................................................................................................................................",
".............................................................................................................................................................................................................................................",
".............................................................................................................................................................................................................................................",
".............................................................................................................................................................................................................................................",
".............................................................................................................................................................................................................................................",
".....................++@........#+$........................@%&+.$+#................................................................................................#+$..$+#................++...........$+#..................................",
".....................&&&*.......+&*.......................#&&+@.*&+................................................................................................+&*..*&+................&&...........*&+..................................",
".....................&&&%.......+&*.......................+&#...$+#................................................................................................#+$..*&+................&&...........*&+..................................",
".....................&&%&@......+&*.......................+&*...........................................................................................................*&+................&&...........*&+..................................",
".....................&&*&&$.....+&*......$**$.............+&*............***.........................$*.....$**$...............=***$.....................****...........*&+......****......&&..$**=.....*&+......=***........................",
".....................&&.-&-.....+&*....$%&&&&-$.........*&&&&&+.*&+....*&&&&%*+&*..+&*.....+&*...&&=-&&...#%&&&&-=...........$-&&&&&%$..#&&......#&-..=@&&&&&&#....+&*..*&+...=@&&&&&&#....&&=-&&&&@....*&+....$-&&&&%*......................",
".....................&&.=&&#....+&*...$&&@**+&&$........$+%&-+#.*&+...*&&@**-&%&*..+&*.....+&*...&&+&&&..@&&@**-&%=.........=&&-***-&%..=&&*.....%&#..-&%#**@&&$...+&*..*&+...-&%#**@&&$...&&%%#*#%&+...*&+...$&&-**@&&*.....................",
".....................&&..#&&=...+&*...%&*....#&%..........+&*...*&+..=&&*....+&&*..+&*.....+&*...&&&#...$&%=....@&@.........@&-.....-&*..-&+....$&&..$&&=....#&+...+&*..*&+..$&&=....#&+...&&%=...=%&#..*&+...%&*....$&%.....................",
".....................&&...-&+...+&*..*&-......%&$.........+&*...*&+..*&-.....=&&*..+&*.....+&*...&&#....@&#......&&.........#+$.....+&*..*&&....@&@..$+#.....*&+...+&*..*&+..$+#.....*&+...&&#.....#&+..*&+..$&-......+&*....................",
".....................&&...=&&*..+&*..@&@......@&@.........+&*...*&+..+&#......-&*..+&*.....+&*...&&.....%&.......+&$..............$#&&*...&&*...%&$........=*%&+...+&*..*&+........=*%&+...&&=.....=&&..*&+..@&*......*&@....................",
".....................&&....@&%..+&*..+&*......*&+.........+&*...*&+..+&*......+&*..+&*.....+&*...&&.....&&&&&&&&&&&*.........=@-&&&&&&*...+&@..*&%.....#+&&&&&&+...+&*..*&+....#+&&&&&&+...&&.......&&..*&+..+&&&&&&&&&&+....................",
".....................&&.....%&@.+&*..+&*......*&+.........+&*...*&+..+&*......+&*..+&*.....+&*...&&.....&&+++++++++$........$&&&++#$+&*...$&%..+&#....%&&-+@**&+...+&*..*&+...%&&-+@**&+...&&.......&&..*&+..+&-++++++++#....................",
".....................&&.....$&&$+&*..@&#......#&@.........+&*...*&+..@&#......+&*..+&*.....+&*...&&.....&&..................-&+.....+&*....%&$.&&=...#&%=....*&+...+&*..*&+..#&%=....*&+...&&......=&%..*&+..+&*.............................",
".....................&&......@&-+&*..*&-......-&*.........+&*...*&+..*&-......%&*..+&*.....&&*...&&.....+&*......++.........&&......-&*....@&@#&-....+&*.....#&+...+&*..*&+..+&*.....#&+...&&$.....#&+..*&+..*&+......#+$....................",
".....................&&......=%&&&*...%&$....$&%..........+&*...*&+...%&$....*&&*..+&@....#&&*...&&.....#&-.....#&-.........&&=....*&&*....=&%-&*....+&#....=%&+...+&*..*&+..+&#....=%&+...&&+.....%&$..*&+..=&&=....=&&=....................",
".....................&&.......*&&&*...*&%#..#%&*..........+&*...*&+...#&%$..#&&&*..*&&*..#&%&*...&&......-&+$..#&&$.........-&+=.=@&&&#=....-&&%.....#&%$..#%&&-.=.+&*..*&+..#&%$..#%&&-.=.&&&+=.=+&-...*&+...#&%*..$%&@.....................",
".....................&&........+&&*....*&&&&&&*...........+&*...*&+....@&&&&&++&*...+&&&&&#+&*...&&......=-&&&&&&*..........=%&&&&&##&&+....#&&@......+&&&&&+$&&&..+&*..*&+...+&&&&&+$&&&..&&*&&&&&-=...*&+....@&&&&&&+......................",
".....................**........=**=.....=#++#=............$*=...=*$.....$@++*.+&*....*+++$.$*=...**........*+++#=............=@++#=..#+$.....**=.......#++@$..$+#..$*=..=*$....#++@$..$+#..**.$+++*.....=*$.....$@++@$.......................",
"..............................................................................%&$............................................................................................................................................................",
".....................................................................$&&.....*&%.............................................................................................................................................................",
"......................................................................-&-$..#%&*.............................................................................................................................................................",
"......................................................................=%&&&&&&#..............................................................................................................................................................",
".............................................................................................................................................................................................................................................",
".............................................................................................................................................................................................................................................",
".............................................................................................................................................................................................................................................",
".............................................................................................................................................................................................................................................",
".............................................................................................................................................................................................................................................",
".............................................................................................................................................................................................................................................",
".............................................................................................................................................................................................................................................",
".............................................................................................................................................................................................................................................",
".............................................................................................................................................................................................................................................",
".............................................................................................................................................................................................................................................",
".............................................................................................................................................................................................................................................",
".............................................................................................................................................................................................................................................",
".............................................................................................................................................................................................................................................",
".............................................................................................................................................................................................................................................",
".............................................................................................................................................................................................................................................",
".............................................................................................................................................................................................................................................",
".............................................................................................................................................................................................................................................",
".............................................................................................................................................................................................................................................",
".............................................................................................................................................................................................................................................",
".............................................................................................................................................................................................................................................",
".............................................................................................................................................................................................................................................",
".............................................................................................................................................................................................................................................",
".............................................................................................................................................................................................................................................",
".............................................................................................................................................................................................................................................",
".............................................................................................................................................................................................................................................",
"............................................................................................................................................................................................................................................."};
