\relax 
\citation{ForceLengthRelation}
\citation{integratedheart}
\citation{LandCellModel}
\@writefile{toc}{\contentsline {section}{\tocsection {}{6}{The cell-contraction model}}{10}}
\newlabel{sec:force}{{6}{10}}
\@writefile{toc}{\contentsline {paragraph}{\tocparagraph {}{}{\bf  The Stretch Model}}{10}}
\newlabel{gammaODE}{{10}{10}}
\newlabel{gammaODE2}{{10b}{10}}
\@writefile{toc}{\contentsline {paragraph}{\tocparagraph {}{}{\bf  The Land Tension Cell Model}}{10}}
\newlabel{eq:troponin}{{11}{10}}
\@setckpt{ForceModel}{
\setcounter{page}{13}
\setcounter{equation}{24}
\setcounter{enumi}{3}
\setcounter{enumii}{0}
\setcounter{enumiii}{0}
\setcounter{enumiv}{0}
\setcounter{footnote}{0}
\setcounter{mpfootnote}{0}
\setcounter{parentequation}{20}
\setcounter{part}{0}
\setcounter{section}{6}
\setcounter{subsection}{0}
\setcounter{subsubsection}{0}
\setcounter{paragraph}{0}
\setcounter{subparagraph}{0}
\setcounter{figure}{0}
\setcounter{table}{0}
\setcounter{thrm}{0}
\setcounter{float@type}{8}
\setcounter{ContinuedFloat}{0}
\setcounter{subfigure}{0}
\setcounter{subtable}{0}
\setcounter{algorithm}{0}
\setcounter{ALC@unique}{0}
\setcounter{ALC@line}{0}
\setcounter{ALC@rem}{0}
\setcounter{ALC@depth}{0}
\setcounter{theorem}{0}
}
