POINTS:
0.0 0.0
0.0 0.1
0.1 0.0
0.1 0.1
0.2 0.0
0.2 0.1
0.3 0.0
0.3 0.1
0.4 0.0
0.4 0.1
0.5 0.0
0.5 0.1
0.6 0.0
0.6 0.1
0.7 0.0
0.7 0.1
0.8 0.0
0.8 0.1
0.9 0.0
0.9 0.1
1.0 0.0
1.0 0.1
1.1 0.0
1.1 0.1
1.2 0.0
1.2 0.1
1.3 0.0
1.3 0.1
1.4 0.0
1.4 0.1
1.5 0.0
1.5 0.1
1.6 0.0
1.6 0.1
1.7 0.0
1.7 0.1
1.8 0.0
1.8 0.1
1.9 0.0
1.9 0.1
2.0 0.0
2.0 0.1
2.1 0.0
2.1 0.1
2.2 0.0
2.2 0.1
2.3 0.0
2.3 0.1
2.4 0.0
2.4 0.1
2.5 0.0
2.5 0.1
2.6 0.0
2.6 0.1
2.7 0.0
2.7 0.1
2.8 0.0
2.8 0.1
2.9 0.0
2.9 0.1
3.0 0.0
3.0 0.1
3.1 0.0
3.1 0.1
3.2 0.0
3.2 0.1
3.3 0.0
3.3 0.1
3.4 0.0
3.4 0.1
3.5 0.0
3.5 0.1
3.6 0.0
3.6 0.1
3.7 0.0
3.7 0.1
3.8 0.0
3.8 0.1
3.9 0.0
3.9 0.1
4.0 0.0
4.0 0.1
4.1 0.0
4.1 0.1
4.2 0.0
4.2 0.1
4.3 0.0
4.3 0.1
4.4 0.0
4.4 0.1
4.5 0.0
4.5 0.1
4.6 0.0
4.6 0.1
4.7 0.0
4.7 0.1
4.8 0.0
4.8 0.1
4.9 0.0
4.9 0.1
5.0 0.0
5.0 0.1
5.1 0.0
5.1 0.1
5.2 0.0
5.2 0.1
5.3 0.0
5.3 0.1
5.4 0.0
5.4 0.1
5.5 0.0
5.5 0.1
5.6 0.0
5.6 0.1
5.7 0.0
5.7 0.1
5.8 0.0
5.8 0.1
5.9 0.0
5.9 0.1
6.0 0.0
6.0 0.1
6.1 0.0
6.1 0.1
6.2 0.0
6.2 0.1
6.3 0.0
6.3 0.1
6.4 0.0
6.4 0.1
6.5 0.0
6.5 0.1
6.6 0.0
6.6 0.1
6.7 0.0
6.7 0.1
6.8 0.0
6.8 0.1
6.9 0.0
6.9 0.1
7.0 0.0
7.0 0.1
7.1 0.0
7.1 0.1
7.2 0.0
7.2 0.1
7.3 0.0
7.3 0.1
7.4 0.0
7.4 0.1
7.5 0.0
7.5 0.1
7.6 0.0
7.6 0.1
7.7 0.0
7.7 0.1
7.8 0.0
7.8 0.1
7.9 0.0
7.9 0.1
8.0 0.0
8.0 0.1
8.1 0.0
8.1 0.1
8.2 0.0
8.2 0.1
8.3 0.0
8.3 0.1
8.4 0.0
8.4 0.1
8.5 0.0
8.5 0.1
8.6 0.0
8.6 0.1
8.7 0.0
8.7 0.1
8.8 0.0
8.8 0.1
8.9 0.0
8.9 0.1
9.0 0.0
9.0 0.1
9.1 0.0
9.1 0.1
9.2 0.0
9.2 0.1
9.3 0.0
9.3 0.1
9.4 0.0
9.4 0.1
9.5 0.0
9.5 0.1
9.6 0.0
9.6 0.1
9.7 0.0
9.7 0.1
9.8 0.0
9.8 0.1
9.9 0.0
9.9 0.1
10.0 0.0
10.0 0.1
CELLS:
3 0 0 2 3
3 0 0 3 1
3 0 2 4 5
3 0 2 5 3
3 0 4 6 7
3 0 4 7 5
3 0 6 8 9
3 0 6 9 7
3 0 8 10 11
3 0 8 11 9
3 0 10 12 13
3 0 10 13 11
3 0 12 14 15
3 0 12 15 13
3 0 14 16 17
3 0 14 17 15
3 0 16 18 19
3 0 16 19 17
3 0 18 20 21
3 0 18 21 19
3 0 20 22 23
3 0 20 23 21
3 0 22 24 25
3 0 22 25 23
3 0 24 26 27
3 0 24 27 25
3 0 26 28 29
3 0 26 29 27
3 0 28 30 31
3 0 28 31 29
3 0 30 32 33
3 0 30 33 31
3 0 32 34 35
3 0 32 35 33
3 0 34 36 37
3 0 34 37 35
3 0 36 38 39
3 0 36 39 37
3 0 38 40 41
3 0 38 41 39
3 0 40 42 43
3 0 40 43 41
3 0 42 44 45
3 0 42 45 43
3 0 44 46 47
3 0 44 47 45
3 0 46 48 49
3 0 46 49 47
3 0 48 50 51
3 0 48 51 49
3 0 50 52 53
3 0 50 53 51
3 0 52 54 55
3 0 52 55 53
3 0 54 56 57
3 0 54 57 55
3 0 56 58 59
3 0 56 59 57
3 0 58 60 61
3 0 58 61 59
3 0 60 62 63
3 0 60 63 61
3 0 62 64 65
3 0 62 65 63
3 0 64 66 67
3 0 64 67 65
3 0 66 68 69
3 0 66 69 67
3 0 68 70 71
3 0 68 71 69
3 0 70 72 73
3 0 70 73 71
3 0 72 74 75
3 0 72 75 73
3 0 74 76 77
3 0 74 77 75
3 0 76 78 79
3 0 76 79 77
3 0 78 80 81
3 0 78 81 79
3 0 80 82 83
3 0 80 83 81
3 0 82 84 85
3 0 82 85 83
3 0 84 86 87
3 0 84 87 85
3 0 86 88 89
3 0 86 89 87
3 0 88 90 91
3 0 88 91 89
3 0 90 92 93
3 0 90 93 91
3 0 92 94 95
3 0 92 95 93
3 0 94 96 97
3 0 94 97 95
3 0 96 98 99
3 0 96 99 97
3 0 98 100 101
3 0 98 101 99
3 0 100 102 103
3 0 100 103 101
3 0 102 104 105
3 0 102 105 103
3 0 104 106 107
3 0 104 107 105
3 0 106 108 109
3 0 106 109 107
3 0 108 110 111
3 0 108 111 109
3 0 110 112 113
3 0 110 113 111
3 0 112 114 115
3 0 112 115 113
3 0 114 116 117
3 0 114 117 115
3 0 116 118 119
3 0 116 119 117
3 0 118 120 121
3 0 118 121 119
3 0 120 122 123
3 0 120 123 121
3 0 122 124 125
3 0 122 125 123
3 0 124 126 127
3 0 124 127 125
3 0 126 128 129
3 0 126 129 127
3 0 128 130 131
3 0 128 131 129
3 0 130 132 133
3 0 130 133 131
3 0 132 134 135
3 0 132 135 133
3 0 134 136 137
3 0 134 137 135
3 0 136 138 139
3 0 136 139 137
3 0 138 140 141
3 0 138 141 139
3 0 140 142 143
3 0 140 143 141
3 0 142 144 145
3 0 142 145 143
3 0 144 146 147
3 0 144 147 145
3 0 146 148 149
3 0 146 149 147
3 0 148 150 151
3 0 148 151 149
3 0 150 152 153
3 0 150 153 151
3 0 152 154 155
3 0 152 155 153
3 0 154 156 157
3 0 154 157 155
3 0 156 158 159
3 0 156 159 157
3 0 158 160 161
3 0 158 161 159
3 0 160 162 163
3 0 160 163 161
3 0 162 164 165
3 0 162 165 163
3 0 164 166 167
3 0 164 167 165
3 0 166 168 169
3 0 166 169 167
3 0 168 170 171
3 0 168 171 169
3 0 170 172 173
3 0 170 173 171
3 0 172 174 175
3 0 172 175 173
3 0 174 176 177
3 0 174 177 175
3 0 176 178 179
3 0 176 179 177
3 0 178 180 181
3 0 178 181 179
3 0 180 182 183
3 0 180 183 181
3 0 182 184 185
3 0 182 185 183
3 0 184 186 187
3 0 184 187 185
3 0 186 188 189
3 0 186 189 187
3 0 188 190 191
3 0 188 191 189
3 0 190 192 193
3 0 190 193 191
3 0 192 194 195
3 0 192 195 193
3 0 194 196 197
3 0 194 197 195
3 0 196 198 199
3 0 196 199 197
3 0 198 200 201
3 0 198 201 199
FACES:
2 199 0 1
VDATA:
3 0.0 0.002 20
3 0.0 0.002 20
3 0.0 0.002 20
3 0.0 0.002 20
3 0.0 0.002 20
3 0.0 0.002 20
3 0.0 0.002 20
3 0.0 0.002 20
3 0.0 0.002 20
3 0.0 0.002 20
3 0.0 0.002 20
3 0.0 0.002 20
3 0.0 0.002 20
3 0.0 0.002 20
3 0.0 0.002 20
3 0.0 0.002 20
3 0.0 0.002 20
3 0.0 0.002 20
3 0.0 0.002 20
3 0.0 0.002 20
3 0.0 0.002 20
3 0.0 0.002 20
3 -10.0 0.0 0.0
3 -10.0 0.0 0.0
3 -10.0 0.0 0.0
3 -10.0 0.0 0.0
3 -10.0 0.0 0.0
3 -10.0 0.0 0.0
3 -10.0 0.0 0.0
3 -10.0 0.0 0.0
3 -10.0 0.0 0.0
3 -10.0 0.0 0.0
3 -10.0 0.0 0.0
3 -10.0 0.0 0.0
3 -10.0 0.0 0.0
3 -10.0 0.0 0.0
3 -10.0 0.0 0.0
3 -10.0 0.0 0.0
3 -10.0 0.0 0.0
3 -10.0 0.0 0.0
3 -10.0 0.0 0.0
3 -10.0 0.0 0.0
3 -10.0 0.0 0.0
3 -10.0 0.0 0.0
3 -10.0 0.0 0.0
3 -10.0 0.0 0.0
3 -10.0 0.0 0.0
3 -10.0 0.0 0.0
3 -10.0 0.0 0.0
3 -10.0 0.0 0.0
3 -10.0 0.0 0.0
3 -10.0 0.0 0.0
3 -10.0 0.0 0.0
3 -10.0 0.0 0.0
3 -10.0 0.0 0.0
3 -10.0 0.0 0.0
3 -10.0 0.0 0.0
3 -10.0 0.0 0.0
3 -10.0 0.0 0.0
3 -10.0 0.0 0.0
3 -10.0 0.0 0.0
3 -10.0 0.0 0.0
3 -10.0 0.0 0.0
3 -10.0 0.0 0.0
3 -10.0 0.0 0.0
3 -10.0 0.0 0.0
3 -10.0 0.0 0.0
3 -10.0 0.0 0.0
3 -10.0 0.0 0.0
3 -10.0 0.0 0.0
3 -10.0 0.0 0.0
3 -10.0 0.0 0.0
3 -10.0 0.0 0.0
3 -10.0 0.0 0.0
3 -10.0 0.0 0.0
3 -10.0 0.0 0.0
3 -10.0 0.0 0.0
3 -10.0 0.0 0.0
3 -10.0 0.0 0.0
3 -10.0 0.0 0.0
3 -10.0 0.0 0.0
3 -10.0 0.0 0.0
3 -10.0 0.0 0.0
3 -10.0 0.0 0.0
3 -10.0 0.0 0.0
3 -10.0 0.0 0.0
3 -10.0 0.0 0.0
3 -10.0 0.0 0.0
3 -10.0 0.0 0.0
3 -10.0 0.0 0.0
3 -10.0 0.0 0.0
3 -10.0 0.0 0.0
3 -10.0 0.0 0.0
3 -10.0 0.0 0.0
3 -10.0 0.0 0.0
3 -10.0 0.0 0.0
3 -10.0 0.0 0.0
3 -10.0 0.0 0.0
3 -10.0 0.0 0.0
3 -10.0 0.0 0.0
3 -10.0 0.0 0.0
3 -10.0 0.0 0.0
3 -10.0 0.0 0.0
3 -10.0 0.0 0.0
3 -10.0 0.0 0.0
3 -10.0 0.0 0.0
3 -10.0 0.0 0.0
3 -10.0 0.0 0.0
3 -10.0 0.0 0.0
3 -10.0 0.0 0.0
3 -10.0 0.0 0.0
3 -10.0 0.0 0.0
3 -10.0 0.0 0.0
3 -10.0 0.0 0.0
3 -10.0 0.0 0.0
3 -10.0 0.0 0.0
3 -10.0 0.0 0.0
3 -10.0 0.0 0.0
3 -10.0 0.0 0.0
3 -10.0 0.0 0.0
3 -10.0 0.0 0.0
3 -10.0 0.0 0.0
3 -10.0 0.0 0.0
3 -10.0 0.0 0.0
3 -10.0 0.0 0.0
3 -10.0 0.0 0.0
3 -10.0 0.0 0.0
3 -10.0 0.0 0.0
3 -10.0 0.0 0.0
3 -10.0 0.0 0.0
3 -10.0 0.0 0.0
3 -10.0 0.0 0.0
3 -10.0 0.0 0.0
3 -10.0 0.0 0.0
3 -10.0 0.0 0.0
3 -10.0 0.0 0.0
3 -10.0 0.0 0.0
3 -10.0 0.0 0.0
3 -10.0 0.0 0.0
3 -10.0 0.0 0.0
3 -10.0 0.0 0.0
3 -10.0 0.0 0.0
3 -10.0 0.0 0.0
3 -10.0 0.0 0.0
3 -10.0 0.0 0.0
3 -10.0 0.0 0.0
3 -10.0 0.0 0.0
3 -10.0 0.0 0.0
3 -10.0 0.0 0.0
3 -10.0 0.0 0.0
3 -10.0 0.0 0.0
3 -10.0 0.0 0.0
3 -10.0 0.0 0.0
3 -10.0 0.0 0.0
3 -10.0 0.0 0.0
3 -10.0 0.0 0.0
3 -10.0 0.0 0.0
3 -10.0 0.0 0.0
3 -10.0 0.0 0.0
3 -10.0 0.0 0.0
3 -10.0 0.0 0.0
3 -10.0 0.0 0.0
3 -10.0 0.0 0.0
3 -10.0 0.0 0.0
3 -10.0 0.0 0.0
3 -10.0 0.0 0.0
3 -10.0 0.0 0.0
3 -10.0 0.0 0.0
3 -10.0 0.0 0.0
3 -10.0 0.0 0.0
3 -10.0 0.0 0.0
3 -10.0 0.0 0.0
3 -10.0 0.0 0.0
3 -10.0 0.0 0.0
3 -10.0 0.0 0.0
3 -10.0 0.0 0.0
3 -10.0 0.0 0.0
3 -10.0 0.0 0.0
3 -10.0 0.0 0.0
3 -10.0 0.0 0.0
3 -10.0 0.0 0.0
3 -10.0 0.0 0.0
3 -10.0 0.0 0.0
3 -10.0 0.0 0.0
3 -10.0 0.0 0.0
3 -10.0 0.0 0.0
3 -10.0 0.0 0.0
3 -10.0 0.0 0.0
3 -10.0 0.0 0.0
3 -10.0 0.0 0.0
3 -10.0 0.0 0.0
3 -10.0 0.0 0.0
3 -10.0 0.0 0.0
3 -10.0 0.0 0.0
3 -10.0 0.0 0.0
3 -10.0 0.0 0.0
3 -10.0 0.0 0.0
3 -10.0 0.0 0.0
3 -10.0 0.0 0.0
3 -10.0 0.0 0.0
3 -10.0 0.0 0.0
3 -10.0 0.0 0.0
CDATA:
9 1 0 0 0 1 0 0 0 1
9 1 0 0 0 1 0 0 0 1
9 1 0 0 0 1 0 0 0 1
9 1 0 0 0 1 0 0 0 1
9 1 0 0 0 1 0 0 0 1
9 1 0 0 0 1 0 0 0 1
9 1 0 0 0 1 0 0 0 1
9 1 0 0 0 1 0 0 0 1
9 1 0 0 0 1 0 0 0 1
9 1 0 0 0 1 0 0 0 1
9 1 0 0 0 1 0 0 0 1
9 1 0 0 0 1 0 0 0 1
9 1 0 0 0 1 0 0 0 1
9 1 0 0 0 1 0 0 0 1
9 1 0 0 0 1 0 0 0 1
9 1 0 0 0 1 0 0 0 1
9 1 0 0 0 1 0 0 0 1
9 1 0 0 0 1 0 0 0 1
9 1 0 0 0 1 0 0 0 1
9 1 0 0 0 1 0 0 0 1
9 1 0 0 0 1 0 0 0 1
9 1 0 0 0 1 0 0 0 1
9 1 0 0 0 1 0 0 0 1
9 1 0 0 0 1 0 0 0 1
9 1 0 0 0 1 0 0 0 1
9 1 0 0 0 1 0 0 0 1
9 1 0 0 0 1 0 0 0 1
9 1 0 0 0 1 0 0 0 1
9 1 0 0 0 1 0 0 0 1
9 1 0 0 0 1 0 0 0 1
9 1 0 0 0 1 0 0 0 1
9 1 0 0 0 1 0 0 0 1
9 1 0 0 0 1 0 0 0 1
9 1 0 0 0 1 0 0 0 1
9 1 0 0 0 1 0 0 0 1
9 1 0 0 0 1 0 0 0 1
9 1 0 0 0 1 0 0 0 1
9 1 0 0 0 1 0 0 0 1
9 1 0 0 0 1 0 0 0 1
9 1 0 0 0 1 0 0 0 1
9 1 0 0 0 1 0 0 0 1
9 1 0 0 0 1 0 0 0 1
9 1 0 0 0 1 0 0 0 1
9 1 0 0 0 1 0 0 0 1
9 1 0 0 0 1 0 0 0 1
9 1 0 0 0 1 0 0 0 1
9 1 0 0 0 1 0 0 0 1
9 1 0 0 0 1 0 0 0 1
9 1 0 0 0 1 0 0 0 1
9 1 0 0 0 1 0 0 0 1
9 1 0 0 0 1 0 0 0 1
9 1 0 0 0 1 0 0 0 1
9 1 0 0 0 1 0 0 0 1
9 1 0 0 0 1 0 0 0 1
9 1 0 0 0 1 0 0 0 1
9 1 0 0 0 1 0 0 0 1
9 1 0 0 0 1 0 0 0 1
9 1 0 0 0 1 0 0 0 1
9 1 0 0 0 1 0 0 0 1
9 1 0 0 0 1 0 0 0 1
9 1 0 0 0 1 0 0 0 1
9 1 0 0 0 1 0 0 0 1
9 1 0 0 0 1 0 0 0 1
9 1 0 0 0 1 0 0 0 1
9 1 0 0 0 1 0 0 0 1
9 1 0 0 0 1 0 0 0 1
9 1 0 0 0 1 0 0 0 1
9 1 0 0 0 1 0 0 0 1
9 1 0 0 0 1 0 0 0 1
9 1 0 0 0 1 0 0 0 1
9 1 0 0 0 1 0 0 0 1
9 1 0 0 0 1 0 0 0 1
9 1 0 0 0 1 0 0 0 1
9 1 0 0 0 1 0 0 0 1
9 1 0 0 0 1 0 0 0 1
9 1 0 0 0 1 0 0 0 1
9 1 0 0 0 1 0 0 0 1
9 1 0 0 0 1 0 0 0 1
9 1 0 0 0 1 0 0 0 1
9 1 0 0 0 1 0 0 0 1
9 1 0 0 0 1 0 0 0 1
9 1 0 0 0 1 0 0 0 1
9 1 0 0 0 1 0 0 0 1
9 1 0 0 0 1 0 0 0 1
9 1 0 0 0 1 0 0 0 1
9 1 0 0 0 1 0 0 0 1
9 1 0 0 0 1 0 0 0 1
9 1 0 0 0 1 0 0 0 1
9 1 0 0 0 1 0 0 0 1
9 1 0 0 0 1 0 0 0 1
9 1 0 0 0 1 0 0 0 1
9 1 0 0 0 1 0 0 0 1
9 1 0 0 0 1 0 0 0 1
9 1 0 0 0 1 0 0 0 1
9 1 0 0 0 1 0 0 0 1
9 1 0 0 0 1 0 0 0 1
9 1 0 0 0 1 0 0 0 1
9 1 0 0 0 1 0 0 0 1
9 1 0 0 0 1 0 0 0 1
9 1 0 0 0 1 0 0 0 1
9 1 0 0 0 1 0 0 0 1
9 1 0 0 0 1 0 0 0 1
9 1 0 0 0 1 0 0 0 1
9 1 0 0 0 1 0 0 0 1
9 1 0 0 0 1 0 0 0 1
9 1 0 0 0 1 0 0 0 1
9 1 0 0 0 1 0 0 0 1
9 1 0 0 0 1 0 0 0 1
9 1 0 0 0 1 0 0 0 1
9 1 0 0 0 1 0 0 0 1
9 1 0 0 0 1 0 0 0 1
9 1 0 0 0 1 0 0 0 1
9 1 0 0 0 1 0 0 0 1
9 1 0 0 0 1 0 0 0 1
9 1 0 0 0 1 0 0 0 1
9 1 0 0 0 1 0 0 0 1
9 1 0 0 0 1 0 0 0 1
9 1 0 0 0 1 0 0 0 1
9 1 0 0 0 1 0 0 0 1
9 1 0 0 0 1 0 0 0 1
9 1 0 0 0 1 0 0 0 1
9 1 0 0 0 1 0 0 0 1
9 1 0 0 0 1 0 0 0 1
9 1 0 0 0 1 0 0 0 1
9 1 0 0 0 1 0 0 0 1
9 1 0 0 0 1 0 0 0 1
9 1 0 0 0 1 0 0 0 1
9 1 0 0 0 1 0 0 0 1
9 1 0 0 0 1 0 0 0 1
9 1 0 0 0 1 0 0 0 1
9 1 0 0 0 1 0 0 0 1
9 1 0 0 0 1 0 0 0 1
9 1 0 0 0 1 0 0 0 1
9 1 0 0 0 1 0 0 0 1
9 1 0 0 0 1 0 0 0 1
9 1 0 0 0 1 0 0 0 1
9 1 0 0 0 1 0 0 0 1
9 1 0 0 0 1 0 0 0 1
9 1 0 0 0 1 0 0 0 1
9 1 0 0 0 1 0 0 0 1
9 1 0 0 0 1 0 0 0 1
9 1 0 0 0 1 0 0 0 1
9 1 0 0 0 1 0 0 0 1
9 1 0 0 0 1 0 0 0 1
9 1 0 0 0 1 0 0 0 1
9 1 0 0 0 1 0 0 0 1
9 1 0 0 0 1 0 0 0 1
9 1 0 0 0 1 0 0 0 1
9 1 0 0 0 1 0 0 0 1
9 1 0 0 0 1 0 0 0 1
9 1 0 0 0 1 0 0 0 1
9 1 0 0 0 1 0 0 0 1
9 1 0 0 0 1 0 0 0 1
9 1 0 0 0 1 0 0 0 1
9 1 0 0 0 1 0 0 0 1
9 1 0 0 0 1 0 0 0 1
9 1 0 0 0 1 0 0 0 1
9 1 0 0 0 1 0 0 0 1
9 1 0 0 0 1 0 0 0 1
9 1 0 0 0 1 0 0 0 1
9 1 0 0 0 1 0 0 0 1
9 1 0 0 0 1 0 0 0 1
9 1 0 0 0 1 0 0 0 1
9 1 0 0 0 1 0 0 0 1
9 1 0 0 0 1 0 0 0 1
9 1 0 0 0 1 0 0 0 1
9 1 0 0 0 1 0 0 0 1
9 1 0 0 0 1 0 0 0 1
9 1 0 0 0 1 0 0 0 1
9 1 0 0 0 1 0 0 0 1
9 1 0 0 0 1 0 0 0 1
9 1 0 0 0 1 0 0 0 1
9 1 0 0 0 1 0 0 0 1
9 1 0 0 0 1 0 0 0 1
9 1 0 0 0 1 0 0 0 1
9 1 0 0 0 1 0 0 0 1
9 1 0 0 0 1 0 0 0 1
9 1 0 0 0 1 0 0 0 1
9 1 0 0 0 1 0 0 0 1
9 1 0 0 0 1 0 0 0 1
9 1 0 0 0 1 0 0 0 1
9 1 0 0 0 1 0 0 0 1
9 1 0 0 0 1 0 0 0 1
9 1 0 0 0 1 0 0 0 1
9 1 0 0 0 1 0 0 0 1
9 1 0 0 0 1 0 0 0 1
9 1 0 0 0 1 0 0 0 1
9 1 0 0 0 1 0 0 0 1
9 1 0 0 0 1 0 0 0 1
9 1 0 0 0 1 0 0 0 1
9 1 0 0 0 1 0 0 0 1
9 1 0 0 0 1 0 0 0 1
9 1 0 0 0 1 0 0 0 1
9 1 0 0 0 1 0 0 0 1
9 1 0 0 0 1 0 0 0 1
9 1 0 0 0 1 0 0 0 1
9 1 0 0 0 1 0 0 0 1
9 1 0 0 0 1 0 0 0 1
9 1 0 0 0 1 0 0 0 1
9 1 0 0 0 1 0 0 0 1
