POINTS:
0.0 0.0
0.0 0.5
0.0 1.0
0.0 1.5
0.0 2.0
0.5 0.0
0.5 0.5
0.5 1.0
0.5 1.5
0.5 2.0
1.0 0.0
1.0 0.5
1.0 1.0
1.0 1.5
1.0 2.0
1.5 0.0
1.5 0.5
1.5 1.0
1.5 1.5
1.5 2.0
2.0 0.0
2.0 0.5
2.0 1.0
2.0 1.5
2.0 2.0
CELLS:
4 1000 0 5 6 1
4 1000 1 6 7 2
4 0 2 7 8 3
4 0 3 8 9 4
4 1000 5 10 11 6
4 1000 6 11 12 7
4 0 7 12 13 8
4 0 8 13 14 9
4 3000 10 15 16 11
4 3000 11 16 17 12
4 2000 12 17 18 13
4 2000 13 18 19 14
4 3000 15 20 21 16
4 3000 16 21 22 17
4 2000 17 22 23 18
4 2000 18 23 24 19
FACES:
VDATA:
3 0.005 0.002 20
3 0.005 0.002 20
3 -10.0 0.0 0.0
3 -10.0 0.0 0.0
3 -10.0 0.0 0.0
3 0.005 0.002 20
3 0.005 0.002 20
3 -10.0 0.0 0.0
3 -10.0 0.0 0.0
3 -10.0 0.0 0.0
3 -10.0 0.0 0.0
3 -10.0 0.0 0.0
3 -10.0 0.0 0.0
3 -10.0 0.0 0.0
3 -10.0 0.0 0.0
3 -10.0 0.0 0.0
3 -10.0 0.0 0.0
3 -10.0 0.0 0.0
3 0.0 0.002 20
3 0.0 0.002 20
3 -10.0 0.0 0.0
3 -10.0 0.0 0.0
3 -10.0 0.0 0.0
3 0.0 0.002 20
3 0.0 0.002 20
CDATA:
9 1 0 0 0 1 0 0 0 1
9 1 0 0 0 1 0 0 0 1
9 1 0 0 0 1 0 0 0 1
9 1 0 0 0 1 0 0 0 1
9 1 0 0 0 1 0 0 0 1
9 1 0 0 0 1 0 0 0 1
9 1 0 0 0 1 0 0 0 1
9 1 0 0 0 1 0 0 0 1
9 1 0 0 0 1 0 0 0 1
9 1 0 0 0 1 0 0 0 1
9 1 0 0 0 1 0 0 0 1
9 1 0 0 0 1 0 0 0 1
9 1 0 0 0 1 0 0 0 1
9 1 0 0 0 1 0 0 0 1
9 1 0 0 0 1 0 0 0 1
9 1 0 0 0 1 0 0 0 1
