POINTS:
0.0 0.0 0.0
0.0 0.0 1.0
0.0 1.0 0.0
0.0 1.0 1.0
1.0 0.0 0.0
1.0 0.0 1.0
1.0 1.0 0.0
1.0 1.0 1.0
CELLS:
4 0 0 2 3 7
4 0 0 2 6 7
4 0 0 4 6 7
4 0 0 4 5 7
4 0 0 1 5 7
4 0 0 1 3 7
FACES:
3 1 0 2 3
3 1 0 3 1
3 1 4 6 7
3 1 4 7 5
3 1 7 5 1
3 1 7 1 3
3 1 6 4 0
3 1 6 0 2
3 1 0 4 5
3 1 0 5 1
3 1 2 6 7
3 1 2 7 3
VDATA:
3 -10 0 0
3 -10 0 0
3 -10 0 0
3 -10 0 0
3 -10 0 0
3 -10 0 0
3 -10 0 0
3 -10 0 0
CDATA:
9 1 0 0 0 1 0 0 0 1
9 1 0 0 0 1 0 0 0 1
9 1 0 0 0 1 0 0 0 1
9 1 0 0 0 1 0 0 0 1
9 1 0 0 0 1 0 0 0 1
9 1 0 0 0 1 0 0 0 1
