\relax 
\citation{courtemanche}
\@writefile{toc}{\contentsline {section}{\tocsection {}{8}{The Courtemanche cell model}}{18}}
\newlabel{sec:Courtemanche}{{8}{18}}
\@writefile{toc}{\contentsline {paragraph}{\tocparagraph {}{}{\bf  The evolution of ion concentration}}{19}}
\@writefile{toc}{\contentsline {paragraph}{\tocparagraph {}{}{\bf  The gating evolution in the Courtemanche model}}{19}}
\@setckpt{Courtemanche}{
\setcounter{page}{23}
\setcounter{equation}{26}
\setcounter{enumi}{3}
\setcounter{enumii}{0}
\setcounter{enumiii}{0}
\setcounter{enumiv}{0}
\setcounter{footnote}{0}
\setcounter{mpfootnote}{0}
\setcounter{parentequation}{20}
\setcounter{part}{0}
\setcounter{section}{8}
\setcounter{subsection}{0}
\setcounter{subsubsection}{0}
\setcounter{paragraph}{0}
\setcounter{subparagraph}{0}
\setcounter{figure}{0}
\setcounter{table}{0}
\setcounter{thrm}{0}
\setcounter{float@type}{8}
\setcounter{ContinuedFloat}{0}
\setcounter{subfigure}{0}
\setcounter{subtable}{0}
\setcounter{algorithm}{0}
\setcounter{ALC@unique}{0}
\setcounter{ALC@line}{0}
\setcounter{ALC@rem}{0}
\setcounter{ALC@depth}{0}
\setcounter{theorem}{0}
}
