\relax 
\@writefile{toc}{\contentsline {section}{\tocsection {}{5}{A model for cardiac electromechanics}}{6}}
\newlabel{sec:mechanics}{{5}{6}}
\newlabel{eq:motionlagr}{{3a}{6}}
\@writefile{toc}{\contentsline {paragraph}{\tocparagraph {}{}{\bf  Hyperelasticity}}{6}}
\@writefile{toc}{\contentsline {paragraph}{\tocparagraph {}{}{\bf  Anisotropy}}{6}}
\citation{guccionemat}
\citation{modelpassivemyo}
\citation{activestrainmodels}
\@writefile{toc}{\contentsline {paragraph}{\tocparagraph {}{}{\bf  Constitutive models}}{7}}
\@writefile{toc}{\contentsline {paragraph}{\tocparagraph {}{}{\bf  Active Strain Decomposition}}{7}}
\citation{NonlinFE_SaS}
\@writefile{toc}{\contentsline {paragraph}{\tocparagraph {}{}{\bf  The active stress decomposition}}{8}}
\@writefile{toc}{\contentsline {paragraph}{\tocparagraph {}{}{\bf  The Newmark method}}{8}}
\newlabel{newmarkappu}{{7a}{8}}
\newlabel{newmarkappv}{{7b}{8}}
\newlabel{eq:newmarksystem}{{8}{8}}
\@writefile{toc}{\contentsline {paragraph}{\tocparagraph {}{}{\bf  The ventricle volume}}{9}}
\@setckpt{Mechanics}{
\setcounter{page}{10}
\setcounter{equation}{9}
\setcounter{enumi}{3}
\setcounter{enumii}{0}
\setcounter{enumiii}{0}
\setcounter{enumiv}{0}
\setcounter{footnote}{0}
\setcounter{mpfootnote}{0}
\setcounter{parentequation}{7}
\setcounter{part}{0}
\setcounter{section}{5}
\setcounter{subsection}{0}
\setcounter{subsubsection}{0}
\setcounter{paragraph}{0}
\setcounter{subparagraph}{0}
\setcounter{figure}{0}
\setcounter{table}{0}
\setcounter{thrm}{0}
\setcounter{float@type}{8}
\setcounter{ContinuedFloat}{0}
\setcounter{subfigure}{0}
\setcounter{subtable}{0}
\setcounter{algorithm}{0}
\setcounter{ALC@unique}{0}
\setcounter{ALC@line}{0}
\setcounter{ALC@rem}{0}
\setcounter{ALC@depth}{0}
\setcounter{theorem}{0}
}
