POINTS:
0.0 0.0 0.0
0.0 0.0 0.5
0.0 0.0 1.0
0.0 0.0 1.5
0.0 0.0 2.0
0.0 0.0 2.5
0.0 0.0 3.0
0.0 0.5 0.0
0.0 0.5 0.5
0.0 0.5 1.0
0.0 0.5 1.5
0.0 0.5 2.0
0.0 0.5 2.5
0.0 0.5 3.0
0.0 1.0 0.0
0.0 1.0 0.5
0.0 1.0 1.0
0.0 1.0 1.5
0.0 1.0 2.0
0.0 1.0 2.5
0.0 1.0 3.0
0.0 1.5 0.0
0.0 1.5 0.5
0.0 1.5 1.0
0.0 1.5 1.5
0.0 1.5 2.0
0.0 1.5 2.5
0.0 1.5 3.0
0.0 2.0 0.0
0.0 2.0 0.5
0.0 2.0 1.0
0.0 2.0 1.5
0.0 2.0 2.0
0.0 2.0 2.5
0.0 2.0 3.0
0.0 2.5 0.0
0.0 2.5 0.5
0.0 2.5 1.0
0.0 2.5 1.5
0.0 2.5 2.0
0.0 2.5 2.5
0.0 2.5 3.0
0.0 3.0 0.0
0.0 3.0 0.5
0.0 3.0 1.0
0.0 3.0 1.5
0.0 3.0 2.0
0.0 3.0 2.5
0.0 3.0 3.0
0.5 0.0 0.0
0.5 0.0 0.5
0.5 0.0 1.0
0.5 0.0 1.5
0.5 0.0 2.0
0.5 0.0 2.5
0.5 0.0 3.0
0.5 0.5 0.0
0.5 0.5 0.5
0.5 0.5 1.0
0.5 0.5 1.5
0.5 0.5 2.0
0.5 0.5 2.5
0.5 0.5 3.0
0.5 1.0 0.0
0.5 1.0 0.5
0.5 1.0 1.0
0.5 1.0 1.5
0.5 1.0 2.0
0.5 1.0 2.5
0.5 1.0 3.0
0.5 1.5 0.0
0.5 1.5 0.5
0.5 1.5 1.0
0.5 1.5 1.5
0.5 1.5 2.0
0.5 1.5 2.5
0.5 1.5 3.0
0.5 2.0 0.0
0.5 2.0 0.5
0.5 2.0 1.0
0.5 2.0 1.5
0.5 2.0 2.0
0.5 2.0 2.5
0.5 2.0 3.0
0.5 2.5 0.0
0.5 2.5 0.5
0.5 2.5 1.0
0.5 2.5 1.5
0.5 2.5 2.0
0.5 2.5 2.5
0.5 2.5 3.0
0.5 3.0 0.0
0.5 3.0 0.5
0.5 3.0 1.0
0.5 3.0 1.5
0.5 3.0 2.0
0.5 3.0 2.5
0.5 3.0 3.0
1.0 0.0 0.0
1.0 0.0 0.5
1.0 0.0 1.0
1.0 0.0 1.5
1.0 0.0 2.0
1.0 0.0 2.5
1.0 0.0 3.0
1.0 0.5 0.0
1.0 0.5 0.5
1.0 0.5 1.0
1.0 0.5 1.5
1.0 0.5 2.0
1.0 0.5 2.5
1.0 0.5 3.0
1.0 1.0 0.0
1.0 1.0 0.5
1.0 1.0 1.0
1.0 1.0 1.5
1.0 1.0 2.0
1.0 1.0 2.5
1.0 1.0 3.0
1.0 1.5 0.0
1.0 1.5 0.5
1.0 1.5 1.0
1.0 1.5 1.5
1.0 1.5 2.0
1.0 1.5 2.5
1.0 1.5 3.0
1.0 2.0 0.0
1.0 2.0 0.5
1.0 2.0 1.0
1.0 2.0 1.5
1.0 2.0 2.0
1.0 2.0 2.5
1.0 2.0 3.0
1.0 2.5 0.0
1.0 2.5 0.5
1.0 2.5 1.0
1.0 2.5 1.5
1.0 2.5 2.0
1.0 2.5 2.5
1.0 2.5 3.0
1.0 3.0 0.0
1.0 3.0 0.5
1.0 3.0 1.0
1.0 3.0 1.5
1.0 3.0 2.0
1.0 3.0 2.5
1.0 3.0 3.0
1.5 0.0 0.0
1.5 0.0 0.5
1.5 0.0 1.0
1.5 0.0 1.5
1.5 0.0 2.0
1.5 0.0 2.5
1.5 0.0 3.0
1.5 0.5 0.0
1.5 0.5 0.5
1.5 0.5 1.0
1.5 0.5 1.5
1.5 0.5 2.0
1.5 0.5 2.5
1.5 0.5 3.0
1.5 1.0 0.0
1.5 1.0 0.5
1.5 1.0 1.0
1.5 1.0 1.5
1.5 1.0 2.0
1.5 1.0 2.5
1.5 1.0 3.0
1.5 1.5 0.0
1.5 1.5 0.5
1.5 1.5 1.0
1.5 1.5 1.5
1.5 1.5 2.0
1.5 1.5 2.5
1.5 1.5 3.0
1.5 2.0 0.0
1.5 2.0 0.5
1.5 2.0 1.0
1.5 2.0 1.5
1.5 2.0 2.0
1.5 2.0 2.5
1.5 2.0 3.0
1.5 2.5 0.0
1.5 2.5 0.5
1.5 2.5 1.0
1.5 2.5 1.5
1.5 2.5 2.0
1.5 2.5 2.5
1.5 2.5 3.0
1.5 3.0 0.0
1.5 3.0 0.5
1.5 3.0 1.0
1.5 3.0 1.5
1.5 3.0 2.0
1.5 3.0 2.5
1.5 3.0 3.0
2.0 0.0 0.0
2.0 0.0 0.5
2.0 0.0 1.0
2.0 0.0 1.5
2.0 0.0 2.0
2.0 0.0 2.5
2.0 0.0 3.0
2.0 0.5 0.0
2.0 0.5 0.5
2.0 0.5 1.0
2.0 0.5 1.5
2.0 0.5 2.0
2.0 0.5 2.5
2.0 0.5 3.0
2.0 1.0 0.0
2.0 1.0 0.5
2.0 1.0 1.0
2.0 1.0 1.5
2.0 1.0 2.0
2.0 1.0 2.5
2.0 1.0 3.0
2.0 1.5 0.0
2.0 1.5 0.5
2.0 1.5 1.0
2.0 1.5 1.5
2.0 1.5 2.0
2.0 1.5 2.5
2.0 1.5 3.0
2.0 2.0 0.0
2.0 2.0 0.5
2.0 2.0 1.0
2.0 2.0 1.5
2.0 2.0 2.0
2.0 2.0 2.5
2.0 2.0 3.0
2.0 2.5 0.0
2.0 2.5 0.5
2.0 2.5 1.0
2.0 2.5 1.5
2.0 2.5 2.0
2.0 2.5 2.5
2.0 2.5 3.0
2.0 3.0 0.0
2.0 3.0 0.5
2.0 3.0 1.0
2.0 3.0 1.5
2.0 3.0 2.0
2.0 3.0 2.5
2.0 3.0 3.0
2.5 0.0 0.0
2.5 0.0 0.5
2.5 0.0 1.0
2.5 0.0 1.5
2.5 0.0 2.0
2.5 0.0 2.5
2.5 0.0 3.0
2.5 0.5 0.0
2.5 0.5 0.5
2.5 0.5 1.0
2.5 0.5 1.5
2.5 0.5 2.0
2.5 0.5 2.5
2.5 0.5 3.0
2.5 1.0 0.0
2.5 1.0 0.5
2.5 1.0 1.0
2.5 1.0 1.5
2.5 1.0 2.0
2.5 1.0 2.5
2.5 1.0 3.0
2.5 1.5 0.0
2.5 1.5 0.5
2.5 1.5 1.0
2.5 1.5 1.5
2.5 1.5 2.0
2.5 1.5 2.5
2.5 1.5 3.0
2.5 2.0 0.0
2.5 2.0 0.5
2.5 2.0 1.0
2.5 2.0 1.5
2.5 2.0 2.0
2.5 2.0 2.5
2.5 2.0 3.0
2.5 2.5 0.0
2.5 2.5 0.5
2.5 2.5 1.0
2.5 2.5 1.5
2.5 2.5 2.0
2.5 2.5 2.5
2.5 2.5 3.0
2.5 3.0 0.0
2.5 3.0 0.5
2.5 3.0 1.0
2.5 3.0 1.5
2.5 3.0 2.0
2.5 3.0 2.5
2.5 3.0 3.0
3.0 0.0 0.0
3.0 0.0 0.5
3.0 0.0 1.0
3.0 0.0 1.5
3.0 0.0 2.0
3.0 0.0 2.5
3.0 0.0 3.0
3.0 0.5 0.0
3.0 0.5 0.5
3.0 0.5 1.0
3.0 0.5 1.5
3.0 0.5 2.0
3.0 0.5 2.5
3.0 0.5 3.0
3.0 1.0 0.0
3.0 1.0 0.5
3.0 1.0 1.0
3.0 1.0 1.5
3.0 1.0 2.0
3.0 1.0 2.5
3.0 1.0 3.0
3.0 1.5 0.0
3.0 1.5 0.5
3.0 1.5 1.0
3.0 1.5 1.5
3.0 1.5 2.0
3.0 1.5 2.5
3.0 1.5 3.0
3.0 2.0 0.0
3.0 2.0 0.5
3.0 2.0 1.0
3.0 2.0 1.5
3.0 2.0 2.0
3.0 2.0 2.5
3.0 2.0 3.0
3.0 2.5 0.0
3.0 2.5 0.5
3.0 2.5 1.0
3.0 2.5 1.5
3.0 2.5 2.0
3.0 2.5 2.5
3.0 2.5 3.0
3.0 3.0 0.0
3.0 3.0 0.5
3.0 3.0 1.0
3.0 3.0 1.5
3.0 3.0 2.0
3.0 3.0 2.5
3.0 3.0 3.0
CELLS:
4 0 0 7 8 57
4 0 0 7 56 57
4 0 0 49 56 57
4 0 0 49 50 57
4 0 0 1 50 57
4 0 0 1 8 57
4 0 1 8 9 58
4 0 1 8 57 58
4 0 1 50 57 58
4 0 1 50 51 58
4 0 1 2 51 58
4 0 1 2 9 58
4 0 2 9 10 59
4 0 2 9 58 59
4 0 2 51 58 59
4 0 2 51 52 59
4 0 2 3 52 59
4 0 2 3 10 59
4 0 3 10 11 60
4 0 3 10 59 60
4 0 3 52 59 60
4 0 3 52 53 60
4 0 3 4 53 60
4 0 3 4 11 60
4 0 4 11 12 61
4 0 4 11 60 61
4 0 4 53 60 61
4 0 4 53 54 61
4 0 4 5 54 61
4 0 4 5 12 61
4 0 5 12 13 62
4 0 5 12 61 62
4 0 5 54 61 62
4 0 5 54 55 62
4 0 5 6 55 62
4 0 5 6 13 62
4 0 7 14 15 64
4 0 7 14 63 64
4 0 7 56 63 64
4 0 7 56 57 64
4 0 7 8 57 64
4 0 7 8 15 64
4 0 8 15 16 65
4 0 8 15 64 65
4 0 8 57 64 65
4 0 8 57 58 65
4 0 8 9 58 65
4 0 8 9 16 65
4 0 9 16 17 66
4 0 9 16 65 66
4 0 9 58 65 66
4 0 9 58 59 66
4 0 9 10 59 66
4 0 9 10 17 66
4 0 10 17 18 67
4 0 10 17 66 67
4 0 10 59 66 67
4 0 10 59 60 67
4 0 10 11 60 67
4 0 10 11 18 67
4 0 11 18 19 68
4 0 11 18 67 68
4 0 11 60 67 68
4 0 11 60 61 68
4 0 11 12 61 68
4 0 11 12 19 68
4 0 12 19 20 69
4 0 12 19 68 69
4 0 12 61 68 69
4 0 12 61 62 69
4 0 12 13 62 69
4 0 12 13 20 69
4 0 14 21 22 71
4 0 14 21 70 71
4 0 14 63 70 71
4 0 14 63 64 71
4 0 14 15 64 71
4 0 14 15 22 71
4 0 15 22 23 72
4 0 15 22 71 72
4 0 15 64 71 72
4 0 15 64 65 72
4 0 15 16 65 72
4 0 15 16 23 72
4 0 16 23 24 73
4 0 16 23 72 73
4 0 16 65 72 73
4 0 16 65 66 73
4 0 16 17 66 73
4 0 16 17 24 73
4 0 17 24 25 74
4 0 17 24 73 74
4 0 17 66 73 74
4 0 17 66 67 74
4 0 17 18 67 74
4 0 17 18 25 74
4 0 18 25 26 75
4 0 18 25 74 75
4 0 18 67 74 75
4 0 18 67 68 75
4 0 18 19 68 75
4 0 18 19 26 75
4 0 19 26 27 76
4 0 19 26 75 76
4 0 19 68 75 76
4 0 19 68 69 76
4 0 19 20 69 76
4 0 19 20 27 76
4 0 21 28 29 78
4 0 21 28 77 78
4 0 21 70 77 78
4 0 21 70 71 78
4 0 21 22 71 78
4 0 21 22 29 78
4 0 22 29 30 79
4 0 22 29 78 79
4 0 22 71 78 79
4 0 22 71 72 79
4 0 22 23 72 79
4 0 22 23 30 79
4 0 23 30 31 80
4 0 23 30 79 80
4 0 23 72 79 80
4 0 23 72 73 80
4 0 23 24 73 80
4 0 23 24 31 80
4 0 24 31 32 81
4 0 24 31 80 81
4 0 24 73 80 81
4 0 24 73 74 81
4 0 24 25 74 81
4 0 24 25 32 81
4 0 25 32 33 82
4 0 25 32 81 82
4 0 25 74 81 82
4 0 25 74 75 82
4 0 25 26 75 82
4 0 25 26 33 82
4 0 26 33 34 83
4 0 26 33 82 83
4 0 26 75 82 83
4 0 26 75 76 83
4 0 26 27 76 83
4 0 26 27 34 83
4 0 28 35 36 85
4 0 28 35 84 85
4 0 28 77 84 85
4 0 28 77 78 85
4 0 28 29 78 85
4 0 28 29 36 85
4 0 29 36 37 86
4 0 29 36 85 86
4 0 29 78 85 86
4 0 29 78 79 86
4 0 29 30 79 86
4 0 29 30 37 86
4 0 30 37 38 87
4 0 30 37 86 87
4 0 30 79 86 87
4 0 30 79 80 87
4 0 30 31 80 87
4 0 30 31 38 87
4 0 31 38 39 88
4 0 31 38 87 88
4 0 31 80 87 88
4 0 31 80 81 88
4 0 31 32 81 88
4 0 31 32 39 88
4 0 32 39 40 89
4 0 32 39 88 89
4 0 32 81 88 89
4 0 32 81 82 89
4 0 32 33 82 89
4 0 32 33 40 89
4 0 33 40 41 90
4 0 33 40 89 90
4 0 33 82 89 90
4 0 33 82 83 90
4 0 33 34 83 90
4 0 33 34 41 90
4 0 35 42 43 92
4 0 35 42 91 92
4 0 35 84 91 92
4 0 35 84 85 92
4 0 35 36 85 92
4 0 35 36 43 92
4 0 36 43 44 93
4 0 36 43 92 93
4 0 36 85 92 93
4 0 36 85 86 93
4 0 36 37 86 93
4 0 36 37 44 93
4 0 37 44 45 94
4 0 37 44 93 94
4 0 37 86 93 94
4 0 37 86 87 94
4 0 37 38 87 94
4 0 37 38 45 94
4 0 38 45 46 95
4 0 38 45 94 95
4 0 38 87 94 95
4 0 38 87 88 95
4 0 38 39 88 95
4 0 38 39 46 95
4 0 39 46 47 96
4 0 39 46 95 96
4 0 39 88 95 96
4 0 39 88 89 96
4 0 39 40 89 96
4 0 39 40 47 96
4 0 40 47 48 97
4 0 40 47 96 97
4 0 40 89 96 97
4 0 40 89 90 97
4 0 40 41 90 97
4 0 40 41 48 97
4 0 49 56 57 106
4 0 49 56 105 106
4 0 49 98 105 106
4 0 49 98 99 106
4 0 49 50 99 106
4 0 49 50 57 106
4 0 50 57 58 107
4 0 50 57 106 107
4 0 50 99 106 107
4 0 50 99 100 107
4 0 50 51 100 107
4 0 50 51 58 107
4 0 51 58 59 108
4 0 51 58 107 108
4 0 51 100 107 108
4 0 51 100 101 108
4 0 51 52 101 108
4 0 51 52 59 108
4 0 52 59 60 109
4 0 52 59 108 109
4 0 52 101 108 109
4 0 52 101 102 109
4 0 52 53 102 109
4 0 52 53 60 109
4 0 53 60 61 110
4 0 53 60 109 110
4 0 53 102 109 110
4 0 53 102 103 110
4 0 53 54 103 110
4 0 53 54 61 110
4 0 54 61 62 111
4 0 54 61 110 111
4 0 54 103 110 111
4 0 54 103 104 111
4 0 54 55 104 111
4 0 54 55 62 111
4 0 56 63 64 113
4 0 56 63 112 113
4 0 56 105 112 113
4 0 56 105 106 113
4 0 56 57 106 113
4 0 56 57 64 113
4 0 57 64 65 114
4 0 57 64 113 114
4 0 57 106 113 114
4 0 57 106 107 114
4 0 57 58 107 114
4 0 57 58 65 114
4 0 58 65 66 115
4 0 58 65 114 115
4 0 58 107 114 115
4 0 58 107 108 115
4 0 58 59 108 115
4 0 58 59 66 115
4 0 59 66 67 116
4 0 59 66 115 116
4 0 59 108 115 116
4 0 59 108 109 116
4 0 59 60 109 116
4 0 59 60 67 116
4 0 60 67 68 117
4 0 60 67 116 117
4 0 60 109 116 117
4 0 60 109 110 117
4 0 60 61 110 117
4 0 60 61 68 117
4 0 61 68 69 118
4 0 61 68 117 118
4 0 61 110 117 118
4 0 61 110 111 118
4 0 61 62 111 118
4 0 61 62 69 118
4 0 63 70 71 120
4 0 63 70 119 120
4 0 63 112 119 120
4 0 63 112 113 120
4 0 63 64 113 120
4 0 63 64 71 120
4 0 64 71 72 121
4 0 64 71 120 121
4 0 64 113 120 121
4 0 64 113 114 121
4 0 64 65 114 121
4 0 64 65 72 121
4 0 65 72 73 122
4 0 65 72 121 122
4 0 65 114 121 122
4 0 65 114 115 122
4 0 65 66 115 122
4 0 65 66 73 122
4 0 66 73 74 123
4 0 66 73 122 123
4 0 66 115 122 123
4 0 66 115 116 123
4 0 66 67 116 123
4 0 66 67 74 123
4 0 67 74 75 124
4 0 67 74 123 124
4 0 67 116 123 124
4 0 67 116 117 124
4 0 67 68 117 124
4 0 67 68 75 124
4 0 68 75 76 125
4 0 68 75 124 125
4 0 68 117 124 125
4 0 68 117 118 125
4 0 68 69 118 125
4 0 68 69 76 125
4 0 70 77 78 127
4 0 70 77 126 127
4 0 70 119 126 127
4 0 70 119 120 127
4 0 70 71 120 127
4 0 70 71 78 127
4 0 71 78 79 128
4 0 71 78 127 128
4 0 71 120 127 128
4 0 71 120 121 128
4 0 71 72 121 128
4 0 71 72 79 128
4 0 72 79 80 129
4 0 72 79 128 129
4 0 72 121 128 129
4 0 72 121 122 129
4 0 72 73 122 129
4 0 72 73 80 129
4 0 73 80 81 130
4 0 73 80 129 130
4 0 73 122 129 130
4 0 73 122 123 130
4 0 73 74 123 130
4 0 73 74 81 130
4 0 74 81 82 131
4 0 74 81 130 131
4 0 74 123 130 131
4 0 74 123 124 131
4 0 74 75 124 131
4 0 74 75 82 131
4 0 75 82 83 132
4 0 75 82 131 132
4 0 75 124 131 132
4 0 75 124 125 132
4 0 75 76 125 132
4 0 75 76 83 132
4 0 77 84 85 134
4 0 77 84 133 134
4 0 77 126 133 134
4 0 77 126 127 134
4 0 77 78 127 134
4 0 77 78 85 134
4 0 78 85 86 135
4 0 78 85 134 135
4 0 78 127 134 135
4 0 78 127 128 135
4 0 78 79 128 135
4 0 78 79 86 135
4 0 79 86 87 136
4 0 79 86 135 136
4 0 79 128 135 136
4 0 79 128 129 136
4 0 79 80 129 136
4 0 79 80 87 136
4 0 80 87 88 137
4 0 80 87 136 137
4 0 80 129 136 137
4 0 80 129 130 137
4 0 80 81 130 137
4 0 80 81 88 137
4 0 81 88 89 138
4 0 81 88 137 138
4 0 81 130 137 138
4 0 81 130 131 138
4 0 81 82 131 138
4 0 81 82 89 138
4 0 82 89 90 139
4 0 82 89 138 139
4 0 82 131 138 139
4 0 82 131 132 139
4 0 82 83 132 139
4 0 82 83 90 139
4 0 84 91 92 141
4 0 84 91 140 141
4 0 84 133 140 141
4 0 84 133 134 141
4 0 84 85 134 141
4 0 84 85 92 141
4 0 85 92 93 142
4 0 85 92 141 142
4 0 85 134 141 142
4 0 85 134 135 142
4 0 85 86 135 142
4 0 85 86 93 142
4 0 86 93 94 143
4 0 86 93 142 143
4 0 86 135 142 143
4 0 86 135 136 143
4 0 86 87 136 143
4 0 86 87 94 143
4 0 87 94 95 144
4 0 87 94 143 144
4 0 87 136 143 144
4 0 87 136 137 144
4 0 87 88 137 144
4 0 87 88 95 144
4 0 88 95 96 145
4 0 88 95 144 145
4 0 88 137 144 145
4 0 88 137 138 145
4 0 88 89 138 145
4 0 88 89 96 145
4 0 89 96 97 146
4 0 89 96 145 146
4 0 89 138 145 146
4 0 89 138 139 146
4 0 89 90 139 146
4 0 89 90 97 146
4 0 98 105 106 155
4 0 98 105 154 155
4 0 98 147 154 155
4 0 98 147 148 155
4 0 98 99 148 155
4 0 98 99 106 155
4 0 99 106 107 156
4 0 99 106 155 156
4 0 99 148 155 156
4 0 99 148 149 156
4 0 99 100 149 156
4 0 99 100 107 156
4 0 100 107 108 157
4 0 100 107 156 157
4 0 100 149 156 157
4 0 100 149 150 157
4 0 100 101 150 157
4 0 100 101 108 157
4 0 101 108 109 158
4 0 101 108 157 158
4 0 101 150 157 158
4 0 101 150 151 158
4 0 101 102 151 158
4 0 101 102 109 158
4 0 102 109 110 159
4 0 102 109 158 159
4 0 102 151 158 159
4 0 102 151 152 159
4 0 102 103 152 159
4 0 102 103 110 159
4 0 103 110 111 160
4 0 103 110 159 160
4 0 103 152 159 160
4 0 103 152 153 160
4 0 103 104 153 160
4 0 103 104 111 160
4 0 105 112 113 162
4 0 105 112 161 162
4 0 105 154 161 162
4 0 105 154 155 162
4 0 105 106 155 162
4 0 105 106 113 162
4 0 106 113 114 163
4 0 106 113 162 163
4 0 106 155 162 163
4 0 106 155 156 163
4 0 106 107 156 163
4 0 106 107 114 163
4 0 107 114 115 164
4 0 107 114 163 164
4 0 107 156 163 164
4 0 107 156 157 164
4 0 107 108 157 164
4 0 107 108 115 164
4 0 108 115 116 165
4 0 108 115 164 165
4 0 108 157 164 165
4 0 108 157 158 165
4 0 108 109 158 165
4 0 108 109 116 165
4 0 109 116 117 166
4 0 109 116 165 166
4 0 109 158 165 166
4 0 109 158 159 166
4 0 109 110 159 166
4 0 109 110 117 166
4 0 110 117 118 167
4 0 110 117 166 167
4 0 110 159 166 167
4 0 110 159 160 167
4 0 110 111 160 167
4 0 110 111 118 167
4 0 112 119 120 169
4 0 112 119 168 169
4 0 112 161 168 169
4 0 112 161 162 169
4 0 112 113 162 169
4 0 112 113 120 169
4 0 113 120 121 170
4 0 113 120 169 170
4 0 113 162 169 170
4 0 113 162 163 170
4 0 113 114 163 170
4 0 113 114 121 170
4 0 114 121 122 171
4 0 114 121 170 171
4 0 114 163 170 171
4 0 114 163 164 171
4 0 114 115 164 171
4 0 114 115 122 171
4 0 115 122 123 172
4 0 115 122 171 172
4 0 115 164 171 172
4 0 115 164 165 172
4 0 115 116 165 172
4 0 115 116 123 172
4 0 116 123 124 173
4 0 116 123 172 173
4 0 116 165 172 173
4 0 116 165 166 173
4 0 116 117 166 173
4 0 116 117 124 173
4 0 117 124 125 174
4 0 117 124 173 174
4 0 117 166 173 174
4 0 117 166 167 174
4 0 117 118 167 174
4 0 117 118 125 174
4 0 119 126 127 176
4 0 119 126 175 176
4 0 119 168 175 176
4 0 119 168 169 176
4 0 119 120 169 176
4 0 119 120 127 176
4 0 120 127 128 177
4 0 120 127 176 177
4 0 120 169 176 177
4 0 120 169 170 177
4 0 120 121 170 177
4 0 120 121 128 177
4 0 121 128 129 178
4 0 121 128 177 178
4 0 121 170 177 178
4 0 121 170 171 178
4 0 121 122 171 178
4 0 121 122 129 178
4 0 122 129 130 179
4 0 122 129 178 179
4 0 122 171 178 179
4 0 122 171 172 179
4 0 122 123 172 179
4 0 122 123 130 179
4 0 123 130 131 180
4 0 123 130 179 180
4 0 123 172 179 180
4 0 123 172 173 180
4 0 123 124 173 180
4 0 123 124 131 180
4 0 124 131 132 181
4 0 124 131 180 181
4 0 124 173 180 181
4 0 124 173 174 181
4 0 124 125 174 181
4 0 124 125 132 181
4 0 126 133 134 183
4 0 126 133 182 183
4 0 126 175 182 183
4 0 126 175 176 183
4 0 126 127 176 183
4 0 126 127 134 183
4 0 127 134 135 184
4 0 127 134 183 184
4 0 127 176 183 184
4 0 127 176 177 184
4 0 127 128 177 184
4 0 127 128 135 184
4 0 128 135 136 185
4 0 128 135 184 185
4 0 128 177 184 185
4 0 128 177 178 185
4 0 128 129 178 185
4 0 128 129 136 185
4 0 129 136 137 186
4 0 129 136 185 186
4 0 129 178 185 186
4 0 129 178 179 186
4 0 129 130 179 186
4 0 129 130 137 186
4 0 130 137 138 187
4 0 130 137 186 187
4 0 130 179 186 187
4 0 130 179 180 187
4 0 130 131 180 187
4 0 130 131 138 187
4 0 131 138 139 188
4 0 131 138 187 188
4 0 131 180 187 188
4 0 131 180 181 188
4 0 131 132 181 188
4 0 131 132 139 188
4 0 133 140 141 190
4 0 133 140 189 190
4 0 133 182 189 190
4 0 133 182 183 190
4 0 133 134 183 190
4 0 133 134 141 190
4 0 134 141 142 191
4 0 134 141 190 191
4 0 134 183 190 191
4 0 134 183 184 191
4 0 134 135 184 191
4 0 134 135 142 191
4 0 135 142 143 192
4 0 135 142 191 192
4 0 135 184 191 192
4 0 135 184 185 192
4 0 135 136 185 192
4 0 135 136 143 192
4 0 136 143 144 193
4 0 136 143 192 193
4 0 136 185 192 193
4 0 136 185 186 193
4 0 136 137 186 193
4 0 136 137 144 193
4 0 137 144 145 194
4 0 137 144 193 194
4 0 137 186 193 194
4 0 137 186 187 194
4 0 137 138 187 194
4 0 137 138 145 194
4 0 138 145 146 195
4 0 138 145 194 195
4 0 138 187 194 195
4 0 138 187 188 195
4 0 138 139 188 195
4 0 138 139 146 195
4 0 147 154 155 204
4 0 147 154 203 204
4 0 147 196 203 204
4 0 147 196 197 204
4 0 147 148 197 204
4 0 147 148 155 204
4 0 148 155 156 205
4 0 148 155 204 205
4 0 148 197 204 205
4 0 148 197 198 205
4 0 148 149 198 205
4 0 148 149 156 205
4 0 149 156 157 206
4 0 149 156 205 206
4 0 149 198 205 206
4 0 149 198 199 206
4 0 149 150 199 206
4 0 149 150 157 206
4 0 150 157 158 207
4 0 150 157 206 207
4 0 150 199 206 207
4 0 150 199 200 207
4 0 150 151 200 207
4 0 150 151 158 207
4 0 151 158 159 208
4 0 151 158 207 208
4 0 151 200 207 208
4 0 151 200 201 208
4 0 151 152 201 208
4 0 151 152 159 208
4 0 152 159 160 209
4 0 152 159 208 209
4 0 152 201 208 209
4 0 152 201 202 209
4 0 152 153 202 209
4 0 152 153 160 209
4 0 154 161 162 211
4 0 154 161 210 211
4 0 154 203 210 211
4 0 154 203 204 211
4 0 154 155 204 211
4 0 154 155 162 211
4 0 155 162 163 212
4 0 155 162 211 212
4 0 155 204 211 212
4 0 155 204 205 212
4 0 155 156 205 212
4 0 155 156 163 212
4 0 156 163 164 213
4 0 156 163 212 213
4 0 156 205 212 213
4 0 156 205 206 213
4 0 156 157 206 213
4 0 156 157 164 213
4 0 157 164 165 214
4 0 157 164 213 214
4 0 157 206 213 214
4 0 157 206 207 214
4 0 157 158 207 214
4 0 157 158 165 214
4 0 158 165 166 215
4 0 158 165 214 215
4 0 158 207 214 215
4 0 158 207 208 215
4 0 158 159 208 215
4 0 158 159 166 215
4 0 159 166 167 216
4 0 159 166 215 216
4 0 159 208 215 216
4 0 159 208 209 216
4 0 159 160 209 216
4 0 159 160 167 216
4 0 161 168 169 218
4 0 161 168 217 218
4 0 161 210 217 218
4 0 161 210 211 218
4 0 161 162 211 218
4 0 161 162 169 218
4 0 162 169 170 219
4 0 162 169 218 219
4 0 162 211 218 219
4 0 162 211 212 219
4 0 162 163 212 219
4 0 162 163 170 219
4 0 163 170 171 220
4 0 163 170 219 220
4 0 163 212 219 220
4 0 163 212 213 220
4 0 163 164 213 220
4 0 163 164 171 220
4 0 164 171 172 221
4 0 164 171 220 221
4 0 164 213 220 221
4 0 164 213 214 221
4 0 164 165 214 221
4 0 164 165 172 221
4 0 165 172 173 222
4 0 165 172 221 222
4 0 165 214 221 222
4 0 165 214 215 222
4 0 165 166 215 222
4 0 165 166 173 222
4 0 166 173 174 223
4 0 166 173 222 223
4 0 166 215 222 223
4 0 166 215 216 223
4 0 166 167 216 223
4 0 166 167 174 223
4 0 168 175 176 225
4 0 168 175 224 225
4 0 168 217 224 225
4 0 168 217 218 225
4 0 168 169 218 225
4 0 168 169 176 225
4 0 169 176 177 226
4 0 169 176 225 226
4 0 169 218 225 226
4 0 169 218 219 226
4 0 169 170 219 226
4 0 169 170 177 226
4 0 170 177 178 227
4 0 170 177 226 227
4 0 170 219 226 227
4 0 170 219 220 227
4 0 170 171 220 227
4 0 170 171 178 227
4 0 171 178 179 228
4 0 171 178 227 228
4 0 171 220 227 228
4 0 171 220 221 228
4 0 171 172 221 228
4 0 171 172 179 228
4 0 172 179 180 229
4 0 172 179 228 229
4 0 172 221 228 229
4 0 172 221 222 229
4 0 172 173 222 229
4 0 172 173 180 229
4 0 173 180 181 230
4 0 173 180 229 230
4 0 173 222 229 230
4 0 173 222 223 230
4 0 173 174 223 230
4 0 173 174 181 230
4 0 175 182 183 232
4 0 175 182 231 232
4 0 175 224 231 232
4 0 175 224 225 232
4 0 175 176 225 232
4 0 175 176 183 232
4 0 176 183 184 233
4 0 176 183 232 233
4 0 176 225 232 233
4 0 176 225 226 233
4 0 176 177 226 233
4 0 176 177 184 233
4 0 177 184 185 234
4 0 177 184 233 234
4 0 177 226 233 234
4 0 177 226 227 234
4 0 177 178 227 234
4 0 177 178 185 234
4 0 178 185 186 235
4 0 178 185 234 235
4 0 178 227 234 235
4 0 178 227 228 235
4 0 178 179 228 235
4 0 178 179 186 235
4 0 179 186 187 236
4 0 179 186 235 236
4 0 179 228 235 236
4 0 179 228 229 236
4 0 179 180 229 236
4 0 179 180 187 236
4 0 180 187 188 237
4 0 180 187 236 237
4 0 180 229 236 237
4 0 180 229 230 237
4 0 180 181 230 237
4 0 180 181 188 237
4 0 182 189 190 239
4 0 182 189 238 239
4 0 182 231 238 239
4 0 182 231 232 239
4 0 182 183 232 239
4 0 182 183 190 239
4 0 183 190 191 240
4 0 183 190 239 240
4 0 183 232 239 240
4 0 183 232 233 240
4 0 183 184 233 240
4 0 183 184 191 240
4 0 184 191 192 241
4 0 184 191 240 241
4 0 184 233 240 241
4 0 184 233 234 241
4 0 184 185 234 241
4 0 184 185 192 241
4 0 185 192 193 242
4 0 185 192 241 242
4 0 185 234 241 242
4 0 185 234 235 242
4 0 185 186 235 242
4 0 185 186 193 242
4 0 186 193 194 243
4 0 186 193 242 243
4 0 186 235 242 243
4 0 186 235 236 243
4 0 186 187 236 243
4 0 186 187 194 243
4 0 187 194 195 244
4 0 187 194 243 244
4 0 187 236 243 244
4 0 187 236 237 244
4 0 187 188 237 244
4 0 187 188 195 244
4 0 196 203 204 253
4 0 196 203 252 253
4 0 196 245 252 253
4 0 196 245 246 253
4 0 196 197 246 253
4 0 196 197 204 253
4 0 197 204 205 254
4 0 197 204 253 254
4 0 197 246 253 254
4 0 197 246 247 254
4 0 197 198 247 254
4 0 197 198 205 254
4 0 198 205 206 255
4 0 198 205 254 255
4 0 198 247 254 255
4 0 198 247 248 255
4 0 198 199 248 255
4 0 198 199 206 255
4 0 199 206 207 256
4 0 199 206 255 256
4 0 199 248 255 256
4 0 199 248 249 256
4 0 199 200 249 256
4 0 199 200 207 256
4 0 200 207 208 257
4 0 200 207 256 257
4 0 200 249 256 257
4 0 200 249 250 257
4 0 200 201 250 257
4 0 200 201 208 257
4 0 201 208 209 258
4 0 201 208 257 258
4 0 201 250 257 258
4 0 201 250 251 258
4 0 201 202 251 258
4 0 201 202 209 258
4 0 203 210 211 260
4 0 203 210 259 260
4 0 203 252 259 260
4 0 203 252 253 260
4 0 203 204 253 260
4 0 203 204 211 260
4 0 204 211 212 261
4 0 204 211 260 261
4 0 204 253 260 261
4 0 204 253 254 261
4 0 204 205 254 261
4 0 204 205 212 261
4 0 205 212 213 262
4 0 205 212 261 262
4 0 205 254 261 262
4 0 205 254 255 262
4 0 205 206 255 262
4 0 205 206 213 262
4 0 206 213 214 263
4 0 206 213 262 263
4 0 206 255 262 263
4 0 206 255 256 263
4 0 206 207 256 263
4 0 206 207 214 263
4 0 207 214 215 264
4 0 207 214 263 264
4 0 207 256 263 264
4 0 207 256 257 264
4 0 207 208 257 264
4 0 207 208 215 264
4 0 208 215 216 265
4 0 208 215 264 265
4 0 208 257 264 265
4 0 208 257 258 265
4 0 208 209 258 265
4 0 208 209 216 265
4 0 210 217 218 267
4 0 210 217 266 267
4 0 210 259 266 267
4 0 210 259 260 267
4 0 210 211 260 267
4 0 210 211 218 267
4 0 211 218 219 268
4 0 211 218 267 268
4 0 211 260 267 268
4 0 211 260 261 268
4 0 211 212 261 268
4 0 211 212 219 268
4 0 212 219 220 269
4 0 212 219 268 269
4 0 212 261 268 269
4 0 212 261 262 269
4 0 212 213 262 269
4 0 212 213 220 269
4 0 213 220 221 270
4 0 213 220 269 270
4 0 213 262 269 270
4 0 213 262 263 270
4 0 213 214 263 270
4 0 213 214 221 270
4 0 214 221 222 271
4 0 214 221 270 271
4 0 214 263 270 271
4 0 214 263 264 271
4 0 214 215 264 271
4 0 214 215 222 271
4 0 215 222 223 272
4 0 215 222 271 272
4 0 215 264 271 272
4 0 215 264 265 272
4 0 215 216 265 272
4 0 215 216 223 272
4 0 217 224 225 274
4 0 217 224 273 274
4 0 217 266 273 274
4 0 217 266 267 274
4 0 217 218 267 274
4 0 217 218 225 274
4 0 218 225 226 275
4 0 218 225 274 275
4 0 218 267 274 275
4 0 218 267 268 275
4 0 218 219 268 275
4 0 218 219 226 275
4 0 219 226 227 276
4 0 219 226 275 276
4 0 219 268 275 276
4 0 219 268 269 276
4 0 219 220 269 276
4 0 219 220 227 276
4 0 220 227 228 277
4 0 220 227 276 277
4 0 220 269 276 277
4 0 220 269 270 277
4 0 220 221 270 277
4 0 220 221 228 277
4 0 221 228 229 278
4 0 221 228 277 278
4 0 221 270 277 278
4 0 221 270 271 278
4 0 221 222 271 278
4 0 221 222 229 278
4 0 222 229 230 279
4 0 222 229 278 279
4 0 222 271 278 279
4 0 222 271 272 279
4 0 222 223 272 279
4 0 222 223 230 279
4 0 224 231 232 281
4 0 224 231 280 281
4 0 224 273 280 281
4 0 224 273 274 281
4 0 224 225 274 281
4 0 224 225 232 281
4 0 225 232 233 282
4 0 225 232 281 282
4 0 225 274 281 282
4 0 225 274 275 282
4 0 225 226 275 282
4 0 225 226 233 282
4 0 226 233 234 283
4 0 226 233 282 283
4 0 226 275 282 283
4 0 226 275 276 283
4 0 226 227 276 283
4 0 226 227 234 283
4 0 227 234 235 284
4 0 227 234 283 284
4 0 227 276 283 284
4 0 227 276 277 284
4 0 227 228 277 284
4 0 227 228 235 284
4 0 228 235 236 285
4 0 228 235 284 285
4 0 228 277 284 285
4 0 228 277 278 285
4 0 228 229 278 285
4 0 228 229 236 285
4 0 229 236 237 286
4 0 229 236 285 286
4 0 229 278 285 286
4 0 229 278 279 286
4 0 229 230 279 286
4 0 229 230 237 286
4 0 231 238 239 288
4 0 231 238 287 288
4 0 231 280 287 288
4 0 231 280 281 288
4 0 231 232 281 288
4 0 231 232 239 288
4 0 232 239 240 289
4 0 232 239 288 289
4 0 232 281 288 289
4 0 232 281 282 289
4 0 232 233 282 289
4 0 232 233 240 289
4 0 233 240 241 290
4 0 233 240 289 290
4 0 233 282 289 290
4 0 233 282 283 290
4 0 233 234 283 290
4 0 233 234 241 290
4 0 234 241 242 291
4 0 234 241 290 291
4 0 234 283 290 291
4 0 234 283 284 291
4 0 234 235 284 291
4 0 234 235 242 291
4 0 235 242 243 292
4 0 235 242 291 292
4 0 235 284 291 292
4 0 235 284 285 292
4 0 235 236 285 292
4 0 235 236 243 292
4 0 236 243 244 293
4 0 236 243 292 293
4 0 236 285 292 293
4 0 236 285 286 293
4 0 236 237 286 293
4 0 236 237 244 293
4 0 245 252 253 302
4 0 245 252 301 302
4 0 245 294 301 302
4 0 245 294 295 302
4 0 245 246 295 302
4 0 245 246 253 302
4 0 246 253 254 303
4 0 246 253 302 303
4 0 246 295 302 303
4 0 246 295 296 303
4 0 246 247 296 303
4 0 246 247 254 303
4 0 247 254 255 304
4 0 247 254 303 304
4 0 247 296 303 304
4 0 247 296 297 304
4 0 247 248 297 304
4 0 247 248 255 304
4 0 248 255 256 305
4 0 248 255 304 305
4 0 248 297 304 305
4 0 248 297 298 305
4 0 248 249 298 305
4 0 248 249 256 305
4 0 249 256 257 306
4 0 249 256 305 306
4 0 249 298 305 306
4 0 249 298 299 306
4 0 249 250 299 306
4 0 249 250 257 306
4 0 250 257 258 307
4 0 250 257 306 307
4 0 250 299 306 307
4 0 250 299 300 307
4 0 250 251 300 307
4 0 250 251 258 307
4 0 252 259 260 309
4 0 252 259 308 309
4 0 252 301 308 309
4 0 252 301 302 309
4 0 252 253 302 309
4 0 252 253 260 309
4 0 253 260 261 310
4 0 253 260 309 310
4 0 253 302 309 310
4 0 253 302 303 310
4 0 253 254 303 310
4 0 253 254 261 310
4 0 254 261 262 311
4 0 254 261 310 311
4 0 254 303 310 311
4 0 254 303 304 311
4 0 254 255 304 311
4 0 254 255 262 311
4 0 255 262 263 312
4 0 255 262 311 312
4 0 255 304 311 312
4 0 255 304 305 312
4 0 255 256 305 312
4 0 255 256 263 312
4 0 256 263 264 313
4 0 256 263 312 313
4 0 256 305 312 313
4 0 256 305 306 313
4 0 256 257 306 313
4 0 256 257 264 313
4 0 257 264 265 314
4 0 257 264 313 314
4 0 257 306 313 314
4 0 257 306 307 314
4 0 257 258 307 314
4 0 257 258 265 314
4 0 259 266 267 316
4 0 259 266 315 316
4 0 259 308 315 316
4 0 259 308 309 316
4 0 259 260 309 316
4 0 259 260 267 316
4 0 260 267 268 317
4 0 260 267 316 317
4 0 260 309 316 317
4 0 260 309 310 317
4 0 260 261 310 317
4 0 260 261 268 317
4 0 261 268 269 318
4 0 261 268 317 318
4 0 261 310 317 318
4 0 261 310 311 318
4 0 261 262 311 318
4 0 261 262 269 318
4 0 262 269 270 319
4 0 262 269 318 319
4 0 262 311 318 319
4 0 262 311 312 319
4 0 262 263 312 319
4 0 262 263 270 319
4 0 263 270 271 320
4 0 263 270 319 320
4 0 263 312 319 320
4 0 263 312 313 320
4 0 263 264 313 320
4 0 263 264 271 320
4 0 264 271 272 321
4 0 264 271 320 321
4 0 264 313 320 321
4 0 264 313 314 321
4 0 264 265 314 321
4 0 264 265 272 321
4 0 266 273 274 323
4 0 266 273 322 323
4 0 266 315 322 323
4 0 266 315 316 323
4 0 266 267 316 323
4 0 266 267 274 323
4 0 267 274 275 324
4 0 267 274 323 324
4 0 267 316 323 324
4 0 267 316 317 324
4 0 267 268 317 324
4 0 267 268 275 324
4 0 268 275 276 325
4 0 268 275 324 325
4 0 268 317 324 325
4 0 268 317 318 325
4 0 268 269 318 325
4 0 268 269 276 325
4 0 269 276 277 326
4 0 269 276 325 326
4 0 269 318 325 326
4 0 269 318 319 326
4 0 269 270 319 326
4 0 269 270 277 326
4 0 270 277 278 327
4 0 270 277 326 327
4 0 270 319 326 327
4 0 270 319 320 327
4 0 270 271 320 327
4 0 270 271 278 327
4 0 271 278 279 328
4 0 271 278 327 328
4 0 271 320 327 328
4 0 271 320 321 328
4 0 271 272 321 328
4 0 271 272 279 328
4 0 273 280 281 330
4 0 273 280 329 330
4 0 273 322 329 330
4 0 273 322 323 330
4 0 273 274 323 330
4 0 273 274 281 330
4 0 274 281 282 331
4 0 274 281 330 331
4 0 274 323 330 331
4 0 274 323 324 331
4 0 274 275 324 331
4 0 274 275 282 331
4 0 275 282 283 332
4 0 275 282 331 332
4 0 275 324 331 332
4 0 275 324 325 332
4 0 275 276 325 332
4 0 275 276 283 332
4 0 276 283 284 333
4 0 276 283 332 333
4 0 276 325 332 333
4 0 276 325 326 333
4 0 276 277 326 333
4 0 276 277 284 333
4 0 277 284 285 334
4 0 277 284 333 334
4 0 277 326 333 334
4 0 277 326 327 334
4 0 277 278 327 334
4 0 277 278 285 334
4 0 278 285 286 335
4 0 278 285 334 335
4 0 278 327 334 335
4 0 278 327 328 335
4 0 278 279 328 335
4 0 278 279 286 335
4 0 280 287 288 337
4 0 280 287 336 337
4 0 280 329 336 337
4 0 280 329 330 337
4 0 280 281 330 337
4 0 280 281 288 337
4 0 281 288 289 338
4 0 281 288 337 338
4 0 281 330 337 338
4 0 281 330 331 338
4 0 281 282 331 338
4 0 281 282 289 338
4 0 282 289 290 339
4 0 282 289 338 339
4 0 282 331 338 339
4 0 282 331 332 339
4 0 282 283 332 339
4 0 282 283 290 339
4 0 283 290 291 340
4 0 283 290 339 340
4 0 283 332 339 340
4 0 283 332 333 340
4 0 283 284 333 340
4 0 283 284 291 340
4 0 284 291 292 341
4 0 284 291 340 341
4 0 284 333 340 341
4 0 284 333 334 341
4 0 284 285 334 341
4 0 284 285 292 341
4 0 285 292 293 342
4 0 285 292 341 342
4 0 285 334 341 342
4 0 285 334 335 342
4 0 285 286 335 342
4 0 285 286 293 342
FACES:
VDATA:
3 0.0 0.002 20
3 0.0 0.002 20
3 0.0 0.002 20
3 0.0 0.002 20
3 -10.0 0.0 0.0
3 -10.0 0.0 0.0
3 -10.0 0.0 0.0
3 0.0 0.002 20
3 0.0 0.002 20
3 0.0 0.002 20
3 0.0 0.002 20
3 -10.0 0.0 0.0
3 -10.0 0.0 0.0
3 -10.0 0.0 0.0
3 0.0 0.002 20
3 0.0 0.002 20
3 0.0 0.002 20
3 0.0 0.002 20
3 -10.0 0.0 0.0
3 -10.0 0.0 0.0
3 -10.0 0.0 0.0
3 0.0 0.002 20
3 0.0 0.002 20
3 0.0 0.002 20
3 0.0 0.002 20
3 -10.0 0.0 0.0
3 -10.0 0.0 0.0
3 -10.0 0.0 0.0
3 -10.0 0.0 0.0
3 -10.0 0.0 0.0
3 -10.0 0.0 0.0
3 -10.0 0.0 0.0
3 -10.0 0.0 0.0
3 -10.0 0.0 0.0
3 -10.0 0.0 0.0
3 -10.0 0.0 0.0
3 -10.0 0.0 0.0
3 -10.0 0.0 0.0
3 -10.0 0.0 0.0
3 -10.0 0.0 0.0
3 -10.0 0.0 0.0
3 -10.0 0.0 0.0
3 -10.0 0.0 0.0
3 -10.0 0.0 0.0
3 -10.0 0.0 0.0
3 -10.0 0.0 0.0
3 -10.0 0.0 0.0
3 -10.0 0.0 0.0
3 -10.0 0.0 0.0
3 0.0 0.002 20
3 0.0 0.002 20
3 0.0 0.002 20
3 0.0 0.002 20
3 -10.0 0.0 0.0
3 -10.0 0.0 0.0
3 -10.0 0.0 0.0
3 0.0 0.002 20
3 0.0 0.002 20
3 0.0 0.002 20
3 0.0 0.002 20
3 -10.0 0.0 0.0
3 -10.0 0.0 0.0
3 -10.0 0.0 0.0
3 0.0 0.002 20
3 0.0 0.002 20
3 0.0 0.002 20
3 0.0 0.002 20
3 -10.0 0.0 0.0
3 -10.0 0.0 0.0
3 -10.0 0.0 0.0
3 0.0 0.002 20
3 0.0 0.002 20
3 0.0 0.002 20
3 0.0 0.002 20
3 -10.0 0.0 0.0
3 -10.0 0.0 0.0
3 -10.0 0.0 0.0
3 -10.0 0.0 0.0
3 -10.0 0.0 0.0
3 -10.0 0.0 0.0
3 -10.0 0.0 0.0
3 -10.0 0.0 0.0
3 -10.0 0.0 0.0
3 -10.0 0.0 0.0
3 -10.0 0.0 0.0
3 -10.0 0.0 0.0
3 -10.0 0.0 0.0
3 -10.0 0.0 0.0
3 -10.0 0.0 0.0
3 -10.0 0.0 0.0
3 -10.0 0.0 0.0
3 -10.0 0.0 0.0
3 -10.0 0.0 0.0
3 -10.0 0.0 0.0
3 -10.0 0.0 0.0
3 -10.0 0.0 0.0
3 -10.0 0.0 0.0
3 -10.0 0.0 0.0
3 0.0 0.002 20
3 0.0 0.002 20
3 0.0 0.002 20
3 0.0 0.002 20
3 -10.0 0.0 0.0
3 -10.0 0.0 0.0
3 -10.0 0.0 0.0
3 0.0 0.002 20
3 0.0 0.002 20
3 0.0 0.002 20
3 0.0 0.002 20
3 -10.0 0.0 0.0
3 -10.0 0.0 0.0
3 -10.0 0.0 0.0
3 0.0 0.002 20
3 0.0 0.002 20
3 0.0 0.002 20
3 0.0 0.002 20
3 -10.0 0.0 0.0
3 -10.0 0.0 0.0
3 -10.0 0.0 0.0
3 0.0 0.002 20
3 0.0 0.002 20
3 0.0 0.002 20
3 0.0 0.002 20
3 -10.0 0.0 0.0
3 -10.0 0.0 0.0
3 -10.0 0.0 0.0
3 -10.0 0.0 0.0
3 -10.0 0.0 0.0
3 -10.0 0.0 0.0
3 -10.0 0.0 0.0
3 -10.0 0.0 0.0
3 -10.0 0.0 0.0
3 -10.0 0.0 0.0
3 -10.0 0.0 0.0
3 -10.0 0.0 0.0
3 -10.0 0.0 0.0
3 -10.0 0.0 0.0
3 -10.0 0.0 0.0
3 -10.0 0.0 0.0
3 -10.0 0.0 0.0
3 -10.0 0.0 0.0
3 -10.0 0.0 0.0
3 -10.0 0.0 0.0
3 -10.0 0.0 0.0
3 -10.0 0.0 0.0
3 -10.0 0.0 0.0
3 -10.0 0.0 0.0
3 0.0 0.002 20
3 0.0 0.002 20
3 0.0 0.002 20
3 0.0 0.002 20
3 -10.0 0.0 0.0
3 -10.0 0.0 0.0
3 -10.0 0.0 0.0
3 0.0 0.002 20
3 0.0 0.002 20
3 0.0 0.002 20
3 0.0 0.002 20
3 -10.0 0.0 0.0
3 -10.0 0.0 0.0
3 -10.0 0.0 0.0
3 0.0 0.002 20
3 0.0 0.002 20
3 0.0 0.002 20
3 0.0 0.002 20
3 -10.0 0.0 0.0
3 -10.0 0.0 0.0
3 -10.0 0.0 0.0
3 0.0 0.002 20
3 0.0 0.002 20
3 0.0 0.002 20
3 0.0 0.002 20
3 -10.0 0.0 0.0
3 -10.0 0.0 0.0
3 -10.0 0.0 0.0
3 -10.0 0.0 0.0
3 -10.0 0.0 0.0
3 -10.0 0.0 0.0
3 -10.0 0.0 0.0
3 -10.0 0.0 0.0
3 -10.0 0.0 0.0
3 -10.0 0.0 0.0
3 -10.0 0.0 0.0
3 -10.0 0.0 0.0
3 -10.0 0.0 0.0
3 -10.0 0.0 0.0
3 -10.0 0.0 0.0
3 -10.0 0.0 0.0
3 -10.0 0.0 0.0
3 -10.0 0.0 0.0
3 -10.0 0.0 0.0
3 -10.0 0.0 0.0
3 -10.0 0.0 0.0
3 -10.0 0.0 0.0
3 -10.0 0.0 0.0
3 -10.0 0.0 0.0
3 -10.0 0.0 0.0
3 -10.0 0.0 0.0
3 -10.0 0.0 0.0
3 -10.0 0.0 0.0
3 -10.0 0.0 0.0
3 -10.0 0.0 0.0
3 -10.0 0.0 0.0
3 -10.0 0.0 0.0
3 -10.0 0.0 0.0
3 -10.0 0.0 0.0
3 -10.0 0.0 0.0
3 -10.0 0.0 0.0
3 -10.0 0.0 0.0
3 -10.0 0.0 0.0
3 -10.0 0.0 0.0
3 -10.0 0.0 0.0
3 -10.0 0.0 0.0
3 -10.0 0.0 0.0
3 -10.0 0.0 0.0
3 -10.0 0.0 0.0
3 -10.0 0.0 0.0
3 -10.0 0.0 0.0
3 -10.0 0.0 0.0
3 -10.0 0.0 0.0
3 -10.0 0.0 0.0
3 -10.0 0.0 0.0
3 -10.0 0.0 0.0
3 -10.0 0.0 0.0
3 -10.0 0.0 0.0
3 -10.0 0.0 0.0
3 -10.0 0.0 0.0
3 -10.0 0.0 0.0
3 -10.0 0.0 0.0
3 -10.0 0.0 0.0
3 -10.0 0.0 0.0
3 -10.0 0.0 0.0
3 -10.0 0.0 0.0
3 -10.0 0.0 0.0
3 -10.0 0.0 0.0
3 -10.0 0.0 0.0
3 -10.0 0.0 0.0
3 -10.0 0.0 0.0
3 -10.0 0.0 0.0
3 -10.0 0.0 0.0
3 -10.0 0.0 0.0
3 -10.0 0.0 0.0
3 -10.0 0.0 0.0
3 -10.0 0.0 0.0
3 -10.0 0.0 0.0
3 -10.0 0.0 0.0
3 -10.0 0.0 0.0
3 -10.0 0.0 0.0
3 -10.0 0.0 0.0
3 -10.0 0.0 0.0
3 -10.0 0.0 0.0
3 -10.0 0.0 0.0
3 -10.0 0.0 0.0
3 -10.0 0.0 0.0
3 -10.0 0.0 0.0
3 -10.0 0.0 0.0
3 -10.0 0.0 0.0
3 -10.0 0.0 0.0
3 -10.0 0.0 0.0
3 -10.0 0.0 0.0
3 -10.0 0.0 0.0
3 -10.0 0.0 0.0
3 -10.0 0.0 0.0
3 -10.0 0.0 0.0
3 -10.0 0.0 0.0
3 -10.0 0.0 0.0
3 -10.0 0.0 0.0
3 -10.0 0.0 0.0
3 -10.0 0.0 0.0
3 -10.0 0.0 0.0
3 -10.0 0.0 0.0
3 -10.0 0.0 0.0
3 -10.0 0.0 0.0
3 -10.0 0.0 0.0
3 -10.0 0.0 0.0
3 -10.0 0.0 0.0
3 -10.0 0.0 0.0
3 -10.0 0.0 0.0
3 -10.0 0.0 0.0
3 -10.0 0.0 0.0
3 -10.0 0.0 0.0
3 -10.0 0.0 0.0
3 -10.0 0.0 0.0
3 -10.0 0.0 0.0
3 -10.0 0.0 0.0
3 -10.0 0.0 0.0
3 -10.0 0.0 0.0
3 -10.0 0.0 0.0
3 -10.0 0.0 0.0
3 -10.0 0.0 0.0
3 -10.0 0.0 0.0
3 -10.0 0.0 0.0
3 -10.0 0.0 0.0
3 -10.0 0.0 0.0
3 -10.0 0.0 0.0
3 -10.0 0.0 0.0
3 -10.0 0.0 0.0
3 -10.0 0.0 0.0
3 -10.0 0.0 0.0
3 -10.0 0.0 0.0
3 -10.0 0.0 0.0
3 -10.0 0.0 0.0
3 -10.0 0.0 0.0
3 -10.0 0.0 0.0
3 -10.0 0.0 0.0
3 -10.0 0.0 0.0
3 -10.0 0.0 0.0
3 -10.0 0.0 0.0
3 -10.0 0.0 0.0
3 -10.0 0.0 0.0
3 -10.0 0.0 0.0
3 -10.0 0.0 0.0
3 -10.0 0.0 0.0
3 -10.0 0.0 0.0
3 -10.0 0.0 0.0
3 -10.0 0.0 0.0
3 -10.0 0.0 0.0
3 -10.0 0.0 0.0
3 -10.0 0.0 0.0
3 -10.0 0.0 0.0
3 -10.0 0.0 0.0
3 -10.0 0.0 0.0
3 -10.0 0.0 0.0
3 -10.0 0.0 0.0
3 -10.0 0.0 0.0
3 -10.0 0.0 0.0
3 -10.0 0.0 0.0
3 -10.0 0.0 0.0
3 -10.0 0.0 0.0
3 -10.0 0.0 0.0
3 -10.0 0.0 0.0
3 -10.0 0.0 0.0
3 -10.0 0.0 0.0
3 -10.0 0.0 0.0
3 -10.0 0.0 0.0
3 -10.0 0.0 0.0
3 -10.0 0.0 0.0
3 -10.0 0.0 0.0
3 -10.0 0.0 0.0
3 -10.0 0.0 0.0
3 -10.0 0.0 0.0
3 -10.0 0.0 0.0
3 -10.0 0.0 0.0
CDATA:
9 1 0 0 0 1 0 0 0 1
9 1 0 0 0 1 0 0 0 1
9 1 0 0 0 1 0 0 0 1
9 1 0 0 0 1 0 0 0 1
9 1 0 0 0 1 0 0 0 1
9 1 0 0 0 1 0 0 0 1
9 1 0 0 0 1 0 0 0 1
9 1 0 0 0 1 0 0 0 1
9 1 0 0 0 1 0 0 0 1
9 1 0 0 0 1 0 0 0 1
9 1 0 0 0 1 0 0 0 1
9 1 0 0 0 1 0 0 0 1
9 1 0 0 0 1 0 0 0 1
9 1 0 0 0 1 0 0 0 1
9 1 0 0 0 1 0 0 0 1
9 1 0 0 0 1 0 0 0 1
9 1 0 0 0 1 0 0 0 1
9 1 0 0 0 1 0 0 0 1
9 1 0 0 0 1 0 0 0 1
9 1 0 0 0 1 0 0 0 1
9 1 0 0 0 1 0 0 0 1
9 1 0 0 0 1 0 0 0 1
9 1 0 0 0 1 0 0 0 1
9 1 0 0 0 1 0 0 0 1
9 1 0 0 0 1 0 0 0 1
9 1 0 0 0 1 0 0 0 1
9 1 0 0 0 1 0 0 0 1
9 1 0 0 0 1 0 0 0 1
9 1 0 0 0 1 0 0 0 1
9 1 0 0 0 1 0 0 0 1
9 1 0 0 0 1 0 0 0 1
9 1 0 0 0 1 0 0 0 1
9 1 0 0 0 1 0 0 0 1
9 1 0 0 0 1 0 0 0 1
9 1 0 0 0 1 0 0 0 1
9 1 0 0 0 1 0 0 0 1
9 1 0 0 0 1 0 0 0 1
9 1 0 0 0 1 0 0 0 1
9 1 0 0 0 1 0 0 0 1
9 1 0 0 0 1 0 0 0 1
9 1 0 0 0 1 0 0 0 1
9 1 0 0 0 1 0 0 0 1
9 1 0 0 0 1 0 0 0 1
9 1 0 0 0 1 0 0 0 1
9 1 0 0 0 1 0 0 0 1
9 1 0 0 0 1 0 0 0 1
9 1 0 0 0 1 0 0 0 1
9 1 0 0 0 1 0 0 0 1
9 1 0 0 0 1 0 0 0 1
9 1 0 0 0 1 0 0 0 1
9 1 0 0 0 1 0 0 0 1
9 1 0 0 0 1 0 0 0 1
9 1 0 0 0 1 0 0 0 1
9 1 0 0 0 1 0 0 0 1
9 1 0 0 0 1 0 0 0 1
9 1 0 0 0 1 0 0 0 1
9 1 0 0 0 1 0 0 0 1
9 1 0 0 0 1 0 0 0 1
9 1 0 0 0 1 0 0 0 1
9 1 0 0 0 1 0 0 0 1
9 1 0 0 0 1 0 0 0 1
9 1 0 0 0 1 0 0 0 1
9 1 0 0 0 1 0 0 0 1
9 1 0 0 0 1 0 0 0 1
9 1 0 0 0 1 0 0 0 1
9 1 0 0 0 1 0 0 0 1
9 1 0 0 0 1 0 0 0 1
9 1 0 0 0 1 0 0 0 1
9 1 0 0 0 1 0 0 0 1
9 1 0 0 0 1 0 0 0 1
9 1 0 0 0 1 0 0 0 1
9 1 0 0 0 1 0 0 0 1
9 1 0 0 0 1 0 0 0 1
9 1 0 0 0 1 0 0 0 1
9 1 0 0 0 1 0 0 0 1
9 1 0 0 0 1 0 0 0 1
9 1 0 0 0 1 0 0 0 1
9 1 0 0 0 1 0 0 0 1
9 1 0 0 0 1 0 0 0 1
9 1 0 0 0 1 0 0 0 1
9 1 0 0 0 1 0 0 0 1
9 1 0 0 0 1 0 0 0 1
9 1 0 0 0 1 0 0 0 1
9 1 0 0 0 1 0 0 0 1
9 1 0 0 0 1 0 0 0 1
9 1 0 0 0 1 0 0 0 1
9 1 0 0 0 1 0 0 0 1
9 1 0 0 0 1 0 0 0 1
9 1 0 0 0 1 0 0 0 1
9 1 0 0 0 1 0 0 0 1
9 1 0 0 0 1 0 0 0 1
9 1 0 0 0 1 0 0 0 1
9 1 0 0 0 1 0 0 0 1
9 1 0 0 0 1 0 0 0 1
9 1 0 0 0 1 0 0 0 1
9 1 0 0 0 1 0 0 0 1
9 1 0 0 0 1 0 0 0 1
9 1 0 0 0 1 0 0 0 1
9 1 0 0 0 1 0 0 0 1
9 1 0 0 0 1 0 0 0 1
9 1 0 0 0 1 0 0 0 1
9 1 0 0 0 1 0 0 0 1
9 1 0 0 0 1 0 0 0 1
9 1 0 0 0 1 0 0 0 1
9 1 0 0 0 1 0 0 0 1
9 1 0 0 0 1 0 0 0 1
9 1 0 0 0 1 0 0 0 1
9 1 0 0 0 1 0 0 0 1
9 1 0 0 0 1 0 0 0 1
9 1 0 0 0 1 0 0 0 1
9 1 0 0 0 1 0 0 0 1
9 1 0 0 0 1 0 0 0 1
9 1 0 0 0 1 0 0 0 1
9 1 0 0 0 1 0 0 0 1
9 1 0 0 0 1 0 0 0 1
9 1 0 0 0 1 0 0 0 1
9 1 0 0 0 1 0 0 0 1
9 1 0 0 0 1 0 0 0 1
9 1 0 0 0 1 0 0 0 1
9 1 0 0 0 1 0 0 0 1
9 1 0 0 0 1 0 0 0 1
9 1 0 0 0 1 0 0 0 1
9 1 0 0 0 1 0 0 0 1
9 1 0 0 0 1 0 0 0 1
9 1 0 0 0 1 0 0 0 1
9 1 0 0 0 1 0 0 0 1
9 1 0 0 0 1 0 0 0 1
9 1 0 0 0 1 0 0 0 1
9 1 0 0 0 1 0 0 0 1
9 1 0 0 0 1 0 0 0 1
9 1 0 0 0 1 0 0 0 1
9 1 0 0 0 1 0 0 0 1
9 1 0 0 0 1 0 0 0 1
9 1 0 0 0 1 0 0 0 1
9 1 0 0 0 1 0 0 0 1
9 1 0 0 0 1 0 0 0 1
9 1 0 0 0 1 0 0 0 1
9 1 0 0 0 1 0 0 0 1
9 1 0 0 0 1 0 0 0 1
9 1 0 0 0 1 0 0 0 1
9 1 0 0 0 1 0 0 0 1
9 1 0 0 0 1 0 0 0 1
9 1 0 0 0 1 0 0 0 1
9 1 0 0 0 1 0 0 0 1
9 1 0 0 0 1 0 0 0 1
9 1 0 0 0 1 0 0 0 1
9 1 0 0 0 1 0 0 0 1
9 1 0 0 0 1 0 0 0 1
9 1 0 0 0 1 0 0 0 1
9 1 0 0 0 1 0 0 0 1
9 1 0 0 0 1 0 0 0 1
9 1 0 0 0 1 0 0 0 1
9 1 0 0 0 1 0 0 0 1
9 1 0 0 0 1 0 0 0 1
9 1 0 0 0 1 0 0 0 1
9 1 0 0 0 1 0 0 0 1
9 1 0 0 0 1 0 0 0 1
9 1 0 0 0 1 0 0 0 1
9 1 0 0 0 1 0 0 0 1
9 1 0 0 0 1 0 0 0 1
9 1 0 0 0 1 0 0 0 1
9 1 0 0 0 1 0 0 0 1
9 1 0 0 0 1 0 0 0 1
9 1 0 0 0 1 0 0 0 1
9 1 0 0 0 1 0 0 0 1
9 1 0 0 0 1 0 0 0 1
9 1 0 0 0 1 0 0 0 1
9 1 0 0 0 1 0 0 0 1
9 1 0 0 0 1 0 0 0 1
9 1 0 0 0 1 0 0 0 1
9 1 0 0 0 1 0 0 0 1
9 1 0 0 0 1 0 0 0 1
9 1 0 0 0 1 0 0 0 1
9 1 0 0 0 1 0 0 0 1
9 1 0 0 0 1 0 0 0 1
9 1 0 0 0 1 0 0 0 1
9 1 0 0 0 1 0 0 0 1
9 1 0 0 0 1 0 0 0 1
9 1 0 0 0 1 0 0 0 1
9 1 0 0 0 1 0 0 0 1
9 1 0 0 0 1 0 0 0 1
9 1 0 0 0 1 0 0 0 1
9 1 0 0 0 1 0 0 0 1
9 1 0 0 0 1 0 0 0 1
9 1 0 0 0 1 0 0 0 1
9 1 0 0 0 1 0 0 0 1
9 1 0 0 0 1 0 0 0 1
9 1 0 0 0 1 0 0 0 1
9 1 0 0 0 1 0 0 0 1
9 1 0 0 0 1 0 0 0 1
9 1 0 0 0 1 0 0 0 1
9 1 0 0 0 1 0 0 0 1
9 1 0 0 0 1 0 0 0 1
9 1 0 0 0 1 0 0 0 1
9 1 0 0 0 1 0 0 0 1
9 1 0 0 0 1 0 0 0 1
9 1 0 0 0 1 0 0 0 1
9 1 0 0 0 1 0 0 0 1
9 1 0 0 0 1 0 0 0 1
9 1 0 0 0 1 0 0 0 1
9 1 0 0 0 1 0 0 0 1
9 1 0 0 0 1 0 0 0 1
9 1 0 0 0 1 0 0 0 1
9 1 0 0 0 1 0 0 0 1
9 1 0 0 0 1 0 0 0 1
9 1 0 0 0 1 0 0 0 1
9 1 0 0 0 1 0 0 0 1
9 1 0 0 0 1 0 0 0 1
9 1 0 0 0 1 0 0 0 1
9 1 0 0 0 1 0 0 0 1
9 1 0 0 0 1 0 0 0 1
9 1 0 0 0 1 0 0 0 1
9 1 0 0 0 1 0 0 0 1
9 1 0 0 0 1 0 0 0 1
9 1 0 0 0 1 0 0 0 1
9 1 0 0 0 1 0 0 0 1
9 1 0 0 0 1 0 0 0 1
9 1 0 0 0 1 0 0 0 1
9 1 0 0 0 1 0 0 0 1
9 1 0 0 0 1 0 0 0 1
9 1 0 0 0 1 0 0 0 1
9 1 0 0 0 1 0 0 0 1
9 1 0 0 0 1 0 0 0 1
9 1 0 0 0 1 0 0 0 1
9 1 0 0 0 1 0 0 0 1
9 1 0 0 0 1 0 0 0 1
9 1 0 0 0 1 0 0 0 1
9 1 0 0 0 1 0 0 0 1
9 1 0 0 0 1 0 0 0 1
9 1 0 0 0 1 0 0 0 1
9 1 0 0 0 1 0 0 0 1
9 1 0 0 0 1 0 0 0 1
9 1 0 0 0 1 0 0 0 1
9 1 0 0 0 1 0 0 0 1
9 1 0 0 0 1 0 0 0 1
9 1 0 0 0 1 0 0 0 1
9 1 0 0 0 1 0 0 0 1
9 1 0 0 0 1 0 0 0 1
9 1 0 0 0 1 0 0 0 1
9 1 0 0 0 1 0 0 0 1
9 1 0 0 0 1 0 0 0 1
9 1 0 0 0 1 0 0 0 1
9 1 0 0 0 1 0 0 0 1
9 1 0 0 0 1 0 0 0 1
9 1 0 0 0 1 0 0 0 1
9 1 0 0 0 1 0 0 0 1
9 1 0 0 0 1 0 0 0 1
9 1 0 0 0 1 0 0 0 1
9 1 0 0 0 1 0 0 0 1
9 1 0 0 0 1 0 0 0 1
9 1 0 0 0 1 0 0 0 1
9 1 0 0 0 1 0 0 0 1
9 1 0 0 0 1 0 0 0 1
9 1 0 0 0 1 0 0 0 1
9 1 0 0 0 1 0 0 0 1
9 1 0 0 0 1 0 0 0 1
9 1 0 0 0 1 0 0 0 1
9 1 0 0 0 1 0 0 0 1
9 1 0 0 0 1 0 0 0 1
9 1 0 0 0 1 0 0 0 1
9 1 0 0 0 1 0 0 0 1
9 1 0 0 0 1 0 0 0 1
9 1 0 0 0 1 0 0 0 1
9 1 0 0 0 1 0 0 0 1
9 1 0 0 0 1 0 0 0 1
9 1 0 0 0 1 0 0 0 1
9 1 0 0 0 1 0 0 0 1
9 1 0 0 0 1 0 0 0 1
9 1 0 0 0 1 0 0 0 1
9 1 0 0 0 1 0 0 0 1
9 1 0 0 0 1 0 0 0 1
9 1 0 0 0 1 0 0 0 1
9 1 0 0 0 1 0 0 0 1
9 1 0 0 0 1 0 0 0 1
9 1 0 0 0 1 0 0 0 1
9 1 0 0 0 1 0 0 0 1
9 1 0 0 0 1 0 0 0 1
9 1 0 0 0 1 0 0 0 1
9 1 0 0 0 1 0 0 0 1
9 1 0 0 0 1 0 0 0 1
9 1 0 0 0 1 0 0 0 1
9 1 0 0 0 1 0 0 0 1
9 1 0 0 0 1 0 0 0 1
9 1 0 0 0 1 0 0 0 1
9 1 0 0 0 1 0 0 0 1
9 1 0 0 0 1 0 0 0 1
9 1 0 0 0 1 0 0 0 1
9 1 0 0 0 1 0 0 0 1
9 1 0 0 0 1 0 0 0 1
9 1 0 0 0 1 0 0 0 1
9 1 0 0 0 1 0 0 0 1
9 1 0 0 0 1 0 0 0 1
9 1 0 0 0 1 0 0 0 1
9 1 0 0 0 1 0 0 0 1
9 1 0 0 0 1 0 0 0 1
9 1 0 0 0 1 0 0 0 1
9 1 0 0 0 1 0 0 0 1
9 1 0 0 0 1 0 0 0 1
9 1 0 0 0 1 0 0 0 1
9 1 0 0 0 1 0 0 0 1
9 1 0 0 0 1 0 0 0 1
9 1 0 0 0 1 0 0 0 1
9 1 0 0 0 1 0 0 0 1
9 1 0 0 0 1 0 0 0 1
9 1 0 0 0 1 0 0 0 1
9 1 0 0 0 1 0 0 0 1
9 1 0 0 0 1 0 0 0 1
9 1 0 0 0 1 0 0 0 1
9 1 0 0 0 1 0 0 0 1
9 1 0 0 0 1 0 0 0 1
9 1 0 0 0 1 0 0 0 1
9 1 0 0 0 1 0 0 0 1
9 1 0 0 0 1 0 0 0 1
9 1 0 0 0 1 0 0 0 1
9 1 0 0 0 1 0 0 0 1
9 1 0 0 0 1 0 0 0 1
9 1 0 0 0 1 0 0 0 1
9 1 0 0 0 1 0 0 0 1
9 1 0 0 0 1 0 0 0 1
9 1 0 0 0 1 0 0 0 1
9 1 0 0 0 1 0 0 0 1
9 1 0 0 0 1 0 0 0 1
9 1 0 0 0 1 0 0 0 1
9 1 0 0 0 1 0 0 0 1
9 1 0 0 0 1 0 0 0 1
9 1 0 0 0 1 0 0 0 1
9 1 0 0 0 1 0 0 0 1
9 1 0 0 0 1 0 0 0 1
9 1 0 0 0 1 0 0 0 1
9 1 0 0 0 1 0 0 0 1
9 1 0 0 0 1 0 0 0 1
9 1 0 0 0 1 0 0 0 1
9 1 0 0 0 1 0 0 0 1
9 1 0 0 0 1 0 0 0 1
9 1 0 0 0 1 0 0 0 1
9 1 0 0 0 1 0 0 0 1
9 1 0 0 0 1 0 0 0 1
9 1 0 0 0 1 0 0 0 1
9 1 0 0 0 1 0 0 0 1
9 1 0 0 0 1 0 0 0 1
9 1 0 0 0 1 0 0 0 1
9 1 0 0 0 1 0 0 0 1
9 1 0 0 0 1 0 0 0 1
9 1 0 0 0 1 0 0 0 1
9 1 0 0 0 1 0 0 0 1
9 1 0 0 0 1 0 0 0 1
9 1 0 0 0 1 0 0 0 1
9 1 0 0 0 1 0 0 0 1
9 1 0 0 0 1 0 0 0 1
9 1 0 0 0 1 0 0 0 1
9 1 0 0 0 1 0 0 0 1
9 1 0 0 0 1 0 0 0 1
9 1 0 0 0 1 0 0 0 1
9 1 0 0 0 1 0 0 0 1
9 1 0 0 0 1 0 0 0 1
9 1 0 0 0 1 0 0 0 1
9 1 0 0 0 1 0 0 0 1
9 1 0 0 0 1 0 0 0 1
9 1 0 0 0 1 0 0 0 1
9 1 0 0 0 1 0 0 0 1
9 1 0 0 0 1 0 0 0 1
9 1 0 0 0 1 0 0 0 1
9 1 0 0 0 1 0 0 0 1
9 1 0 0 0 1 0 0 0 1
9 1 0 0 0 1 0 0 0 1
9 1 0 0 0 1 0 0 0 1
9 1 0 0 0 1 0 0 0 1
9 1 0 0 0 1 0 0 0 1
9 1 0 0 0 1 0 0 0 1
9 1 0 0 0 1 0 0 0 1
9 1 0 0 0 1 0 0 0 1
9 1 0 0 0 1 0 0 0 1
9 1 0 0 0 1 0 0 0 1
9 1 0 0 0 1 0 0 0 1
9 1 0 0 0 1 0 0 0 1
9 1 0 0 0 1 0 0 0 1
9 1 0 0 0 1 0 0 0 1
9 1 0 0 0 1 0 0 0 1
9 1 0 0 0 1 0 0 0 1
9 1 0 0 0 1 0 0 0 1
9 1 0 0 0 1 0 0 0 1
9 1 0 0 0 1 0 0 0 1
9 1 0 0 0 1 0 0 0 1
9 1 0 0 0 1 0 0 0 1
9 1 0 0 0 1 0 0 0 1
9 1 0 0 0 1 0 0 0 1
9 1 0 0 0 1 0 0 0 1
9 1 0 0 0 1 0 0 0 1
9 1 0 0 0 1 0 0 0 1
9 1 0 0 0 1 0 0 0 1
9 1 0 0 0 1 0 0 0 1
9 1 0 0 0 1 0 0 0 1
9 1 0 0 0 1 0 0 0 1
9 1 0 0 0 1 0 0 0 1
9 1 0 0 0 1 0 0 0 1
9 1 0 0 0 1 0 0 0 1
9 1 0 0 0 1 0 0 0 1
9 1 0 0 0 1 0 0 0 1
9 1 0 0 0 1 0 0 0 1
9 1 0 0 0 1 0 0 0 1
9 1 0 0 0 1 0 0 0 1
9 1 0 0 0 1 0 0 0 1
9 1 0 0 0 1 0 0 0 1
9 1 0 0 0 1 0 0 0 1
9 1 0 0 0 1 0 0 0 1
9 1 0 0 0 1 0 0 0 1
9 1 0 0 0 1 0 0 0 1
9 1 0 0 0 1 0 0 0 1
9 1 0 0 0 1 0 0 0 1
9 1 0 0 0 1 0 0 0 1
9 1 0 0 0 1 0 0 0 1
9 1 0 0 0 1 0 0 0 1
9 1 0 0 0 1 0 0 0 1
9 1 0 0 0 1 0 0 0 1
9 1 0 0 0 1 0 0 0 1
9 1 0 0 0 1 0 0 0 1
9 1 0 0 0 1 0 0 0 1
9 1 0 0 0 1 0 0 0 1
9 1 0 0 0 1 0 0 0 1
9 1 0 0 0 1 0 0 0 1
9 1 0 0 0 1 0 0 0 1
9 1 0 0 0 1 0 0 0 1
9 1 0 0 0 1 0 0 0 1
9 1 0 0 0 1 0 0 0 1
9 1 0 0 0 1 0 0 0 1
9 1 0 0 0 1 0 0 0 1
9 1 0 0 0 1 0 0 0 1
9 1 0 0 0 1 0 0 0 1
9 1 0 0 0 1 0 0 0 1
9 1 0 0 0 1 0 0 0 1
9 1 0 0 0 1 0 0 0 1
9 1 0 0 0 1 0 0 0 1
9 1 0 0 0 1 0 0 0 1
9 1 0 0 0 1 0 0 0 1
9 1 0 0 0 1 0 0 0 1
9 1 0 0 0 1 0 0 0 1
9 1 0 0 0 1 0 0 0 1
9 1 0 0 0 1 0 0 0 1
9 1 0 0 0 1 0 0 0 1
9 1 0 0 0 1 0 0 0 1
9 1 0 0 0 1 0 0 0 1
9 1 0 0 0 1 0 0 0 1
9 1 0 0 0 1 0 0 0 1
9 1 0 0 0 1 0 0 0 1
9 1 0 0 0 1 0 0 0 1
9 1 0 0 0 1 0 0 0 1
9 1 0 0 0 1 0 0 0 1
9 1 0 0 0 1 0 0 0 1
9 1 0 0 0 1 0 0 0 1
9 1 0 0 0 1 0 0 0 1
9 1 0 0 0 1 0 0 0 1
9 1 0 0 0 1 0 0 0 1
9 1 0 0 0 1 0 0 0 1
9 1 0 0 0 1 0 0 0 1
9 1 0 0 0 1 0 0 0 1
9 1 0 0 0 1 0 0 0 1
9 1 0 0 0 1 0 0 0 1
9 1 0 0 0 1 0 0 0 1
9 1 0 0 0 1 0 0 0 1
9 1 0 0 0 1 0 0 0 1
9 1 0 0 0 1 0 0 0 1
9 1 0 0 0 1 0 0 0 1
9 1 0 0 0 1 0 0 0 1
9 1 0 0 0 1 0 0 0 1
9 1 0 0 0 1 0 0 0 1
9 1 0 0 0 1 0 0 0 1
9 1 0 0 0 1 0 0 0 1
9 1 0 0 0 1 0 0 0 1
9 1 0 0 0 1 0 0 0 1
9 1 0 0 0 1 0 0 0 1
9 1 0 0 0 1 0 0 0 1
9 1 0 0 0 1 0 0 0 1
9 1 0 0 0 1 0 0 0 1
9 1 0 0 0 1 0 0 0 1
9 1 0 0 0 1 0 0 0 1
9 1 0 0 0 1 0 0 0 1
9 1 0 0 0 1 0 0 0 1
9 1 0 0 0 1 0 0 0 1
9 1 0 0 0 1 0 0 0 1
9 1 0 0 0 1 0 0 0 1
9 1 0 0 0 1 0 0 0 1
9 1 0 0 0 1 0 0 0 1
9 1 0 0 0 1 0 0 0 1
9 1 0 0 0 1 0 0 0 1
9 1 0 0 0 1 0 0 0 1
9 1 0 0 0 1 0 0 0 1
9 1 0 0 0 1 0 0 0 1
9 1 0 0 0 1 0 0 0 1
9 1 0 0 0 1 0 0 0 1
9 1 0 0 0 1 0 0 0 1
9 1 0 0 0 1 0 0 0 1
9 1 0 0 0 1 0 0 0 1
9 1 0 0 0 1 0 0 0 1
9 1 0 0 0 1 0 0 0 1
9 1 0 0 0 1 0 0 0 1
9 1 0 0 0 1 0 0 0 1
9 1 0 0 0 1 0 0 0 1
9 1 0 0 0 1 0 0 0 1
9 1 0 0 0 1 0 0 0 1
9 1 0 0 0 1 0 0 0 1
9 1 0 0 0 1 0 0 0 1
9 1 0 0 0 1 0 0 0 1
9 1 0 0 0 1 0 0 0 1
9 1 0 0 0 1 0 0 0 1
9 1 0 0 0 1 0 0 0 1
9 1 0 0 0 1 0 0 0 1
9 1 0 0 0 1 0 0 0 1
9 1 0 0 0 1 0 0 0 1
9 1 0 0 0 1 0 0 0 1
9 1 0 0 0 1 0 0 0 1
9 1 0 0 0 1 0 0 0 1
9 1 0 0 0 1 0 0 0 1
9 1 0 0 0 1 0 0 0 1
9 1 0 0 0 1 0 0 0 1
9 1 0 0 0 1 0 0 0 1
9 1 0 0 0 1 0 0 0 1
9 1 0 0 0 1 0 0 0 1
9 1 0 0 0 1 0 0 0 1
9 1 0 0 0 1 0 0 0 1
9 1 0 0 0 1 0 0 0 1
9 1 0 0 0 1 0 0 0 1
9 1 0 0 0 1 0 0 0 1
9 1 0 0 0 1 0 0 0 1
9 1 0 0 0 1 0 0 0 1
9 1 0 0 0 1 0 0 0 1
9 1 0 0 0 1 0 0 0 1
9 1 0 0 0 1 0 0 0 1
9 1 0 0 0 1 0 0 0 1
9 1 0 0 0 1 0 0 0 1
9 1 0 0 0 1 0 0 0 1
9 1 0 0 0 1 0 0 0 1
9 1 0 0 0 1 0 0 0 1
9 1 0 0 0 1 0 0 0 1
9 1 0 0 0 1 0 0 0 1
9 1 0 0 0 1 0 0 0 1
9 1 0 0 0 1 0 0 0 1
9 1 0 0 0 1 0 0 0 1
9 1 0 0 0 1 0 0 0 1
9 1 0 0 0 1 0 0 0 1
9 1 0 0 0 1 0 0 0 1
9 1 0 0 0 1 0 0 0 1
9 1 0 0 0 1 0 0 0 1
9 1 0 0 0 1 0 0 0 1
9 1 0 0 0 1 0 0 0 1
9 1 0 0 0 1 0 0 0 1
9 1 0 0 0 1 0 0 0 1
9 1 0 0 0 1 0 0 0 1
9 1 0 0 0 1 0 0 0 1
9 1 0 0 0 1 0 0 0 1
9 1 0 0 0 1 0 0 0 1
9 1 0 0 0 1 0 0 0 1
9 1 0 0 0 1 0 0 0 1
9 1 0 0 0 1 0 0 0 1
9 1 0 0 0 1 0 0 0 1
9 1 0 0 0 1 0 0 0 1
9 1 0 0 0 1 0 0 0 1
9 1 0 0 0 1 0 0 0 1
9 1 0 0 0 1 0 0 0 1
9 1 0 0 0 1 0 0 0 1
9 1 0 0 0 1 0 0 0 1
9 1 0 0 0 1 0 0 0 1
9 1 0 0 0 1 0 0 0 1
9 1 0 0 0 1 0 0 0 1
9 1 0 0 0 1 0 0 0 1
9 1 0 0 0 1 0 0 0 1
9 1 0 0 0 1 0 0 0 1
9 1 0 0 0 1 0 0 0 1
9 1 0 0 0 1 0 0 0 1
9 1 0 0 0 1 0 0 0 1
9 1 0 0 0 1 0 0 0 1
9 1 0 0 0 1 0 0 0 1
9 1 0 0 0 1 0 0 0 1
9 1 0 0 0 1 0 0 0 1
9 1 0 0 0 1 0 0 0 1
9 1 0 0 0 1 0 0 0 1
9 1 0 0 0 1 0 0 0 1
9 1 0 0 0 1 0 0 0 1
9 1 0 0 0 1 0 0 0 1
9 1 0 0 0 1 0 0 0 1
9 1 0 0 0 1 0 0 0 1
9 1 0 0 0 1 0 0 0 1
9 1 0 0 0 1 0 0 0 1
9 1 0 0 0 1 0 0 0 1
9 1 0 0 0 1 0 0 0 1
9 1 0 0 0 1 0 0 0 1
9 1 0 0 0 1 0 0 0 1
9 1 0 0 0 1 0 0 0 1
9 1 0 0 0 1 0 0 0 1
9 1 0 0 0 1 0 0 0 1
9 1 0 0 0 1 0 0 0 1
9 1 0 0 0 1 0 0 0 1
9 1 0 0 0 1 0 0 0 1
9 1 0 0 0 1 0 0 0 1
9 1 0 0 0 1 0 0 0 1
9 1 0 0 0 1 0 0 0 1
9 1 0 0 0 1 0 0 0 1
9 1 0 0 0 1 0 0 0 1
9 1 0 0 0 1 0 0 0 1
9 1 0 0 0 1 0 0 0 1
9 1 0 0 0 1 0 0 0 1
9 1 0 0 0 1 0 0 0 1
9 1 0 0 0 1 0 0 0 1
9 1 0 0 0 1 0 0 0 1
9 1 0 0 0 1 0 0 0 1
9 1 0 0 0 1 0 0 0 1
9 1 0 0 0 1 0 0 0 1
9 1 0 0 0 1 0 0 0 1
9 1 0 0 0 1 0 0 0 1
9 1 0 0 0 1 0 0 0 1
9 1 0 0 0 1 0 0 0 1
9 1 0 0 0 1 0 0 0 1
9 1 0 0 0 1 0 0 0 1
9 1 0 0 0 1 0 0 0 1
9 1 0 0 0 1 0 0 0 1
9 1 0 0 0 1 0 0 0 1
9 1 0 0 0 1 0 0 0 1
9 1 0 0 0 1 0 0 0 1
9 1 0 0 0 1 0 0 0 1
9 1 0 0 0 1 0 0 0 1
9 1 0 0 0 1 0 0 0 1
9 1 0 0 0 1 0 0 0 1
9 1 0 0 0 1 0 0 0 1
9 1 0 0 0 1 0 0 0 1
9 1 0 0 0 1 0 0 0 1
9 1 0 0 0 1 0 0 0 1
9 1 0 0 0 1 0 0 0 1
9 1 0 0 0 1 0 0 0 1
9 1 0 0 0 1 0 0 0 1
9 1 0 0 0 1 0 0 0 1
9 1 0 0 0 1 0 0 0 1
9 1 0 0 0 1 0 0 0 1
9 1 0 0 0 1 0 0 0 1
9 1 0 0 0 1 0 0 0 1
9 1 0 0 0 1 0 0 0 1
9 1 0 0 0 1 0 0 0 1
9 1 0 0 0 1 0 0 0 1
9 1 0 0 0 1 0 0 0 1
9 1 0 0 0 1 0 0 0 1
9 1 0 0 0 1 0 0 0 1
9 1 0 0 0 1 0 0 0 1
9 1 0 0 0 1 0 0 0 1
9 1 0 0 0 1 0 0 0 1
9 1 0 0 0 1 0 0 0 1
9 1 0 0 0 1 0 0 0 1
9 1 0 0 0 1 0 0 0 1
9 1 0 0 0 1 0 0 0 1
9 1 0 0 0 1 0 0 0 1
9 1 0 0 0 1 0 0 0 1
9 1 0 0 0 1 0 0 0 1
9 1 0 0 0 1 0 0 0 1
9 1 0 0 0 1 0 0 0 1
9 1 0 0 0 1 0 0 0 1
9 1 0 0 0 1 0 0 0 1
9 1 0 0 0 1 0 0 0 1
9 1 0 0 0 1 0 0 0 1
9 1 0 0 0 1 0 0 0 1
9 1 0 0 0 1 0 0 0 1
9 1 0 0 0 1 0 0 0 1
9 1 0 0 0 1 0 0 0 1
9 1 0 0 0 1 0 0 0 1
9 1 0 0 0 1 0 0 0 1
9 1 0 0 0 1 0 0 0 1
9 1 0 0 0 1 0 0 0 1
9 1 0 0 0 1 0 0 0 1
9 1 0 0 0 1 0 0 0 1
9 1 0 0 0 1 0 0 0 1
9 1 0 0 0 1 0 0 0 1
9 1 0 0 0 1 0 0 0 1
9 1 0 0 0 1 0 0 0 1
9 1 0 0 0 1 0 0 0 1
9 1 0 0 0 1 0 0 0 1
9 1 0 0 0 1 0 0 0 1
9 1 0 0 0 1 0 0 0 1
9 1 0 0 0 1 0 0 0 1
9 1 0 0 0 1 0 0 0 1
9 1 0 0 0 1 0 0 0 1
9 1 0 0 0 1 0 0 0 1
9 1 0 0 0 1 0 0 0 1
9 1 0 0 0 1 0 0 0 1
9 1 0 0 0 1 0 0 0 1
9 1 0 0 0 1 0 0 0 1
9 1 0 0 0 1 0 0 0 1
9 1 0 0 0 1 0 0 0 1
9 1 0 0 0 1 0 0 0 1
9 1 0 0 0 1 0 0 0 1
9 1 0 0 0 1 0 0 0 1
9 1 0 0 0 1 0 0 0 1
9 1 0 0 0 1 0 0 0 1
9 1 0 0 0 1 0 0 0 1
9 1 0 0 0 1 0 0 0 1
9 1 0 0 0 1 0 0 0 1
9 1 0 0 0 1 0 0 0 1
9 1 0 0 0 1 0 0 0 1
9 1 0 0 0 1 0 0 0 1
9 1 0 0 0 1 0 0 0 1
9 1 0 0 0 1 0 0 0 1
9 1 0 0 0 1 0 0 0 1
9 1 0 0 0 1 0 0 0 1
9 1 0 0 0 1 0 0 0 1
9 1 0 0 0 1 0 0 0 1
9 1 0 0 0 1 0 0 0 1
9 1 0 0 0 1 0 0 0 1
9 1 0 0 0 1 0 0 0 1
9 1 0 0 0 1 0 0 0 1
9 1 0 0 0 1 0 0 0 1
9 1 0 0 0 1 0 0 0 1
9 1 0 0 0 1 0 0 0 1
9 1 0 0 0 1 0 0 0 1
9 1 0 0 0 1 0 0 0 1
9 1 0 0 0 1 0 0 0 1
9 1 0 0 0 1 0 0 0 1
9 1 0 0 0 1 0 0 0 1
9 1 0 0 0 1 0 0 0 1
9 1 0 0 0 1 0 0 0 1
9 1 0 0 0 1 0 0 0 1
9 1 0 0 0 1 0 0 0 1
9 1 0 0 0 1 0 0 0 1
9 1 0 0 0 1 0 0 0 1
9 1 0 0 0 1 0 0 0 1
9 1 0 0 0 1 0 0 0 1
9 1 0 0 0 1 0 0 0 1
9 1 0 0 0 1 0 0 0 1
9 1 0 0 0 1 0 0 0 1
9 1 0 0 0 1 0 0 0 1
9 1 0 0 0 1 0 0 0 1
9 1 0 0 0 1 0 0 0 1
9 1 0 0 0 1 0 0 0 1
9 1 0 0 0 1 0 0 0 1
9 1 0 0 0 1 0 0 0 1
9 1 0 0 0 1 0 0 0 1
9 1 0 0 0 1 0 0 0 1
9 1 0 0 0 1 0 0 0 1
9 1 0 0 0 1 0 0 0 1
9 1 0 0 0 1 0 0 0 1
9 1 0 0 0 1 0 0 0 1
9 1 0 0 0 1 0 0 0 1
9 1 0 0 0 1 0 0 0 1
9 1 0 0 0 1 0 0 0 1
9 1 0 0 0 1 0 0 0 1
9 1 0 0 0 1 0 0 0 1
9 1 0 0 0 1 0 0 0 1
9 1 0 0 0 1 0 0 0 1
9 1 0 0 0 1 0 0 0 1
9 1 0 0 0 1 0 0 0 1
9 1 0 0 0 1 0 0 0 1
9 1 0 0 0 1 0 0 0 1
9 1 0 0 0 1 0 0 0 1
9 1 0 0 0 1 0 0 0 1
9 1 0 0 0 1 0 0 0 1
9 1 0 0 0 1 0 0 0 1
9 1 0 0 0 1 0 0 0 1
9 1 0 0 0 1 0 0 0 1
9 1 0 0 0 1 0 0 0 1
9 1 0 0 0 1 0 0 0 1
9 1 0 0 0 1 0 0 0 1
9 1 0 0 0 1 0 0 0 1
9 1 0 0 0 1 0 0 0 1
9 1 0 0 0 1 0 0 0 1
9 1 0 0 0 1 0 0 0 1
9 1 0 0 0 1 0 0 0 1
9 1 0 0 0 1 0 0 0 1
9 1 0 0 0 1 0 0 0 1
9 1 0 0 0 1 0 0 0 1
9 1 0 0 0 1 0 0 0 1
9 1 0 0 0 1 0 0 0 1
9 1 0 0 0 1 0 0 0 1
9 1 0 0 0 1 0 0 0 1
9 1 0 0 0 1 0 0 0 1
9 1 0 0 0 1 0 0 0 1
9 1 0 0 0 1 0 0 0 1
9 1 0 0 0 1 0 0 0 1
9 1 0 0 0 1 0 0 0 1
9 1 0 0 0 1 0 0 0 1
9 1 0 0 0 1 0 0 0 1
9 1 0 0 0 1 0 0 0 1
9 1 0 0 0 1 0 0 0 1
9 1 0 0 0 1 0 0 0 1
9 1 0 0 0 1 0 0 0 1
9 1 0 0 0 1 0 0 0 1
9 1 0 0 0 1 0 0 0 1
9 1 0 0 0 1 0 0 0 1
9 1 0 0 0 1 0 0 0 1
9 1 0 0 0 1 0 0 0 1
9 1 0 0 0 1 0 0 0 1
9 1 0 0 0 1 0 0 0 1
9 1 0 0 0 1 0 0 0 1
9 1 0 0 0 1 0 0 0 1
9 1 0 0 0 1 0 0 0 1
9 1 0 0 0 1 0 0 0 1
9 1 0 0 0 1 0 0 0 1
9 1 0 0 0 1 0 0 0 1
9 1 0 0 0 1 0 0 0 1
9 1 0 0 0 1 0 0 0 1
9 1 0 0 0 1 0 0 0 1
9 1 0 0 0 1 0 0 0 1
9 1 0 0 0 1 0 0 0 1
9 1 0 0 0 1 0 0 0 1
9 1 0 0 0 1 0 0 0 1
9 1 0 0 0 1 0 0 0 1
9 1 0 0 0 1 0 0 0 1
9 1 0 0 0 1 0 0 0 1
9 1 0 0 0 1 0 0 0 1
9 1 0 0 0 1 0 0 0 1
9 1 0 0 0 1 0 0 0 1
9 1 0 0 0 1 0 0 0 1
9 1 0 0 0 1 0 0 0 1
9 1 0 0 0 1 0 0 0 1
9 1 0 0 0 1 0 0 0 1
9 1 0 0 0 1 0 0 0 1
9 1 0 0 0 1 0 0 0 1
9 1 0 0 0 1 0 0 0 1
9 1 0 0 0 1 0 0 0 1
9 1 0 0 0 1 0 0 0 1
9 1 0 0 0 1 0 0 0 1
9 1 0 0 0 1 0 0 0 1
9 1 0 0 0 1 0 0 0 1
9 1 0 0 0 1 0 0 0 1
9 1 0 0 0 1 0 0 0 1
9 1 0 0 0 1 0 0 0 1
9 1 0 0 0 1 0 0 0 1
9 1 0 0 0 1 0 0 0 1
9 1 0 0 0 1 0 0 0 1
9 1 0 0 0 1 0 0 0 1
9 1 0 0 0 1 0 0 0 1
9 1 0 0 0 1 0 0 0 1
9 1 0 0 0 1 0 0 0 1
9 1 0 0 0 1 0 0 0 1
9 1 0 0 0 1 0 0 0 1
9 1 0 0 0 1 0 0 0 1
9 1 0 0 0 1 0 0 0 1
9 1 0 0 0 1 0 0 0 1
9 1 0 0 0 1 0 0 0 1
9 1 0 0 0 1 0 0 0 1
9 1 0 0 0 1 0 0 0 1
9 1 0 0 0 1 0 0 0 1
9 1 0 0 0 1 0 0 0 1
9 1 0 0 0 1 0 0 0 1
9 1 0 0 0 1 0 0 0 1
9 1 0 0 0 1 0 0 0 1
9 1 0 0 0 1 0 0 0 1
9 1 0 0 0 1 0 0 0 1
9 1 0 0 0 1 0 0 0 1
9 1 0 0 0 1 0 0 0 1
9 1 0 0 0 1 0 0 0 1
9 1 0 0 0 1 0 0 0 1
9 1 0 0 0 1 0 0 0 1
9 1 0 0 0 1 0 0 0 1
9 1 0 0 0 1 0 0 0 1
9 1 0 0 0 1 0 0 0 1
9 1 0 0 0 1 0 0 0 1
9 1 0 0 0 1 0 0 0 1
9 1 0 0 0 1 0 0 0 1
9 1 0 0 0 1 0 0 0 1
9 1 0 0 0 1 0 0 0 1
9 1 0 0 0 1 0 0 0 1
9 1 0 0 0 1 0 0 0 1
9 1 0 0 0 1 0 0 0 1
9 1 0 0 0 1 0 0 0 1
9 1 0 0 0 1 0 0 0 1
9 1 0 0 0 1 0 0 0 1
9 1 0 0 0 1 0 0 0 1
9 1 0 0 0 1 0 0 0 1
9 1 0 0 0 1 0 0 0 1
9 1 0 0 0 1 0 0 0 1
9 1 0 0 0 1 0 0 0 1
9 1 0 0 0 1 0 0 0 1
9 1 0 0 0 1 0 0 0 1
9 1 0 0 0 1 0 0 0 1
9 1 0 0 0 1 0 0 0 1
9 1 0 0 0 1 0 0 0 1
9 1 0 0 0 1 0 0 0 1
9 1 0 0 0 1 0 0 0 1
9 1 0 0 0 1 0 0 0 1
9 1 0 0 0 1 0 0 0 1
9 1 0 0 0 1 0 0 0 1
9 1 0 0 0 1 0 0 0 1
9 1 0 0 0 1 0 0 0 1
9 1 0 0 0 1 0 0 0 1
9 1 0 0 0 1 0 0 0 1
9 1 0 0 0 1 0 0 0 1
9 1 0 0 0 1 0 0 0 1
9 1 0 0 0 1 0 0 0 1
9 1 0 0 0 1 0 0 0 1
9 1 0 0 0 1 0 0 0 1
9 1 0 0 0 1 0 0 0 1
9 1 0 0 0 1 0 0 0 1
9 1 0 0 0 1 0 0 0 1
9 1 0 0 0 1 0 0 0 1
9 1 0 0 0 1 0 0 0 1
9 1 0 0 0 1 0 0 0 1
9 1 0 0 0 1 0 0 0 1
9 1 0 0 0 1 0 0 0 1
9 1 0 0 0 1 0 0 0 1
9 1 0 0 0 1 0 0 0 1
9 1 0 0 0 1 0 0 0 1
9 1 0 0 0 1 0 0 0 1
9 1 0 0 0 1 0 0 0 1
9 1 0 0 0 1 0 0 0 1
9 1 0 0 0 1 0 0 0 1
9 1 0 0 0 1 0 0 0 1
9 1 0 0 0 1 0 0 0 1
9 1 0 0 0 1 0 0 0 1
9 1 0 0 0 1 0 0 0 1
9 1 0 0 0 1 0 0 0 1
9 1 0 0 0 1 0 0 0 1
9 1 0 0 0 1 0 0 0 1
9 1 0 0 0 1 0 0 0 1
9 1 0 0 0 1 0 0 0 1
9 1 0 0 0 1 0 0 0 1
9 1 0 0 0 1 0 0 0 1
9 1 0 0 0 1 0 0 0 1
9 1 0 0 0 1 0 0 0 1
9 1 0 0 0 1 0 0 0 1
9 1 0 0 0 1 0 0 0 1
9 1 0 0 0 1 0 0 0 1
9 1 0 0 0 1 0 0 0 1
9 1 0 0 0 1 0 0 0 1
9 1 0 0 0 1 0 0 0 1
9 1 0 0 0 1 0 0 0 1
9 1 0 0 0 1 0 0 0 1
9 1 0 0 0 1 0 0 0 1
9 1 0 0 0 1 0 0 0 1
9 1 0 0 0 1 0 0 0 1
9 1 0 0 0 1 0 0 0 1
9 1 0 0 0 1 0 0 0 1
9 1 0 0 0 1 0 0 0 1
9 1 0 0 0 1 0 0 0 1
9 1 0 0 0 1 0 0 0 1
9 1 0 0 0 1 0 0 0 1
9 1 0 0 0 1 0 0 0 1
9 1 0 0 0 1 0 0 0 1
9 1 0 0 0 1 0 0 0 1
9 1 0 0 0 1 0 0 0 1
9 1 0 0 0 1 0 0 0 1
9 1 0 0 0 1 0 0 0 1
9 1 0 0 0 1 0 0 0 1
9 1 0 0 0 1 0 0 0 1
9 1 0 0 0 1 0 0 0 1
9 1 0 0 0 1 0 0 0 1
9 1 0 0 0 1 0 0 0 1
9 1 0 0 0 1 0 0 0 1
9 1 0 0 0 1 0 0 0 1
9 1 0 0 0 1 0 0 0 1
9 1 0 0 0 1 0 0 0 1
9 1 0 0 0 1 0 0 0 1
9 1 0 0 0 1 0 0 0 1
9 1 0 0 0 1 0 0 0 1
9 1 0 0 0 1 0 0 0 1
9 1 0 0 0 1 0 0 0 1
9 1 0 0 0 1 0 0 0 1
9 1 0 0 0 1 0 0 0 1
9 1 0 0 0 1 0 0 0 1
9 1 0 0 0 1 0 0 0 1
9 1 0 0 0 1 0 0 0 1
9 1 0 0 0 1 0 0 0 1
9 1 0 0 0 1 0 0 0 1
9 1 0 0 0 1 0 0 0 1
9 1 0 0 0 1 0 0 0 1
9 1 0 0 0 1 0 0 0 1
9 1 0 0 0 1 0 0 0 1
9 1 0 0 0 1 0 0 0 1
9 1 0 0 0 1 0 0 0 1
9 1 0 0 0 1 0 0 0 1
9 1 0 0 0 1 0 0 0 1
9 1 0 0 0 1 0 0 0 1
9 1 0 0 0 1 0 0 0 1
9 1 0 0 0 1 0 0 0 1
9 1 0 0 0 1 0 0 0 1
9 1 0 0 0 1 0 0 0 1
9 1 0 0 0 1 0 0 0 1
9 1 0 0 0 1 0 0 0 1
9 1 0 0 0 1 0 0 0 1
9 1 0 0 0 1 0 0 0 1
9 1 0 0 0 1 0 0 0 1
9 1 0 0 0 1 0 0 0 1
9 1 0 0 0 1 0 0 0 1
9 1 0 0 0 1 0 0 0 1
9 1 0 0 0 1 0 0 0 1
9 1 0 0 0 1 0 0 0 1
9 1 0 0 0 1 0 0 0 1
9 1 0 0 0 1 0 0 0 1
9 1 0 0 0 1 0 0 0 1
9 1 0 0 0 1 0 0 0 1
9 1 0 0 0 1 0 0 0 1
9 1 0 0 0 1 0 0 0 1
9 1 0 0 0 1 0 0 0 1
9 1 0 0 0 1 0 0 0 1
9 1 0 0 0 1 0 0 0 1
9 1 0 0 0 1 0 0 0 1
9 1 0 0 0 1 0 0 0 1
9 1 0 0 0 1 0 0 0 1
9 1 0 0 0 1 0 0 0 1
9 1 0 0 0 1 0 0 0 1
9 1 0 0 0 1 0 0 0 1
9 1 0 0 0 1 0 0 0 1
9 1 0 0 0 1 0 0 0 1
9 1 0 0 0 1 0 0 0 1
9 1 0 0 0 1 0 0 0 1
9 1 0 0 0 1 0 0 0 1
9 1 0 0 0 1 0 0 0 1
9 1 0 0 0 1 0 0 0 1
9 1 0 0 0 1 0 0 0 1
9 1 0 0 0 1 0 0 0 1
9 1 0 0 0 1 0 0 0 1
9 1 0 0 0 1 0 0 0 1
9 1 0 0 0 1 0 0 0 1
9 1 0 0 0 1 0 0 0 1
9 1 0 0 0 1 0 0 0 1
9 1 0 0 0 1 0 0 0 1
9 1 0 0 0 1 0 0 0 1
9 1 0 0 0 1 0 0 0 1
9 1 0 0 0 1 0 0 0 1
9 1 0 0 0 1 0 0 0 1
9 1 0 0 0 1 0 0 0 1
9 1 0 0 0 1 0 0 0 1
9 1 0 0 0 1 0 0 0 1
9 1 0 0 0 1 0 0 0 1
9 1 0 0 0 1 0 0 0 1
9 1 0 0 0 1 0 0 0 1
9 1 0 0 0 1 0 0 0 1
9 1 0 0 0 1 0 0 0 1
9 1 0 0 0 1 0 0 0 1
9 1 0 0 0 1 0 0 0 1
9 1 0 0 0 1 0 0 0 1
9 1 0 0 0 1 0 0 0 1
9 1 0 0 0 1 0 0 0 1
9 1 0 0 0 1 0 0 0 1
9 1 0 0 0 1 0 0 0 1
9 1 0 0 0 1 0 0 0 1
9 1 0 0 0 1 0 0 0 1
9 1 0 0 0 1 0 0 0 1
9 1 0 0 0 1 0 0 0 1
9 1 0 0 0 1 0 0 0 1
9 1 0 0 0 1 0 0 0 1
9 1 0 0 0 1 0 0 0 1
9 1 0 0 0 1 0 0 0 1
9 1 0 0 0 1 0 0 0 1
9 1 0 0 0 1 0 0 0 1
9 1 0 0 0 1 0 0 0 1
9 1 0 0 0 1 0 0 0 1
9 1 0 0 0 1 0 0 0 1
9 1 0 0 0 1 0 0 0 1
9 1 0 0 0 1 0 0 0 1
9 1 0 0 0 1 0 0 0 1
9 1 0 0 0 1 0 0 0 1
9 1 0 0 0 1 0 0 0 1
9 1 0 0 0 1 0 0 0 1
9 1 0 0 0 1 0 0 0 1
9 1 0 0 0 1 0 0 0 1
9 1 0 0 0 1 0 0 0 1
9 1 0 0 0 1 0 0 0 1
9 1 0 0 0 1 0 0 0 1
9 1 0 0 0 1 0 0 0 1
9 1 0 0 0 1 0 0 0 1
9 1 0 0 0 1 0 0 0 1
9 1 0 0 0 1 0 0 0 1
9 1 0 0 0 1 0 0 0 1
9 1 0 0 0 1 0 0 0 1
9 1 0 0 0 1 0 0 0 1
9 1 0 0 0 1 0 0 0 1
9 1 0 0 0 1 0 0 0 1
9 1 0 0 0 1 0 0 0 1
9 1 0 0 0 1 0 0 0 1
9 1 0 0 0 1 0 0 0 1
9 1 0 0 0 1 0 0 0 1
9 1 0 0 0 1 0 0 0 1
9 1 0 0 0 1 0 0 0 1
9 1 0 0 0 1 0 0 0 1
9 1 0 0 0 1 0 0 0 1
9 1 0 0 0 1 0 0 0 1
9 1 0 0 0 1 0 0 0 1
9 1 0 0 0 1 0 0 0 1
9 1 0 0 0 1 0 0 0 1
9 1 0 0 0 1 0 0 0 1
9 1 0 0 0 1 0 0 0 1
9 1 0 0 0 1 0 0 0 1
9 1 0 0 0 1 0 0 0 1
9 1 0 0 0 1 0 0 0 1
9 1 0 0 0 1 0 0 0 1
9 1 0 0 0 1 0 0 0 1
9 1 0 0 0 1 0 0 0 1
9 1 0 0 0 1 0 0 0 1
9 1 0 0 0 1 0 0 0 1
9 1 0 0 0 1 0 0 0 1
9 1 0 0 0 1 0 0 0 1
9 1 0 0 0 1 0 0 0 1
9 1 0 0 0 1 0 0 0 1
9 1 0 0 0 1 0 0 0 1
9 1 0 0 0 1 0 0 0 1
9 1 0 0 0 1 0 0 0 1
9 1 0 0 0 1 0 0 0 1
9 1 0 0 0 1 0 0 0 1
9 1 0 0 0 1 0 0 0 1
9 1 0 0 0 1 0 0 0 1
9 1 0 0 0 1 0 0 0 1
9 1 0 0 0 1 0 0 0 1
9 1 0 0 0 1 0 0 0 1
9 1 0 0 0 1 0 0 0 1
9 1 0 0 0 1 0 0 0 1
9 1 0 0 0 1 0 0 0 1
9 1 0 0 0 1 0 0 0 1
9 1 0 0 0 1 0 0 0 1
9 1 0 0 0 1 0 0 0 1
9 1 0 0 0 1 0 0 0 1
9 1 0 0 0 1 0 0 0 1
9 1 0 0 0 1 0 0 0 1
9 1 0 0 0 1 0 0 0 1
9 1 0 0 0 1 0 0 0 1
9 1 0 0 0 1 0 0 0 1
9 1 0 0 0 1 0 0 0 1
9 1 0 0 0 1 0 0 0 1
9 1 0 0 0 1 0 0 0 1
9 1 0 0 0 1 0 0 0 1
9 1 0 0 0 1 0 0 0 1
9 1 0 0 0 1 0 0 0 1
9 1 0 0 0 1 0 0 0 1
9 1 0 0 0 1 0 0 0 1
9 1 0 0 0 1 0 0 0 1
9 1 0 0 0 1 0 0 0 1
9 1 0 0 0 1 0 0 0 1
9 1 0 0 0 1 0 0 0 1
9 1 0 0 0 1 0 0 0 1
9 1 0 0 0 1 0 0 0 1
9 1 0 0 0 1 0 0 0 1
9 1 0 0 0 1 0 0 0 1
9 1 0 0 0 1 0 0 0 1
9 1 0 0 0 1 0 0 0 1
9 1 0 0 0 1 0 0 0 1
9 1 0 0 0 1 0 0 0 1
9 1 0 0 0 1 0 0 0 1
9 1 0 0 0 1 0 0 0 1
9 1 0 0 0 1 0 0 0 1
9 1 0 0 0 1 0 0 0 1
9 1 0 0 0 1 0 0 0 1
9 1 0 0 0 1 0 0 0 1
9 1 0 0 0 1 0 0 0 1
9 1 0 0 0 1 0 0 0 1
9 1 0 0 0 1 0 0 0 1
9 1 0 0 0 1 0 0 0 1
9 1 0 0 0 1 0 0 0 1
9 1 0 0 0 1 0 0 0 1
9 1 0 0 0 1 0 0 0 1
9 1 0 0 0 1 0 0 0 1
9 1 0 0 0 1 0 0 0 1
9 1 0 0 0 1 0 0 0 1
9 1 0 0 0 1 0 0 0 1
9 1 0 0 0 1 0 0 0 1
9 1 0 0 0 1 0 0 0 1
9 1 0 0 0 1 0 0 0 1
9 1 0 0 0 1 0 0 0 1
9 1 0 0 0 1 0 0 0 1
9 1 0 0 0 1 0 0 0 1
9 1 0 0 0 1 0 0 0 1
9 1 0 0 0 1 0 0 0 1
9 1 0 0 0 1 0 0 0 1
9 1 0 0 0 1 0 0 0 1
9 1 0 0 0 1 0 0 0 1
9 1 0 0 0 1 0 0 0 1
9 1 0 0 0 1 0 0 0 1
9 1 0 0 0 1 0 0 0 1
9 1 0 0 0 1 0 0 0 1
9 1 0 0 0 1 0 0 0 1
9 1 0 0 0 1 0 0 0 1
9 1 0 0 0 1 0 0 0 1
9 1 0 0 0 1 0 0 0 1
9 1 0 0 0 1 0 0 0 1
9 1 0 0 0 1 0 0 0 1
9 1 0 0 0 1 0 0 0 1
9 1 0 0 0 1 0 0 0 1
9 1 0 0 0 1 0 0 0 1
9 1 0 0 0 1 0 0 0 1
9 1 0 0 0 1 0 0 0 1
9 1 0 0 0 1 0 0 0 1
9 1 0 0 0 1 0 0 0 1
9 1 0 0 0 1 0 0 0 1
9 1 0 0 0 1 0 0 0 1
9 1 0 0 0 1 0 0 0 1
9 1 0 0 0 1 0 0 0 1
9 1 0 0 0 1 0 0 0 1
9 1 0 0 0 1 0 0 0 1
9 1 0 0 0 1 0 0 0 1
9 1 0 0 0 1 0 0 0 1
9 1 0 0 0 1 0 0 0 1
9 1 0 0 0 1 0 0 0 1
9 1 0 0 0 1 0 0 0 1
9 1 0 0 0 1 0 0 0 1
9 1 0 0 0 1 0 0 0 1
9 1 0 0 0 1 0 0 0 1
9 1 0 0 0 1 0 0 0 1
9 1 0 0 0 1 0 0 0 1
9 1 0 0 0 1 0 0 0 1
9 1 0 0 0 1 0 0 0 1
9 1 0 0 0 1 0 0 0 1
9 1 0 0 0 1 0 0 0 1
9 1 0 0 0 1 0 0 0 1
9 1 0 0 0 1 0 0 0 1
9 1 0 0 0 1 0 0 0 1
9 1 0 0 0 1 0 0 0 1
9 1 0 0 0 1 0 0 0 1
9 1 0 0 0 1 0 0 0 1
9 1 0 0 0 1 0 0 0 1
9 1 0 0 0 1 0 0 0 1
9 1 0 0 0 1 0 0 0 1
9 1 0 0 0 1 0 0 0 1
9 1 0 0 0 1 0 0 0 1
9 1 0 0 0 1 0 0 0 1
9 1 0 0 0 1 0 0 0 1
9 1 0 0 0 1 0 0 0 1
9 1 0 0 0 1 0 0 0 1
9 1 0 0 0 1 0 0 0 1
9 1 0 0 0 1 0 0 0 1
9 1 0 0 0 1 0 0 0 1
9 1 0 0 0 1 0 0 0 1
9 1 0 0 0 1 0 0 0 1
9 1 0 0 0 1 0 0 0 1
9 1 0 0 0 1 0 0 0 1
9 1 0 0 0 1 0 0 0 1
9 1 0 0 0 1 0 0 0 1
9 1 0 0 0 1 0 0 0 1
9 1 0 0 0 1 0 0 0 1
9 1 0 0 0 1 0 0 0 1
9 1 0 0 0 1 0 0 0 1
9 1 0 0 0 1 0 0 0 1
9 1 0 0 0 1 0 0 0 1
9 1 0 0 0 1 0 0 0 1
9 1 0 0 0 1 0 0 0 1
9 1 0 0 0 1 0 0 0 1
9 1 0 0 0 1 0 0 0 1
9 1 0 0 0 1 0 0 0 1
9 1 0 0 0 1 0 0 0 1
9 1 0 0 0 1 0 0 0 1
9 1 0 0 0 1 0 0 0 1
9 1 0 0 0 1 0 0 0 1
9 1 0 0 0 1 0 0 0 1
9 1 0 0 0 1 0 0 0 1
9 1 0 0 0 1 0 0 0 1
9 1 0 0 0 1 0 0 0 1
9 1 0 0 0 1 0 0 0 1
9 1 0 0 0 1 0 0 0 1
9 1 0 0 0 1 0 0 0 1
9 1 0 0 0 1 0 0 0 1
9 1 0 0 0 1 0 0 0 1
9 1 0 0 0 1 0 0 0 1
9 1 0 0 0 1 0 0 0 1
9 1 0 0 0 1 0 0 0 1
9 1 0 0 0 1 0 0 0 1
9 1 0 0 0 1 0 0 0 1
9 1 0 0 0 1 0 0 0 1
9 1 0 0 0 1 0 0 0 1
9 1 0 0 0 1 0 0 0 1
9 1 0 0 0 1 0 0 0 1
9 1 0 0 0 1 0 0 0 1
9 1 0 0 0 1 0 0 0 1
9 1 0 0 0 1 0 0 0 1
9 1 0 0 0 1 0 0 0 1
9 1 0 0 0 1 0 0 0 1
9 1 0 0 0 1 0 0 0 1
9 1 0 0 0 1 0 0 0 1
9 1 0 0 0 1 0 0 0 1
9 1 0 0 0 1 0 0 0 1
9 1 0 0 0 1 0 0 0 1
9 1 0 0 0 1 0 0 0 1
9 1 0 0 0 1 0 0 0 1
9 1 0 0 0 1 0 0 0 1
9 1 0 0 0 1 0 0 0 1
9 1 0 0 0 1 0 0 0 1
9 1 0 0 0 1 0 0 0 1
9 1 0 0 0 1 0 0 0 1
9 1 0 0 0 1 0 0 0 1
9 1 0 0 0 1 0 0 0 1
9 1 0 0 0 1 0 0 0 1
9 1 0 0 0 1 0 0 0 1
9 1 0 0 0 1 0 0 0 1
9 1 0 0 0 1 0 0 0 1
9 1 0 0 0 1 0 0 0 1
9 1 0 0 0 1 0 0 0 1
9 1 0 0 0 1 0 0 0 1
9 1 0 0 0 1 0 0 0 1
9 1 0 0 0 1 0 0 0 1
9 1 0 0 0 1 0 0 0 1
9 1 0 0 0 1 0 0 0 1
9 1 0 0 0 1 0 0 0 1
9 1 0 0 0 1 0 0 0 1
9 1 0 0 0 1 0 0 0 1
9 1 0 0 0 1 0 0 0 1
9 1 0 0 0 1 0 0 0 1
9 1 0 0 0 1 0 0 0 1
9 1 0 0 0 1 0 0 0 1
9 1 0 0 0 1 0 0 0 1
9 1 0 0 0 1 0 0 0 1
9 1 0 0 0 1 0 0 0 1
9 1 0 0 0 1 0 0 0 1
9 1 0 0 0 1 0 0 0 1
9 1 0 0 0 1 0 0 0 1
9 1 0 0 0 1 0 0 0 1
9 1 0 0 0 1 0 0 0 1
