\relax 
\citation{tentuscher}
\@writefile{toc}{\contentsline {section}{\tocsection {Appendix}{}{Supplement Material (for references and discussion, not for the paper)}}{19}}
\@writefile{toc}{\contentsline {section}{\tocsection {Appendix}{D}{A splitting method for the monodomain equation}}{19}}
\newlabel{neumannbnd}{{21d}{19}}
\@setckpt{Splitting}{
\setcounter{page}{21}
\setcounter{equation}{22}
\setcounter{enumi}{3}
\setcounter{enumii}{0}
\setcounter{enumiii}{0}
\setcounter{enumiv}{0}
\setcounter{footnote}{0}
\setcounter{mpfootnote}{0}
\setcounter{parentequation}{21}
\setcounter{part}{0}
\setcounter{section}{4}
\setcounter{subsection}{0}
\setcounter{subsubsection}{0}
\setcounter{paragraph}{0}
\setcounter{subparagraph}{0}
\setcounter{figure}{0}
\setcounter{table}{6}
\setcounter{thrm}{0}
\setcounter{float@type}{8}
\setcounter{ContinuedFloat}{0}
\setcounter{algorithm}{0}
\setcounter{ALC@unique}{0}
\setcounter{ALC@line}{0}
\setcounter{ALC@rem}{0}
\setcounter{ALC@depth}{0}
\setcounter{theorem}{0}
}
