POINTS:
0.0000 0.0000 0.0000
0.0000 0.0000 0.5000
0.0000 0.0000 1.0000
0.0000 0.0000 1.5000
0.0000 0.0000 2.0000
0.0000 0.0000 2.5000
0.0000 0.0000 3.0000
0.0000 0.5000 0.0000
0.0000 0.5000 0.5000
0.0000 0.5000 1.0000
0.0000 0.5000 1.5000
0.0000 0.5000 2.0000
0.0000 0.5000 2.5000
0.0000 0.5000 3.0000
0.0000 1.0000 0.0000
0.0000 1.0000 0.5000
0.0000 1.0000 1.0000
0.0000 1.0000 1.5000
0.0000 1.0000 2.0000
0.0000 1.0000 2.5000
0.0000 1.0000 3.0000
0.0000 1.5000 0.0000
0.0000 1.5000 0.5000
0.0000 1.5000 1.0000
0.0000 1.5000 1.5000
0.0000 1.5000 2.0000
0.0000 1.5000 2.5000
0.0000 1.5000 3.0000
0.0000 2.0000 0.0000
0.0000 2.0000 0.5000
0.0000 2.0000 1.0000
0.0000 2.0000 1.5000
0.0000 2.0000 2.0000
0.0000 2.0000 2.5000
0.0000 2.0000 3.0000
0.0000 2.5000 0.0000
0.0000 2.5000 0.5000
0.0000 2.5000 1.0000
0.0000 2.5000 1.5000
0.0000 2.5000 2.0000
0.0000 2.5000 2.5000
0.0000 2.5000 3.0000
0.0000 3.0000 0.0000
0.0000 3.0000 0.5000
0.0000 3.0000 1.0000
0.0000 3.0000 1.5000
0.0000 3.0000 2.0000
0.0000 3.0000 2.5000
0.0000 3.0000 3.0000
0.5000 0.0000 0.0000
0.5000 0.0000 0.5000
0.5000 0.0000 1.0000
0.5000 0.0000 1.5000
0.5000 0.0000 2.0000
0.5000 0.0000 2.5000
0.5000 0.0000 3.0000
0.5000 0.5000 0.0000
0.5000 0.5000 0.5000
0.5000 0.5000 1.0000
0.5000 0.5000 1.5000
0.5000 0.5000 2.0000
0.5000 0.5000 2.5000
0.5000 0.5000 3.0000
0.5000 1.0000 0.0000
0.5000 1.0000 0.5000
0.5000 1.0000 1.0000
0.5000 1.0000 1.5000
0.5000 1.0000 2.0000
0.5000 1.0000 2.5000
0.5000 1.0000 3.0000
0.5000 1.5000 0.0000
0.5000 1.5000 0.5000
0.5000 1.5000 1.0000
0.5000 1.5000 1.5000
0.5000 1.5000 2.0000
0.5000 1.5000 2.5000
0.5000 1.5000 3.0000
0.5000 2.0000 0.0000
0.5000 2.0000 0.5000
0.5000 2.0000 1.0000
0.5000 2.0000 1.5000
0.5000 2.0000 2.0000
0.5000 2.0000 2.5000
0.5000 2.0000 3.0000
0.5000 2.5000 0.0000
0.5000 2.5000 0.5000
0.5000 2.5000 1.0000
0.5000 2.5000 1.5000
0.5000 2.5000 2.0000
0.5000 2.5000 2.5000
0.5000 2.5000 3.0000
0.5000 3.0000 0.0000
0.5000 3.0000 0.5000
0.5000 3.0000 1.0000
0.5000 3.0000 1.5000
0.5000 3.0000 2.0000
0.5000 3.0000 2.5000
0.5000 3.0000 3.0000
1.0000 0.0000 0.0000
1.0000 0.0000 0.5000
1.0000 0.0000 1.0000
1.0000 0.0000 1.5000
1.0000 0.0000 2.0000
1.0000 0.0000 2.5000
1.0000 0.0000 3.0000
1.0000 0.5000 0.0000
1.0000 0.5000 0.5000
1.0000 0.5000 1.0000
1.0000 0.5000 1.5000
1.0000 0.5000 2.0000
1.0000 0.5000 2.5000
1.0000 0.5000 3.0000
1.0000 1.0000 0.0000
1.0000 1.0000 0.5000
1.0000 1.0000 1.0000
1.0000 1.0000 1.5000
1.0000 1.0000 2.0000
1.0000 1.0000 2.5000
1.0000 1.0000 3.0000
1.0000 1.5000 0.0000
1.0000 1.5000 0.5000
1.0000 1.5000 1.0000
1.0000 1.5000 1.5000
1.0000 1.5000 2.0000
1.0000 1.5000 2.5000
1.0000 1.5000 3.0000
1.0000 2.0000 0.0000
1.0000 2.0000 0.5000
1.0000 2.0000 1.0000
1.0000 2.0000 1.5000
1.0000 2.0000 2.0000
1.0000 2.0000 2.5000
1.0000 2.0000 3.0000
1.0000 2.5000 0.0000
1.0000 2.5000 0.5000
1.0000 2.5000 1.0000
1.0000 2.5000 1.5000
1.0000 2.5000 2.0000
1.0000 2.5000 2.5000
1.0000 2.5000 3.0000
1.0000 3.0000 0.0000
1.0000 3.0000 0.5000
1.0000 3.0000 1.0000
1.0000 3.0000 1.5000
1.0000 3.0000 2.0000
1.0000 3.0000 2.5000
1.0000 3.0000 3.0000
1.5000 0.0000 0.0000
1.5000 0.0000 0.5000
1.5000 0.0000 1.0000
1.5000 0.0000 1.5000
1.5000 0.0000 2.0000
1.5000 0.0000 2.5000
1.5000 0.0000 3.0000
1.5000 0.5000 0.0000
1.5000 0.5000 0.5000
1.5000 0.5000 1.0000
1.5000 0.5000 1.5000
1.5000 0.5000 2.0000
1.5000 0.5000 2.5000
1.5000 0.5000 3.0000
1.5000 1.0000 0.0000
1.5000 1.0000 0.5000
1.5000 1.0000 1.0000
1.5000 1.0000 1.5000
1.5000 1.0000 2.0000
1.5000 1.0000 2.5000
1.5000 1.0000 3.0000
1.5000 1.5000 0.0000
1.5000 1.5000 0.5000
1.5000 1.5000 1.0000
1.5000 1.5000 1.5000
1.5000 1.5000 2.0000
1.5000 1.5000 2.5000
1.5000 1.5000 3.0000
1.5000 2.0000 0.0000
1.5000 2.0000 0.5000
1.5000 2.0000 1.0000
1.5000 2.0000 1.5000
1.5000 2.0000 2.0000
1.5000 2.0000 2.5000
1.5000 2.0000 3.0000
1.5000 2.5000 0.0000
1.5000 2.5000 0.5000
1.5000 2.5000 1.0000
1.5000 2.5000 1.5000
1.5000 2.5000 2.0000
1.5000 2.5000 2.5000
1.5000 2.5000 3.0000
1.5000 3.0000 0.0000
1.5000 3.0000 0.5000
1.5000 3.0000 1.0000
1.5000 3.0000 1.5000
1.5000 3.0000 2.0000
1.5000 3.0000 2.5000
1.5000 3.0000 3.0000
2.0000 0.0000 0.0000
2.0000 0.0000 0.5000
2.0000 0.0000 1.0000
2.0000 0.0000 1.5000
2.0000 0.0000 2.0000
2.0000 0.0000 2.5000
2.0000 0.0000 3.0000
2.0000 0.5000 0.0000
2.0000 0.5000 0.5000
2.0000 0.5000 1.0000
2.0000 0.5000 1.5000
2.0000 0.5000 2.0000
2.0000 0.5000 2.5000
2.0000 0.5000 3.0000
2.0000 1.0000 0.0000
2.0000 1.0000 0.5000
2.0000 1.0000 1.0000
2.0000 1.0000 1.5000
2.0000 1.0000 2.0000
2.0000 1.0000 2.5000
2.0000 1.0000 3.0000
2.0000 1.5000 0.0000
2.0000 1.5000 0.5000
2.0000 1.5000 1.0000
2.0000 1.5000 1.5000
2.0000 1.5000 2.0000
2.0000 1.5000 2.5000
2.0000 1.5000 3.0000
2.0000 2.0000 0.0000
2.0000 2.0000 0.5000
2.0000 2.0000 1.0000
2.0000 2.0000 1.5000
2.0000 2.0000 2.0000
2.0000 2.0000 2.5000
2.0000 2.0000 3.0000
2.0000 2.5000 0.0000
2.0000 2.5000 0.5000
2.0000 2.5000 1.0000
2.0000 2.5000 1.5000
2.0000 2.5000 2.0000
2.0000 2.5000 2.5000
2.0000 2.5000 3.0000
2.0000 3.0000 0.0000
2.0000 3.0000 0.5000
2.0000 3.0000 1.0000
2.0000 3.0000 1.5000
2.0000 3.0000 2.0000
2.0000 3.0000 2.5000
2.0000 3.0000 3.0000
2.5000 0.0000 0.0000
2.5000 0.0000 0.5000
2.5000 0.0000 1.0000
2.5000 0.0000 1.5000
2.5000 0.0000 2.0000
2.5000 0.0000 2.5000
2.5000 0.0000 3.0000
2.5000 0.5000 0.0000
2.5000 0.5000 0.5000
2.5000 0.5000 1.0000
2.5000 0.5000 1.5000
2.5000 0.5000 2.0000
2.5000 0.5000 2.5000
2.5000 0.5000 3.0000
2.5000 1.0000 0.0000
2.5000 1.0000 0.5000
2.5000 1.0000 1.0000
2.5000 1.0000 1.5000
2.5000 1.0000 2.0000
2.5000 1.0000 2.5000
2.5000 1.0000 3.0000
2.5000 1.5000 0.0000
2.5000 1.5000 0.5000
2.5000 1.5000 1.0000
2.5000 1.5000 1.5000
2.5000 1.5000 2.0000
2.5000 1.5000 2.5000
2.5000 1.5000 3.0000
2.5000 2.0000 0.0000
2.5000 2.0000 0.5000
2.5000 2.0000 1.0000
2.5000 2.0000 1.5000
2.5000 2.0000 2.0000
2.5000 2.0000 2.5000
2.5000 2.0000 3.0000
2.5000 2.5000 0.0000
2.5000 2.5000 0.5000
2.5000 2.5000 1.0000
2.5000 2.5000 1.5000
2.5000 2.5000 2.0000
2.5000 2.5000 2.5000
2.5000 2.5000 3.0000
2.5000 3.0000 0.0000
2.5000 3.0000 0.5000
2.5000 3.0000 1.0000
2.5000 3.0000 1.5000
2.5000 3.0000 2.0000
2.5000 3.0000 2.5000
2.5000 3.0000 3.0000
3.0000 0.0000 0.0000
3.0000 0.0000 0.5000
3.0000 0.0000 1.0000
3.0000 0.0000 1.5000
3.0000 0.0000 2.0000
3.0000 0.0000 2.5000
3.0000 0.0000 3.0000
3.0000 0.5000 0.0000
3.0000 0.5000 0.5000
3.0000 0.5000 1.0000
3.0000 0.5000 1.5000
3.0000 0.5000 2.0000
3.0000 0.5000 2.5000
3.0000 0.5000 3.0000
3.0000 1.0000 0.0000
3.0000 1.0000 0.5000
3.0000 1.0000 1.0000
3.0000 1.0000 1.5000
3.0000 1.0000 2.0000
3.0000 1.0000 2.5000
3.0000 1.0000 3.0000
3.0000 1.5000 0.0000
3.0000 1.5000 0.5000
3.0000 1.5000 1.0000
3.0000 1.5000 1.5000
3.0000 1.5000 2.0000
3.0000 1.5000 2.5000
3.0000 1.5000 3.0000
3.0000 2.0000 0.0000
3.0000 2.0000 0.5000
3.0000 2.0000 1.0000
3.0000 2.0000 1.5000
3.0000 2.0000 2.0000
3.0000 2.0000 2.5000
3.0000 2.0000 3.0000
3.0000 2.5000 0.0000
3.0000 2.5000 0.5000
3.0000 2.5000 1.0000
3.0000 2.5000 1.5000
3.0000 2.5000 2.0000
3.0000 2.5000 2.5000
3.0000 2.5000 3.0000
3.0000 3.0000 0.0000
3.0000 3.0000 0.5000
3.0000 3.0000 1.0000
3.0000 3.0000 1.5000
3.0000 3.0000 2.0000
3.0000 3.0000 2.5000
3.0000 3.0000 3.0000
CELLS:
4 0000  0 7 56 8
4 0000  0 56 49 50
4 0000  0 8 1 50
4 0000  56 57 8 50
4 0000  0 56 50 8
4 0000  1 50 2 8
4 0000  9 2 58 8
4 0000  57 8 50 58
4 0000  51 58 2 50
4 0000  8 50 58 2
4 0000  2 9 58 10
4 0000  2 58 51 52
4 0000  2 10 3 52
4 0000  58 59 10 52
4 0000  2 58 52 10
4 0000  3 52 4 10
4 0000  11 4 60 10
4 0000  59 10 52 60
4 0000  53 60 4 52
4 0000  10 52 60 4
4 0000  4 11 60 12
4 0000  4 60 53 54
4 0000  4 12 5 54
4 0000  60 61 12 54
4 0000  4 60 54 12
4 0000  5 54 6 12
4 0000  13 6 62 12
4 0000  61 12 54 62
4 0000  55 62 6 54
4 0000  12 54 62 6
4 0000  7 56 8 14
4 0000  15 8 64 14
4 0000  63 14 56 64
4 0000  57 64 8 56
4 0000  14 56 64 8
4 0000  8 15 64 16
4 0000  8 64 57 58
4 0000  8 16 9 58
4 0000  64 65 16 58
4 0000  8 64 58 16
4 0000  9 58 10 16
4 0000  17 10 66 16
4 0000  65 16 58 66
4 0000  59 66 10 58
4 0000  16 58 66 10
4 0000  10 17 66 18
4 0000  10 66 59 60
4 0000  10 18 11 60
4 0000  66 67 18 60
4 0000  10 66 60 18
4 0000  11 60 12 18
4 0000  19 12 68 18
4 0000  67 18 60 68
4 0000  61 68 12 60
4 0000  18 60 68 12
4 0000  12 19 68 20
4 0000  12 68 61 62
4 0000  12 20 13 62
4 0000  68 69 20 62
4 0000  12 68 62 20
4 0000  14 21 70 22
4 0000  14 70 63 64
4 0000  14 22 15 64
4 0000  70 71 22 64
4 0000  14 70 64 22
4 0000  15 64 16 22
4 0000  23 16 72 22
4 0000  71 22 64 72
4 0000  65 72 16 64
4 0000  22 64 72 16
4 0000  16 23 72 24
4 0000  16 72 65 66
4 0000  16 24 17 66
4 0000  72 73 24 66
4 0000  16 72 66 24
4 0000  17 66 18 24
4 0000  25 18 74 24
4 0000  73 24 66 74
4 0000  67 74 18 66
4 0000  24 66 74 18
4 0000  18 25 74 26
4 0000  18 74 67 68
4 0000  18 26 19 68
4 0000  74 75 26 68
4 0000  18 74 68 26
4 0000  19 68 20 26
4 0000  27 20 76 26
4 0000  75 26 68 76
4 0000  69 76 20 68
4 0000  26 68 76 20
4 0000  21 70 22 28
4 0000  29 22 78 28
4 0000  77 28 70 78
4 0000  71 78 22 70
4 0000  28 70 78 22
4 0000  22 29 78 30
4 0000  22 78 71 72
4 0000  22 30 23 72
4 0000  78 79 30 72
4 0000  22 78 72 30
4 0000  23 72 24 30
4 0000  31 24 80 30
4 0000  79 30 72 80
4 0000  73 80 24 72
4 0000  30 72 80 24
4 0000  24 31 80 32
4 0000  24 80 73 74
4 0000  24 32 25 74
4 0000  80 81 32 74
4 0000  24 80 74 32
4 0000  25 74 26 32
4 0000  33 26 82 32
4 0000  81 32 74 82
4 0000  75 82 26 74
4 0000  32 74 82 26
4 0000  26 33 82 34
4 0000  26 82 75 76
4 0000  26 34 27 76
4 0000  82 83 34 76
4 0000  26 82 76 34
4 0000  28 35 84 36
4 0000  28 84 77 78
4 0000  28 36 29 78
4 0000  84 85 36 78
4 0000  28 84 78 36
4 0000  29 78 30 36
4 0000  37 30 86 36
4 0000  85 36 78 86
4 0000  79 86 30 78
4 0000  36 78 86 30
4 0000  30 37 86 38
4 0000  30 86 79 80
4 0000  30 38 31 80
4 0000  86 87 38 80
4 0000  30 86 80 38
4 0000  31 80 32 38
4 0000  39 32 88 38
4 0000  87 38 80 88
4 0000  81 88 32 80
4 0000  38 80 88 32
4 0000  32 39 88 40
4 0000  32 88 81 82
4 0000  32 40 33 82
4 0000  88 89 40 82
4 0000  32 88 82 40
4 0000  33 82 34 40
4 0000  41 34 90 40
4 0000  89 40 82 90
4 0000  83 90 34 82
4 0000  40 82 90 34
4 0000  35 84 36 42
4 0000  43 36 92 42
4 0000  91 42 84 92
4 0000  85 92 36 84
4 0000  42 84 92 36
4 0000  36 43 92 44
4 0000  36 92 85 86
4 0000  36 44 37 86
4 0000  92 93 44 86
4 0000  36 92 86 44
4 0000  37 86 38 44
4 0000  45 38 94 44
4 0000  93 44 86 94
4 0000  87 94 38 86
4 0000  44 86 94 38
4 0000  38 45 94 46
4 0000  38 94 87 88
4 0000  38 46 39 88
4 0000  94 95 46 88
4 0000  38 94 88 46
4 0000  39 88 40 46
4 0000  47 40 96 46
4 0000  95 46 88 96
4 0000  89 96 40 88
4 0000  46 88 96 40
4 0000  40 47 96 48
4 0000  40 96 89 90
4 0000  40 48 41 90
4 0000  96 97 48 90
4 0000  40 96 90 48
4 0000  49 98 50 56
4 0000  57 50 106 56
4 0000  105 56 98 106
4 0000  99 106 50 98
4 0000  56 98 106 50
4 0000  50 57 106 58
4 0000  50 106 99 100
4 0000  50 58 51 100
4 0000  106 107 58 100
4 0000  50 106 100 58
4 0000  51 100 52 58
4 0000  59 52 108 58
4 0000  107 58 100 108
4 0000  101 108 52 100
4 0000  58 100 108 52
4 0000  52 59 108 60
4 0000  52 108 101 102
4 0000  52 60 53 102
4 0000  108 109 60 102
4 0000  52 108 102 60
4 0000  53 102 54 60
4 0000  61 54 110 60
4 0000  109 60 102 110
4 0000  103 110 54 102
4 0000  60 102 110 54
4 0000  54 61 110 62
4 0000  54 110 103 104
4 0000  54 62 55 104
4 0000  110 111 62 104
4 0000  54 110 104 62
4 0000  56 63 112 64
4 0000  56 112 105 106
4 0000  56 64 57 106
4 0000  112 113 64 106
4 0000  56 112 106 64
4 0000  57 106 58 64
4 0000  65 58 114 64
4 0000  113 64 106 114
4 0000  107 114 58 106
4 0000  64 106 114 58
4 0000  58 65 114 66
4 0000  58 114 107 108
4 0000  58 66 59 108
4 0000  114 115 66 108
4 0000  58 114 108 66
4 0000  59 108 60 66
4 0000  67 60 116 66
4 0000  115 66 108 116
4 0000  109 116 60 108
4 0000  66 108 116 60
4 0000  60 67 116 68
4 0000  60 116 109 110
4 0000  60 68 61 110
4 0000  116 117 68 110
4 0000  60 116 110 68
4 0000  61 110 62 68
4 0000  69 62 118 68
4 0000  117 68 110 118
4 0000  111 118 62 110
4 0000  68 110 118 62
4 0000  63 112 64 70
4 0000  71 64 120 70
4 0000  119 70 112 120
4 0000  113 120 64 112
4 0000  70 112 120 64
4 0000  64 71 120 72
4 0000  64 120 113 114
4 0000  64 72 65 114
4 0000  120 121 72 114
4 0000  64 120 114 72
4 0000  65 114 66 72
4 0000  73 66 122 72
4 0000  121 72 114 122
4 0000  115 122 66 114
4 0000  72 114 122 66
4 0000  66 73 122 74
4 0000  66 122 115 116
4 0000  66 74 67 116
4 0000  122 123 74 116
4 0000  66 122 116 74
4 0000  67 116 68 74
4 0000  75 68 124 74
4 0000  123 74 116 124
4 0000  117 124 68 116
4 0000  74 116 124 68
4 0000  68 75 124 76
4 0000  68 124 117 118
4 0000  68 76 69 118
4 0000  124 125 76 118
4 0000  68 124 118 76
4 0000  70 77 126 78
4 0000  70 126 119 120
4 0000  70 78 71 120
4 0000  126 127 78 120
4 0000  70 126 120 78
4 0000  71 120 72 78
4 0000  79 72 128 78
4 0000  127 78 120 128
4 0000  121 128 72 120
4 0000  78 120 128 72
4 0000  72 79 128 80
4 0000  72 128 121 122
4 0000  72 80 73 122
4 0000  128 129 80 122
4 0000  72 128 122 80
4 0000  73 122 74 80
4 0000  81 74 130 80
4 0000  129 80 122 130
4 0000  123 130 74 122
4 0000  80 122 130 74
4 0000  74 81 130 82
4 0000  74 130 123 124
4 0000  74 82 75 124
4 0000  130 131 82 124
4 0000  74 130 124 82
4 0000  75 124 76 82
4 0000  83 76 132 82
4 0000  131 82 124 132
4 0000  125 132 76 124
4 0000  82 124 132 76
4 0000  77 126 78 84
4 0000  85 78 134 84
4 0000  133 84 126 134
4 0000  127 134 78 126
4 0000  84 126 134 78
4 0000  78 85 134 86
4 0000  78 134 127 128
4 0000  78 86 79 128
4 0000  134 135 86 128
4 0000  78 134 128 86
4 0000  79 128 80 86
4 0000  87 80 136 86
4 0000  135 86 128 136
4 0000  129 136 80 128
4 0000  86 128 136 80
4 0000  80 87 136 88
4 0000  80 136 129 130
4 0000  80 88 81 130
4 0000  136 137 88 130
4 0000  80 136 130 88
4 0000  81 130 82 88
4 0000  89 82 138 88
4 0000  137 88 130 138
4 0000  131 138 82 130
4 0000  88 130 138 82
4 0000  82 89 138 90
4 0000  82 138 131 132
4 0000  82 90 83 132
4 0000  138 139 90 132
4 0000  82 138 132 90
4 0000  84 91 140 92
4 0000  84 140 133 134
4 0000  84 92 85 134
4 0000  140 141 92 134
4 0000  84 140 134 92
4 0000  85 134 86 92
4 0000  93 86 142 92
4 0000  141 92 134 142
4 0000  135 142 86 134
4 0000  92 134 142 86
4 0000  86 93 142 94
4 0000  86 142 135 136
4 0000  86 94 87 136
4 0000  142 143 94 136
4 0000  86 142 136 94
4 0000  87 136 88 94
4 0000  95 88 144 94
4 0000  143 94 136 144
4 0000  137 144 88 136
4 0000  94 136 144 88
4 0000  88 95 144 96
4 0000  88 144 137 138
4 0000  88 96 89 138
4 0000  144 145 96 138
4 0000  88 144 138 96
4 0000  89 138 90 96
4 0000  97 90 146 96
4 0000  145 96 138 146
4 0000  139 146 90 138
4 0000  96 138 146 90
4 0000  98 105 154 106
4 0000  98 154 147 148
4 0000  98 106 99 148
4 0000  154 155 106 148
4 0000  98 154 148 106
4 0000  99 148 100 106
4 0000  107 100 156 106
4 0000  155 106 148 156
4 0000  149 156 100 148
4 0000  106 148 156 100
4 0000  100 107 156 108
4 0000  100 156 149 150
4 0000  100 108 101 150
4 0000  156 157 108 150
4 0000  100 156 150 108
4 0000  101 150 102 108
4 0000  109 102 158 108
4 0000  157 108 150 158
4 0000  151 158 102 150
4 0000  108 150 158 102
4 0000  102 109 158 110
4 0000  102 158 151 152
4 0000  102 110 103 152
4 0000  158 159 110 152
4 0000  102 158 152 110
4 0000  103 152 104 110
4 0000  111 104 160 110
4 0000  159 110 152 160
4 0000  153 160 104 152
4 0000  110 152 160 104
4 0000  105 154 106 112
4 0000  113 106 162 112
4 0000  161 112 154 162
4 0000  155 162 106 154
4 0000  112 154 162 106
4 0000  106 113 162 114
4 0000  106 162 155 156
4 0000  106 114 107 156
4 0000  162 163 114 156
4 0000  106 162 156 114
4 0000  107 156 108 114
4 0000  115 108 164 114
4 0000  163 114 156 164
4 0000  157 164 108 156
4 0000  114 156 164 108
4 0000  108 115 164 116
4 0000  108 164 157 158
4 0000  108 116 109 158
4 0000  164 165 116 158
4 0000  108 164 158 116
4 0000  109 158 110 116
4 0000  117 110 166 116
4 0000  165 116 158 166
4 0000  159 166 110 158
4 0000  116 158 166 110
4 0000  110 117 166 118
4 0000  110 166 159 160
4 0000  110 118 111 160
4 0000  166 167 118 160
4 0000  110 166 160 118
4 0000  112 119 168 120
4 0000  112 168 161 162
4 0000  112 120 113 162
4 0000  168 169 120 162
4 0000  112 168 162 120
4 0000  113 162 114 120
4 0000  121 114 170 120
4 0000  169 120 162 170
4 0000  163 170 114 162
4 0000  120 162 170 114
4 0000  114 121 170 122
4 0000  114 170 163 164
4 0000  114 122 115 164
4 0000  170 171 122 164
4 0000  114 170 164 122
4 0000  115 164 116 122
4 0000  123 116 172 122
4 0000  171 122 164 172
4 0000  165 172 116 164
4 0000  122 164 172 116
4 0000  116 123 172 124
4 0000  116 172 165 166
4 0000  116 124 117 166
4 0000  172 173 124 166
4 0000  116 172 166 124
4 0000  117 166 118 124
4 0000  125 118 174 124
4 0000  173 124 166 174
4 0000  167 174 118 166
4 0000  124 166 174 118
4 0000  119 168 120 126
4 0000  127 120 176 126
4 0000  175 126 168 176
4 0000  169 176 120 168
4 0000  126 168 176 120
4 0000  120 127 176 128
4 0000  120 176 169 170
4 0000  120 128 121 170
4 0000  176 177 128 170
4 0000  120 176 170 128
4 0000  121 170 122 128
4 0000  129 122 178 128
4 0000  177 128 170 178
4 0000  171 178 122 170
4 0000  128 170 178 122
4 0000  122 129 178 130
4 0000  122 178 171 172
4 0000  122 130 123 172
4 0000  178 179 130 172
4 0000  122 178 172 130
4 0000  123 172 124 130
4 0000  131 124 180 130
4 0000  179 130 172 180
4 0000  173 180 124 172
4 0000  130 172 180 124
4 0000  124 131 180 132
4 0000  124 180 173 174
4 0000  124 132 125 174
4 0000  180 181 132 174
4 0000  124 180 174 132
4 0000  126 133 182 134
4 0000  126 182 175 176
4 0000  126 134 127 176
4 0000  182 183 134 176
4 0000  126 182 176 134
4 0000  127 176 128 134
4 0000  135 128 184 134
4 0000  183 134 176 184
4 0000  177 184 128 176
4 0000  134 176 184 128
4 0000  128 135 184 136
4 0000  128 184 177 178
4 0000  128 136 129 178
4 0000  184 185 136 178
4 0000  128 184 178 136
4 0000  129 178 130 136
4 0000  137 130 186 136
4 0000  185 136 178 186
4 0000  179 186 130 178
4 0000  136 178 186 130
4 0000  130 137 186 138
4 0000  130 186 179 180
4 0000  130 138 131 180
4 0000  186 187 138 180
4 0000  130 186 180 138
4 0000  131 180 132 138
4 0000  139 132 188 138
4 0000  187 138 180 188
4 0000  181 188 132 180
4 0000  138 180 188 132
4 0000  133 182 134 140
4 0000  141 134 190 140
4 0000  189 140 182 190
4 0000  183 190 134 182
4 0000  140 182 190 134
4 0000  134 141 190 142
4 0000  134 190 183 184
4 0000  134 142 135 184
4 0000  190 191 142 184
4 0000  134 190 184 142
4 0000  135 184 136 142
4 0000  143 136 192 142
4 0000  191 142 184 192
4 0000  185 192 136 184
4 0000  142 184 192 136
4 0000  136 143 192 144
4 0000  136 192 185 186
4 0000  136 144 137 186
4 0000  192 193 144 186
4 0000  136 192 186 144
4 0000  137 186 138 144
4 0000  145 138 194 144
4 0000  193 144 186 194
4 0000  187 194 138 186
4 0000  144 186 194 138
4 0000  138 145 194 146
4 0000  138 194 187 188
4 0000  138 146 139 188
4 0000  194 195 146 188
4 0000  138 194 188 146
4 0000  147 196 148 154
4 0000  155 148 204 154
4 0000  203 154 196 204
4 0000  197 204 148 196
4 0000  154 196 204 148
4 0000  148 155 204 156
4 0000  148 204 197 198
4 0000  148 156 149 198
4 0000  204 205 156 198
4 0000  148 204 198 156
4 0000  149 198 150 156
4 0000  157 150 206 156
4 0000  205 156 198 206
4 0000  199 206 150 198
4 0000  156 198 206 150
4 0000  150 157 206 158
4 0000  150 206 199 200
4 0000  150 158 151 200
4 0000  206 207 158 200
4 0000  150 206 200 158
4 0000  151 200 152 158
4 0000  159 152 208 158
4 0000  207 158 200 208
4 0000  201 208 152 200
4 0000  158 200 208 152
4 0000  152 159 208 160
4 0000  152 208 201 202
4 0000  152 160 153 202
4 0000  208 209 160 202
4 0000  152 208 202 160
4 0000  154 161 210 162
4 0000  154 210 203 204
4 0000  154 162 155 204
4 0000  210 211 162 204
4 0000  154 210 204 162
4 0000  155 204 156 162
4 0000  163 156 212 162
4 0000  211 162 204 212
4 0000  205 212 156 204
4 0000  162 204 212 156
4 0000  156 163 212 164
4 0000  156 212 205 206
4 0000  156 164 157 206
4 0000  212 213 164 206
4 0000  156 212 206 164
4 0000  157 206 158 164
4 0000  165 158 214 164
4 0000  213 164 206 214
4 0000  207 214 158 206
4 0000  164 206 214 158
4 0000  158 165 214 166
4 0000  158 214 207 208
4 0000  158 166 159 208
4 0000  214 215 166 208
4 0000  158 214 208 166
4 0000  159 208 160 166
4 0000  167 160 216 166
4 0000  215 166 208 216
4 0000  209 216 160 208
4 0000  166 208 216 160
4 0000  161 210 162 168
4 0000  169 162 218 168
4 0000  217 168 210 218
4 0000  211 218 162 210
4 0000  168 210 218 162
4 0000  162 169 218 170
4 0000  162 218 211 212
4 0000  162 170 163 212
4 0000  218 219 170 212
4 0000  162 218 212 170
4 0000  163 212 164 170
4 0000  171 164 220 170
4 0000  219 170 212 220
4 0000  213 220 164 212
4 0000  170 212 220 164
4 0000  164 171 220 172
4 0000  164 220 213 214
4 0000  164 172 165 214
4 0000  220 221 172 214
4 0000  164 220 214 172
4 0000  165 214 166 172
4 0000  173 166 222 172
4 0000  221 172 214 222
4 0000  215 222 166 214
4 0000  172 214 222 166
4 0000  166 173 222 174
4 0000  166 222 215 216
4 0000  166 174 167 216
4 0000  222 223 174 216
4 0000  166 222 216 174
4 0000  168 175 224 176
4 0000  168 224 217 218
4 0000  168 176 169 218
4 0000  224 225 176 218
4 0000  168 224 218 176
4 0000  169 218 170 176
4 0000  177 170 226 176
4 0000  225 176 218 226
4 0000  219 226 170 218
4 0000  176 218 226 170
4 0000  170 177 226 178
4 0000  170 226 219 220
4 0000  170 178 171 220
4 0000  226 227 178 220
4 0000  170 226 220 178
4 0000  171 220 172 178
4 0000  179 172 228 178
4 0000  227 178 220 228
4 0000  221 228 172 220
4 0000  178 220 228 172
4 0000  172 179 228 180
4 0000  172 228 221 222
4 0000  172 180 173 222
4 0000  228 229 180 222
4 0000  172 228 222 180
4 0000  173 222 174 180
4 0000  181 174 230 180
4 0000  229 180 222 230
4 0000  223 230 174 222
4 0000  180 222 230 174
4 0000  175 224 176 182
4 0000  183 176 232 182
4 0000  231 182 224 232
4 0000  225 232 176 224
4 0000  182 224 232 176
4 0000  176 183 232 184
4 0000  176 232 225 226
4 0000  176 184 177 226
4 0000  232 233 184 226
4 0000  176 232 226 184
4 0000  177 226 178 184
4 0000  185 178 234 184
4 0000  233 184 226 234
4 0000  227 234 178 226
4 0000  184 226 234 178
4 0000  178 185 234 186
4 0000  178 234 227 228
4 0000  178 186 179 228
4 0000  234 235 186 228
4 0000  178 234 228 186
4 0000  179 228 180 186
4 0000  187 180 236 186
4 0000  235 186 228 236
4 0000  229 236 180 228
4 0000  186 228 236 180
4 0000  180 187 236 188
4 0000  180 236 229 230
4 0000  180 188 181 230
4 0000  236 237 188 230
4 0000  180 236 230 188
4 0000  182 189 238 190
4 0000  182 238 231 232
4 0000  182 190 183 232
4 0000  238 239 190 232
4 0000  182 238 232 190
4 0000  183 232 184 190
4 0000  191 184 240 190
4 0000  239 190 232 240
4 0000  233 240 184 232
4 0000  190 232 240 184
4 0000  184 191 240 192
4 0000  184 240 233 234
4 0000  184 192 185 234
4 0000  240 241 192 234
4 0000  184 240 234 192
4 0000  185 234 186 192
4 0000  193 186 242 192
4 0000  241 192 234 242
4 0000  235 242 186 234
4 0000  192 234 242 186
4 0000  186 193 242 194
4 0000  186 242 235 236
4 0000  186 194 187 236
4 0000  242 243 194 236
4 0000  186 242 236 194
4 0000  187 236 188 194
4 0000  195 188 244 194
4 0000  243 194 236 244
4 0000  237 244 188 236
4 0000  194 236 244 188
4 0000  196 203 252 204
4 0000  196 252 245 246
4 0000  196 204 197 246
4 0000  252 253 204 246
4 0000  196 252 246 204
4 0000  197 246 198 204
4 0000  205 198 254 204
4 0000  253 204 246 254
4 0000  247 254 198 246
4 0000  204 246 254 198
4 0000  198 205 254 206
4 0000  198 254 247 248
4 0000  198 206 199 248
4 0000  254 255 206 248
4 0000  198 254 248 206
4 0000  199 248 200 206
4 0000  207 200 256 206
4 0000  255 206 248 256
4 0000  249 256 200 248
4 0000  206 248 256 200
4 0000  200 207 256 208
4 0000  200 256 249 250
4 0000  200 208 201 250
4 0000  256 257 208 250
4 0000  200 256 250 208
4 0000  201 250 202 208
4 0000  209 202 258 208
4 0000  257 208 250 258
4 0000  251 258 202 250
4 0000  208 250 258 202
4 0000  203 252 204 210
4 0000  211 204 260 210
4 0000  259 210 252 260
4 0000  253 260 204 252
4 0000  210 252 260 204
4 0000  204 211 260 212
4 0000  204 260 253 254
4 0000  204 212 205 254
4 0000  260 261 212 254
4 0000  204 260 254 212
4 0000  205 254 206 212
4 0000  213 206 262 212
4 0000  261 212 254 262
4 0000  255 262 206 254
4 0000  212 254 262 206
4 0000  206 213 262 214
4 0000  206 262 255 256
4 0000  206 214 207 256
4 0000  262 263 214 256
4 0000  206 262 256 214
4 0000  207 256 208 214
4 0000  215 208 264 214
4 0000  263 214 256 264
4 0000  257 264 208 256
4 0000  214 256 264 208
4 0000  208 215 264 216
4 0000  208 264 257 258
4 0000  208 216 209 258
4 0000  264 265 216 258
4 0000  208 264 258 216
4 0000  210 217 266 218
4 0000  210 266 259 260
4 0000  210 218 211 260
4 0000  266 267 218 260
4 0000  210 266 260 218
4 0000  211 260 212 218
4 0000  219 212 268 218
4 0000  267 218 260 268
4 0000  261 268 212 260
4 0000  218 260 268 212
4 0000  212 219 268 220
4 0000  212 268 261 262
4 0000  212 220 213 262
4 0000  268 269 220 262
4 0000  212 268 262 220
4 0000  213 262 214 220
4 0000  221 214 270 220
4 0000  269 220 262 270
4 0000  263 270 214 262
4 0000  220 262 270 214
4 0000  214 221 270 222
4 0000  214 270 263 264
4 0000  214 222 215 264
4 0000  270 271 222 264
4 0000  214 270 264 222
4 0000  215 264 216 222
4 0000  223 216 272 222
4 0000  271 222 264 272
4 0000  265 272 216 264
4 0000  222 264 272 216
4 0000  217 266 218 224
4 0000  225 218 274 224
4 0000  273 224 266 274
4 0000  267 274 218 266
4 0000  224 266 274 218
4 0000  218 225 274 226
4 0000  218 274 267 268
4 0000  218 226 219 268
4 0000  274 275 226 268
4 0000  218 274 268 226
4 0000  219 268 220 226
4 0000  227 220 276 226
4 0000  275 226 268 276
4 0000  269 276 220 268
4 0000  226 268 276 220
4 0000  220 227 276 228
4 0000  220 276 269 270
4 0000  220 228 221 270
4 0000  276 277 228 270
4 0000  220 276 270 228
4 0000  221 270 222 228
4 0000  229 222 278 228
4 0000  277 228 270 278
4 0000  271 278 222 270
4 0000  228 270 278 222
4 0000  222 229 278 230
4 0000  222 278 271 272
4 0000  222 230 223 272
4 0000  278 279 230 272
4 0000  222 278 272 230
4 0000  224 231 280 232
4 0000  224 280 273 274
4 0000  224 232 225 274
4 0000  280 281 232 274
4 0000  224 280 274 232
4 0000  225 274 226 232
4 0000  233 226 282 232
4 0000  281 232 274 282
4 0000  275 282 226 274
4 0000  232 274 282 226
4 0000  226 233 282 234
4 0000  226 282 275 276
4 0000  226 234 227 276
4 0000  282 283 234 276
4 0000  226 282 276 234
4 0000  227 276 228 234
4 0000  235 228 284 234
4 0000  283 234 276 284
4 0000  277 284 228 276
4 0000  234 276 284 228
4 0000  228 235 284 236
4 0000  228 284 277 278
4 0000  228 236 229 278
4 0000  284 285 236 278
4 0000  228 284 278 236
4 0000  229 278 230 236
4 0000  237 230 286 236
4 0000  285 236 278 286
4 0000  279 286 230 278
4 0000  236 278 286 230
4 0000  231 280 232 238
4 0000  239 232 288 238
4 0000  287 238 280 288
4 0000  281 288 232 280
4 0000  238 280 288 232
4 0000  232 239 288 240
4 0000  232 288 281 282
4 0000  232 240 233 282
4 0000  288 289 240 282
4 0000  232 288 282 240
4 0000  233 282 234 240
4 0000  241 234 290 240
4 0000  289 240 282 290
4 0000  283 290 234 282
4 0000  240 282 290 234
4 0000  234 241 290 242
4 0000  234 290 283 284
4 0000  234 242 235 284
4 0000  290 291 242 284
4 0000  234 290 284 242
4 0000  235 284 236 242
4 0000  243 236 292 242
4 0000  291 242 284 292
4 0000  285 292 236 284
4 0000  242 284 292 236
4 0000  236 243 292 244
4 0000  236 292 285 286
4 0000  236 244 237 286
4 0000  292 293 244 286
4 0000  236 292 286 244
4 0000  245 294 246 252
4 0000  253 246 302 252
4 0000  301 252 294 302
4 0000  295 302 246 294
4 0000  252 294 302 246
4 0000  246 253 302 254
4 0000  246 302 295 296
4 0000  246 254 247 296
4 0000  302 303 254 296
4 0000  246 302 296 254
4 0000  247 296 248 254
4 0000  255 248 304 254
4 0000  303 254 296 304
4 0000  297 304 248 296
4 0000  254 296 304 248
4 0000  248 255 304 256
4 0000  248 304 297 298
4 0000  248 256 249 298
4 0000  304 305 256 298
4 0000  248 304 298 256
4 0000  249 298 250 256
4 0000  257 250 306 256
4 0000  305 256 298 306
4 0000  299 306 250 298
4 0000  256 298 306 250
4 0000  250 257 306 258
4 0000  250 306 299 300
4 0000  250 258 251 300
4 0000  306 307 258 300
4 0000  250 306 300 258
4 0000  252 259 308 260
4 0000  252 308 301 302
4 0000  252 260 253 302
4 0000  308 309 260 302
4 0000  252 308 302 260
4 0000  253 302 254 260
4 0000  261 254 310 260
4 0000  309 260 302 310
4 0000  303 310 254 302
4 0000  260 302 310 254
4 0000  254 261 310 262
4 0000  254 310 303 304
4 0000  254 262 255 304
4 0000  310 311 262 304
4 0000  254 310 304 262
4 0000  255 304 256 262
4 0000  263 256 312 262
4 0000  311 262 304 312
4 0000  305 312 256 304
4 0000  262 304 312 256
4 0000  256 263 312 264
4 0000  256 312 305 306
4 0000  256 264 257 306
4 0000  312 313 264 306
4 0000  256 312 306 264
4 0000  257 306 258 264
4 0000  265 258 314 264
4 0000  313 264 306 314
4 0000  307 314 258 306
4 0000  264 306 314 258
4 0000  259 308 260 266
4 0000  267 260 316 266
4 0000  315 266 308 316
4 0000  309 316 260 308
4 0000  266 308 316 260
4 0000  260 267 316 268
4 0000  260 316 309 310
4 0000  260 268 261 310
4 0000  316 317 268 310
4 0000  260 316 310 268
4 0000  261 310 262 268
4 0000  269 262 318 268
4 0000  317 268 310 318
4 0000  311 318 262 310
4 0000  268 310 318 262
4 0000  262 269 318 270
4 0000  262 318 311 312
4 0000  262 270 263 312
4 0000  318 319 270 312
4 0000  262 318 312 270
4 0000  263 312 264 270
4 0000  271 264 320 270
4 0000  319 270 312 320
4 0000  313 320 264 312
4 0000  270 312 320 264
4 0000  264 271 320 272
4 0000  264 320 313 314
4 0000  264 272 265 314
4 0000  320 321 272 314
4 0000  264 320 314 272
4 0000  266 273 322 274
4 0000  266 322 315 316
4 0000  266 274 267 316
4 0000  322 323 274 316
4 0000  266 322 316 274
4 0000  267 316 268 274
4 0000  275 268 324 274
4 0000  323 274 316 324
4 0000  317 324 268 316
4 0000  274 316 324 268
4 0000  268 275 324 276
4 0000  268 324 317 318
4 0000  268 276 269 318
4 0000  324 325 276 318
4 0000  268 324 318 276
4 0000  269 318 270 276
4 0000  277 270 326 276
4 0000  325 276 318 326
4 0000  319 326 270 318
4 0000  276 318 326 270
4 0000  270 277 326 278
4 0000  270 326 319 320
4 0000  270 278 271 320
4 0000  326 327 278 320
4 0000  270 326 320 278
4 0000  271 320 272 278
4 0000  279 272 328 278
4 0000  327 278 320 328
4 0000  321 328 272 320
4 0000  278 320 328 272
4 0000  273 322 274 280
4 0000  281 274 330 280
4 0000  329 280 322 330
4 0000  323 330 274 322
4 0000  280 322 330 274
4 0000  274 281 330 282
4 0000  274 330 323 324
4 0000  274 282 275 324
4 0000  330 331 282 324
4 0000  274 330 324 282
4 0000  275 324 276 282
4 0000  283 276 332 282
4 0000  331 282 324 332
4 0000  325 332 276 324
4 0000  282 324 332 276
4 0000  276 283 332 284
4 0000  276 332 325 326
4 0000  276 284 277 326
4 0000  332 333 284 326
4 0000  276 332 326 284
4 0000  277 326 278 284
4 0000  285 278 334 284
4 0000  333 284 326 334
4 0000  327 334 278 326
4 0000  284 326 334 278
4 0000  278 285 334 286
4 0000  278 334 327 328
4 0000  278 286 279 328
4 0000  334 335 286 328
4 0000  278 334 328 286
4 0000  280 287 336 288
4 0000  280 336 329 330
4 0000  280 288 281 330
4 0000  336 337 288 330
4 0000  280 336 330 288
4 0000  281 330 282 288
4 0000  289 282 338 288
4 0000  337 288 330 338
4 0000  331 338 282 330
4 0000  288 330 338 282
4 0000  282 289 338 290
4 0000  282 338 331 332
4 0000  282 290 283 332
4 0000  338 339 290 332
4 0000  282 338 332 290
4 0000  283 332 284 290
4 0000  291 284 340 290
4 0000  339 290 332 340
4 0000  333 340 284 332
4 0000  290 332 340 284
4 0000  284 291 340 292
4 0000  284 340 333 334
4 0000  284 292 285 334
4 0000  340 341 292 334
4 0000  284 340 334 292
4 0000  285 334 286 292
4 0000  293 286 342 292
4 0000  341 292 334 342
4 0000  335 342 286 334
4 0000  292 334 342 286
VDATA:
12 1.0 0.0 0.0 0.0 1.0 0.0 0.0 0.0 1.0 0.0 0.002 0.8202
12 1.0 0.0 0.0 0.0 1.0 0.0 0.0 0.0 1.0 0.0 0.002 0.8202
12 1.0 0.0 0.0 0.0 1.0 0.0 0.0 0.0 1.0 0.0 0.002 0.8202
12 1.0 0.0 0.0 0.0 1.0 0.0 0.0 0.0 1.0 0.0 0.002 0.8202
12 1.0 0.0 0.0 0.0 1.0 0.0 0.0 0.0 1.0 -10.0 0.0 0.0
12 1.0 0.0 0.0 0.0 1.0 0.0 0.0 0.0 1.0 -10.0 0.0 0.0
12 1.0 0.0 0.0 0.0 1.0 0.0 0.0 0.0 1.0 -10.0 0.0 0.0
12 1.0 0.0 0.0 0.0 1.0 0.0 0.0 0.0 1.0 0.0 0.002 0.8202
12 1.0 0.0 0.0 0.0 1.0 0.0 0.0 0.0 1.0 0.0 0.002 0.8202
12 1.0 0.0 0.0 0.0 1.0 0.0 0.0 0.0 1.0 0.0 0.002 0.8202
12 1.0 0.0 0.0 0.0 1.0 0.0 0.0 0.0 1.0 0.0 0.002 0.8202
12 1.0 0.0 0.0 0.0 1.0 0.0 0.0 0.0 1.0 -10.0 0.0 0.0
12 1.0 0.0 0.0 0.0 1.0 0.0 0.0 0.0 1.0 -10.0 0.0 0.0
12 1.0 0.0 0.0 0.0 1.0 0.0 0.0 0.0 1.0 -10.0 0.0 0.0
12 1.0 0.0 0.0 0.0 1.0 0.0 0.0 0.0 1.0 0.0 0.002 0.8202
12 1.0 0.0 0.0 0.0 1.0 0.0 0.0 0.0 1.0 0.0 0.002 0.8202
12 1.0 0.0 0.0 0.0 1.0 0.0 0.0 0.0 1.0 0.0 0.002 0.8202
12 1.0 0.0 0.0 0.0 1.0 0.0 0.0 0.0 1.0 0.0 0.002 0.8202
12 1.0 0.0 0.0 0.0 1.0 0.0 0.0 0.0 1.0 -10.0 0.0 0.0
12 1.0 0.0 0.0 0.0 1.0 0.0 0.0 0.0 1.0 -10.0 0.0 0.0
12 1.0 0.0 0.0 0.0 1.0 0.0 0.0 0.0 1.0 -10.0 0.0 0.0
12 1.0 0.0 0.0 0.0 1.0 0.0 0.0 0.0 1.0 0.0 0.002 0.8202
12 1.0 0.0 0.0 0.0 1.0 0.0 0.0 0.0 1.0 0.0 0.002 0.8202
12 1.0 0.0 0.0 0.0 1.0 0.0 0.0 0.0 1.0 0.0 0.002 0.8202
12 1.0 0.0 0.0 0.0 1.0 0.0 0.0 0.0 1.0 0.0 0.002 0.8202
12 1.0 0.0 0.0 0.0 1.0 0.0 0.0 0.0 1.0 -10.0 0.0 0.0
12 1.0 0.0 0.0 0.0 1.0 0.0 0.0 0.0 1.0 -10.0 0.0 0.0
12 1.0 0.0 0.0 0.0 1.0 0.0 0.0 0.0 1.0 -10.0 0.0 0.0
12 1.0 0.0 0.0 0.0 1.0 0.0 0.0 0.0 1.0 -10.0 0.0 0.0
12 1.0 0.0 0.0 0.0 1.0 0.0 0.0 0.0 1.0 -10.0 0.0 0.0
12 1.0 0.0 0.0 0.0 1.0 0.0 0.0 0.0 1.0 -10.0 0.0 0.0
12 1.0 0.0 0.0 0.0 1.0 0.0 0.0 0.0 1.0 -10.0 0.0 0.0
12 1.0 0.0 0.0 0.0 1.0 0.0 0.0 0.0 1.0 -10.0 0.0 0.0
12 1.0 0.0 0.0 0.0 1.0 0.0 0.0 0.0 1.0 -10.0 0.0 0.0
12 1.0 0.0 0.0 0.0 1.0 0.0 0.0 0.0 1.0 -10.0 0.0 0.0
12 1.0 0.0 0.0 0.0 1.0 0.0 0.0 0.0 1.0 -10.0 0.0 0.0
12 1.0 0.0 0.0 0.0 1.0 0.0 0.0 0.0 1.0 -10.0 0.0 0.0
12 1.0 0.0 0.0 0.0 1.0 0.0 0.0 0.0 1.0 -10.0 0.0 0.0
12 1.0 0.0 0.0 0.0 1.0 0.0 0.0 0.0 1.0 -10.0 0.0 0.0
12 1.0 0.0 0.0 0.0 1.0 0.0 0.0 0.0 1.0 -10.0 0.0 0.0
12 1.0 0.0 0.0 0.0 1.0 0.0 0.0 0.0 1.0 -10.0 0.0 0.0
12 1.0 0.0 0.0 0.0 1.0 0.0 0.0 0.0 1.0 -10.0 0.0 0.0
12 1.0 0.0 0.0 0.0 1.0 0.0 0.0 0.0 1.0 -10.0 0.0 0.0
12 1.0 0.0 0.0 0.0 1.0 0.0 0.0 0.0 1.0 -10.0 0.0 0.0
12 1.0 0.0 0.0 0.0 1.0 0.0 0.0 0.0 1.0 -10.0 0.0 0.0
12 1.0 0.0 0.0 0.0 1.0 0.0 0.0 0.0 1.0 -10.0 0.0 0.0
12 1.0 0.0 0.0 0.0 1.0 0.0 0.0 0.0 1.0 -10.0 0.0 0.0
12 1.0 0.0 0.0 0.0 1.0 0.0 0.0 0.0 1.0 -10.0 0.0 0.0
12 1.0 0.0 0.0 0.0 1.0 0.0 0.0 0.0 1.0 -10.0 0.0 0.0
12 1.0 0.0 0.0 0.0 1.0 0.0 0.0 0.0 1.0 0.0 0.002 0.8202
12 1.0 0.0 0.0 0.0 1.0 0.0 0.0 0.0 1.0 0.0 0.002 0.8202
12 1.0 0.0 0.0 0.0 1.0 0.0 0.0 0.0 1.0 0.0 0.002 0.8202
12 1.0 0.0 0.0 0.0 1.0 0.0 0.0 0.0 1.0 0.0 0.002 0.8202
12 1.0 0.0 0.0 0.0 1.0 0.0 0.0 0.0 1.0 -10.0 0.0 0.0
12 1.0 0.0 0.0 0.0 1.0 0.0 0.0 0.0 1.0 -10.0 0.0 0.0
12 1.0 0.0 0.0 0.0 1.0 0.0 0.0 0.0 1.0 -10.0 0.0 0.0
12 1.0 0.0 0.0 0.0 1.0 0.0 0.0 0.0 1.0 0.0 0.002 0.8202
12 1.0 0.0 0.0 0.0 1.0 0.0 0.0 0.0 1.0 0.0 0.002 0.8202
12 1.0 0.0 0.0 0.0 1.0 0.0 0.0 0.0 1.0 0.0 0.002 0.8202
12 1.0 0.0 0.0 0.0 1.0 0.0 0.0 0.0 1.0 0.0 0.002 0.8202
12 1.0 0.0 0.0 0.0 1.0 0.0 0.0 0.0 1.0 -10.0 0.0 0.0
12 1.0 0.0 0.0 0.0 1.0 0.0 0.0 0.0 1.0 -10.0 0.0 0.0
12 1.0 0.0 0.0 0.0 1.0 0.0 0.0 0.0 1.0 -10.0 0.0 0.0
12 1.0 0.0 0.0 0.0 1.0 0.0 0.0 0.0 1.0 0.0 0.002 0.8202
12 1.0 0.0 0.0 0.0 1.0 0.0 0.0 0.0 1.0 0.0 0.002 0.8202
12 1.0 0.0 0.0 0.0 1.0 0.0 0.0 0.0 1.0 0.0 0.002 0.8202
12 1.0 0.0 0.0 0.0 1.0 0.0 0.0 0.0 1.0 0.0 0.002 0.8202
12 1.0 0.0 0.0 0.0 1.0 0.0 0.0 0.0 1.0 -10.0 0.0 0.0
12 1.0 0.0 0.0 0.0 1.0 0.0 0.0 0.0 1.0 -10.0 0.0 0.0
12 1.0 0.0 0.0 0.0 1.0 0.0 0.0 0.0 1.0 -10.0 0.0 0.0
12 1.0 0.0 0.0 0.0 1.0 0.0 0.0 0.0 1.0 0.0 0.002 0.8202
12 1.0 0.0 0.0 0.0 1.0 0.0 0.0 0.0 1.0 0.0 0.002 0.8202
12 1.0 0.0 0.0 0.0 1.0 0.0 0.0 0.0 1.0 0.0 0.002 0.8202
12 1.0 0.0 0.0 0.0 1.0 0.0 0.0 0.0 1.0 0.0 0.002 0.8202
12 1.0 0.0 0.0 0.0 1.0 0.0 0.0 0.0 1.0 -10.0 0.0 0.0
12 1.0 0.0 0.0 0.0 1.0 0.0 0.0 0.0 1.0 -10.0 0.0 0.0
12 1.0 0.0 0.0 0.0 1.0 0.0 0.0 0.0 1.0 -10.0 0.0 0.0
12 1.0 0.0 0.0 0.0 1.0 0.0 0.0 0.0 1.0 -10.0 0.0 0.0
12 1.0 0.0 0.0 0.0 1.0 0.0 0.0 0.0 1.0 -10.0 0.0 0.0
12 1.0 0.0 0.0 0.0 1.0 0.0 0.0 0.0 1.0 -10.0 0.0 0.0
12 1.0 0.0 0.0 0.0 1.0 0.0 0.0 0.0 1.0 -10.0 0.0 0.0
12 1.0 0.0 0.0 0.0 1.0 0.0 0.0 0.0 1.0 -10.0 0.0 0.0
12 1.0 0.0 0.0 0.0 1.0 0.0 0.0 0.0 1.0 -10.0 0.0 0.0
12 1.0 0.0 0.0 0.0 1.0 0.0 0.0 0.0 1.0 -10.0 0.0 0.0
12 1.0 0.0 0.0 0.0 1.0 0.0 0.0 0.0 1.0 -10.0 0.0 0.0
12 1.0 0.0 0.0 0.0 1.0 0.0 0.0 0.0 1.0 -10.0 0.0 0.0
12 1.0 0.0 0.0 0.0 1.0 0.0 0.0 0.0 1.0 -10.0 0.0 0.0
12 1.0 0.0 0.0 0.0 1.0 0.0 0.0 0.0 1.0 -10.0 0.0 0.0
12 1.0 0.0 0.0 0.0 1.0 0.0 0.0 0.0 1.0 -10.0 0.0 0.0
12 1.0 0.0 0.0 0.0 1.0 0.0 0.0 0.0 1.0 -10.0 0.0 0.0
12 1.0 0.0 0.0 0.0 1.0 0.0 0.0 0.0 1.0 -10.0 0.0 0.0
12 1.0 0.0 0.0 0.0 1.0 0.0 0.0 0.0 1.0 -10.0 0.0 0.0
12 1.0 0.0 0.0 0.0 1.0 0.0 0.0 0.0 1.0 -10.0 0.0 0.0
12 1.0 0.0 0.0 0.0 1.0 0.0 0.0 0.0 1.0 -10.0 0.0 0.0
12 1.0 0.0 0.0 0.0 1.0 0.0 0.0 0.0 1.0 -10.0 0.0 0.0
12 1.0 0.0 0.0 0.0 1.0 0.0 0.0 0.0 1.0 -10.0 0.0 0.0
12 1.0 0.0 0.0 0.0 1.0 0.0 0.0 0.0 1.0 -10.0 0.0 0.0
12 1.0 0.0 0.0 0.0 1.0 0.0 0.0 0.0 1.0 -10.0 0.0 0.0
12 1.0 0.0 0.0 0.0 1.0 0.0 0.0 0.0 1.0 0.0 0.002 0.8202
12 1.0 0.0 0.0 0.0 1.0 0.0 0.0 0.0 1.0 0.0 0.002 0.8202
12 1.0 0.0 0.0 0.0 1.0 0.0 0.0 0.0 1.0 0.0 0.002 0.8202
12 1.0 0.0 0.0 0.0 1.0 0.0 0.0 0.0 1.0 0.0 0.002 0.8202
12 1.0 0.0 0.0 0.0 1.0 0.0 0.0 0.0 1.0 -10.0 0.0 0.0
12 1.0 0.0 0.0 0.0 1.0 0.0 0.0 0.0 1.0 -10.0 0.0 0.0
12 1.0 0.0 0.0 0.0 1.0 0.0 0.0 0.0 1.0 -10.0 0.0 0.0
12 1.0 0.0 0.0 0.0 1.0 0.0 0.0 0.0 1.0 0.0 0.002 0.8202
12 1.0 0.0 0.0 0.0 1.0 0.0 0.0 0.0 1.0 0.0 0.002 0.8202
12 1.0 0.0 0.0 0.0 1.0 0.0 0.0 0.0 1.0 0.0 0.002 0.8202
12 1.0 0.0 0.0 0.0 1.0 0.0 0.0 0.0 1.0 0.0 0.002 0.8202
12 1.0 0.0 0.0 0.0 1.0 0.0 0.0 0.0 1.0 -10.0 0.0 0.0
12 1.0 0.0 0.0 0.0 1.0 0.0 0.0 0.0 1.0 -10.0 0.0 0.0
12 1.0 0.0 0.0 0.0 1.0 0.0 0.0 0.0 1.0 -10.0 0.0 0.0
12 1.0 0.0 0.0 0.0 1.0 0.0 0.0 0.0 1.0 0.0 0.002 0.8202
12 1.0 0.0 0.0 0.0 1.0 0.0 0.0 0.0 1.0 0.0 0.002 0.8202
12 1.0 0.0 0.0 0.0 1.0 0.0 0.0 0.0 1.0 0.0 0.002 0.8202
12 1.0 0.0 0.0 0.0 1.0 0.0 0.0 0.0 1.0 0.0 0.002 0.8202
12 1.0 0.0 0.0 0.0 1.0 0.0 0.0 0.0 1.0 -10.0 0.0 0.0
12 1.0 0.0 0.0 0.0 1.0 0.0 0.0 0.0 1.0 -10.0 0.0 0.0
12 1.0 0.0 0.0 0.0 1.0 0.0 0.0 0.0 1.0 -10.0 0.0 0.0
12 1.0 0.0 0.0 0.0 1.0 0.0 0.0 0.0 1.0 0.0 0.002 0.8202
12 1.0 0.0 0.0 0.0 1.0 0.0 0.0 0.0 1.0 0.0 0.002 0.8202
12 1.0 0.0 0.0 0.0 1.0 0.0 0.0 0.0 1.0 0.0 0.002 0.8202
12 1.0 0.0 0.0 0.0 1.0 0.0 0.0 0.0 1.0 0.0 0.002 0.8202
12 1.0 0.0 0.0 0.0 1.0 0.0 0.0 0.0 1.0 -10.0 0.0 0.0
12 1.0 0.0 0.0 0.0 1.0 0.0 0.0 0.0 1.0 -10.0 0.0 0.0
12 1.0 0.0 0.0 0.0 1.0 0.0 0.0 0.0 1.0 -10.0 0.0 0.0
12 1.0 0.0 0.0 0.0 1.0 0.0 0.0 0.0 1.0 -10.0 0.0 0.0
12 1.0 0.0 0.0 0.0 1.0 0.0 0.0 0.0 1.0 -10.0 0.0 0.0
12 1.0 0.0 0.0 0.0 1.0 0.0 0.0 0.0 1.0 -10.0 0.0 0.0
12 1.0 0.0 0.0 0.0 1.0 0.0 0.0 0.0 1.0 -10.0 0.0 0.0
12 1.0 0.0 0.0 0.0 1.0 0.0 0.0 0.0 1.0 -10.0 0.0 0.0
12 1.0 0.0 0.0 0.0 1.0 0.0 0.0 0.0 1.0 -10.0 0.0 0.0
12 1.0 0.0 0.0 0.0 1.0 0.0 0.0 0.0 1.0 -10.0 0.0 0.0
12 1.0 0.0 0.0 0.0 1.0 0.0 0.0 0.0 1.0 -10.0 0.0 0.0
12 1.0 0.0 0.0 0.0 1.0 0.0 0.0 0.0 1.0 -10.0 0.0 0.0
12 1.0 0.0 0.0 0.0 1.0 0.0 0.0 0.0 1.0 -10.0 0.0 0.0
12 1.0 0.0 0.0 0.0 1.0 0.0 0.0 0.0 1.0 -10.0 0.0 0.0
12 1.0 0.0 0.0 0.0 1.0 0.0 0.0 0.0 1.0 -10.0 0.0 0.0
12 1.0 0.0 0.0 0.0 1.0 0.0 0.0 0.0 1.0 -10.0 0.0 0.0
12 1.0 0.0 0.0 0.0 1.0 0.0 0.0 0.0 1.0 -10.0 0.0 0.0
12 1.0 0.0 0.0 0.0 1.0 0.0 0.0 0.0 1.0 -10.0 0.0 0.0
12 1.0 0.0 0.0 0.0 1.0 0.0 0.0 0.0 1.0 -10.0 0.0 0.0
12 1.0 0.0 0.0 0.0 1.0 0.0 0.0 0.0 1.0 -10.0 0.0 0.0
12 1.0 0.0 0.0 0.0 1.0 0.0 0.0 0.0 1.0 -10.0 0.0 0.0
12 1.0 0.0 0.0 0.0 1.0 0.0 0.0 0.0 1.0 -10.0 0.0 0.0
12 1.0 0.0 0.0 0.0 1.0 0.0 0.0 0.0 1.0 -10.0 0.0 0.0
12 1.0 0.0 0.0 0.0 1.0 0.0 0.0 0.0 1.0 -10.0 0.0 0.0
12 1.0 0.0 0.0 0.0 1.0 0.0 0.0 0.0 1.0 0.0 0.002 0.8202
12 1.0 0.0 0.0 0.0 1.0 0.0 0.0 0.0 1.0 0.0 0.002 0.8202
12 1.0 0.0 0.0 0.0 1.0 0.0 0.0 0.0 1.0 0.0 0.002 0.8202
12 1.0 0.0 0.0 0.0 1.0 0.0 0.0 0.0 1.0 0.0 0.002 0.8202
12 1.0 0.0 0.0 0.0 1.0 0.0 0.0 0.0 1.0 -10.0 0.0 0.0
12 1.0 0.0 0.0 0.0 1.0 0.0 0.0 0.0 1.0 -10.0 0.0 0.0
12 1.0 0.0 0.0 0.0 1.0 0.0 0.0 0.0 1.0 -10.0 0.0 0.0
12 1.0 0.0 0.0 0.0 1.0 0.0 0.0 0.0 1.0 0.0 0.002 0.8202
12 1.0 0.0 0.0 0.0 1.0 0.0 0.0 0.0 1.0 0.0 0.002 0.8202
12 1.0 0.0 0.0 0.0 1.0 0.0 0.0 0.0 1.0 0.0 0.002 0.8202
12 1.0 0.0 0.0 0.0 1.0 0.0 0.0 0.0 1.0 0.0 0.002 0.8202
12 1.0 0.0 0.0 0.0 1.0 0.0 0.0 0.0 1.0 -10.0 0.0 0.0
12 1.0 0.0 0.0 0.0 1.0 0.0 0.0 0.0 1.0 -10.0 0.0 0.0
12 1.0 0.0 0.0 0.0 1.0 0.0 0.0 0.0 1.0 -10.0 0.0 0.0
12 1.0 0.0 0.0 0.0 1.0 0.0 0.0 0.0 1.0 0.0 0.002 0.8202
12 1.0 0.0 0.0 0.0 1.0 0.0 0.0 0.0 1.0 0.0 0.002 0.8202
12 1.0 0.0 0.0 0.0 1.0 0.0 0.0 0.0 1.0 0.0 0.002 0.8202
12 1.0 0.0 0.0 0.0 1.0 0.0 0.0 0.0 1.0 0.0 0.002 0.8202
12 1.0 0.0 0.0 0.0 1.0 0.0 0.0 0.0 1.0 -10.0 0.0 0.0
12 1.0 0.0 0.0 0.0 1.0 0.0 0.0 0.0 1.0 -10.0 0.0 0.0
12 1.0 0.0 0.0 0.0 1.0 0.0 0.0 0.0 1.0 -10.0 0.0 0.0
12 1.0 0.0 0.0 0.0 1.0 0.0 0.0 0.0 1.0 0.0 0.002 0.8202
12 1.0 0.0 0.0 0.0 1.0 0.0 0.0 0.0 1.0 0.0 0.002 0.8202
12 1.0 0.0 0.0 0.0 1.0 0.0 0.0 0.0 1.0 0.0 0.002 0.8202
12 1.0 0.0 0.0 0.0 1.0 0.0 0.0 0.0 1.0 0.0 0.002 0.8202
12 1.0 0.0 0.0 0.0 1.0 0.0 0.0 0.0 1.0 -10.0 0.0 0.0
12 1.0 0.0 0.0 0.0 1.0 0.0 0.0 0.0 1.0 -10.0 0.0 0.0
12 1.0 0.0 0.0 0.0 1.0 0.0 0.0 0.0 1.0 -10.0 0.0 0.0
12 1.0 0.0 0.0 0.0 1.0 0.0 0.0 0.0 1.0 -10.0 0.0 0.0
12 1.0 0.0 0.0 0.0 1.0 0.0 0.0 0.0 1.0 -10.0 0.0 0.0
12 1.0 0.0 0.0 0.0 1.0 0.0 0.0 0.0 1.0 -10.0 0.0 0.0
12 1.0 0.0 0.0 0.0 1.0 0.0 0.0 0.0 1.0 -10.0 0.0 0.0
12 1.0 0.0 0.0 0.0 1.0 0.0 0.0 0.0 1.0 -10.0 0.0 0.0
12 1.0 0.0 0.0 0.0 1.0 0.0 0.0 0.0 1.0 -10.0 0.0 0.0
12 1.0 0.0 0.0 0.0 1.0 0.0 0.0 0.0 1.0 -10.0 0.0 0.0
12 1.0 0.0 0.0 0.0 1.0 0.0 0.0 0.0 1.0 -10.0 0.0 0.0
12 1.0 0.0 0.0 0.0 1.0 0.0 0.0 0.0 1.0 -10.0 0.0 0.0
12 1.0 0.0 0.0 0.0 1.0 0.0 0.0 0.0 1.0 -10.0 0.0 0.0
12 1.0 0.0 0.0 0.0 1.0 0.0 0.0 0.0 1.0 -10.0 0.0 0.0
12 1.0 0.0 0.0 0.0 1.0 0.0 0.0 0.0 1.0 -10.0 0.0 0.0
12 1.0 0.0 0.0 0.0 1.0 0.0 0.0 0.0 1.0 -10.0 0.0 0.0
12 1.0 0.0 0.0 0.0 1.0 0.0 0.0 0.0 1.0 -10.0 0.0 0.0
12 1.0 0.0 0.0 0.0 1.0 0.0 0.0 0.0 1.0 -10.0 0.0 0.0
12 1.0 0.0 0.0 0.0 1.0 0.0 0.0 0.0 1.0 -10.0 0.0 0.0
12 1.0 0.0 0.0 0.0 1.0 0.0 0.0 0.0 1.0 -10.0 0.0 0.0
12 1.0 0.0 0.0 0.0 1.0 0.0 0.0 0.0 1.0 -10.0 0.0 0.0
12 1.0 0.0 0.0 0.0 1.0 0.0 0.0 0.0 1.0 -10.0 0.0 0.0
12 1.0 0.0 0.0 0.0 1.0 0.0 0.0 0.0 1.0 -10.0 0.0 0.0
12 1.0 0.0 0.0 0.0 1.0 0.0 0.0 0.0 1.0 -10.0 0.0 0.0
12 1.0 0.0 0.0 0.0 1.0 0.0 0.0 0.0 1.0 -10.0 0.0 0.0
12 1.0 0.0 0.0 0.0 1.0 0.0 0.0 0.0 1.0 -10.0 0.0 0.0
12 1.0 0.0 0.0 0.0 1.0 0.0 0.0 0.0 1.0 -10.0 0.0 0.0
12 1.0 0.0 0.0 0.0 1.0 0.0 0.0 0.0 1.0 -10.0 0.0 0.0
12 1.0 0.0 0.0 0.0 1.0 0.0 0.0 0.0 1.0 -10.0 0.0 0.0
12 1.0 0.0 0.0 0.0 1.0 0.0 0.0 0.0 1.0 -10.0 0.0 0.0
12 1.0 0.0 0.0 0.0 1.0 0.0 0.0 0.0 1.0 -10.0 0.0 0.0
12 1.0 0.0 0.0 0.0 1.0 0.0 0.0 0.0 1.0 -10.0 0.0 0.0
12 1.0 0.0 0.0 0.0 1.0 0.0 0.0 0.0 1.0 -10.0 0.0 0.0
12 1.0 0.0 0.0 0.0 1.0 0.0 0.0 0.0 1.0 -10.0 0.0 0.0
12 1.0 0.0 0.0 0.0 1.0 0.0 0.0 0.0 1.0 -10.0 0.0 0.0
12 1.0 0.0 0.0 0.0 1.0 0.0 0.0 0.0 1.0 -10.0 0.0 0.0
12 1.0 0.0 0.0 0.0 1.0 0.0 0.0 0.0 1.0 -10.0 0.0 0.0
12 1.0 0.0 0.0 0.0 1.0 0.0 0.0 0.0 1.0 -10.0 0.0 0.0
12 1.0 0.0 0.0 0.0 1.0 0.0 0.0 0.0 1.0 -10.0 0.0 0.0
12 1.0 0.0 0.0 0.0 1.0 0.0 0.0 0.0 1.0 -10.0 0.0 0.0
12 1.0 0.0 0.0 0.0 1.0 0.0 0.0 0.0 1.0 -10.0 0.0 0.0
12 1.0 0.0 0.0 0.0 1.0 0.0 0.0 0.0 1.0 -10.0 0.0 0.0
12 1.0 0.0 0.0 0.0 1.0 0.0 0.0 0.0 1.0 -10.0 0.0 0.0
12 1.0 0.0 0.0 0.0 1.0 0.0 0.0 0.0 1.0 -10.0 0.0 0.0
12 1.0 0.0 0.0 0.0 1.0 0.0 0.0 0.0 1.0 -10.0 0.0 0.0
12 1.0 0.0 0.0 0.0 1.0 0.0 0.0 0.0 1.0 -10.0 0.0 0.0
12 1.0 0.0 0.0 0.0 1.0 0.0 0.0 0.0 1.0 -10.0 0.0 0.0
12 1.0 0.0 0.0 0.0 1.0 0.0 0.0 0.0 1.0 -10.0 0.0 0.0
12 1.0 0.0 0.0 0.0 1.0 0.0 0.0 0.0 1.0 -10.0 0.0 0.0
12 1.0 0.0 0.0 0.0 1.0 0.0 0.0 0.0 1.0 -10.0 0.0 0.0
12 1.0 0.0 0.0 0.0 1.0 0.0 0.0 0.0 1.0 -10.0 0.0 0.0
12 1.0 0.0 0.0 0.0 1.0 0.0 0.0 0.0 1.0 -10.0 0.0 0.0
12 1.0 0.0 0.0 0.0 1.0 0.0 0.0 0.0 1.0 -10.0 0.0 0.0
12 1.0 0.0 0.0 0.0 1.0 0.0 0.0 0.0 1.0 -10.0 0.0 0.0
12 1.0 0.0 0.0 0.0 1.0 0.0 0.0 0.0 1.0 -10.0 0.0 0.0
12 1.0 0.0 0.0 0.0 1.0 0.0 0.0 0.0 1.0 -10.0 0.0 0.0
12 1.0 0.0 0.0 0.0 1.0 0.0 0.0 0.0 1.0 -10.0 0.0 0.0
12 1.0 0.0 0.0 0.0 1.0 0.0 0.0 0.0 1.0 -10.0 0.0 0.0
12 1.0 0.0 0.0 0.0 1.0 0.0 0.0 0.0 1.0 -10.0 0.0 0.0
12 1.0 0.0 0.0 0.0 1.0 0.0 0.0 0.0 1.0 -10.0 0.0 0.0
12 1.0 0.0 0.0 0.0 1.0 0.0 0.0 0.0 1.0 -10.0 0.0 0.0
12 1.0 0.0 0.0 0.0 1.0 0.0 0.0 0.0 1.0 -10.0 0.0 0.0
12 1.0 0.0 0.0 0.0 1.0 0.0 0.0 0.0 1.0 -10.0 0.0 0.0
12 1.0 0.0 0.0 0.0 1.0 0.0 0.0 0.0 1.0 -10.0 0.0 0.0
12 1.0 0.0 0.0 0.0 1.0 0.0 0.0 0.0 1.0 -10.0 0.0 0.0
12 1.0 0.0 0.0 0.0 1.0 0.0 0.0 0.0 1.0 -10.0 0.0 0.0
12 1.0 0.0 0.0 0.0 1.0 0.0 0.0 0.0 1.0 -10.0 0.0 0.0
12 1.0 0.0 0.0 0.0 1.0 0.0 0.0 0.0 1.0 -10.0 0.0 0.0
12 1.0 0.0 0.0 0.0 1.0 0.0 0.0 0.0 1.0 -10.0 0.0 0.0
12 1.0 0.0 0.0 0.0 1.0 0.0 0.0 0.0 1.0 -10.0 0.0 0.0
12 1.0 0.0 0.0 0.0 1.0 0.0 0.0 0.0 1.0 -10.0 0.0 0.0
12 1.0 0.0 0.0 0.0 1.0 0.0 0.0 0.0 1.0 -10.0 0.0 0.0
12 1.0 0.0 0.0 0.0 1.0 0.0 0.0 0.0 1.0 -10.0 0.0 0.0
12 1.0 0.0 0.0 0.0 1.0 0.0 0.0 0.0 1.0 -10.0 0.0 0.0
12 1.0 0.0 0.0 0.0 1.0 0.0 0.0 0.0 1.0 -10.0 0.0 0.0
12 1.0 0.0 0.0 0.0 1.0 0.0 0.0 0.0 1.0 -10.0 0.0 0.0
12 1.0 0.0 0.0 0.0 1.0 0.0 0.0 0.0 1.0 -10.0 0.0 0.0
12 1.0 0.0 0.0 0.0 1.0 0.0 0.0 0.0 1.0 -10.0 0.0 0.0
12 1.0 0.0 0.0 0.0 1.0 0.0 0.0 0.0 1.0 -10.0 0.0 0.0
12 1.0 0.0 0.0 0.0 1.0 0.0 0.0 0.0 1.0 -10.0 0.0 0.0
12 1.0 0.0 0.0 0.0 1.0 0.0 0.0 0.0 1.0 -10.0 0.0 0.0
12 1.0 0.0 0.0 0.0 1.0 0.0 0.0 0.0 1.0 -10.0 0.0 0.0
12 1.0 0.0 0.0 0.0 1.0 0.0 0.0 0.0 1.0 -10.0 0.0 0.0
12 1.0 0.0 0.0 0.0 1.0 0.0 0.0 0.0 1.0 -10.0 0.0 0.0
12 1.0 0.0 0.0 0.0 1.0 0.0 0.0 0.0 1.0 -10.0 0.0 0.0
12 1.0 0.0 0.0 0.0 1.0 0.0 0.0 0.0 1.0 -10.0 0.0 0.0
12 1.0 0.0 0.0 0.0 1.0 0.0 0.0 0.0 1.0 -10.0 0.0 0.0
12 1.0 0.0 0.0 0.0 1.0 0.0 0.0 0.0 1.0 -10.0 0.0 0.0
12 1.0 0.0 0.0 0.0 1.0 0.0 0.0 0.0 1.0 -10.0 0.0 0.0
12 1.0 0.0 0.0 0.0 1.0 0.0 0.0 0.0 1.0 -10.0 0.0 0.0
12 1.0 0.0 0.0 0.0 1.0 0.0 0.0 0.0 1.0 -10.0 0.0 0.0
12 1.0 0.0 0.0 0.0 1.0 0.0 0.0 0.0 1.0 -10.0 0.0 0.0
12 1.0 0.0 0.0 0.0 1.0 0.0 0.0 0.0 1.0 -10.0 0.0 0.0
12 1.0 0.0 0.0 0.0 1.0 0.0 0.0 0.0 1.0 -10.0 0.0 0.0
12 1.0 0.0 0.0 0.0 1.0 0.0 0.0 0.0 1.0 -10.0 0.0 0.0
12 1.0 0.0 0.0 0.0 1.0 0.0 0.0 0.0 1.0 -10.0 0.0 0.0
12 1.0 0.0 0.0 0.0 1.0 0.0 0.0 0.0 1.0 -10.0 0.0 0.0
12 1.0 0.0 0.0 0.0 1.0 0.0 0.0 0.0 1.0 -10.0 0.0 0.0
12 1.0 0.0 0.0 0.0 1.0 0.0 0.0 0.0 1.0 -10.0 0.0 0.0
12 1.0 0.0 0.0 0.0 1.0 0.0 0.0 0.0 1.0 -10.0 0.0 0.0
12 1.0 0.0 0.0 0.0 1.0 0.0 0.0 0.0 1.0 -10.0 0.0 0.0
12 1.0 0.0 0.0 0.0 1.0 0.0 0.0 0.0 1.0 -10.0 0.0 0.0
12 1.0 0.0 0.0 0.0 1.0 0.0 0.0 0.0 1.0 -10.0 0.0 0.0
12 1.0 0.0 0.0 0.0 1.0 0.0 0.0 0.0 1.0 -10.0 0.0 0.0
12 1.0 0.0 0.0 0.0 1.0 0.0 0.0 0.0 1.0 -10.0 0.0 0.0
12 1.0 0.0 0.0 0.0 1.0 0.0 0.0 0.0 1.0 -10.0 0.0 0.0
12 1.0 0.0 0.0 0.0 1.0 0.0 0.0 0.0 1.0 -10.0 0.0 0.0
12 1.0 0.0 0.0 0.0 1.0 0.0 0.0 0.0 1.0 -10.0 0.0 0.0
12 1.0 0.0 0.0 0.0 1.0 0.0 0.0 0.0 1.0 -10.0 0.0 0.0
12 1.0 0.0 0.0 0.0 1.0 0.0 0.0 0.0 1.0 -10.0 0.0 0.0
12 1.0 0.0 0.0 0.0 1.0 0.0 0.0 0.0 1.0 -10.0 0.0 0.0
12 1.0 0.0 0.0 0.0 1.0 0.0 0.0 0.0 1.0 -10.0 0.0 0.0
12 1.0 0.0 0.0 0.0 1.0 0.0 0.0 0.0 1.0 -10.0 0.0 0.0
12 1.0 0.0 0.0 0.0 1.0 0.0 0.0 0.0 1.0 -10.0 0.0 0.0
12 1.0 0.0 0.0 0.0 1.0 0.0 0.0 0.0 1.0 -10.0 0.0 0.0
12 1.0 0.0 0.0 0.0 1.0 0.0 0.0 0.0 1.0 -10.0 0.0 0.0
12 1.0 0.0 0.0 0.0 1.0 0.0 0.0 0.0 1.0 -10.0 0.0 0.0
12 1.0 0.0 0.0 0.0 1.0 0.0 0.0 0.0 1.0 -10.0 0.0 0.0
12 1.0 0.0 0.0 0.0 1.0 0.0 0.0 0.0 1.0 -10.0 0.0 0.0
12 1.0 0.0 0.0 0.0 1.0 0.0 0.0 0.0 1.0 -10.0 0.0 0.0
12 1.0 0.0 0.0 0.0 1.0 0.0 0.0 0.0 1.0 -10.0 0.0 0.0
12 1.0 0.0 0.0 0.0 1.0 0.0 0.0 0.0 1.0 -10.0 0.0 0.0
12 1.0 0.0 0.0 0.0 1.0 0.0 0.0 0.0 1.0 -10.0 0.0 0.0
12 1.0 0.0 0.0 0.0 1.0 0.0 0.0 0.0 1.0 -10.0 0.0 0.0
12 1.0 0.0 0.0 0.0 1.0 0.0 0.0 0.0 1.0 -10.0 0.0 0.0
12 1.0 0.0 0.0 0.0 1.0 0.0 0.0 0.0 1.0 -10.0 0.0 0.0
12 1.0 0.0 0.0 0.0 1.0 0.0 0.0 0.0 1.0 -10.0 0.0 0.0
12 1.0 0.0 0.0 0.0 1.0 0.0 0.0 0.0 1.0 -10.0 0.0 0.0
12 1.0 0.0 0.0 0.0 1.0 0.0 0.0 0.0 1.0 -10.0 0.0 0.0
12 1.0 0.0 0.0 0.0 1.0 0.0 0.0 0.0 1.0 -10.0 0.0 0.0
12 1.0 0.0 0.0 0.0 1.0 0.0 0.0 0.0 1.0 -10.0 0.0 0.0
12 1.0 0.0 0.0 0.0 1.0 0.0 0.0 0.0 1.0 -10.0 0.0 0.0
12 1.0 0.0 0.0 0.0 1.0 0.0 0.0 0.0 1.0 -10.0 0.0 0.0
12 1.0 0.0 0.0 0.0 1.0 0.0 0.0 0.0 1.0 -10.0 0.0 0.0
12 1.0 0.0 0.0 0.0 1.0 0.0 0.0 0.0 1.0 -10.0 0.0 0.0
12 1.0 0.0 0.0 0.0 1.0 0.0 0.0 0.0 1.0 -10.0 0.0 0.0
12 1.0 0.0 0.0 0.0 1.0 0.0 0.0 0.0 1.0 -10.0 0.0 0.0
12 1.0 0.0 0.0 0.0 1.0 0.0 0.0 0.0 1.0 -10.0 0.0 0.0
12 1.0 0.0 0.0 0.0 1.0 0.0 0.0 0.0 1.0 -10.0 0.0 0.0
12 1.0 0.0 0.0 0.0 1.0 0.0 0.0 0.0 1.0 -10.0 0.0 0.0
12 1.0 0.0 0.0 0.0 1.0 0.0 0.0 0.0 1.0 -10.0 0.0 0.0
12 1.0 0.0 0.0 0.0 1.0 0.0 0.0 0.0 1.0 -10.0 0.0 0.0
12 1.0 0.0 0.0 0.0 1.0 0.0 0.0 0.0 1.0 -10.0 0.0 0.0
12 1.0 0.0 0.0 0.0 1.0 0.0 0.0 0.0 1.0 -10.0 0.0 0.0
12 1.0 0.0 0.0 0.0 1.0 0.0 0.0 0.0 1.0 -10.0 0.0 0.0
12 1.0 0.0 0.0 0.0 1.0 0.0 0.0 0.0 1.0 -10.0 0.0 0.0
12 1.0 0.0 0.0 0.0 1.0 0.0 0.0 0.0 1.0 -10.0 0.0 0.0
12 1.0 0.0 0.0 0.0 1.0 0.0 0.0 0.0 1.0 -10.0 0.0 0.0
12 1.0 0.0 0.0 0.0 1.0 0.0 0.0 0.0 1.0 -10.0 0.0 0.0
12 1.0 0.0 0.0 0.0 1.0 0.0 0.0 0.0 1.0 -10.0 0.0 0.0
12 1.0 0.0 0.0 0.0 1.0 0.0 0.0 0.0 1.0 -10.0 0.0 0.0
12 1.0 0.0 0.0 0.0 1.0 0.0 0.0 0.0 1.0 -10.0 0.0 0.0
12 1.0 0.0 0.0 0.0 1.0 0.0 0.0 0.0 1.0 -10.0 0.0 0.0
12 1.0 0.0 0.0 0.0 1.0 0.0 0.0 0.0 1.0 -10.0 0.0 0.0
12 1.0 0.0 0.0 0.0 1.0 0.0 0.0 0.0 1.0 -10.0 0.0 0.0
12 1.0 0.0 0.0 0.0 1.0 0.0 0.0 0.0 1.0 -10.0 0.0 0.0
12 1.0 0.0 0.0 0.0 1.0 0.0 0.0 0.0 1.0 -10.0 0.0 0.0
12 1.0 0.0 0.0 0.0 1.0 0.0 0.0 0.0 1.0 -10.0 0.0 0.0
12 1.0 0.0 0.0 0.0 1.0 0.0 0.0 0.0 1.0 -10.0 0.0 0.0
12 1.0 0.0 0.0 0.0 1.0 0.0 0.0 0.0 1.0 -10.0 0.0 0.0
12 1.0 0.0 0.0 0.0 1.0 0.0 0.0 0.0 1.0 -10.0 0.0 0.0
12 1.0 0.0 0.0 0.0 1.0 0.0 0.0 0.0 1.0 -10.0 0.0 0.0
12 1.0 0.0 0.0 0.0 1.0 0.0 0.0 0.0 1.0 -10.0 0.0 0.0
12 1.0 0.0 0.0 0.0 1.0 0.0 0.0 0.0 1.0 -10.0 0.0 0.0
12 1.0 0.0 0.0 0.0 1.0 0.0 0.0 0.0 1.0 -10.0 0.0 0.0
12 1.0 0.0 0.0 0.0 1.0 0.0 0.0 0.0 1.0 -10.0 0.0 0.0
12 1.0 0.0 0.0 0.0 1.0 0.0 0.0 0.0 1.0 -10.0 0.0 0.0
12 1.0 0.0 0.0 0.0 1.0 0.0 0.0 0.0 1.0 -10.0 0.0 0.0
12 1.0 0.0 0.0 0.0 1.0 0.0 0.0 0.0 1.0 -10.0 0.0 0.0
12 1.0 0.0 0.0 0.0 1.0 0.0 0.0 0.0 1.0 -10.0 0.0 0.0
12 1.0 0.0 0.0 0.0 1.0 0.0 0.0 0.0 1.0 -10.0 0.0 0.0
