\relax 
\citation{niederer2011verification}
\citation{niederer2015verification}
\@writefile{toc}{\contentsline {section}{\tocsection {}{1}{Introduction}}{1}}
\newlabel{sec:intro}{{1}{1}}
\@writefile{toc}{\contentsline {paragraph}{\tocparagraph {}{}{\em  Remark}}{1}}
\@writefile{toc}{\contentsline {section}{\tocsection {}{2}{A fully coupled model in cardiac electrophysiolgy}}{3}}
\newlabel{eq:mono}{{1a}{3}}
\newlabel{eq:cell}{{1b}{3}}
\newlabel{eq:circ1}{{1f}{3}}
\newlabel{eq:circ2}{{1g}{3}}
\citation{cherry2017introduction,franzone2014mathematical,quarteroni2017integrated}
\citation{andreianov2015solvability}
\citation{pathmanathan2013existence}
\citation{colli2017effects}
\citation{augustin2016anatomically,franzone2015parallel,pavarino2017scalable,santiago2018fully}
\@writefile{toc}{\contentsline {section}{\tocsection {}{3}{The monodomain equation}}{4}}
\newlabel{sec:monodomain}{{3}{4}}
\@writefile{toc}{\contentsline {paragraph}{\tocparagraph {}{}{\bf  The monodomain data}}{4}}
\newlabel{eq:I_ext}{{2}{4}}
\newlabel{eq:I_ext_smoothed}{{3}{5}}
\@writefile{lof}{\contentsline {figure}{\numberline {1}{\ignorespaces Illustration of the Purkinje fibers and the stimulus points at the end of each branch are shown with their respective activation time. The external stimulus points of the sinus node at $t = 0$\tmspace  +\thinmuskip {.1667em}s is shown in green.\relax }}{5}}
\providecommand*\caption@xref[2]{\@setref\relax\@undefined{#1}}
\newlabel{fig:Purkinje}{{1}{5}}
\@writefile{toc}{\contentsline {paragraph}{\tocparagraph {}{}{\bf  The monodomain evolution}}{5}}
\newlabel{eq:mono1}{{4a}{5}}
\newlabel{eq:mono2}{{4b}{5}}
\@writefile{toc}{\contentsline {section}{\tocsection {}{4}{A splitting method for the monodomain equation}}{5}}
\newlabel{sec:splitting}{{4}{5}}
\@writefile{toc}{\contentsline {paragraph}{\tocparagraph {}{}{\bf  Time integration for the ODE system}}{6}}
\citation{tentusscher}
\citation{kohlsachsSAC,taviSAC}
\newlabel{geoLevel0}{{2a}{7}}
\newlabel{sub@geoLevel0}{{a}{7}}
\newlabel{geoLevel1}{{2b}{7}}
\newlabel{sub@geoLevel1}{{b}{7}}
\@writefile{lof}{\contentsline {figure}{\numberline {2}{\ignorespaces Reference geometry approximating ventricles and atria on level $\ell =0$ and with three uniform refinement steps.\relax }}{7}}
\newlabel{fig:mesh}{{2}{7}}
\@writefile{lof}{\contentsline {figure}{\numberline {3}{\ignorespaces Evolution of a depolarization wave on the ventricles and atria: In this model, the wave is initiated via external stimuli starting at the sinus node located in the wall of the right atrium of the heart and then propagates by electrophysiologic mechanisms. The electric potential is computed with conforming finite elements, which are coupled with an abstract interface to the ODE system describing the electrophysiology of the cell membranes at every nodal point. The time stepping is realized by a splitting scheme. The system is computed in parallel and requires approximately 8.5 million tetrahedra to faithfully represent a physiologically accurate propagation of the cardiac depolarization wave.\relax }}{7}}
\newlabel{fig:depolarization}{{3}{7}}
\@writefile{toc}{\contentsline {section}{\tocsection {}{5}{The ten Tusscher cell model}}{7}}
\newlabel{sec:TenTusscher}{{5}{7}}
\@writefile{toc}{\contentsline {paragraph}{\tocparagraph {}{}{\bf  The evolution of ion concentrations}}{9}}
\citation{croninHodgkin}
\@writefile{toc}{\contentsline {paragraph}{\tocparagraph {}{}{\bf  The gating mechanism}}{10}}
\newlabel{eq:gatingDifferentialgleichung}{{5}{10}}
\newlabel{eq:y_update}{{6}{10}}
\@writefile{toc}{\contentsline {paragraph}{\tocparagraph {}{}{\bf  The gating evolution in the ten Tusscher model}}{10}}
\citation{courtemanche}
\@writefile{toc}{\contentsline {paragraph}{\tocparagraph {}{}{\bf  Computing $\alpha (V_\text  {m})$ and $\beta (V_\text  {m})$}}{12}}
\@writefile{toc}{\contentsline {section}{\tocsection {}{6}{The Courtemanche cell model}}{12}}
\newlabel{sec:Courtemanche}{{6}{12}}
\@writefile{toc}{\contentsline {paragraph}{\tocparagraph {}{}{\bf  The evolution of ion concentration}}{13}}
\@writefile{toc}{\contentsline {paragraph}{\tocparagraph {}{}{\bf  The gating evolution in the Courtemanche model}}{14}}
\@writefile{toc}{\contentsline {section}{\tocsection {}{7}{A model for cardiac electromechanics}}{16}}
\newlabel{sec:mechanics}{{7}{16}}
\newlabel{eq:motionlagr}{{7}{16}}
\@writefile{lof}{\contentsline {figure}{\numberline {4}{\ignorespaces Reference geometry approximating ventricles and atria on level $\ell =0$ and with three uniform refinement steps.\relax }}{17}}
\newlabel{fig:contraction}{{4}{17}}
\@writefile{toc}{\contentsline {paragraph}{\tocparagraph {}{}{\bf  Hyperelasticity}}{17}}
\@writefile{toc}{\contentsline {paragraph}{\tocparagraph {}{}{\bf  Anisotropy}}{17}}
\citation{guccionemat}
\citation{modelpassivemyo}
\citation{ambrosi2011electromechanical,activestrainmodels}
\@writefile{toc}{\contentsline {paragraph}{\tocparagraph {}{}{\bf  Constitutive models}}{18}}
\citation{NonlinFE_SaS}
\@writefile{toc}{\contentsline {paragraph}{\tocparagraph {}{}{\bf  The active strain decomposition}}{19}}
\@writefile{toc}{\contentsline {paragraph}{\tocparagraph {}{}{\bf  The active stress decomposition}}{19}}
\@writefile{toc}{\contentsline {paragraph}{\tocparagraph {}{}{\bf  The Newmark method}}{19}}
\newlabel{newmarkappu}{{11a}{19}}
\newlabel{newmarkappv}{{11b}{19}}
\citation{ForceLengthRelation}
\citation{quarteroni2017integrated}
\newlabel{eq:newmarksystem}{{12}{20}}
\@writefile{toc}{\contentsline {paragraph}{\tocparagraph {}{}{\bf  The ventricle volume}}{20}}
\@writefile{toc}{\contentsline {section}{\tocsection {}{8}{The cell-contraction model}}{20}}
\newlabel{sec:force}{{8}{20}}
\@writefile{toc}{\contentsline {paragraph}{\tocparagraph {}{}{\bf  The Stretch Model}}{20}}
\newlabel{gammaODE}{{14}{20}}
\newlabel{gammaODE2}{{14b}{20}}
\citation{LandCellModel}
\@writefile{toc}{\contentsline {paragraph}{\tocparagraph {}{}{\bf  The Land Tension Cell Model}}{21}}
\newlabel{eq:troponin}{{15}{21}}
\citation{quarteroni2019mathematical}
\citation{barbarotta2018transmurally}
\citation{fedele2017patient}
\citation{tagliabue2017complex}
\@writefile{toc}{\contentsline {section}{\tocsection {}{9}{The circulartory system}}{22}}
\newlabel{sec:circulartory}{{9}{22}}
\@writefile{lof}{\contentsline {figure}{\numberline {5}{\ignorespaces Schematic of the circulatory system model with the pressure values $p$, resistances $R$, and compliances $C$.\relax }}{23}}
\newlabel{fig:CircModel}{{5}{23}}
\newlabel{eq:v}{{29}{24}}
\@writefile{toc}{\contentsline {paragraph}{\tocparagraph {}{}{\bf  The incremental realization}}{24}}
\@writefile{toc}{\contentsline {section}{\tocsection {Appendix}{A}{Monodomain parameters}}{24}}
\@writefile{lot}{\contentsline {table}{\numberline {1}{\ignorespaces Parameters for the evolution of the electric potential in the monodomain equations.\relax }}{24}}
\newlabel{tab:Monodomain}{{1}{24}}
\@writefile{lot}{\contentsline {table}{\numberline {2}{\ignorespaces Parameters in the ten Tuscher cell model.\relax }}{26}}
\newlabel{tab:TenTusscher}{{2}{26}}
\@writefile{lot}{\contentsline {table}{\numberline {3}{\ignorespaces Parameters in the Courtemanche cell model.\relax }}{27}}
\newlabel{tab:Courtemanche}{{3}{27}}
\@writefile{toc}{\contentsline {section}{\tocsection {Appendix}{B}{Hyperelastic parameters}}{28}}
\@writefile{lot}{\contentsline {table}{\numberline {4}{\ignorespaces Parameters in the Land cell model.\relax }}{28}}
\newlabel{tab:LandModel}{{4}{28}}
\@writefile{lot}{\contentsline {table}{\numberline {5}{\ignorespaces Parameters of the force-length relationship function\relax }}{28}}
\newlabel{tab:RFL}{{5}{28}}
\@writefile{lot}{\contentsline {table}{\numberline {6}{\ignorespaces Parameters of the passive material models\relax }}{28}}
\newlabel{tab:PassMat}{{6}{28}}
\bibstyle{apalike}
\bibdata{HeartModel}
\bibcite{ambrosi2011electromechanical}{Ambrosi et\nonbreakingspace al., 2011}
\bibcite{andreianov2015solvability}{Andreianov et\nonbreakingspace al., 2015}
\bibcite{augustin2016anatomically}{Augustin et\nonbreakingspace al., 2016}
\@writefile{toc}{\contentsline {section}{\tocsection {Appendix}{C}{Circulatory System Parameters}}{29}}
\@writefile{lot}{\contentsline {table}{\numberline {7}{\ignorespaces Initial conditions of the circulatory system model.\relax }}{29}}
\newlabel{tab:CircWholeHeartIC}{{7}{29}}
\@writefile{lot}{\contentsline {table}{\numberline {8}{\ignorespaces Parameters in the circulatory system model.\relax }}{29}}
\newlabel{tab:CircWholeHeartParameter}{{8}{29}}
\@writefile{toc}{\contentsline {section}{\tocsection {Appendix}{}{Acknowledgments}}{29}}
\@writefile{toc}{\contentsline {section}{\tocsection {Appendix}{}{References}}{29}}
\bibcite{barbarotta2018transmurally}{Barbarotta et\nonbreakingspace al., 2018}
\bibcite{cherry2017introduction}{Cherry et\nonbreakingspace al., 2017}
\bibcite{colli2017effects}{Colli\nonbreakingspace Franzone et\nonbreakingspace al., 2017}
\bibcite{courtemanche}{Courtemanche et\nonbreakingspace al., 1998}
\bibcite{NonlinFE_SaS}{Crisfield, 1997}
\bibcite{croninHodgkin}{Cronin and Jane, 1987}
\bibcite{fedele2017patient}{Fedele et\nonbreakingspace al., 2017}
\bibcite{franzone2014mathematical}{Franzone et\nonbreakingspace al., 2014}
\bibcite{franzone2015parallel}{Franzone et\nonbreakingspace al., 2015}
\bibcite{guccionemat}{Guccione et\nonbreakingspace al., 1991}
\bibcite{modelpassivemyo}{Holzapfel and Ogden, 2009}
\bibcite{kohlsachsSAC}{Kohl et\nonbreakingspace al., 2001}
\bibcite{niederer2015verification}{Land et\nonbreakingspace al., 2015}
\bibcite{LandCellModel}{Land et\nonbreakingspace al., 2017}
\bibcite{niederer2011verification}{Niederer et\nonbreakingspace al., 2011}
\bibcite{pathmanathan2013existence}{Pathmanathan et\nonbreakingspace al., 2013}
\bibcite{pavarino2017scalable}{Pavarino et\nonbreakingspace al., 2017}
\bibcite{quarteroni2017integrated}{Quarteroni et\nonbreakingspace al., 2017}
\bibcite{quarteroni2019mathematical}{Quarteroni et\nonbreakingspace al., 2019}
\bibcite{activestrainmodels}{Rossi et\nonbreakingspace al., 2012}
\bibcite{ForceLengthRelation}{Ruiz-Baier et\nonbreakingspace al., 2014}
\bibcite{santiago2018fully}{Santiago et\nonbreakingspace al., 2018}
\bibcite{tagliabue2017complex}{Tagliabue et\nonbreakingspace al., 2017}
\bibcite{taviSAC}{Tavi et\nonbreakingspace al., 1998}
\bibcite{tentusscher}{ten Tusscher and Panfilov, 2006}
\newlabel{tocindent-1}{0pt}
\newlabel{tocindent0}{58.61125pt}
\newlabel{tocindent1}{66.11127pt}
\newlabel{tocindent2}{0pt}
\newlabel{tocindent3}{0pt}
