POINTS:
0.0 0.0
0.0 1.0
0.0 2.0
0.0 3.0
0.0 4.0
0.0 5.0
0.0 6.0
0.0 7.0
0.0 8.0
0.0 9.0
0.0 10.0
1.0 0.0
1.0 1.0
1.0 2.0
1.0 3.0
1.0 4.0
1.0 5.0
1.0 6.0
1.0 7.0
1.0 8.0
1.0 9.0
1.0 10.0
2.0 0.0
2.0 1.0
2.0 2.0
2.0 3.0
2.0 4.0
2.0 5.0
2.0 6.0
2.0 7.0
2.0 8.0
2.0 9.0
2.0 10.0
3.0 0.0
3.0 1.0
3.0 2.0
3.0 3.0
3.0 4.0
3.0 5.0
3.0 6.0
3.0 7.0
3.0 8.0
3.0 9.0
3.0 10.0
4.0 0.0
4.0 1.0
4.0 2.0
4.0 3.0
4.0 4.0
4.0 5.0
4.0 6.0
4.0 7.0
4.0 8.0
4.0 9.0
4.0 10.0
5.0 0.0
5.0 1.0
5.0 2.0
5.0 3.0
5.0 4.0
5.0 5.0
5.0 6.0
5.0 7.0
5.0 8.0
5.0 9.0
5.0 10.0
CELLS:
4 0 0 11 12 1
4 0 1 12 13 2
4 0 2 13 14 3
4 0 3 14 15 4
4 0 4 15 16 5
4 0 5 16 17 6
4 0 6 17 18 7
4 0 7 18 19 8
4 0 8 19 20 9
4 0 9 20 21 10
4 0 11 22 23 12
4 0 12 23 24 13
4 0 13 24 25 14
4 0 14 25 26 15
4 0 15 26 27 16
4 0 16 27 28 17
4 0 17 28 29 18
4 0 18 29 30 19
4 0 19 30 31 20
4 0 20 31 32 21
4 0 22 33 34 23
4 0 23 34 35 24
4 0 24 35 36 25
4 0 25 36 37 26
4 0 26 37 38 27
4 0 27 38 39 28
4 0 28 39 40 29
4 0 29 40 41 30
4 0 30 41 42 31
4 0 31 42 43 32
4 0 33 44 45 34
4 0 34 45 46 35
4 0 35 46 47 36
4 0 36 47 48 37
4 0 37 48 49 38
4 0 38 49 50 39
4 0 39 50 51 40
4 0 40 51 52 41
4 0 41 52 53 42
4 0 42 53 54 43
4 0 44 55 56 45
4 0 45 56 57 46
4 0 46 57 58 47
4 0 47 58 59 48
4 0 48 59 60 49
4 0 49 60 61 50
4 0 50 61 62 51
4 0 51 62 63 52
4 0 52 63 64 53
4 0 53 64 65 54
FACES:
2 100 0 1
2 230 55 56
2 100 1 2
2 230 56 57
2 100 2 3
2 230 57 58
2 100 3 4
2 230 58 59
2 100 4 5
2 230 59 60
2 100 5 6
2 230 60 61
2 100 6 7
2 230 61 62
2 100 7 8
2 230 62 63
2 100 8 9
2 230 63 64
2 100 9 10
2 230 64 65
2 231 10 21
2 101 0 11
2 231 21 32
2 101 11 22
2 231 32 43
2 101 22 33
2 231 43 54
2 101 33 44
2 231 54 65
2 101 44 55
VDATA:
3 -10 0 0
3 -10 0 0
3 -10 0 0
3 -10 0 0
3 -10 0 0
3 -10 0 0
3 -10 0 0
3 -10 0 0
3 -10 0 0
3 -10 0 0
3 -10 0 0
3 -10 0 0
3 -10 0 0
3 -10 0 0
3 -10 0 0
3 -10 0 0
3 -10 0 0
3 -10 0 0
3 -10 0 0
3 -10 0 0
3 -10 0 0
3 -10 0 0
3 -10 0 0
3 -10 0 0
3 -10 0 0
3 -10 0 0
3 -10 0 0
3 -10 0 0
3 -10 0 0
3 -10 0 0
3 -10 0 0
3 -10 0 0
3 -10 0 0
3 -10 0 0
3 -10 0 0
3 -10 0 0
3 -10 0 0
3 -10 0 0
3 -10 0 0
3 -10 0 0
3 -10 0 0
3 -10 0 0
3 -10 0 0
3 -10 0 0
3 -10 0 0
3 -10 0 0
3 -10 0 0
3 -10 0 0
3 -10 0 0
3 -10 0 0
3 -10 0 0
3 -10 0 0
3 -10 0 0
3 -10 0 0
3 -10 0 0
3 -10 0 0
3 -10 0 0
3 -10 0 0
3 -10 0 0
3 -10 0 0
3 -10 0 0
3 -10 0 0
3 -10 0 0
3 -10 0 0
3 -10 0 0
3 -10 0 0
CDATA:
9 1 0 0 0 1 0 0 0 1
9 1 0 0 0 1 0 0 0 1
9 1 0 0 0 1 0 0 0 1
9 1 0 0 0 1 0 0 0 1
9 1 0 0 0 1 0 0 0 1
9 1 0 0 0 1 0 0 0 1
9 1 0 0 0 1 0 0 0 1
9 1 0 0 0 1 0 0 0 1
9 1 0 0 0 1 0 0 0 1
9 1 0 0 0 1 0 0 0 1
9 1 0 0 0 1 0 0 0 1
9 1 0 0 0 1 0 0 0 1
9 1 0 0 0 1 0 0 0 1
9 1 0 0 0 1 0 0 0 1
9 1 0 0 0 1 0 0 0 1
9 1 0 0 0 1 0 0 0 1
9 1 0 0 0 1 0 0 0 1
9 1 0 0 0 1 0 0 0 1
9 1 0 0 0 1 0 0 0 1
9 1 0 0 0 1 0 0 0 1
9 1 0 0 0 1 0 0 0 1
9 1 0 0 0 1 0 0 0 1
9 1 0 0 0 1 0 0 0 1
9 1 0 0 0 1 0 0 0 1
9 1 0 0 0 1 0 0 0 1
9 1 0 0 0 1 0 0 0 1
9 1 0 0 0 1 0 0 0 1
9 1 0 0 0 1 0 0 0 1
9 1 0 0 0 1 0 0 0 1
9 1 0 0 0 1 0 0 0 1
9 1 0 0 0 1 0 0 0 1
9 1 0 0 0 1 0 0 0 1
9 1 0 0 0 1 0 0 0 1
9 1 0 0 0 1 0 0 0 1
9 1 0 0 0 1 0 0 0 1
9 1 0 0 0 1 0 0 0 1
9 1 0 0 0 1 0 0 0 1
9 1 0 0 0 1 0 0 0 1
9 1 0 0 0 1 0 0 0 1
9 1 0 0 0 1 0 0 0 1
9 1 0 0 0 1 0 0 0 1
9 1 0 0 0 1 0 0 0 1
9 1 0 0 0 1 0 0 0 1
9 1 0 0 0 1 0 0 0 1
9 1 0 0 0 1 0 0 0 1
9 1 0 0 0 1 0 0 0 1
9 1 0 0 0 1 0 0 0 1
9 1 0 0 0 1 0 0 0 1
9 1 0 0 0 1 0 0 0 1
9 1 0 0 0 1 0 0 0 1
