POINTS
0.0 0.0 0.0
1.0 0.0 0.0
1.0 1.0 0.0
0.0 1.0 0.0
0.0 0.0 1.0
1.0 0.0 1.0
1.0 1.0 1.0
0.0 1.0 1.0
0.5 0.5 0.0
0.5 0.0 0.5
1.0 0.5 0.5
0.5 1.0 0.5
0.0 0.5 0.5
0.5 0.5 1.0
0.5 0.5 0.5
0.00 0.00 0.00
13.0 0.00 0.00
13.0 17.0 0.00
0.00 17.0 0.00
0.00 0.00 20.0
13.0 0.00 20.0
13.0 17.0 20.0
0.00 17.0 20.0
6.500000 8.500000 0.000000
6.500000 0.000000 10.00000
13.00000 8.500000 10.00000
6.500000 17.00000 10.00000
0.000000 8.500000 10.00000
6.500000 8.500000 20.00000
6.500000 8.500000 10.00000
CELLS
4 0 14 8 0 1 
4 0 14 8 1 2 
4 0 14 8 2 3 
4 0 14 8 3 0 
4 0 14 9 0 1 
4 0 14 9 1 5 
4 0 14 9 5 4 
4 0 14 9 4 0 
4 0 14 10 1 2 
4 0 14 10 2 6 
4 0 14 10 6 5 
4 0 14 10 5 1 
4 0 14 11 2 3 
4 0 14 11 3 7 
4 0 14 11 7 6 
4 0 14 11 6 2 
4 0 14 12 3 0 
4 0 14 12 0 4 
4 0 14 12 4 7 
4 0 14 12 7 3 
4 0 14 13 4 5 
4 0 14 13 5 6 
4 0 14 13 6 7 
4 0 14 13 7 4 
FACES
3 1 0 1 8 
3 1 1 2 8 
3 1 2 3 8 
3 1 3 0 8 
3 1 0 1 9 
3 1 1 5 9 
3 1 5 4 9 
3 1 4 0 9 
3 1 1 2 10 
3 1 2 6 10 
3 1 6 5 10 
3 1 5 1 10 
3 1 2 3 11 
3 1 3 7 11 
3 1 7 6 11 
3 1 6 2 11 
3 1 0 3 12 
3 1 3 7 12 
3 1 7 4 12 
3 1 4 0 12 
3 1 4 5 13 
3 1 5 6 13 
3 1 6 7 13 
3 1 7 4 13 
