POINTS:
0.0000 0.0000 0.0000
0.0000 0.0000 0.5000
0.0000 0.0000 1.0000
0.0000 0.0000 1.5000
0.0000 0.0000 2.0000
0.0000 0.0000 2.5000
0.0000 0.0000 3.0000
0.0000 0.5000 0.0000
0.0000 0.5000 0.5000
0.0000 0.5000 1.0000
0.0000 0.5000 1.5000
0.0000 0.5000 2.0000
0.0000 0.5000 2.5000
0.0000 0.5000 3.0000
0.0000 1.0000 0.0000
0.0000 1.0000 0.5000
0.0000 1.0000 1.0000
0.0000 1.0000 1.5000
0.0000 1.0000 2.0000
0.0000 1.0000 2.5000
0.0000 1.0000 3.0000
0.0000 1.5000 0.0000
0.0000 1.5000 0.5000
0.0000 1.5000 1.0000
0.0000 1.5000 1.5000
0.0000 1.5000 2.0000
0.0000 1.5000 2.5000
0.0000 1.5000 3.0000
0.0000 2.0000 0.0000
0.0000 2.0000 0.5000
0.0000 2.0000 1.0000
0.0000 2.0000 1.5000
0.0000 2.0000 2.0000
0.0000 2.0000 2.5000
0.0000 2.0000 3.0000
0.0000 2.5000 0.0000
0.0000 2.5000 0.5000
0.0000 2.5000 1.0000
0.0000 2.5000 1.5000
0.0000 2.5000 2.0000
0.0000 2.5000 2.5000
0.0000 2.5000 3.0000
0.0000 3.0000 0.0000
0.0000 3.0000 0.5000
0.0000 3.0000 1.0000
0.0000 3.0000 1.5000
0.0000 3.0000 2.0000
0.0000 3.0000 2.5000
0.0000 3.0000 3.0000
0.5000 0.0000 0.0000
0.5000 0.0000 0.5000
0.5000 0.0000 1.0000
0.5000 0.0000 1.5000
0.5000 0.0000 2.0000
0.5000 0.0000 2.5000
0.5000 0.0000 3.0000
0.5000 0.5000 0.0000
0.5000 0.5000 0.5000
0.5000 0.5000 1.0000
0.5000 0.5000 1.5000
0.5000 0.5000 2.0000
0.5000 0.5000 2.5000
0.5000 0.5000 3.0000
0.5000 1.0000 0.0000
0.5000 1.0000 0.5000
0.5000 1.0000 1.0000
0.5000 1.0000 1.5000
0.5000 1.0000 2.0000
0.5000 1.0000 2.5000
0.5000 1.0000 3.0000
0.5000 1.5000 0.0000
0.5000 1.5000 0.5000
0.5000 1.5000 1.0000
0.5000 1.5000 1.5000
0.5000 1.5000 2.0000
0.5000 1.5000 2.5000
0.5000 1.5000 3.0000
0.5000 2.0000 0.0000
0.5000 2.0000 0.5000
0.5000 2.0000 1.0000
0.5000 2.0000 1.5000
0.5000 2.0000 2.0000
0.5000 2.0000 2.5000
0.5000 2.0000 3.0000
0.5000 2.5000 0.0000
0.5000 2.5000 0.5000
0.5000 2.5000 1.0000
0.5000 2.5000 1.5000
0.5000 2.5000 2.0000
0.5000 2.5000 2.5000
0.5000 2.5000 3.0000
0.5000 3.0000 0.0000
0.5000 3.0000 0.5000
0.5000 3.0000 1.0000
0.5000 3.0000 1.5000
0.5000 3.0000 2.0000
0.5000 3.0000 2.5000
0.5000 3.0000 3.0000
1.0000 0.0000 0.0000
1.0000 0.0000 0.5000
1.0000 0.0000 1.0000
1.0000 0.0000 1.5000
1.0000 0.0000 2.0000
1.0000 0.0000 2.5000
1.0000 0.0000 3.0000
1.0000 0.5000 0.0000
1.0000 0.5000 0.5000
1.0000 0.5000 1.0000
1.0000 0.5000 1.5000
1.0000 0.5000 2.0000
1.0000 0.5000 2.5000
1.0000 0.5000 3.0000
1.0000 1.0000 0.0000
1.0000 1.0000 0.5000
1.0000 1.0000 1.0000
1.0000 1.0000 1.5000
1.0000 1.0000 2.0000
1.0000 1.0000 2.5000
1.0000 1.0000 3.0000
1.0000 1.5000 0.0000
1.0000 1.5000 0.5000
1.0000 1.5000 1.0000
1.0000 1.5000 1.5000
1.0000 1.5000 2.0000
1.0000 1.5000 2.5000
1.0000 1.5000 3.0000
1.0000 2.0000 0.0000
1.0000 2.0000 0.5000
1.0000 2.0000 1.0000
1.0000 2.0000 1.5000
1.0000 2.0000 2.0000
1.0000 2.0000 2.5000
1.0000 2.0000 3.0000
1.0000 2.5000 0.0000
1.0000 2.5000 0.5000
1.0000 2.5000 1.0000
1.0000 2.5000 1.5000
1.0000 2.5000 2.0000
1.0000 2.5000 2.5000
1.0000 2.5000 3.0000
1.0000 3.0000 0.0000
1.0000 3.0000 0.5000
1.0000 3.0000 1.0000
1.0000 3.0000 1.5000
1.0000 3.0000 2.0000
1.0000 3.0000 2.5000
1.0000 3.0000 3.0000
1.5000 0.0000 0.0000
1.5000 0.0000 0.5000
1.5000 0.0000 1.0000
1.5000 0.0000 1.5000
1.5000 0.0000 2.0000
1.5000 0.0000 2.5000
1.5000 0.0000 3.0000
1.5000 0.5000 0.0000
1.5000 0.5000 0.5000
1.5000 0.5000 1.0000
1.5000 0.5000 1.5000
1.5000 0.5000 2.0000
1.5000 0.5000 2.5000
1.5000 0.5000 3.0000
1.5000 1.0000 0.0000
1.5000 1.0000 0.5000
1.5000 1.0000 1.0000
1.5000 1.0000 1.5000
1.5000 1.0000 2.0000
1.5000 1.0000 2.5000
1.5000 1.0000 3.0000
1.5000 1.5000 0.0000
1.5000 1.5000 0.5000
1.5000 1.5000 1.0000
1.5000 1.5000 1.5000
1.5000 1.5000 2.0000
1.5000 1.5000 2.5000
1.5000 1.5000 3.0000
1.5000 2.0000 0.0000
1.5000 2.0000 0.5000
1.5000 2.0000 1.0000
1.5000 2.0000 1.5000
1.5000 2.0000 2.0000
1.5000 2.0000 2.5000
1.5000 2.0000 3.0000
1.5000 2.5000 0.0000
1.5000 2.5000 0.5000
1.5000 2.5000 1.0000
1.5000 2.5000 1.5000
1.5000 2.5000 2.0000
1.5000 2.5000 2.5000
1.5000 2.5000 3.0000
1.5000 3.0000 0.0000
1.5000 3.0000 0.5000
1.5000 3.0000 1.0000
1.5000 3.0000 1.5000
1.5000 3.0000 2.0000
1.5000 3.0000 2.5000
1.5000 3.0000 3.0000
2.0000 0.0000 0.0000
2.0000 0.0000 0.5000
2.0000 0.0000 1.0000
2.0000 0.0000 1.5000
2.0000 0.0000 2.0000
2.0000 0.0000 2.5000
2.0000 0.0000 3.0000
2.0000 0.5000 0.0000
2.0000 0.5000 0.5000
2.0000 0.5000 1.0000
2.0000 0.5000 1.5000
2.0000 0.5000 2.0000
2.0000 0.5000 2.5000
2.0000 0.5000 3.0000
2.0000 1.0000 0.0000
2.0000 1.0000 0.5000
2.0000 1.0000 1.0000
2.0000 1.0000 1.5000
2.0000 1.0000 2.0000
2.0000 1.0000 2.5000
2.0000 1.0000 3.0000
2.0000 1.5000 0.0000
2.0000 1.5000 0.5000
2.0000 1.5000 1.0000
2.0000 1.5000 1.5000
2.0000 1.5000 2.0000
2.0000 1.5000 2.5000
2.0000 1.5000 3.0000
2.0000 2.0000 0.0000
2.0000 2.0000 0.5000
2.0000 2.0000 1.0000
2.0000 2.0000 1.5000
2.0000 2.0000 2.0000
2.0000 2.0000 2.5000
2.0000 2.0000 3.0000
2.0000 2.5000 0.0000
2.0000 2.5000 0.5000
2.0000 2.5000 1.0000
2.0000 2.5000 1.5000
2.0000 2.5000 2.0000
2.0000 2.5000 2.5000
2.0000 2.5000 3.0000
2.0000 3.0000 0.0000
2.0000 3.0000 0.5000
2.0000 3.0000 1.0000
2.0000 3.0000 1.5000
2.0000 3.0000 2.0000
2.0000 3.0000 2.5000
2.0000 3.0000 3.0000
2.5000 0.0000 0.0000
2.5000 0.0000 0.5000
2.5000 0.0000 1.0000
2.5000 0.0000 1.5000
2.5000 0.0000 2.0000
2.5000 0.0000 2.5000
2.5000 0.0000 3.0000
2.5000 0.5000 0.0000
2.5000 0.5000 0.5000
2.5000 0.5000 1.0000
2.5000 0.5000 1.5000
2.5000 0.5000 2.0000
2.5000 0.5000 2.5000
2.5000 0.5000 3.0000
2.5000 1.0000 0.0000
2.5000 1.0000 0.5000
2.5000 1.0000 1.0000
2.5000 1.0000 1.5000
2.5000 1.0000 2.0000
2.5000 1.0000 2.5000
2.5000 1.0000 3.0000
2.5000 1.5000 0.0000
2.5000 1.5000 0.5000
2.5000 1.5000 1.0000
2.5000 1.5000 1.5000
2.5000 1.5000 2.0000
2.5000 1.5000 2.5000
2.5000 1.5000 3.0000
2.5000 2.0000 0.0000
2.5000 2.0000 0.5000
2.5000 2.0000 1.0000
2.5000 2.0000 1.5000
2.5000 2.0000 2.0000
2.5000 2.0000 2.5000
2.5000 2.0000 3.0000
2.5000 2.5000 0.0000
2.5000 2.5000 0.5000
2.5000 2.5000 1.0000
2.5000 2.5000 1.5000
2.5000 2.5000 2.0000
2.5000 2.5000 2.5000
2.5000 2.5000 3.0000
2.5000 3.0000 0.0000
2.5000 3.0000 0.5000
2.5000 3.0000 1.0000
2.5000 3.0000 1.5000
2.5000 3.0000 2.0000
2.5000 3.0000 2.5000
2.5000 3.0000 3.0000
3.0000 0.0000 0.0000
3.0000 0.0000 0.5000
3.0000 0.0000 1.0000
3.0000 0.0000 1.5000
3.0000 0.0000 2.0000
3.0000 0.0000 2.5000
3.0000 0.0000 3.0000
3.0000 0.5000 0.0000
3.0000 0.5000 0.5000
3.0000 0.5000 1.0000
3.0000 0.5000 1.5000
3.0000 0.5000 2.0000
3.0000 0.5000 2.5000
3.0000 0.5000 3.0000
3.0000 1.0000 0.0000
3.0000 1.0000 0.5000
3.0000 1.0000 1.0000
3.0000 1.0000 1.5000
3.0000 1.0000 2.0000
3.0000 1.0000 2.5000
3.0000 1.0000 3.0000
3.0000 1.5000 0.0000
3.0000 1.5000 0.5000
3.0000 1.5000 1.0000
3.0000 1.5000 1.5000
3.0000 1.5000 2.0000
3.0000 1.5000 2.5000
3.0000 1.5000 3.0000
3.0000 2.0000 0.0000
3.0000 2.0000 0.5000
3.0000 2.0000 1.0000
3.0000 2.0000 1.5000
3.0000 2.0000 2.0000
3.0000 2.0000 2.5000
3.0000 2.0000 3.0000
3.0000 2.5000 0.0000
3.0000 2.5000 0.5000
3.0000 2.5000 1.0000
3.0000 2.5000 1.5000
3.0000 2.5000 2.0000
3.0000 2.5000 2.5000
3.0000 2.5000 3.0000
3.0000 3.0000 0.0000
3.0000 3.0000 0.5000
3.0000 3.0000 1.0000
3.0000 3.0000 1.5000
3.0000 3.0000 2.0000
3.0000 3.0000 2.5000
3.0000 3.0000 3.0000
3.5000 0.0000 0.0000
3.5000 0.0000 0.5000
3.5000 0.0000 1.0000
3.5000 0.0000 1.5000
3.5000 0.0000 2.0000
3.5000 0.0000 2.5000
3.5000 0.0000 3.0000
3.5000 0.5000 0.0000
3.5000 0.5000 0.5000
3.5000 0.5000 1.0000
3.5000 0.5000 1.5000
3.5000 0.5000 2.0000
3.5000 0.5000 2.5000
3.5000 0.5000 3.0000
3.5000 1.0000 0.0000
3.5000 1.0000 0.5000
3.5000 1.0000 1.0000
3.5000 1.0000 1.5000
3.5000 1.0000 2.0000
3.5000 1.0000 2.5000
3.5000 1.0000 3.0000
3.5000 1.5000 0.0000
3.5000 1.5000 0.5000
3.5000 1.5000 1.0000
3.5000 1.5000 1.5000
3.5000 1.5000 2.0000
3.5000 1.5000 2.5000
3.5000 1.5000 3.0000
3.5000 2.0000 0.0000
3.5000 2.0000 0.5000
3.5000 2.0000 1.0000
3.5000 2.0000 1.5000
3.5000 2.0000 2.0000
3.5000 2.0000 2.5000
3.5000 2.0000 3.0000
3.5000 2.5000 0.0000
3.5000 2.5000 0.5000
3.5000 2.5000 1.0000
3.5000 2.5000 1.5000
3.5000 2.5000 2.0000
3.5000 2.5000 2.5000
3.5000 2.5000 3.0000
3.5000 3.0000 0.0000
3.5000 3.0000 0.5000
3.5000 3.0000 1.0000
3.5000 3.0000 1.5000
3.5000 3.0000 2.0000
3.5000 3.0000 2.5000
3.5000 3.0000 3.0000
4.0000 0.0000 0.0000
4.0000 0.0000 0.5000
4.0000 0.0000 1.0000
4.0000 0.0000 1.5000
4.0000 0.0000 2.0000
4.0000 0.0000 2.5000
4.0000 0.0000 3.0000
4.0000 0.5000 0.0000
4.0000 0.5000 0.5000
4.0000 0.5000 1.0000
4.0000 0.5000 1.5000
4.0000 0.5000 2.0000
4.0000 0.5000 2.5000
4.0000 0.5000 3.0000
4.0000 1.0000 0.0000
4.0000 1.0000 0.5000
4.0000 1.0000 1.0000
4.0000 1.0000 1.5000
4.0000 1.0000 2.0000
4.0000 1.0000 2.5000
4.0000 1.0000 3.0000
4.0000 1.5000 0.0000
4.0000 1.5000 0.5000
4.0000 1.5000 1.0000
4.0000 1.5000 1.5000
4.0000 1.5000 2.0000
4.0000 1.5000 2.5000
4.0000 1.5000 3.0000
4.0000 2.0000 0.0000
4.0000 2.0000 0.5000
4.0000 2.0000 1.0000
4.0000 2.0000 1.5000
4.0000 2.0000 2.0000
4.0000 2.0000 2.5000
4.0000 2.0000 3.0000
4.0000 2.5000 0.0000
4.0000 2.5000 0.5000
4.0000 2.5000 1.0000
4.0000 2.5000 1.5000
4.0000 2.5000 2.0000
4.0000 2.5000 2.5000
4.0000 2.5000 3.0000
4.0000 3.0000 0.0000
4.0000 3.0000 0.5000
4.0000 3.0000 1.0000
4.0000 3.0000 1.5000
4.0000 3.0000 2.0000
4.0000 3.0000 2.5000
4.0000 3.0000 3.0000
4.5000 0.0000 0.0000
4.5000 0.0000 0.5000
4.5000 0.0000 1.0000
4.5000 0.0000 1.5000
4.5000 0.0000 2.0000
4.5000 0.0000 2.5000
4.5000 0.0000 3.0000
4.5000 0.5000 0.0000
4.5000 0.5000 0.5000
4.5000 0.5000 1.0000
4.5000 0.5000 1.5000
4.5000 0.5000 2.0000
4.5000 0.5000 2.5000
4.5000 0.5000 3.0000
4.5000 1.0000 0.0000
4.5000 1.0000 0.5000
4.5000 1.0000 1.0000
4.5000 1.0000 1.5000
4.5000 1.0000 2.0000
4.5000 1.0000 2.5000
4.5000 1.0000 3.0000
4.5000 1.5000 0.0000
4.5000 1.5000 0.5000
4.5000 1.5000 1.0000
4.5000 1.5000 1.5000
4.5000 1.5000 2.0000
4.5000 1.5000 2.5000
4.5000 1.5000 3.0000
4.5000 2.0000 0.0000
4.5000 2.0000 0.5000
4.5000 2.0000 1.0000
4.5000 2.0000 1.5000
4.5000 2.0000 2.0000
4.5000 2.0000 2.5000
4.5000 2.0000 3.0000
4.5000 2.5000 0.0000
4.5000 2.5000 0.5000
4.5000 2.5000 1.0000
4.5000 2.5000 1.5000
4.5000 2.5000 2.0000
4.5000 2.5000 2.5000
4.5000 2.5000 3.0000
4.5000 3.0000 0.0000
4.5000 3.0000 0.5000
4.5000 3.0000 1.0000
4.5000 3.0000 1.5000
4.5000 3.0000 2.0000
4.5000 3.0000 2.5000
4.5000 3.0000 3.0000
5.0000 0.0000 0.0000
5.0000 0.0000 0.5000
5.0000 0.0000 1.0000
5.0000 0.0000 1.5000
5.0000 0.0000 2.0000
5.0000 0.0000 2.5000
5.0000 0.0000 3.0000
5.0000 0.5000 0.0000
5.0000 0.5000 0.5000
5.0000 0.5000 1.0000
5.0000 0.5000 1.5000
5.0000 0.5000 2.0000
5.0000 0.5000 2.5000
5.0000 0.5000 3.0000
5.0000 1.0000 0.0000
5.0000 1.0000 0.5000
5.0000 1.0000 1.0000
5.0000 1.0000 1.5000
5.0000 1.0000 2.0000
5.0000 1.0000 2.5000
5.0000 1.0000 3.0000
5.0000 1.5000 0.0000
5.0000 1.5000 0.5000
5.0000 1.5000 1.0000
5.0000 1.5000 1.5000
5.0000 1.5000 2.0000
5.0000 1.5000 2.5000
5.0000 1.5000 3.0000
5.0000 2.0000 0.0000
5.0000 2.0000 0.5000
5.0000 2.0000 1.0000
5.0000 2.0000 1.5000
5.0000 2.0000 2.0000
5.0000 2.0000 2.5000
5.0000 2.0000 3.0000
5.0000 2.5000 0.0000
5.0000 2.5000 0.5000
5.0000 2.5000 1.0000
5.0000 2.5000 1.5000
5.0000 2.5000 2.0000
5.0000 2.5000 2.5000
5.0000 2.5000 3.0000
5.0000 3.0000 0.0000
5.0000 3.0000 0.5000
5.0000 3.0000 1.0000
5.0000 3.0000 1.5000
5.0000 3.0000 2.0000
5.0000 3.0000 2.5000
5.0000 3.0000 3.0000
CELLS:
8 0000  0 49 56 7 1 50 57 8
8 0000  1 50 57 8 2 51 58 9
8 0000  2 51 58 9 3 52 59 10
8 0000  3 52 59 10 4 53 60 11
8 0000  4 53 60 11 5 54 61 12
8 0000  5 54 61 12 6 55 62 13
8 0000  7 56 63 14 8 57 64 15
8 0000  8 57 64 15 9 58 65 16
8 0000  9 58 65 16 10 59 66 17
8 0000  10 59 66 17 11 60 67 18
8 0000  11 60 67 18 12 61 68 19
8 0000  12 61 68 19 13 62 69 20
8 0000  14 63 70 21 15 64 71 22
8 0000  15 64 71 22 16 65 72 23
8 0000  16 65 72 23 17 66 73 24
8 0000  17 66 73 24 18 67 74 25
8 0000  18 67 74 25 19 68 75 26
8 0000  19 68 75 26 20 69 76 27
8 0000  21 70 77 28 22 71 78 29
8 0000  22 71 78 29 23 72 79 30
8 0000  23 72 79 30 24 73 80 31
8 0000  24 73 80 31 25 74 81 32
8 0000  25 74 81 32 26 75 82 33
8 0000  26 75 82 33 27 76 83 34
8 0000  28 77 84 35 29 78 85 36
8 0000  29 78 85 36 30 79 86 37
8 0000  30 79 86 37 31 80 87 38
8 0000  31 80 87 38 32 81 88 39
8 0000  32 81 88 39 33 82 89 40
8 0000  33 82 89 40 34 83 90 41
8 0000  35 84 91 42 36 85 92 43
8 0000  36 85 92 43 37 86 93 44
8 0000  37 86 93 44 38 87 94 45
8 0000  38 87 94 45 39 88 95 46
8 0000  39 88 95 46 40 89 96 47
8 0000  40 89 96 47 41 90 97 48
8 0000  49 98 105 56 50 99 106 57
8 0000  50 99 106 57 51 100 107 58
8 0000  51 100 107 58 52 101 108 59
8 0000  52 101 108 59 53 102 109 60
8 0000  53 102 109 60 54 103 110 61
8 0000  54 103 110 61 55 104 111 62
8 0000  56 105 112 63 57 106 113 64
8 0000  57 106 113 64 58 107 114 65
8 0000  58 107 114 65 59 108 115 66
8 0000  59 108 115 66 60 109 116 67
8 0000  60 109 116 67 61 110 117 68
8 0000  61 110 117 68 62 111 118 69
8 0000  63 112 119 70 64 113 120 71
8 0000  64 113 120 71 65 114 121 72
8 0000  65 114 121 72 66 115 122 73
8 0000  66 115 122 73 67 116 123 74
8 0000  67 116 123 74 68 117 124 75
8 0000  68 117 124 75 69 118 125 76
8 0000  70 119 126 77 71 120 127 78
8 0000  71 120 127 78 72 121 128 79
8 0000  72 121 128 79 73 122 129 80
8 0000  73 122 129 80 74 123 130 81
8 0000  74 123 130 81 75 124 131 82
8 0000  75 124 131 82 76 125 132 83
8 0000  77 126 133 84 78 127 134 85
8 0000  78 127 134 85 79 128 135 86
8 0000  79 128 135 86 80 129 136 87
8 0000  80 129 136 87 81 130 137 88
8 0000  81 130 137 88 82 131 138 89
8 0000  82 131 138 89 83 132 139 90
8 0000  84 133 140 91 85 134 141 92
8 0000  85 134 141 92 86 135 142 93
8 0000  86 135 142 93 87 136 143 94
8 0000  87 136 143 94 88 137 144 95
8 0000  88 137 144 95 89 138 145 96
8 0000  89 138 145 96 90 139 146 97
8 0000  98 147 154 105 99 148 155 106
8 0000  99 148 155 106 100 149 156 107
8 0000  100 149 156 107 101 150 157 108
8 0000  101 150 157 108 102 151 158 109
8 0000  102 151 158 109 103 152 159 110
8 0000  103 152 159 110 104 153 160 111
8 0000  105 154 161 112 106 155 162 113
8 0000  106 155 162 113 107 156 163 114
8 0000  107 156 163 114 108 157 164 115
8 0000  108 157 164 115 109 158 165 116
8 0000  109 158 165 116 110 159 166 117
8 0000  110 159 166 117 111 160 167 118
8 0000  112 161 168 119 113 162 169 120
8 0000  113 162 169 120 114 163 170 121
8 0000  114 163 170 121 115 164 171 122
8 0000  115 164 171 122 116 165 172 123
8 0000  116 165 172 123 117 166 173 124
8 0000  117 166 173 124 118 167 174 125
8 0000  119 168 175 126 120 169 176 127
8 0000  120 169 176 127 121 170 177 128
8 0000  121 170 177 128 122 171 178 129
8 0000  122 171 178 129 123 172 179 130
8 0000  123 172 179 130 124 173 180 131
8 0000  124 173 180 131 125 174 181 132
8 0000  126 175 182 133 127 176 183 134
8 0000  127 176 183 134 128 177 184 135
8 0000  128 177 184 135 129 178 185 136
8 0000  129 178 185 136 130 179 186 137
8 0000  130 179 186 137 131 180 187 138
8 0000  131 180 187 138 132 181 188 139
8 0000  133 182 189 140 134 183 190 141
8 0000  134 183 190 141 135 184 191 142
8 0000  135 184 191 142 136 185 192 143
8 0000  136 185 192 143 137 186 193 144
8 0000  137 186 193 144 138 187 194 145
8 0000  138 187 194 145 139 188 195 146
8 0000  147 196 203 154 148 197 204 155
8 0000  148 197 204 155 149 198 205 156
8 0000  149 198 205 156 150 199 206 157
8 0000  150 199 206 157 151 200 207 158
8 0000  151 200 207 158 152 201 208 159
8 0000  152 201 208 159 153 202 209 160
8 0000  154 203 210 161 155 204 211 162
8 0000  155 204 211 162 156 205 212 163
8 0000  156 205 212 163 157 206 213 164
8 0000  157 206 213 164 158 207 214 165
8 0000  158 207 214 165 159 208 215 166
8 0000  159 208 215 166 160 209 216 167
8 0000  161 210 217 168 162 211 218 169
8 0000  162 211 218 169 163 212 219 170
8 0000  163 212 219 170 164 213 220 171
8 0000  164 213 220 171 165 214 221 172
8 0000  165 214 221 172 166 215 222 173
8 0000  166 215 222 173 167 216 223 174
8 0000  168 217 224 175 169 218 225 176
8 0000  169 218 225 176 170 219 226 177
8 0000  170 219 226 177 171 220 227 178
8 0000  171 220 227 178 172 221 228 179
8 0000  172 221 228 179 173 222 229 180
8 0000  173 222 229 180 174 223 230 181
8 0000  175 224 231 182 176 225 232 183
8 0000  176 225 232 183 177 226 233 184
8 0000  177 226 233 184 178 227 234 185
8 0000  178 227 234 185 179 228 235 186
8 0000  179 228 235 186 180 229 236 187
8 0000  180 229 236 187 181 230 237 188
8 0000  182 231 238 189 183 232 239 190
8 0000  183 232 239 190 184 233 240 191
8 0000  184 233 240 191 185 234 241 192
8 0000  185 234 241 192 186 235 242 193
8 0000  186 235 242 193 187 236 243 194
8 0000  187 236 243 194 188 237 244 195
8 0000  196 245 252 203 197 246 253 204
8 0000  197 246 253 204 198 247 254 205
8 0000  198 247 254 205 199 248 255 206
8 0000  199 248 255 206 200 249 256 207
8 0000  200 249 256 207 201 250 257 208
8 0000  201 250 257 208 202 251 258 209
8 0000  203 252 259 210 204 253 260 211
8 0000  204 253 260 211 205 254 261 212
8 0000  205 254 261 212 206 255 262 213
8 0000  206 255 262 213 207 256 263 214
8 0000  207 256 263 214 208 257 264 215
8 0000  208 257 264 215 209 258 265 216
8 0000  210 259 266 217 211 260 267 218
8 0000  211 260 267 218 212 261 268 219
8 0000  212 261 268 219 213 262 269 220
8 0000  213 262 269 220 214 263 270 221
8 0000  214 263 270 221 215 264 271 222
8 0000  215 264 271 222 216 265 272 223
8 0000  217 266 273 224 218 267 274 225
8 0000  218 267 274 225 219 268 275 226
8 0000  219 268 275 226 220 269 276 227
8 0000  220 269 276 227 221 270 277 228
8 0000  221 270 277 228 222 271 278 229
8 0000  222 271 278 229 223 272 279 230
8 0000  224 273 280 231 225 274 281 232
8 0000  225 274 281 232 226 275 282 233
8 0000  226 275 282 233 227 276 283 234
8 0000  227 276 283 234 228 277 284 235
8 0000  228 277 284 235 229 278 285 236
8 0000  229 278 285 236 230 279 286 237
8 0000  231 280 287 238 232 281 288 239
8 0000  232 281 288 239 233 282 289 240
8 0000  233 282 289 240 234 283 290 241
8 0000  234 283 290 241 235 284 291 242
8 0000  235 284 291 242 236 285 292 243
8 0000  236 285 292 243 237 286 293 244
8 0000  245 294 301 252 246 295 302 253
8 0000  246 295 302 253 247 296 303 254
8 0000  247 296 303 254 248 297 304 255
8 0000  248 297 304 255 249 298 305 256
8 0000  249 298 305 256 250 299 306 257
8 0000  250 299 306 257 251 300 307 258
8 0000  252 301 308 259 253 302 309 260
8 0000  253 302 309 260 254 303 310 261
8 0000  254 303 310 261 255 304 311 262
8 0000  255 304 311 262 256 305 312 263
8 0000  256 305 312 263 257 306 313 264
8 0000  257 306 313 264 258 307 314 265
8 0000  259 308 315 266 260 309 316 267
8 0000  260 309 316 267 261 310 317 268
8 0000  261 310 317 268 262 311 318 269
8 0000  262 311 318 269 263 312 319 270
8 0000  263 312 319 270 264 313 320 271
8 0000  264 313 320 271 265 314 321 272
8 0000  266 315 322 273 267 316 323 274
8 0000  267 316 323 274 268 317 324 275
8 0000  268 317 324 275 269 318 325 276
8 0000  269 318 325 276 270 319 326 277
8 0000  270 319 326 277 271 320 327 278
8 0000  271 320 327 278 272 321 328 279
8 0000  273 322 329 280 274 323 330 281
8 0000  274 323 330 281 275 324 331 282
8 0000  275 324 331 282 276 325 332 283
8 0000  276 325 332 283 277 326 333 284
8 0000  277 326 333 284 278 327 334 285
8 0000  278 327 334 285 279 328 335 286
8 0000  280 329 336 287 281 330 337 288
8 0000  281 330 337 288 282 331 338 289
8 0000  282 331 338 289 283 332 339 290
8 0000  283 332 339 290 284 333 340 291
8 0000  284 333 340 291 285 334 341 292
8 0000  285 334 341 292 286 335 342 293
8 0000  294 343 350 301 295 344 351 302
8 0000  295 344 351 302 296 345 352 303
8 0000  296 345 352 303 297 346 353 304
8 0000  297 346 353 304 298 347 354 305
8 0000  298 347 354 305 299 348 355 306
8 0000  299 348 355 306 300 349 356 307
8 0000  301 350 357 308 302 351 358 309
8 0000  302 351 358 309 303 352 359 310
8 0000  303 352 359 310 304 353 360 311
8 0000  304 353 360 311 305 354 361 312
8 0000  305 354 361 312 306 355 362 313
8 0000  306 355 362 313 307 356 363 314
8 0000  308 357 364 315 309 358 365 316
8 0000  309 358 365 316 310 359 366 317
8 0000  310 359 366 317 311 360 367 318
8 0000  311 360 367 318 312 361 368 319
8 0000  312 361 368 319 313 362 369 320
8 0000  313 362 369 320 314 363 370 321
8 0000  315 364 371 322 316 365 372 323
8 0000  316 365 372 323 317 366 373 324
8 0000  317 366 373 324 318 367 374 325
8 0000  318 367 374 325 319 368 375 326
8 0000  319 368 375 326 320 369 376 327
8 0000  320 369 376 327 321 370 377 328
8 0000  322 371 378 329 323 372 379 330
8 0000  323 372 379 330 324 373 380 331
8 0000  324 373 380 331 325 374 381 332
8 0000  325 374 381 332 326 375 382 333
8 0000  326 375 382 333 327 376 383 334
8 0000  327 376 383 334 328 377 384 335
8 0000  329 378 385 336 330 379 386 337
8 0000  330 379 386 337 331 380 387 338
8 0000  331 380 387 338 332 381 388 339
8 0000  332 381 388 339 333 382 389 340
8 0000  333 382 389 340 334 383 390 341
8 0000  334 383 390 341 335 384 391 342
8 0000  343 392 399 350 344 393 400 351
8 0000  344 393 400 351 345 394 401 352
8 0000  345 394 401 352 346 395 402 353
8 0000  346 395 402 353 347 396 403 354
8 0000  347 396 403 354 348 397 404 355
8 0000  348 397 404 355 349 398 405 356
8 0000  350 399 406 357 351 400 407 358
8 0000  351 400 407 358 352 401 408 359
8 0000  352 401 408 359 353 402 409 360
8 0000  353 402 409 360 354 403 410 361
8 0000  354 403 410 361 355 404 411 362
8 0000  355 404 411 362 356 405 412 363
8 0000  357 406 413 364 358 407 414 365
8 0000  358 407 414 365 359 408 415 366
8 0000  359 408 415 366 360 409 416 367
8 0000  360 409 416 367 361 410 417 368
8 0000  361 410 417 368 362 411 418 369
8 0000  362 411 418 369 363 412 419 370
8 0000  364 413 420 371 365 414 421 372
8 0000  365 414 421 372 366 415 422 373
8 0000  366 415 422 373 367 416 423 374
8 0000  367 416 423 374 368 417 424 375
8 0000  368 417 424 375 369 418 425 376
8 0000  369 418 425 376 370 419 426 377
8 0000  371 420 427 378 372 421 428 379
8 0000  372 421 428 379 373 422 429 380
8 0000  373 422 429 380 374 423 430 381
8 0000  374 423 430 381 375 424 431 382
8 0000  375 424 431 382 376 425 432 383
8 0000  376 425 432 383 377 426 433 384
8 0000  378 427 434 385 379 428 435 386
8 0000  379 428 435 386 380 429 436 387
8 0000  380 429 436 387 381 430 437 388
8 0000  381 430 437 388 382 431 438 389
8 0000  382 431 438 389 383 432 439 390
8 0000  383 432 439 390 384 433 440 391
8 0000  392 441 448 399 393 442 449 400
8 0000  393 442 449 400 394 443 450 401
8 0000  394 443 450 401 395 444 451 402
8 0000  395 444 451 402 396 445 452 403
8 0000  396 445 452 403 397 446 453 404
8 0000  397 446 453 404 398 447 454 405
8 0000  399 448 455 406 400 449 456 407
8 0000  400 449 456 407 401 450 457 408
8 0000  401 450 457 408 402 451 458 409
8 0000  402 451 458 409 403 452 459 410
8 0000  403 452 459 410 404 453 460 411
8 0000  404 453 460 411 405 454 461 412
8 0000  406 455 462 413 407 456 463 414
8 0000  407 456 463 414 408 457 464 415
8 0000  408 457 464 415 409 458 465 416
8 0000  409 458 465 416 410 459 466 417
8 0000  410 459 466 417 411 460 467 418
8 0000  411 460 467 418 412 461 468 419
8 0000  413 462 469 420 414 463 470 421
8 0000  414 463 470 421 415 464 471 422
8 0000  415 464 471 422 416 465 472 423
8 0000  416 465 472 423 417 466 473 424
8 0000  417 466 473 424 418 467 474 425
8 0000  418 467 474 425 419 468 475 426
8 0000  420 469 476 427 421 470 477 428
8 0000  421 470 477 428 422 471 478 429
8 0000  422 471 478 429 423 472 479 430
8 0000  423 472 479 430 424 473 480 431
8 0000  424 473 480 431 425 474 481 432
8 0000  425 474 481 432 426 475 482 433
8 0000  427 476 483 434 428 477 484 435
8 0000  428 477 484 435 429 478 485 436
8 0000  429 478 485 436 430 479 486 437
8 0000  430 479 486 437 431 480 487 438
8 0000  431 480 487 438 432 481 488 439
8 0000  432 481 488 439 433 482 489 440
8 0000  441 490 497 448 442 491 498 449
8 0000  442 491 498 449 443 492 499 450
8 0000  443 492 499 450 444 493 500 451
8 0000  444 493 500 451 445 494 501 452
8 0000  445 494 501 452 446 495 502 453
8 0000  446 495 502 453 447 496 503 454
8 0000  448 497 504 455 449 498 505 456
8 0000  449 498 505 456 450 499 506 457
8 0000  450 499 506 457 451 500 507 458
8 0000  451 500 507 458 452 501 508 459
8 0000  452 501 508 459 453 502 509 460
8 0000  453 502 509 460 454 503 510 461
8 0000  455 504 511 462 456 505 512 463
8 0000  456 505 512 463 457 506 513 464
8 0000  457 506 513 464 458 507 514 465
8 0000  458 507 514 465 459 508 515 466
8 0000  459 508 515 466 460 509 516 467
8 0000  460 509 516 467 461 510 517 468
8 0000  462 511 518 469 463 512 519 470
8 0000  463 512 519 470 464 513 520 471
8 0000  464 513 520 471 465 514 521 472
8 0000  465 514 521 472 466 515 522 473
8 0000  466 515 522 473 467 516 523 474
8 0000  467 516 523 474 468 517 524 475
8 0000  469 518 525 476 470 519 526 477
8 0000  470 519 526 477 471 520 527 478
8 0000  471 520 527 478 472 521 528 479
8 0000  472 521 528 479 473 522 529 480
8 0000  473 522 529 480 474 523 530 481
8 0000  474 523 530 481 475 524 531 482
8 0000  476 525 532 483 477 526 533 484
8 0000  477 526 533 484 478 527 534 485
8 0000  478 527 534 485 479 528 535 486
8 0000  479 528 535 486 480 529 536 487
8 0000  480 529 536 487 481 530 537 488
8 0000  481 530 537 488 482 531 538 489
VDATA:
12 1.0 0.0 0.0 0.0 1.0 0.0 0.0 0.0 1.0 0.0 0.002 0.8202
12 1.0 0.0 0.0 0.0 1.0 0.0 0.0 0.0 1.0 0.0 0.002 0.8202
12 1.0 0.0 0.0 0.0 1.0 0.0 0.0 0.0 1.0 0.0 0.002 0.8202
12 1.0 0.0 0.0 0.0 1.0 0.0 0.0 0.0 1.0 0.0 0.002 0.8202
12 1.0 0.0 0.0 0.0 1.0 0.0 0.0 0.0 1.0 -10.0 0.0 0.0
12 1.0 0.0 0.0 0.0 1.0 0.0 0.0 0.0 1.0 -10.0 0.0 0.0
12 1.0 0.0 0.0 0.0 1.0 0.0 0.0 0.0 1.0 -10.0 0.0 0.0
12 1.0 0.0 0.0 0.0 1.0 0.0 0.0 0.0 1.0 0.0 0.002 0.8202
12 1.0 0.0 0.0 0.0 1.0 0.0 0.0 0.0 1.0 0.0 0.002 0.8202
12 1.0 0.0 0.0 0.0 1.0 0.0 0.0 0.0 1.0 0.0 0.002 0.8202
12 1.0 0.0 0.0 0.0 1.0 0.0 0.0 0.0 1.0 0.0 0.002 0.8202
12 1.0 0.0 0.0 0.0 1.0 0.0 0.0 0.0 1.0 -10.0 0.0 0.0
12 1.0 0.0 0.0 0.0 1.0 0.0 0.0 0.0 1.0 -10.0 0.0 0.0
12 1.0 0.0 0.0 0.0 1.0 0.0 0.0 0.0 1.0 -10.0 0.0 0.0
12 1.0 0.0 0.0 0.0 1.0 0.0 0.0 0.0 1.0 0.0 0.002 0.8202
12 1.0 0.0 0.0 0.0 1.0 0.0 0.0 0.0 1.0 0.0 0.002 0.8202
12 1.0 0.0 0.0 0.0 1.0 0.0 0.0 0.0 1.0 0.0 0.002 0.8202
12 1.0 0.0 0.0 0.0 1.0 0.0 0.0 0.0 1.0 0.0 0.002 0.8202
12 1.0 0.0 0.0 0.0 1.0 0.0 0.0 0.0 1.0 -10.0 0.0 0.0
12 1.0 0.0 0.0 0.0 1.0 0.0 0.0 0.0 1.0 -10.0 0.0 0.0
12 1.0 0.0 0.0 0.0 1.0 0.0 0.0 0.0 1.0 -10.0 0.0 0.0
12 1.0 0.0 0.0 0.0 1.0 0.0 0.0 0.0 1.0 0.0 0.002 0.8202
12 1.0 0.0 0.0 0.0 1.0 0.0 0.0 0.0 1.0 0.0 0.002 0.8202
12 1.0 0.0 0.0 0.0 1.0 0.0 0.0 0.0 1.0 0.0 0.002 0.8202
12 1.0 0.0 0.0 0.0 1.0 0.0 0.0 0.0 1.0 0.0 0.002 0.8202
12 1.0 0.0 0.0 0.0 1.0 0.0 0.0 0.0 1.0 -10.0 0.0 0.0
12 1.0 0.0 0.0 0.0 1.0 0.0 0.0 0.0 1.0 -10.0 0.0 0.0
12 1.0 0.0 0.0 0.0 1.0 0.0 0.0 0.0 1.0 -10.0 0.0 0.0
12 1.0 0.0 0.0 0.0 1.0 0.0 0.0 0.0 1.0 -10.0 0.0 0.0
12 1.0 0.0 0.0 0.0 1.0 0.0 0.0 0.0 1.0 -10.0 0.0 0.0
12 1.0 0.0 0.0 0.0 1.0 0.0 0.0 0.0 1.0 -10.0 0.0 0.0
12 1.0 0.0 0.0 0.0 1.0 0.0 0.0 0.0 1.0 -10.0 0.0 0.0
12 1.0 0.0 0.0 0.0 1.0 0.0 0.0 0.0 1.0 -10.0 0.0 0.0
12 1.0 0.0 0.0 0.0 1.0 0.0 0.0 0.0 1.0 -10.0 0.0 0.0
12 1.0 0.0 0.0 0.0 1.0 0.0 0.0 0.0 1.0 -10.0 0.0 0.0
12 1.0 0.0 0.0 0.0 1.0 0.0 0.0 0.0 1.0 -10.0 0.0 0.0
12 1.0 0.0 0.0 0.0 1.0 0.0 0.0 0.0 1.0 -10.0 0.0 0.0
12 1.0 0.0 0.0 0.0 1.0 0.0 0.0 0.0 1.0 -10.0 0.0 0.0
12 1.0 0.0 0.0 0.0 1.0 0.0 0.0 0.0 1.0 -10.0 0.0 0.0
12 1.0 0.0 0.0 0.0 1.0 0.0 0.0 0.0 1.0 -10.0 0.0 0.0
12 1.0 0.0 0.0 0.0 1.0 0.0 0.0 0.0 1.0 -10.0 0.0 0.0
12 1.0 0.0 0.0 0.0 1.0 0.0 0.0 0.0 1.0 -10.0 0.0 0.0
12 1.0 0.0 0.0 0.0 1.0 0.0 0.0 0.0 1.0 -10.0 0.0 0.0
12 1.0 0.0 0.0 0.0 1.0 0.0 0.0 0.0 1.0 -10.0 0.0 0.0
12 1.0 0.0 0.0 0.0 1.0 0.0 0.0 0.0 1.0 -10.0 0.0 0.0
12 1.0 0.0 0.0 0.0 1.0 0.0 0.0 0.0 1.0 -10.0 0.0 0.0
12 1.0 0.0 0.0 0.0 1.0 0.0 0.0 0.0 1.0 -10.0 0.0 0.0
12 1.0 0.0 0.0 0.0 1.0 0.0 0.0 0.0 1.0 -10.0 0.0 0.0
12 1.0 0.0 0.0 0.0 1.0 0.0 0.0 0.0 1.0 -10.0 0.0 0.0
12 1.0 0.0 0.0 0.0 1.0 0.0 0.0 0.0 1.0 0.0 0.002 0.8202
12 1.0 0.0 0.0 0.0 1.0 0.0 0.0 0.0 1.0 0.0 0.002 0.8202
12 1.0 0.0 0.0 0.0 1.0 0.0 0.0 0.0 1.0 0.0 0.002 0.8202
12 1.0 0.0 0.0 0.0 1.0 0.0 0.0 0.0 1.0 0.0 0.002 0.8202
12 1.0 0.0 0.0 0.0 1.0 0.0 0.0 0.0 1.0 -10.0 0.0 0.0
12 1.0 0.0 0.0 0.0 1.0 0.0 0.0 0.0 1.0 -10.0 0.0 0.0
12 1.0 0.0 0.0 0.0 1.0 0.0 0.0 0.0 1.0 -10.0 0.0 0.0
12 1.0 0.0 0.0 0.0 1.0 0.0 0.0 0.0 1.0 0.0 0.002 0.8202
12 1.0 0.0 0.0 0.0 1.0 0.0 0.0 0.0 1.0 0.0 0.002 0.8202
12 1.0 0.0 0.0 0.0 1.0 0.0 0.0 0.0 1.0 0.0 0.002 0.8202
12 1.0 0.0 0.0 0.0 1.0 0.0 0.0 0.0 1.0 0.0 0.002 0.8202
12 1.0 0.0 0.0 0.0 1.0 0.0 0.0 0.0 1.0 -10.0 0.0 0.0
12 1.0 0.0 0.0 0.0 1.0 0.0 0.0 0.0 1.0 -10.0 0.0 0.0
12 1.0 0.0 0.0 0.0 1.0 0.0 0.0 0.0 1.0 -10.0 0.0 0.0
12 1.0 0.0 0.0 0.0 1.0 0.0 0.0 0.0 1.0 0.0 0.002 0.8202
12 1.0 0.0 0.0 0.0 1.0 0.0 0.0 0.0 1.0 0.0 0.002 0.8202
12 1.0 0.0 0.0 0.0 1.0 0.0 0.0 0.0 1.0 0.0 0.002 0.8202
12 1.0 0.0 0.0 0.0 1.0 0.0 0.0 0.0 1.0 0.0 0.002 0.8202
12 1.0 0.0 0.0 0.0 1.0 0.0 0.0 0.0 1.0 -10.0 0.0 0.0
12 1.0 0.0 0.0 0.0 1.0 0.0 0.0 0.0 1.0 -10.0 0.0 0.0
12 1.0 0.0 0.0 0.0 1.0 0.0 0.0 0.0 1.0 -10.0 0.0 0.0
12 1.0 0.0 0.0 0.0 1.0 0.0 0.0 0.0 1.0 0.0 0.002 0.8202
12 1.0 0.0 0.0 0.0 1.0 0.0 0.0 0.0 1.0 0.0 0.002 0.8202
12 1.0 0.0 0.0 0.0 1.0 0.0 0.0 0.0 1.0 0.0 0.002 0.8202
12 1.0 0.0 0.0 0.0 1.0 0.0 0.0 0.0 1.0 0.0 0.002 0.8202
12 1.0 0.0 0.0 0.0 1.0 0.0 0.0 0.0 1.0 -10.0 0.0 0.0
12 1.0 0.0 0.0 0.0 1.0 0.0 0.0 0.0 1.0 -10.0 0.0 0.0
12 1.0 0.0 0.0 0.0 1.0 0.0 0.0 0.0 1.0 -10.0 0.0 0.0
12 1.0 0.0 0.0 0.0 1.0 0.0 0.0 0.0 1.0 -10.0 0.0 0.0
12 1.0 0.0 0.0 0.0 1.0 0.0 0.0 0.0 1.0 -10.0 0.0 0.0
12 1.0 0.0 0.0 0.0 1.0 0.0 0.0 0.0 1.0 -10.0 0.0 0.0
12 1.0 0.0 0.0 0.0 1.0 0.0 0.0 0.0 1.0 -10.0 0.0 0.0
12 1.0 0.0 0.0 0.0 1.0 0.0 0.0 0.0 1.0 -10.0 0.0 0.0
12 1.0 0.0 0.0 0.0 1.0 0.0 0.0 0.0 1.0 -10.0 0.0 0.0
12 1.0 0.0 0.0 0.0 1.0 0.0 0.0 0.0 1.0 -10.0 0.0 0.0
12 1.0 0.0 0.0 0.0 1.0 0.0 0.0 0.0 1.0 -10.0 0.0 0.0
12 1.0 0.0 0.0 0.0 1.0 0.0 0.0 0.0 1.0 -10.0 0.0 0.0
12 1.0 0.0 0.0 0.0 1.0 0.0 0.0 0.0 1.0 -10.0 0.0 0.0
12 1.0 0.0 0.0 0.0 1.0 0.0 0.0 0.0 1.0 -10.0 0.0 0.0
12 1.0 0.0 0.0 0.0 1.0 0.0 0.0 0.0 1.0 -10.0 0.0 0.0
12 1.0 0.0 0.0 0.0 1.0 0.0 0.0 0.0 1.0 -10.0 0.0 0.0
12 1.0 0.0 0.0 0.0 1.0 0.0 0.0 0.0 1.0 -10.0 0.0 0.0
12 1.0 0.0 0.0 0.0 1.0 0.0 0.0 0.0 1.0 -10.0 0.0 0.0
12 1.0 0.0 0.0 0.0 1.0 0.0 0.0 0.0 1.0 -10.0 0.0 0.0
12 1.0 0.0 0.0 0.0 1.0 0.0 0.0 0.0 1.0 -10.0 0.0 0.0
12 1.0 0.0 0.0 0.0 1.0 0.0 0.0 0.0 1.0 -10.0 0.0 0.0
12 1.0 0.0 0.0 0.0 1.0 0.0 0.0 0.0 1.0 -10.0 0.0 0.0
12 1.0 0.0 0.0 0.0 1.0 0.0 0.0 0.0 1.0 -10.0 0.0 0.0
12 1.0 0.0 0.0 0.0 1.0 0.0 0.0 0.0 1.0 -10.0 0.0 0.0
12 1.0 0.0 0.0 0.0 1.0 0.0 0.0 0.0 1.0 0.0 0.002 0.8202
12 1.0 0.0 0.0 0.0 1.0 0.0 0.0 0.0 1.0 0.0 0.002 0.8202
12 1.0 0.0 0.0 0.0 1.0 0.0 0.0 0.0 1.0 0.0 0.002 0.8202
12 1.0 0.0 0.0 0.0 1.0 0.0 0.0 0.0 1.0 0.0 0.002 0.8202
12 1.0 0.0 0.0 0.0 1.0 0.0 0.0 0.0 1.0 -10.0 0.0 0.0
12 1.0 0.0 0.0 0.0 1.0 0.0 0.0 0.0 1.0 -10.0 0.0 0.0
12 1.0 0.0 0.0 0.0 1.0 0.0 0.0 0.0 1.0 -10.0 0.0 0.0
12 1.0 0.0 0.0 0.0 1.0 0.0 0.0 0.0 1.0 0.0 0.002 0.8202
12 1.0 0.0 0.0 0.0 1.0 0.0 0.0 0.0 1.0 0.0 0.002 0.8202
12 1.0 0.0 0.0 0.0 1.0 0.0 0.0 0.0 1.0 0.0 0.002 0.8202
12 1.0 0.0 0.0 0.0 1.0 0.0 0.0 0.0 1.0 0.0 0.002 0.8202
12 1.0 0.0 0.0 0.0 1.0 0.0 0.0 0.0 1.0 -10.0 0.0 0.0
12 1.0 0.0 0.0 0.0 1.0 0.0 0.0 0.0 1.0 -10.0 0.0 0.0
12 1.0 0.0 0.0 0.0 1.0 0.0 0.0 0.0 1.0 -10.0 0.0 0.0
12 1.0 0.0 0.0 0.0 1.0 0.0 0.0 0.0 1.0 0.0 0.002 0.8202
12 1.0 0.0 0.0 0.0 1.0 0.0 0.0 0.0 1.0 0.0 0.002 0.8202
12 1.0 0.0 0.0 0.0 1.0 0.0 0.0 0.0 1.0 0.0 0.002 0.8202
12 1.0 0.0 0.0 0.0 1.0 0.0 0.0 0.0 1.0 0.0 0.002 0.8202
12 1.0 0.0 0.0 0.0 1.0 0.0 0.0 0.0 1.0 -10.0 0.0 0.0
12 1.0 0.0 0.0 0.0 1.0 0.0 0.0 0.0 1.0 -10.0 0.0 0.0
12 1.0 0.0 0.0 0.0 1.0 0.0 0.0 0.0 1.0 -10.0 0.0 0.0
12 1.0 0.0 0.0 0.0 1.0 0.0 0.0 0.0 1.0 0.0 0.002 0.8202
12 1.0 0.0 0.0 0.0 1.0 0.0 0.0 0.0 1.0 0.0 0.002 0.8202
12 1.0 0.0 0.0 0.0 1.0 0.0 0.0 0.0 1.0 0.0 0.002 0.8202
12 1.0 0.0 0.0 0.0 1.0 0.0 0.0 0.0 1.0 0.0 0.002 0.8202
12 1.0 0.0 0.0 0.0 1.0 0.0 0.0 0.0 1.0 -10.0 0.0 0.0
12 1.0 0.0 0.0 0.0 1.0 0.0 0.0 0.0 1.0 -10.0 0.0 0.0
12 1.0 0.0 0.0 0.0 1.0 0.0 0.0 0.0 1.0 -10.0 0.0 0.0
12 1.0 0.0 0.0 0.0 1.0 0.0 0.0 0.0 1.0 -10.0 0.0 0.0
12 1.0 0.0 0.0 0.0 1.0 0.0 0.0 0.0 1.0 -10.0 0.0 0.0
12 1.0 0.0 0.0 0.0 1.0 0.0 0.0 0.0 1.0 -10.0 0.0 0.0
12 1.0 0.0 0.0 0.0 1.0 0.0 0.0 0.0 1.0 -10.0 0.0 0.0
12 1.0 0.0 0.0 0.0 1.0 0.0 0.0 0.0 1.0 -10.0 0.0 0.0
12 1.0 0.0 0.0 0.0 1.0 0.0 0.0 0.0 1.0 -10.0 0.0 0.0
12 1.0 0.0 0.0 0.0 1.0 0.0 0.0 0.0 1.0 -10.0 0.0 0.0
12 1.0 0.0 0.0 0.0 1.0 0.0 0.0 0.0 1.0 -10.0 0.0 0.0
12 1.0 0.0 0.0 0.0 1.0 0.0 0.0 0.0 1.0 -10.0 0.0 0.0
12 1.0 0.0 0.0 0.0 1.0 0.0 0.0 0.0 1.0 -10.0 0.0 0.0
12 1.0 0.0 0.0 0.0 1.0 0.0 0.0 0.0 1.0 -10.0 0.0 0.0
12 1.0 0.0 0.0 0.0 1.0 0.0 0.0 0.0 1.0 -10.0 0.0 0.0
12 1.0 0.0 0.0 0.0 1.0 0.0 0.0 0.0 1.0 -10.0 0.0 0.0
12 1.0 0.0 0.0 0.0 1.0 0.0 0.0 0.0 1.0 -10.0 0.0 0.0
12 1.0 0.0 0.0 0.0 1.0 0.0 0.0 0.0 1.0 -10.0 0.0 0.0
12 1.0 0.0 0.0 0.0 1.0 0.0 0.0 0.0 1.0 -10.0 0.0 0.0
12 1.0 0.0 0.0 0.0 1.0 0.0 0.0 0.0 1.0 -10.0 0.0 0.0
12 1.0 0.0 0.0 0.0 1.0 0.0 0.0 0.0 1.0 -10.0 0.0 0.0
12 1.0 0.0 0.0 0.0 1.0 0.0 0.0 0.0 1.0 -10.0 0.0 0.0
12 1.0 0.0 0.0 0.0 1.0 0.0 0.0 0.0 1.0 -10.0 0.0 0.0
12 1.0 0.0 0.0 0.0 1.0 0.0 0.0 0.0 1.0 -10.0 0.0 0.0
12 1.0 0.0 0.0 0.0 1.0 0.0 0.0 0.0 1.0 0.0 0.002 0.8202
12 1.0 0.0 0.0 0.0 1.0 0.0 0.0 0.0 1.0 0.0 0.002 0.8202
12 1.0 0.0 0.0 0.0 1.0 0.0 0.0 0.0 1.0 0.0 0.002 0.8202
12 1.0 0.0 0.0 0.0 1.0 0.0 0.0 0.0 1.0 0.0 0.002 0.8202
12 1.0 0.0 0.0 0.0 1.0 0.0 0.0 0.0 1.0 -10.0 0.0 0.0
12 1.0 0.0 0.0 0.0 1.0 0.0 0.0 0.0 1.0 -10.0 0.0 0.0
12 1.0 0.0 0.0 0.0 1.0 0.0 0.0 0.0 1.0 -10.0 0.0 0.0
12 1.0 0.0 0.0 0.0 1.0 0.0 0.0 0.0 1.0 0.0 0.002 0.8202
12 1.0 0.0 0.0 0.0 1.0 0.0 0.0 0.0 1.0 0.0 0.002 0.8202
12 1.0 0.0 0.0 0.0 1.0 0.0 0.0 0.0 1.0 0.0 0.002 0.8202
12 1.0 0.0 0.0 0.0 1.0 0.0 0.0 0.0 1.0 0.0 0.002 0.8202
12 1.0 0.0 0.0 0.0 1.0 0.0 0.0 0.0 1.0 -10.0 0.0 0.0
12 1.0 0.0 0.0 0.0 1.0 0.0 0.0 0.0 1.0 -10.0 0.0 0.0
12 1.0 0.0 0.0 0.0 1.0 0.0 0.0 0.0 1.0 -10.0 0.0 0.0
12 1.0 0.0 0.0 0.0 1.0 0.0 0.0 0.0 1.0 0.0 0.002 0.8202
12 1.0 0.0 0.0 0.0 1.0 0.0 0.0 0.0 1.0 0.0 0.002 0.8202
12 1.0 0.0 0.0 0.0 1.0 0.0 0.0 0.0 1.0 0.0 0.002 0.8202
12 1.0 0.0 0.0 0.0 1.0 0.0 0.0 0.0 1.0 0.0 0.002 0.8202
12 1.0 0.0 0.0 0.0 1.0 0.0 0.0 0.0 1.0 -10.0 0.0 0.0
12 1.0 0.0 0.0 0.0 1.0 0.0 0.0 0.0 1.0 -10.0 0.0 0.0
12 1.0 0.0 0.0 0.0 1.0 0.0 0.0 0.0 1.0 -10.0 0.0 0.0
12 1.0 0.0 0.0 0.0 1.0 0.0 0.0 0.0 1.0 0.0 0.002 0.8202
12 1.0 0.0 0.0 0.0 1.0 0.0 0.0 0.0 1.0 0.0 0.002 0.8202
12 1.0 0.0 0.0 0.0 1.0 0.0 0.0 0.0 1.0 0.0 0.002 0.8202
12 1.0 0.0 0.0 0.0 1.0 0.0 0.0 0.0 1.0 0.0 0.002 0.8202
12 1.0 0.0 0.0 0.0 1.0 0.0 0.0 0.0 1.0 -10.0 0.0 0.0
12 1.0 0.0 0.0 0.0 1.0 0.0 0.0 0.0 1.0 -10.0 0.0 0.0
12 1.0 0.0 0.0 0.0 1.0 0.0 0.0 0.0 1.0 -10.0 0.0 0.0
12 1.0 0.0 0.0 0.0 1.0 0.0 0.0 0.0 1.0 -10.0 0.0 0.0
12 1.0 0.0 0.0 0.0 1.0 0.0 0.0 0.0 1.0 -10.0 0.0 0.0
12 1.0 0.0 0.0 0.0 1.0 0.0 0.0 0.0 1.0 -10.0 0.0 0.0
12 1.0 0.0 0.0 0.0 1.0 0.0 0.0 0.0 1.0 -10.0 0.0 0.0
12 1.0 0.0 0.0 0.0 1.0 0.0 0.0 0.0 1.0 -10.0 0.0 0.0
12 1.0 0.0 0.0 0.0 1.0 0.0 0.0 0.0 1.0 -10.0 0.0 0.0
12 1.0 0.0 0.0 0.0 1.0 0.0 0.0 0.0 1.0 -10.0 0.0 0.0
12 1.0 0.0 0.0 0.0 1.0 0.0 0.0 0.0 1.0 -10.0 0.0 0.0
12 1.0 0.0 0.0 0.0 1.0 0.0 0.0 0.0 1.0 -10.0 0.0 0.0
12 1.0 0.0 0.0 0.0 1.0 0.0 0.0 0.0 1.0 -10.0 0.0 0.0
12 1.0 0.0 0.0 0.0 1.0 0.0 0.0 0.0 1.0 -10.0 0.0 0.0
12 1.0 0.0 0.0 0.0 1.0 0.0 0.0 0.0 1.0 -10.0 0.0 0.0
12 1.0 0.0 0.0 0.0 1.0 0.0 0.0 0.0 1.0 -10.0 0.0 0.0
12 1.0 0.0 0.0 0.0 1.0 0.0 0.0 0.0 1.0 -10.0 0.0 0.0
12 1.0 0.0 0.0 0.0 1.0 0.0 0.0 0.0 1.0 -10.0 0.0 0.0
12 1.0 0.0 0.0 0.0 1.0 0.0 0.0 0.0 1.0 -10.0 0.0 0.0
12 1.0 0.0 0.0 0.0 1.0 0.0 0.0 0.0 1.0 -10.0 0.0 0.0
12 1.0 0.0 0.0 0.0 1.0 0.0 0.0 0.0 1.0 -10.0 0.0 0.0
12 1.0 0.0 0.0 0.0 1.0 0.0 0.0 0.0 1.0 -10.0 0.0 0.0
12 1.0 0.0 0.0 0.0 1.0 0.0 0.0 0.0 1.0 -10.0 0.0 0.0
12 1.0 0.0 0.0 0.0 1.0 0.0 0.0 0.0 1.0 -10.0 0.0 0.0
12 1.0 0.0 0.0 0.0 1.0 0.0 0.0 0.0 1.0 -10.0 0.0 0.0
12 1.0 0.0 0.0 0.0 1.0 0.0 0.0 0.0 1.0 -10.0 0.0 0.0
12 1.0 0.0 0.0 0.0 1.0 0.0 0.0 0.0 1.0 -10.0 0.0 0.0
12 1.0 0.0 0.0 0.0 1.0 0.0 0.0 0.0 1.0 -10.0 0.0 0.0
12 1.0 0.0 0.0 0.0 1.0 0.0 0.0 0.0 1.0 -10.0 0.0 0.0
12 1.0 0.0 0.0 0.0 1.0 0.0 0.0 0.0 1.0 -10.0 0.0 0.0
12 1.0 0.0 0.0 0.0 1.0 0.0 0.0 0.0 1.0 -10.0 0.0 0.0
12 1.0 0.0 0.0 0.0 1.0 0.0 0.0 0.0 1.0 -10.0 0.0 0.0
12 1.0 0.0 0.0 0.0 1.0 0.0 0.0 0.0 1.0 -10.0 0.0 0.0
12 1.0 0.0 0.0 0.0 1.0 0.0 0.0 0.0 1.0 -10.0 0.0 0.0
12 1.0 0.0 0.0 0.0 1.0 0.0 0.0 0.0 1.0 -10.0 0.0 0.0
12 1.0 0.0 0.0 0.0 1.0 0.0 0.0 0.0 1.0 -10.0 0.0 0.0
12 1.0 0.0 0.0 0.0 1.0 0.0 0.0 0.0 1.0 -10.0 0.0 0.0
12 1.0 0.0 0.0 0.0 1.0 0.0 0.0 0.0 1.0 -10.0 0.0 0.0
12 1.0 0.0 0.0 0.0 1.0 0.0 0.0 0.0 1.0 -10.0 0.0 0.0
12 1.0 0.0 0.0 0.0 1.0 0.0 0.0 0.0 1.0 -10.0 0.0 0.0
12 1.0 0.0 0.0 0.0 1.0 0.0 0.0 0.0 1.0 -10.0 0.0 0.0
12 1.0 0.0 0.0 0.0 1.0 0.0 0.0 0.0 1.0 -10.0 0.0 0.0
12 1.0 0.0 0.0 0.0 1.0 0.0 0.0 0.0 1.0 -10.0 0.0 0.0
12 1.0 0.0 0.0 0.0 1.0 0.0 0.0 0.0 1.0 -10.0 0.0 0.0
12 1.0 0.0 0.0 0.0 1.0 0.0 0.0 0.0 1.0 -10.0 0.0 0.0
12 1.0 0.0 0.0 0.0 1.0 0.0 0.0 0.0 1.0 -10.0 0.0 0.0
12 1.0 0.0 0.0 0.0 1.0 0.0 0.0 0.0 1.0 -10.0 0.0 0.0
12 1.0 0.0 0.0 0.0 1.0 0.0 0.0 0.0 1.0 -10.0 0.0 0.0
12 1.0 0.0 0.0 0.0 1.0 0.0 0.0 0.0 1.0 -10.0 0.0 0.0
12 1.0 0.0 0.0 0.0 1.0 0.0 0.0 0.0 1.0 -10.0 0.0 0.0
12 1.0 0.0 0.0 0.0 1.0 0.0 0.0 0.0 1.0 -10.0 0.0 0.0
12 1.0 0.0 0.0 0.0 1.0 0.0 0.0 0.0 1.0 -10.0 0.0 0.0
12 1.0 0.0 0.0 0.0 1.0 0.0 0.0 0.0 1.0 -10.0 0.0 0.0
12 1.0 0.0 0.0 0.0 1.0 0.0 0.0 0.0 1.0 -10.0 0.0 0.0
12 1.0 0.0 0.0 0.0 1.0 0.0 0.0 0.0 1.0 -10.0 0.0 0.0
12 1.0 0.0 0.0 0.0 1.0 0.0 0.0 0.0 1.0 -10.0 0.0 0.0
12 1.0 0.0 0.0 0.0 1.0 0.0 0.0 0.0 1.0 -10.0 0.0 0.0
12 1.0 0.0 0.0 0.0 1.0 0.0 0.0 0.0 1.0 -10.0 0.0 0.0
12 1.0 0.0 0.0 0.0 1.0 0.0 0.0 0.0 1.0 -10.0 0.0 0.0
12 1.0 0.0 0.0 0.0 1.0 0.0 0.0 0.0 1.0 -10.0 0.0 0.0
12 1.0 0.0 0.0 0.0 1.0 0.0 0.0 0.0 1.0 -10.0 0.0 0.0
12 1.0 0.0 0.0 0.0 1.0 0.0 0.0 0.0 1.0 -10.0 0.0 0.0
12 1.0 0.0 0.0 0.0 1.0 0.0 0.0 0.0 1.0 -10.0 0.0 0.0
12 1.0 0.0 0.0 0.0 1.0 0.0 0.0 0.0 1.0 -10.0 0.0 0.0
12 1.0 0.0 0.0 0.0 1.0 0.0 0.0 0.0 1.0 -10.0 0.0 0.0
12 1.0 0.0 0.0 0.0 1.0 0.0 0.0 0.0 1.0 -10.0 0.0 0.0
12 1.0 0.0 0.0 0.0 1.0 0.0 0.0 0.0 1.0 -10.0 0.0 0.0
12 1.0 0.0 0.0 0.0 1.0 0.0 0.0 0.0 1.0 -10.0 0.0 0.0
12 1.0 0.0 0.0 0.0 1.0 0.0 0.0 0.0 1.0 -10.0 0.0 0.0
12 1.0 0.0 0.0 0.0 1.0 0.0 0.0 0.0 1.0 -10.0 0.0 0.0
12 1.0 0.0 0.0 0.0 1.0 0.0 0.0 0.0 1.0 -10.0 0.0 0.0
12 1.0 0.0 0.0 0.0 1.0 0.0 0.0 0.0 1.0 -10.0 0.0 0.0
12 1.0 0.0 0.0 0.0 1.0 0.0 0.0 0.0 1.0 -10.0 0.0 0.0
12 1.0 0.0 0.0 0.0 1.0 0.0 0.0 0.0 1.0 -10.0 0.0 0.0
12 1.0 0.0 0.0 0.0 1.0 0.0 0.0 0.0 1.0 -10.0 0.0 0.0
12 1.0 0.0 0.0 0.0 1.0 0.0 0.0 0.0 1.0 -10.0 0.0 0.0
12 1.0 0.0 0.0 0.0 1.0 0.0 0.0 0.0 1.0 -10.0 0.0 0.0
12 1.0 0.0 0.0 0.0 1.0 0.0 0.0 0.0 1.0 -10.0 0.0 0.0
12 1.0 0.0 0.0 0.0 1.0 0.0 0.0 0.0 1.0 -10.0 0.0 0.0
12 1.0 0.0 0.0 0.0 1.0 0.0 0.0 0.0 1.0 -10.0 0.0 0.0
12 1.0 0.0 0.0 0.0 1.0 0.0 0.0 0.0 1.0 -10.0 0.0 0.0
12 1.0 0.0 0.0 0.0 1.0 0.0 0.0 0.0 1.0 -10.0 0.0 0.0
12 1.0 0.0 0.0 0.0 1.0 0.0 0.0 0.0 1.0 -10.0 0.0 0.0
12 1.0 0.0 0.0 0.0 1.0 0.0 0.0 0.0 1.0 -10.0 0.0 0.0
12 1.0 0.0 0.0 0.0 1.0 0.0 0.0 0.0 1.0 -10.0 0.0 0.0
12 1.0 0.0 0.0 0.0 1.0 0.0 0.0 0.0 1.0 -10.0 0.0 0.0
12 1.0 0.0 0.0 0.0 1.0 0.0 0.0 0.0 1.0 -10.0 0.0 0.0
12 1.0 0.0 0.0 0.0 1.0 0.0 0.0 0.0 1.0 -10.0 0.0 0.0
12 1.0 0.0 0.0 0.0 1.0 0.0 0.0 0.0 1.0 -10.0 0.0 0.0
12 1.0 0.0 0.0 0.0 1.0 0.0 0.0 0.0 1.0 -10.0 0.0 0.0
12 1.0 0.0 0.0 0.0 1.0 0.0 0.0 0.0 1.0 -10.0 0.0 0.0
12 1.0 0.0 0.0 0.0 1.0 0.0 0.0 0.0 1.0 -10.0 0.0 0.0
12 1.0 0.0 0.0 0.0 1.0 0.0 0.0 0.0 1.0 -10.0 0.0 0.0
12 1.0 0.0 0.0 0.0 1.0 0.0 0.0 0.0 1.0 -10.0 0.0 0.0
12 1.0 0.0 0.0 0.0 1.0 0.0 0.0 0.0 1.0 -10.0 0.0 0.0
12 1.0 0.0 0.0 0.0 1.0 0.0 0.0 0.0 1.0 -10.0 0.0 0.0
12 1.0 0.0 0.0 0.0 1.0 0.0 0.0 0.0 1.0 -10.0 0.0 0.0
12 1.0 0.0 0.0 0.0 1.0 0.0 0.0 0.0 1.0 -10.0 0.0 0.0
12 1.0 0.0 0.0 0.0 1.0 0.0 0.0 0.0 1.0 -10.0 0.0 0.0
12 1.0 0.0 0.0 0.0 1.0 0.0 0.0 0.0 1.0 -10.0 0.0 0.0
12 1.0 0.0 0.0 0.0 1.0 0.0 0.0 0.0 1.0 -10.0 0.0 0.0
12 1.0 0.0 0.0 0.0 1.0 0.0 0.0 0.0 1.0 -10.0 0.0 0.0
12 1.0 0.0 0.0 0.0 1.0 0.0 0.0 0.0 1.0 -10.0 0.0 0.0
12 1.0 0.0 0.0 0.0 1.0 0.0 0.0 0.0 1.0 -10.0 0.0 0.0
12 1.0 0.0 0.0 0.0 1.0 0.0 0.0 0.0 1.0 -10.0 0.0 0.0
12 1.0 0.0 0.0 0.0 1.0 0.0 0.0 0.0 1.0 -10.0 0.0 0.0
12 1.0 0.0 0.0 0.0 1.0 0.0 0.0 0.0 1.0 -10.0 0.0 0.0
12 1.0 0.0 0.0 0.0 1.0 0.0 0.0 0.0 1.0 -10.0 0.0 0.0
12 1.0 0.0 0.0 0.0 1.0 0.0 0.0 0.0 1.0 -10.0 0.0 0.0
12 1.0 0.0 0.0 0.0 1.0 0.0 0.0 0.0 1.0 -10.0 0.0 0.0
12 1.0 0.0 0.0 0.0 1.0 0.0 0.0 0.0 1.0 -10.0 0.0 0.0
12 1.0 0.0 0.0 0.0 1.0 0.0 0.0 0.0 1.0 -10.0 0.0 0.0
12 1.0 0.0 0.0 0.0 1.0 0.0 0.0 0.0 1.0 -10.0 0.0 0.0
12 1.0 0.0 0.0 0.0 1.0 0.0 0.0 0.0 1.0 -10.0 0.0 0.0
12 1.0 0.0 0.0 0.0 1.0 0.0 0.0 0.0 1.0 -10.0 0.0 0.0
12 1.0 0.0 0.0 0.0 1.0 0.0 0.0 0.0 1.0 -10.0 0.0 0.0
12 1.0 0.0 0.0 0.0 1.0 0.0 0.0 0.0 1.0 -10.0 0.0 0.0
12 1.0 0.0 0.0 0.0 1.0 0.0 0.0 0.0 1.0 -10.0 0.0 0.0
12 1.0 0.0 0.0 0.0 1.0 0.0 0.0 0.0 1.0 -10.0 0.0 0.0
12 1.0 0.0 0.0 0.0 1.0 0.0 0.0 0.0 1.0 -10.0 0.0 0.0
12 1.0 0.0 0.0 0.0 1.0 0.0 0.0 0.0 1.0 -10.0 0.0 0.0
12 1.0 0.0 0.0 0.0 1.0 0.0 0.0 0.0 1.0 -10.0 0.0 0.0
12 1.0 0.0 0.0 0.0 1.0 0.0 0.0 0.0 1.0 -10.0 0.0 0.0
12 1.0 0.0 0.0 0.0 1.0 0.0 0.0 0.0 1.0 -10.0 0.0 0.0
12 1.0 0.0 0.0 0.0 1.0 0.0 0.0 0.0 1.0 -10.0 0.0 0.0
12 1.0 0.0 0.0 0.0 1.0 0.0 0.0 0.0 1.0 -10.0 0.0 0.0
12 1.0 0.0 0.0 0.0 1.0 0.0 0.0 0.0 1.0 -10.0 0.0 0.0
12 1.0 0.0 0.0 0.0 1.0 0.0 0.0 0.0 1.0 -10.0 0.0 0.0
12 1.0 0.0 0.0 0.0 1.0 0.0 0.0 0.0 1.0 -10.0 0.0 0.0
12 1.0 0.0 0.0 0.0 1.0 0.0 0.0 0.0 1.0 -10.0 0.0 0.0
12 1.0 0.0 0.0 0.0 1.0 0.0 0.0 0.0 1.0 -10.0 0.0 0.0
12 1.0 0.0 0.0 0.0 1.0 0.0 0.0 0.0 1.0 -10.0 0.0 0.0
12 1.0 0.0 0.0 0.0 1.0 0.0 0.0 0.0 1.0 -10.0 0.0 0.0
12 1.0 0.0 0.0 0.0 1.0 0.0 0.0 0.0 1.0 -10.0 0.0 0.0
12 1.0 0.0 0.0 0.0 1.0 0.0 0.0 0.0 1.0 -10.0 0.0 0.0
12 1.0 0.0 0.0 0.0 1.0 0.0 0.0 0.0 1.0 -10.0 0.0 0.0
12 1.0 0.0 0.0 0.0 1.0 0.0 0.0 0.0 1.0 -10.0 0.0 0.0
12 1.0 0.0 0.0 0.0 1.0 0.0 0.0 0.0 1.0 -10.0 0.0 0.0
12 1.0 0.0 0.0 0.0 1.0 0.0 0.0 0.0 1.0 -10.0 0.0 0.0
12 1.0 0.0 0.0 0.0 1.0 0.0 0.0 0.0 1.0 -10.0 0.0 0.0
12 1.0 0.0 0.0 0.0 1.0 0.0 0.0 0.0 1.0 -10.0 0.0 0.0
12 1.0 0.0 0.0 0.0 1.0 0.0 0.0 0.0 1.0 -10.0 0.0 0.0
12 1.0 0.0 0.0 0.0 1.0 0.0 0.0 0.0 1.0 -10.0 0.0 0.0
12 1.0 0.0 0.0 0.0 1.0 0.0 0.0 0.0 1.0 -10.0 0.0 0.0
12 1.0 0.0 0.0 0.0 1.0 0.0 0.0 0.0 1.0 -10.0 0.0 0.0
12 1.0 0.0 0.0 0.0 1.0 0.0 0.0 0.0 1.0 -10.0 0.0 0.0
12 1.0 0.0 0.0 0.0 1.0 0.0 0.0 0.0 1.0 -10.0 0.0 0.0
12 1.0 0.0 0.0 0.0 1.0 0.0 0.0 0.0 1.0 -10.0 0.0 0.0
12 1.0 0.0 0.0 0.0 1.0 0.0 0.0 0.0 1.0 -10.0 0.0 0.0
12 1.0 0.0 0.0 0.0 1.0 0.0 0.0 0.0 1.0 -10.0 0.0 0.0
12 1.0 0.0 0.0 0.0 1.0 0.0 0.0 0.0 1.0 -10.0 0.0 0.0
12 1.0 0.0 0.0 0.0 1.0 0.0 0.0 0.0 1.0 -10.0 0.0 0.0
12 1.0 0.0 0.0 0.0 1.0 0.0 0.0 0.0 1.0 -10.0 0.0 0.0
12 1.0 0.0 0.0 0.0 1.0 0.0 0.0 0.0 1.0 -10.0 0.0 0.0
12 1.0 0.0 0.0 0.0 1.0 0.0 0.0 0.0 1.0 -10.0 0.0 0.0
12 1.0 0.0 0.0 0.0 1.0 0.0 0.0 0.0 1.0 -10.0 0.0 0.0
12 1.0 0.0 0.0 0.0 1.0 0.0 0.0 0.0 1.0 -10.0 0.0 0.0
12 1.0 0.0 0.0 0.0 1.0 0.0 0.0 0.0 1.0 -10.0 0.0 0.0
12 1.0 0.0 0.0 0.0 1.0 0.0 0.0 0.0 1.0 -10.0 0.0 0.0
12 1.0 0.0 0.0 0.0 1.0 0.0 0.0 0.0 1.0 -10.0 0.0 0.0
12 1.0 0.0 0.0 0.0 1.0 0.0 0.0 0.0 1.0 -10.0 0.0 0.0
12 1.0 0.0 0.0 0.0 1.0 0.0 0.0 0.0 1.0 -10.0 0.0 0.0
12 1.0 0.0 0.0 0.0 1.0 0.0 0.0 0.0 1.0 -10.0 0.0 0.0
12 1.0 0.0 0.0 0.0 1.0 0.0 0.0 0.0 1.0 -10.0 0.0 0.0
12 1.0 0.0 0.0 0.0 1.0 0.0 0.0 0.0 1.0 -10.0 0.0 0.0
12 1.0 0.0 0.0 0.0 1.0 0.0 0.0 0.0 1.0 -10.0 0.0 0.0
12 1.0 0.0 0.0 0.0 1.0 0.0 0.0 0.0 1.0 -10.0 0.0 0.0
12 1.0 0.0 0.0 0.0 1.0 0.0 0.0 0.0 1.0 -10.0 0.0 0.0
12 1.0 0.0 0.0 0.0 1.0 0.0 0.0 0.0 1.0 -10.0 0.0 0.0
12 1.0 0.0 0.0 0.0 1.0 0.0 0.0 0.0 1.0 -10.0 0.0 0.0
12 1.0 0.0 0.0 0.0 1.0 0.0 0.0 0.0 1.0 -10.0 0.0 0.0
12 1.0 0.0 0.0 0.0 1.0 0.0 0.0 0.0 1.0 -10.0 0.0 0.0
12 1.0 0.0 0.0 0.0 1.0 0.0 0.0 0.0 1.0 -10.0 0.0 0.0
12 1.0 0.0 0.0 0.0 1.0 0.0 0.0 0.0 1.0 -10.0 0.0 0.0
12 1.0 0.0 0.0 0.0 1.0 0.0 0.0 0.0 1.0 -10.0 0.0 0.0
12 1.0 0.0 0.0 0.0 1.0 0.0 0.0 0.0 1.0 -10.0 0.0 0.0
12 1.0 0.0 0.0 0.0 1.0 0.0 0.0 0.0 1.0 -10.0 0.0 0.0
12 1.0 0.0 0.0 0.0 1.0 0.0 0.0 0.0 1.0 -10.0 0.0 0.0
12 1.0 0.0 0.0 0.0 1.0 0.0 0.0 0.0 1.0 -10.0 0.0 0.0
12 1.0 0.0 0.0 0.0 1.0 0.0 0.0 0.0 1.0 -10.0 0.0 0.0
12 1.0 0.0 0.0 0.0 1.0 0.0 0.0 0.0 1.0 -10.0 0.0 0.0
12 1.0 0.0 0.0 0.0 1.0 0.0 0.0 0.0 1.0 -10.0 0.0 0.0
12 1.0 0.0 0.0 0.0 1.0 0.0 0.0 0.0 1.0 -10.0 0.0 0.0
12 1.0 0.0 0.0 0.0 1.0 0.0 0.0 0.0 1.0 -10.0 0.0 0.0
12 1.0 0.0 0.0 0.0 1.0 0.0 0.0 0.0 1.0 -10.0 0.0 0.0
12 1.0 0.0 0.0 0.0 1.0 0.0 0.0 0.0 1.0 -10.0 0.0 0.0
12 1.0 0.0 0.0 0.0 1.0 0.0 0.0 0.0 1.0 -10.0 0.0 0.0
12 1.0 0.0 0.0 0.0 1.0 0.0 0.0 0.0 1.0 -10.0 0.0 0.0
12 1.0 0.0 0.0 0.0 1.0 0.0 0.0 0.0 1.0 -10.0 0.0 0.0
12 1.0 0.0 0.0 0.0 1.0 0.0 0.0 0.0 1.0 -10.0 0.0 0.0
12 1.0 0.0 0.0 0.0 1.0 0.0 0.0 0.0 1.0 -10.0 0.0 0.0
12 1.0 0.0 0.0 0.0 1.0 0.0 0.0 0.0 1.0 -10.0 0.0 0.0
12 1.0 0.0 0.0 0.0 1.0 0.0 0.0 0.0 1.0 -10.0 0.0 0.0
12 1.0 0.0 0.0 0.0 1.0 0.0 0.0 0.0 1.0 -10.0 0.0 0.0
12 1.0 0.0 0.0 0.0 1.0 0.0 0.0 0.0 1.0 -10.0 0.0 0.0
12 1.0 0.0 0.0 0.0 1.0 0.0 0.0 0.0 1.0 -10.0 0.0 0.0
12 1.0 0.0 0.0 0.0 1.0 0.0 0.0 0.0 1.0 -10.0 0.0 0.0
12 1.0 0.0 0.0 0.0 1.0 0.0 0.0 0.0 1.0 -10.0 0.0 0.0
12 1.0 0.0 0.0 0.0 1.0 0.0 0.0 0.0 1.0 -10.0 0.0 0.0
12 1.0 0.0 0.0 0.0 1.0 0.0 0.0 0.0 1.0 -10.0 0.0 0.0
12 1.0 0.0 0.0 0.0 1.0 0.0 0.0 0.0 1.0 -10.0 0.0 0.0
12 1.0 0.0 0.0 0.0 1.0 0.0 0.0 0.0 1.0 -10.0 0.0 0.0
12 1.0 0.0 0.0 0.0 1.0 0.0 0.0 0.0 1.0 -10.0 0.0 0.0
12 1.0 0.0 0.0 0.0 1.0 0.0 0.0 0.0 1.0 -10.0 0.0 0.0
12 1.0 0.0 0.0 0.0 1.0 0.0 0.0 0.0 1.0 -10.0 0.0 0.0
12 1.0 0.0 0.0 0.0 1.0 0.0 0.0 0.0 1.0 -10.0 0.0 0.0
12 1.0 0.0 0.0 0.0 1.0 0.0 0.0 0.0 1.0 -10.0 0.0 0.0
12 1.0 0.0 0.0 0.0 1.0 0.0 0.0 0.0 1.0 -10.0 0.0 0.0
12 1.0 0.0 0.0 0.0 1.0 0.0 0.0 0.0 1.0 -10.0 0.0 0.0
12 1.0 0.0 0.0 0.0 1.0 0.0 0.0 0.0 1.0 -10.0 0.0 0.0
12 1.0 0.0 0.0 0.0 1.0 0.0 0.0 0.0 1.0 -10.0 0.0 0.0
12 1.0 0.0 0.0 0.0 1.0 0.0 0.0 0.0 1.0 -10.0 0.0 0.0
12 1.0 0.0 0.0 0.0 1.0 0.0 0.0 0.0 1.0 -10.0 0.0 0.0
12 1.0 0.0 0.0 0.0 1.0 0.0 0.0 0.0 1.0 -10.0 0.0 0.0
12 1.0 0.0 0.0 0.0 1.0 0.0 0.0 0.0 1.0 -10.0 0.0 0.0
12 1.0 0.0 0.0 0.0 1.0 0.0 0.0 0.0 1.0 -10.0 0.0 0.0
12 1.0 0.0 0.0 0.0 1.0 0.0 0.0 0.0 1.0 -10.0 0.0 0.0
12 1.0 0.0 0.0 0.0 1.0 0.0 0.0 0.0 1.0 -10.0 0.0 0.0
12 1.0 0.0 0.0 0.0 1.0 0.0 0.0 0.0 1.0 -10.0 0.0 0.0
12 1.0 0.0 0.0 0.0 1.0 0.0 0.0 0.0 1.0 -10.0 0.0 0.0
12 1.0 0.0 0.0 0.0 1.0 0.0 0.0 0.0 1.0 -10.0 0.0 0.0
12 1.0 0.0 0.0 0.0 1.0 0.0 0.0 0.0 1.0 -10.0 0.0 0.0
12 1.0 0.0 0.0 0.0 1.0 0.0 0.0 0.0 1.0 -10.0 0.0 0.0
12 1.0 0.0 0.0 0.0 1.0 0.0 0.0 0.0 1.0 -10.0 0.0 0.0
12 1.0 0.0 0.0 0.0 1.0 0.0 0.0 0.0 1.0 -10.0 0.0 0.0
12 1.0 0.0 0.0 0.0 1.0 0.0 0.0 0.0 1.0 -10.0 0.0 0.0
12 1.0 0.0 0.0 0.0 1.0 0.0 0.0 0.0 1.0 -10.0 0.0 0.0
12 1.0 0.0 0.0 0.0 1.0 0.0 0.0 0.0 1.0 -10.0 0.0 0.0
12 1.0 0.0 0.0 0.0 1.0 0.0 0.0 0.0 1.0 -10.0 0.0 0.0
12 1.0 0.0 0.0 0.0 1.0 0.0 0.0 0.0 1.0 -10.0 0.0 0.0
12 1.0 0.0 0.0 0.0 1.0 0.0 0.0 0.0 1.0 -10.0 0.0 0.0
12 1.0 0.0 0.0 0.0 1.0 0.0 0.0 0.0 1.0 -10.0 0.0 0.0
12 1.0 0.0 0.0 0.0 1.0 0.0 0.0 0.0 1.0 -10.0 0.0 0.0
12 1.0 0.0 0.0 0.0 1.0 0.0 0.0 0.0 1.0 -10.0 0.0 0.0
12 1.0 0.0 0.0 0.0 1.0 0.0 0.0 0.0 1.0 -10.0 0.0 0.0
12 1.0 0.0 0.0 0.0 1.0 0.0 0.0 0.0 1.0 -10.0 0.0 0.0
12 1.0 0.0 0.0 0.0 1.0 0.0 0.0 0.0 1.0 -10.0 0.0 0.0
12 1.0 0.0 0.0 0.0 1.0 0.0 0.0 0.0 1.0 -10.0 0.0 0.0
12 1.0 0.0 0.0 0.0 1.0 0.0 0.0 0.0 1.0 -10.0 0.0 0.0
12 1.0 0.0 0.0 0.0 1.0 0.0 0.0 0.0 1.0 -10.0 0.0 0.0
12 1.0 0.0 0.0 0.0 1.0 0.0 0.0 0.0 1.0 -10.0 0.0 0.0
12 1.0 0.0 0.0 0.0 1.0 0.0 0.0 0.0 1.0 -10.0 0.0 0.0
12 1.0 0.0 0.0 0.0 1.0 0.0 0.0 0.0 1.0 -10.0 0.0 0.0
12 1.0 0.0 0.0 0.0 1.0 0.0 0.0 0.0 1.0 -10.0 0.0 0.0
12 1.0 0.0 0.0 0.0 1.0 0.0 0.0 0.0 1.0 -10.0 0.0 0.0
12 1.0 0.0 0.0 0.0 1.0 0.0 0.0 0.0 1.0 -10.0 0.0 0.0
12 1.0 0.0 0.0 0.0 1.0 0.0 0.0 0.0 1.0 -10.0 0.0 0.0
12 1.0 0.0 0.0 0.0 1.0 0.0 0.0 0.0 1.0 -10.0 0.0 0.0
12 1.0 0.0 0.0 0.0 1.0 0.0 0.0 0.0 1.0 -10.0 0.0 0.0
12 1.0 0.0 0.0 0.0 1.0 0.0 0.0 0.0 1.0 -10.0 0.0 0.0
12 1.0 0.0 0.0 0.0 1.0 0.0 0.0 0.0 1.0 -10.0 0.0 0.0
12 1.0 0.0 0.0 0.0 1.0 0.0 0.0 0.0 1.0 -10.0 0.0 0.0
12 1.0 0.0 0.0 0.0 1.0 0.0 0.0 0.0 1.0 -10.0 0.0 0.0
12 1.0 0.0 0.0 0.0 1.0 0.0 0.0 0.0 1.0 -10.0 0.0 0.0
12 1.0 0.0 0.0 0.0 1.0 0.0 0.0 0.0 1.0 -10.0 0.0 0.0
12 1.0 0.0 0.0 0.0 1.0 0.0 0.0 0.0 1.0 -10.0 0.0 0.0
12 1.0 0.0 0.0 0.0 1.0 0.0 0.0 0.0 1.0 -10.0 0.0 0.0
12 1.0 0.0 0.0 0.0 1.0 0.0 0.0 0.0 1.0 -10.0 0.0 0.0
12 1.0 0.0 0.0 0.0 1.0 0.0 0.0 0.0 1.0 -10.0 0.0 0.0
12 1.0 0.0 0.0 0.0 1.0 0.0 0.0 0.0 1.0 -10.0 0.0 0.0
12 1.0 0.0 0.0 0.0 1.0 0.0 0.0 0.0 1.0 -10.0 0.0 0.0
12 1.0 0.0 0.0 0.0 1.0 0.0 0.0 0.0 1.0 -10.0 0.0 0.0
12 1.0 0.0 0.0 0.0 1.0 0.0 0.0 0.0 1.0 -10.0 0.0 0.0
12 1.0 0.0 0.0 0.0 1.0 0.0 0.0 0.0 1.0 -10.0 0.0 0.0
12 1.0 0.0 0.0 0.0 1.0 0.0 0.0 0.0 1.0 -10.0 0.0 0.0
12 1.0 0.0 0.0 0.0 1.0 0.0 0.0 0.0 1.0 -10.0 0.0 0.0
12 1.0 0.0 0.0 0.0 1.0 0.0 0.0 0.0 1.0 -10.0 0.0 0.0
12 1.0 0.0 0.0 0.0 1.0 0.0 0.0 0.0 1.0 -10.0 0.0 0.0
12 1.0 0.0 0.0 0.0 1.0 0.0 0.0 0.0 1.0 -10.0 0.0 0.0
12 1.0 0.0 0.0 0.0 1.0 0.0 0.0 0.0 1.0 -10.0 0.0 0.0
12 1.0 0.0 0.0 0.0 1.0 0.0 0.0 0.0 1.0 -10.0 0.0 0.0
12 1.0 0.0 0.0 0.0 1.0 0.0 0.0 0.0 1.0 -10.0 0.0 0.0
12 1.0 0.0 0.0 0.0 1.0 0.0 0.0 0.0 1.0 -10.0 0.0 0.0
12 1.0 0.0 0.0 0.0 1.0 0.0 0.0 0.0 1.0 -10.0 0.0 0.0
12 1.0 0.0 0.0 0.0 1.0 0.0 0.0 0.0 1.0 -10.0 0.0 0.0
12 1.0 0.0 0.0 0.0 1.0 0.0 0.0 0.0 1.0 -10.0 0.0 0.0
12 1.0 0.0 0.0 0.0 1.0 0.0 0.0 0.0 1.0 -10.0 0.0 0.0
12 1.0 0.0 0.0 0.0 1.0 0.0 0.0 0.0 1.0 -10.0 0.0 0.0
12 1.0 0.0 0.0 0.0 1.0 0.0 0.0 0.0 1.0 -10.0 0.0 0.0
12 1.0 0.0 0.0 0.0 1.0 0.0 0.0 0.0 1.0 -10.0 0.0 0.0
12 1.0 0.0 0.0 0.0 1.0 0.0 0.0 0.0 1.0 -10.0 0.0 0.0
12 1.0 0.0 0.0 0.0 1.0 0.0 0.0 0.0 1.0 -10.0 0.0 0.0
12 1.0 0.0 0.0 0.0 1.0 0.0 0.0 0.0 1.0 -10.0 0.0 0.0
12 1.0 0.0 0.0 0.0 1.0 0.0 0.0 0.0 1.0 -10.0 0.0 0.0
12 1.0 0.0 0.0 0.0 1.0 0.0 0.0 0.0 1.0 -10.0 0.0 0.0
12 1.0 0.0 0.0 0.0 1.0 0.0 0.0 0.0 1.0 -10.0 0.0 0.0
12 1.0 0.0 0.0 0.0 1.0 0.0 0.0 0.0 1.0 -10.0 0.0 0.0
12 1.0 0.0 0.0 0.0 1.0 0.0 0.0 0.0 1.0 -10.0 0.0 0.0
12 1.0 0.0 0.0 0.0 1.0 0.0 0.0 0.0 1.0 -10.0 0.0 0.0
12 1.0 0.0 0.0 0.0 1.0 0.0 0.0 0.0 1.0 -10.0 0.0 0.0
12 1.0 0.0 0.0 0.0 1.0 0.0 0.0 0.0 1.0 -10.0 0.0 0.0
12 1.0 0.0 0.0 0.0 1.0 0.0 0.0 0.0 1.0 -10.0 0.0 0.0
12 1.0 0.0 0.0 0.0 1.0 0.0 0.0 0.0 1.0 -10.0 0.0 0.0
12 1.0 0.0 0.0 0.0 1.0 0.0 0.0 0.0 1.0 -10.0 0.0 0.0
12 1.0 0.0 0.0 0.0 1.0 0.0 0.0 0.0 1.0 -10.0 0.0 0.0
12 1.0 0.0 0.0 0.0 1.0 0.0 0.0 0.0 1.0 -10.0 0.0 0.0
12 1.0 0.0 0.0 0.0 1.0 0.0 0.0 0.0 1.0 -10.0 0.0 0.0
12 1.0 0.0 0.0 0.0 1.0 0.0 0.0 0.0 1.0 -10.0 0.0 0.0
12 1.0 0.0 0.0 0.0 1.0 0.0 0.0 0.0 1.0 -10.0 0.0 0.0
12 1.0 0.0 0.0 0.0 1.0 0.0 0.0 0.0 1.0 -10.0 0.0 0.0
12 1.0 0.0 0.0 0.0 1.0 0.0 0.0 0.0 1.0 -10.0 0.0 0.0
12 1.0 0.0 0.0 0.0 1.0 0.0 0.0 0.0 1.0 -10.0 0.0 0.0
12 1.0 0.0 0.0 0.0 1.0 0.0 0.0 0.0 1.0 -10.0 0.0 0.0
12 1.0 0.0 0.0 0.0 1.0 0.0 0.0 0.0 1.0 -10.0 0.0 0.0
12 1.0 0.0 0.0 0.0 1.0 0.0 0.0 0.0 1.0 -10.0 0.0 0.0
12 1.0 0.0 0.0 0.0 1.0 0.0 0.0 0.0 1.0 -10.0 0.0 0.0
12 1.0 0.0 0.0 0.0 1.0 0.0 0.0 0.0 1.0 -10.0 0.0 0.0
12 1.0 0.0 0.0 0.0 1.0 0.0 0.0 0.0 1.0 -10.0 0.0 0.0
12 1.0 0.0 0.0 0.0 1.0 0.0 0.0 0.0 1.0 -10.0 0.0 0.0
12 1.0 0.0 0.0 0.0 1.0 0.0 0.0 0.0 1.0 -10.0 0.0 0.0
12 1.0 0.0 0.0 0.0 1.0 0.0 0.0 0.0 1.0 -10.0 0.0 0.0
12 1.0 0.0 0.0 0.0 1.0 0.0 0.0 0.0 1.0 -10.0 0.0 0.0
12 1.0 0.0 0.0 0.0 1.0 0.0 0.0 0.0 1.0 -10.0 0.0 0.0
12 1.0 0.0 0.0 0.0 1.0 0.0 0.0 0.0 1.0 -10.0 0.0 0.0
12 1.0 0.0 0.0 0.0 1.0 0.0 0.0 0.0 1.0 -10.0 0.0 0.0
12 1.0 0.0 0.0 0.0 1.0 0.0 0.0 0.0 1.0 -10.0 0.0 0.0
12 1.0 0.0 0.0 0.0 1.0 0.0 0.0 0.0 1.0 -10.0 0.0 0.0
12 1.0 0.0 0.0 0.0 1.0 0.0 0.0 0.0 1.0 -10.0 0.0 0.0
12 1.0 0.0 0.0 0.0 1.0 0.0 0.0 0.0 1.0 -10.0 0.0 0.0
12 1.0 0.0 0.0 0.0 1.0 0.0 0.0 0.0 1.0 -10.0 0.0 0.0
12 1.0 0.0 0.0 0.0 1.0 0.0 0.0 0.0 1.0 -10.0 0.0 0.0
12 1.0 0.0 0.0 0.0 1.0 0.0 0.0 0.0 1.0 -10.0 0.0 0.0
12 1.0 0.0 0.0 0.0 1.0 0.0 0.0 0.0 1.0 -10.0 0.0 0.0
12 1.0 0.0 0.0 0.0 1.0 0.0 0.0 0.0 1.0 -10.0 0.0 0.0
12 1.0 0.0 0.0 0.0 1.0 0.0 0.0 0.0 1.0 -10.0 0.0 0.0
12 1.0 0.0 0.0 0.0 1.0 0.0 0.0 0.0 1.0 -10.0 0.0 0.0
12 1.0 0.0 0.0 0.0 1.0 0.0 0.0 0.0 1.0 -10.0 0.0 0.0
12 1.0 0.0 0.0 0.0 1.0 0.0 0.0 0.0 1.0 -10.0 0.0 0.0
12 1.0 0.0 0.0 0.0 1.0 0.0 0.0 0.0 1.0 -10.0 0.0 0.0
12 1.0 0.0 0.0 0.0 1.0 0.0 0.0 0.0 1.0 -10.0 0.0 0.0
12 1.0 0.0 0.0 0.0 1.0 0.0 0.0 0.0 1.0 -10.0 0.0 0.0
12 1.0 0.0 0.0 0.0 1.0 0.0 0.0 0.0 1.0 -10.0 0.0 0.0
12 1.0 0.0 0.0 0.0 1.0 0.0 0.0 0.0 1.0 -10.0 0.0 0.0
12 1.0 0.0 0.0 0.0 1.0 0.0 0.0 0.0 1.0 -10.0 0.0 0.0
12 1.0 0.0 0.0 0.0 1.0 0.0 0.0 0.0 1.0 -10.0 0.0 0.0
12 1.0 0.0 0.0 0.0 1.0 0.0 0.0 0.0 1.0 -10.0 0.0 0.0
12 1.0 0.0 0.0 0.0 1.0 0.0 0.0 0.0 1.0 -10.0 0.0 0.0
12 1.0 0.0 0.0 0.0 1.0 0.0 0.0 0.0 1.0 -10.0 0.0 0.0
12 1.0 0.0 0.0 0.0 1.0 0.0 0.0 0.0 1.0 -10.0 0.0 0.0
12 1.0 0.0 0.0 0.0 1.0 0.0 0.0 0.0 1.0 -10.0 0.0 0.0
12 1.0 0.0 0.0 0.0 1.0 0.0 0.0 0.0 1.0 -10.0 0.0 0.0
12 1.0 0.0 0.0 0.0 1.0 0.0 0.0 0.0 1.0 -10.0 0.0 0.0
12 1.0 0.0 0.0 0.0 1.0 0.0 0.0 0.0 1.0 -10.0 0.0 0.0
12 1.0 0.0 0.0 0.0 1.0 0.0 0.0 0.0 1.0 -10.0 0.0 0.0
12 1.0 0.0 0.0 0.0 1.0 0.0 0.0 0.0 1.0 -10.0 0.0 0.0
12 1.0 0.0 0.0 0.0 1.0 0.0 0.0 0.0 1.0 -10.0 0.0 0.0
12 1.0 0.0 0.0 0.0 1.0 0.0 0.0 0.0 1.0 -10.0 0.0 0.0
12 1.0 0.0 0.0 0.0 1.0 0.0 0.0 0.0 1.0 -10.0 0.0 0.0
12 1.0 0.0 0.0 0.0 1.0 0.0 0.0 0.0 1.0 -10.0 0.0 0.0
12 1.0 0.0 0.0 0.0 1.0 0.0 0.0 0.0 1.0 -10.0 0.0 0.0
12 1.0 0.0 0.0 0.0 1.0 0.0 0.0 0.0 1.0 -10.0 0.0 0.0
12 1.0 0.0 0.0 0.0 1.0 0.0 0.0 0.0 1.0 -10.0 0.0 0.0
12 1.0 0.0 0.0 0.0 1.0 0.0 0.0 0.0 1.0 -10.0 0.0 0.0
12 1.0 0.0 0.0 0.0 1.0 0.0 0.0 0.0 1.0 -10.0 0.0 0.0
12 1.0 0.0 0.0 0.0 1.0 0.0 0.0 0.0 1.0 -10.0 0.0 0.0
12 1.0 0.0 0.0 0.0 1.0 0.0 0.0 0.0 1.0 -10.0 0.0 0.0
12 1.0 0.0 0.0 0.0 1.0 0.0 0.0 0.0 1.0 -10.0 0.0 0.0
12 1.0 0.0 0.0 0.0 1.0 0.0 0.0 0.0 1.0 -10.0 0.0 0.0
12 1.0 0.0 0.0 0.0 1.0 0.0 0.0 0.0 1.0 -10.0 0.0 0.0
12 1.0 0.0 0.0 0.0 1.0 0.0 0.0 0.0 1.0 -10.0 0.0 0.0
12 1.0 0.0 0.0 0.0 1.0 0.0 0.0 0.0 1.0 -10.0 0.0 0.0
12 1.0 0.0 0.0 0.0 1.0 0.0 0.0 0.0 1.0 -10.0 0.0 0.0
12 1.0 0.0 0.0 0.0 1.0 0.0 0.0 0.0 1.0 -10.0 0.0 0.0
12 1.0 0.0 0.0 0.0 1.0 0.0 0.0 0.0 1.0 -10.0 0.0 0.0
12 1.0 0.0 0.0 0.0 1.0 0.0 0.0 0.0 1.0 -10.0 0.0 0.0
12 1.0 0.0 0.0 0.0 1.0 0.0 0.0 0.0 1.0 -10.0 0.0 0.0
12 1.0 0.0 0.0 0.0 1.0 0.0 0.0 0.0 1.0 -10.0 0.0 0.0
