POINTS:
0.0000 0.0000 0.0000
0.0000 0.0000 1.0000
0.0000 1.0000 0.0000
0.0000 1.0000 1.0000
1.0000 0.0000 0.0000
1.0000 0.0000 1.0000
1.0000 1.0000 0.0000
1.0000 1.0000 1.0000
2.0000 0.0000 0.0000
2.0000 0.0000 1.0000
2.0000 1.0000 0.0000
2.0000 1.0000 1.0000
3.0000 0.0000 0.0000
3.0000 0.0000 1.0000
3.0000 1.0000 0.0000
3.0000 1.0000 1.0000
4.0000 0.0000 0.0000
4.0000 0.0000 1.0000
4.0000 1.0000 0.0000
4.0000 1.0000 1.0000
5.0000 0.0000 0.0000
5.0000 0.0000 1.0000
5.0000 1.0000 0.0000
5.0000 1.0000 1.0000
6.0000 0.0000 0.0000
6.0000 0.0000 1.0000
6.0000 1.0000 0.0000
6.0000 1.0000 1.0000
7.0000 0.0000 0.0000
7.0000 0.0000 1.0000
7.0000 1.0000 0.0000
7.0000 1.0000 1.0000
8.0000 0.0000 0.0000
8.0000 0.0000 1.0000
8.0000 1.0000 0.0000
8.0000 1.0000 1.0000
9.0000 0.0000 0.0000
9.0000 0.0000 1.0000
9.0000 1.0000 0.0000
9.0000 1.0000 1.0000
10.0000 0.0000 0.0000
10.0000 0.0000 1.0000
10.0000 1.0000 0.0000
10.0000 1.0000 1.0000
CELLS:
4 0000  0 2 3 7
4 0000  0 2 6 7
4 0000  0 4 6 7
4 0000  0 4 5 7
4 0000  0 1 5 7
4 0000  0 1 3 7
4 0000  4 6 7 11
4 0000  4 6 10 11
4 0000  4 8 10 11
4 0000  4 8 9 11
4 0000  4 5 9 11
4 0000  4 5 7 11
4 0000  8 10 11 15
4 0000  8 10 14 15
4 0000  8 12 14 15
4 0000  8 12 13 15
4 0000  8 9 13 15
4 0000  8 9 11 15
4 0000  12 14 15 19
4 0000  12 14 18 19
4 0000  12 16 18 19
4 0000  12 16 17 19
4 0000  12 13 17 19
4 0000  12 13 15 19
4 0000  16 18 19 23
4 0000  16 18 22 23
4 0000  16 20 22 23
4 0000  16 20 21 23
4 0000  16 17 21 23
4 0000  16 17 19 23
4 0000  20 22 23 27
4 0000  20 22 26 27
4 0000  20 24 26 27
4 0000  20 24 25 27
4 0000  20 21 25 27
4 0000  20 21 23 27
4 0000  24 26 27 31
4 0000  24 26 30 31
4 0000  24 28 30 31
4 0000  24 28 29 31
4 0000  24 25 29 31
4 0000  24 25 27 31
4 0000  28 30 31 35
4 0000  28 30 34 35
4 0000  28 32 34 35
4 0000  28 32 33 35
4 0000  28 29 33 35
4 0000  28 29 31 35
4 0000  32 34 35 39
4 0000  32 34 38 39
4 0000  32 36 38 39
4 0000  32 36 37 39
4 0000  32 33 37 39
4 0000  32 33 35 39
4 0000  36 38 39 43
4 0000  36 38 42 43
4 0000  36 40 42 43
4 0000  36 40 41 43
4 0000  36 37 41 43
4 0000  36 37 39 43
FACES:
3 1 0 2 3
3 1 0 3 1
3 2 40 42 43
3 2 40 43 41
3 2 7 5 1
3 2 7 1 3
3 2 6 2 0
3 2 6 0 4
3 2 11 9 5
3 2 11 5 7
3 2 10 6 4
3 2 10 4 8
3 2 15 13 9
3 2 15 9 11
3 2 14 10 8
3 2 14 8 12
3 2 19 17 13
3 2 19 13 15
3 2 18 14 12
3 2 18 12 16
3 2 23 21 17
3 2 23 17 19
3 2 22 18 16
3 2 22 16 20
3 2 27 25 21
3 2 27 21 23
3 2 26 22 20
3 2 26 20 24
3 2 31 29 25
3 2 31 25 27
3 2 30 26 24
3 2 30 24 28
3 2 35 33 29
3 2 35 29 31
3 2 34 30 28
3 2 34 28 32
3 2 39 37 33
3 2 39 33 35
3 2 38 34 32
3 2 38 32 36
3 2 43 41 37
3 2 43 37 39
3 2 42 38 36
3 2 42 36 40
3 2 0 4 5
3 2 0 5 1
3 2 2 6 7
3 2 2 7 3
3 2 4 8 9
3 2 4 9 5
3 2 6 10 11
3 2 6 11 7
3 2 8 12 13
3 2 8 13 9
3 2 10 14 15
3 2 10 15 11
3 2 12 16 17
3 2 12 17 13
3 2 14 18 19
3 2 14 19 15
3 2 16 20 21
3 2 16 21 17
3 2 18 22 23
3 2 18 23 19
3 2 20 24 25
3 2 20 25 21
3 2 22 26 27
3 2 22 27 23
3 2 24 28 29
3 2 24 29 25
3 2 26 30 31
3 2 26 31 27
3 2 28 32 33
3 2 28 33 29
3 2 30 34 35
3 2 30 35 31
3 2 32 36 37
3 2 32 37 33
3 2 34 38 39
3 2 34 39 35
3 2 36 40 41
3 2 36 41 37
3 2 38 42 43
3 2 38 43 39
VDATA:
12 1.0 0.0 0.0 0.0 1.0 0.0 0.0 0.0 1.0 -10.0 0.0 0.0
12 1.0 0.0 0.0 0.0 1.0 0.0 0.0 0.0 1.0 -10.0 0.0 0.0
12 1.0 0.0 0.0 0.0 1.0 0.0 0.0 0.0 1.0 -10.0 0.0 0.0
12 1.0 0.0 0.0 0.0 1.0 0.0 0.0 0.0 1.0 -10.0 0.0 0.0
12 1.0 0.0 0.0 0.0 1.0 0.0 0.0 0.0 1.0 -10.0 0.0 0.0
12 1.0 0.0 0.0 0.0 1.0 0.0 0.0 0.0 1.0 -10.0 0.0 0.0
12 1.0 0.0 0.0 0.0 1.0 0.0 0.0 0.0 1.0 -10.0 0.0 0.0
12 1.0 0.0 0.0 0.0 1.0 0.0 0.0 0.0 1.0 -10.0 0.0 0.0
12 1.0 0.0 0.0 0.0 1.0 0.0 0.0 0.0 1.0 -10.0 0.0 0.0
12 1.0 0.0 0.0 0.0 1.0 0.0 0.0 0.0 1.0 -10.0 0.0 0.0
12 1.0 0.0 0.0 0.0 1.0 0.0 0.0 0.0 1.0 -10.0 0.0 0.0
12 1.0 0.0 0.0 0.0 1.0 0.0 0.0 0.0 1.0 -10.0 0.0 0.0
12 1.0 0.0 0.0 0.0 1.0 0.0 0.0 0.0 1.0 -10.0 0.0 0.0
12 1.0 0.0 0.0 0.0 1.0 0.0 0.0 0.0 1.0 -10.0 0.0 0.0
12 1.0 0.0 0.0 0.0 1.0 0.0 0.0 0.0 1.0 -10.0 0.0 0.0
12 1.0 0.0 0.0 0.0 1.0 0.0 0.0 0.0 1.0 -10.0 0.0 0.0
12 1.0 0.0 0.0 0.0 1.0 0.0 0.0 0.0 1.0 -10.0 0.0 0.0
12 1.0 0.0 0.0 0.0 1.0 0.0 0.0 0.0 1.0 -10.0 0.0 0.0
12 1.0 0.0 0.0 0.0 1.0 0.0 0.0 0.0 1.0 -10.0 0.0 0.0
12 1.0 0.0 0.0 0.0 1.0 0.0 0.0 0.0 1.0 -10.0 0.0 0.0
12 1.0 0.0 0.0 0.0 1.0 0.0 0.0 0.0 1.0 -10.0 0.0 0.0
12 1.0 0.0 0.0 0.0 1.0 0.0 0.0 0.0 1.0 -10.0 0.0 0.0
12 1.0 0.0 0.0 0.0 1.0 0.0 0.0 0.0 1.0 -10.0 0.0 0.0
12 1.0 0.0 0.0 0.0 1.0 0.0 0.0 0.0 1.0 -10.0 0.0 0.0
12 1.0 0.0 0.0 0.0 1.0 0.0 0.0 0.0 1.0 -10.0 0.0 0.0
12 1.0 0.0 0.0 0.0 1.0 0.0 0.0 0.0 1.0 -10.0 0.0 0.0
12 1.0 0.0 0.0 0.0 1.0 0.0 0.0 0.0 1.0 -10.0 0.0 0.0
12 1.0 0.0 0.0 0.0 1.0 0.0 0.0 0.0 1.0 -10.0 0.0 0.0
12 1.0 0.0 0.0 0.0 1.0 0.0 0.0 0.0 1.0 -10.0 0.0 0.0
12 1.0 0.0 0.0 0.0 1.0 0.0 0.0 0.0 1.0 -10.0 0.0 0.0
12 1.0 0.0 0.0 0.0 1.0 0.0 0.0 0.0 1.0 -10.0 0.0 0.0
12 1.0 0.0 0.0 0.0 1.0 0.0 0.0 0.0 1.0 -10.0 0.0 0.0
12 1.0 0.0 0.0 0.0 1.0 0.0 0.0 0.0 1.0 -10.0 0.0 0.0
12 1.0 0.0 0.0 0.0 1.0 0.0 0.0 0.0 1.0 -10.0 0.0 0.0
12 1.0 0.0 0.0 0.0 1.0 0.0 0.0 0.0 1.0 -10.0 0.0 0.0
12 1.0 0.0 0.0 0.0 1.0 0.0 0.0 0.0 1.0 -10.0 0.0 0.0
12 1.0 0.0 0.0 0.0 1.0 0.0 0.0 0.0 1.0 -10.0 0.0 0.0
12 1.0 0.0 0.0 0.0 1.0 0.0 0.0 0.0 1.0 -10.0 0.0 0.0
12 1.0 0.0 0.0 0.0 1.0 0.0 0.0 0.0 1.0 -10.0 0.0 0.0
12 1.0 0.0 0.0 0.0 1.0 0.0 0.0 0.0 1.0 -10.0 0.0 0.0
12 1.0 0.0 0.0 0.0 1.0 0.0 0.0 0.0 1.0 -10.0 0.0 0.0
12 1.0 0.0 0.0 0.0 1.0 0.0 0.0 0.0 1.0 -10.0 0.0 0.0
12 1.0 0.0 0.0 0.0 1.0 0.0 0.0 0.0 1.0 -10.0 0.0 0.0
12 1.0 0.0 0.0 0.0 1.0 0.0 0.0 0.0 1.0 -10.0 0.0 0.0
