\relax 
\@writefile{toc}{\contentsline {section}{\tocsection {Appendix}{A}{Monodomain parameters}}{32}}
\@writefile{lot}{\contentsline {table}{\numberline {2}{\ignorespaces Parameters for the evolution of the electric potential in the monodomain equations. TODO:Einheiten gleich machen\relax }}{32}}
\newlabel{tab:Monodomain}{{2}{32}}
\@writefile{lot}{\contentsline {table}{\numberline {3}{\ignorespaces Parameters in the ten Tuscher cell model.\relax }}{33}}
\newlabel{tab:TenTuscher}{{3}{33}}
\@writefile{lot}{\contentsline {table}{\numberline {4}{\ignorespaces Parameters in the Courtemanche cell model.\relax }}{34}}
\newlabel{tab:Courtemanche}{{4}{34}}
\@writefile{toc}{\contentsline {section}{\tocsection {Appendix}{B}{Hyperelastic parameters}}{34}}
\@writefile{lot}{\contentsline {table}{\numberline {5}{\ignorespaces Parameters of the passive material models\relax }}{35}}
\newlabel{tab:PassMat}{{5}{35}}
\@writefile{lot}{\contentsline {table}{\numberline {6}{\ignorespaces Parameters of the force-length relationship function\relax }}{35}}
\newlabel{tab:RFL}{{6}{35}}
\@writefile{lot}{\contentsline {table}{\numberline {7}{\ignorespaces Parameters in the Land cell model.\relax }}{35}}
\newlabel{tab:LandModel}{{7}{35}}
\@writefile{toc}{\contentsline {section}{\tocsection {Appendix}{C}{Circulatory System Parameters}}{36}}
\@writefile{lot}{\contentsline {table}{\numberline {8}{\ignorespaces Initial conditions of the circulatory system model.\relax }}{36}}
\newlabel{tab:CircWholeHeartIC}{{8}{36}}
\@writefile{lot}{\contentsline {table}{\numberline {9}{\ignorespaces Parameters in the circulatory system model.\relax }}{36}}
\newlabel{tab:CircWholeHeartParameter}{{9}{36}}
\@setckpt{Appendix}{
\setcounter{page}{37}
\setcounter{equation}{27}
\setcounter{enumi}{3}
\setcounter{enumii}{0}
\setcounter{enumiii}{0}
\setcounter{enumiv}{0}
\setcounter{footnote}{0}
\setcounter{mpfootnote}{0}
\setcounter{parentequation}{20}
\setcounter{part}{0}
\setcounter{section}{3}
\setcounter{subsection}{0}
\setcounter{subsubsection}{0}
\setcounter{paragraph}{0}
\setcounter{subparagraph}{0}
\setcounter{figure}{3}
\setcounter{table}{9}
\setcounter{thrm}{0}
\setcounter{float@type}{8}
\setcounter{ContinuedFloat}{0}
\setcounter{subfigure}{0}
\setcounter{subtable}{0}
\setcounter{algorithm}{0}
\setcounter{ALC@unique}{0}
\setcounter{ALC@line}{0}
\setcounter{ALC@rem}{0}
\setcounter{ALC@depth}{0}
\setcounter{theorem}{0}
}
