POINTS:
0 0
1 0
2 0
3 0
4 0
5 0
6 0
6 1
5 1
4 1
3 1
2 1
1 1
0 1
CELLS:
4 0000 0 1 12 13
4 0000 1 2 11 12
4 0000 2 3 10 11
4 2000 3 4 9 10
4 2000 4 5 8 9
4 2000 5 6 7 8
VDATA:
3 0.005 0.002 20
3 0.005 0.002 20
3 -10.0 0.0 0.0
3 -10.0 0.0 0.0
3 -10.0 0.0 0.0
3 0.005 0.002 20
3 0.005 0.002 20
3 0.005 0.002 20
3 0.005 0.002 20
3 -10.0 0.0 0.0
3 -10.0 0.0 0.0
3 -10.0 0.0 0.0
3 0.005 0.002 20
3 0.005 0.002 20
CDATA:
9 1 0 0 0 1 0 0 0 1
9 1 0 0 0 1 0 0 0 1
9 1 0 0 0 1 0 0 0 1
9 1 0 0 0 1 0 0 0 1
9 1 0 0 0 1 0 0 0 1
9 1 0 0 0 1 0 0 0 1
