POINTS:
0.0 0.0 0.0
0.0 0.0 1.0
0.0 0.0 2.0
0.0 0.0 3.0
0.0 0.0 4.0
0.0 0.0 5.0
0.0 1.0 0.0
0.0 1.0 1.0
0.0 1.0 2.0
0.0 1.0 3.0
0.0 1.0 4.0
0.0 1.0 5.0
0.0 2.0 0.0
0.0 2.0 1.0
0.0 2.0 2.0
0.0 2.0 3.0
0.0 2.0 4.0
0.0 2.0 5.0
0.0 3.0 0.0
0.0 3.0 1.0
0.0 3.0 2.0
0.0 3.0 3.0
0.0 3.0 4.0
0.0 3.0 5.0
0.0 4.0 0.0
0.0 4.0 1.0
0.0 4.0 2.0
0.0 4.0 3.0
0.0 4.0 4.0
0.0 4.0 5.0
0.0 5.0 0.0
0.0 5.0 1.0
0.0 5.0 2.0
0.0 5.0 3.0
0.0 5.0 4.0
0.0 5.0 5.0
1.0 0.0 0.0
1.0 0.0 1.0
1.0 0.0 2.0
1.0 0.0 3.0
1.0 0.0 4.0
1.0 0.0 5.0
1.0 1.0 0.0
1.0 1.0 1.0
1.0 1.0 2.0
1.0 1.0 3.0
1.0 1.0 4.0
1.0 1.0 5.0
1.0 2.0 0.0
1.0 2.0 1.0
1.0 2.0 2.0
1.0 2.0 3.0
1.0 2.0 4.0
1.0 2.0 5.0
1.0 3.0 0.0
1.0 3.0 1.0
1.0 3.0 2.0
1.0 3.0 3.0
1.0 3.0 4.0
1.0 3.0 5.0
1.0 4.0 0.0
1.0 4.0 1.0
1.0 4.0 2.0
1.0 4.0 3.0
1.0 4.0 4.0
1.0 4.0 5.0
1.0 5.0 0.0
1.0 5.0 1.0
1.0 5.0 2.0
1.0 5.0 3.0
1.0 5.0 4.0
1.0 5.0 5.0
2.0 0.0 0.0
2.0 0.0 1.0
2.0 0.0 2.0
2.0 0.0 3.0
2.0 0.0 4.0
2.0 0.0 5.0
2.0 1.0 0.0
2.0 1.0 1.0
2.0 1.0 2.0
2.0 1.0 3.0
2.0 1.0 4.0
2.0 1.0 5.0
2.0 2.0 0.0
2.0 2.0 1.0
2.0 2.0 2.0
2.0 2.0 3.0
2.0 2.0 4.0
2.0 2.0 5.0
2.0 3.0 0.0
2.0 3.0 1.0
2.0 3.0 2.0
2.0 3.0 3.0
2.0 3.0 4.0
2.0 3.0 5.0
2.0 4.0 0.0
2.0 4.0 1.0
2.0 4.0 2.0
2.0 4.0 3.0
2.0 4.0 4.0
2.0 4.0 5.0
2.0 5.0 0.0
2.0 5.0 1.0
2.0 5.0 2.0
2.0 5.0 3.0
2.0 5.0 4.0
2.0 5.0 5.0
3.0 0.0 0.0
3.0 0.0 1.0
3.0 0.0 2.0
3.0 0.0 3.0
3.0 0.0 4.0
3.0 0.0 5.0
3.0 1.0 0.0
3.0 1.0 1.0
3.0 1.0 2.0
3.0 1.0 3.0
3.0 1.0 4.0
3.0 1.0 5.0
3.0 2.0 0.0
3.0 2.0 1.0
3.0 2.0 2.0
3.0 2.0 3.0
3.0 2.0 4.0
3.0 2.0 5.0
3.0 3.0 0.0
3.0 3.0 1.0
3.0 3.0 2.0
3.0 3.0 3.0
3.0 3.0 4.0
3.0 3.0 5.0
3.0 4.0 0.0
3.0 4.0 1.0
3.0 4.0 2.0
3.0 4.0 3.0
3.0 4.0 4.0
3.0 4.0 5.0
3.0 5.0 0.0
3.0 5.0 1.0
3.0 5.0 2.0
3.0 5.0 3.0
3.0 5.0 4.0
3.0 5.0 5.0
4.0 0.0 0.0
4.0 0.0 1.0
4.0 0.0 2.0
4.0 0.0 3.0
4.0 0.0 4.0
4.0 0.0 5.0
4.0 1.0 0.0
4.0 1.0 1.0
4.0 1.0 2.0
4.0 1.0 3.0
4.0 1.0 4.0
4.0 1.0 5.0
4.0 2.0 0.0
4.0 2.0 1.0
4.0 2.0 2.0
4.0 2.0 3.0
4.0 2.0 4.0
4.0 2.0 5.0
4.0 3.0 0.0
4.0 3.0 1.0
4.0 3.0 2.0
4.0 3.0 3.0
4.0 3.0 4.0
4.0 3.0 5.0
4.0 4.0 0.0
4.0 4.0 1.0
4.0 4.0 2.0
4.0 4.0 3.0
4.0 4.0 4.0
4.0 4.0 5.0
4.0 5.0 0.0
4.0 5.0 1.0
4.0 5.0 2.0
4.0 5.0 3.0
4.0 5.0 4.0
4.0 5.0 5.0
5.0 0.0 0.0
5.0 0.0 1.0
5.0 0.0 2.0
5.0 0.0 3.0
5.0 0.0 4.0
5.0 0.0 5.0
5.0 1.0 0.0
5.0 1.0 1.0
5.0 1.0 2.0
5.0 1.0 3.0
5.0 1.0 4.0
5.0 1.0 5.0
5.0 2.0 0.0
5.0 2.0 1.0
5.0 2.0 2.0
5.0 2.0 3.0
5.0 2.0 4.0
5.0 2.0 5.0
5.0 3.0 0.0
5.0 3.0 1.0
5.0 3.0 2.0
5.0 3.0 3.0
5.0 3.0 4.0
5.0 3.0 5.0
5.0 4.0 0.0
5.0 4.0 1.0
5.0 4.0 2.0
5.0 4.0 3.0
5.0 4.0 4.0
5.0 4.0 5.0
5.0 5.0 0.0
5.0 5.0 1.0
5.0 5.0 2.0
5.0 5.0 3.0
5.0 5.0 4.0
5.0 5.0 5.0
CELLS:
8 0 0 6 42 36 1 7 43 37
8 0 1 7 43 37 2 8 44 38
8 0 2 8 44 38 3 9 45 39
8 0 3 9 45 39 4 10 46 40
8 0 4 10 46 40 5 11 47 41
8 0 6 12 48 42 7 13 49 43
8 0 7 13 49 43 8 14 50 44
8 0 8 14 50 44 9 15 51 45
8 0 9 15 51 45 10 16 52 46
8 0 10 16 52 46 11 17 53 47
8 0 12 18 54 48 13 19 55 49
8 0 13 19 55 49 14 20 56 50
8 0 14 20 56 50 15 21 57 51
8 0 15 21 57 51 16 22 58 52
8 0 16 22 58 52 17 23 59 53
8 0 18 24 60 54 19 25 61 55
8 0 19 25 61 55 20 26 62 56
8 0 20 26 62 56 21 27 63 57
8 0 21 27 63 57 22 28 64 58
8 0 22 28 64 58 23 29 65 59
8 0 24 30 66 60 25 31 67 61
8 0 25 31 67 61 26 32 68 62
8 0 26 32 68 62 27 33 69 63
8 0 27 33 69 63 28 34 70 64
8 0 28 34 70 64 29 35 71 65
8 0 36 42 78 72 37 43 79 73
8 0 37 43 79 73 38 44 80 74
8 0 38 44 80 74 39 45 81 75
8 0 39 45 81 75 40 46 82 76
8 0 40 46 82 76 41 47 83 77
8 0 42 48 84 78 43 49 85 79
8 0 43 49 85 79 44 50 86 80
8 0 44 50 86 80 45 51 87 81
8 0 45 51 87 81 46 52 88 82
8 0 46 52 88 82 47 53 89 83
8 0 48 54 90 84 49 55 91 85
8 0 49 55 91 85 50 56 92 86
8 0 50 56 92 86 51 57 93 87
8 0 51 57 93 87 52 58 94 88
8 0 52 58 94 88 53 59 95 89
8 0 54 60 96 90 55 61 97 91
8 0 55 61 97 91 56 62 98 92
8 0 56 62 98 92 57 63 99 93
8 0 57 63 99 93 58 64 100 94
8 0 58 64 100 94 59 65 101 95
8 0 60 66 102 96 61 67 103 97
8 0 61 67 103 97 62 68 104 98
8 0 62 68 104 98 63 69 105 99
8 0 63 69 105 99 64 70 106 100
8 0 64 70 106 100 65 71 107 101
8 0 72 78 114 108 73 79 115 109
8 0 73 79 115 109 74 80 116 110
8 0 74 80 116 110 75 81 117 111
8 0 75 81 117 111 76 82 118 112
8 0 76 82 118 112 77 83 119 113
8 0 78 84 120 114 79 85 121 115
8 0 79 85 121 115 80 86 122 116
8 0 80 86 122 116 81 87 123 117
8 0 81 87 123 117 82 88 124 118
8 0 82 88 124 118 83 89 125 119
8 0 84 90 126 120 85 91 127 121
8 0 85 91 127 121 86 92 128 122
8 0 86 92 128 122 87 93 129 123
8 0 87 93 129 123 88 94 130 124
8 0 88 94 130 124 89 95 131 125
8 0 90 96 132 126 91 97 133 127
8 0 91 97 133 127 92 98 134 128
8 0 92 98 134 128 93 99 135 129
8 0 93 99 135 129 94 100 136 130
8 0 94 100 136 130 95 101 137 131
8 0 96 102 138 132 97 103 139 133
8 0 97 103 139 133 98 104 140 134
8 0 98 104 140 134 99 105 141 135
8 0 99 105 141 135 100 106 142 136
8 0 100 106 142 136 101 107 143 137
8 0 108 114 150 144 109 115 151 145
8 0 109 115 151 145 110 116 152 146
8 0 110 116 152 146 111 117 153 147
8 0 111 117 153 147 112 118 154 148
8 0 112 118 154 148 113 119 155 149
8 0 114 120 156 150 115 121 157 151
8 0 115 121 157 151 116 122 158 152
8 0 116 122 158 152 117 123 159 153
8 0 117 123 159 153 118 124 160 154
8 0 118 124 160 154 119 125 161 155
8 0 120 126 162 156 121 127 163 157
8 0 121 127 163 157 122 128 164 158
8 0 122 128 164 158 123 129 165 159
8 0 123 129 165 159 124 130 166 160
8 0 124 130 166 160 125 131 167 161
8 0 126 132 168 162 127 133 169 163
8 0 127 133 169 163 128 134 170 164
8 0 128 134 170 164 129 135 171 165
8 0 129 135 171 165 130 136 172 166
8 0 130 136 172 166 131 137 173 167
8 0 132 138 174 168 133 139 175 169
8 0 133 139 175 169 134 140 176 170
8 0 134 140 176 170 135 141 177 171
8 0 135 141 177 171 136 142 178 172
8 0 136 142 178 172 137 143 179 173
8 0 144 150 186 180 145 151 187 181
8 0 145 151 187 181 146 152 188 182
8 0 146 152 188 182 147 153 189 183
8 0 147 153 189 183 148 154 190 184
8 0 148 154 190 184 149 155 191 185
8 0 150 156 192 186 151 157 193 187
8 0 151 157 193 187 152 158 194 188
8 0 152 158 194 188 153 159 195 189
8 0 153 159 195 189 154 160 196 190
8 0 154 160 196 190 155 161 197 191
8 0 156 162 198 192 157 163 199 193
8 0 157 163 199 193 158 164 200 194
8 0 158 164 200 194 159 165 201 195
8 0 159 165 201 195 160 166 202 196
8 0 160 166 202 196 161 167 203 197
8 0 162 168 204 198 163 169 205 199
8 0 163 169 205 199 164 170 206 200
8 0 164 170 206 200 165 171 207 201
8 0 165 171 207 201 166 172 208 202
8 0 166 172 208 202 167 173 209 203
8 0 168 174 210 204 169 175 211 205
8 0 169 175 211 205 170 176 212 206
8 0 170 176 212 206 171 177 213 207
8 0 171 177 213 207 172 178 214 208
8 0 172 178 214 208 173 179 215 209
FACES:
4 100 0 6 7 1
4 230 180 186 187 181
4 100 1 7 8 2
4 230 181 187 188 182
4 100 2 8 9 3
4 230 182 188 189 183
4 100 3 9 10 4
4 230 183 189 190 184
4 100 4 10 11 5
4 230 184 190 191 185
4 100 6 12 13 7
4 230 186 192 193 187
4 100 7 13 14 8
4 230 187 193 194 188
4 100 8 14 15 9
4 230 188 194 195 189
4 100 9 15 16 10
4 230 189 195 196 190
4 100 10 16 17 11
4 230 190 196 197 191
4 100 12 18 19 13
4 230 192 198 199 193
4 100 13 19 20 14
4 230 193 199 200 194
4 100 14 20 21 15
4 230 194 200 201 195
4 100 15 21 22 16
4 230 195 201 202 196
4 100 16 22 23 17
4 230 196 202 203 197
4 100 18 24 25 19
4 230 198 204 205 199
4 100 19 25 26 20
4 230 199 205 206 200
4 100 20 26 27 21
4 230 200 206 207 201
4 100 21 27 28 22
4 230 201 207 208 202
4 100 22 28 29 23
4 230 202 208 209 203
4 100 24 30 31 25
4 230 204 210 211 205
4 100 25 31 32 26
4 230 205 211 212 206
4 100 26 32 33 27
4 230 206 212 213 207
4 100 27 33 34 28
4 230 207 213 214 208
4 100 28 34 35 29
4 230 208 214 215 209
4 102 42 36 0 6
4 232 47 41 5 11
4 102 48 42 6 12
4 232 53 47 11 17
4 102 54 48 12 18
4 232 59 53 17 23
4 102 60 54 18 24
4 232 65 59 23 29
4 102 66 60 24 30
4 232 71 65 29 35
4 102 78 72 36 42
4 232 83 77 41 47
4 102 84 78 42 48
4 232 89 83 47 53
4 102 90 84 48 54
4 232 95 89 53 59
4 102 96 90 54 60
4 232 101 95 59 65
4 102 102 96 60 66
4 232 107 101 65 71
4 102 114 108 72 78
4 232 119 113 77 83
4 102 120 114 78 84
4 232 125 119 83 89
4 102 126 120 84 90
4 232 131 125 89 95
4 102 132 126 90 96
4 232 137 131 95 101
4 102 138 132 96 102
4 232 143 137 101 107
4 102 150 144 108 114
4 232 155 149 113 119
4 102 156 150 114 120
4 232 161 155 119 125
4 102 162 156 120 126
4 232 167 161 125 131
4 102 168 162 126 132
4 232 173 167 131 137
4 102 174 168 132 138
4 232 179 173 137 143
4 102 186 180 144 150
4 232 191 185 149 155
4 102 192 186 150 156
4 232 197 191 155 161
4 102 198 192 156 162
4 232 203 197 161 167
4 102 204 198 162 168
4 232 209 203 167 173
4 102 210 204 168 174
4 232 215 209 173 179
4 101 0 36 37 1
4 231 30 66 67 31
4 101 1 37 38 2
4 231 31 67 68 32
4 101 2 38 39 3
4 231 32 68 69 33
4 101 3 39 40 4
4 231 33 69 70 34
4 101 4 40 41 5
4 231 34 70 71 35
4 101 36 72 73 37
4 231 66 102 103 67
4 101 37 73 74 38
4 231 67 103 104 68
4 101 38 74 75 39
4 231 68 104 105 69
4 101 39 75 76 40
4 231 69 105 106 70
4 101 40 76 77 41
4 231 70 106 107 71
4 101 72 108 109 73
4 231 102 138 139 103
4 101 73 109 110 74
4 231 103 139 140 104
4 101 74 110 111 75
4 231 104 140 141 105
4 101 75 111 112 76
4 231 105 141 142 106
4 101 76 112 113 77
4 231 106 142 143 107
4 101 108 144 145 109
4 231 138 174 175 139
4 101 109 145 146 110
4 231 139 175 176 140
4 101 110 146 147 111
4 231 140 176 177 141
4 101 111 147 148 112
4 231 141 177 178 142
4 101 112 148 149 113
4 231 142 178 179 143
4 101 144 180 181 145
4 231 174 210 211 175
4 101 145 181 182 146
4 231 175 211 212 176
4 101 146 182 183 147
4 231 176 212 213 177
4 101 147 183 184 148
4 231 177 213 214 178
4 101 148 184 185 149
4 231 178 214 215 179
VDATA:
3 -10 0 0
3 -10 0 0
3 -10 0 0
3 -10 0 0
3 -10 0 0
3 -10 0 0
3 -10 0 0
3 -10 0 0
3 -10 0 0
3 -10 0 0
3 -10 0 0
3 -10 0 0
3 -10 0 0
3 -10 0 0
3 -10 0 0
3 -10 0 0
3 -10 0 0
3 -10 0 0
3 -10 0 0
3 -10 0 0
3 -10 0 0
3 -10 0 0
3 -10 0 0
3 -10 0 0
3 -10 0 0
3 -10 0 0
3 -10 0 0
3 -10 0 0
3 -10 0 0
3 -10 0 0
3 -10 0 0
3 -10 0 0
3 -10 0 0
3 -10 0 0
3 -10 0 0
3 -10 0 0
3 -10 0 0
3 -10 0 0
3 -10 0 0
3 -10 0 0
3 -10 0 0
3 -10 0 0
3 -10 0 0
3 -10 0 0
3 -10 0 0
3 -10 0 0
3 -10 0 0
3 -10 0 0
3 -10 0 0
3 -10 0 0
3 -10 0 0
3 -10 0 0
3 -10 0 0
3 -10 0 0
3 -10 0 0
3 -10 0 0
3 -10 0 0
3 -10 0 0
3 -10 0 0
3 -10 0 0
3 -10 0 0
3 -10 0 0
3 -10 0 0
3 -10 0 0
3 -10 0 0
3 -10 0 0
3 -10 0 0
3 -10 0 0
3 -10 0 0
3 -10 0 0
3 -10 0 0
3 -10 0 0
3 -10 0 0
3 -10 0 0
3 -10 0 0
3 -10 0 0
3 -10 0 0
3 -10 0 0
3 -10 0 0
3 -10 0 0
3 -10 0 0
3 -10 0 0
3 -10 0 0
3 -10 0 0
3 -10 0 0
3 -10 0 0
3 -10 0 0
3 -10 0 0
3 -10 0 0
3 -10 0 0
3 -10 0 0
3 -10 0 0
3 -10 0 0
3 -10 0 0
3 -10 0 0
3 -10 0 0
3 -10 0 0
3 -10 0 0
3 -10 0 0
3 -10 0 0
3 -10 0 0
3 -10 0 0
3 -10 0 0
3 -10 0 0
3 -10 0 0
3 -10 0 0
3 -10 0 0
3 -10 0 0
3 -10 0 0
3 -10 0 0
3 -10 0 0
3 -10 0 0
3 -10 0 0
3 -10 0 0
3 -10 0 0
3 -10 0 0
3 -10 0 0
3 -10 0 0
3 -10 0 0
3 -10 0 0
3 -10 0 0
3 -10 0 0
3 -10 0 0
3 -10 0 0
3 -10 0 0
3 -10 0 0
3 -10 0 0
3 -10 0 0
3 -10 0 0
3 -10 0 0
3 -10 0 0
3 -10 0 0
3 -10 0 0
3 -10 0 0
3 -10 0 0
3 -10 0 0
3 -10 0 0
3 -10 0 0
3 -10 0 0
3 -10 0 0
3 -10 0 0
3 -10 0 0
3 -10 0 0
3 -10 0 0
3 -10 0 0
3 -10 0 0
3 -10 0 0
3 -10 0 0
3 -10 0 0
3 -10 0 0
3 -10 0 0
3 -10 0 0
3 -10 0 0
3 -10 0 0
3 -10 0 0
3 -10 0 0
3 -10 0 0
3 -10 0 0
3 -10 0 0
3 -10 0 0
3 -10 0 0
3 -10 0 0
3 -10 0 0
3 -10 0 0
3 -10 0 0
3 -10 0 0
3 -10 0 0
3 -10 0 0
3 -10 0 0
3 -10 0 0
3 -10 0 0
3 -10 0 0
3 -10 0 0
3 -10 0 0
3 -10 0 0
3 -10 0 0
3 -10 0 0
3 -10 0 0
3 -10 0 0
3 -10 0 0
3 -10 0 0
3 -10 0 0
3 -10 0 0
3 -10 0 0
3 -10 0 0
3 -10 0 0
3 -10 0 0
3 -10 0 0
3 -10 0 0
3 -10 0 0
3 -10 0 0
3 -10 0 0
3 -10 0 0
3 -10 0 0
3 -10 0 0
3 -10 0 0
3 -10 0 0
3 -10 0 0
3 -10 0 0
3 -10 0 0
3 -10 0 0
3 -10 0 0
3 -10 0 0
3 -10 0 0
3 -10 0 0
3 -10 0 0
3 -10 0 0
3 -10 0 0
3 -10 0 0
3 -10 0 0
3 -10 0 0
3 -10 0 0
3 -10 0 0
3 -10 0 0
3 -10 0 0
3 -10 0 0
CDATA:
9 1 0 0 0 1 0 0 0 1
9 1 0 0 0 1 0 0 0 1
9 1 0 0 0 1 0 0 0 1
9 1 0 0 0 1 0 0 0 1
9 1 0 0 0 1 0 0 0 1
9 1 0 0 0 1 0 0 0 1
9 1 0 0 0 1 0 0 0 1
9 1 0 0 0 1 0 0 0 1
9 1 0 0 0 1 0 0 0 1
9 1 0 0 0 1 0 0 0 1
9 1 0 0 0 1 0 0 0 1
9 1 0 0 0 1 0 0 0 1
9 1 0 0 0 1 0 0 0 1
9 1 0 0 0 1 0 0 0 1
9 1 0 0 0 1 0 0 0 1
9 1 0 0 0 1 0 0 0 1
9 1 0 0 0 1 0 0 0 1
9 1 0 0 0 1 0 0 0 1
9 1 0 0 0 1 0 0 0 1
9 1 0 0 0 1 0 0 0 1
9 1 0 0 0 1 0 0 0 1
9 1 0 0 0 1 0 0 0 1
9 1 0 0 0 1 0 0 0 1
9 1 0 0 0 1 0 0 0 1
9 1 0 0 0 1 0 0 0 1
9 1 0 0 0 1 0 0 0 1
9 1 0 0 0 1 0 0 0 1
9 1 0 0 0 1 0 0 0 1
9 1 0 0 0 1 0 0 0 1
9 1 0 0 0 1 0 0 0 1
9 1 0 0 0 1 0 0 0 1
9 1 0 0 0 1 0 0 0 1
9 1 0 0 0 1 0 0 0 1
9 1 0 0 0 1 0 0 0 1
9 1 0 0 0 1 0 0 0 1
9 1 0 0 0 1 0 0 0 1
9 1 0 0 0 1 0 0 0 1
9 1 0 0 0 1 0 0 0 1
9 1 0 0 0 1 0 0 0 1
9 1 0 0 0 1 0 0 0 1
9 1 0 0 0 1 0 0 0 1
9 1 0 0 0 1 0 0 0 1
9 1 0 0 0 1 0 0 0 1
9 1 0 0 0 1 0 0 0 1
9 1 0 0 0 1 0 0 0 1
9 1 0 0 0 1 0 0 0 1
9 1 0 0 0 1 0 0 0 1
9 1 0 0 0 1 0 0 0 1
9 1 0 0 0 1 0 0 0 1
9 1 0 0 0 1 0 0 0 1
9 1 0 0 0 1 0 0 0 1
9 1 0 0 0 1 0 0 0 1
9 1 0 0 0 1 0 0 0 1
9 1 0 0 0 1 0 0 0 1
9 1 0 0 0 1 0 0 0 1
9 1 0 0 0 1 0 0 0 1
9 1 0 0 0 1 0 0 0 1
9 1 0 0 0 1 0 0 0 1
9 1 0 0 0 1 0 0 0 1
9 1 0 0 0 1 0 0 0 1
9 1 0 0 0 1 0 0 0 1
9 1 0 0 0 1 0 0 0 1
9 1 0 0 0 1 0 0 0 1
9 1 0 0 0 1 0 0 0 1
9 1 0 0 0 1 0 0 0 1
9 1 0 0 0 1 0 0 0 1
9 1 0 0 0 1 0 0 0 1
9 1 0 0 0 1 0 0 0 1
9 1 0 0 0 1 0 0 0 1
9 1 0 0 0 1 0 0 0 1
9 1 0 0 0 1 0 0 0 1
9 1 0 0 0 1 0 0 0 1
9 1 0 0 0 1 0 0 0 1
9 1 0 0 0 1 0 0 0 1
9 1 0 0 0 1 0 0 0 1
9 1 0 0 0 1 0 0 0 1
9 1 0 0 0 1 0 0 0 1
9 1 0 0 0 1 0 0 0 1
9 1 0 0 0 1 0 0 0 1
9 1 0 0 0 1 0 0 0 1
9 1 0 0 0 1 0 0 0 1
9 1 0 0 0 1 0 0 0 1
9 1 0 0 0 1 0 0 0 1
9 1 0 0 0 1 0 0 0 1
9 1 0 0 0 1 0 0 0 1
9 1 0 0 0 1 0 0 0 1
9 1 0 0 0 1 0 0 0 1
9 1 0 0 0 1 0 0 0 1
9 1 0 0 0 1 0 0 0 1
9 1 0 0 0 1 0 0 0 1
9 1 0 0 0 1 0 0 0 1
9 1 0 0 0 1 0 0 0 1
9 1 0 0 0 1 0 0 0 1
9 1 0 0 0 1 0 0 0 1
9 1 0 0 0 1 0 0 0 1
9 1 0 0 0 1 0 0 0 1
9 1 0 0 0 1 0 0 0 1
9 1 0 0 0 1 0 0 0 1
9 1 0 0 0 1 0 0 0 1
9 1 0 0 0 1 0 0 0 1
9 1 0 0 0 1 0 0 0 1
9 1 0 0 0 1 0 0 0 1
9 1 0 0 0 1 0 0 0 1
9 1 0 0 0 1 0 0 0 1
9 1 0 0 0 1 0 0 0 1
9 1 0 0 0 1 0 0 0 1
9 1 0 0 0 1 0 0 0 1
9 1 0 0 0 1 0 0 0 1
9 1 0 0 0 1 0 0 0 1
9 1 0 0 0 1 0 0 0 1
9 1 0 0 0 1 0 0 0 1
9 1 0 0 0 1 0 0 0 1
9 1 0 0 0 1 0 0 0 1
9 1 0 0 0 1 0 0 0 1
9 1 0 0 0 1 0 0 0 1
9 1 0 0 0 1 0 0 0 1
9 1 0 0 0 1 0 0 0 1
9 1 0 0 0 1 0 0 0 1
9 1 0 0 0 1 0 0 0 1
9 1 0 0 0 1 0 0 0 1
9 1 0 0 0 1 0 0 0 1
9 1 0 0 0 1 0 0 0 1
9 1 0 0 0 1 0 0 0 1
9 1 0 0 0 1 0 0 0 1
9 1 0 0 0 1 0 0 0 1
