POINTS:
0.0 0.0
0.0 1.0
0.0 2.0
0.0 3.0
0.0 4.0
1.0 0.0
1.0 1.0
1.0 2.0
1.0 3.0
1.0 4.0
2.0 0.0
2.0 1.0
2.0 2.0
2.0 3.0
2.0 4.0
3.0 0.0
3.0 1.0
3.0 2.0
3.0 3.0
3.0 4.0
4.0 0.0
4.0 1.0
4.0 2.0
4.0 3.0
4.0 4.0
CELLS:
3 9000 0 5 6
3 9000 0 6 1
3 9000 1 6 7
3 9000 1 7 2
3 9000 2 7 8
3 9000 2 8 3
3 9000 3 8 9
3 9000 3 9 4
3 9000 5 10 11
3 9000 5 11 6
3 0 6 11 12
3 0 6 12 7
3 2000 7 12 13
3 2000 7 13 8
3 9000 8 13 14
3 9000 8 14 9
3 9000 10 15 16
3 9000 10 16 11
3 1000 11 16 17
3 1000 11 17 12
3 3000 12 17 18
3 3000 12 18 13
3 9000 13 18 19
3 9000 13 19 14
3 9000 15 20 21
3 9000 15 21 16
3 9000 16 21 22
3 9000 16 22 17
3 9000 17 22 23
3 9000 17 23 18
3 9000 18 23 24
3 9000 18 24 19
FACES:
2 1 0 1
2 1 20 21
2 1 1 2
2 1 21 22
2 1 2 3
2 1 22 23
2 1 3 4
2 1 23 24
2 1 4 9
2 1 0 5
2 1 9 14
2 1 5 10
2 1 14 19
2 1 10 15
2 1 19 24
2 1 15 20
VDATA:
3 -10 0 0
3 -10 0 0
3 -10 0 0
3 -10 0 0
3 -10 0 0
3 -10 0 0
3 -10 0 0
3 -10 0 0
3 -10 0 0
3 -10 0 0
3 -10 0 0
3 -10 0 0
3 -10 0 0
3 -10 0 0
3 -10 0 0
3 -10 0 0
3 -10 0 0
3 -10 0 0
3 -10 0 0
3 -10 0 0
3 -10 0 0
3 -10 0 0
3 -10 0 0
3 -10 0 0
3 -10 0 0
CDATA:
9 1 0 0 0 1 0 0 0 1
9 1 0 0 0 1 0 0 0 1
9 1 0 0 0 1 0 0 0 1
9 1 0 0 0 1 0 0 0 1
9 1 0 0 0 1 0 0 0 1
9 1 0 0 0 1 0 0 0 1
9 1 0 0 0 1 0 0 0 1
9 1 0 0 0 1 0 0 0 1
9 1 0 0 0 1 0 0 0 1
9 1 0 0 0 1 0 0 0 1
9 1 0 0 0 1 0 0 0 1
9 1 0 0 0 1 0 0 0 1
9 1 0 0 0 1 0 0 0 1
9 1 0 0 0 1 0 0 0 1
9 1 0 0 0 1 0 0 0 1
9 1 0 0 0 1 0 0 0 1
9 1 0 0 0 1 0 0 0 1
9 1 0 0 0 1 0 0 0 1
9 1 0 0 0 1 0 0 0 1
9 1 0 0 0 1 0 0 0 1
9 1 0 0 0 1 0 0 0 1
9 1 0 0 0 1 0 0 0 1
9 1 0 0 0 1 0 0 0 1
9 1 0 0 0 1 0 0 0 1
9 1 0 0 0 1 0 0 0 1
9 1 0 0 0 1 0 0 0 1
9 1 0 0 0 1 0 0 0 1
9 1 0 0 0 1 0 0 0 1
9 1 0 0 0 1 0 0 0 1
9 1 0 0 0 1 0 0 0 1
9 1 0 0 0 1 0 0 0 1
9 1 0 0 0 1 0 0 0 1
