POINTS:
0.0 0.0
0.0 0.5
0.0 1.0
0.0 1.5
0.0 2.0
0.0 2.5
0.0 3.0
0.5 0.0
0.5 0.5
0.5 1.0
0.5 1.5
0.5 2.0
0.5 2.5
0.5 3.0
1.0 0.0
1.0 0.5
1.0 1.0
1.0 1.5
1.0 2.0
1.0 2.5
1.0 3.0
1.5 0.0
1.5 0.5
1.5 1.0
1.5 1.5
1.5 2.0
1.5 2.5
1.5 3.0
2.0 0.0
2.0 0.5
2.0 1.0
2.0 1.5
2.0 2.0
2.0 2.5
2.0 3.0
2.5 0.0
2.5 0.5
2.5 1.0
2.5 1.5
2.5 2.0
2.5 2.5
2.5 3.0
3.0 0.0
3.0 0.5
3.0 1.0
3.0 1.5
3.0 2.0
3.0 2.5
3.0 3.0
3.5 0.0
3.5 0.5
3.5 1.0
3.5 1.5
3.5 2.0
3.5 2.5
3.5 3.0
4.0 0.0
4.0 0.5
4.0 1.0
4.0 1.5
4.0 2.0
4.0 2.5
4.0 3.0
4.5 0.0
4.5 0.5
4.5 1.0
4.5 1.5
4.5 2.0
4.5 2.5
4.5 3.0
5.0 0.0
5.0 0.5
5.0 1.0
5.0 1.5
5.0 2.0
5.0 2.5
5.0 3.0
CELLS:
4 1000 0 7 8 1
4 1000 1 8 9 2
4 1000 2 9 10 3
4 0 3 10 11 4
4 0 4 11 12 5
4 0 5 12 13 6
4 1000 7 14 15 8
4 1000 8 15 16 9
4 1000 9 16 17 10
4 0 10 17 18 11
4 0 11 18 19 12
4 0 12 19 20 13
4 1000 14 21 22 15
4 1000 15 22 23 16
4 1000 16 23 24 17
4 0 17 24 25 18
4 0 18 25 26 19
4 0 19 26 27 20
4 1000 21 28 29 22
4 1000 22 29 30 23
4 1000 23 30 31 24
4 0 24 31 32 25
4 0 25 32 33 26
4 0 26 33 34 27
4 1000 28 35 36 29
4 1000 29 36 37 30
4 1000 30 37 38 31
4 0 31 38 39 32
4 0 32 39 40 33
4 0 33 40 41 34
4 1000 35 42 43 36
4 1000 36 43 44 37
4 1000 37 44 45 38
4 0 38 45 46 39
4 0 39 46 47 40
4 0 40 47 48 41
4 3000 42 49 50 43
4 3000 43 50 51 44
4 3000 44 51 52 45
4 2000 45 52 53 46
4 2000 46 53 54 47
4 2000 47 54 55 48
4 3000 49 56 57 50
4 3000 50 57 58 51
4 3000 51 58 59 52
4 2000 52 59 60 53
4 2000 53 60 61 54
4 2000 54 61 62 55
4 3000 56 63 64 57
4 3000 57 64 65 58
4 3000 58 65 66 59
4 2000 59 66 67 60
4 2000 60 67 68 61
4 2000 61 68 69 62
4 3000 63 70 71 64
4 3000 64 71 72 65
4 3000 65 72 73 66
4 2000 66 73 74 67
4 2000 67 74 75 68
4 2000 68 75 76 69
FACES:
VDATA:
3 0.005 0.002 20
3 0.005 0.002 20
3 0.005 0.002 20
3 -10.0 0.0 0.0
3 -10.0 0.0 0.0
3 -10.0 0.0 0.0
3 -10.0 0.0 0.0
3 0.005 0.002 20
3 0.005 0.002 20
3 0.005 0.002 20
3 -10.0 0.0 0.0
3 -10.0 0.0 0.0
3 -10.0 0.0 0.0
3 -10.0 0.0 0.0
3 0.005 0.002 20
3 0.005 0.002 20
3 0.005 0.002 20
3 -10.0 0.0 0.0
3 -10.0 0.0 0.0
3 -10.0 0.0 0.0
3 -10.0 0.0 0.0
3 -10.0 0.0 0.0
3 -10.0 0.0 0.0
3 -10.0 0.0 0.0
3 -10.0 0.0 0.0
3 -10.0 0.0 0.0
3 -10.0 0.0 0.0
3 -10.0 0.0 0.0
3 -10.0 0.0 0.0
3 -10.0 0.0 0.0
3 -10.0 0.0 0.0
3 -10.0 0.0 0.0
3 -10.0 0.0 0.0
3 -10.0 0.0 0.0
3 -10.0 0.0 0.0
3 -10.0 0.0 0.0
3 -10.0 0.0 0.0
3 -10.0 0.0 0.0
3 -10.0 0.0 0.0
3 -10.0 0.0 0.0
3 -10.0 0.0 0.0
3 -10.0 0.0 0.0
3 -10.0 0.0 0.0
3 -10.0 0.0 0.0
3 -10.0 0.0 0.0
3 -10.0 0.0 0.0
3 -10.0 0.0 0.0
3 -10.0 0.0 0.0
3 -10.0 0.0 0.0
3 -10.0 0.0 0.0
3 -10.0 0.0 0.0
3 -10.0 0.0 0.0
3 -10.0 0.0 0.0
3 -10.0 0.0 0.0
3 -10.0 0.0 0.0
3 -10.0 0.0 0.0
3 -10.0 0.0 0.0
3 -10.0 0.0 0.0
3 -10.0 0.0 0.0
3 -10.0 0.0 0.0
3 -10.0 0.0 0.0
3 -10.0 0.0 0.0
3 -10.0 0.0 0.0
3 -10.0 0.0 0.0
3 -10.0 0.0 0.0
3 -10.0 0.0 0.0
3 -10.0 0.0 0.0
3 -10.0 0.0 0.0
3 0.0 0.002 20
3 0.0 0.002 20
3 -10.0 0.0 0.0
3 -10.0 0.0 0.0
3 -10.0 0.0 0.0
3 -10.0 0.0 0.0
3 -10.0 0.0 0.0
3 0.0 0.002 20
3 0.0 0.002 20
CDATA:
9 1 0 0 0 1 0 0 0 1
9 1 0 0 0 1 0 0 0 1
9 1 0 0 0 1 0 0 0 1
9 1 0 0 0 1 0 0 0 1
9 1 0 0 0 1 0 0 0 1
9 1 0 0 0 1 0 0 0 1
9 1 0 0 0 1 0 0 0 1
9 1 0 0 0 1 0 0 0 1
9 1 0 0 0 1 0 0 0 1
9 1 0 0 0 1 0 0 0 1
9 1 0 0 0 1 0 0 0 1
9 1 0 0 0 1 0 0 0 1
9 1 0 0 0 1 0 0 0 1
9 1 0 0 0 1 0 0 0 1
9 1 0 0 0 1 0 0 0 1
9 1 0 0 0 1 0 0 0 1
9 1 0 0 0 1 0 0 0 1
9 1 0 0 0 1 0 0 0 1
9 1 0 0 0 1 0 0 0 1
9 1 0 0 0 1 0 0 0 1
9 1 0 0 0 1 0 0 0 1
9 1 0 0 0 1 0 0 0 1
9 1 0 0 0 1 0 0 0 1
9 1 0 0 0 1 0 0 0 1
9 1 0 0 0 1 0 0 0 1
9 1 0 0 0 1 0 0 0 1
9 1 0 0 0 1 0 0 0 1
9 1 0 0 0 1 0 0 0 1
9 1 0 0 0 1 0 0 0 1
9 1 0 0 0 1 0 0 0 1
9 1 0 0 0 1 0 0 0 1
9 1 0 0 0 1 0 0 0 1
9 1 0 0 0 1 0 0 0 1
9 1 0 0 0 1 0 0 0 1
9 1 0 0 0 1 0 0 0 1
9 1 0 0 0 1 0 0 0 1
9 1 0 0 0 1 0 0 0 1
9 1 0 0 0 1 0 0 0 1
9 1 0 0 0 1 0 0 0 1
9 1 0 0 0 1 0 0 0 1
9 1 0 0 0 1 0 0 0 1
9 1 0 0 0 1 0 0 0 1
9 1 0 0 0 1 0 0 0 1
9 1 0 0 0 1 0 0 0 1
9 1 0 0 0 1 0 0 0 1
9 1 0 0 0 1 0 0 0 1
9 1 0 0 0 1 0 0 0 1
9 1 0 0 0 1 0 0 0 1
9 1 0 0 0 1 0 0 0 1
9 1 0 0 0 1 0 0 0 1
9 1 0 0 0 1 0 0 0 1
9 1 0 0 0 1 0 0 0 1
9 1 0 0 0 1 0 0 0 1
9 1 0 0 0 1 0 0 0 1
9 1 0 0 0 1 0 0 0 1
9 1 0 0 0 1 0 0 0 1
9 1 0 0 0 1 0 0 0 1
9 1 0 0 0 1 0 0 0 1
9 1 0 0 0 1 0 0 0 1
9 1 0 0 0 1 0 0 0 1
