POINTS:
0.0 0.0 0.0
0.0 0.0 0.1
0.0 0.1 0.0
0.0 0.1 0.1
0.1 0.0 0.0
0.1 0.0 0.1
0.1 0.1 0.0
0.1 0.1 0.1
0.2 0.0 0.0
0.2 0.0 0.1
0.2 0.1 0.0
0.2 0.1 0.1
0.3 0.0 0.0
0.3 0.0 0.1
0.3 0.1 0.0
0.3 0.1 0.1
0.4 0.0 0.0
0.4 0.0 0.1
0.4 0.1 0.0
0.4 0.1 0.1
0.5 0.0 0.0
0.5 0.0 0.1
0.5 0.1 0.0
0.5 0.1 0.1
0.6 0.0 0.0
0.6 0.0 0.1
0.6 0.1 0.0
0.6 0.1 0.1
0.7 0.0 0.0
0.7 0.0 0.1
0.7 0.1 0.0
0.7 0.1 0.1
0.8 0.0 0.0
0.8 0.0 0.1
0.8 0.1 0.0
0.8 0.1 0.1
0.9 0.0 0.0
0.9 0.0 0.1
0.9 0.1 0.0
0.9 0.1 0.1
1.0 0.0 0.0
1.0 0.0 0.1
1.0 0.1 0.0
1.0 0.1 0.1
1.1 0.0 0.0
1.1 0.0 0.1
1.1 0.1 0.0
1.1 0.1 0.1
1.2 0.0 0.0
1.2 0.0 0.1
1.2 0.1 0.0
1.2 0.1 0.1
1.3 0.0 0.0
1.3 0.0 0.1
1.3 0.1 0.0
1.3 0.1 0.1
1.4 0.0 0.0
1.4 0.0 0.1
1.4 0.1 0.0
1.4 0.1 0.1
1.5 0.0 0.0
1.5 0.0 0.1
1.5 0.1 0.0
1.5 0.1 0.1
1.6 0.0 0.0
1.6 0.0 0.1
1.6 0.1 0.0
1.6 0.1 0.1
1.7 0.0 0.0
1.7 0.0 0.1
1.7 0.1 0.0
1.7 0.1 0.1
1.8 0.0 0.0
1.8 0.0 0.1
1.8 0.1 0.0
1.8 0.1 0.1
1.9 0.0 0.0
1.9 0.0 0.1
1.9 0.1 0.0
1.9 0.1 0.1
2.0 0.0 0.0
2.0 0.0 0.1
2.0 0.1 0.0
2.0 0.1 0.1
2.1 0.0 0.0
2.1 0.0 0.1
2.1 0.1 0.0
2.1 0.1 0.1
2.2 0.0 0.0
2.2 0.0 0.1
2.2 0.1 0.0
2.2 0.1 0.1
2.3 0.0 0.0
2.3 0.0 0.1
2.3 0.1 0.0
2.3 0.1 0.1
2.4 0.0 0.0
2.4 0.0 0.1
2.4 0.1 0.0
2.4 0.1 0.1
2.5 0.0 0.0
2.5 0.0 0.1
2.5 0.1 0.0
2.5 0.1 0.1
2.6 0.0 0.0
2.6 0.0 0.1
2.6 0.1 0.0
2.6 0.1 0.1
2.7 0.0 0.0
2.7 0.0 0.1
2.7 0.1 0.0
2.7 0.1 0.1
2.8 0.0 0.0
2.8 0.0 0.1
2.8 0.1 0.0
2.8 0.1 0.1
2.9 0.0 0.0
2.9 0.0 0.1
2.9 0.1 0.0
2.9 0.1 0.1
3.0 0.0 0.0
3.0 0.0 0.1
3.0 0.1 0.0
3.0 0.1 0.1
3.1 0.0 0.0
3.1 0.0 0.1
3.1 0.1 0.0
3.1 0.1 0.1
3.2 0.0 0.0
3.2 0.0 0.1
3.2 0.1 0.0
3.2 0.1 0.1
3.3 0.0 0.0
3.3 0.0 0.1
3.3 0.1 0.0
3.3 0.1 0.1
3.4 0.0 0.0
3.4 0.0 0.1
3.4 0.1 0.0
3.4 0.1 0.1
3.5 0.0 0.0
3.5 0.0 0.1
3.5 0.1 0.0
3.5 0.1 0.1
3.6 0.0 0.0
3.6 0.0 0.1
3.6 0.1 0.0
3.6 0.1 0.1
3.7 0.0 0.0
3.7 0.0 0.1
3.7 0.1 0.0
3.7 0.1 0.1
3.8 0.0 0.0
3.8 0.0 0.1
3.8 0.1 0.0
3.8 0.1 0.1
3.9 0.0 0.0
3.9 0.0 0.1
3.9 0.1 0.0
3.9 0.1 0.1
4.0 0.0 0.0
4.0 0.0 0.1
4.0 0.1 0.0
4.0 0.1 0.1
4.1 0.0 0.0
4.1 0.0 0.1
4.1 0.1 0.0
4.1 0.1 0.1
4.2 0.0 0.0
4.2 0.0 0.1
4.2 0.1 0.0
4.2 0.1 0.1
4.3 0.0 0.0
4.3 0.0 0.1
4.3 0.1 0.0
4.3 0.1 0.1
4.4 0.0 0.0
4.4 0.0 0.1
4.4 0.1 0.0
4.4 0.1 0.1
4.5 0.0 0.0
4.5 0.0 0.1
4.5 0.1 0.0
4.5 0.1 0.1
4.6 0.0 0.0
4.6 0.0 0.1
4.6 0.1 0.0
4.6 0.1 0.1
4.7 0.0 0.0
4.7 0.0 0.1
4.7 0.1 0.0
4.7 0.1 0.1
4.8 0.0 0.0
4.8 0.0 0.1
4.8 0.1 0.0
4.8 0.1 0.1
4.9 0.0 0.0
4.9 0.0 0.1
4.9 0.1 0.0
4.9 0.1 0.1
5.0 0.0 0.0
5.0 0.0 0.1
5.0 0.1 0.0
5.0 0.1 0.1
5.1 0.0 0.0
5.1 0.0 0.1
5.1 0.1 0.0
5.1 0.1 0.1
5.2 0.0 0.0
5.2 0.0 0.1
5.2 0.1 0.0
5.2 0.1 0.1
5.3 0.0 0.0
5.3 0.0 0.1
5.3 0.1 0.0
5.3 0.1 0.1
5.4 0.0 0.0
5.4 0.0 0.1
5.4 0.1 0.0
5.4 0.1 0.1
5.5 0.0 0.0
5.5 0.0 0.1
5.5 0.1 0.0
5.5 0.1 0.1
5.6 0.0 0.0
5.6 0.0 0.1
5.6 0.1 0.0
5.6 0.1 0.1
5.7 0.0 0.0
5.7 0.0 0.1
5.7 0.1 0.0
5.7 0.1 0.1
5.8 0.0 0.0
5.8 0.0 0.1
5.8 0.1 0.0
5.8 0.1 0.1
5.9 0.0 0.0
5.9 0.0 0.1
5.9 0.1 0.0
5.9 0.1 0.1
6.0 0.0 0.0
6.0 0.0 0.1
6.0 0.1 0.0
6.0 0.1 0.1
6.1 0.0 0.0
6.1 0.0 0.1
6.1 0.1 0.0
6.1 0.1 0.1
6.2 0.0 0.0
6.2 0.0 0.1
6.2 0.1 0.0
6.2 0.1 0.1
6.3 0.0 0.0
6.3 0.0 0.1
6.3 0.1 0.0
6.3 0.1 0.1
6.4 0.0 0.0
6.4 0.0 0.1
6.4 0.1 0.0
6.4 0.1 0.1
6.5 0.0 0.0
6.5 0.0 0.1
6.5 0.1 0.0
6.5 0.1 0.1
6.6 0.0 0.0
6.6 0.0 0.1
6.6 0.1 0.0
6.6 0.1 0.1
6.7 0.0 0.0
6.7 0.0 0.1
6.7 0.1 0.0
6.7 0.1 0.1
6.8 0.0 0.0
6.8 0.0 0.1
6.8 0.1 0.0
6.8 0.1 0.1
6.9 0.0 0.0
6.9 0.0 0.1
6.9 0.1 0.0
6.9 0.1 0.1
7.0 0.0 0.0
7.0 0.0 0.1
7.0 0.1 0.0
7.0 0.1 0.1
7.1 0.0 0.0
7.1 0.0 0.1
7.1 0.1 0.0
7.1 0.1 0.1
7.2 0.0 0.0
7.2 0.0 0.1
7.2 0.1 0.0
7.2 0.1 0.1
7.3 0.0 0.0
7.3 0.0 0.1
7.3 0.1 0.0
7.3 0.1 0.1
7.4 0.0 0.0
7.4 0.0 0.1
7.4 0.1 0.0
7.4 0.1 0.1
7.5 0.0 0.0
7.5 0.0 0.1
7.5 0.1 0.0
7.5 0.1 0.1
7.6 0.0 0.0
7.6 0.0 0.1
7.6 0.1 0.0
7.6 0.1 0.1
7.7 0.0 0.0
7.7 0.0 0.1
7.7 0.1 0.0
7.7 0.1 0.1
7.8 0.0 0.0
7.8 0.0 0.1
7.8 0.1 0.0
7.8 0.1 0.1
7.9 0.0 0.0
7.9 0.0 0.1
7.9 0.1 0.0
7.9 0.1 0.1
8.0 0.0 0.0
8.0 0.0 0.1
8.0 0.1 0.0
8.0 0.1 0.1
8.1 0.0 0.0
8.1 0.0 0.1
8.1 0.1 0.0
8.1 0.1 0.1
8.2 0.0 0.0
8.2 0.0 0.1
8.2 0.1 0.0
8.2 0.1 0.1
8.3 0.0 0.0
8.3 0.0 0.1
8.3 0.1 0.0
8.3 0.1 0.1
8.4 0.0 0.0
8.4 0.0 0.1
8.4 0.1 0.0
8.4 0.1 0.1
8.5 0.0 0.0
8.5 0.0 0.1
8.5 0.1 0.0
8.5 0.1 0.1
8.6 0.0 0.0
8.6 0.0 0.1
8.6 0.1 0.0
8.6 0.1 0.1
8.7 0.0 0.0
8.7 0.0 0.1
8.7 0.1 0.0
8.7 0.1 0.1
8.8 0.0 0.0
8.8 0.0 0.1
8.8 0.1 0.0
8.8 0.1 0.1
8.9 0.0 0.0
8.9 0.0 0.1
8.9 0.1 0.0
8.9 0.1 0.1
9.0 0.0 0.0
9.0 0.0 0.1
9.0 0.1 0.0
9.0 0.1 0.1
9.1 0.0 0.0
9.1 0.0 0.1
9.1 0.1 0.0
9.1 0.1 0.1
9.2 0.0 0.0
9.2 0.0 0.1
9.2 0.1 0.0
9.2 0.1 0.1
9.3 0.0 0.0
9.3 0.0 0.1
9.3 0.1 0.0
9.3 0.1 0.1
9.4 0.0 0.0
9.4 0.0 0.1
9.4 0.1 0.0
9.4 0.1 0.1
9.5 0.0 0.0
9.5 0.0 0.1
9.5 0.1 0.0
9.5 0.1 0.1
9.6 0.0 0.0
9.6 0.0 0.1
9.6 0.1 0.0
9.6 0.1 0.1
9.7 0.0 0.0
9.7 0.0 0.1
9.7 0.1 0.0
9.7 0.1 0.1
9.8 0.0 0.0
9.8 0.0 0.1
9.8 0.1 0.0
9.8 0.1 0.1
9.9 0.0 0.0
9.9 0.0 0.1
9.9 0.1 0.0
9.9 0.1 0.1
10.0 0.0 0.0
10.0 0.0 0.1
10.0 0.1 0.0
10.0 0.1 0.1
CELLS:
4 0 0 2 3 7
4 0 0 2 6 7
4 0 0 4 6 7
4 0 0 4 5 7
4 0 0 1 5 7
4 0 0 1 3 7
4 0 4 6 7 11
4 0 4 6 10 11
4 0 4 8 10 11
4 0 4 8 9 11
4 0 4 5 9 11
4 0 4 5 7 11
4 0 8 10 11 15
4 0 8 10 14 15
4 0 8 12 14 15
4 0 8 12 13 15
4 0 8 9 13 15
4 0 8 9 11 15
4 0 12 14 15 19
4 0 12 14 18 19
4 0 12 16 18 19
4 0 12 16 17 19
4 0 12 13 17 19
4 0 12 13 15 19
4 0 16 18 19 23
4 0 16 18 22 23
4 0 16 20 22 23
4 0 16 20 21 23
4 0 16 17 21 23
4 0 16 17 19 23
4 0 20 22 23 27
4 0 20 22 26 27
4 0 20 24 26 27
4 0 20 24 25 27
4 0 20 21 25 27
4 0 20 21 23 27
4 0 24 26 27 31
4 0 24 26 30 31
4 0 24 28 30 31
4 0 24 28 29 31
4 0 24 25 29 31
4 0 24 25 27 31
4 0 28 30 31 35
4 0 28 30 34 35
4 0 28 32 34 35
4 0 28 32 33 35
4 0 28 29 33 35
4 0 28 29 31 35
4 0 32 34 35 39
4 0 32 34 38 39
4 0 32 36 38 39
4 0 32 36 37 39
4 0 32 33 37 39
4 0 32 33 35 39
4 0 36 38 39 43
4 0 36 38 42 43
4 0 36 40 42 43
4 0 36 40 41 43
4 0 36 37 41 43
4 0 36 37 39 43
4 0 40 42 43 47
4 0 40 42 46 47
4 0 40 44 46 47
4 0 40 44 45 47
4 0 40 41 45 47
4 0 40 41 43 47
4 0 44 46 47 51
4 0 44 46 50 51
4 0 44 48 50 51
4 0 44 48 49 51
4 0 44 45 49 51
4 0 44 45 47 51
4 0 48 50 51 55
4 0 48 50 54 55
4 0 48 52 54 55
4 0 48 52 53 55
4 0 48 49 53 55
4 0 48 49 51 55
4 0 52 54 55 59
4 0 52 54 58 59
4 0 52 56 58 59
4 0 52 56 57 59
4 0 52 53 57 59
4 0 52 53 55 59
4 0 56 58 59 63
4 0 56 58 62 63
4 0 56 60 62 63
4 0 56 60 61 63
4 0 56 57 61 63
4 0 56 57 59 63
4 0 60 62 63 67
4 0 60 62 66 67
4 0 60 64 66 67
4 0 60 64 65 67
4 0 60 61 65 67
4 0 60 61 63 67
4 0 64 66 67 71
4 0 64 66 70 71
4 0 64 68 70 71
4 0 64 68 69 71
4 0 64 65 69 71
4 0 64 65 67 71
4 0 68 70 71 75
4 0 68 70 74 75
4 0 68 72 74 75
4 0 68 72 73 75
4 0 68 69 73 75
4 0 68 69 71 75
4 0 72 74 75 79
4 0 72 74 78 79
4 0 72 76 78 79
4 0 72 76 77 79
4 0 72 73 77 79
4 0 72 73 75 79
4 0 76 78 79 83
4 0 76 78 82 83
4 0 76 80 82 83
4 0 76 80 81 83
4 0 76 77 81 83
4 0 76 77 79 83
4 0 80 82 83 87
4 0 80 82 86 87
4 0 80 84 86 87
4 0 80 84 85 87
4 0 80 81 85 87
4 0 80 81 83 87
4 0 84 86 87 91
4 0 84 86 90 91
4 0 84 88 90 91
4 0 84 88 89 91
4 0 84 85 89 91
4 0 84 85 87 91
4 0 88 90 91 95
4 0 88 90 94 95
4 0 88 92 94 95
4 0 88 92 93 95
4 0 88 89 93 95
4 0 88 89 91 95
4 0 92 94 95 99
4 0 92 94 98 99
4 0 92 96 98 99
4 0 92 96 97 99
4 0 92 93 97 99
4 0 92 93 95 99
4 0 96 98 99 103
4 0 96 98 102 103
4 0 96 100 102 103
4 0 96 100 101 103
4 0 96 97 101 103
4 0 96 97 99 103
4 0 100 102 103 107
4 0 100 102 106 107
4 0 100 104 106 107
4 0 100 104 105 107
4 0 100 101 105 107
4 0 100 101 103 107
4 0 104 106 107 111
4 0 104 106 110 111
4 0 104 108 110 111
4 0 104 108 109 111
4 0 104 105 109 111
4 0 104 105 107 111
4 0 108 110 111 115
4 0 108 110 114 115
4 0 108 112 114 115
4 0 108 112 113 115
4 0 108 109 113 115
4 0 108 109 111 115
4 0 112 114 115 119
4 0 112 114 118 119
4 0 112 116 118 119
4 0 112 116 117 119
4 0 112 113 117 119
4 0 112 113 115 119
4 0 116 118 119 123
4 0 116 118 122 123
4 0 116 120 122 123
4 0 116 120 121 123
4 0 116 117 121 123
4 0 116 117 119 123
4 0 120 122 123 127
4 0 120 122 126 127
4 0 120 124 126 127
4 0 120 124 125 127
4 0 120 121 125 127
4 0 120 121 123 127
4 0 124 126 127 131
4 0 124 126 130 131
4 0 124 128 130 131
4 0 124 128 129 131
4 0 124 125 129 131
4 0 124 125 127 131
4 0 128 130 131 135
4 0 128 130 134 135
4 0 128 132 134 135
4 0 128 132 133 135
4 0 128 129 133 135
4 0 128 129 131 135
4 0 132 134 135 139
4 0 132 134 138 139
4 0 132 136 138 139
4 0 132 136 137 139
4 0 132 133 137 139
4 0 132 133 135 139
4 0 136 138 139 143
4 0 136 138 142 143
4 0 136 140 142 143
4 0 136 140 141 143
4 0 136 137 141 143
4 0 136 137 139 143
4 0 140 142 143 147
4 0 140 142 146 147
4 0 140 144 146 147
4 0 140 144 145 147
4 0 140 141 145 147
4 0 140 141 143 147
4 0 144 146 147 151
4 0 144 146 150 151
4 0 144 148 150 151
4 0 144 148 149 151
4 0 144 145 149 151
4 0 144 145 147 151
4 0 148 150 151 155
4 0 148 150 154 155
4 0 148 152 154 155
4 0 148 152 153 155
4 0 148 149 153 155
4 0 148 149 151 155
4 0 152 154 155 159
4 0 152 154 158 159
4 0 152 156 158 159
4 0 152 156 157 159
4 0 152 153 157 159
4 0 152 153 155 159
4 0 156 158 159 163
4 0 156 158 162 163
4 0 156 160 162 163
4 0 156 160 161 163
4 0 156 157 161 163
4 0 156 157 159 163
4 0 160 162 163 167
4 0 160 162 166 167
4 0 160 164 166 167
4 0 160 164 165 167
4 0 160 161 165 167
4 0 160 161 163 167
4 0 164 166 167 171
4 0 164 166 170 171
4 0 164 168 170 171
4 0 164 168 169 171
4 0 164 165 169 171
4 0 164 165 167 171
4 0 168 170 171 175
4 0 168 170 174 175
4 0 168 172 174 175
4 0 168 172 173 175
4 0 168 169 173 175
4 0 168 169 171 175
4 0 172 174 175 179
4 0 172 174 178 179
4 0 172 176 178 179
4 0 172 176 177 179
4 0 172 173 177 179
4 0 172 173 175 179
4 0 176 178 179 183
4 0 176 178 182 183
4 0 176 180 182 183
4 0 176 180 181 183
4 0 176 177 181 183
4 0 176 177 179 183
4 0 180 182 183 187
4 0 180 182 186 187
4 0 180 184 186 187
4 0 180 184 185 187
4 0 180 181 185 187
4 0 180 181 183 187
4 0 184 186 187 191
4 0 184 186 190 191
4 0 184 188 190 191
4 0 184 188 189 191
4 0 184 185 189 191
4 0 184 185 187 191
4 0 188 190 191 195
4 0 188 190 194 195
4 0 188 192 194 195
4 0 188 192 193 195
4 0 188 189 193 195
4 0 188 189 191 195
4 0 192 194 195 199
4 0 192 194 198 199
4 0 192 196 198 199
4 0 192 196 197 199
4 0 192 193 197 199
4 0 192 193 195 199
4 0 196 198 199 203
4 0 196 198 202 203
4 0 196 200 202 203
4 0 196 200 201 203
4 0 196 197 201 203
4 0 196 197 199 203
4 0 200 202 203 207
4 0 200 202 206 207
4 0 200 204 206 207
4 0 200 204 205 207
4 0 200 201 205 207
4 0 200 201 203 207
4 0 204 206 207 211
4 0 204 206 210 211
4 0 204 208 210 211
4 0 204 208 209 211
4 0 204 205 209 211
4 0 204 205 207 211
4 0 208 210 211 215
4 0 208 210 214 215
4 0 208 212 214 215
4 0 208 212 213 215
4 0 208 209 213 215
4 0 208 209 211 215
4 0 212 214 215 219
4 0 212 214 218 219
4 0 212 216 218 219
4 0 212 216 217 219
4 0 212 213 217 219
4 0 212 213 215 219
4 0 216 218 219 223
4 0 216 218 222 223
4 0 216 220 222 223
4 0 216 220 221 223
4 0 216 217 221 223
4 0 216 217 219 223
4 0 220 222 223 227
4 0 220 222 226 227
4 0 220 224 226 227
4 0 220 224 225 227
4 0 220 221 225 227
4 0 220 221 223 227
4 0 224 226 227 231
4 0 224 226 230 231
4 0 224 228 230 231
4 0 224 228 229 231
4 0 224 225 229 231
4 0 224 225 227 231
4 0 228 230 231 235
4 0 228 230 234 235
4 0 228 232 234 235
4 0 228 232 233 235
4 0 228 229 233 235
4 0 228 229 231 235
4 0 232 234 235 239
4 0 232 234 238 239
4 0 232 236 238 239
4 0 232 236 237 239
4 0 232 233 237 239
4 0 232 233 235 239
4 0 236 238 239 243
4 0 236 238 242 243
4 0 236 240 242 243
4 0 236 240 241 243
4 0 236 237 241 243
4 0 236 237 239 243
4 0 240 242 243 247
4 0 240 242 246 247
4 0 240 244 246 247
4 0 240 244 245 247
4 0 240 241 245 247
4 0 240 241 243 247
4 0 244 246 247 251
4 0 244 246 250 251
4 0 244 248 250 251
4 0 244 248 249 251
4 0 244 245 249 251
4 0 244 245 247 251
4 0 248 250 251 255
4 0 248 250 254 255
4 0 248 252 254 255
4 0 248 252 253 255
4 0 248 249 253 255
4 0 248 249 251 255
4 0 252 254 255 259
4 0 252 254 258 259
4 0 252 256 258 259
4 0 252 256 257 259
4 0 252 253 257 259
4 0 252 253 255 259
4 0 256 258 259 263
4 0 256 258 262 263
4 0 256 260 262 263
4 0 256 260 261 263
4 0 256 257 261 263
4 0 256 257 259 263
4 0 260 262 263 267
4 0 260 262 266 267
4 0 260 264 266 267
4 0 260 264 265 267
4 0 260 261 265 267
4 0 260 261 263 267
4 0 264 266 267 271
4 0 264 266 270 271
4 0 264 268 270 271
4 0 264 268 269 271
4 0 264 265 269 271
4 0 264 265 267 271
4 0 268 270 271 275
4 0 268 270 274 275
4 0 268 272 274 275
4 0 268 272 273 275
4 0 268 269 273 275
4 0 268 269 271 275
4 0 272 274 275 279
4 0 272 274 278 279
4 0 272 276 278 279
4 0 272 276 277 279
4 0 272 273 277 279
4 0 272 273 275 279
4 0 276 278 279 283
4 0 276 278 282 283
4 0 276 280 282 283
4 0 276 280 281 283
4 0 276 277 281 283
4 0 276 277 279 283
4 0 280 282 283 287
4 0 280 282 286 287
4 0 280 284 286 287
4 0 280 284 285 287
4 0 280 281 285 287
4 0 280 281 283 287
4 0 284 286 287 291
4 0 284 286 290 291
4 0 284 288 290 291
4 0 284 288 289 291
4 0 284 285 289 291
4 0 284 285 287 291
4 0 288 290 291 295
4 0 288 290 294 295
4 0 288 292 294 295
4 0 288 292 293 295
4 0 288 289 293 295
4 0 288 289 291 295
4 0 292 294 295 299
4 0 292 294 298 299
4 0 292 296 298 299
4 0 292 296 297 299
4 0 292 293 297 299
4 0 292 293 295 299
4 0 296 298 299 303
4 0 296 298 302 303
4 0 296 300 302 303
4 0 296 300 301 303
4 0 296 297 301 303
4 0 296 297 299 303
4 0 300 302 303 307
4 0 300 302 306 307
4 0 300 304 306 307
4 0 300 304 305 307
4 0 300 301 305 307
4 0 300 301 303 307
4 0 304 306 307 311
4 0 304 306 310 311
4 0 304 308 310 311
4 0 304 308 309 311
4 0 304 305 309 311
4 0 304 305 307 311
4 0 308 310 311 315
4 0 308 310 314 315
4 0 308 312 314 315
4 0 308 312 313 315
4 0 308 309 313 315
4 0 308 309 311 315
4 0 312 314 315 319
4 0 312 314 318 319
4 0 312 316 318 319
4 0 312 316 317 319
4 0 312 313 317 319
4 0 312 313 315 319
4 0 316 318 319 323
4 0 316 318 322 323
4 0 316 320 322 323
4 0 316 320 321 323
4 0 316 317 321 323
4 0 316 317 319 323
4 0 320 322 323 327
4 0 320 322 326 327
4 0 320 324 326 327
4 0 320 324 325 327
4 0 320 321 325 327
4 0 320 321 323 327
4 0 324 326 327 331
4 0 324 326 330 331
4 0 324 328 330 331
4 0 324 328 329 331
4 0 324 325 329 331
4 0 324 325 327 331
4 0 328 330 331 335
4 0 328 330 334 335
4 0 328 332 334 335
4 0 328 332 333 335
4 0 328 329 333 335
4 0 328 329 331 335
4 0 332 334 335 339
4 0 332 334 338 339
4 0 332 336 338 339
4 0 332 336 337 339
4 0 332 333 337 339
4 0 332 333 335 339
4 0 336 338 339 343
4 0 336 338 342 343
4 0 336 340 342 343
4 0 336 340 341 343
4 0 336 337 341 343
4 0 336 337 339 343
4 0 340 342 343 347
4 0 340 342 346 347
4 0 340 344 346 347
4 0 340 344 345 347
4 0 340 341 345 347
4 0 340 341 343 347
4 0 344 346 347 351
4 0 344 346 350 351
4 0 344 348 350 351
4 0 344 348 349 351
4 0 344 345 349 351
4 0 344 345 347 351
4 0 348 350 351 355
4 0 348 350 354 355
4 0 348 352 354 355
4 0 348 352 353 355
4 0 348 349 353 355
4 0 348 349 351 355
4 0 352 354 355 359
4 0 352 354 358 359
4 0 352 356 358 359
4 0 352 356 357 359
4 0 352 353 357 359
4 0 352 353 355 359
4 0 356 358 359 363
4 0 356 358 362 363
4 0 356 360 362 363
4 0 356 360 361 363
4 0 356 357 361 363
4 0 356 357 359 363
4 0 360 362 363 367
4 0 360 362 366 367
4 0 360 364 366 367
4 0 360 364 365 367
4 0 360 361 365 367
4 0 360 361 363 367
4 0 364 366 367 371
4 0 364 366 370 371
4 0 364 368 370 371
4 0 364 368 369 371
4 0 364 365 369 371
4 0 364 365 367 371
4 0 368 370 371 375
4 0 368 370 374 375
4 0 368 372 374 375
4 0 368 372 373 375
4 0 368 369 373 375
4 0 368 369 371 375
4 0 372 374 375 379
4 0 372 374 378 379
4 0 372 376 378 379
4 0 372 376 377 379
4 0 372 373 377 379
4 0 372 373 375 379
4 0 376 378 379 383
4 0 376 378 382 383
4 0 376 380 382 383
4 0 376 380 381 383
4 0 376 377 381 383
4 0 376 377 379 383
4 0 380 382 383 387
4 0 380 382 386 387
4 0 380 384 386 387
4 0 380 384 385 387
4 0 380 381 385 387
4 0 380 381 383 387
4 0 384 386 387 391
4 0 384 386 390 391
4 0 384 388 390 391
4 0 384 388 389 391
4 0 384 385 389 391
4 0 384 385 387 391
4 0 388 390 391 395
4 0 388 390 394 395
4 0 388 392 394 395
4 0 388 392 393 395
4 0 388 389 393 395
4 0 388 389 391 395
4 0 392 394 395 399
4 0 392 394 398 399
4 0 392 396 398 399
4 0 392 396 397 399
4 0 392 393 397 399
4 0 392 393 395 399
4 0 396 398 399 403
4 0 396 398 402 403
4 0 396 400 402 403
4 0 396 400 401 403
4 0 396 397 401 403
4 0 396 397 399 403
FACES:
3 199 0 2 3
3 199 0 3 1
3 0 400 402 403
3 0 400 403 401
3 0 7 5 1
3 0 7 1 3
3 0 6 4 0
3 0 6 0 2
3 0 11 9 5
3 0 11 5 7
3 0 10 8 4
3 0 10 4 6
3 0 15 13 9
3 0 15 9 11
3 0 14 12 8
3 0 14 8 10
3 0 19 17 13
3 0 19 13 15
3 0 18 16 12
3 0 18 12 14
3 0 23 21 17
3 0 23 17 19
3 0 22 20 16
3 0 22 16 18
3 0 27 25 21
3 0 27 21 23
3 0 26 24 20
3 0 26 20 22
3 0 31 29 25
3 0 31 25 27
3 0 30 28 24
3 0 30 24 26
3 0 35 33 29
3 0 35 29 31
3 0 34 32 28
3 0 34 28 30
3 0 39 37 33
3 0 39 33 35
3 0 38 36 32
3 0 38 32 34
3 0 43 41 37
3 0 43 37 39
3 0 42 40 36
3 0 42 36 38
3 0 47 45 41
3 0 47 41 43
3 0 46 44 40
3 0 46 40 42
3 0 51 49 45
3 0 51 45 47
3 0 50 48 44
3 0 50 44 46
3 0 55 53 49
3 0 55 49 51
3 0 54 52 48
3 0 54 48 50
3 0 59 57 53
3 0 59 53 55
3 0 58 56 52
3 0 58 52 54
3 0 63 61 57
3 0 63 57 59
3 0 62 60 56
3 0 62 56 58
3 0 67 65 61
3 0 67 61 63
3 0 66 64 60
3 0 66 60 62
3 0 71 69 65
3 0 71 65 67
3 0 70 68 64
3 0 70 64 66
3 0 75 73 69
3 0 75 69 71
3 0 74 72 68
3 0 74 68 70
3 0 79 77 73
3 0 79 73 75
3 0 78 76 72
3 0 78 72 74
3 0 83 81 77
3 0 83 77 79
3 0 82 80 76
3 0 82 76 78
3 0 87 85 81
3 0 87 81 83
3 0 86 84 80
3 0 86 80 82
3 0 91 89 85
3 0 91 85 87
3 0 90 88 84
3 0 90 84 86
3 0 95 93 89
3 0 95 89 91
3 0 94 92 88
3 0 94 88 90
3 0 99 97 93
3 0 99 93 95
3 0 98 96 92
3 0 98 92 94
3 0 103 101 97
3 0 103 97 99
3 0 102 100 96
3 0 102 96 98
3 0 107 105 101
3 0 107 101 103
3 0 106 104 100
3 0 106 100 102
3 0 111 109 105
3 0 111 105 107
3 0 110 108 104
3 0 110 104 106
3 0 115 113 109
3 0 115 109 111
3 0 114 112 108
3 0 114 108 110
3 0 119 117 113
3 0 119 113 115
3 0 118 116 112
3 0 118 112 114
3 0 123 121 117
3 0 123 117 119
3 0 122 120 116
3 0 122 116 118
3 0 127 125 121
3 0 127 121 123
3 0 126 124 120
3 0 126 120 122
3 0 131 129 125
3 0 131 125 127
3 0 130 128 124
3 0 130 124 126
3 0 135 133 129
3 0 135 129 131
3 0 134 132 128
3 0 134 128 130
3 0 139 137 133
3 0 139 133 135
3 0 138 136 132
3 0 138 132 134
3 0 143 141 137
3 0 143 137 139
3 0 142 140 136
3 0 142 136 138
3 0 147 145 141
3 0 147 141 143
3 0 146 144 140
3 0 146 140 142
3 0 151 149 145
3 0 151 145 147
3 0 150 148 144
3 0 150 144 146
3 0 155 153 149
3 0 155 149 151
3 0 154 152 148
3 0 154 148 150
3 0 159 157 153
3 0 159 153 155
3 0 158 156 152
3 0 158 152 154
3 0 163 161 157
3 0 163 157 159
3 0 162 160 156
3 0 162 156 158
3 0 167 165 161
3 0 167 161 163
3 0 166 164 160
3 0 166 160 162
3 0 171 169 165
3 0 171 165 167
3 0 170 168 164
3 0 170 164 166
3 0 175 173 169
3 0 175 169 171
3 0 174 172 168
3 0 174 168 170
3 0 179 177 173
3 0 179 173 175
3 0 178 176 172
3 0 178 172 174
3 0 183 181 177
3 0 183 177 179
3 0 182 180 176
3 0 182 176 178
3 0 187 185 181
3 0 187 181 183
3 0 186 184 180
3 0 186 180 182
3 0 191 189 185
3 0 191 185 187
3 0 190 188 184
3 0 190 184 186
3 0 195 193 189
3 0 195 189 191
3 0 194 192 188
3 0 194 188 190
3 0 199 197 193
3 0 199 193 195
3 0 198 196 192
3 0 198 192 194
3 0 203 201 197
3 0 203 197 199
3 0 202 200 196
3 0 202 196 198
3 0 207 205 201
3 0 207 201 203
3 0 206 204 200
3 0 206 200 202
3 0 211 209 205
3 0 211 205 207
3 0 210 208 204
3 0 210 204 206
3 0 215 213 209
3 0 215 209 211
3 0 214 212 208
3 0 214 208 210
3 0 219 217 213
3 0 219 213 215
3 0 218 216 212
3 0 218 212 214
3 0 223 221 217
3 0 223 217 219
3 0 222 220 216
3 0 222 216 218
3 0 227 225 221
3 0 227 221 223
3 0 226 224 220
3 0 226 220 222
3 0 231 229 225
3 0 231 225 227
3 0 230 228 224
3 0 230 224 226
3 0 235 233 229
3 0 235 229 231
3 0 234 232 228
3 0 234 228 230
3 0 239 237 233
3 0 239 233 235
3 0 238 236 232
3 0 238 232 234
3 0 243 241 237
3 0 243 237 239
3 0 242 240 236
3 0 242 236 238
3 0 247 245 241
3 0 247 241 243
3 0 246 244 240
3 0 246 240 242
3 0 251 249 245
3 0 251 245 247
3 0 250 248 244
3 0 250 244 246
3 0 255 253 249
3 0 255 249 251
3 0 254 252 248
3 0 254 248 250
3 0 259 257 253
3 0 259 253 255
3 0 258 256 252
3 0 258 252 254
3 0 263 261 257
3 0 263 257 259
3 0 262 260 256
3 0 262 256 258
3 0 267 265 261
3 0 267 261 263
3 0 266 264 260
3 0 266 260 262
3 0 271 269 265
3 0 271 265 267
3 0 270 268 264
3 0 270 264 266
3 0 275 273 269
3 0 275 269 271
3 0 274 272 268
3 0 274 268 270
3 0 279 277 273
3 0 279 273 275
3 0 278 276 272
3 0 278 272 274
3 0 283 281 277
3 0 283 277 279
3 0 282 280 276
3 0 282 276 278
3 0 287 285 281
3 0 287 281 283
3 0 286 284 280
3 0 286 280 282
3 0 291 289 285
3 0 291 285 287
3 0 290 288 284
3 0 290 284 286
3 0 295 293 289
3 0 295 289 291
3 0 294 292 288
3 0 294 288 290
3 0 299 297 293
3 0 299 293 295
3 0 298 296 292
3 0 298 292 294
3 0 303 301 297
3 0 303 297 299
3 0 302 300 296
3 0 302 296 298
3 0 307 305 301
3 0 307 301 303
3 0 306 304 300
3 0 306 300 302
3 0 311 309 305
3 0 311 305 307
3 0 310 308 304
3 0 310 304 306
3 0 315 313 309
3 0 315 309 311
3 0 314 312 308
3 0 314 308 310
3 0 319 317 313
3 0 319 313 315
3 0 318 316 312
3 0 318 312 314
3 0 323 321 317
3 0 323 317 319
3 0 322 320 316
3 0 322 316 318
3 0 327 325 321
3 0 327 321 323
3 0 326 324 320
3 0 326 320 322
3 0 331 329 325
3 0 331 325 327
3 0 330 328 324
3 0 330 324 326
3 0 335 333 329
3 0 335 329 331
3 0 334 332 328
3 0 334 328 330
3 0 339 337 333
3 0 339 333 335
3 0 338 336 332
3 0 338 332 334
3 0 343 341 337
3 0 343 337 339
3 0 342 340 336
3 0 342 336 338
3 0 347 345 341
3 0 347 341 343
3 0 346 344 340
3 0 346 340 342
3 0 351 349 345
3 0 351 345 347
3 0 350 348 344
3 0 350 344 346
3 0 355 353 349
3 0 355 349 351
3 0 354 352 348
3 0 354 348 350
3 0 359 357 353
3 0 359 353 355
3 0 358 356 352
3 0 358 352 354
3 0 363 361 357
3 0 363 357 359
3 0 362 360 356
3 0 362 356 358
3 0 367 365 361
3 0 367 361 363
3 0 366 364 360
3 0 366 360 362
3 0 371 369 365
3 0 371 365 367
3 0 370 368 364
3 0 370 364 366
3 0 375 373 369
3 0 375 369 371
3 0 374 372 368
3 0 374 368 370
3 0 379 377 373
3 0 379 373 375
3 0 378 376 372
3 0 378 372 374
3 0 383 381 377
3 0 383 377 379
3 0 382 380 376
3 0 382 376 378
3 0 387 385 381
3 0 387 381 383
3 0 386 384 380
3 0 386 380 382
3 0 391 389 385
3 0 391 385 387
3 0 390 388 384
3 0 390 384 386
3 0 395 393 389
3 0 395 389 391
3 0 394 392 388
3 0 394 388 390
3 0 399 397 393
3 0 399 393 395
3 0 398 396 392
3 0 398 392 394
3 0 403 401 397
3 0 403 397 399
3 0 402 400 396
3 0 402 396 398
3 0 0 4 5
3 0 0 5 1
3 0 2 6 7
3 0 2 7 3
3 0 4 8 9
3 0 4 9 5
3 0 6 10 11
3 0 6 11 7
3 0 8 12 13
3 0 8 13 9
3 0 10 14 15
3 0 10 15 11
3 0 12 16 17
3 0 12 17 13
3 0 14 18 19
3 0 14 19 15
3 0 16 20 21
3 0 16 21 17
3 0 18 22 23
3 0 18 23 19
3 0 20 24 25
3 0 20 25 21
3 0 22 26 27
3 0 22 27 23
3 0 24 28 29
3 0 24 29 25
3 0 26 30 31
3 0 26 31 27
3 0 28 32 33
3 0 28 33 29
3 0 30 34 35
3 0 30 35 31
3 0 32 36 37
3 0 32 37 33
3 0 34 38 39
3 0 34 39 35
3 0 36 40 41
3 0 36 41 37
3 0 38 42 43
3 0 38 43 39
3 0 40 44 45
3 0 40 45 41
3 0 42 46 47
3 0 42 47 43
3 0 44 48 49
3 0 44 49 45
3 0 46 50 51
3 0 46 51 47
3 0 48 52 53
3 0 48 53 49
3 0 50 54 55
3 0 50 55 51
3 0 52 56 57
3 0 52 57 53
3 0 54 58 59
3 0 54 59 55
3 0 56 60 61
3 0 56 61 57
3 0 58 62 63
3 0 58 63 59
3 0 60 64 65
3 0 60 65 61
3 0 62 66 67
3 0 62 67 63
3 0 64 68 69
3 0 64 69 65
3 0 66 70 71
3 0 66 71 67
3 0 68 72 73
3 0 68 73 69
3 0 70 74 75
3 0 70 75 71
3 0 72 76 77
3 0 72 77 73
3 0 74 78 79
3 0 74 79 75
3 0 76 80 81
3 0 76 81 77
3 0 78 82 83
3 0 78 83 79
3 0 80 84 85
3 0 80 85 81
3 0 82 86 87
3 0 82 87 83
3 0 84 88 89
3 0 84 89 85
3 0 86 90 91
3 0 86 91 87
3 0 88 92 93
3 0 88 93 89
3 0 90 94 95
3 0 90 95 91
3 0 92 96 97
3 0 92 97 93
3 0 94 98 99
3 0 94 99 95
3 0 96 100 101
3 0 96 101 97
3 0 98 102 103
3 0 98 103 99
3 0 100 104 105
3 0 100 105 101
3 0 102 106 107
3 0 102 107 103
3 0 104 108 109
3 0 104 109 105
3 0 106 110 111
3 0 106 111 107
3 0 108 112 113
3 0 108 113 109
3 0 110 114 115
3 0 110 115 111
3 0 112 116 117
3 0 112 117 113
3 0 114 118 119
3 0 114 119 115
3 0 116 120 121
3 0 116 121 117
3 0 118 122 123
3 0 118 123 119
3 0 120 124 125
3 0 120 125 121
3 0 122 126 127
3 0 122 127 123
3 0 124 128 129
3 0 124 129 125
3 0 126 130 131
3 0 126 131 127
3 0 128 132 133
3 0 128 133 129
3 0 130 134 135
3 0 130 135 131
3 0 132 136 137
3 0 132 137 133
3 0 134 138 139
3 0 134 139 135
3 0 136 140 141
3 0 136 141 137
3 0 138 142 143
3 0 138 143 139
3 0 140 144 145
3 0 140 145 141
3 0 142 146 147
3 0 142 147 143
3 0 144 148 149
3 0 144 149 145
3 0 146 150 151
3 0 146 151 147
3 0 148 152 153
3 0 148 153 149
3 0 150 154 155
3 0 150 155 151
3 0 152 156 157
3 0 152 157 153
3 0 154 158 159
3 0 154 159 155
3 0 156 160 161
3 0 156 161 157
3 0 158 162 163
3 0 158 163 159
3 0 160 164 165
3 0 160 165 161
3 0 162 166 167
3 0 162 167 163
3 0 164 168 169
3 0 164 169 165
3 0 166 170 171
3 0 166 171 167
3 0 168 172 173
3 0 168 173 169
3 0 170 174 175
3 0 170 175 171
3 0 172 176 177
3 0 172 177 173
3 0 174 178 179
3 0 174 179 175
3 0 176 180 181
3 0 176 181 177
3 0 178 182 183
3 0 178 183 179
3 0 180 184 185
3 0 180 185 181
3 0 182 186 187
3 0 182 187 183
3 0 184 188 189
3 0 184 189 185
3 0 186 190 191
3 0 186 191 187
3 0 188 192 193
3 0 188 193 189
3 0 190 194 195
3 0 190 195 191
3 0 192 196 197
3 0 192 197 193
3 0 194 198 199
3 0 194 199 195
3 0 196 200 201
3 0 196 201 197
3 0 198 202 203
3 0 198 203 199
3 0 200 204 205
3 0 200 205 201
3 0 202 206 207
3 0 202 207 203
3 0 204 208 209
3 0 204 209 205
3 0 206 210 211
3 0 206 211 207
3 0 208 212 213
3 0 208 213 209
3 0 210 214 215
3 0 210 215 211
3 0 212 216 217
3 0 212 217 213
3 0 214 218 219
3 0 214 219 215
3 0 216 220 221
3 0 216 221 217
3 0 218 222 223
3 0 218 223 219
3 0 220 224 225
3 0 220 225 221
3 0 222 226 227
3 0 222 227 223
3 0 224 228 229
3 0 224 229 225
3 0 226 230 231
3 0 226 231 227
3 0 228 232 233
3 0 228 233 229
3 0 230 234 235
3 0 230 235 231
3 0 232 236 237
3 0 232 237 233
3 0 234 238 239
3 0 234 239 235
3 0 236 240 241
3 0 236 241 237
3 0 238 242 243
3 0 238 243 239
3 0 240 244 245
3 0 240 245 241
3 0 242 246 247
3 0 242 247 243
3 0 244 248 249
3 0 244 249 245
3 0 246 250 251
3 0 246 251 247
3 0 248 252 253
3 0 248 253 249
3 0 250 254 255
3 0 250 255 251
3 0 252 256 257
3 0 252 257 253
3 0 254 258 259
3 0 254 259 255
3 0 256 260 261
3 0 256 261 257
3 0 258 262 263
3 0 258 263 259
3 0 260 264 265
3 0 260 265 261
3 0 262 266 267
3 0 262 267 263
3 0 264 268 269
3 0 264 269 265
3 0 266 270 271
3 0 266 271 267
3 0 268 272 273
3 0 268 273 269
3 0 270 274 275
3 0 270 275 271
3 0 272 276 277
3 0 272 277 273
3 0 274 278 279
3 0 274 279 275
3 0 276 280 281
3 0 276 281 277
3 0 278 282 283
3 0 278 283 279
3 0 280 284 285
3 0 280 285 281
3 0 282 286 287
3 0 282 287 283
3 0 284 288 289
3 0 284 289 285
3 0 286 290 291
3 0 286 291 287
3 0 288 292 293
3 0 288 293 289
3 0 290 294 295
3 0 290 295 291
3 0 292 296 297
3 0 292 297 293
3 0 294 298 299
3 0 294 299 295
3 0 296 300 301
3 0 296 301 297
3 0 298 302 303
3 0 298 303 299
3 0 300 304 305
3 0 300 305 301
3 0 302 306 307
3 0 302 307 303
3 0 304 308 309
3 0 304 309 305
3 0 306 310 311
3 0 306 311 307
3 0 308 312 313
3 0 308 313 309
3 0 310 314 315
3 0 310 315 311
3 0 312 316 317
3 0 312 317 313
3 0 314 318 319
3 0 314 319 315
3 0 316 320 321
3 0 316 321 317
3 0 318 322 323
3 0 318 323 319
3 0 320 324 325
3 0 320 325 321
3 0 322 326 327
3 0 322 327 323
3 0 324 328 329
3 0 324 329 325
3 0 326 330 331
3 0 326 331 327
3 0 328 332 333
3 0 328 333 329
3 0 330 334 335
3 0 330 335 331
3 0 332 336 337
3 0 332 337 333
3 0 334 338 339
3 0 334 339 335
3 0 336 340 341
3 0 336 341 337
3 0 338 342 343
3 0 338 343 339
3 0 340 344 345
3 0 340 345 341
3 0 342 346 347
3 0 342 347 343
3 0 344 348 349
3 0 344 349 345
3 0 346 350 351
3 0 346 351 347
3 0 348 352 353
3 0 348 353 349
3 0 350 354 355
3 0 350 355 351
3 0 352 356 357
3 0 352 357 353
3 0 354 358 359
3 0 354 359 355
3 0 356 360 361
3 0 356 361 357
3 0 358 362 363
3 0 358 363 359
3 0 360 364 365
3 0 360 365 361
3 0 362 366 367
3 0 362 367 363
3 0 364 368 369
3 0 364 369 365
3 0 366 370 371
3 0 366 371 367
3 0 368 372 373
3 0 368 373 369
3 0 370 374 375
3 0 370 375 371
3 0 372 376 377
3 0 372 377 373
3 0 374 378 379
3 0 374 379 375
3 0 376 380 381
3 0 376 381 377
3 0 378 382 383
3 0 378 383 379
3 0 380 384 385
3 0 380 385 381
3 0 382 386 387
3 0 382 387 383
3 0 384 388 389
3 0 384 389 385
3 0 386 390 391
3 0 386 391 387
3 0 388 392 393
3 0 388 393 389
3 0 390 394 395
3 0 390 395 391
3 0 392 396 397
3 0 392 397 393
3 0 394 398 399
3 0 394 399 395
3 0 396 400 401
3 0 396 401 397
3 0 398 402 403
3 0 398 403 399
VDATA:
3 0.0 0.002 20
3 0.0 0.002 20
3 0.0 0.002 20
3 0.0 0.002 20
3 0.0 0.002 20
3 0.0 0.002 20
3 0.0 0.002 20
3 0.0 0.002 20
3 0.0 0.002 20
3 0.0 0.002 20
3 0.0 0.002 20
3 0.0 0.002 20
3 0.0 0.002 20
3 0.0 0.002 20
3 0.0 0.002 20
3 0.0 0.002 20
3 0.0 0.002 20
3 0.0 0.002 20
3 0.0 0.002 20
3 0.0 0.002 20
3 0.0 0.002 20
3 0.0 0.002 20
3 0.0 0.002 20
3 0.0 0.002 20
3 0.0 0.002 20
3 0.0 0.002 20
3 0.0 0.002 20
3 0.0 0.002 20
3 0.0 0.002 20
3 0.0 0.002 20
3 0.0 0.002 20
3 0.0 0.002 20
3 0.0 0.002 20
3 0.0 0.002 20
3 0.0 0.002 20
3 0.0 0.002 20
3 0.0 0.002 20
3 0.0 0.002 20
3 0.0 0.002 20
3 0.0 0.002 20
3 0.0 0.002 20
3 0.0 0.002 20
3 0.0 0.002 20
3 0.0 0.002 20
3 -10.0 0.0 0.0
3 -10.0 0.0 0.0
3 -10.0 0.0 0.0
3 -10.0 0.0 0.0
3 -10.0 0.0 0.0
3 -10.0 0.0 0.0
3 -10.0 0.0 0.0
3 -10.0 0.0 0.0
3 -10.0 0.0 0.0
3 -10.0 0.0 0.0
3 -10.0 0.0 0.0
3 -10.0 0.0 0.0
3 -10.0 0.0 0.0
3 -10.0 0.0 0.0
3 -10.0 0.0 0.0
3 -10.0 0.0 0.0
3 -10.0 0.0 0.0
3 -10.0 0.0 0.0
3 -10.0 0.0 0.0
3 -10.0 0.0 0.0
3 -10.0 0.0 0.0
3 -10.0 0.0 0.0
3 -10.0 0.0 0.0
3 -10.0 0.0 0.0
3 -10.0 0.0 0.0
3 -10.0 0.0 0.0
3 -10.0 0.0 0.0
3 -10.0 0.0 0.0
3 -10.0 0.0 0.0
3 -10.0 0.0 0.0
3 -10.0 0.0 0.0
3 -10.0 0.0 0.0
3 -10.0 0.0 0.0
3 -10.0 0.0 0.0
3 -10.0 0.0 0.0
3 -10.0 0.0 0.0
3 -10.0 0.0 0.0
3 -10.0 0.0 0.0
3 -10.0 0.0 0.0
3 -10.0 0.0 0.0
3 -10.0 0.0 0.0
3 -10.0 0.0 0.0
3 -10.0 0.0 0.0
3 -10.0 0.0 0.0
3 -10.0 0.0 0.0
3 -10.0 0.0 0.0
3 -10.0 0.0 0.0
3 -10.0 0.0 0.0
3 -10.0 0.0 0.0
3 -10.0 0.0 0.0
3 -10.0 0.0 0.0
3 -10.0 0.0 0.0
3 -10.0 0.0 0.0
3 -10.0 0.0 0.0
3 -10.0 0.0 0.0
3 -10.0 0.0 0.0
3 -10.0 0.0 0.0
3 -10.0 0.0 0.0
3 -10.0 0.0 0.0
3 -10.0 0.0 0.0
3 -10.0 0.0 0.0
3 -10.0 0.0 0.0
3 -10.0 0.0 0.0
3 -10.0 0.0 0.0
3 -10.0 0.0 0.0
3 -10.0 0.0 0.0
3 -10.0 0.0 0.0
3 -10.0 0.0 0.0
3 -10.0 0.0 0.0
3 -10.0 0.0 0.0
3 -10.0 0.0 0.0
3 -10.0 0.0 0.0
3 -10.0 0.0 0.0
3 -10.0 0.0 0.0
3 -10.0 0.0 0.0
3 -10.0 0.0 0.0
3 -10.0 0.0 0.0
3 -10.0 0.0 0.0
3 -10.0 0.0 0.0
3 -10.0 0.0 0.0
3 -10.0 0.0 0.0
3 -10.0 0.0 0.0
3 -10.0 0.0 0.0
3 -10.0 0.0 0.0
3 -10.0 0.0 0.0
3 -10.0 0.0 0.0
3 -10.0 0.0 0.0
3 -10.0 0.0 0.0
3 -10.0 0.0 0.0
3 -10.0 0.0 0.0
3 -10.0 0.0 0.0
3 -10.0 0.0 0.0
3 -10.0 0.0 0.0
3 -10.0 0.0 0.0
3 -10.0 0.0 0.0
3 -10.0 0.0 0.0
3 -10.0 0.0 0.0
3 -10.0 0.0 0.0
3 -10.0 0.0 0.0
3 -10.0 0.0 0.0
3 -10.0 0.0 0.0
3 -10.0 0.0 0.0
3 -10.0 0.0 0.0
3 -10.0 0.0 0.0
3 -10.0 0.0 0.0
3 -10.0 0.0 0.0
3 -10.0 0.0 0.0
3 -10.0 0.0 0.0
3 -10.0 0.0 0.0
3 -10.0 0.0 0.0
3 -10.0 0.0 0.0
3 -10.0 0.0 0.0
3 -10.0 0.0 0.0
3 -10.0 0.0 0.0
3 -10.0 0.0 0.0
3 -10.0 0.0 0.0
3 -10.0 0.0 0.0
3 -10.0 0.0 0.0
3 -10.0 0.0 0.0
3 -10.0 0.0 0.0
3 -10.0 0.0 0.0
3 -10.0 0.0 0.0
3 -10.0 0.0 0.0
3 -10.0 0.0 0.0
3 -10.0 0.0 0.0
3 -10.0 0.0 0.0
3 -10.0 0.0 0.0
3 -10.0 0.0 0.0
3 -10.0 0.0 0.0
3 -10.0 0.0 0.0
3 -10.0 0.0 0.0
3 -10.0 0.0 0.0
3 -10.0 0.0 0.0
3 -10.0 0.0 0.0
3 -10.0 0.0 0.0
3 -10.0 0.0 0.0
3 -10.0 0.0 0.0
3 -10.0 0.0 0.0
3 -10.0 0.0 0.0
3 -10.0 0.0 0.0
3 -10.0 0.0 0.0
3 -10.0 0.0 0.0
3 -10.0 0.0 0.0
3 -10.0 0.0 0.0
3 -10.0 0.0 0.0
3 -10.0 0.0 0.0
3 -10.0 0.0 0.0
3 -10.0 0.0 0.0
3 -10.0 0.0 0.0
3 -10.0 0.0 0.0
3 -10.0 0.0 0.0
3 -10.0 0.0 0.0
3 -10.0 0.0 0.0
3 -10.0 0.0 0.0
3 -10.0 0.0 0.0
3 -10.0 0.0 0.0
3 -10.0 0.0 0.0
3 -10.0 0.0 0.0
3 -10.0 0.0 0.0
3 -10.0 0.0 0.0
3 -10.0 0.0 0.0
3 -10.0 0.0 0.0
3 -10.0 0.0 0.0
3 -10.0 0.0 0.0
3 -10.0 0.0 0.0
3 -10.0 0.0 0.0
3 -10.0 0.0 0.0
3 -10.0 0.0 0.0
3 -10.0 0.0 0.0
3 -10.0 0.0 0.0
3 -10.0 0.0 0.0
3 -10.0 0.0 0.0
3 -10.0 0.0 0.0
3 -10.0 0.0 0.0
3 -10.0 0.0 0.0
3 -10.0 0.0 0.0
3 -10.0 0.0 0.0
3 -10.0 0.0 0.0
3 -10.0 0.0 0.0
3 -10.0 0.0 0.0
3 -10.0 0.0 0.0
3 -10.0 0.0 0.0
3 -10.0 0.0 0.0
3 -10.0 0.0 0.0
3 -10.0 0.0 0.0
3 -10.0 0.0 0.0
3 -10.0 0.0 0.0
3 -10.0 0.0 0.0
3 -10.0 0.0 0.0
3 -10.0 0.0 0.0
3 -10.0 0.0 0.0
3 -10.0 0.0 0.0
3 -10.0 0.0 0.0
3 -10.0 0.0 0.0
3 -10.0 0.0 0.0
3 -10.0 0.0 0.0
3 -10.0 0.0 0.0
3 -10.0 0.0 0.0
3 -10.0 0.0 0.0
3 -10.0 0.0 0.0
3 -10.0 0.0 0.0
3 -10.0 0.0 0.0
3 -10.0 0.0 0.0
3 -10.0 0.0 0.0
3 -10.0 0.0 0.0
3 -10.0 0.0 0.0
3 -10.0 0.0 0.0
3 -10.0 0.0 0.0
3 -10.0 0.0 0.0
3 -10.0 0.0 0.0
3 -10.0 0.0 0.0
3 -10.0 0.0 0.0
3 -10.0 0.0 0.0
3 -10.0 0.0 0.0
3 -10.0 0.0 0.0
3 -10.0 0.0 0.0
3 -10.0 0.0 0.0
3 -10.0 0.0 0.0
3 -10.0 0.0 0.0
3 -10.0 0.0 0.0
3 -10.0 0.0 0.0
3 -10.0 0.0 0.0
3 -10.0 0.0 0.0
3 -10.0 0.0 0.0
3 -10.0 0.0 0.0
3 -10.0 0.0 0.0
3 -10.0 0.0 0.0
3 -10.0 0.0 0.0
3 -10.0 0.0 0.0
3 -10.0 0.0 0.0
3 -10.0 0.0 0.0
3 -10.0 0.0 0.0
3 -10.0 0.0 0.0
3 -10.0 0.0 0.0
3 -10.0 0.0 0.0
3 -10.0 0.0 0.0
3 -10.0 0.0 0.0
3 -10.0 0.0 0.0
3 -10.0 0.0 0.0
3 -10.0 0.0 0.0
3 -10.0 0.0 0.0
3 -10.0 0.0 0.0
3 -10.0 0.0 0.0
3 -10.0 0.0 0.0
3 -10.0 0.0 0.0
3 -10.0 0.0 0.0
3 -10.0 0.0 0.0
3 -10.0 0.0 0.0
3 -10.0 0.0 0.0
3 -10.0 0.0 0.0
3 -10.0 0.0 0.0
3 -10.0 0.0 0.0
3 -10.0 0.0 0.0
3 -10.0 0.0 0.0
3 -10.0 0.0 0.0
3 -10.0 0.0 0.0
3 -10.0 0.0 0.0
3 -10.0 0.0 0.0
3 -10.0 0.0 0.0
3 -10.0 0.0 0.0
3 -10.0 0.0 0.0
3 -10.0 0.0 0.0
3 -10.0 0.0 0.0
3 -10.0 0.0 0.0
3 -10.0 0.0 0.0
3 -10.0 0.0 0.0
3 -10.0 0.0 0.0
3 -10.0 0.0 0.0
3 -10.0 0.0 0.0
3 -10.0 0.0 0.0
3 -10.0 0.0 0.0
3 -10.0 0.0 0.0
3 -10.0 0.0 0.0
3 -10.0 0.0 0.0
3 -10.0 0.0 0.0
3 -10.0 0.0 0.0
3 -10.0 0.0 0.0
3 -10.0 0.0 0.0
3 -10.0 0.0 0.0
3 -10.0 0.0 0.0
3 -10.0 0.0 0.0
3 -10.0 0.0 0.0
3 -10.0 0.0 0.0
3 -10.0 0.0 0.0
3 -10.0 0.0 0.0
3 -10.0 0.0 0.0
3 -10.0 0.0 0.0
3 -10.0 0.0 0.0
3 -10.0 0.0 0.0
3 -10.0 0.0 0.0
3 -10.0 0.0 0.0
3 -10.0 0.0 0.0
3 -10.0 0.0 0.0
3 -10.0 0.0 0.0
3 -10.0 0.0 0.0
3 -10.0 0.0 0.0
3 -10.0 0.0 0.0
3 -10.0 0.0 0.0
3 -10.0 0.0 0.0
3 -10.0 0.0 0.0
3 -10.0 0.0 0.0
3 -10.0 0.0 0.0
3 -10.0 0.0 0.0
3 -10.0 0.0 0.0
3 -10.0 0.0 0.0
3 -10.0 0.0 0.0
3 -10.0 0.0 0.0
3 -10.0 0.0 0.0
3 -10.0 0.0 0.0
3 -10.0 0.0 0.0
3 -10.0 0.0 0.0
3 -10.0 0.0 0.0
3 -10.0 0.0 0.0
3 -10.0 0.0 0.0
3 -10.0 0.0 0.0
3 -10.0 0.0 0.0
3 -10.0 0.0 0.0
3 -10.0 0.0 0.0
3 -10.0 0.0 0.0
3 -10.0 0.0 0.0
3 -10.0 0.0 0.0
3 -10.0 0.0 0.0
3 -10.0 0.0 0.0
3 -10.0 0.0 0.0
3 -10.0 0.0 0.0
3 -10.0 0.0 0.0
3 -10.0 0.0 0.0
3 -10.0 0.0 0.0
3 -10.0 0.0 0.0
3 -10.0 0.0 0.0
3 -10.0 0.0 0.0
3 -10.0 0.0 0.0
3 -10.0 0.0 0.0
3 -10.0 0.0 0.0
3 -10.0 0.0 0.0
3 -10.0 0.0 0.0
3 -10.0 0.0 0.0
3 -10.0 0.0 0.0
3 -10.0 0.0 0.0
3 -10.0 0.0 0.0
3 -10.0 0.0 0.0
3 -10.0 0.0 0.0
3 -10.0 0.0 0.0
3 -10.0 0.0 0.0
3 -10.0 0.0 0.0
3 -10.0 0.0 0.0
3 -10.0 0.0 0.0
3 -10.0 0.0 0.0
3 -10.0 0.0 0.0
3 -10.0 0.0 0.0
3 -10.0 0.0 0.0
3 -10.0 0.0 0.0
3 -10.0 0.0 0.0
3 -10.0 0.0 0.0
3 -10.0 0.0 0.0
3 -10.0 0.0 0.0
3 -10.0 0.0 0.0
3 -10.0 0.0 0.0
3 -10.0 0.0 0.0
3 -10.0 0.0 0.0
CDATA:
9 1 0 0 0 1 0 0 0 1
9 1 0 0 0 1 0 0 0 1
9 1 0 0 0 1 0 0 0 1
9 1 0 0 0 1 0 0 0 1
9 1 0 0 0 1 0 0 0 1
9 1 0 0 0 1 0 0 0 1
9 1 0 0 0 1 0 0 0 1
9 1 0 0 0 1 0 0 0 1
9 1 0 0 0 1 0 0 0 1
9 1 0 0 0 1 0 0 0 1
9 1 0 0 0 1 0 0 0 1
9 1 0 0 0 1 0 0 0 1
9 1 0 0 0 1 0 0 0 1
9 1 0 0 0 1 0 0 0 1
9 1 0 0 0 1 0 0 0 1
9 1 0 0 0 1 0 0 0 1
9 1 0 0 0 1 0 0 0 1
9 1 0 0 0 1 0 0 0 1
9 1 0 0 0 1 0 0 0 1
9 1 0 0 0 1 0 0 0 1
9 1 0 0 0 1 0 0 0 1
9 1 0 0 0 1 0 0 0 1
9 1 0 0 0 1 0 0 0 1
9 1 0 0 0 1 0 0 0 1
9 1 0 0 0 1 0 0 0 1
9 1 0 0 0 1 0 0 0 1
9 1 0 0 0 1 0 0 0 1
9 1 0 0 0 1 0 0 0 1
9 1 0 0 0 1 0 0 0 1
9 1 0 0 0 1 0 0 0 1
9 1 0 0 0 1 0 0 0 1
9 1 0 0 0 1 0 0 0 1
9 1 0 0 0 1 0 0 0 1
9 1 0 0 0 1 0 0 0 1
9 1 0 0 0 1 0 0 0 1
9 1 0 0 0 1 0 0 0 1
9 1 0 0 0 1 0 0 0 1
9 1 0 0 0 1 0 0 0 1
9 1 0 0 0 1 0 0 0 1
9 1 0 0 0 1 0 0 0 1
9 1 0 0 0 1 0 0 0 1
9 1 0 0 0 1 0 0 0 1
9 1 0 0 0 1 0 0 0 1
9 1 0 0 0 1 0 0 0 1
9 1 0 0 0 1 0 0 0 1
9 1 0 0 0 1 0 0 0 1
9 1 0 0 0 1 0 0 0 1
9 1 0 0 0 1 0 0 0 1
9 1 0 0 0 1 0 0 0 1
9 1 0 0 0 1 0 0 0 1
9 1 0 0 0 1 0 0 0 1
9 1 0 0 0 1 0 0 0 1
9 1 0 0 0 1 0 0 0 1
9 1 0 0 0 1 0 0 0 1
9 1 0 0 0 1 0 0 0 1
9 1 0 0 0 1 0 0 0 1
9 1 0 0 0 1 0 0 0 1
9 1 0 0 0 1 0 0 0 1
9 1 0 0 0 1 0 0 0 1
9 1 0 0 0 1 0 0 0 1
9 1 0 0 0 1 0 0 0 1
9 1 0 0 0 1 0 0 0 1
9 1 0 0 0 1 0 0 0 1
9 1 0 0 0 1 0 0 0 1
9 1 0 0 0 1 0 0 0 1
9 1 0 0 0 1 0 0 0 1
9 1 0 0 0 1 0 0 0 1
9 1 0 0 0 1 0 0 0 1
9 1 0 0 0 1 0 0 0 1
9 1 0 0 0 1 0 0 0 1
9 1 0 0 0 1 0 0 0 1
9 1 0 0 0 1 0 0 0 1
9 1 0 0 0 1 0 0 0 1
9 1 0 0 0 1 0 0 0 1
9 1 0 0 0 1 0 0 0 1
9 1 0 0 0 1 0 0 0 1
9 1 0 0 0 1 0 0 0 1
9 1 0 0 0 1 0 0 0 1
9 1 0 0 0 1 0 0 0 1
9 1 0 0 0 1 0 0 0 1
9 1 0 0 0 1 0 0 0 1
9 1 0 0 0 1 0 0 0 1
9 1 0 0 0 1 0 0 0 1
9 1 0 0 0 1 0 0 0 1
9 1 0 0 0 1 0 0 0 1
9 1 0 0 0 1 0 0 0 1
9 1 0 0 0 1 0 0 0 1
9 1 0 0 0 1 0 0 0 1
9 1 0 0 0 1 0 0 0 1
9 1 0 0 0 1 0 0 0 1
9 1 0 0 0 1 0 0 0 1
9 1 0 0 0 1 0 0 0 1
9 1 0 0 0 1 0 0 0 1
9 1 0 0 0 1 0 0 0 1
9 1 0 0 0 1 0 0 0 1
9 1 0 0 0 1 0 0 0 1
9 1 0 0 0 1 0 0 0 1
9 1 0 0 0 1 0 0 0 1
9 1 0 0 0 1 0 0 0 1
9 1 0 0 0 1 0 0 0 1
9 1 0 0 0 1 0 0 0 1
9 1 0 0 0 1 0 0 0 1
9 1 0 0 0 1 0 0 0 1
9 1 0 0 0 1 0 0 0 1
9 1 0 0 0 1 0 0 0 1
9 1 0 0 0 1 0 0 0 1
9 1 0 0 0 1 0 0 0 1
9 1 0 0 0 1 0 0 0 1
9 1 0 0 0 1 0 0 0 1
9 1 0 0 0 1 0 0 0 1
9 1 0 0 0 1 0 0 0 1
9 1 0 0 0 1 0 0 0 1
9 1 0 0 0 1 0 0 0 1
9 1 0 0 0 1 0 0 0 1
9 1 0 0 0 1 0 0 0 1
9 1 0 0 0 1 0 0 0 1
9 1 0 0 0 1 0 0 0 1
9 1 0 0 0 1 0 0 0 1
9 1 0 0 0 1 0 0 0 1
9 1 0 0 0 1 0 0 0 1
9 1 0 0 0 1 0 0 0 1
9 1 0 0 0 1 0 0 0 1
9 1 0 0 0 1 0 0 0 1
9 1 0 0 0 1 0 0 0 1
9 1 0 0 0 1 0 0 0 1
9 1 0 0 0 1 0 0 0 1
9 1 0 0 0 1 0 0 0 1
9 1 0 0 0 1 0 0 0 1
9 1 0 0 0 1 0 0 0 1
9 1 0 0 0 1 0 0 0 1
9 1 0 0 0 1 0 0 0 1
9 1 0 0 0 1 0 0 0 1
9 1 0 0 0 1 0 0 0 1
9 1 0 0 0 1 0 0 0 1
9 1 0 0 0 1 0 0 0 1
9 1 0 0 0 1 0 0 0 1
9 1 0 0 0 1 0 0 0 1
9 1 0 0 0 1 0 0 0 1
9 1 0 0 0 1 0 0 0 1
9 1 0 0 0 1 0 0 0 1
9 1 0 0 0 1 0 0 0 1
9 1 0 0 0 1 0 0 0 1
9 1 0 0 0 1 0 0 0 1
9 1 0 0 0 1 0 0 0 1
9 1 0 0 0 1 0 0 0 1
9 1 0 0 0 1 0 0 0 1
9 1 0 0 0 1 0 0 0 1
9 1 0 0 0 1 0 0 0 1
9 1 0 0 0 1 0 0 0 1
9 1 0 0 0 1 0 0 0 1
9 1 0 0 0 1 0 0 0 1
9 1 0 0 0 1 0 0 0 1
9 1 0 0 0 1 0 0 0 1
9 1 0 0 0 1 0 0 0 1
9 1 0 0 0 1 0 0 0 1
9 1 0 0 0 1 0 0 0 1
9 1 0 0 0 1 0 0 0 1
9 1 0 0 0 1 0 0 0 1
9 1 0 0 0 1 0 0 0 1
9 1 0 0 0 1 0 0 0 1
9 1 0 0 0 1 0 0 0 1
9 1 0 0 0 1 0 0 0 1
9 1 0 0 0 1 0 0 0 1
9 1 0 0 0 1 0 0 0 1
9 1 0 0 0 1 0 0 0 1
9 1 0 0 0 1 0 0 0 1
9 1 0 0 0 1 0 0 0 1
9 1 0 0 0 1 0 0 0 1
9 1 0 0 0 1 0 0 0 1
9 1 0 0 0 1 0 0 0 1
9 1 0 0 0 1 0 0 0 1
9 1 0 0 0 1 0 0 0 1
9 1 0 0 0 1 0 0 0 1
9 1 0 0 0 1 0 0 0 1
9 1 0 0 0 1 0 0 0 1
9 1 0 0 0 1 0 0 0 1
9 1 0 0 0 1 0 0 0 1
9 1 0 0 0 1 0 0 0 1
9 1 0 0 0 1 0 0 0 1
9 1 0 0 0 1 0 0 0 1
9 1 0 0 0 1 0 0 0 1
9 1 0 0 0 1 0 0 0 1
9 1 0 0 0 1 0 0 0 1
9 1 0 0 0 1 0 0 0 1
9 1 0 0 0 1 0 0 0 1
9 1 0 0 0 1 0 0 0 1
9 1 0 0 0 1 0 0 0 1
9 1 0 0 0 1 0 0 0 1
9 1 0 0 0 1 0 0 0 1
9 1 0 0 0 1 0 0 0 1
9 1 0 0 0 1 0 0 0 1
9 1 0 0 0 1 0 0 0 1
9 1 0 0 0 1 0 0 0 1
9 1 0 0 0 1 0 0 0 1
9 1 0 0 0 1 0 0 0 1
9 1 0 0 0 1 0 0 0 1
9 1 0 0 0 1 0 0 0 1
9 1 0 0 0 1 0 0 0 1
9 1 0 0 0 1 0 0 0 1
9 1 0 0 0 1 0 0 0 1
9 1 0 0 0 1 0 0 0 1
9 1 0 0 0 1 0 0 0 1
9 1 0 0 0 1 0 0 0 1
9 1 0 0 0 1 0 0 0 1
9 1 0 0 0 1 0 0 0 1
9 1 0 0 0 1 0 0 0 1
9 1 0 0 0 1 0 0 0 1
9 1 0 0 0 1 0 0 0 1
9 1 0 0 0 1 0 0 0 1
9 1 0 0 0 1 0 0 0 1
9 1 0 0 0 1 0 0 0 1
9 1 0 0 0 1 0 0 0 1
9 1 0 0 0 1 0 0 0 1
9 1 0 0 0 1 0 0 0 1
9 1 0 0 0 1 0 0 0 1
9 1 0 0 0 1 0 0 0 1
9 1 0 0 0 1 0 0 0 1
9 1 0 0 0 1 0 0 0 1
9 1 0 0 0 1 0 0 0 1
9 1 0 0 0 1 0 0 0 1
9 1 0 0 0 1 0 0 0 1
9 1 0 0 0 1 0 0 0 1
9 1 0 0 0 1 0 0 0 1
9 1 0 0 0 1 0 0 0 1
9 1 0 0 0 1 0 0 0 1
9 1 0 0 0 1 0 0 0 1
9 1 0 0 0 1 0 0 0 1
9 1 0 0 0 1 0 0 0 1
9 1 0 0 0 1 0 0 0 1
9 1 0 0 0 1 0 0 0 1
9 1 0 0 0 1 0 0 0 1
9 1 0 0 0 1 0 0 0 1
9 1 0 0 0 1 0 0 0 1
9 1 0 0 0 1 0 0 0 1
9 1 0 0 0 1 0 0 0 1
9 1 0 0 0 1 0 0 0 1
9 1 0 0 0 1 0 0 0 1
9 1 0 0 0 1 0 0 0 1
9 1 0 0 0 1 0 0 0 1
9 1 0 0 0 1 0 0 0 1
9 1 0 0 0 1 0 0 0 1
9 1 0 0 0 1 0 0 0 1
9 1 0 0 0 1 0 0 0 1
9 1 0 0 0 1 0 0 0 1
9 1 0 0 0 1 0 0 0 1
9 1 0 0 0 1 0 0 0 1
9 1 0 0 0 1 0 0 0 1
9 1 0 0 0 1 0 0 0 1
9 1 0 0 0 1 0 0 0 1
9 1 0 0 0 1 0 0 0 1
9 1 0 0 0 1 0 0 0 1
9 1 0 0 0 1 0 0 0 1
9 1 0 0 0 1 0 0 0 1
9 1 0 0 0 1 0 0 0 1
9 1 0 0 0 1 0 0 0 1
9 1 0 0 0 1 0 0 0 1
9 1 0 0 0 1 0 0 0 1
9 1 0 0 0 1 0 0 0 1
9 1 0 0 0 1 0 0 0 1
9 1 0 0 0 1 0 0 0 1
9 1 0 0 0 1 0 0 0 1
9 1 0 0 0 1 0 0 0 1
9 1 0 0 0 1 0 0 0 1
9 1 0 0 0 1 0 0 0 1
9 1 0 0 0 1 0 0 0 1
9 1 0 0 0 1 0 0 0 1
9 1 0 0 0 1 0 0 0 1
9 1 0 0 0 1 0 0 0 1
9 1 0 0 0 1 0 0 0 1
9 1 0 0 0 1 0 0 0 1
9 1 0 0 0 1 0 0 0 1
9 1 0 0 0 1 0 0 0 1
9 1 0 0 0 1 0 0 0 1
9 1 0 0 0 1 0 0 0 1
9 1 0 0 0 1 0 0 0 1
9 1 0 0 0 1 0 0 0 1
9 1 0 0 0 1 0 0 0 1
9 1 0 0 0 1 0 0 0 1
9 1 0 0 0 1 0 0 0 1
9 1 0 0 0 1 0 0 0 1
9 1 0 0 0 1 0 0 0 1
9 1 0 0 0 1 0 0 0 1
9 1 0 0 0 1 0 0 0 1
9 1 0 0 0 1 0 0 0 1
9 1 0 0 0 1 0 0 0 1
9 1 0 0 0 1 0 0 0 1
9 1 0 0 0 1 0 0 0 1
9 1 0 0 0 1 0 0 0 1
9 1 0 0 0 1 0 0 0 1
9 1 0 0 0 1 0 0 0 1
9 1 0 0 0 1 0 0 0 1
9 1 0 0 0 1 0 0 0 1
9 1 0 0 0 1 0 0 0 1
9 1 0 0 0 1 0 0 0 1
9 1 0 0 0 1 0 0 0 1
9 1 0 0 0 1 0 0 0 1
9 1 0 0 0 1 0 0 0 1
9 1 0 0 0 1 0 0 0 1
9 1 0 0 0 1 0 0 0 1
9 1 0 0 0 1 0 0 0 1
9 1 0 0 0 1 0 0 0 1
9 1 0 0 0 1 0 0 0 1
9 1 0 0 0 1 0 0 0 1
9 1 0 0 0 1 0 0 0 1
9 1 0 0 0 1 0 0 0 1
9 1 0 0 0 1 0 0 0 1
9 1 0 0 0 1 0 0 0 1
9 1 0 0 0 1 0 0 0 1
9 1 0 0 0 1 0 0 0 1
9 1 0 0 0 1 0 0 0 1
9 1 0 0 0 1 0 0 0 1
9 1 0 0 0 1 0 0 0 1
9 1 0 0 0 1 0 0 0 1
9 1 0 0 0 1 0 0 0 1
9 1 0 0 0 1 0 0 0 1
9 1 0 0 0 1 0 0 0 1
9 1 0 0 0 1 0 0 0 1
9 1 0 0 0 1 0 0 0 1
9 1 0 0 0 1 0 0 0 1
9 1 0 0 0 1 0 0 0 1
9 1 0 0 0 1 0 0 0 1
9 1 0 0 0 1 0 0 0 1
9 1 0 0 0 1 0 0 0 1
9 1 0 0 0 1 0 0 0 1
9 1 0 0 0 1 0 0 0 1
9 1 0 0 0 1 0 0 0 1
9 1 0 0 0 1 0 0 0 1
9 1 0 0 0 1 0 0 0 1
9 1 0 0 0 1 0 0 0 1
9 1 0 0 0 1 0 0 0 1
9 1 0 0 0 1 0 0 0 1
9 1 0 0 0 1 0 0 0 1
9 1 0 0 0 1 0 0 0 1
9 1 0 0 0 1 0 0 0 1
9 1 0 0 0 1 0 0 0 1
9 1 0 0 0 1 0 0 0 1
9 1 0 0 0 1 0 0 0 1
9 1 0 0 0 1 0 0 0 1
9 1 0 0 0 1 0 0 0 1
9 1 0 0 0 1 0 0 0 1
9 1 0 0 0 1 0 0 0 1
9 1 0 0 0 1 0 0 0 1
9 1 0 0 0 1 0 0 0 1
9 1 0 0 0 1 0 0 0 1
9 1 0 0 0 1 0 0 0 1
9 1 0 0 0 1 0 0 0 1
9 1 0 0 0 1 0 0 0 1
9 1 0 0 0 1 0 0 0 1
9 1 0 0 0 1 0 0 0 1
9 1 0 0 0 1 0 0 0 1
9 1 0 0 0 1 0 0 0 1
9 1 0 0 0 1 0 0 0 1
9 1 0 0 0 1 0 0 0 1
9 1 0 0 0 1 0 0 0 1
9 1 0 0 0 1 0 0 0 1
9 1 0 0 0 1 0 0 0 1
9 1 0 0 0 1 0 0 0 1
9 1 0 0 0 1 0 0 0 1
9 1 0 0 0 1 0 0 0 1
9 1 0 0 0 1 0 0 0 1
9 1 0 0 0 1 0 0 0 1
9 1 0 0 0 1 0 0 0 1
9 1 0 0 0 1 0 0 0 1
9 1 0 0 0 1 0 0 0 1
9 1 0 0 0 1 0 0 0 1
9 1 0 0 0 1 0 0 0 1
9 1 0 0 0 1 0 0 0 1
9 1 0 0 0 1 0 0 0 1
9 1 0 0 0 1 0 0 0 1
9 1 0 0 0 1 0 0 0 1
9 1 0 0 0 1 0 0 0 1
9 1 0 0 0 1 0 0 0 1
9 1 0 0 0 1 0 0 0 1
9 1 0 0 0 1 0 0 0 1
9 1 0 0 0 1 0 0 0 1
9 1 0 0 0 1 0 0 0 1
9 1 0 0 0 1 0 0 0 1
9 1 0 0 0 1 0 0 0 1
9 1 0 0 0 1 0 0 0 1
9 1 0 0 0 1 0 0 0 1
9 1 0 0 0 1 0 0 0 1
9 1 0 0 0 1 0 0 0 1
9 1 0 0 0 1 0 0 0 1
9 1 0 0 0 1 0 0 0 1
9 1 0 0 0 1 0 0 0 1
9 1 0 0 0 1 0 0 0 1
9 1 0 0 0 1 0 0 0 1
9 1 0 0 0 1 0 0 0 1
9 1 0 0 0 1 0 0 0 1
9 1 0 0 0 1 0 0 0 1
9 1 0 0 0 1 0 0 0 1
9 1 0 0 0 1 0 0 0 1
9 1 0 0 0 1 0 0 0 1
9 1 0 0 0 1 0 0 0 1
9 1 0 0 0 1 0 0 0 1
9 1 0 0 0 1 0 0 0 1
9 1 0 0 0 1 0 0 0 1
9 1 0 0 0 1 0 0 0 1
9 1 0 0 0 1 0 0 0 1
9 1 0 0 0 1 0 0 0 1
9 1 0 0 0 1 0 0 0 1
9 1 0 0 0 1 0 0 0 1
9 1 0 0 0 1 0 0 0 1
9 1 0 0 0 1 0 0 0 1
9 1 0 0 0 1 0 0 0 1
9 1 0 0 0 1 0 0 0 1
9 1 0 0 0 1 0 0 0 1
9 1 0 0 0 1 0 0 0 1
9 1 0 0 0 1 0 0 0 1
9 1 0 0 0 1 0 0 0 1
9 1 0 0 0 1 0 0 0 1
9 1 0 0 0 1 0 0 0 1
9 1 0 0 0 1 0 0 0 1
9 1 0 0 0 1 0 0 0 1
9 1 0 0 0 1 0 0 0 1
9 1 0 0 0 1 0 0 0 1
9 1 0 0 0 1 0 0 0 1
9 1 0 0 0 1 0 0 0 1
9 1 0 0 0 1 0 0 0 1
9 1 0 0 0 1 0 0 0 1
9 1 0 0 0 1 0 0 0 1
9 1 0 0 0 1 0 0 0 1
9 1 0 0 0 1 0 0 0 1
9 1 0 0 0 1 0 0 0 1
9 1 0 0 0 1 0 0 0 1
9 1 0 0 0 1 0 0 0 1
9 1 0 0 0 1 0 0 0 1
9 1 0 0 0 1 0 0 0 1
9 1 0 0 0 1 0 0 0 1
9 1 0 0 0 1 0 0 0 1
9 1 0 0 0 1 0 0 0 1
9 1 0 0 0 1 0 0 0 1
9 1 0 0 0 1 0 0 0 1
9 1 0 0 0 1 0 0 0 1
9 1 0 0 0 1 0 0 0 1
9 1 0 0 0 1 0 0 0 1
9 1 0 0 0 1 0 0 0 1
9 1 0 0 0 1 0 0 0 1
9 1 0 0 0 1 0 0 0 1
9 1 0 0 0 1 0 0 0 1
9 1 0 0 0 1 0 0 0 1
9 1 0 0 0 1 0 0 0 1
9 1 0 0 0 1 0 0 0 1
9 1 0 0 0 1 0 0 0 1
9 1 0 0 0 1 0 0 0 1
9 1 0 0 0 1 0 0 0 1
9 1 0 0 0 1 0 0 0 1
9 1 0 0 0 1 0 0 0 1
9 1 0 0 0 1 0 0 0 1
9 1 0 0 0 1 0 0 0 1
9 1 0 0 0 1 0 0 0 1
9 1 0 0 0 1 0 0 0 1
9 1 0 0 0 1 0 0 0 1
9 1 0 0 0 1 0 0 0 1
9 1 0 0 0 1 0 0 0 1
9 1 0 0 0 1 0 0 0 1
9 1 0 0 0 1 0 0 0 1
9 1 0 0 0 1 0 0 0 1
9 1 0 0 0 1 0 0 0 1
9 1 0 0 0 1 0 0 0 1
9 1 0 0 0 1 0 0 0 1
9 1 0 0 0 1 0 0 0 1
9 1 0 0 0 1 0 0 0 1
9 1 0 0 0 1 0 0 0 1
9 1 0 0 0 1 0 0 0 1
9 1 0 0 0 1 0 0 0 1
9 1 0 0 0 1 0 0 0 1
9 1 0 0 0 1 0 0 0 1
9 1 0 0 0 1 0 0 0 1
9 1 0 0 0 1 0 0 0 1
9 1 0 0 0 1 0 0 0 1
9 1 0 0 0 1 0 0 0 1
9 1 0 0 0 1 0 0 0 1
9 1 0 0 0 1 0 0 0 1
9 1 0 0 0 1 0 0 0 1
9 1 0 0 0 1 0 0 0 1
9 1 0 0 0 1 0 0 0 1
9 1 0 0 0 1 0 0 0 1
9 1 0 0 0 1 0 0 0 1
9 1 0 0 0 1 0 0 0 1
9 1 0 0 0 1 0 0 0 1
9 1 0 0 0 1 0 0 0 1
9 1 0 0 0 1 0 0 0 1
9 1 0 0 0 1 0 0 0 1
9 1 0 0 0 1 0 0 0 1
9 1 0 0 0 1 0 0 0 1
9 1 0 0 0 1 0 0 0 1
9 1 0 0 0 1 0 0 0 1
9 1 0 0 0 1 0 0 0 1
9 1 0 0 0 1 0 0 0 1
9 1 0 0 0 1 0 0 0 1
9 1 0 0 0 1 0 0 0 1
9 1 0 0 0 1 0 0 0 1
9 1 0 0 0 1 0 0 0 1
9 1 0 0 0 1 0 0 0 1
9 1 0 0 0 1 0 0 0 1
9 1 0 0 0 1 0 0 0 1
9 1 0 0 0 1 0 0 0 1
9 1 0 0 0 1 0 0 0 1
9 1 0 0 0 1 0 0 0 1
9 1 0 0 0 1 0 0 0 1
9 1 0 0 0 1 0 0 0 1
9 1 0 0 0 1 0 0 0 1
9 1 0 0 0 1 0 0 0 1
9 1 0 0 0 1 0 0 0 1
9 1 0 0 0 1 0 0 0 1
9 1 0 0 0 1 0 0 0 1
9 1 0 0 0 1 0 0 0 1
9 1 0 0 0 1 0 0 0 1
9 1 0 0 0 1 0 0 0 1
9 1 0 0 0 1 0 0 0 1
9 1 0 0 0 1 0 0 0 1
9 1 0 0 0 1 0 0 0 1
9 1 0 0 0 1 0 0 0 1
9 1 0 0 0 1 0 0 0 1
9 1 0 0 0 1 0 0 0 1
9 1 0 0 0 1 0 0 0 1
9 1 0 0 0 1 0 0 0 1
9 1 0 0 0 1 0 0 0 1
9 1 0 0 0 1 0 0 0 1
9 1 0 0 0 1 0 0 0 1
9 1 0 0 0 1 0 0 0 1
9 1 0 0 0 1 0 0 0 1
9 1 0 0 0 1 0 0 0 1
9 1 0 0 0 1 0 0 0 1
9 1 0 0 0 1 0 0 0 1
9 1 0 0 0 1 0 0 0 1
9 1 0 0 0 1 0 0 0 1
9 1 0 0 0 1 0 0 0 1
9 1 0 0 0 1 0 0 0 1
9 1 0 0 0 1 0 0 0 1
9 1 0 0 0 1 0 0 0 1
9 1 0 0 0 1 0 0 0 1
9 1 0 0 0 1 0 0 0 1
9 1 0 0 0 1 0 0 0 1
9 1 0 0 0 1 0 0 0 1
9 1 0 0 0 1 0 0 0 1
9 1 0 0 0 1 0 0 0 1
9 1 0 0 0 1 0 0 0 1
9 1 0 0 0 1 0 0 0 1
9 1 0 0 0 1 0 0 0 1
9 1 0 0 0 1 0 0 0 1
9 1 0 0 0 1 0 0 0 1
9 1 0 0 0 1 0 0 0 1
9 1 0 0 0 1 0 0 0 1
9 1 0 0 0 1 0 0 0 1
9 1 0 0 0 1 0 0 0 1
9 1 0 0 0 1 0 0 0 1
9 1 0 0 0 1 0 0 0 1
9 1 0 0 0 1 0 0 0 1
9 1 0 0 0 1 0 0 0 1
9 1 0 0 0 1 0 0 0 1
9 1 0 0 0 1 0 0 0 1
9 1 0 0 0 1 0 0 0 1
9 1 0 0 0 1 0 0 0 1
9 1 0 0 0 1 0 0 0 1
9 1 0 0 0 1 0 0 0 1
9 1 0 0 0 1 0 0 0 1
9 1 0 0 0 1 0 0 0 1
9 1 0 0 0 1 0 0 0 1
9 1 0 0 0 1 0 0 0 1
9 1 0 0 0 1 0 0 0 1
9 1 0 0 0 1 0 0 0 1
9 1 0 0 0 1 0 0 0 1
9 1 0 0 0 1 0 0 0 1
9 1 0 0 0 1 0 0 0 1
9 1 0 0 0 1 0 0 0 1
9 1 0 0 0 1 0 0 0 1
9 1 0 0 0 1 0 0 0 1
9 1 0 0 0 1 0 0 0 1
9 1 0 0 0 1 0 0 0 1
9 1 0 0 0 1 0 0 0 1
9 1 0 0 0 1 0 0 0 1
9 1 0 0 0 1 0 0 0 1
9 1 0 0 0 1 0 0 0 1
9 1 0 0 0 1 0 0 0 1
9 1 0 0 0 1 0 0 0 1
9 1 0 0 0 1 0 0 0 1
9 1 0 0 0 1 0 0 0 1
9 1 0 0 0 1 0 0 0 1
9 1 0 0 0 1 0 0 0 1
9 1 0 0 0 1 0 0 0 1
9 1 0 0 0 1 0 0 0 1
9 1 0 0 0 1 0 0 0 1
9 1 0 0 0 1 0 0 0 1
9 1 0 0 0 1 0 0 0 1
9 1 0 0 0 1 0 0 0 1
9 1 0 0 0 1 0 0 0 1
9 1 0 0 0 1 0 0 0 1
9 1 0 0 0 1 0 0 0 1
9 1 0 0 0 1 0 0 0 1
9 1 0 0 0 1 0 0 0 1
9 1 0 0 0 1 0 0 0 1
9 1 0 0 0 1 0 0 0 1
9 1 0 0 0 1 0 0 0 1
9 1 0 0 0 1 0 0 0 1
9 1 0 0 0 1 0 0 0 1
9 1 0 0 0 1 0 0 0 1
9 1 0 0 0 1 0 0 0 1
9 1 0 0 0 1 0 0 0 1
