POINTS:
0.0 0.0 0.0
0.0 0.0 1.0
0.0 1.0 0.0
0.0 1.0 1.0
1.0 0.0 0.0
1.0 0.0 1.0
1.0 1.0 0.0
1.0 1.0 1.0
2.0 0.0 0.0
2.0 0.0 1.0
2.0 1.0 0.0
2.0 1.0 1.0
3.0 0.0 0.0
3.0 0.0 1.0
3.0 1.0 0.0
3.0 1.0 1.0
4.0 0.0 0.0
4.0 0.0 1.0
4.0 1.0 0.0
4.0 1.0 1.0
5.0 0.0 0.0
5.0 0.0 1.0
5.0 1.0 0.0
5.0 1.0 1.0
6.0 0.0 0.0
6.0 0.0 1.0
6.0 1.0 0.0
6.0 1.0 1.0
7.0 0.0 0.0
7.0 0.0 1.0
7.0 1.0 0.0
7.0 1.0 1.0
8.0 0.0 0.0
8.0 0.0 1.0
8.0 1.0 0.0
8.0 1.0 1.0
9.0 0.0 0.0
9.0 0.0 1.0
9.0 1.0 0.0
9.0 1.0 1.0
10.0 0.0 0.0
10.0 0.0 1.0
10.0 1.0 0.0
10.0 1.0 1.0
CELLS:
4 0 0 2 3 7
4 0 0 2 6 7
4 0 0 4 6 7
4 0 0 4 5 7
4 0 0 1 5 7
4 0 0 1 3 7
4 0 4 6 7 11
4 0 4 6 10 11
4 0 4 8 10 11
4 0 4 8 9 11
4 0 4 5 9 11
4 0 4 5 7 11
4 0 8 10 11 15
4 0 8 10 14 15
4 0 8 12 14 15
4 0 8 12 13 15
4 0 8 9 13 15
4 0 8 9 11 15
4 0 12 14 15 19
4 0 12 14 18 19
4 0 12 16 18 19
4 0 12 16 17 19
4 0 12 13 17 19
4 0 12 13 15 19
4 0 16 18 19 23
4 0 16 18 22 23
4 0 16 20 22 23
4 0 16 20 21 23
4 0 16 17 21 23
4 0 16 17 19 23
4 0 20 22 23 27
4 0 20 22 26 27
4 0 20 24 26 27
4 0 20 24 25 27
4 0 20 21 25 27
4 0 20 21 23 27
4 0 24 26 27 31
4 0 24 26 30 31
4 0 24 28 30 31
4 0 24 28 29 31
4 0 24 25 29 31
4 0 24 25 27 31
4 0 28 30 31 35
4 0 28 30 34 35
4 0 28 32 34 35
4 0 28 32 33 35
4 0 28 29 33 35
4 0 28 29 31 35
4 0 32 34 35 39
4 0 32 34 38 39
4 0 32 36 38 39
4 0 32 36 37 39
4 0 32 33 37 39
4 0 32 33 35 39
4 0 36 38 39 43
4 0 36 38 42 43
4 0 36 40 42 43
4 0 36 40 41 43
4 0 36 37 41 43
4 0 36 37 39 43
FACES:
3 1 0 2 3
3 1 0 3 1
3 1 40 42 43
3 1 40 43 41
3 1 7 5 1
3 1 7 1 3
3 1 6 4 0
3 1 6 0 2
3 1 11 9 5
3 1 11 5 7
3 1 10 8 4
3 1 10 4 6
3 1 15 13 9
3 1 15 9 11
3 1 14 12 8
3 1 14 8 10
3 1 19 17 13
3 1 19 13 15
3 1 18 16 12
3 1 18 12 14
3 1 23 21 17
3 1 23 17 19
3 1 22 20 16
3 1 22 16 18
3 1 27 25 21
3 1 27 21 23
3 1 26 24 20
3 1 26 20 22
3 1 31 29 25
3 1 31 25 27
3 1 30 28 24
3 1 30 24 26
3 1 35 33 29
3 1 35 29 31
3 1 34 32 28
3 1 34 28 30
3 1 39 37 33
3 1 39 33 35
3 1 38 36 32
3 1 38 32 34
3 1 43 41 37
3 1 43 37 39
3 1 42 40 36
3 1 42 36 38
3 1 0 4 5
3 1 0 5 1
3 1 2 6 7
3 1 2 7 3
3 1 4 8 9
3 1 4 9 5
3 1 6 10 11
3 1 6 11 7
3 1 8 12 13
3 1 8 13 9
3 1 10 14 15
3 1 10 15 11
3 1 12 16 17
3 1 12 17 13
3 1 14 18 19
3 1 14 19 15
3 1 16 20 21
3 1 16 21 17
3 1 18 22 23
3 1 18 23 19
3 1 20 24 25
3 1 20 25 21
3 1 22 26 27
3 1 22 27 23
3 1 24 28 29
3 1 24 29 25
3 1 26 30 31
3 1 26 31 27
3 1 28 32 33
3 1 28 33 29
3 1 30 34 35
3 1 30 35 31
3 1 32 36 37
3 1 32 37 33
3 1 34 38 39
3 1 34 39 35
3 1 36 40 41
3 1 36 41 37
3 1 38 42 43
3 1 38 43 39
VDATA:
3 -10 0 0
3 -10 0 0
3 -10 0 0
3 -10 0 0
3 -10 0 0
3 -10 0 0
3 -10 0 0
3 -10 0 0
3 -10 0 0
3 -10 0 0
3 -10 0 0
3 -10 0 0
3 -10 0 0
3 -10 0 0
3 -10 0 0
3 -10 0 0
3 -10 0 0
3 -10 0 0
3 -10 0 0
3 -10 0 0
3 -10 0 0
3 -10 0 0
3 -10 0 0
3 -10 0 0
3 -10 0 0
3 -10 0 0
3 -10 0 0
3 -10 0 0
3 -10 0 0
3 -10 0 0
3 -10 0 0
3 -10 0 0
3 -10 0 0
3 -10 0 0
3 -10 0 0
3 -10 0 0
3 -10 0 0
3 -10 0 0
3 -10 0 0
3 -10 0 0
3 -10 0 0
3 -10 0 0
3 -10 0 0
3 -10 0 0
CDATA:
9 1 0 0 0 1 0 0 0 1
9 1 0 0 0 1 0 0 0 1
9 1 0 0 0 1 0 0 0 1
9 1 0 0 0 1 0 0 0 1
9 1 0 0 0 1 0 0 0 1
9 1 0 0 0 1 0 0 0 1
9 1 0 0 0 1 0 0 0 1
9 1 0 0 0 1 0 0 0 1
9 1 0 0 0 1 0 0 0 1
9 1 0 0 0 1 0 0 0 1
9 1 0 0 0 1 0 0 0 1
9 1 0 0 0 1 0 0 0 1
9 1 0 0 0 1 0 0 0 1
9 1 0 0 0 1 0 0 0 1
9 1 0 0 0 1 0 0 0 1
9 1 0 0 0 1 0 0 0 1
9 1 0 0 0 1 0 0 0 1
9 1 0 0 0 1 0 0 0 1
9 1 0 0 0 1 0 0 0 1
9 1 0 0 0 1 0 0 0 1
9 1 0 0 0 1 0 0 0 1
9 1 0 0 0 1 0 0 0 1
9 1 0 0 0 1 0 0 0 1
9 1 0 0 0 1 0 0 0 1
9 1 0 0 0 1 0 0 0 1
9 1 0 0 0 1 0 0 0 1
9 1 0 0 0 1 0 0 0 1
9 1 0 0 0 1 0 0 0 1
9 1 0 0 0 1 0 0 0 1
9 1 0 0 0 1 0 0 0 1
9 1 0 0 0 1 0 0 0 1
9 1 0 0 0 1 0 0 0 1
9 1 0 0 0 1 0 0 0 1
9 1 0 0 0 1 0 0 0 1
9 1 0 0 0 1 0 0 0 1
9 1 0 0 0 1 0 0 0 1
9 1 0 0 0 1 0 0 0 1
9 1 0 0 0 1 0 0 0 1
9 1 0 0 0 1 0 0 0 1
9 1 0 0 0 1 0 0 0 1
9 1 0 0 0 1 0 0 0 1
9 1 0 0 0 1 0 0 0 1
9 1 0 0 0 1 0 0 0 1
9 1 0 0 0 1 0 0 0 1
9 1 0 0 0 1 0 0 0 1
9 1 0 0 0 1 0 0 0 1
9 1 0 0 0 1 0 0 0 1
9 1 0 0 0 1 0 0 0 1
9 1 0 0 0 1 0 0 0 1
9 1 0 0 0 1 0 0 0 1
9 1 0 0 0 1 0 0 0 1
9 1 0 0 0 1 0 0 0 1
9 1 0 0 0 1 0 0 0 1
9 1 0 0 0 1 0 0 0 1
9 1 0 0 0 1 0 0 0 1
9 1 0 0 0 1 0 0 0 1
9 1 0 0 0 1 0 0 0 1
9 1 0 0 0 1 0 0 0 1
9 1 0 0 0 1 0 0 0 1
9 1 0 0 0 1 0 0 0 1
