POINTS:
0.0000 0.0000
0.0000 0.2500
0.0000 0.5000
0.0000 0.7500
0.0000 1.0000
0.0000 1.2500
0.0000 1.5000
0.0000 1.7500
0.0000 2.0000
0.0000 2.2500
0.0000 2.5000
0.0000 2.7500
0.0000 3.0000
0.2500 0.0000
0.2500 0.2500
0.2500 0.5000
0.2500 0.7500
0.2500 1.0000
0.2500 1.2500
0.2500 1.5000
0.2500 1.7500
0.2500 2.0000
0.2500 2.2500
0.2500 2.5000
0.2500 2.7500
0.2500 3.0000
0.5000 0.0000
0.5000 0.2500
0.5000 0.5000
0.5000 0.7500
0.5000 1.0000
0.5000 1.2500
0.5000 1.5000
0.5000 1.7500
0.5000 2.0000
0.5000 2.2500
0.5000 2.5000
0.5000 2.7500
0.5000 3.0000
0.7500 0.0000
0.7500 0.2500
0.7500 0.5000
0.7500 0.7500
0.7500 1.0000
0.7500 1.2500
0.7500 1.5000
0.7500 1.7500
0.7500 2.0000
0.7500 2.2500
0.7500 2.5000
0.7500 2.7500
0.7500 3.0000
1.0000 0.0000
1.0000 0.2500
1.0000 0.5000
1.0000 0.7500
1.0000 1.0000
1.0000 1.2500
1.0000 1.5000
1.0000 1.7500
1.0000 2.0000
1.0000 2.2500
1.0000 2.5000
1.0000 2.7500
1.0000 3.0000
1.2500 0.0000
1.2500 0.2500
1.2500 0.5000
1.2500 0.7500
1.2500 1.0000
1.2500 1.2500
1.2500 1.5000
1.2500 1.7500
1.2500 2.0000
1.2500 2.2500
1.2500 2.5000
1.2500 2.7500
1.2500 3.0000
1.5000 0.0000
1.5000 0.2500
1.5000 0.5000
1.5000 0.7500
1.5000 1.0000
1.5000 1.2500
1.5000 1.5000
1.5000 1.7500
1.5000 2.0000
1.5000 2.2500
1.5000 2.5000
1.5000 2.7500
1.5000 3.0000
1.7500 0.0000
1.7500 0.2500
1.7500 0.5000
1.7500 0.7500
1.7500 1.0000
1.7500 1.2500
1.7500 1.5000
1.7500 1.7500
1.7500 2.0000
1.7500 2.2500
1.7500 2.5000
1.7500 2.7500
1.7500 3.0000
2.0000 0.0000
2.0000 0.2500
2.0000 0.5000
2.0000 0.7500
2.0000 1.0000
2.0000 1.2500
2.0000 1.5000
2.0000 1.7500
2.0000 2.0000
2.0000 2.2500
2.0000 2.5000
2.0000 2.7500
2.0000 3.0000
2.2500 0.0000
2.2500 0.2500
2.2500 0.5000
2.2500 0.7500
2.2500 1.0000
2.2500 1.2500
2.2500 1.5000
2.2500 1.7500
2.2500 2.0000
2.2500 2.2500
2.2500 2.5000
2.2500 2.7500
2.2500 3.0000
2.5000 0.0000
2.5000 0.2500
2.5000 0.5000
2.5000 0.7500
2.5000 1.0000
2.5000 1.2500
2.5000 1.5000
2.5000 1.7500
2.5000 2.0000
2.5000 2.2500
2.5000 2.5000
2.5000 2.7500
2.5000 3.0000
2.7500 0.0000
2.7500 0.2500
2.7500 0.5000
2.7500 0.7500
2.7500 1.0000
2.7500 1.2500
2.7500 1.5000
2.7500 1.7500
2.7500 2.0000
2.7500 2.2500
2.7500 2.5000
2.7500 2.7500
2.7500 3.0000
3.0000 0.0000
3.0000 0.2500
3.0000 0.5000
3.0000 0.7500
3.0000 1.0000
3.0000 1.2500
3.0000 1.5000
3.0000 1.7500
3.0000 2.0000
3.0000 2.2500
3.0000 2.5000
3.0000 2.7500
3.0000 3.0000
3.2500 0.0000
3.2500 0.2500
3.2500 0.5000
3.2500 0.7500
3.2500 1.0000
3.2500 1.2500
3.2500 1.5000
3.2500 1.7500
3.2500 2.0000
3.2500 2.2500
3.2500 2.5000
3.2500 2.7500
3.2500 3.0000
3.5000 0.0000
3.5000 0.2500
3.5000 0.5000
3.5000 0.7500
3.5000 1.0000
3.5000 1.2500
3.5000 1.5000
3.5000 1.7500
3.5000 2.0000
3.5000 2.2500
3.5000 2.5000
3.5000 2.7500
3.5000 3.0000
3.7500 0.0000
3.7500 0.2500
3.7500 0.5000
3.7500 0.7500
3.7500 1.0000
3.7500 1.2500
3.7500 1.5000
3.7500 1.7500
3.7500 2.0000
3.7500 2.2500
3.7500 2.5000
3.7500 2.7500
3.7500 3.0000
4.0000 0.0000
4.0000 0.2500
4.0000 0.5000
4.0000 0.7500
4.0000 1.0000
4.0000 1.2500
4.0000 1.5000
4.0000 1.7500
4.0000 2.0000
4.0000 2.2500
4.0000 2.5000
4.0000 2.7500
4.0000 3.0000
4.2500 0.0000
4.2500 0.2500
4.2500 0.5000
4.2500 0.7500
4.2500 1.0000
4.2500 1.2500
4.2500 1.5000
4.2500 1.7500
4.2500 2.0000
4.2500 2.2500
4.2500 2.5000
4.2500 2.7500
4.2500 3.0000
4.5000 0.0000
4.5000 0.2500
4.5000 0.5000
4.5000 0.7500
4.5000 1.0000
4.5000 1.2500
4.5000 1.5000
4.5000 1.7500
4.5000 2.0000
4.5000 2.2500
4.5000 2.5000
4.5000 2.7500
4.5000 3.0000
4.7500 0.0000
4.7500 0.2500
4.7500 0.5000
4.7500 0.7500
4.7500 1.0000
4.7500 1.2500
4.7500 1.5000
4.7500 1.7500
4.7500 2.0000
4.7500 2.2500
4.7500 2.5000
4.7500 2.7500
4.7500 3.0000
5.0000 0.0000
5.0000 0.2500
5.0000 0.5000
5.0000 0.7500
5.0000 1.0000
5.0000 1.2500
5.0000 1.5000
5.0000 1.7500
5.0000 2.0000
5.0000 2.2500
5.0000 2.5000
5.0000 2.7500
5.0000 3.0000
CELLS:
4 0000 0 13 14 1
4 0000 1 14 15 2
4 0000 2 15 16 3
4 0000 3 16 17 4
4 0000 4 17 18 5
4 0000 5 18 19 6
4 0000 6 19 20 7
4 0000 7 20 21 8
4 0000 8 21 22 9
4 0000 9 22 23 10
4 0000 10 23 24 11
4 0000 11 24 25 12
4 0000 13 26 27 14
4 0000 14 27 28 15
4 0000 15 28 29 16
4 0000 16 29 30 17
4 0000 17 30 31 18
4 0000 18 31 32 19
4 0000 19 32 33 20
4 0000 20 33 34 21
4 0000 21 34 35 22
4 0000 22 35 36 23
4 0000 23 36 37 24
4 0000 24 37 38 25
4 0000 26 39 40 27
4 0000 27 40 41 28
4 0000 28 41 42 29
4 0000 29 42 43 30
4 0000 30 43 44 31
4 0000 31 44 45 32
4 0000 32 45 46 33
4 0000 33 46 47 34
4 0000 34 47 48 35
4 0000 35 48 49 36
4 0000 36 49 50 37
4 0000 37 50 51 38
4 0000 39 52 53 40
4 0000 40 53 54 41
4 0000 41 54 55 42
4 0000 42 55 56 43
4 0000 43 56 57 44
4 0000 44 57 58 45
4 0000 45 58 59 46
4 0000 46 59 60 47
4 0000 47 60 61 48
4 0000 48 61 62 49
4 0000 49 62 63 50
4 0000 50 63 64 51
4 0000 52 65 66 53
4 0000 53 66 67 54
4 0000 54 67 68 55
4 0000 55 68 69 56
4 0000 56 69 70 57
4 0000 57 70 71 58
4 0000 58 71 72 59
4 0000 59 72 73 60
4 0000 60 73 74 61
4 0000 61 74 75 62
4 0000 62 75 76 63
4 0000 63 76 77 64
4 0000 65 78 79 66
4 0000 66 79 80 67
4 0000 67 80 81 68
4 0000 68 81 82 69
4 0000 69 82 83 70
4 0000 70 83 84 71
4 0000 71 84 85 72
4 0000 72 85 86 73
4 0000 73 86 87 74
4 0000 74 87 88 75
4 0000 75 88 89 76
4 0000 76 89 90 77
4 0000 78 91 92 79
4 0000 79 92 93 80
4 0000 80 93 94 81
4 0000 81 94 95 82
4 0000 82 95 96 83
4 0000 83 96 97 84
4 0000 84 97 98 85
4 0000 85 98 99 86
4 0000 86 99 100 87
4 0000 87 100 101 88
4 0000 88 101 102 89
4 0000 89 102 103 90
4 0000 91 104 105 92
4 0000 92 105 106 93
4 0000 93 106 107 94
4 0000 94 107 108 95
4 0000 95 108 109 96
4 0000 96 109 110 97
4 0000 97 110 111 98
4 0000 98 111 112 99
4 0000 99 112 113 100
4 0000 100 113 114 101
4 0000 101 114 115 102
4 0000 102 115 116 103
4 0000 104 117 118 105
4 0000 105 118 119 106
4 0000 106 119 120 107
4 0000 107 120 121 108
4 0000 108 121 122 109
4 0000 109 122 123 110
4 0000 110 123 124 111
4 0000 111 124 125 112
4 0000 112 125 126 113
4 0000 113 126 127 114
4 0000 114 127 128 115
4 0000 115 128 129 116
4 0000 117 130 131 118
4 0000 118 131 132 119
4 0000 119 132 133 120
4 0000 120 133 134 121
4 0000 121 134 135 122
4 0000 122 135 136 123
4 0000 123 136 137 124
4 0000 124 137 138 125
4 0000 125 138 139 126
4 0000 126 139 140 127
4 0000 127 140 141 128
4 0000 128 141 142 129
4 0000 130 143 144 131
4 0000 131 144 145 132
4 0000 132 145 146 133
4 0000 133 146 147 134
4 0000 134 147 148 135
4 0000 135 148 149 136
4 0000 136 149 150 137
4 0000 137 150 151 138
4 0000 138 151 152 139
4 0000 139 152 153 140
4 0000 140 153 154 141
4 0000 141 154 155 142
4 0000 143 156 157 144
4 0000 144 157 158 145
4 0000 145 158 159 146
4 0000 146 159 160 147
4 0000 147 160 161 148
4 0000 148 161 162 149
4 0000 149 162 163 150
4 0000 150 163 164 151
4 0000 151 164 165 152
4 0000 152 165 166 153
4 0000 153 166 167 154
4 0000 154 167 168 155
4 0000 156 169 170 157
4 0000 157 170 171 158
4 0000 158 171 172 159
4 0000 159 172 173 160
4 0000 160 173 174 161
4 0000 161 174 175 162
4 0000 162 175 176 163
4 0000 163 176 177 164
4 0000 164 177 178 165
4 0000 165 178 179 166
4 0000 166 179 180 167
4 0000 167 180 181 168
4 0000 169 182 183 170
4 0000 170 183 184 171
4 0000 171 184 185 172
4 0000 172 185 186 173
4 0000 173 186 187 174
4 0000 174 187 188 175
4 0000 175 188 189 176
4 0000 176 189 190 177
4 0000 177 190 191 178
4 0000 178 191 192 179
4 0000 179 192 193 180
4 0000 180 193 194 181
4 0000 182 195 196 183
4 0000 183 196 197 184
4 0000 184 197 198 185
4 0000 185 198 199 186
4 0000 186 199 200 187
4 0000 187 200 201 188
4 0000 188 201 202 189
4 0000 189 202 203 190
4 0000 190 203 204 191
4 0000 191 204 205 192
4 0000 192 205 206 193
4 0000 193 206 207 194
4 0000 195 208 209 196
4 0000 196 209 210 197
4 0000 197 210 211 198
4 0000 198 211 212 199
4 0000 199 212 213 200
4 0000 200 213 214 201
4 0000 201 214 215 202
4 0000 202 215 216 203
4 0000 203 216 217 204
4 0000 204 217 218 205
4 0000 205 218 219 206
4 0000 206 219 220 207
4 0000 208 221 222 209
4 0000 209 222 223 210
4 0000 210 223 224 211
4 0000 211 224 225 212
4 0000 212 225 226 213
4 0000 213 226 227 214
4 0000 214 227 228 215
4 0000 215 228 229 216
4 0000 216 229 230 217
4 0000 217 230 231 218
4 0000 218 231 232 219
4 0000 219 232 233 220
4 0000 221 234 235 222
4 0000 222 235 236 223
4 0000 223 236 237 224
4 0000 224 237 238 225
4 0000 225 238 239 226
4 0000 226 239 240 227
4 0000 227 240 241 228
4 0000 228 241 242 229
4 0000 229 242 243 230
4 0000 230 243 244 231
4 0000 231 244 245 232
4 0000 232 245 246 233
4 0000 234 247 248 235
4 0000 235 248 249 236
4 0000 236 249 250 237
4 0000 237 250 251 238
4 0000 238 251 252 239
4 0000 239 252 253 240
4 0000 240 253 254 241
4 0000 241 254 255 242
4 0000 242 255 256 243
4 0000 243 256 257 244
4 0000 244 257 258 245
4 0000 245 258 259 246
4 0000 247 260 261 248
4 0000 248 261 262 249
4 0000 249 262 263 250
4 0000 250 263 264 251
4 0000 251 264 265 252
4 0000 252 265 266 253
4 0000 253 266 267 254
4 0000 254 267 268 255
4 0000 255 268 269 256
4 0000 256 269 270 257
4 0000 257 270 271 258
4 0000 258 271 272 259
VDATA:
12 1.0 0.0 0.0 0.0 1.0 0.0 0.0 0.0 1.0 0.0 0.002 0.8202
12 1.0 0.0 0.0 0.0 1.0 0.0 0.0 0.0 1.0 0.0 0.002 0.8202
12 1.0 0.0 0.0 0.0 1.0 0.0 0.0 0.0 1.0 0.0 0.002 0.8202
12 1.0 0.0 0.0 0.0 1.0 0.0 0.0 0.0 1.0 0.0 0.002 0.8202
12 1.0 0.0 0.0 0.0 1.0 0.0 0.0 0.0 1.0 0.0 0.002 0.8202
12 1.0 0.0 0.0 0.0 1.0 0.0 0.0 0.0 1.0 0.0 0.002 0.8202
12 1.0 0.0 0.0 0.0 1.0 0.0 0.0 0.0 1.0 0.0 0.002 0.8202
12 1.0 0.0 0.0 0.0 1.0 0.0 0.0 0.0 1.0 -10.0 0.0 0.0
12 1.0 0.0 0.0 0.0 1.0 0.0 0.0 0.0 1.0 -10.0 0.0 0.0
12 1.0 0.0 0.0 0.0 1.0 0.0 0.0 0.0 1.0 -10.0 0.0 0.0
12 1.0 0.0 0.0 0.0 1.0 0.0 0.0 0.0 1.0 -10.0 0.0 0.0
12 1.0 0.0 0.0 0.0 1.0 0.0 0.0 0.0 1.0 -10.0 0.0 0.0
12 1.0 0.0 0.0 0.0 1.0 0.0 0.0 0.0 1.0 -10.0 0.0 0.0
12 1.0 0.0 0.0 0.0 1.0 0.0 0.0 0.0 1.0 0.0 0.002 0.8202
12 1.0 0.0 0.0 0.0 1.0 0.0 0.0 0.0 1.0 0.0 0.002 0.8202
12 1.0 0.0 0.0 0.0 1.0 0.0 0.0 0.0 1.0 0.0 0.002 0.8202
12 1.0 0.0 0.0 0.0 1.0 0.0 0.0 0.0 1.0 0.0 0.002 0.8202
12 1.0 0.0 0.0 0.0 1.0 0.0 0.0 0.0 1.0 0.0 0.002 0.8202
12 1.0 0.0 0.0 0.0 1.0 0.0 0.0 0.0 1.0 0.0 0.002 0.8202
12 1.0 0.0 0.0 0.0 1.0 0.0 0.0 0.0 1.0 0.0 0.002 0.8202
12 1.0 0.0 0.0 0.0 1.0 0.0 0.0 0.0 1.0 -10.0 0.0 0.0
12 1.0 0.0 0.0 0.0 1.0 0.0 0.0 0.0 1.0 -10.0 0.0 0.0
12 1.0 0.0 0.0 0.0 1.0 0.0 0.0 0.0 1.0 -10.0 0.0 0.0
12 1.0 0.0 0.0 0.0 1.0 0.0 0.0 0.0 1.0 -10.0 0.0 0.0
12 1.0 0.0 0.0 0.0 1.0 0.0 0.0 0.0 1.0 -10.0 0.0 0.0
12 1.0 0.0 0.0 0.0 1.0 0.0 0.0 0.0 1.0 -10.0 0.0 0.0
12 1.0 0.0 0.0 0.0 1.0 0.0 0.0 0.0 1.0 0.0 0.002 0.8202
12 1.0 0.0 0.0 0.0 1.0 0.0 0.0 0.0 1.0 0.0 0.002 0.8202
12 1.0 0.0 0.0 0.0 1.0 0.0 0.0 0.0 1.0 0.0 0.002 0.8202
12 1.0 0.0 0.0 0.0 1.0 0.0 0.0 0.0 1.0 0.0 0.002 0.8202
12 1.0 0.0 0.0 0.0 1.0 0.0 0.0 0.0 1.0 0.0 0.002 0.8202
12 1.0 0.0 0.0 0.0 1.0 0.0 0.0 0.0 1.0 0.0 0.002 0.8202
12 1.0 0.0 0.0 0.0 1.0 0.0 0.0 0.0 1.0 0.0 0.002 0.8202
12 1.0 0.0 0.0 0.0 1.0 0.0 0.0 0.0 1.0 -10.0 0.0 0.0
12 1.0 0.0 0.0 0.0 1.0 0.0 0.0 0.0 1.0 -10.0 0.0 0.0
12 1.0 0.0 0.0 0.0 1.0 0.0 0.0 0.0 1.0 -10.0 0.0 0.0
12 1.0 0.0 0.0 0.0 1.0 0.0 0.0 0.0 1.0 -10.0 0.0 0.0
12 1.0 0.0 0.0 0.0 1.0 0.0 0.0 0.0 1.0 -10.0 0.0 0.0
12 1.0 0.0 0.0 0.0 1.0 0.0 0.0 0.0 1.0 -10.0 0.0 0.0
12 1.0 0.0 0.0 0.0 1.0 0.0 0.0 0.0 1.0 0.0 0.002 0.8202
12 1.0 0.0 0.0 0.0 1.0 0.0 0.0 0.0 1.0 0.0 0.002 0.8202
12 1.0 0.0 0.0 0.0 1.0 0.0 0.0 0.0 1.0 0.0 0.002 0.8202
12 1.0 0.0 0.0 0.0 1.0 0.0 0.0 0.0 1.0 0.0 0.002 0.8202
12 1.0 0.0 0.0 0.0 1.0 0.0 0.0 0.0 1.0 0.0 0.002 0.8202
12 1.0 0.0 0.0 0.0 1.0 0.0 0.0 0.0 1.0 0.0 0.002 0.8202
12 1.0 0.0 0.0 0.0 1.0 0.0 0.0 0.0 1.0 0.0 0.002 0.8202
12 1.0 0.0 0.0 0.0 1.0 0.0 0.0 0.0 1.0 -10.0 0.0 0.0
12 1.0 0.0 0.0 0.0 1.0 0.0 0.0 0.0 1.0 -10.0 0.0 0.0
12 1.0 0.0 0.0 0.0 1.0 0.0 0.0 0.0 1.0 -10.0 0.0 0.0
12 1.0 0.0 0.0 0.0 1.0 0.0 0.0 0.0 1.0 -10.0 0.0 0.0
12 1.0 0.0 0.0 0.0 1.0 0.0 0.0 0.0 1.0 -10.0 0.0 0.0
12 1.0 0.0 0.0 0.0 1.0 0.0 0.0 0.0 1.0 -10.0 0.0 0.0
12 1.0 0.0 0.0 0.0 1.0 0.0 0.0 0.0 1.0 0.0 0.002 0.8202
12 1.0 0.0 0.0 0.0 1.0 0.0 0.0 0.0 1.0 0.0 0.002 0.8202
12 1.0 0.0 0.0 0.0 1.0 0.0 0.0 0.0 1.0 0.0 0.002 0.8202
12 1.0 0.0 0.0 0.0 1.0 0.0 0.0 0.0 1.0 0.0 0.002 0.8202
12 1.0 0.0 0.0 0.0 1.0 0.0 0.0 0.0 1.0 0.0 0.002 0.8202
12 1.0 0.0 0.0 0.0 1.0 0.0 0.0 0.0 1.0 0.0 0.002 0.8202
12 1.0 0.0 0.0 0.0 1.0 0.0 0.0 0.0 1.0 0.0 0.002 0.8202
12 1.0 0.0 0.0 0.0 1.0 0.0 0.0 0.0 1.0 -10.0 0.0 0.0
12 1.0 0.0 0.0 0.0 1.0 0.0 0.0 0.0 1.0 -10.0 0.0 0.0
12 1.0 0.0 0.0 0.0 1.0 0.0 0.0 0.0 1.0 -10.0 0.0 0.0
12 1.0 0.0 0.0 0.0 1.0 0.0 0.0 0.0 1.0 -10.0 0.0 0.0
12 1.0 0.0 0.0 0.0 1.0 0.0 0.0 0.0 1.0 -10.0 0.0 0.0
12 1.0 0.0 0.0 0.0 1.0 0.0 0.0 0.0 1.0 -10.0 0.0 0.0
12 1.0 0.0 0.0 0.0 1.0 0.0 0.0 0.0 1.0 0.0 0.002 0.8202
12 1.0 0.0 0.0 0.0 1.0 0.0 0.0 0.0 1.0 0.0 0.002 0.8202
12 1.0 0.0 0.0 0.0 1.0 0.0 0.0 0.0 1.0 0.0 0.002 0.8202
12 1.0 0.0 0.0 0.0 1.0 0.0 0.0 0.0 1.0 0.0 0.002 0.8202
12 1.0 0.0 0.0 0.0 1.0 0.0 0.0 0.0 1.0 0.0 0.002 0.8202
12 1.0 0.0 0.0 0.0 1.0 0.0 0.0 0.0 1.0 0.0 0.002 0.8202
12 1.0 0.0 0.0 0.0 1.0 0.0 0.0 0.0 1.0 0.0 0.002 0.8202
12 1.0 0.0 0.0 0.0 1.0 0.0 0.0 0.0 1.0 -10.0 0.0 0.0
12 1.0 0.0 0.0 0.0 1.0 0.0 0.0 0.0 1.0 -10.0 0.0 0.0
12 1.0 0.0 0.0 0.0 1.0 0.0 0.0 0.0 1.0 -10.0 0.0 0.0
12 1.0 0.0 0.0 0.0 1.0 0.0 0.0 0.0 1.0 -10.0 0.0 0.0
12 1.0 0.0 0.0 0.0 1.0 0.0 0.0 0.0 1.0 -10.0 0.0 0.0
12 1.0 0.0 0.0 0.0 1.0 0.0 0.0 0.0 1.0 -10.0 0.0 0.0
12 1.0 0.0 0.0 0.0 1.0 0.0 0.0 0.0 1.0 0.0 0.002 0.8202
12 1.0 0.0 0.0 0.0 1.0 0.0 0.0 0.0 1.0 0.0 0.002 0.8202
12 1.0 0.0 0.0 0.0 1.0 0.0 0.0 0.0 1.0 0.0 0.002 0.8202
12 1.0 0.0 0.0 0.0 1.0 0.0 0.0 0.0 1.0 0.0 0.002 0.8202
12 1.0 0.0 0.0 0.0 1.0 0.0 0.0 0.0 1.0 0.0 0.002 0.8202
12 1.0 0.0 0.0 0.0 1.0 0.0 0.0 0.0 1.0 0.0 0.002 0.8202
12 1.0 0.0 0.0 0.0 1.0 0.0 0.0 0.0 1.0 0.0 0.002 0.8202
12 1.0 0.0 0.0 0.0 1.0 0.0 0.0 0.0 1.0 -10.0 0.0 0.0
12 1.0 0.0 0.0 0.0 1.0 0.0 0.0 0.0 1.0 -10.0 0.0 0.0
12 1.0 0.0 0.0 0.0 1.0 0.0 0.0 0.0 1.0 -10.0 0.0 0.0
12 1.0 0.0 0.0 0.0 1.0 0.0 0.0 0.0 1.0 -10.0 0.0 0.0
12 1.0 0.0 0.0 0.0 1.0 0.0 0.0 0.0 1.0 -10.0 0.0 0.0
12 1.0 0.0 0.0 0.0 1.0 0.0 0.0 0.0 1.0 -10.0 0.0 0.0
12 1.0 0.0 0.0 0.0 1.0 0.0 0.0 0.0 1.0 -10.0 0.0 0.0
12 1.0 0.0 0.0 0.0 1.0 0.0 0.0 0.0 1.0 -10.0 0.0 0.0
12 1.0 0.0 0.0 0.0 1.0 0.0 0.0 0.0 1.0 -10.0 0.0 0.0
12 1.0 0.0 0.0 0.0 1.0 0.0 0.0 0.0 1.0 -10.0 0.0 0.0
12 1.0 0.0 0.0 0.0 1.0 0.0 0.0 0.0 1.0 -10.0 0.0 0.0
12 1.0 0.0 0.0 0.0 1.0 0.0 0.0 0.0 1.0 -10.0 0.0 0.0
12 1.0 0.0 0.0 0.0 1.0 0.0 0.0 0.0 1.0 -10.0 0.0 0.0
12 1.0 0.0 0.0 0.0 1.0 0.0 0.0 0.0 1.0 -10.0 0.0 0.0
12 1.0 0.0 0.0 0.0 1.0 0.0 0.0 0.0 1.0 -10.0 0.0 0.0
12 1.0 0.0 0.0 0.0 1.0 0.0 0.0 0.0 1.0 -10.0 0.0 0.0
12 1.0 0.0 0.0 0.0 1.0 0.0 0.0 0.0 1.0 -10.0 0.0 0.0
12 1.0 0.0 0.0 0.0 1.0 0.0 0.0 0.0 1.0 -10.0 0.0 0.0
12 1.0 0.0 0.0 0.0 1.0 0.0 0.0 0.0 1.0 -10.0 0.0 0.0
12 1.0 0.0 0.0 0.0 1.0 0.0 0.0 0.0 1.0 -10.0 0.0 0.0
12 1.0 0.0 0.0 0.0 1.0 0.0 0.0 0.0 1.0 -10.0 0.0 0.0
12 1.0 0.0 0.0 0.0 1.0 0.0 0.0 0.0 1.0 -10.0 0.0 0.0
12 1.0 0.0 0.0 0.0 1.0 0.0 0.0 0.0 1.0 -10.0 0.0 0.0
12 1.0 0.0 0.0 0.0 1.0 0.0 0.0 0.0 1.0 -10.0 0.0 0.0
12 1.0 0.0 0.0 0.0 1.0 0.0 0.0 0.0 1.0 -10.0 0.0 0.0
12 1.0 0.0 0.0 0.0 1.0 0.0 0.0 0.0 1.0 -10.0 0.0 0.0
12 1.0 0.0 0.0 0.0 1.0 0.0 0.0 0.0 1.0 -10.0 0.0 0.0
12 1.0 0.0 0.0 0.0 1.0 0.0 0.0 0.0 1.0 -10.0 0.0 0.0
12 1.0 0.0 0.0 0.0 1.0 0.0 0.0 0.0 1.0 -10.0 0.0 0.0
12 1.0 0.0 0.0 0.0 1.0 0.0 0.0 0.0 1.0 -10.0 0.0 0.0
12 1.0 0.0 0.0 0.0 1.0 0.0 0.0 0.0 1.0 -10.0 0.0 0.0
12 1.0 0.0 0.0 0.0 1.0 0.0 0.0 0.0 1.0 -10.0 0.0 0.0
12 1.0 0.0 0.0 0.0 1.0 0.0 0.0 0.0 1.0 -10.0 0.0 0.0
12 1.0 0.0 0.0 0.0 1.0 0.0 0.0 0.0 1.0 -10.0 0.0 0.0
12 1.0 0.0 0.0 0.0 1.0 0.0 0.0 0.0 1.0 -10.0 0.0 0.0
12 1.0 0.0 0.0 0.0 1.0 0.0 0.0 0.0 1.0 -10.0 0.0 0.0
12 1.0 0.0 0.0 0.0 1.0 0.0 0.0 0.0 1.0 -10.0 0.0 0.0
12 1.0 0.0 0.0 0.0 1.0 0.0 0.0 0.0 1.0 -10.0 0.0 0.0
12 1.0 0.0 0.0 0.0 1.0 0.0 0.0 0.0 1.0 -10.0 0.0 0.0
12 1.0 0.0 0.0 0.0 1.0 0.0 0.0 0.0 1.0 -10.0 0.0 0.0
12 1.0 0.0 0.0 0.0 1.0 0.0 0.0 0.0 1.0 -10.0 0.0 0.0
12 1.0 0.0 0.0 0.0 1.0 0.0 0.0 0.0 1.0 -10.0 0.0 0.0
12 1.0 0.0 0.0 0.0 1.0 0.0 0.0 0.0 1.0 -10.0 0.0 0.0
12 1.0 0.0 0.0 0.0 1.0 0.0 0.0 0.0 1.0 -10.0 0.0 0.0
12 1.0 0.0 0.0 0.0 1.0 0.0 0.0 0.0 1.0 -10.0 0.0 0.0
12 1.0 0.0 0.0 0.0 1.0 0.0 0.0 0.0 1.0 -10.0 0.0 0.0
12 1.0 0.0 0.0 0.0 1.0 0.0 0.0 0.0 1.0 -10.0 0.0 0.0
12 1.0 0.0 0.0 0.0 1.0 0.0 0.0 0.0 1.0 -10.0 0.0 0.0
12 1.0 0.0 0.0 0.0 1.0 0.0 0.0 0.0 1.0 -10.0 0.0 0.0
12 1.0 0.0 0.0 0.0 1.0 0.0 0.0 0.0 1.0 -10.0 0.0 0.0
12 1.0 0.0 0.0 0.0 1.0 0.0 0.0 0.0 1.0 -10.0 0.0 0.0
12 1.0 0.0 0.0 0.0 1.0 0.0 0.0 0.0 1.0 -10.0 0.0 0.0
12 1.0 0.0 0.0 0.0 1.0 0.0 0.0 0.0 1.0 -10.0 0.0 0.0
12 1.0 0.0 0.0 0.0 1.0 0.0 0.0 0.0 1.0 -10.0 0.0 0.0
12 1.0 0.0 0.0 0.0 1.0 0.0 0.0 0.0 1.0 -10.0 0.0 0.0
12 1.0 0.0 0.0 0.0 1.0 0.0 0.0 0.0 1.0 -10.0 0.0 0.0
12 1.0 0.0 0.0 0.0 1.0 0.0 0.0 0.0 1.0 -10.0 0.0 0.0
12 1.0 0.0 0.0 0.0 1.0 0.0 0.0 0.0 1.0 -10.0 0.0 0.0
12 1.0 0.0 0.0 0.0 1.0 0.0 0.0 0.0 1.0 -10.0 0.0 0.0
12 1.0 0.0 0.0 0.0 1.0 0.0 0.0 0.0 1.0 -10.0 0.0 0.0
12 1.0 0.0 0.0 0.0 1.0 0.0 0.0 0.0 1.0 -10.0 0.0 0.0
12 1.0 0.0 0.0 0.0 1.0 0.0 0.0 0.0 1.0 -10.0 0.0 0.0
12 1.0 0.0 0.0 0.0 1.0 0.0 0.0 0.0 1.0 -10.0 0.0 0.0
12 1.0 0.0 0.0 0.0 1.0 0.0 0.0 0.0 1.0 -10.0 0.0 0.0
12 1.0 0.0 0.0 0.0 1.0 0.0 0.0 0.0 1.0 -10.0 0.0 0.0
12 1.0 0.0 0.0 0.0 1.0 0.0 0.0 0.0 1.0 -10.0 0.0 0.0
12 1.0 0.0 0.0 0.0 1.0 0.0 0.0 0.0 1.0 -10.0 0.0 0.0
12 1.0 0.0 0.0 0.0 1.0 0.0 0.0 0.0 1.0 -10.0 0.0 0.0
12 1.0 0.0 0.0 0.0 1.0 0.0 0.0 0.0 1.0 -10.0 0.0 0.0
12 1.0 0.0 0.0 0.0 1.0 0.0 0.0 0.0 1.0 -10.0 0.0 0.0
12 1.0 0.0 0.0 0.0 1.0 0.0 0.0 0.0 1.0 -10.0 0.0 0.0
12 1.0 0.0 0.0 0.0 1.0 0.0 0.0 0.0 1.0 -10.0 0.0 0.0
12 1.0 0.0 0.0 0.0 1.0 0.0 0.0 0.0 1.0 -10.0 0.0 0.0
12 1.0 0.0 0.0 0.0 1.0 0.0 0.0 0.0 1.0 -10.0 0.0 0.0
12 1.0 0.0 0.0 0.0 1.0 0.0 0.0 0.0 1.0 -10.0 0.0 0.0
12 1.0 0.0 0.0 0.0 1.0 0.0 0.0 0.0 1.0 -10.0 0.0 0.0
12 1.0 0.0 0.0 0.0 1.0 0.0 0.0 0.0 1.0 -10.0 0.0 0.0
12 1.0 0.0 0.0 0.0 1.0 0.0 0.0 0.0 1.0 -10.0 0.0 0.0
12 1.0 0.0 0.0 0.0 1.0 0.0 0.0 0.0 1.0 -10.0 0.0 0.0
12 1.0 0.0 0.0 0.0 1.0 0.0 0.0 0.0 1.0 -10.0 0.0 0.0
12 1.0 0.0 0.0 0.0 1.0 0.0 0.0 0.0 1.0 -10.0 0.0 0.0
12 1.0 0.0 0.0 0.0 1.0 0.0 0.0 0.0 1.0 -10.0 0.0 0.0
12 1.0 0.0 0.0 0.0 1.0 0.0 0.0 0.0 1.0 -10.0 0.0 0.0
12 1.0 0.0 0.0 0.0 1.0 0.0 0.0 0.0 1.0 -10.0 0.0 0.0
12 1.0 0.0 0.0 0.0 1.0 0.0 0.0 0.0 1.0 -10.0 0.0 0.0
12 1.0 0.0 0.0 0.0 1.0 0.0 0.0 0.0 1.0 -10.0 0.0 0.0
12 1.0 0.0 0.0 0.0 1.0 0.0 0.0 0.0 1.0 -10.0 0.0 0.0
12 1.0 0.0 0.0 0.0 1.0 0.0 0.0 0.0 1.0 -10.0 0.0 0.0
12 1.0 0.0 0.0 0.0 1.0 0.0 0.0 0.0 1.0 -10.0 0.0 0.0
12 1.0 0.0 0.0 0.0 1.0 0.0 0.0 0.0 1.0 -10.0 0.0 0.0
12 1.0 0.0 0.0 0.0 1.0 0.0 0.0 0.0 1.0 -10.0 0.0 0.0
12 1.0 0.0 0.0 0.0 1.0 0.0 0.0 0.0 1.0 -10.0 0.0 0.0
12 1.0 0.0 0.0 0.0 1.0 0.0 0.0 0.0 1.0 -10.0 0.0 0.0
12 1.0 0.0 0.0 0.0 1.0 0.0 0.0 0.0 1.0 -10.0 0.0 0.0
12 1.0 0.0 0.0 0.0 1.0 0.0 0.0 0.0 1.0 -10.0 0.0 0.0
12 1.0 0.0 0.0 0.0 1.0 0.0 0.0 0.0 1.0 -10.0 0.0 0.0
12 1.0 0.0 0.0 0.0 1.0 0.0 0.0 0.0 1.0 -10.0 0.0 0.0
12 1.0 0.0 0.0 0.0 1.0 0.0 0.0 0.0 1.0 -10.0 0.0 0.0
12 1.0 0.0 0.0 0.0 1.0 0.0 0.0 0.0 1.0 -10.0 0.0 0.0
12 1.0 0.0 0.0 0.0 1.0 0.0 0.0 0.0 1.0 -10.0 0.0 0.0
12 1.0 0.0 0.0 0.0 1.0 0.0 0.0 0.0 1.0 -10.0 0.0 0.0
12 1.0 0.0 0.0 0.0 1.0 0.0 0.0 0.0 1.0 -10.0 0.0 0.0
12 1.0 0.0 0.0 0.0 1.0 0.0 0.0 0.0 1.0 -10.0 0.0 0.0
12 1.0 0.0 0.0 0.0 1.0 0.0 0.0 0.0 1.0 -10.0 0.0 0.0
12 1.0 0.0 0.0 0.0 1.0 0.0 0.0 0.0 1.0 -10.0 0.0 0.0
12 1.0 0.0 0.0 0.0 1.0 0.0 0.0 0.0 1.0 -10.0 0.0 0.0
12 1.0 0.0 0.0 0.0 1.0 0.0 0.0 0.0 1.0 -10.0 0.0 0.0
12 1.0 0.0 0.0 0.0 1.0 0.0 0.0 0.0 1.0 -10.0 0.0 0.0
12 1.0 0.0 0.0 0.0 1.0 0.0 0.0 0.0 1.0 -10.0 0.0 0.0
12 1.0 0.0 0.0 0.0 1.0 0.0 0.0 0.0 1.0 -10.0 0.0 0.0
12 1.0 0.0 0.0 0.0 1.0 0.0 0.0 0.0 1.0 -10.0 0.0 0.0
12 1.0 0.0 0.0 0.0 1.0 0.0 0.0 0.0 1.0 -10.0 0.0 0.0
12 1.0 0.0 0.0 0.0 1.0 0.0 0.0 0.0 1.0 -10.0 0.0 0.0
12 1.0 0.0 0.0 0.0 1.0 0.0 0.0 0.0 1.0 -10.0 0.0 0.0
12 1.0 0.0 0.0 0.0 1.0 0.0 0.0 0.0 1.0 -10.0 0.0 0.0
12 1.0 0.0 0.0 0.0 1.0 0.0 0.0 0.0 1.0 -10.0 0.0 0.0
12 1.0 0.0 0.0 0.0 1.0 0.0 0.0 0.0 1.0 -10.0 0.0 0.0
12 1.0 0.0 0.0 0.0 1.0 0.0 0.0 0.0 1.0 -10.0 0.0 0.0
12 1.0 0.0 0.0 0.0 1.0 0.0 0.0 0.0 1.0 -10.0 0.0 0.0
12 1.0 0.0 0.0 0.0 1.0 0.0 0.0 0.0 1.0 -10.0 0.0 0.0
12 1.0 0.0 0.0 0.0 1.0 0.0 0.0 0.0 1.0 -10.0 0.0 0.0
12 1.0 0.0 0.0 0.0 1.0 0.0 0.0 0.0 1.0 -10.0 0.0 0.0
12 1.0 0.0 0.0 0.0 1.0 0.0 0.0 0.0 1.0 -10.0 0.0 0.0
12 1.0 0.0 0.0 0.0 1.0 0.0 0.0 0.0 1.0 -10.0 0.0 0.0
12 1.0 0.0 0.0 0.0 1.0 0.0 0.0 0.0 1.0 -10.0 0.0 0.0
12 1.0 0.0 0.0 0.0 1.0 0.0 0.0 0.0 1.0 -10.0 0.0 0.0
12 1.0 0.0 0.0 0.0 1.0 0.0 0.0 0.0 1.0 -10.0 0.0 0.0
12 1.0 0.0 0.0 0.0 1.0 0.0 0.0 0.0 1.0 -10.0 0.0 0.0
12 1.0 0.0 0.0 0.0 1.0 0.0 0.0 0.0 1.0 -10.0 0.0 0.0
12 1.0 0.0 0.0 0.0 1.0 0.0 0.0 0.0 1.0 -10.0 0.0 0.0
12 1.0 0.0 0.0 0.0 1.0 0.0 0.0 0.0 1.0 -10.0 0.0 0.0
12 1.0 0.0 0.0 0.0 1.0 0.0 0.0 0.0 1.0 -10.0 0.0 0.0
12 1.0 0.0 0.0 0.0 1.0 0.0 0.0 0.0 1.0 -10.0 0.0 0.0
12 1.0 0.0 0.0 0.0 1.0 0.0 0.0 0.0 1.0 -10.0 0.0 0.0
12 1.0 0.0 0.0 0.0 1.0 0.0 0.0 0.0 1.0 -10.0 0.0 0.0
12 1.0 0.0 0.0 0.0 1.0 0.0 0.0 0.0 1.0 -10.0 0.0 0.0
12 1.0 0.0 0.0 0.0 1.0 0.0 0.0 0.0 1.0 -10.0 0.0 0.0
12 1.0 0.0 0.0 0.0 1.0 0.0 0.0 0.0 1.0 -10.0 0.0 0.0
12 1.0 0.0 0.0 0.0 1.0 0.0 0.0 0.0 1.0 -10.0 0.0 0.0
12 1.0 0.0 0.0 0.0 1.0 0.0 0.0 0.0 1.0 -10.0 0.0 0.0
12 1.0 0.0 0.0 0.0 1.0 0.0 0.0 0.0 1.0 -10.0 0.0 0.0
12 1.0 0.0 0.0 0.0 1.0 0.0 0.0 0.0 1.0 -10.0 0.0 0.0
12 1.0 0.0 0.0 0.0 1.0 0.0 0.0 0.0 1.0 -10.0 0.0 0.0
12 1.0 0.0 0.0 0.0 1.0 0.0 0.0 0.0 1.0 -10.0 0.0 0.0
12 1.0 0.0 0.0 0.0 1.0 0.0 0.0 0.0 1.0 -10.0 0.0 0.0
12 1.0 0.0 0.0 0.0 1.0 0.0 0.0 0.0 1.0 -10.0 0.0 0.0
12 1.0 0.0 0.0 0.0 1.0 0.0 0.0 0.0 1.0 -10.0 0.0 0.0
12 1.0 0.0 0.0 0.0 1.0 0.0 0.0 0.0 1.0 -10.0 0.0 0.0
12 1.0 0.0 0.0 0.0 1.0 0.0 0.0 0.0 1.0 -10.0 0.0 0.0
12 1.0 0.0 0.0 0.0 1.0 0.0 0.0 0.0 1.0 -10.0 0.0 0.0
12 1.0 0.0 0.0 0.0 1.0 0.0 0.0 0.0 1.0 -10.0 0.0 0.0
12 1.0 0.0 0.0 0.0 1.0 0.0 0.0 0.0 1.0 -10.0 0.0 0.0
12 1.0 0.0 0.0 0.0 1.0 0.0 0.0 0.0 1.0 -10.0 0.0 0.0
12 1.0 0.0 0.0 0.0 1.0 0.0 0.0 0.0 1.0 -10.0 0.0 0.0
12 1.0 0.0 0.0 0.0 1.0 0.0 0.0 0.0 1.0 -10.0 0.0 0.0
12 1.0 0.0 0.0 0.0 1.0 0.0 0.0 0.0 1.0 -10.0 0.0 0.0
12 1.0 0.0 0.0 0.0 1.0 0.0 0.0 0.0 1.0 -10.0 0.0 0.0
12 1.0 0.0 0.0 0.0 1.0 0.0 0.0 0.0 1.0 -10.0 0.0 0.0
12 1.0 0.0 0.0 0.0 1.0 0.0 0.0 0.0 1.0 -10.0 0.0 0.0
12 1.0 0.0 0.0 0.0 1.0 0.0 0.0 0.0 1.0 -10.0 0.0 0.0
12 1.0 0.0 0.0 0.0 1.0 0.0 0.0 0.0 1.0 -10.0 0.0 0.0
12 1.0 0.0 0.0 0.0 1.0 0.0 0.0 0.0 1.0 -10.0 0.0 0.0
12 1.0 0.0 0.0 0.0 1.0 0.0 0.0 0.0 1.0 -10.0 0.0 0.0
12 1.0 0.0 0.0 0.0 1.0 0.0 0.0 0.0 1.0 -10.0 0.0 0.0
12 1.0 0.0 0.0 0.0 1.0 0.0 0.0 0.0 1.0 -10.0 0.0 0.0
12 1.0 0.0 0.0 0.0 1.0 0.0 0.0 0.0 1.0 -10.0 0.0 0.0
12 1.0 0.0 0.0 0.0 1.0 0.0 0.0 0.0 1.0 -10.0 0.0 0.0
12 1.0 0.0 0.0 0.0 1.0 0.0 0.0 0.0 1.0 -10.0 0.0 0.0
12 1.0 0.0 0.0 0.0 1.0 0.0 0.0 0.0 1.0 -10.0 0.0 0.0
12 1.0 0.0 0.0 0.0 1.0 0.0 0.0 0.0 1.0 -10.0 0.0 0.0
12 1.0 0.0 0.0 0.0 1.0 0.0 0.0 0.0 1.0 -10.0 0.0 0.0
12 1.0 0.0 0.0 0.0 1.0 0.0 0.0 0.0 1.0 -10.0 0.0 0.0
12 1.0 0.0 0.0 0.0 1.0 0.0 0.0 0.0 1.0 -10.0 0.0 0.0
12 1.0 0.0 0.0 0.0 1.0 0.0 0.0 0.0 1.0 -10.0 0.0 0.0
12 1.0 0.0 0.0 0.0 1.0 0.0 0.0 0.0 1.0 -10.0 0.0 0.0
12 1.0 0.0 0.0 0.0 1.0 0.0 0.0 0.0 1.0 -10.0 0.0 0.0
12 1.0 0.0 0.0 0.0 1.0 0.0 0.0 0.0 1.0 -10.0 0.0 0.0
12 1.0 0.0 0.0 0.0 1.0 0.0 0.0 0.0 1.0 -10.0 0.0 0.0
12 1.0 0.0 0.0 0.0 1.0 0.0 0.0 0.0 1.0 -10.0 0.0 0.0
12 1.0 0.0 0.0 0.0 1.0 0.0 0.0 0.0 1.0 -10.0 0.0 0.0
12 1.0 0.0 0.0 0.0 1.0 0.0 0.0 0.0 1.0 -10.0 0.0 0.0
12 1.0 0.0 0.0 0.0 1.0 0.0 0.0 0.0 1.0 -10.0 0.0 0.0
12 1.0 0.0 0.0 0.0 1.0 0.0 0.0 0.0 1.0 -10.0 0.0 0.0
12 1.0 0.0 0.0 0.0 1.0 0.0 0.0 0.0 1.0 -10.0 0.0 0.0
12 1.0 0.0 0.0 0.0 1.0 0.0 0.0 0.0 1.0 -10.0 0.0 0.0
12 1.0 0.0 0.0 0.0 1.0 0.0 0.0 0.0 1.0 -10.0 0.0 0.0
12 1.0 0.0 0.0 0.0 1.0 0.0 0.0 0.0 1.0 -10.0 0.0 0.0
12 1.0 0.0 0.0 0.0 1.0 0.0 0.0 0.0 1.0 -10.0 0.0 0.0
