POINTS:
0.0 0.0
0.0 0.25
0.0 0.5
0.0 0.75
0.0 1.0
0.0 1.25
0.0 1.5
0.0 1.75
0.0 2.0
0.0 2.25
0.0 2.5
0.0 2.75
0.0 3.0
0.25 0.0
0.25 0.25
0.25 0.5
0.25 0.75
0.25 1.0
0.25 1.25
0.25 1.5
0.25 1.75
0.25 2.0
0.25 2.25
0.25 2.5
0.25 2.75
0.25 3.0
0.5 0.0
0.5 0.25
0.5 0.5
0.5 0.75
0.5 1.0
0.5 1.25
0.5 1.5
0.5 1.75
0.5 2.0
0.5 2.25
0.5 2.5
0.5 2.75
0.5 3.0
0.75 0.0
0.75 0.25
0.75 0.5
0.75 0.75
0.75 1.0
0.75 1.25
0.75 1.5
0.75 1.75
0.75 2.0
0.75 2.25
0.75 2.5
0.75 2.75
0.75 3.0
1.0 0.0
1.0 0.25
1.0 0.5
1.0 0.75
1.0 1.0
1.0 1.25
1.0 1.5
1.0 1.75
1.0 2.0
1.0 2.25
1.0 2.5
1.0 2.75
1.0 3.0
1.25 0.0
1.25 0.25
1.25 0.5
1.25 0.75
1.25 1.0
1.25 1.25
1.25 1.5
1.25 1.75
1.25 2.0
1.25 2.25
1.25 2.5
1.25 2.75
1.25 3.0
1.5 0.0
1.5 0.25
1.5 0.5
1.5 0.75
1.5 1.0
1.5 1.25
1.5 1.5
1.5 1.75
1.5 2.0
1.5 2.25
1.5 2.5
1.5 2.75
1.5 3.0
1.75 0.0
1.75 0.25
1.75 0.5
1.75 0.75
1.75 1.0
1.75 1.25
1.75 1.5
1.75 1.75
1.75 2.0
1.75 2.25
1.75 2.5
1.75 2.75
1.75 3.0
2.0 0.0
2.0 0.25
2.0 0.5
2.0 0.75
2.0 1.0
2.0 1.25
2.0 1.5
2.0 1.75
2.0 2.0
2.0 2.25
2.0 2.5
2.0 2.75
2.0 3.0
2.25 0.0
2.25 0.25
2.25 0.5
2.25 0.75
2.25 1.0
2.25 1.25
2.25 1.5
2.25 1.75
2.25 2.0
2.25 2.25
2.25 2.5
2.25 2.75
2.25 3.0
2.5 0.0
2.5 0.25
2.5 0.5
2.5 0.75
2.5 1.0
2.5 1.25
2.5 1.5
2.5 1.75
2.5 2.0
2.5 2.25
2.5 2.5
2.5 2.75
2.5 3.0
2.75 0.0
2.75 0.25
2.75 0.5
2.75 0.75
2.75 1.0
2.75 1.25
2.75 1.5
2.75 1.75
2.75 2.0
2.75 2.25
2.75 2.5
2.75 2.75
2.75 3.0
3.0 0.0
3.0 0.25
3.0 0.5
3.0 0.75
3.0 1.0
3.0 1.25
3.0 1.5
3.0 1.75
3.0 2.0
3.0 2.25
3.0 2.5
3.0 2.75
3.0 3.0
3.25 0.0
3.25 0.25
3.25 0.5
3.25 0.75
3.25 1.0
3.25 1.25
3.25 1.5
3.25 1.75
3.25 2.0
3.25 2.25
3.25 2.5
3.25 2.75
3.25 3.0
3.5 0.0
3.5 0.25
3.5 0.5
3.5 0.75
3.5 1.0
3.5 1.25
3.5 1.5
3.5 1.75
3.5 2.0
3.5 2.25
3.5 2.5
3.5 2.75
3.5 3.0
3.75 0.0
3.75 0.25
3.75 0.5
3.75 0.75
3.75 1.0
3.75 1.25
3.75 1.5
3.75 1.75
3.75 2.0
3.75 2.25
3.75 2.5
3.75 2.75
3.75 3.0
4.0 0.0
4.0 0.25
4.0 0.5
4.0 0.75
4.0 1.0
4.0 1.25
4.0 1.5
4.0 1.75
4.0 2.0
4.0 2.25
4.0 2.5
4.0 2.75
4.0 3.0
4.25 0.0
4.25 0.25
4.25 0.5
4.25 0.75
4.25 1.0
4.25 1.25
4.25 1.5
4.25 1.75
4.25 2.0
4.25 2.25
4.25 2.5
4.25 2.75
4.25 3.0
4.5 0.0
4.5 0.25
4.5 0.5
4.5 0.75
4.5 1.0
4.5 1.25
4.5 1.5
4.5 1.75
4.5 2.0
4.5 2.25
4.5 2.5
4.5 2.75
4.5 3.0
4.75 0.0
4.75 0.25
4.75 0.5
4.75 0.75
4.75 1.0
4.75 1.25
4.75 1.5
4.75 1.75
4.75 2.0
4.75 2.25
4.75 2.5
4.75 2.75
4.75 3.0
5.0 0.0
5.0 0.25
5.0 0.5
5.0 0.75
5.0 1.0
5.0 1.25
5.0 1.5
5.0 1.75
5.0 2.0
5.0 2.25
5.0 2.5
5.0 2.75
5.0 3.0
CELLS:
3 0 0 13 14
3 0 0 14 1
3 0 1 14 15
3 0 1 15 2
3 0 2 15 16
3 0 2 16 3
3 0 3 16 17
3 0 3 17 4
3 0 4 17 18
3 0 4 18 5
3 0 5 18 19
3 0 5 19 6
3 0 6 19 20
3 0 6 20 7
3 0 7 20 21
3 0 7 21 8
3 0 8 21 22
3 0 8 22 9
3 0 9 22 23
3 0 9 23 10
3 0 10 23 24
3 0 10 24 11
3 0 11 24 25
3 0 11 25 12
3 0 13 26 27
3 0 13 27 14
3 0 14 27 28
3 0 14 28 15
3 0 15 28 29
3 0 15 29 16
3 0 16 29 30
3 0 16 30 17
3 0 17 30 31
3 0 17 31 18
3 0 18 31 32
3 0 18 32 19
3 0 19 32 33
3 0 19 33 20
3 0 20 33 34
3 0 20 34 21
3 0 21 34 35
3 0 21 35 22
3 0 22 35 36
3 0 22 36 23
3 0 23 36 37
3 0 23 37 24
3 0 24 37 38
3 0 24 38 25
3 0 26 39 40
3 0 26 40 27
3 0 27 40 41
3 0 27 41 28
3 0 28 41 42
3 0 28 42 29
3 0 29 42 43
3 0 29 43 30
3 0 30 43 44
3 0 30 44 31
3 0 31 44 45
3 0 31 45 32
3 0 32 45 46
3 0 32 46 33
3 0 33 46 47
3 0 33 47 34
3 0 34 47 48
3 0 34 48 35
3 0 35 48 49
3 0 35 49 36
3 0 36 49 50
3 0 36 50 37
3 0 37 50 51
3 0 37 51 38
3 0 39 52 53
3 0 39 53 40
3 0 40 53 54
3 0 40 54 41
3 0 41 54 55
3 0 41 55 42
3 0 42 55 56
3 0 42 56 43
3 0 43 56 57
3 0 43 57 44
3 0 44 57 58
3 0 44 58 45
3 0 45 58 59
3 0 45 59 46
3 0 46 59 60
3 0 46 60 47
3 0 47 60 61
3 0 47 61 48
3 0 48 61 62
3 0 48 62 49
3 0 49 62 63
3 0 49 63 50
3 0 50 63 64
3 0 50 64 51
3 0 52 65 66
3 0 52 66 53
3 0 53 66 67
3 0 53 67 54
3 0 54 67 68
3 0 54 68 55
3 0 55 68 69
3 0 55 69 56
3 0 56 69 70
3 0 56 70 57
3 0 57 70 71
3 0 57 71 58
3 0 58 71 72
3 0 58 72 59
3 0 59 72 73
3 0 59 73 60
3 0 60 73 74
3 0 60 74 61
3 0 61 74 75
3 0 61 75 62
3 0 62 75 76
3 0 62 76 63
3 0 63 76 77
3 0 63 77 64
3 0 65 78 79
3 0 65 79 66
3 0 66 79 80
3 0 66 80 67
3 0 67 80 81
3 0 67 81 68
3 0 68 81 82
3 0 68 82 69
3 0 69 82 83
3 0 69 83 70
3 0 70 83 84
3 0 70 84 71
3 0 71 84 85
3 0 71 85 72
3 0 72 85 86
3 0 72 86 73
3 0 73 86 87
3 0 73 87 74
3 0 74 87 88
3 0 74 88 75
3 0 75 88 89
3 0 75 89 76
3 0 76 89 90
3 0 76 90 77
3 0 78 91 92
3 0 78 92 79
3 0 79 92 93
3 0 79 93 80
3 0 80 93 94
3 0 80 94 81
3 0 81 94 95
3 0 81 95 82
3 0 82 95 96
3 0 82 96 83
3 0 83 96 97
3 0 83 97 84
3 0 84 97 98
3 0 84 98 85
3 0 85 98 99
3 0 85 99 86
3 0 86 99 100
3 0 86 100 87
3 0 87 100 101
3 0 87 101 88
3 0 88 101 102
3 0 88 102 89
3 0 89 102 103
3 0 89 103 90
3 0 91 104 105
3 0 91 105 92
3 0 92 105 106
3 0 92 106 93
3 0 93 106 107
3 0 93 107 94
3 0 94 107 108
3 0 94 108 95
3 0 95 108 109
3 0 95 109 96
3 0 96 109 110
3 0 96 110 97
3 0 97 110 111
3 0 97 111 98
3 0 98 111 112
3 0 98 112 99
3 0 99 112 113
3 0 99 113 100
3 0 100 113 114
3 0 100 114 101
3 0 101 114 115
3 0 101 115 102
3 0 102 115 116
3 0 102 116 103
3 0 104 117 118
3 0 104 118 105
3 0 105 118 119
3 0 105 119 106
3 0 106 119 120
3 0 106 120 107
3 0 107 120 121
3 0 107 121 108
3 0 108 121 122
3 0 108 122 109
3 0 109 122 123
3 0 109 123 110
3 0 110 123 124
3 0 110 124 111
3 0 111 124 125
3 0 111 125 112
3 0 112 125 126
3 0 112 126 113
3 0 113 126 127
3 0 113 127 114
3 0 114 127 128
3 0 114 128 115
3 0 115 128 129
3 0 115 129 116
3 0 117 130 131
3 0 117 131 118
3 0 118 131 132
3 0 118 132 119
3 0 119 132 133
3 0 119 133 120
3 0 120 133 134
3 0 120 134 121
3 0 121 134 135
3 0 121 135 122
3 0 122 135 136
3 0 122 136 123
3 0 123 136 137
3 0 123 137 124
3 0 124 137 138
3 0 124 138 125
3 0 125 138 139
3 0 125 139 126
3 0 126 139 140
3 0 126 140 127
3 0 127 140 141
3 0 127 141 128
3 0 128 141 142
3 0 128 142 129
3 0 130 143 144
3 0 130 144 131
3 0 131 144 145
3 0 131 145 132
3 0 132 145 146
3 0 132 146 133
3 0 133 146 147
3 0 133 147 134
3 0 134 147 148
3 0 134 148 135
3 0 135 148 149
3 0 135 149 136
3 0 136 149 150
3 0 136 150 137
3 0 137 150 151
3 0 137 151 138
3 0 138 151 152
3 0 138 152 139
3 0 139 152 153
3 0 139 153 140
3 0 140 153 154
3 0 140 154 141
3 0 141 154 155
3 0 141 155 142
3 0 143 156 157
3 0 143 157 144
3 0 144 157 158
3 0 144 158 145
3 0 145 158 159
3 0 145 159 146
3 0 146 159 160
3 0 146 160 147
3 0 147 160 161
3 0 147 161 148
3 0 148 161 162
3 0 148 162 149
3 0 149 162 163
3 0 149 163 150
3 0 150 163 164
3 0 150 164 151
3 0 151 164 165
3 0 151 165 152
3 0 152 165 166
3 0 152 166 153
3 0 153 166 167
3 0 153 167 154
3 0 154 167 168
3 0 154 168 155
3 0 156 169 170
3 0 156 170 157
3 0 157 170 171
3 0 157 171 158
3 0 158 171 172
3 0 158 172 159
3 0 159 172 173
3 0 159 173 160
3 0 160 173 174
3 0 160 174 161
3 0 161 174 175
3 0 161 175 162
3 0 162 175 176
3 0 162 176 163
3 0 163 176 177
3 0 163 177 164
3 0 164 177 178
3 0 164 178 165
3 0 165 178 179
3 0 165 179 166
3 0 166 179 180
3 0 166 180 167
3 0 167 180 181
3 0 167 181 168
3 0 169 182 183
3 0 169 183 170
3 0 170 183 184
3 0 170 184 171
3 0 171 184 185
3 0 171 185 172
3 0 172 185 186
3 0 172 186 173
3 0 173 186 187
3 0 173 187 174
3 0 174 187 188
3 0 174 188 175
3 0 175 188 189
3 0 175 189 176
3 0 176 189 190
3 0 176 190 177
3 0 177 190 191
3 0 177 191 178
3 0 178 191 192
3 0 178 192 179
3 0 179 192 193
3 0 179 193 180
3 0 180 193 194
3 0 180 194 181
3 0 182 195 196
3 0 182 196 183
3 0 183 196 197
3 0 183 197 184
3 0 184 197 198
3 0 184 198 185
3 0 185 198 199
3 0 185 199 186
3 0 186 199 200
3 0 186 200 187
3 0 187 200 201
3 0 187 201 188
3 0 188 201 202
3 0 188 202 189
3 0 189 202 203
3 0 189 203 190
3 0 190 203 204
3 0 190 204 191
3 0 191 204 205
3 0 191 205 192
3 0 192 205 206
3 0 192 206 193
3 0 193 206 207
3 0 193 207 194
3 0 195 208 209
3 0 195 209 196
3 0 196 209 210
3 0 196 210 197
3 0 197 210 211
3 0 197 211 198
3 0 198 211 212
3 0 198 212 199
3 0 199 212 213
3 0 199 213 200
3 0 200 213 214
3 0 200 214 201
3 0 201 214 215
3 0 201 215 202
3 0 202 215 216
3 0 202 216 203
3 0 203 216 217
3 0 203 217 204
3 0 204 217 218
3 0 204 218 205
3 0 205 218 219
3 0 205 219 206
3 0 206 219 220
3 0 206 220 207
3 0 208 221 222
3 0 208 222 209
3 0 209 222 223
3 0 209 223 210
3 0 210 223 224
3 0 210 224 211
3 0 211 224 225
3 0 211 225 212
3 0 212 225 226
3 0 212 226 213
3 0 213 226 227
3 0 213 227 214
3 0 214 227 228
3 0 214 228 215
3 0 215 228 229
3 0 215 229 216
3 0 216 229 230
3 0 216 230 217
3 0 217 230 231
3 0 217 231 218
3 0 218 231 232
3 0 218 232 219
3 0 219 232 233
3 0 219 233 220
3 0 221 234 235
3 0 221 235 222
3 0 222 235 236
3 0 222 236 223
3 0 223 236 237
3 0 223 237 224
3 0 224 237 238
3 0 224 238 225
3 0 225 238 239
3 0 225 239 226
3 0 226 239 240
3 0 226 240 227
3 0 227 240 241
3 0 227 241 228
3 0 228 241 242
3 0 228 242 229
3 0 229 242 243
3 0 229 243 230
3 0 230 243 244
3 0 230 244 231
3 0 231 244 245
3 0 231 245 232
3 0 232 245 246
3 0 232 246 233
3 0 234 247 248
3 0 234 248 235
3 0 235 248 249
3 0 235 249 236
3 0 236 249 250
3 0 236 250 237
3 0 237 250 251
3 0 237 251 238
3 0 238 251 252
3 0 238 252 239
3 0 239 252 253
3 0 239 253 240
3 0 240 253 254
3 0 240 254 241
3 0 241 254 255
3 0 241 255 242
3 0 242 255 256
3 0 242 256 243
3 0 243 256 257
3 0 243 257 244
3 0 244 257 258
3 0 244 258 245
3 0 245 258 259
3 0 245 259 246
3 0 247 260 261
3 0 247 261 248
3 0 248 261 262
3 0 248 262 249
3 0 249 262 263
3 0 249 263 250
3 0 250 263 264
3 0 250 264 251
3 0 251 264 265
3 0 251 265 252
3 0 252 265 266
3 0 252 266 253
3 0 253 266 267
3 0 253 267 254
3 0 254 267 268
3 0 254 268 255
3 0 255 268 269
3 0 255 269 256
3 0 256 269 270
3 0 256 270 257
3 0 257 270 271
3 0 257 271 258
3 0 258 271 272
3 0 258 272 259
FACES:
VDATA:
3 0.0 0.002 20
3 0.0 0.002 20
3 0.0 0.002 20
3 0.0 0.002 20
3 0.0 0.002 20
3 0.0 0.002 20
3 0.0 0.002 20
3 -10.0 0.0 0.0
3 -10.0 0.0 0.0
3 -10.0 0.0 0.0
3 -10.0 0.0 0.0
3 -10.0 0.0 0.0
3 -10.0 0.0 0.0
3 0.0 0.002 20
3 0.0 0.002 20
3 0.0 0.002 20
3 0.0 0.002 20
3 0.0 0.002 20
3 0.0 0.002 20
3 0.0 0.002 20
3 -10.0 0.0 0.0
3 -10.0 0.0 0.0
3 -10.0 0.0 0.0
3 -10.0 0.0 0.0
3 -10.0 0.0 0.0
3 -10.0 0.0 0.0
3 0.0 0.002 20
3 0.0 0.002 20
3 0.0 0.002 20
3 0.0 0.002 20
3 0.0 0.002 20
3 0.0 0.002 20
3 0.0 0.002 20
3 -10.0 0.0 0.0
3 -10.0 0.0 0.0
3 -10.0 0.0 0.0
3 -10.0 0.0 0.0
3 -10.0 0.0 0.0
3 -10.0 0.0 0.0
3 0.0 0.002 20
3 0.0 0.002 20
3 0.0 0.002 20
3 0.0 0.002 20
3 0.0 0.002 20
3 0.0 0.002 20
3 0.0 0.002 20
3 -10.0 0.0 0.0
3 -10.0 0.0 0.0
3 -10.0 0.0 0.0
3 -10.0 0.0 0.0
3 -10.0 0.0 0.0
3 -10.0 0.0 0.0
3 0.0 0.002 20
3 0.0 0.002 20
3 0.0 0.002 20
3 0.0 0.002 20
3 0.0 0.002 20
3 0.0 0.002 20
3 0.0 0.002 20
3 -10.0 0.0 0.0
3 -10.0 0.0 0.0
3 -10.0 0.0 0.0
3 -10.0 0.0 0.0
3 -10.0 0.0 0.0
3 -10.0 0.0 0.0
3 0.0 0.002 20
3 0.0 0.002 20
3 0.0 0.002 20
3 0.0 0.002 20
3 0.0 0.002 20
3 0.0 0.002 20
3 0.0 0.002 20
3 -10.0 0.0 0.0
3 -10.0 0.0 0.0
3 -10.0 0.0 0.0
3 -10.0 0.0 0.0
3 -10.0 0.0 0.0
3 -10.0 0.0 0.0
3 0.0 0.002 20
3 0.0 0.002 20
3 0.0 0.002 20
3 0.0 0.002 20
3 0.0 0.002 20
3 0.0 0.002 20
3 0.0 0.002 20
3 -10.0 0.0 0.0
3 -10.0 0.0 0.0
3 -10.0 0.0 0.0
3 -10.0 0.0 0.0
3 -10.0 0.0 0.0
3 -10.0 0.0 0.0
3 -10.0 0.0 0.0
3 -10.0 0.0 0.0
3 -10.0 0.0 0.0
3 -10.0 0.0 0.0
3 -10.0 0.0 0.0
3 -10.0 0.0 0.0
3 -10.0 0.0 0.0
3 -10.0 0.0 0.0
3 -10.0 0.0 0.0
3 -10.0 0.0 0.0
3 -10.0 0.0 0.0
3 -10.0 0.0 0.0
3 -10.0 0.0 0.0
3 -10.0 0.0 0.0
3 -10.0 0.0 0.0
3 -10.0 0.0 0.0
3 -10.0 0.0 0.0
3 -10.0 0.0 0.0
3 -10.0 0.0 0.0
3 -10.0 0.0 0.0
3 -10.0 0.0 0.0
3 -10.0 0.0 0.0
3 -10.0 0.0 0.0
3 -10.0 0.0 0.0
3 -10.0 0.0 0.0
3 -10.0 0.0 0.0
3 -10.0 0.0 0.0
3 -10.0 0.0 0.0
3 -10.0 0.0 0.0
3 -10.0 0.0 0.0
3 -10.0 0.0 0.0
3 -10.0 0.0 0.0
3 -10.0 0.0 0.0
3 -10.0 0.0 0.0
3 -10.0 0.0 0.0
3 -10.0 0.0 0.0
3 -10.0 0.0 0.0
3 -10.0 0.0 0.0
3 -10.0 0.0 0.0
3 -10.0 0.0 0.0
3 -10.0 0.0 0.0
3 -10.0 0.0 0.0
3 -10.0 0.0 0.0
3 -10.0 0.0 0.0
3 -10.0 0.0 0.0
3 -10.0 0.0 0.0
3 -10.0 0.0 0.0
3 -10.0 0.0 0.0
3 -10.0 0.0 0.0
3 -10.0 0.0 0.0
3 -10.0 0.0 0.0
3 -10.0 0.0 0.0
3 -10.0 0.0 0.0
3 -10.0 0.0 0.0
3 -10.0 0.0 0.0
3 -10.0 0.0 0.0
3 -10.0 0.0 0.0
3 -10.0 0.0 0.0
3 -10.0 0.0 0.0
3 -10.0 0.0 0.0
3 -10.0 0.0 0.0
3 -10.0 0.0 0.0
3 -10.0 0.0 0.0
3 -10.0 0.0 0.0
3 -10.0 0.0 0.0
3 -10.0 0.0 0.0
3 -10.0 0.0 0.0
3 -10.0 0.0 0.0
3 -10.0 0.0 0.0
3 -10.0 0.0 0.0
3 -10.0 0.0 0.0
3 -10.0 0.0 0.0
3 -10.0 0.0 0.0
3 -10.0 0.0 0.0
3 -10.0 0.0 0.0
3 -10.0 0.0 0.0
3 -10.0 0.0 0.0
3 -10.0 0.0 0.0
3 -10.0 0.0 0.0
3 -10.0 0.0 0.0
3 -10.0 0.0 0.0
3 -10.0 0.0 0.0
3 -10.0 0.0 0.0
3 -10.0 0.0 0.0
3 -10.0 0.0 0.0
3 -10.0 0.0 0.0
3 -10.0 0.0 0.0
3 -10.0 0.0 0.0
3 -10.0 0.0 0.0
3 -10.0 0.0 0.0
3 -10.0 0.0 0.0
3 -10.0 0.0 0.0
3 -10.0 0.0 0.0
3 -10.0 0.0 0.0
3 -10.0 0.0 0.0
3 -10.0 0.0 0.0
3 -10.0 0.0 0.0
3 -10.0 0.0 0.0
3 -10.0 0.0 0.0
3 -10.0 0.0 0.0
3 -10.0 0.0 0.0
3 -10.0 0.0 0.0
3 -10.0 0.0 0.0
3 -10.0 0.0 0.0
3 -10.0 0.0 0.0
3 -10.0 0.0 0.0
3 -10.0 0.0 0.0
3 -10.0 0.0 0.0
3 -10.0 0.0 0.0
3 -10.0 0.0 0.0
3 -10.0 0.0 0.0
3 -10.0 0.0 0.0
3 -10.0 0.0 0.0
3 -10.0 0.0 0.0
3 -10.0 0.0 0.0
3 -10.0 0.0 0.0
3 -10.0 0.0 0.0
3 -10.0 0.0 0.0
3 -10.0 0.0 0.0
3 -10.0 0.0 0.0
3 -10.0 0.0 0.0
3 -10.0 0.0 0.0
3 -10.0 0.0 0.0
3 -10.0 0.0 0.0
3 -10.0 0.0 0.0
3 -10.0 0.0 0.0
3 -10.0 0.0 0.0
3 -10.0 0.0 0.0
3 -10.0 0.0 0.0
3 -10.0 0.0 0.0
3 -10.0 0.0 0.0
3 -10.0 0.0 0.0
3 -10.0 0.0 0.0
3 -10.0 0.0 0.0
3 -10.0 0.0 0.0
3 -10.0 0.0 0.0
3 -10.0 0.0 0.0
3 -10.0 0.0 0.0
3 -10.0 0.0 0.0
3 -10.0 0.0 0.0
3 -10.0 0.0 0.0
3 -10.0 0.0 0.0
3 -10.0 0.0 0.0
3 -10.0 0.0 0.0
3 -10.0 0.0 0.0
3 -10.0 0.0 0.0
3 -10.0 0.0 0.0
3 -10.0 0.0 0.0
3 -10.0 0.0 0.0
3 -10.0 0.0 0.0
3 -10.0 0.0 0.0
3 -10.0 0.0 0.0
3 -10.0 0.0 0.0
3 -10.0 0.0 0.0
3 -10.0 0.0 0.0
3 -10.0 0.0 0.0
3 -10.0 0.0 0.0
3 -10.0 0.0 0.0
3 -10.0 0.0 0.0
3 -10.0 0.0 0.0
3 -10.0 0.0 0.0
3 -10.0 0.0 0.0
3 -10.0 0.0 0.0
3 -10.0 0.0 0.0
3 -10.0 0.0 0.0
3 -10.0 0.0 0.0
3 -10.0 0.0 0.0
3 -10.0 0.0 0.0
3 -10.0 0.0 0.0
3 -10.0 0.0 0.0
3 -10.0 0.0 0.0
3 -10.0 0.0 0.0
3 -10.0 0.0 0.0
3 -10.0 0.0 0.0
3 -10.0 0.0 0.0
3 -10.0 0.0 0.0
3 -10.0 0.0 0.0
3 -10.0 0.0 0.0
3 -10.0 0.0 0.0
3 -10.0 0.0 0.0
3 -10.0 0.0 0.0
3 -10.0 0.0 0.0
CDATA:
9 1 0 0 0 1 0 0 0 1
9 1 0 0 0 1 0 0 0 1
9 1 0 0 0 1 0 0 0 1
9 1 0 0 0 1 0 0 0 1
9 1 0 0 0 1 0 0 0 1
9 1 0 0 0 1 0 0 0 1
9 1 0 0 0 1 0 0 0 1
9 1 0 0 0 1 0 0 0 1
9 1 0 0 0 1 0 0 0 1
9 1 0 0 0 1 0 0 0 1
9 1 0 0 0 1 0 0 0 1
9 1 0 0 0 1 0 0 0 1
9 1 0 0 0 1 0 0 0 1
9 1 0 0 0 1 0 0 0 1
9 1 0 0 0 1 0 0 0 1
9 1 0 0 0 1 0 0 0 1
9 1 0 0 0 1 0 0 0 1
9 1 0 0 0 1 0 0 0 1
9 1 0 0 0 1 0 0 0 1
9 1 0 0 0 1 0 0 0 1
9 1 0 0 0 1 0 0 0 1
9 1 0 0 0 1 0 0 0 1
9 1 0 0 0 1 0 0 0 1
9 1 0 0 0 1 0 0 0 1
9 1 0 0 0 1 0 0 0 1
9 1 0 0 0 1 0 0 0 1
9 1 0 0 0 1 0 0 0 1
9 1 0 0 0 1 0 0 0 1
9 1 0 0 0 1 0 0 0 1
9 1 0 0 0 1 0 0 0 1
9 1 0 0 0 1 0 0 0 1
9 1 0 0 0 1 0 0 0 1
9 1 0 0 0 1 0 0 0 1
9 1 0 0 0 1 0 0 0 1
9 1 0 0 0 1 0 0 0 1
9 1 0 0 0 1 0 0 0 1
9 1 0 0 0 1 0 0 0 1
9 1 0 0 0 1 0 0 0 1
9 1 0 0 0 1 0 0 0 1
9 1 0 0 0 1 0 0 0 1
9 1 0 0 0 1 0 0 0 1
9 1 0 0 0 1 0 0 0 1
9 1 0 0 0 1 0 0 0 1
9 1 0 0 0 1 0 0 0 1
9 1 0 0 0 1 0 0 0 1
9 1 0 0 0 1 0 0 0 1
9 1 0 0 0 1 0 0 0 1
9 1 0 0 0 1 0 0 0 1
9 1 0 0 0 1 0 0 0 1
9 1 0 0 0 1 0 0 0 1
9 1 0 0 0 1 0 0 0 1
9 1 0 0 0 1 0 0 0 1
9 1 0 0 0 1 0 0 0 1
9 1 0 0 0 1 0 0 0 1
9 1 0 0 0 1 0 0 0 1
9 1 0 0 0 1 0 0 0 1
9 1 0 0 0 1 0 0 0 1
9 1 0 0 0 1 0 0 0 1
9 1 0 0 0 1 0 0 0 1
9 1 0 0 0 1 0 0 0 1
9 1 0 0 0 1 0 0 0 1
9 1 0 0 0 1 0 0 0 1
9 1 0 0 0 1 0 0 0 1
9 1 0 0 0 1 0 0 0 1
9 1 0 0 0 1 0 0 0 1
9 1 0 0 0 1 0 0 0 1
9 1 0 0 0 1 0 0 0 1
9 1 0 0 0 1 0 0 0 1
9 1 0 0 0 1 0 0 0 1
9 1 0 0 0 1 0 0 0 1
9 1 0 0 0 1 0 0 0 1
9 1 0 0 0 1 0 0 0 1
9 1 0 0 0 1 0 0 0 1
9 1 0 0 0 1 0 0 0 1
9 1 0 0 0 1 0 0 0 1
9 1 0 0 0 1 0 0 0 1
9 1 0 0 0 1 0 0 0 1
9 1 0 0 0 1 0 0 0 1
9 1 0 0 0 1 0 0 0 1
9 1 0 0 0 1 0 0 0 1
9 1 0 0 0 1 0 0 0 1
9 1 0 0 0 1 0 0 0 1
9 1 0 0 0 1 0 0 0 1
9 1 0 0 0 1 0 0 0 1
9 1 0 0 0 1 0 0 0 1
9 1 0 0 0 1 0 0 0 1
9 1 0 0 0 1 0 0 0 1
9 1 0 0 0 1 0 0 0 1
9 1 0 0 0 1 0 0 0 1
9 1 0 0 0 1 0 0 0 1
9 1 0 0 0 1 0 0 0 1
9 1 0 0 0 1 0 0 0 1
9 1 0 0 0 1 0 0 0 1
9 1 0 0 0 1 0 0 0 1
9 1 0 0 0 1 0 0 0 1
9 1 0 0 0 1 0 0 0 1
9 1 0 0 0 1 0 0 0 1
9 1 0 0 0 1 0 0 0 1
9 1 0 0 0 1 0 0 0 1
9 1 0 0 0 1 0 0 0 1
9 1 0 0 0 1 0 0 0 1
9 1 0 0 0 1 0 0 0 1
9 1 0 0 0 1 0 0 0 1
9 1 0 0 0 1 0 0 0 1
9 1 0 0 0 1 0 0 0 1
9 1 0 0 0 1 0 0 0 1
9 1 0 0 0 1 0 0 0 1
9 1 0 0 0 1 0 0 0 1
9 1 0 0 0 1 0 0 0 1
9 1 0 0 0 1 0 0 0 1
9 1 0 0 0 1 0 0 0 1
9 1 0 0 0 1 0 0 0 1
9 1 0 0 0 1 0 0 0 1
9 1 0 0 0 1 0 0 0 1
9 1 0 0 0 1 0 0 0 1
9 1 0 0 0 1 0 0 0 1
9 1 0 0 0 1 0 0 0 1
9 1 0 0 0 1 0 0 0 1
9 1 0 0 0 1 0 0 0 1
9 1 0 0 0 1 0 0 0 1
9 1 0 0 0 1 0 0 0 1
9 1 0 0 0 1 0 0 0 1
9 1 0 0 0 1 0 0 0 1
9 1 0 0 0 1 0 0 0 1
9 1 0 0 0 1 0 0 0 1
9 1 0 0 0 1 0 0 0 1
9 1 0 0 0 1 0 0 0 1
9 1 0 0 0 1 0 0 0 1
9 1 0 0 0 1 0 0 0 1
9 1 0 0 0 1 0 0 0 1
9 1 0 0 0 1 0 0 0 1
9 1 0 0 0 1 0 0 0 1
9 1 0 0 0 1 0 0 0 1
9 1 0 0 0 1 0 0 0 1
9 1 0 0 0 1 0 0 0 1
9 1 0 0 0 1 0 0 0 1
9 1 0 0 0 1 0 0 0 1
9 1 0 0 0 1 0 0 0 1
9 1 0 0 0 1 0 0 0 1
9 1 0 0 0 1 0 0 0 1
9 1 0 0 0 1 0 0 0 1
9 1 0 0 0 1 0 0 0 1
9 1 0 0 0 1 0 0 0 1
9 1 0 0 0 1 0 0 0 1
9 1 0 0 0 1 0 0 0 1
9 1 0 0 0 1 0 0 0 1
9 1 0 0 0 1 0 0 0 1
9 1 0 0 0 1 0 0 0 1
9 1 0 0 0 1 0 0 0 1
9 1 0 0 0 1 0 0 0 1
9 1 0 0 0 1 0 0 0 1
9 1 0 0 0 1 0 0 0 1
9 1 0 0 0 1 0 0 0 1
9 1 0 0 0 1 0 0 0 1
9 1 0 0 0 1 0 0 0 1
9 1 0 0 0 1 0 0 0 1
9 1 0 0 0 1 0 0 0 1
9 1 0 0 0 1 0 0 0 1
9 1 0 0 0 1 0 0 0 1
9 1 0 0 0 1 0 0 0 1
9 1 0 0 0 1 0 0 0 1
9 1 0 0 0 1 0 0 0 1
9 1 0 0 0 1 0 0 0 1
9 1 0 0 0 1 0 0 0 1
9 1 0 0 0 1 0 0 0 1
9 1 0 0 0 1 0 0 0 1
9 1 0 0 0 1 0 0 0 1
9 1 0 0 0 1 0 0 0 1
9 1 0 0 0 1 0 0 0 1
9 1 0 0 0 1 0 0 0 1
9 1 0 0 0 1 0 0 0 1
9 1 0 0 0 1 0 0 0 1
9 1 0 0 0 1 0 0 0 1
9 1 0 0 0 1 0 0 0 1
9 1 0 0 0 1 0 0 0 1
9 1 0 0 0 1 0 0 0 1
9 1 0 0 0 1 0 0 0 1
9 1 0 0 0 1 0 0 0 1
9 1 0 0 0 1 0 0 0 1
9 1 0 0 0 1 0 0 0 1
9 1 0 0 0 1 0 0 0 1
9 1 0 0 0 1 0 0 0 1
9 1 0 0 0 1 0 0 0 1
9 1 0 0 0 1 0 0 0 1
9 1 0 0 0 1 0 0 0 1
9 1 0 0 0 1 0 0 0 1
9 1 0 0 0 1 0 0 0 1
9 1 0 0 0 1 0 0 0 1
9 1 0 0 0 1 0 0 0 1
9 1 0 0 0 1 0 0 0 1
9 1 0 0 0 1 0 0 0 1
9 1 0 0 0 1 0 0 0 1
9 1 0 0 0 1 0 0 0 1
9 1 0 0 0 1 0 0 0 1
9 1 0 0 0 1 0 0 0 1
9 1 0 0 0 1 0 0 0 1
9 1 0 0 0 1 0 0 0 1
9 1 0 0 0 1 0 0 0 1
9 1 0 0 0 1 0 0 0 1
9 1 0 0 0 1 0 0 0 1
9 1 0 0 0 1 0 0 0 1
9 1 0 0 0 1 0 0 0 1
9 1 0 0 0 1 0 0 0 1
9 1 0 0 0 1 0 0 0 1
9 1 0 0 0 1 0 0 0 1
9 1 0 0 0 1 0 0 0 1
9 1 0 0 0 1 0 0 0 1
9 1 0 0 0 1 0 0 0 1
9 1 0 0 0 1 0 0 0 1
9 1 0 0 0 1 0 0 0 1
9 1 0 0 0 1 0 0 0 1
9 1 0 0 0 1 0 0 0 1
9 1 0 0 0 1 0 0 0 1
9 1 0 0 0 1 0 0 0 1
9 1 0 0 0 1 0 0 0 1
9 1 0 0 0 1 0 0 0 1
9 1 0 0 0 1 0 0 0 1
9 1 0 0 0 1 0 0 0 1
9 1 0 0 0 1 0 0 0 1
9 1 0 0 0 1 0 0 0 1
9 1 0 0 0 1 0 0 0 1
9 1 0 0 0 1 0 0 0 1
9 1 0 0 0 1 0 0 0 1
9 1 0 0 0 1 0 0 0 1
9 1 0 0 0 1 0 0 0 1
9 1 0 0 0 1 0 0 0 1
9 1 0 0 0 1 0 0 0 1
9 1 0 0 0 1 0 0 0 1
9 1 0 0 0 1 0 0 0 1
9 1 0 0 0 1 0 0 0 1
9 1 0 0 0 1 0 0 0 1
9 1 0 0 0 1 0 0 0 1
9 1 0 0 0 1 0 0 0 1
9 1 0 0 0 1 0 0 0 1
9 1 0 0 0 1 0 0 0 1
9 1 0 0 0 1 0 0 0 1
9 1 0 0 0 1 0 0 0 1
9 1 0 0 0 1 0 0 0 1
9 1 0 0 0 1 0 0 0 1
9 1 0 0 0 1 0 0 0 1
9 1 0 0 0 1 0 0 0 1
9 1 0 0 0 1 0 0 0 1
9 1 0 0 0 1 0 0 0 1
9 1 0 0 0 1 0 0 0 1
9 1 0 0 0 1 0 0 0 1
9 1 0 0 0 1 0 0 0 1
9 1 0 0 0 1 0 0 0 1
9 1 0 0 0 1 0 0 0 1
9 1 0 0 0 1 0 0 0 1
9 1 0 0 0 1 0 0 0 1
9 1 0 0 0 1 0 0 0 1
9 1 0 0 0 1 0 0 0 1
9 1 0 0 0 1 0 0 0 1
9 1 0 0 0 1 0 0 0 1
9 1 0 0 0 1 0 0 0 1
9 1 0 0 0 1 0 0 0 1
9 1 0 0 0 1 0 0 0 1
9 1 0 0 0 1 0 0 0 1
9 1 0 0 0 1 0 0 0 1
9 1 0 0 0 1 0 0 0 1
9 1 0 0 0 1 0 0 0 1
9 1 0 0 0 1 0 0 0 1
9 1 0 0 0 1 0 0 0 1
9 1 0 0 0 1 0 0 0 1
9 1 0 0 0 1 0 0 0 1
9 1 0 0 0 1 0 0 0 1
9 1 0 0 0 1 0 0 0 1
9 1 0 0 0 1 0 0 0 1
9 1 0 0 0 1 0 0 0 1
9 1 0 0 0 1 0 0 0 1
9 1 0 0 0 1 0 0 0 1
9 1 0 0 0 1 0 0 0 1
9 1 0 0 0 1 0 0 0 1
9 1 0 0 0 1 0 0 0 1
9 1 0 0 0 1 0 0 0 1
9 1 0 0 0 1 0 0 0 1
9 1 0 0 0 1 0 0 0 1
9 1 0 0 0 1 0 0 0 1
9 1 0 0 0 1 0 0 0 1
9 1 0 0 0 1 0 0 0 1
9 1 0 0 0 1 0 0 0 1
9 1 0 0 0 1 0 0 0 1
9 1 0 0 0 1 0 0 0 1
9 1 0 0 0 1 0 0 0 1
9 1 0 0 0 1 0 0 0 1
9 1 0 0 0 1 0 0 0 1
9 1 0 0 0 1 0 0 0 1
9 1 0 0 0 1 0 0 0 1
9 1 0 0 0 1 0 0 0 1
9 1 0 0 0 1 0 0 0 1
9 1 0 0 0 1 0 0 0 1
9 1 0 0 0 1 0 0 0 1
9 1 0 0 0 1 0 0 0 1
9 1 0 0 0 1 0 0 0 1
9 1 0 0 0 1 0 0 0 1
9 1 0 0 0 1 0 0 0 1
9 1 0 0 0 1 0 0 0 1
9 1 0 0 0 1 0 0 0 1
9 1 0 0 0 1 0 0 0 1
9 1 0 0 0 1 0 0 0 1
9 1 0 0 0 1 0 0 0 1
9 1 0 0 0 1 0 0 0 1
9 1 0 0 0 1 0 0 0 1
9 1 0 0 0 1 0 0 0 1
9 1 0 0 0 1 0 0 0 1
9 1 0 0 0 1 0 0 0 1
9 1 0 0 0 1 0 0 0 1
9 1 0 0 0 1 0 0 0 1
9 1 0 0 0 1 0 0 0 1
9 1 0 0 0 1 0 0 0 1
9 1 0 0 0 1 0 0 0 1
9 1 0 0 0 1 0 0 0 1
9 1 0 0 0 1 0 0 0 1
9 1 0 0 0 1 0 0 0 1
9 1 0 0 0 1 0 0 0 1
9 1 0 0 0 1 0 0 0 1
9 1 0 0 0 1 0 0 0 1
9 1 0 0 0 1 0 0 0 1
9 1 0 0 0 1 0 0 0 1
9 1 0 0 0 1 0 0 0 1
9 1 0 0 0 1 0 0 0 1
9 1 0 0 0 1 0 0 0 1
9 1 0 0 0 1 0 0 0 1
9 1 0 0 0 1 0 0 0 1
9 1 0 0 0 1 0 0 0 1
9 1 0 0 0 1 0 0 0 1
9 1 0 0 0 1 0 0 0 1
9 1 0 0 0 1 0 0 0 1
9 1 0 0 0 1 0 0 0 1
9 1 0 0 0 1 0 0 0 1
9 1 0 0 0 1 0 0 0 1
9 1 0 0 0 1 0 0 0 1
9 1 0 0 0 1 0 0 0 1
9 1 0 0 0 1 0 0 0 1
9 1 0 0 0 1 0 0 0 1
9 1 0 0 0 1 0 0 0 1
9 1 0 0 0 1 0 0 0 1
9 1 0 0 0 1 0 0 0 1
9 1 0 0 0 1 0 0 0 1
9 1 0 0 0 1 0 0 0 1
9 1 0 0 0 1 0 0 0 1
9 1 0 0 0 1 0 0 0 1
9 1 0 0 0 1 0 0 0 1
9 1 0 0 0 1 0 0 0 1
9 1 0 0 0 1 0 0 0 1
9 1 0 0 0 1 0 0 0 1
9 1 0 0 0 1 0 0 0 1
9 1 0 0 0 1 0 0 0 1
9 1 0 0 0 1 0 0 0 1
9 1 0 0 0 1 0 0 0 1
9 1 0 0 0 1 0 0 0 1
9 1 0 0 0 1 0 0 0 1
9 1 0 0 0 1 0 0 0 1
9 1 0 0 0 1 0 0 0 1
9 1 0 0 0 1 0 0 0 1
9 1 0 0 0 1 0 0 0 1
9 1 0 0 0 1 0 0 0 1
9 1 0 0 0 1 0 0 0 1
9 1 0 0 0 1 0 0 0 1
9 1 0 0 0 1 0 0 0 1
9 1 0 0 0 1 0 0 0 1
9 1 0 0 0 1 0 0 0 1
9 1 0 0 0 1 0 0 0 1
9 1 0 0 0 1 0 0 0 1
9 1 0 0 0 1 0 0 0 1
9 1 0 0 0 1 0 0 0 1
9 1 0 0 0 1 0 0 0 1
9 1 0 0 0 1 0 0 0 1
9 1 0 0 0 1 0 0 0 1
9 1 0 0 0 1 0 0 0 1
9 1 0 0 0 1 0 0 0 1
9 1 0 0 0 1 0 0 0 1
9 1 0 0 0 1 0 0 0 1
9 1 0 0 0 1 0 0 0 1
9 1 0 0 0 1 0 0 0 1
9 1 0 0 0 1 0 0 0 1
9 1 0 0 0 1 0 0 0 1
9 1 0 0 0 1 0 0 0 1
9 1 0 0 0 1 0 0 0 1
9 1 0 0 0 1 0 0 0 1
9 1 0 0 0 1 0 0 0 1
9 1 0 0 0 1 0 0 0 1
9 1 0 0 0 1 0 0 0 1
9 1 0 0 0 1 0 0 0 1
9 1 0 0 0 1 0 0 0 1
9 1 0 0 0 1 0 0 0 1
9 1 0 0 0 1 0 0 0 1
9 1 0 0 0 1 0 0 0 1
9 1 0 0 0 1 0 0 0 1
9 1 0 0 0 1 0 0 0 1
9 1 0 0 0 1 0 0 0 1
9 1 0 0 0 1 0 0 0 1
9 1 0 0 0 1 0 0 0 1
9 1 0 0 0 1 0 0 0 1
9 1 0 0 0 1 0 0 0 1
9 1 0 0 0 1 0 0 0 1
9 1 0 0 0 1 0 0 0 1
9 1 0 0 0 1 0 0 0 1
9 1 0 0 0 1 0 0 0 1
9 1 0 0 0 1 0 0 0 1
9 1 0 0 0 1 0 0 0 1
9 1 0 0 0 1 0 0 0 1
9 1 0 0 0 1 0 0 0 1
9 1 0 0 0 1 0 0 0 1
9 1 0 0 0 1 0 0 0 1
9 1 0 0 0 1 0 0 0 1
9 1 0 0 0 1 0 0 0 1
9 1 0 0 0 1 0 0 0 1
9 1 0 0 0 1 0 0 0 1
9 1 0 0 0 1 0 0 0 1
9 1 0 0 0 1 0 0 0 1
9 1 0 0 0 1 0 0 0 1
9 1 0 0 0 1 0 0 0 1
9 1 0 0 0 1 0 0 0 1
9 1 0 0 0 1 0 0 0 1
9 1 0 0 0 1 0 0 0 1
9 1 0 0 0 1 0 0 0 1
9 1 0 0 0 1 0 0 0 1
9 1 0 0 0 1 0 0 0 1
9 1 0 0 0 1 0 0 0 1
9 1 0 0 0 1 0 0 0 1
9 1 0 0 0 1 0 0 0 1
9 1 0 0 0 1 0 0 0 1
9 1 0 0 0 1 0 0 0 1
9 1 0 0 0 1 0 0 0 1
9 1 0 0 0 1 0 0 0 1
9 1 0 0 0 1 0 0 0 1
9 1 0 0 0 1 0 0 0 1
9 1 0 0 0 1 0 0 0 1
9 1 0 0 0 1 0 0 0 1
9 1 0 0 0 1 0 0 0 1
9 1 0 0 0 1 0 0 0 1
9 1 0 0 0 1 0 0 0 1
9 1 0 0 0 1 0 0 0 1
9 1 0 0 0 1 0 0 0 1
9 1 0 0 0 1 0 0 0 1
9 1 0 0 0 1 0 0 0 1
9 1 0 0 0 1 0 0 0 1
9 1 0 0 0 1 0 0 0 1
9 1 0 0 0 1 0 0 0 1
9 1 0 0 0 1 0 0 0 1
9 1 0 0 0 1 0 0 0 1
9 1 0 0 0 1 0 0 0 1
9 1 0 0 0 1 0 0 0 1
9 1 0 0 0 1 0 0 0 1
9 1 0 0 0 1 0 0 0 1
9 1 0 0 0 1 0 0 0 1
9 1 0 0 0 1 0 0 0 1
9 1 0 0 0 1 0 0 0 1
9 1 0 0 0 1 0 0 0 1
9 1 0 0 0 1 0 0 0 1
9 1 0 0 0 1 0 0 0 1
9 1 0 0 0 1 0 0 0 1
9 1 0 0 0 1 0 0 0 1
9 1 0 0 0 1 0 0 0 1
9 1 0 0 0 1 0 0 0 1
9 1 0 0 0 1 0 0 0 1
9 1 0 0 0 1 0 0 0 1
9 1 0 0 0 1 0 0 0 1
9 1 0 0 0 1 0 0 0 1
9 1 0 0 0 1 0 0 0 1
9 1 0 0 0 1 0 0 0 1
9 1 0 0 0 1 0 0 0 1
9 1 0 0 0 1 0 0 0 1
9 1 0 0 0 1 0 0 0 1
9 1 0 0 0 1 0 0 0 1
9 1 0 0 0 1 0 0 0 1
9 1 0 0 0 1 0 0 0 1
9 1 0 0 0 1 0 0 0 1
9 1 0 0 0 1 0 0 0 1
9 1 0 0 0 1 0 0 0 1
9 1 0 0 0 1 0 0 0 1
9 1 0 0 0 1 0 0 0 1
9 1 0 0 0 1 0 0 0 1
9 1 0 0 0 1 0 0 0 1
9 1 0 0 0 1 0 0 0 1
9 1 0 0 0 1 0 0 0 1
9 1 0 0 0 1 0 0 0 1
9 1 0 0 0 1 0 0 0 1
9 1 0 0 0 1 0 0 0 1
