POINTS:
0.0 0.0 0.0
0.0 0.0 1.0
0.0 0.0 2.0
0.0 0.0 3.0
0.0 0.0 4.0
0.0 0.0 5.0
0.0 1.0 0.0
0.0 1.0 1.0
0.0 1.0 2.0
0.0 1.0 3.0
0.0 1.0 4.0
0.0 1.0 5.0
0.0 2.0 0.0
0.0 2.0 1.0
0.0 2.0 2.0
0.0 2.0 3.0
0.0 2.0 4.0
0.0 2.0 5.0
0.0 3.0 0.0
0.0 3.0 1.0
0.0 3.0 2.0
0.0 3.0 3.0
0.0 3.0 4.0
0.0 3.0 5.0
0.0 4.0 0.0
0.0 4.0 1.0
0.0 4.0 2.0
0.0 4.0 3.0
0.0 4.0 4.0
0.0 4.0 5.0
0.0 5.0 0.0
0.0 5.0 1.0
0.0 5.0 2.0
0.0 5.0 3.0
0.0 5.0 4.0
0.0 5.0 5.0
1.0 0.0 0.0
1.0 0.0 1.0
1.0 0.0 2.0
1.0 0.0 3.0
1.0 0.0 4.0
1.0 0.0 5.0
1.0 1.0 0.0
1.0 1.0 1.0
1.0 1.0 2.0
1.0 1.0 3.0
1.0 1.0 4.0
1.0 1.0 5.0
1.0 2.0 0.0
1.0 2.0 1.0
1.0 2.0 2.0
1.0 2.0 3.0
1.0 2.0 4.0
1.0 2.0 5.0
1.0 3.0 0.0
1.0 3.0 1.0
1.0 3.0 2.0
1.0 3.0 3.0
1.0 3.0 4.0
1.0 3.0 5.0
1.0 4.0 0.0
1.0 4.0 1.0
1.0 4.0 2.0
1.0 4.0 3.0
1.0 4.0 4.0
1.0 4.0 5.0
1.0 5.0 0.0
1.0 5.0 1.0
1.0 5.0 2.0
1.0 5.0 3.0
1.0 5.0 4.0
1.0 5.0 5.0
2.0 0.0 0.0
2.0 0.0 1.0
2.0 0.0 2.0
2.0 0.0 3.0
2.0 0.0 4.0
2.0 0.0 5.0
2.0 1.0 0.0
2.0 1.0 1.0
2.0 1.0 2.0
2.0 1.0 3.0
2.0 1.0 4.0
2.0 1.0 5.0
2.0 2.0 0.0
2.0 2.0 1.0
2.0 2.0 2.0
2.0 2.0 3.0
2.0 2.0 4.0
2.0 2.0 5.0
2.0 3.0 0.0
2.0 3.0 1.0
2.0 3.0 2.0
2.0 3.0 3.0
2.0 3.0 4.0
2.0 3.0 5.0
2.0 4.0 0.0
2.0 4.0 1.0
2.0 4.0 2.0
2.0 4.0 3.0
2.0 4.0 4.0
2.0 4.0 5.0
2.0 5.0 0.0
2.0 5.0 1.0
2.0 5.0 2.0
2.0 5.0 3.0
2.0 5.0 4.0
2.0 5.0 5.0
3.0 0.0 0.0
3.0 0.0 1.0
3.0 0.0 2.0
3.0 0.0 3.0
3.0 0.0 4.0
3.0 0.0 5.0
3.0 1.0 0.0
3.0 1.0 1.0
3.0 1.0 2.0
3.0 1.0 3.0
3.0 1.0 4.0
3.0 1.0 5.0
3.0 2.0 0.0
3.0 2.0 1.0
3.0 2.0 2.0
3.0 2.0 3.0
3.0 2.0 4.0
3.0 2.0 5.0
3.0 3.0 0.0
3.0 3.0 1.0
3.0 3.0 2.0
3.0 3.0 3.0
3.0 3.0 4.0
3.0 3.0 5.0
3.0 4.0 0.0
3.0 4.0 1.0
3.0 4.0 2.0
3.0 4.0 3.0
3.0 4.0 4.0
3.0 4.0 5.0
3.0 5.0 0.0
3.0 5.0 1.0
3.0 5.0 2.0
3.0 5.0 3.0
3.0 5.0 4.0
3.0 5.0 5.0
4.0 0.0 0.0
4.0 0.0 1.0
4.0 0.0 2.0
4.0 0.0 3.0
4.0 0.0 4.0
4.0 0.0 5.0
4.0 1.0 0.0
4.0 1.0 1.0
4.0 1.0 2.0
4.0 1.0 3.0
4.0 1.0 4.0
4.0 1.0 5.0
4.0 2.0 0.0
4.0 2.0 1.0
4.0 2.0 2.0
4.0 2.0 3.0
4.0 2.0 4.0
4.0 2.0 5.0
4.0 3.0 0.0
4.0 3.0 1.0
4.0 3.0 2.0
4.0 3.0 3.0
4.0 3.0 4.0
4.0 3.0 5.0
4.0 4.0 0.0
4.0 4.0 1.0
4.0 4.0 2.0
4.0 4.0 3.0
4.0 4.0 4.0
4.0 4.0 5.0
4.0 5.0 0.0
4.0 5.0 1.0
4.0 5.0 2.0
4.0 5.0 3.0
4.0 5.0 4.0
4.0 5.0 5.0
5.0 0.0 0.0
5.0 0.0 1.0
5.0 0.0 2.0
5.0 0.0 3.0
5.0 0.0 4.0
5.0 0.0 5.0
5.0 1.0 0.0
5.0 1.0 1.0
5.0 1.0 2.0
5.0 1.0 3.0
5.0 1.0 4.0
5.0 1.0 5.0
5.0 2.0 0.0
5.0 2.0 1.0
5.0 2.0 2.0
5.0 2.0 3.0
5.0 2.0 4.0
5.0 2.0 5.0
5.0 3.0 0.0
5.0 3.0 1.0
5.0 3.0 2.0
5.0 3.0 3.0
5.0 3.0 4.0
5.0 3.0 5.0
5.0 4.0 0.0
5.0 4.0 1.0
5.0 4.0 2.0
5.0 4.0 3.0
5.0 4.0 4.0
5.0 4.0 5.0
5.0 5.0 0.0
5.0 5.0 1.0
5.0 5.0 2.0
5.0 5.0 3.0
5.0 5.0 4.0
5.0 5.0 5.0
CELLS:
4 0 0 6 7 43
4 0 0 6 42 43
4 0 0 36 42 43
4 0 0 36 37 43
4 0 0 1 37 43
4 0 0 1 7 43
4 0 1 7 8 44
4 0 1 7 43 44
4 0 1 37 43 44
4 0 1 37 38 44
4 0 1 2 38 44
4 0 1 2 8 44
4 0 2 8 9 45
4 0 2 8 44 45
4 0 2 38 44 45
4 0 2 38 39 45
4 0 2 3 39 45
4 0 2 3 9 45
4 0 3 9 10 46
4 0 3 9 45 46
4 0 3 39 45 46
4 0 3 39 40 46
4 0 3 4 40 46
4 0 3 4 10 46
4 0 4 10 11 47
4 0 4 10 46 47
4 0 4 40 46 47
4 0 4 40 41 47
4 0 4 5 41 47
4 0 4 5 11 47
4 0 6 12 13 49
4 0 6 12 48 49
4 0 6 42 48 49
4 0 6 42 43 49
4 0 6 7 43 49
4 0 6 7 13 49
4 0 7 13 14 50
4 0 7 13 49 50
4 0 7 43 49 50
4 0 7 43 44 50
4 0 7 8 44 50
4 0 7 8 14 50
4 0 8 14 15 51
4 0 8 14 50 51
4 0 8 44 50 51
4 0 8 44 45 51
4 0 8 9 45 51
4 0 8 9 15 51
4 0 9 15 16 52
4 0 9 15 51 52
4 0 9 45 51 52
4 0 9 45 46 52
4 0 9 10 46 52
4 0 9 10 16 52
4 0 10 16 17 53
4 0 10 16 52 53
4 0 10 46 52 53
4 0 10 46 47 53
4 0 10 11 47 53
4 0 10 11 17 53
4 0 12 18 19 55
4 0 12 18 54 55
4 0 12 48 54 55
4 0 12 48 49 55
4 0 12 13 49 55
4 0 12 13 19 55
4 0 13 19 20 56
4 0 13 19 55 56
4 0 13 49 55 56
4 0 13 49 50 56
4 0 13 14 50 56
4 0 13 14 20 56
4 0 14 20 21 57
4 0 14 20 56 57
4 0 14 50 56 57
4 0 14 50 51 57
4 0 14 15 51 57
4 0 14 15 21 57
4 0 15 21 22 58
4 0 15 21 57 58
4 0 15 51 57 58
4 0 15 51 52 58
4 0 15 16 52 58
4 0 15 16 22 58
4 0 16 22 23 59
4 0 16 22 58 59
4 0 16 52 58 59
4 0 16 52 53 59
4 0 16 17 53 59
4 0 16 17 23 59
4 0 18 24 25 61
4 0 18 24 60 61
4 0 18 54 60 61
4 0 18 54 55 61
4 0 18 19 55 61
4 0 18 19 25 61
4 0 19 25 26 62
4 0 19 25 61 62
4 0 19 55 61 62
4 0 19 55 56 62
4 0 19 20 56 62
4 0 19 20 26 62
4 0 20 26 27 63
4 0 20 26 62 63
4 0 20 56 62 63
4 0 20 56 57 63
4 0 20 21 57 63
4 0 20 21 27 63
4 0 21 27 28 64
4 0 21 27 63 64
4 0 21 57 63 64
4 0 21 57 58 64
4 0 21 22 58 64
4 0 21 22 28 64
4 0 22 28 29 65
4 0 22 28 64 65
4 0 22 58 64 65
4 0 22 58 59 65
4 0 22 23 59 65
4 0 22 23 29 65
4 0 24 30 31 67
4 0 24 30 66 67
4 0 24 60 66 67
4 0 24 60 61 67
4 0 24 25 61 67
4 0 24 25 31 67
4 0 25 31 32 68
4 0 25 31 67 68
4 0 25 61 67 68
4 0 25 61 62 68
4 0 25 26 62 68
4 0 25 26 32 68
4 0 26 32 33 69
4 0 26 32 68 69
4 0 26 62 68 69
4 0 26 62 63 69
4 0 26 27 63 69
4 0 26 27 33 69
4 0 27 33 34 70
4 0 27 33 69 70
4 0 27 63 69 70
4 0 27 63 64 70
4 0 27 28 64 70
4 0 27 28 34 70
4 0 28 34 35 71
4 0 28 34 70 71
4 0 28 64 70 71
4 0 28 64 65 71
4 0 28 29 65 71
4 0 28 29 35 71
4 0 36 42 43 79
4 0 36 42 78 79
4 0 36 72 78 79
4 0 36 72 73 79
4 0 36 37 73 79
4 0 36 37 43 79
4 0 37 43 44 80
4 0 37 43 79 80
4 0 37 73 79 80
4 0 37 73 74 80
4 0 37 38 74 80
4 0 37 38 44 80
4 0 38 44 45 81
4 0 38 44 80 81
4 0 38 74 80 81
4 0 38 74 75 81
4 0 38 39 75 81
4 0 38 39 45 81
4 0 39 45 46 82
4 0 39 45 81 82
4 0 39 75 81 82
4 0 39 75 76 82
4 0 39 40 76 82
4 0 39 40 46 82
4 0 40 46 47 83
4 0 40 46 82 83
4 0 40 76 82 83
4 0 40 76 77 83
4 0 40 41 77 83
4 0 40 41 47 83
4 0 42 48 49 85
4 0 42 48 84 85
4 0 42 78 84 85
4 0 42 78 79 85
4 0 42 43 79 85
4 0 42 43 49 85
4 0 43 49 50 86
4 0 43 49 85 86
4 0 43 79 85 86
4 0 43 79 80 86
4 0 43 44 80 86
4 0 43 44 50 86
4 0 44 50 51 87
4 0 44 50 86 87
4 0 44 80 86 87
4 0 44 80 81 87
4 0 44 45 81 87
4 0 44 45 51 87
4 0 45 51 52 88
4 0 45 51 87 88
4 0 45 81 87 88
4 0 45 81 82 88
4 0 45 46 82 88
4 0 45 46 52 88
4 0 46 52 53 89
4 0 46 52 88 89
4 0 46 82 88 89
4 0 46 82 83 89
4 0 46 47 83 89
4 0 46 47 53 89
4 0 48 54 55 91
4 0 48 54 90 91
4 0 48 84 90 91
4 0 48 84 85 91
4 0 48 49 85 91
4 0 48 49 55 91
4 0 49 55 56 92
4 0 49 55 91 92
4 0 49 85 91 92
4 0 49 85 86 92
4 0 49 50 86 92
4 0 49 50 56 92
4 0 50 56 57 93
4 0 50 56 92 93
4 0 50 86 92 93
4 0 50 86 87 93
4 0 50 51 87 93
4 0 50 51 57 93
4 0 51 57 58 94
4 0 51 57 93 94
4 0 51 87 93 94
4 0 51 87 88 94
4 0 51 52 88 94
4 0 51 52 58 94
4 0 52 58 59 95
4 0 52 58 94 95
4 0 52 88 94 95
4 0 52 88 89 95
4 0 52 53 89 95
4 0 52 53 59 95
4 0 54 60 61 97
4 0 54 60 96 97
4 0 54 90 96 97
4 0 54 90 91 97
4 0 54 55 91 97
4 0 54 55 61 97
4 0 55 61 62 98
4 0 55 61 97 98
4 0 55 91 97 98
4 0 55 91 92 98
4 0 55 56 92 98
4 0 55 56 62 98
4 0 56 62 63 99
4 0 56 62 98 99
4 0 56 92 98 99
4 0 56 92 93 99
4 0 56 57 93 99
4 0 56 57 63 99
4 0 57 63 64 100
4 0 57 63 99 100
4 0 57 93 99 100
4 0 57 93 94 100
4 0 57 58 94 100
4 0 57 58 64 100
4 0 58 64 65 101
4 0 58 64 100 101
4 0 58 94 100 101
4 0 58 94 95 101
4 0 58 59 95 101
4 0 58 59 65 101
4 0 60 66 67 103
4 0 60 66 102 103
4 0 60 96 102 103
4 0 60 96 97 103
4 0 60 61 97 103
4 0 60 61 67 103
4 0 61 67 68 104
4 0 61 67 103 104
4 0 61 97 103 104
4 0 61 97 98 104
4 0 61 62 98 104
4 0 61 62 68 104
4 0 62 68 69 105
4 0 62 68 104 105
4 0 62 98 104 105
4 0 62 98 99 105
4 0 62 63 99 105
4 0 62 63 69 105
4 0 63 69 70 106
4 0 63 69 105 106
4 0 63 99 105 106
4 0 63 99 100 106
4 0 63 64 100 106
4 0 63 64 70 106
4 0 64 70 71 107
4 0 64 70 106 107
4 0 64 100 106 107
4 0 64 100 101 107
4 0 64 65 101 107
4 0 64 65 71 107
4 0 72 78 79 115
4 0 72 78 114 115
4 0 72 108 114 115
4 0 72 108 109 115
4 0 72 73 109 115
4 0 72 73 79 115
4 0 73 79 80 116
4 0 73 79 115 116
4 0 73 109 115 116
4 0 73 109 110 116
4 0 73 74 110 116
4 0 73 74 80 116
4 0 74 80 81 117
4 0 74 80 116 117
4 0 74 110 116 117
4 0 74 110 111 117
4 0 74 75 111 117
4 0 74 75 81 117
4 0 75 81 82 118
4 0 75 81 117 118
4 0 75 111 117 118
4 0 75 111 112 118
4 0 75 76 112 118
4 0 75 76 82 118
4 0 76 82 83 119
4 0 76 82 118 119
4 0 76 112 118 119
4 0 76 112 113 119
4 0 76 77 113 119
4 0 76 77 83 119
4 0 78 84 85 121
4 0 78 84 120 121
4 0 78 114 120 121
4 0 78 114 115 121
4 0 78 79 115 121
4 0 78 79 85 121
4 0 79 85 86 122
4 0 79 85 121 122
4 0 79 115 121 122
4 0 79 115 116 122
4 0 79 80 116 122
4 0 79 80 86 122
4 0 80 86 87 123
4 0 80 86 122 123
4 0 80 116 122 123
4 0 80 116 117 123
4 0 80 81 117 123
4 0 80 81 87 123
4 0 81 87 88 124
4 0 81 87 123 124
4 0 81 117 123 124
4 0 81 117 118 124
4 0 81 82 118 124
4 0 81 82 88 124
4 0 82 88 89 125
4 0 82 88 124 125
4 0 82 118 124 125
4 0 82 118 119 125
4 0 82 83 119 125
4 0 82 83 89 125
4 0 84 90 91 127
4 0 84 90 126 127
4 0 84 120 126 127
4 0 84 120 121 127
4 0 84 85 121 127
4 0 84 85 91 127
4 0 85 91 92 128
4 0 85 91 127 128
4 0 85 121 127 128
4 0 85 121 122 128
4 0 85 86 122 128
4 0 85 86 92 128
4 0 86 92 93 129
4 0 86 92 128 129
4 0 86 122 128 129
4 0 86 122 123 129
4 0 86 87 123 129
4 0 86 87 93 129
4 0 87 93 94 130
4 0 87 93 129 130
4 0 87 123 129 130
4 0 87 123 124 130
4 0 87 88 124 130
4 0 87 88 94 130
4 0 88 94 95 131
4 0 88 94 130 131
4 0 88 124 130 131
4 0 88 124 125 131
4 0 88 89 125 131
4 0 88 89 95 131
4 0 90 96 97 133
4 0 90 96 132 133
4 0 90 126 132 133
4 0 90 126 127 133
4 0 90 91 127 133
4 0 90 91 97 133
4 0 91 97 98 134
4 0 91 97 133 134
4 0 91 127 133 134
4 0 91 127 128 134
4 0 91 92 128 134
4 0 91 92 98 134
4 0 92 98 99 135
4 0 92 98 134 135
4 0 92 128 134 135
4 0 92 128 129 135
4 0 92 93 129 135
4 0 92 93 99 135
4 0 93 99 100 136
4 0 93 99 135 136
4 0 93 129 135 136
4 0 93 129 130 136
4 0 93 94 130 136
4 0 93 94 100 136
4 0 94 100 101 137
4 0 94 100 136 137
4 0 94 130 136 137
4 0 94 130 131 137
4 0 94 95 131 137
4 0 94 95 101 137
4 0 96 102 103 139
4 0 96 102 138 139
4 0 96 132 138 139
4 0 96 132 133 139
4 0 96 97 133 139
4 0 96 97 103 139
4 0 97 103 104 140
4 0 97 103 139 140
4 0 97 133 139 140
4 0 97 133 134 140
4 0 97 98 134 140
4 0 97 98 104 140
4 0 98 104 105 141
4 0 98 104 140 141
4 0 98 134 140 141
4 0 98 134 135 141
4 0 98 99 135 141
4 0 98 99 105 141
4 0 99 105 106 142
4 0 99 105 141 142
4 0 99 135 141 142
4 0 99 135 136 142
4 0 99 100 136 142
4 0 99 100 106 142
4 0 100 106 107 143
4 0 100 106 142 143
4 0 100 136 142 143
4 0 100 136 137 143
4 0 100 101 137 143
4 0 100 101 107 143
4 0 108 114 115 151
4 0 108 114 150 151
4 0 108 144 150 151
4 0 108 144 145 151
4 0 108 109 145 151
4 0 108 109 115 151
4 0 109 115 116 152
4 0 109 115 151 152
4 0 109 145 151 152
4 0 109 145 146 152
4 0 109 110 146 152
4 0 109 110 116 152
4 0 110 116 117 153
4 0 110 116 152 153
4 0 110 146 152 153
4 0 110 146 147 153
4 0 110 111 147 153
4 0 110 111 117 153
4 0 111 117 118 154
4 0 111 117 153 154
4 0 111 147 153 154
4 0 111 147 148 154
4 0 111 112 148 154
4 0 111 112 118 154
4 0 112 118 119 155
4 0 112 118 154 155
4 0 112 148 154 155
4 0 112 148 149 155
4 0 112 113 149 155
4 0 112 113 119 155
4 0 114 120 121 157
4 0 114 120 156 157
4 0 114 150 156 157
4 0 114 150 151 157
4 0 114 115 151 157
4 0 114 115 121 157
4 0 115 121 122 158
4 0 115 121 157 158
4 0 115 151 157 158
4 0 115 151 152 158
4 0 115 116 152 158
4 0 115 116 122 158
4 0 116 122 123 159
4 0 116 122 158 159
4 0 116 152 158 159
4 0 116 152 153 159
4 0 116 117 153 159
4 0 116 117 123 159
4 0 117 123 124 160
4 0 117 123 159 160
4 0 117 153 159 160
4 0 117 153 154 160
4 0 117 118 154 160
4 0 117 118 124 160
4 0 118 124 125 161
4 0 118 124 160 161
4 0 118 154 160 161
4 0 118 154 155 161
4 0 118 119 155 161
4 0 118 119 125 161
4 0 120 126 127 163
4 0 120 126 162 163
4 0 120 156 162 163
4 0 120 156 157 163
4 0 120 121 157 163
4 0 120 121 127 163
4 0 121 127 128 164
4 0 121 127 163 164
4 0 121 157 163 164
4 0 121 157 158 164
4 0 121 122 158 164
4 0 121 122 128 164
4 0 122 128 129 165
4 0 122 128 164 165
4 0 122 158 164 165
4 0 122 158 159 165
4 0 122 123 159 165
4 0 122 123 129 165
4 0 123 129 130 166
4 0 123 129 165 166
4 0 123 159 165 166
4 0 123 159 160 166
4 0 123 124 160 166
4 0 123 124 130 166
4 0 124 130 131 167
4 0 124 130 166 167
4 0 124 160 166 167
4 0 124 160 161 167
4 0 124 125 161 167
4 0 124 125 131 167
4 0 126 132 133 169
4 0 126 132 168 169
4 0 126 162 168 169
4 0 126 162 163 169
4 0 126 127 163 169
4 0 126 127 133 169
4 0 127 133 134 170
4 0 127 133 169 170
4 0 127 163 169 170
4 0 127 163 164 170
4 0 127 128 164 170
4 0 127 128 134 170
4 0 128 134 135 171
4 0 128 134 170 171
4 0 128 164 170 171
4 0 128 164 165 171
4 0 128 129 165 171
4 0 128 129 135 171
4 0 129 135 136 172
4 0 129 135 171 172
4 0 129 165 171 172
4 0 129 165 166 172
4 0 129 130 166 172
4 0 129 130 136 172
4 0 130 136 137 173
4 0 130 136 172 173
4 0 130 166 172 173
4 0 130 166 167 173
4 0 130 131 167 173
4 0 130 131 137 173
4 0 132 138 139 175
4 0 132 138 174 175
4 0 132 168 174 175
4 0 132 168 169 175
4 0 132 133 169 175
4 0 132 133 139 175
4 0 133 139 140 176
4 0 133 139 175 176
4 0 133 169 175 176
4 0 133 169 170 176
4 0 133 134 170 176
4 0 133 134 140 176
4 0 134 140 141 177
4 0 134 140 176 177
4 0 134 170 176 177
4 0 134 170 171 177
4 0 134 135 171 177
4 0 134 135 141 177
4 0 135 141 142 178
4 0 135 141 177 178
4 0 135 171 177 178
4 0 135 171 172 178
4 0 135 136 172 178
4 0 135 136 142 178
4 0 136 142 143 179
4 0 136 142 178 179
4 0 136 172 178 179
4 0 136 172 173 179
4 0 136 137 173 179
4 0 136 137 143 179
4 0 144 150 151 187
4 0 144 150 186 187
4 0 144 180 186 187
4 0 144 180 181 187
4 0 144 145 181 187
4 0 144 145 151 187
4 0 145 151 152 188
4 0 145 151 187 188
4 0 145 181 187 188
4 0 145 181 182 188
4 0 145 146 182 188
4 0 145 146 152 188
4 0 146 152 153 189
4 0 146 152 188 189
4 0 146 182 188 189
4 0 146 182 183 189
4 0 146 147 183 189
4 0 146 147 153 189
4 0 147 153 154 190
4 0 147 153 189 190
4 0 147 183 189 190
4 0 147 183 184 190
4 0 147 148 184 190
4 0 147 148 154 190
4 0 148 154 155 191
4 0 148 154 190 191
4 0 148 184 190 191
4 0 148 184 185 191
4 0 148 149 185 191
4 0 148 149 155 191
4 0 150 156 157 193
4 0 150 156 192 193
4 0 150 186 192 193
4 0 150 186 187 193
4 0 150 151 187 193
4 0 150 151 157 193
4 0 151 157 158 194
4 0 151 157 193 194
4 0 151 187 193 194
4 0 151 187 188 194
4 0 151 152 188 194
4 0 151 152 158 194
4 0 152 158 159 195
4 0 152 158 194 195
4 0 152 188 194 195
4 0 152 188 189 195
4 0 152 153 189 195
4 0 152 153 159 195
4 0 153 159 160 196
4 0 153 159 195 196
4 0 153 189 195 196
4 0 153 189 190 196
4 0 153 154 190 196
4 0 153 154 160 196
4 0 154 160 161 197
4 0 154 160 196 197
4 0 154 190 196 197
4 0 154 190 191 197
4 0 154 155 191 197
4 0 154 155 161 197
4 0 156 162 163 199
4 0 156 162 198 199
4 0 156 192 198 199
4 0 156 192 193 199
4 0 156 157 193 199
4 0 156 157 163 199
4 0 157 163 164 200
4 0 157 163 199 200
4 0 157 193 199 200
4 0 157 193 194 200
4 0 157 158 194 200
4 0 157 158 164 200
4 0 158 164 165 201
4 0 158 164 200 201
4 0 158 194 200 201
4 0 158 194 195 201
4 0 158 159 195 201
4 0 158 159 165 201
4 0 159 165 166 202
4 0 159 165 201 202
4 0 159 195 201 202
4 0 159 195 196 202
4 0 159 160 196 202
4 0 159 160 166 202
4 0 160 166 167 203
4 0 160 166 202 203
4 0 160 196 202 203
4 0 160 196 197 203
4 0 160 161 197 203
4 0 160 161 167 203
4 0 162 168 169 205
4 0 162 168 204 205
4 0 162 198 204 205
4 0 162 198 199 205
4 0 162 163 199 205
4 0 162 163 169 205
4 0 163 169 170 206
4 0 163 169 205 206
4 0 163 199 205 206
4 0 163 199 200 206
4 0 163 164 200 206
4 0 163 164 170 206
4 0 164 170 171 207
4 0 164 170 206 207
4 0 164 200 206 207
4 0 164 200 201 207
4 0 164 165 201 207
4 0 164 165 171 207
4 0 165 171 172 208
4 0 165 171 207 208
4 0 165 201 207 208
4 0 165 201 202 208
4 0 165 166 202 208
4 0 165 166 172 208
4 0 166 172 173 209
4 0 166 172 208 209
4 0 166 202 208 209
4 0 166 202 203 209
4 0 166 167 203 209
4 0 166 167 173 209
4 0 168 174 175 211
4 0 168 174 210 211
4 0 168 204 210 211
4 0 168 204 205 211
4 0 168 169 205 211
4 0 168 169 175 211
4 0 169 175 176 212
4 0 169 175 211 212
4 0 169 205 211 212
4 0 169 205 206 212
4 0 169 170 206 212
4 0 169 170 176 212
4 0 170 176 177 213
4 0 170 176 212 213
4 0 170 206 212 213
4 0 170 206 207 213
4 0 170 171 207 213
4 0 170 171 177 213
4 0 171 177 178 214
4 0 171 177 213 214
4 0 171 207 213 214
4 0 171 207 208 214
4 0 171 172 208 214
4 0 171 172 178 214
4 0 172 178 179 215
4 0 172 178 214 215
4 0 172 208 214 215
4 0 172 208 209 215
4 0 172 173 209 215
4 0 172 173 179 215
FACES:
3 100 0 6 7
3 100 0 7 1
3 230 180 186 187
3 230 180 187 181
3 100 1 7 8
3 100 1 8 2
3 230 181 187 188
3 230 181 188 182
3 100 2 8 9
3 100 2 9 3
3 230 182 188 189
3 230 182 189 183
3 100 3 9 10
3 100 3 10 4
3 230 183 189 190
3 230 183 190 184
3 100 4 10 11
3 100 4 11 5
3 230 184 190 191
3 230 184 191 185
3 100 6 12 13
3 100 6 13 7
3 230 186 192 193
3 230 186 193 187
3 100 7 13 14
3 100 7 14 8
3 230 187 193 194
3 230 187 194 188
3 100 8 14 15
3 100 8 15 9
3 230 188 194 195
3 230 188 195 189
3 100 9 15 16
3 100 9 16 10
3 230 189 195 196
3 230 189 196 190
3 100 10 16 17
3 100 10 17 11
3 230 190 196 197
3 230 190 197 191
3 100 12 18 19
3 100 12 19 13
3 230 192 198 199
3 230 192 199 193
3 100 13 19 20
3 100 13 20 14
3 230 193 199 200
3 230 193 200 194
3 100 14 20 21
3 100 14 21 15
3 230 194 200 201
3 230 194 201 195
3 100 15 21 22
3 100 15 22 16
3 230 195 201 202
3 230 195 202 196
3 100 16 22 23
3 100 16 23 17
3 230 196 202 203
3 230 196 203 197
3 100 18 24 25
3 100 18 25 19
3 230 198 204 205
3 230 198 205 199
3 100 19 25 26
3 100 19 26 20
3 230 199 205 206
3 230 199 206 200
3 100 20 26 27
3 100 20 27 21
3 230 200 206 207
3 230 200 207 201
3 100 21 27 28
3 100 21 28 22
3 230 201 207 208
3 230 201 208 202
3 100 22 28 29
3 100 22 29 23
3 230 202 208 209
3 230 202 209 203
3 100 24 30 31
3 100 24 31 25
3 230 204 210 211
3 230 204 211 205
3 100 25 31 32
3 100 25 32 26
3 230 205 211 212
3 230 205 212 206
3 100 26 32 33
3 100 26 33 27
3 230 206 212 213
3 230 206 213 207
3 100 27 33 34
3 100 27 34 28
3 230 207 213 214
3 230 207 214 208
3 100 28 34 35
3 100 28 35 29
3 230 208 214 215
3 230 208 215 209
3 232 47 41 5
3 232 47 5 11
3 102 42 36 0
3 102 42 0 6
3 232 53 47 11
3 232 53 11 17
3 102 48 42 6
3 102 48 6 12
3 232 59 53 17
3 232 59 17 23
3 102 54 48 12
3 102 54 12 18
3 232 65 59 23
3 232 65 23 29
3 102 60 54 18
3 102 60 18 24
3 232 71 65 29
3 232 71 29 35
3 102 66 60 24
3 102 66 24 30
3 232 83 77 41
3 232 83 41 47
3 102 78 72 36
3 102 78 36 42
3 232 89 83 47
3 232 89 47 53
3 102 84 78 42
3 102 84 42 48
3 232 95 89 53
3 232 95 53 59
3 102 90 84 48
3 102 90 48 54
3 232 101 95 59
3 232 101 59 65
3 102 96 90 54
3 102 96 54 60
3 232 107 101 65
3 232 107 65 71
3 102 102 96 60
3 102 102 60 66
3 232 119 113 77
3 232 119 77 83
3 102 114 108 72
3 102 114 72 78
3 232 125 119 83
3 232 125 83 89
3 102 120 114 78
3 102 120 78 84
3 232 131 125 89
3 232 131 89 95
3 102 126 120 84
3 102 126 84 90
3 232 137 131 95
3 232 137 95 101
3 102 132 126 90
3 102 132 90 96
3 232 143 137 101
3 232 143 101 107
3 102 138 132 96
3 102 138 96 102
3 232 155 149 113
3 232 155 113 119
3 102 150 144 108
3 102 150 108 114
3 232 161 155 119
3 232 161 119 125
3 102 156 150 114
3 102 156 114 120
3 232 167 161 125
3 232 167 125 131
3 102 162 156 120
3 102 162 120 126
3 232 173 167 131
3 232 173 131 137
3 102 168 162 126
3 102 168 126 132
3 232 179 173 137
3 232 179 137 143
3 102 174 168 132
3 102 174 132 138
3 232 191 185 149
3 232 191 149 155
3 102 186 180 144
3 102 186 144 150
3 232 197 191 155
3 232 197 155 161
3 102 192 186 150
3 102 192 150 156
3 232 203 197 161
3 232 203 161 167
3 102 198 192 156
3 102 198 156 162
3 232 209 203 167
3 232 209 167 173
3 102 204 198 162
3 102 204 162 168
3 232 215 209 173
3 232 215 173 179
3 102 210 204 168
3 102 210 168 174
3 101 0 36 37
3 101 0 37 1
3 231 30 66 67
3 231 30 67 31
3 101 1 37 38
3 101 1 38 2
3 231 31 67 68
3 231 31 68 32
3 101 2 38 39
3 101 2 39 3
3 231 32 68 69
3 231 32 69 33
3 101 3 39 40
3 101 3 40 4
3 231 33 69 70
3 231 33 70 34
3 101 4 40 41
3 101 4 41 5
3 231 34 70 71
3 231 34 71 35
3 101 36 72 73
3 101 36 73 37
3 231 66 102 103
3 231 66 103 67
3 101 37 73 74
3 101 37 74 38
3 231 67 103 104
3 231 67 104 68
3 101 38 74 75
3 101 38 75 39
3 231 68 104 105
3 231 68 105 69
3 101 39 75 76
3 101 39 76 40
3 231 69 105 106
3 231 69 106 70
3 101 40 76 77
3 101 40 77 41
3 231 70 106 107
3 231 70 107 71
3 101 72 108 109
3 101 72 109 73
3 231 102 138 139
3 231 102 139 103
3 101 73 109 110
3 101 73 110 74
3 231 103 139 140
3 231 103 140 104
3 101 74 110 111
3 101 74 111 75
3 231 104 140 141
3 231 104 141 105
3 101 75 111 112
3 101 75 112 76
3 231 105 141 142
3 231 105 142 106
3 101 76 112 113
3 101 76 113 77
3 231 106 142 143
3 231 106 143 107
3 101 108 144 145
3 101 108 145 109
3 231 138 174 175
3 231 138 175 139
3 101 109 145 146
3 101 109 146 110
3 231 139 175 176
3 231 139 176 140
3 101 110 146 147
3 101 110 147 111
3 231 140 176 177
3 231 140 177 141
3 101 111 147 148
3 101 111 148 112
3 231 141 177 178
3 231 141 178 142
3 101 112 148 149
3 101 112 149 113
3 231 142 178 179
3 231 142 179 143
3 101 144 180 181
3 101 144 181 145
3 231 174 210 211
3 231 174 211 175
3 101 145 181 182
3 101 145 182 146
3 231 175 211 212
3 231 175 212 176
3 101 146 182 183
3 101 146 183 147
3 231 176 212 213
3 231 176 213 177
3 101 147 183 184
3 101 147 184 148
3 231 177 213 214
3 231 177 214 178
3 101 148 184 185
3 101 148 185 149
3 231 178 214 215
3 231 178 215 179
VDATA:
3 -10 0 0
3 -10 0 0
3 -10 0 0
3 -10 0 0
3 -10 0 0
3 -10 0 0
3 -10 0 0
3 -10 0 0
3 -10 0 0
3 -10 0 0
3 -10 0 0
3 -10 0 0
3 -10 0 0
3 -10 0 0
3 -10 0 0
3 -10 0 0
3 -10 0 0
3 -10 0 0
3 -10 0 0
3 -10 0 0
3 -10 0 0
3 -10 0 0
3 -10 0 0
3 -10 0 0
3 -10 0 0
3 -10 0 0
3 -10 0 0
3 -10 0 0
3 -10 0 0
3 -10 0 0
3 -10 0 0
3 -10 0 0
3 -10 0 0
3 -10 0 0
3 -10 0 0
3 -10 0 0
3 -10 0 0
3 -10 0 0
3 -10 0 0
3 -10 0 0
3 -10 0 0
3 -10 0 0
3 -10 0 0
3 -10 0 0
3 -10 0 0
3 -10 0 0
3 -10 0 0
3 -10 0 0
3 -10 0 0
3 -10 0 0
3 -10 0 0
3 -10 0 0
3 -10 0 0
3 -10 0 0
3 -10 0 0
3 -10 0 0
3 -10 0 0
3 -10 0 0
3 -10 0 0
3 -10 0 0
3 -10 0 0
3 -10 0 0
3 -10 0 0
3 -10 0 0
3 -10 0 0
3 -10 0 0
3 -10 0 0
3 -10 0 0
3 -10 0 0
3 -10 0 0
3 -10 0 0
3 -10 0 0
3 -10 0 0
3 -10 0 0
3 -10 0 0
3 -10 0 0
3 -10 0 0
3 -10 0 0
3 -10 0 0
3 -10 0 0
3 -10 0 0
3 -10 0 0
3 -10 0 0
3 -10 0 0
3 -10 0 0
3 -10 0 0
3 -10 0 0
3 -10 0 0
3 -10 0 0
3 -10 0 0
3 -10 0 0
3 -10 0 0
3 -10 0 0
3 -10 0 0
3 -10 0 0
3 -10 0 0
3 -10 0 0
3 -10 0 0
3 -10 0 0
3 -10 0 0
3 -10 0 0
3 -10 0 0
3 -10 0 0
3 -10 0 0
3 -10 0 0
3 -10 0 0
3 -10 0 0
3 -10 0 0
3 -10 0 0
3 -10 0 0
3 -10 0 0
3 -10 0 0
3 -10 0 0
3 -10 0 0
3 -10 0 0
3 -10 0 0
3 -10 0 0
3 -10 0 0
3 -10 0 0
3 -10 0 0
3 -10 0 0
3 -10 0 0
3 -10 0 0
3 -10 0 0
3 -10 0 0
3 -10 0 0
3 -10 0 0
3 -10 0 0
3 -10 0 0
3 -10 0 0
3 -10 0 0
3 -10 0 0
3 -10 0 0
3 -10 0 0
3 -10 0 0
3 -10 0 0
3 -10 0 0
3 -10 0 0
3 -10 0 0
3 -10 0 0
3 -10 0 0
3 -10 0 0
3 -10 0 0
3 -10 0 0
3 -10 0 0
3 -10 0 0
3 -10 0 0
3 -10 0 0
3 -10 0 0
3 -10 0 0
3 -10 0 0
3 -10 0 0
3 -10 0 0
3 -10 0 0
3 -10 0 0
3 -10 0 0
3 -10 0 0
3 -10 0 0
3 -10 0 0
3 -10 0 0
3 -10 0 0
3 -10 0 0
3 -10 0 0
3 -10 0 0
3 -10 0 0
3 -10 0 0
3 -10 0 0
3 -10 0 0
3 -10 0 0
3 -10 0 0
3 -10 0 0
3 -10 0 0
3 -10 0 0
3 -10 0 0
3 -10 0 0
3 -10 0 0
3 -10 0 0
3 -10 0 0
3 -10 0 0
3 -10 0 0
3 -10 0 0
3 -10 0 0
3 -10 0 0
3 -10 0 0
3 -10 0 0
3 -10 0 0
3 -10 0 0
3 -10 0 0
3 -10 0 0
3 -10 0 0
3 -10 0 0
3 -10 0 0
3 -10 0 0
3 -10 0 0
3 -10 0 0
3 -10 0 0
3 -10 0 0
3 -10 0 0
3 -10 0 0
3 -10 0 0
3 -10 0 0
3 -10 0 0
3 -10 0 0
3 -10 0 0
3 -10 0 0
3 -10 0 0
3 -10 0 0
3 -10 0 0
3 -10 0 0
3 -10 0 0
3 -10 0 0
3 -10 0 0
3 -10 0 0
3 -10 0 0
3 -10 0 0
3 -10 0 0
CDATA:
9 1 0 0 0 1 0 0 0 1
9 1 0 0 0 1 0 0 0 1
9 1 0 0 0 1 0 0 0 1
9 1 0 0 0 1 0 0 0 1
9 1 0 0 0 1 0 0 0 1
9 1 0 0 0 1 0 0 0 1
9 1 0 0 0 1 0 0 0 1
9 1 0 0 0 1 0 0 0 1
9 1 0 0 0 1 0 0 0 1
9 1 0 0 0 1 0 0 0 1
9 1 0 0 0 1 0 0 0 1
9 1 0 0 0 1 0 0 0 1
9 1 0 0 0 1 0 0 0 1
9 1 0 0 0 1 0 0 0 1
9 1 0 0 0 1 0 0 0 1
9 1 0 0 0 1 0 0 0 1
9 1 0 0 0 1 0 0 0 1
9 1 0 0 0 1 0 0 0 1
9 1 0 0 0 1 0 0 0 1
9 1 0 0 0 1 0 0 0 1
9 1 0 0 0 1 0 0 0 1
9 1 0 0 0 1 0 0 0 1
9 1 0 0 0 1 0 0 0 1
9 1 0 0 0 1 0 0 0 1
9 1 0 0 0 1 0 0 0 1
9 1 0 0 0 1 0 0 0 1
9 1 0 0 0 1 0 0 0 1
9 1 0 0 0 1 0 0 0 1
9 1 0 0 0 1 0 0 0 1
9 1 0 0 0 1 0 0 0 1
9 1 0 0 0 1 0 0 0 1
9 1 0 0 0 1 0 0 0 1
9 1 0 0 0 1 0 0 0 1
9 1 0 0 0 1 0 0 0 1
9 1 0 0 0 1 0 0 0 1
9 1 0 0 0 1 0 0 0 1
9 1 0 0 0 1 0 0 0 1
9 1 0 0 0 1 0 0 0 1
9 1 0 0 0 1 0 0 0 1
9 1 0 0 0 1 0 0 0 1
9 1 0 0 0 1 0 0 0 1
9 1 0 0 0 1 0 0 0 1
9 1 0 0 0 1 0 0 0 1
9 1 0 0 0 1 0 0 0 1
9 1 0 0 0 1 0 0 0 1
9 1 0 0 0 1 0 0 0 1
9 1 0 0 0 1 0 0 0 1
9 1 0 0 0 1 0 0 0 1
9 1 0 0 0 1 0 0 0 1
9 1 0 0 0 1 0 0 0 1
9 1 0 0 0 1 0 0 0 1
9 1 0 0 0 1 0 0 0 1
9 1 0 0 0 1 0 0 0 1
9 1 0 0 0 1 0 0 0 1
9 1 0 0 0 1 0 0 0 1
9 1 0 0 0 1 0 0 0 1
9 1 0 0 0 1 0 0 0 1
9 1 0 0 0 1 0 0 0 1
9 1 0 0 0 1 0 0 0 1
9 1 0 0 0 1 0 0 0 1
9 1 0 0 0 1 0 0 0 1
9 1 0 0 0 1 0 0 0 1
9 1 0 0 0 1 0 0 0 1
9 1 0 0 0 1 0 0 0 1
9 1 0 0 0 1 0 0 0 1
9 1 0 0 0 1 0 0 0 1
9 1 0 0 0 1 0 0 0 1
9 1 0 0 0 1 0 0 0 1
9 1 0 0 0 1 0 0 0 1
9 1 0 0 0 1 0 0 0 1
9 1 0 0 0 1 0 0 0 1
9 1 0 0 0 1 0 0 0 1
9 1 0 0 0 1 0 0 0 1
9 1 0 0 0 1 0 0 0 1
9 1 0 0 0 1 0 0 0 1
9 1 0 0 0 1 0 0 0 1
9 1 0 0 0 1 0 0 0 1
9 1 0 0 0 1 0 0 0 1
9 1 0 0 0 1 0 0 0 1
9 1 0 0 0 1 0 0 0 1
9 1 0 0 0 1 0 0 0 1
9 1 0 0 0 1 0 0 0 1
9 1 0 0 0 1 0 0 0 1
9 1 0 0 0 1 0 0 0 1
9 1 0 0 0 1 0 0 0 1
9 1 0 0 0 1 0 0 0 1
9 1 0 0 0 1 0 0 0 1
9 1 0 0 0 1 0 0 0 1
9 1 0 0 0 1 0 0 0 1
9 1 0 0 0 1 0 0 0 1
9 1 0 0 0 1 0 0 0 1
9 1 0 0 0 1 0 0 0 1
9 1 0 0 0 1 0 0 0 1
9 1 0 0 0 1 0 0 0 1
9 1 0 0 0 1 0 0 0 1
9 1 0 0 0 1 0 0 0 1
9 1 0 0 0 1 0 0 0 1
9 1 0 0 0 1 0 0 0 1
9 1 0 0 0 1 0 0 0 1
9 1 0 0 0 1 0 0 0 1
9 1 0 0 0 1 0 0 0 1
9 1 0 0 0 1 0 0 0 1
9 1 0 0 0 1 0 0 0 1
9 1 0 0 0 1 0 0 0 1
9 1 0 0 0 1 0 0 0 1
9 1 0 0 0 1 0 0 0 1
9 1 0 0 0 1 0 0 0 1
9 1 0 0 0 1 0 0 0 1
9 1 0 0 0 1 0 0 0 1
9 1 0 0 0 1 0 0 0 1
9 1 0 0 0 1 0 0 0 1
9 1 0 0 0 1 0 0 0 1
9 1 0 0 0 1 0 0 0 1
9 1 0 0 0 1 0 0 0 1
9 1 0 0 0 1 0 0 0 1
9 1 0 0 0 1 0 0 0 1
9 1 0 0 0 1 0 0 0 1
9 1 0 0 0 1 0 0 0 1
9 1 0 0 0 1 0 0 0 1
9 1 0 0 0 1 0 0 0 1
9 1 0 0 0 1 0 0 0 1
9 1 0 0 0 1 0 0 0 1
9 1 0 0 0 1 0 0 0 1
9 1 0 0 0 1 0 0 0 1
9 1 0 0 0 1 0 0 0 1
9 1 0 0 0 1 0 0 0 1
9 1 0 0 0 1 0 0 0 1
9 1 0 0 0 1 0 0 0 1
9 1 0 0 0 1 0 0 0 1
9 1 0 0 0 1 0 0 0 1
9 1 0 0 0 1 0 0 0 1
9 1 0 0 0 1 0 0 0 1
9 1 0 0 0 1 0 0 0 1
9 1 0 0 0 1 0 0 0 1
9 1 0 0 0 1 0 0 0 1
9 1 0 0 0 1 0 0 0 1
9 1 0 0 0 1 0 0 0 1
9 1 0 0 0 1 0 0 0 1
9 1 0 0 0 1 0 0 0 1
9 1 0 0 0 1 0 0 0 1
9 1 0 0 0 1 0 0 0 1
9 1 0 0 0 1 0 0 0 1
9 1 0 0 0 1 0 0 0 1
9 1 0 0 0 1 0 0 0 1
9 1 0 0 0 1 0 0 0 1
9 1 0 0 0 1 0 0 0 1
9 1 0 0 0 1 0 0 0 1
9 1 0 0 0 1 0 0 0 1
9 1 0 0 0 1 0 0 0 1
9 1 0 0 0 1 0 0 0 1
9 1 0 0 0 1 0 0 0 1
9 1 0 0 0 1 0 0 0 1
9 1 0 0 0 1 0 0 0 1
9 1 0 0 0 1 0 0 0 1
9 1 0 0 0 1 0 0 0 1
9 1 0 0 0 1 0 0 0 1
9 1 0 0 0 1 0 0 0 1
9 1 0 0 0 1 0 0 0 1
9 1 0 0 0 1 0 0 0 1
9 1 0 0 0 1 0 0 0 1
9 1 0 0 0 1 0 0 0 1
9 1 0 0 0 1 0 0 0 1
9 1 0 0 0 1 0 0 0 1
9 1 0 0 0 1 0 0 0 1
9 1 0 0 0 1 0 0 0 1
9 1 0 0 0 1 0 0 0 1
9 1 0 0 0 1 0 0 0 1
9 1 0 0 0 1 0 0 0 1
9 1 0 0 0 1 0 0 0 1
9 1 0 0 0 1 0 0 0 1
9 1 0 0 0 1 0 0 0 1
9 1 0 0 0 1 0 0 0 1
9 1 0 0 0 1 0 0 0 1
9 1 0 0 0 1 0 0 0 1
9 1 0 0 0 1 0 0 0 1
9 1 0 0 0 1 0 0 0 1
9 1 0 0 0 1 0 0 0 1
9 1 0 0 0 1 0 0 0 1
9 1 0 0 0 1 0 0 0 1
9 1 0 0 0 1 0 0 0 1
9 1 0 0 0 1 0 0 0 1
9 1 0 0 0 1 0 0 0 1
9 1 0 0 0 1 0 0 0 1
9 1 0 0 0 1 0 0 0 1
9 1 0 0 0 1 0 0 0 1
9 1 0 0 0 1 0 0 0 1
9 1 0 0 0 1 0 0 0 1
9 1 0 0 0 1 0 0 0 1
9 1 0 0 0 1 0 0 0 1
9 1 0 0 0 1 0 0 0 1
9 1 0 0 0 1 0 0 0 1
9 1 0 0 0 1 0 0 0 1
9 1 0 0 0 1 0 0 0 1
9 1 0 0 0 1 0 0 0 1
9 1 0 0 0 1 0 0 0 1
9 1 0 0 0 1 0 0 0 1
9 1 0 0 0 1 0 0 0 1
9 1 0 0 0 1 0 0 0 1
9 1 0 0 0 1 0 0 0 1
9 1 0 0 0 1 0 0 0 1
9 1 0 0 0 1 0 0 0 1
9 1 0 0 0 1 0 0 0 1
9 1 0 0 0 1 0 0 0 1
9 1 0 0 0 1 0 0 0 1
9 1 0 0 0 1 0 0 0 1
9 1 0 0 0 1 0 0 0 1
9 1 0 0 0 1 0 0 0 1
9 1 0 0 0 1 0 0 0 1
9 1 0 0 0 1 0 0 0 1
9 1 0 0 0 1 0 0 0 1
9 1 0 0 0 1 0 0 0 1
9 1 0 0 0 1 0 0 0 1
9 1 0 0 0 1 0 0 0 1
9 1 0 0 0 1 0 0 0 1
9 1 0 0 0 1 0 0 0 1
9 1 0 0 0 1 0 0 0 1
9 1 0 0 0 1 0 0 0 1
9 1 0 0 0 1 0 0 0 1
9 1 0 0 0 1 0 0 0 1
9 1 0 0 0 1 0 0 0 1
9 1 0 0 0 1 0 0 0 1
9 1 0 0 0 1 0 0 0 1
9 1 0 0 0 1 0 0 0 1
9 1 0 0 0 1 0 0 0 1
9 1 0 0 0 1 0 0 0 1
9 1 0 0 0 1 0 0 0 1
9 1 0 0 0 1 0 0 0 1
9 1 0 0 0 1 0 0 0 1
9 1 0 0 0 1 0 0 0 1
9 1 0 0 0 1 0 0 0 1
9 1 0 0 0 1 0 0 0 1
9 1 0 0 0 1 0 0 0 1
9 1 0 0 0 1 0 0 0 1
9 1 0 0 0 1 0 0 0 1
9 1 0 0 0 1 0 0 0 1
9 1 0 0 0 1 0 0 0 1
9 1 0 0 0 1 0 0 0 1
9 1 0 0 0 1 0 0 0 1
9 1 0 0 0 1 0 0 0 1
9 1 0 0 0 1 0 0 0 1
9 1 0 0 0 1 0 0 0 1
9 1 0 0 0 1 0 0 0 1
9 1 0 0 0 1 0 0 0 1
9 1 0 0 0 1 0 0 0 1
9 1 0 0 0 1 0 0 0 1
9 1 0 0 0 1 0 0 0 1
9 1 0 0 0 1 0 0 0 1
9 1 0 0 0 1 0 0 0 1
9 1 0 0 0 1 0 0 0 1
9 1 0 0 0 1 0 0 0 1
9 1 0 0 0 1 0 0 0 1
9 1 0 0 0 1 0 0 0 1
9 1 0 0 0 1 0 0 0 1
9 1 0 0 0 1 0 0 0 1
9 1 0 0 0 1 0 0 0 1
9 1 0 0 0 1 0 0 0 1
9 1 0 0 0 1 0 0 0 1
9 1 0 0 0 1 0 0 0 1
9 1 0 0 0 1 0 0 0 1
9 1 0 0 0 1 0 0 0 1
9 1 0 0 0 1 0 0 0 1
9 1 0 0 0 1 0 0 0 1
9 1 0 0 0 1 0 0 0 1
9 1 0 0 0 1 0 0 0 1
9 1 0 0 0 1 0 0 0 1
9 1 0 0 0 1 0 0 0 1
9 1 0 0 0 1 0 0 0 1
9 1 0 0 0 1 0 0 0 1
9 1 0 0 0 1 0 0 0 1
9 1 0 0 0 1 0 0 0 1
9 1 0 0 0 1 0 0 0 1
9 1 0 0 0 1 0 0 0 1
9 1 0 0 0 1 0 0 0 1
9 1 0 0 0 1 0 0 0 1
9 1 0 0 0 1 0 0 0 1
9 1 0 0 0 1 0 0 0 1
9 1 0 0 0 1 0 0 0 1
9 1 0 0 0 1 0 0 0 1
9 1 0 0 0 1 0 0 0 1
9 1 0 0 0 1 0 0 0 1
9 1 0 0 0 1 0 0 0 1
9 1 0 0 0 1 0 0 0 1
9 1 0 0 0 1 0 0 0 1
9 1 0 0 0 1 0 0 0 1
9 1 0 0 0 1 0 0 0 1
9 1 0 0 0 1 0 0 0 1
9 1 0 0 0 1 0 0 0 1
9 1 0 0 0 1 0 0 0 1
9 1 0 0 0 1 0 0 0 1
9 1 0 0 0 1 0 0 0 1
9 1 0 0 0 1 0 0 0 1
9 1 0 0 0 1 0 0 0 1
9 1 0 0 0 1 0 0 0 1
9 1 0 0 0 1 0 0 0 1
9 1 0 0 0 1 0 0 0 1
9 1 0 0 0 1 0 0 0 1
9 1 0 0 0 1 0 0 0 1
9 1 0 0 0 1 0 0 0 1
9 1 0 0 0 1 0 0 0 1
9 1 0 0 0 1 0 0 0 1
9 1 0 0 0 1 0 0 0 1
9 1 0 0 0 1 0 0 0 1
9 1 0 0 0 1 0 0 0 1
9 1 0 0 0 1 0 0 0 1
9 1 0 0 0 1 0 0 0 1
9 1 0 0 0 1 0 0 0 1
9 1 0 0 0 1 0 0 0 1
9 1 0 0 0 1 0 0 0 1
9 1 0 0 0 1 0 0 0 1
9 1 0 0 0 1 0 0 0 1
9 1 0 0 0 1 0 0 0 1
9 1 0 0 0 1 0 0 0 1
9 1 0 0 0 1 0 0 0 1
9 1 0 0 0 1 0 0 0 1
9 1 0 0 0 1 0 0 0 1
9 1 0 0 0 1 0 0 0 1
9 1 0 0 0 1 0 0 0 1
9 1 0 0 0 1 0 0 0 1
9 1 0 0 0 1 0 0 0 1
9 1 0 0 0 1 0 0 0 1
9 1 0 0 0 1 0 0 0 1
9 1 0 0 0 1 0 0 0 1
9 1 0 0 0 1 0 0 0 1
9 1 0 0 0 1 0 0 0 1
9 1 0 0 0 1 0 0 0 1
9 1 0 0 0 1 0 0 0 1
9 1 0 0 0 1 0 0 0 1
9 1 0 0 0 1 0 0 0 1
9 1 0 0 0 1 0 0 0 1
9 1 0 0 0 1 0 0 0 1
9 1 0 0 0 1 0 0 0 1
9 1 0 0 0 1 0 0 0 1
9 1 0 0 0 1 0 0 0 1
9 1 0 0 0 1 0 0 0 1
9 1 0 0 0 1 0 0 0 1
9 1 0 0 0 1 0 0 0 1
9 1 0 0 0 1 0 0 0 1
9 1 0 0 0 1 0 0 0 1
9 1 0 0 0 1 0 0 0 1
9 1 0 0 0 1 0 0 0 1
9 1 0 0 0 1 0 0 0 1
9 1 0 0 0 1 0 0 0 1
9 1 0 0 0 1 0 0 0 1
9 1 0 0 0 1 0 0 0 1
9 1 0 0 0 1 0 0 0 1
9 1 0 0 0 1 0 0 0 1
9 1 0 0 0 1 0 0 0 1
9 1 0 0 0 1 0 0 0 1
9 1 0 0 0 1 0 0 0 1
9 1 0 0 0 1 0 0 0 1
9 1 0 0 0 1 0 0 0 1
9 1 0 0 0 1 0 0 0 1
9 1 0 0 0 1 0 0 0 1
9 1 0 0 0 1 0 0 0 1
9 1 0 0 0 1 0 0 0 1
9 1 0 0 0 1 0 0 0 1
9 1 0 0 0 1 0 0 0 1
9 1 0 0 0 1 0 0 0 1
9 1 0 0 0 1 0 0 0 1
9 1 0 0 0 1 0 0 0 1
9 1 0 0 0 1 0 0 0 1
9 1 0 0 0 1 0 0 0 1
9 1 0 0 0 1 0 0 0 1
9 1 0 0 0 1 0 0 0 1
9 1 0 0 0 1 0 0 0 1
9 1 0 0 0 1 0 0 0 1
9 1 0 0 0 1 0 0 0 1
9 1 0 0 0 1 0 0 0 1
9 1 0 0 0 1 0 0 0 1
9 1 0 0 0 1 0 0 0 1
9 1 0 0 0 1 0 0 0 1
9 1 0 0 0 1 0 0 0 1
9 1 0 0 0 1 0 0 0 1
9 1 0 0 0 1 0 0 0 1
9 1 0 0 0 1 0 0 0 1
9 1 0 0 0 1 0 0 0 1
9 1 0 0 0 1 0 0 0 1
9 1 0 0 0 1 0 0 0 1
9 1 0 0 0 1 0 0 0 1
9 1 0 0 0 1 0 0 0 1
9 1 0 0 0 1 0 0 0 1
9 1 0 0 0 1 0 0 0 1
9 1 0 0 0 1 0 0 0 1
9 1 0 0 0 1 0 0 0 1
9 1 0 0 0 1 0 0 0 1
9 1 0 0 0 1 0 0 0 1
9 1 0 0 0 1 0 0 0 1
9 1 0 0 0 1 0 0 0 1
9 1 0 0 0 1 0 0 0 1
9 1 0 0 0 1 0 0 0 1
9 1 0 0 0 1 0 0 0 1
9 1 0 0 0 1 0 0 0 1
9 1 0 0 0 1 0 0 0 1
9 1 0 0 0 1 0 0 0 1
9 1 0 0 0 1 0 0 0 1
9 1 0 0 0 1 0 0 0 1
9 1 0 0 0 1 0 0 0 1
9 1 0 0 0 1 0 0 0 1
9 1 0 0 0 1 0 0 0 1
9 1 0 0 0 1 0 0 0 1
9 1 0 0 0 1 0 0 0 1
9 1 0 0 0 1 0 0 0 1
9 1 0 0 0 1 0 0 0 1
9 1 0 0 0 1 0 0 0 1
9 1 0 0 0 1 0 0 0 1
9 1 0 0 0 1 0 0 0 1
9 1 0 0 0 1 0 0 0 1
9 1 0 0 0 1 0 0 0 1
9 1 0 0 0 1 0 0 0 1
9 1 0 0 0 1 0 0 0 1
9 1 0 0 0 1 0 0 0 1
9 1 0 0 0 1 0 0 0 1
9 1 0 0 0 1 0 0 0 1
9 1 0 0 0 1 0 0 0 1
9 1 0 0 0 1 0 0 0 1
9 1 0 0 0 1 0 0 0 1
9 1 0 0 0 1 0 0 0 1
9 1 0 0 0 1 0 0 0 1
9 1 0 0 0 1 0 0 0 1
9 1 0 0 0 1 0 0 0 1
9 1 0 0 0 1 0 0 0 1
9 1 0 0 0 1 0 0 0 1
9 1 0 0 0 1 0 0 0 1
9 1 0 0 0 1 0 0 0 1
9 1 0 0 0 1 0 0 0 1
9 1 0 0 0 1 0 0 0 1
9 1 0 0 0 1 0 0 0 1
9 1 0 0 0 1 0 0 0 1
9 1 0 0 0 1 0 0 0 1
9 1 0 0 0 1 0 0 0 1
9 1 0 0 0 1 0 0 0 1
9 1 0 0 0 1 0 0 0 1
9 1 0 0 0 1 0 0 0 1
9 1 0 0 0 1 0 0 0 1
9 1 0 0 0 1 0 0 0 1
9 1 0 0 0 1 0 0 0 1
9 1 0 0 0 1 0 0 0 1
9 1 0 0 0 1 0 0 0 1
9 1 0 0 0 1 0 0 0 1
9 1 0 0 0 1 0 0 0 1
9 1 0 0 0 1 0 0 0 1
9 1 0 0 0 1 0 0 0 1
9 1 0 0 0 1 0 0 0 1
9 1 0 0 0 1 0 0 0 1
9 1 0 0 0 1 0 0 0 1
9 1 0 0 0 1 0 0 0 1
9 1 0 0 0 1 0 0 0 1
9 1 0 0 0 1 0 0 0 1
9 1 0 0 0 1 0 0 0 1
9 1 0 0 0 1 0 0 0 1
9 1 0 0 0 1 0 0 0 1
9 1 0 0 0 1 0 0 0 1
9 1 0 0 0 1 0 0 0 1
9 1 0 0 0 1 0 0 0 1
9 1 0 0 0 1 0 0 0 1
9 1 0 0 0 1 0 0 0 1
9 1 0 0 0 1 0 0 0 1
9 1 0 0 0 1 0 0 0 1
9 1 0 0 0 1 0 0 0 1
9 1 0 0 0 1 0 0 0 1
9 1 0 0 0 1 0 0 0 1
9 1 0 0 0 1 0 0 0 1
9 1 0 0 0 1 0 0 0 1
9 1 0 0 0 1 0 0 0 1
9 1 0 0 0 1 0 0 0 1
9 1 0 0 0 1 0 0 0 1
9 1 0 0 0 1 0 0 0 1
9 1 0 0 0 1 0 0 0 1
9 1 0 0 0 1 0 0 0 1
9 1 0 0 0 1 0 0 0 1
9 1 0 0 0 1 0 0 0 1
9 1 0 0 0 1 0 0 0 1
9 1 0 0 0 1 0 0 0 1
9 1 0 0 0 1 0 0 0 1
9 1 0 0 0 1 0 0 0 1
9 1 0 0 0 1 0 0 0 1
9 1 0 0 0 1 0 0 0 1
9 1 0 0 0 1 0 0 0 1
9 1 0 0 0 1 0 0 0 1
9 1 0 0 0 1 0 0 0 1
9 1 0 0 0 1 0 0 0 1
9 1 0 0 0 1 0 0 0 1
9 1 0 0 0 1 0 0 0 1
9 1 0 0 0 1 0 0 0 1
9 1 0 0 0 1 0 0 0 1
9 1 0 0 0 1 0 0 0 1
9 1 0 0 0 1 0 0 0 1
9 1 0 0 0 1 0 0 0 1
9 1 0 0 0 1 0 0 0 1
9 1 0 0 0 1 0 0 0 1
9 1 0 0 0 1 0 0 0 1
9 1 0 0 0 1 0 0 0 1
9 1 0 0 0 1 0 0 0 1
9 1 0 0 0 1 0 0 0 1
9 1 0 0 0 1 0 0 0 1
9 1 0 0 0 1 0 0 0 1
9 1 0 0 0 1 0 0 0 1
9 1 0 0 0 1 0 0 0 1
9 1 0 0 0 1 0 0 0 1
9 1 0 0 0 1 0 0 0 1
9 1 0 0 0 1 0 0 0 1
9 1 0 0 0 1 0 0 0 1
9 1 0 0 0 1 0 0 0 1
9 1 0 0 0 1 0 0 0 1
9 1 0 0 0 1 0 0 0 1
9 1 0 0 0 1 0 0 0 1
9 1 0 0 0 1 0 0 0 1
9 1 0 0 0 1 0 0 0 1
9 1 0 0 0 1 0 0 0 1
9 1 0 0 0 1 0 0 0 1
9 1 0 0 0 1 0 0 0 1
9 1 0 0 0 1 0 0 0 1
9 1 0 0 0 1 0 0 0 1
9 1 0 0 0 1 0 0 0 1
9 1 0 0 0 1 0 0 0 1
9 1 0 0 0 1 0 0 0 1
9 1 0 0 0 1 0 0 0 1
9 1 0 0 0 1 0 0 0 1
9 1 0 0 0 1 0 0 0 1
9 1 0 0 0 1 0 0 0 1
9 1 0 0 0 1 0 0 0 1
9 1 0 0 0 1 0 0 0 1
9 1 0 0 0 1 0 0 0 1
9 1 0 0 0 1 0 0 0 1
9 1 0 0 0 1 0 0 0 1
9 1 0 0 0 1 0 0 0 1
9 1 0 0 0 1 0 0 0 1
9 1 0 0 0 1 0 0 0 1
9 1 0 0 0 1 0 0 0 1
9 1 0 0 0 1 0 0 0 1
9 1 0 0 0 1 0 0 0 1
9 1 0 0 0 1 0 0 0 1
9 1 0 0 0 1 0 0 0 1
9 1 0 0 0 1 0 0 0 1
9 1 0 0 0 1 0 0 0 1
9 1 0 0 0 1 0 0 0 1
9 1 0 0 0 1 0 0 0 1
9 1 0 0 0 1 0 0 0 1
9 1 0 0 0 1 0 0 0 1
9 1 0 0 0 1 0 0 0 1
9 1 0 0 0 1 0 0 0 1
9 1 0 0 0 1 0 0 0 1
9 1 0 0 0 1 0 0 0 1
9 1 0 0 0 1 0 0 0 1
9 1 0 0 0 1 0 0 0 1
9 1 0 0 0 1 0 0 0 1
9 1 0 0 0 1 0 0 0 1
9 1 0 0 0 1 0 0 0 1
9 1 0 0 0 1 0 0 0 1
9 1 0 0 0 1 0 0 0 1
9 1 0 0 0 1 0 0 0 1
9 1 0 0 0 1 0 0 0 1
9 1 0 0 0 1 0 0 0 1
9 1 0 0 0 1 0 0 0 1
9 1 0 0 0 1 0 0 0 1
9 1 0 0 0 1 0 0 0 1
9 1 0 0 0 1 0 0 0 1
9 1 0 0 0 1 0 0 0 1
9 1 0 0 0 1 0 0 0 1
9 1 0 0 0 1 0 0 0 1
9 1 0 0 0 1 0 0 0 1
9 1 0 0 0 1 0 0 0 1
9 1 0 0 0 1 0 0 0 1
9 1 0 0 0 1 0 0 0 1
9 1 0 0 0 1 0 0 0 1
9 1 0 0 0 1 0 0 0 1
9 1 0 0 0 1 0 0 0 1
9 1 0 0 0 1 0 0 0 1
9 1 0 0 0 1 0 0 0 1
9 1 0 0 0 1 0 0 0 1
9 1 0 0 0 1 0 0 0 1
9 1 0 0 0 1 0 0 0 1
9 1 0 0 0 1 0 0 0 1
9 1 0 0 0 1 0 0 0 1
9 1 0 0 0 1 0 0 0 1
9 1 0 0 0 1 0 0 0 1
9 1 0 0 0 1 0 0 0 1
9 1 0 0 0 1 0 0 0 1
9 1 0 0 0 1 0 0 0 1
9 1 0 0 0 1 0 0 0 1
9 1 0 0 0 1 0 0 0 1
9 1 0 0 0 1 0 0 0 1
9 1 0 0 0 1 0 0 0 1
9 1 0 0 0 1 0 0 0 1
9 1 0 0 0 1 0 0 0 1
9 1 0 0 0 1 0 0 0 1
9 1 0 0 0 1 0 0 0 1
9 1 0 0 0 1 0 0 0 1
9 1 0 0 0 1 0 0 0 1
9 1 0 0 0 1 0 0 0 1
9 1 0 0 0 1 0 0 0 1
9 1 0 0 0 1 0 0 0 1
9 1 0 0 0 1 0 0 0 1
9 1 0 0 0 1 0 0 0 1
9 1 0 0 0 1 0 0 0 1
9 1 0 0 0 1 0 0 0 1
9 1 0 0 0 1 0 0 0 1
9 1 0 0 0 1 0 0 0 1
9 1 0 0 0 1 0 0 0 1
9 1 0 0 0 1 0 0 0 1
9 1 0 0 0 1 0 0 0 1
9 1 0 0 0 1 0 0 0 1
9 1 0 0 0 1 0 0 0 1
9 1 0 0 0 1 0 0 0 1
9 1 0 0 0 1 0 0 0 1
9 1 0 0 0 1 0 0 0 1
9 1 0 0 0 1 0 0 0 1
9 1 0 0 0 1 0 0 0 1
9 1 0 0 0 1 0 0 0 1
9 1 0 0 0 1 0 0 0 1
9 1 0 0 0 1 0 0 0 1
9 1 0 0 0 1 0 0 0 1
9 1 0 0 0 1 0 0 0 1
9 1 0 0 0 1 0 0 0 1
9 1 0 0 0 1 0 0 0 1
9 1 0 0 0 1 0 0 0 1
9 1 0 0 0 1 0 0 0 1
9 1 0 0 0 1 0 0 0 1
9 1 0 0 0 1 0 0 0 1
9 1 0 0 0 1 0 0 0 1
9 1 0 0 0 1 0 0 0 1
9 1 0 0 0 1 0 0 0 1
9 1 0 0 0 1 0 0 0 1
9 1 0 0 0 1 0 0 0 1
9 1 0 0 0 1 0 0 0 1
9 1 0 0 0 1 0 0 0 1
9 1 0 0 0 1 0 0 0 1
9 1 0 0 0 1 0 0 0 1
9 1 0 0 0 1 0 0 0 1
9 1 0 0 0 1 0 0 0 1
9 1 0 0 0 1 0 0 0 1
9 1 0 0 0 1 0 0 0 1
9 1 0 0 0 1 0 0 0 1
9 1 0 0 0 1 0 0 0 1
9 1 0 0 0 1 0 0 0 1
9 1 0 0 0 1 0 0 0 1
9 1 0 0 0 1 0 0 0 1
9 1 0 0 0 1 0 0 0 1
9 1 0 0 0 1 0 0 0 1
9 1 0 0 0 1 0 0 0 1
9 1 0 0 0 1 0 0 0 1
9 1 0 0 0 1 0 0 0 1
9 1 0 0 0 1 0 0 0 1
9 1 0 0 0 1 0 0 0 1
9 1 0 0 0 1 0 0 0 1
9 1 0 0 0 1 0 0 0 1
9 1 0 0 0 1 0 0 0 1
9 1 0 0 0 1 0 0 0 1
9 1 0 0 0 1 0 0 0 1
9 1 0 0 0 1 0 0 0 1
9 1 0 0 0 1 0 0 0 1
9 1 0 0 0 1 0 0 0 1
9 1 0 0 0 1 0 0 0 1
9 1 0 0 0 1 0 0 0 1
9 1 0 0 0 1 0 0 0 1
9 1 0 0 0 1 0 0 0 1
9 1 0 0 0 1 0 0 0 1
9 1 0 0 0 1 0 0 0 1
9 1 0 0 0 1 0 0 0 1
9 1 0 0 0 1 0 0 0 1
9 1 0 0 0 1 0 0 0 1
9 1 0 0 0 1 0 0 0 1
9 1 0 0 0 1 0 0 0 1
9 1 0 0 0 1 0 0 0 1
9 1 0 0 0 1 0 0 0 1
9 1 0 0 0 1 0 0 0 1
9 1 0 0 0 1 0 0 0 1
9 1 0 0 0 1 0 0 0 1
9 1 0 0 0 1 0 0 0 1
9 1 0 0 0 1 0 0 0 1
9 1 0 0 0 1 0 0 0 1
9 1 0 0 0 1 0 0 0 1
9 1 0 0 0 1 0 0 0 1
9 1 0 0 0 1 0 0 0 1
9 1 0 0 0 1 0 0 0 1
9 1 0 0 0 1 0 0 0 1
9 1 0 0 0 1 0 0 0 1
9 1 0 0 0 1 0 0 0 1
9 1 0 0 0 1 0 0 0 1
9 1 0 0 0 1 0 0 0 1
9 1 0 0 0 1 0 0 0 1
9 1 0 0 0 1 0 0 0 1
9 1 0 0 0 1 0 0 0 1
9 1 0 0 0 1 0 0 0 1
9 1 0 0 0 1 0 0 0 1
9 1 0 0 0 1 0 0 0 1
9 1 0 0 0 1 0 0 0 1
9 1 0 0 0 1 0 0 0 1
9 1 0 0 0 1 0 0 0 1
9 1 0 0 0 1 0 0 0 1
9 1 0 0 0 1 0 0 0 1
9 1 0 0 0 1 0 0 0 1
9 1 0 0 0 1 0 0 0 1
9 1 0 0 0 1 0 0 0 1
9 1 0 0 0 1 0 0 0 1
9 1 0 0 0 1 0 0 0 1
9 1 0 0 0 1 0 0 0 1
9 1 0 0 0 1 0 0 0 1
9 1 0 0 0 1 0 0 0 1
9 1 0 0 0 1 0 0 0 1
9 1 0 0 0 1 0 0 0 1
9 1 0 0 0 1 0 0 0 1
9 1 0 0 0 1 0 0 0 1
9 1 0 0 0 1 0 0 0 1
9 1 0 0 0 1 0 0 0 1
9 1 0 0 0 1 0 0 0 1
9 1 0 0 0 1 0 0 0 1
9 1 0 0 0 1 0 0 0 1
9 1 0 0 0 1 0 0 0 1
9 1 0 0 0 1 0 0 0 1
9 1 0 0 0 1 0 0 0 1
9 1 0 0 0 1 0 0 0 1
9 1 0 0 0 1 0 0 0 1
9 1 0 0 0 1 0 0 0 1
9 1 0 0 0 1 0 0 0 1
9 1 0 0 0 1 0 0 0 1
9 1 0 0 0 1 0 0 0 1
9 1 0 0 0 1 0 0 0 1
9 1 0 0 0 1 0 0 0 1
9 1 0 0 0 1 0 0 0 1
9 1 0 0 0 1 0 0 0 1
9 1 0 0 0 1 0 0 0 1
9 1 0 0 0 1 0 0 0 1
9 1 0 0 0 1 0 0 0 1
9 1 0 0 0 1 0 0 0 1
9 1 0 0 0 1 0 0 0 1
9 1 0 0 0 1 0 0 0 1
9 1 0 0 0 1 0 0 0 1
9 1 0 0 0 1 0 0 0 1
9 1 0 0 0 1 0 0 0 1
9 1 0 0 0 1 0 0 0 1
9 1 0 0 0 1 0 0 0 1
9 1 0 0 0 1 0 0 0 1
9 1 0 0 0 1 0 0 0 1
9 1 0 0 0 1 0 0 0 1
9 1 0 0 0 1 0 0 0 1
9 1 0 0 0 1 0 0 0 1
9 1 0 0 0 1 0 0 0 1
9 1 0 0 0 1 0 0 0 1
9 1 0 0 0 1 0 0 0 1
9 1 0 0 0 1 0 0 0 1
9 1 0 0 0 1 0 0 0 1
9 1 0 0 0 1 0 0 0 1
9 1 0 0 0 1 0 0 0 1
9 1 0 0 0 1 0 0 0 1
9 1 0 0 0 1 0 0 0 1
9 1 0 0 0 1 0 0 0 1
9 1 0 0 0 1 0 0 0 1
9 1 0 0 0 1 0 0 0 1
9 1 0 0 0 1 0 0 0 1
