POINTS:
0.0 0.0 0.0
0.0 0.0 0.5
0.0 0.0 1.0
0.0 0.5 0.0
0.0 0.5 0.5
0.0 0.5 1.0
0.0 1.0 0.0
0.0 1.0 0.5
0.0 1.0 1.0
0.5 0.0 0.0
0.5 0.0 0.5
0.5 0.0 1.0
0.5 0.5 0.0
0.5 0.5 0.5
0.5 0.5 1.0
0.5 1.0 0.0
0.5 1.0 0.5
0.5 1.0 1.0
1.0 0.0 0.0
1.0 0.0 0.5
1.0 0.0 1.0
1.0 0.5 0.0
1.0 0.5 0.5
1.0 0.5 1.0
1.0 1.0 0.0
1.0 1.0 0.5
1.0 1.0 1.0
CELLS:
4 0 0 3 4 13
4 0 0 3 12 13
4 0 0 9 12 13
4 0 0 9 10 13
4 0 0 1 10 13
4 0 0 1 4 13
4 0 1 4 5 14
4 0 1 4 13 14
4 0 1 10 13 14
4 0 1 10 11 14
4 0 1 2 11 14
4 0 1 2 5 14
4 0 3 6 7 16
4 0 3 6 15 16
4 0 3 12 15 16
4 0 3 12 13 16
4 0 3 4 13 16
4 0 3 4 7 16
4 0 4 7 8 17
4 0 4 7 16 17
4 0 4 13 16 17
4 0 4 13 14 17
4 0 4 5 14 17
4 0 4 5 8 17
4 0 9 12 13 22
4 0 9 12 21 22
4 0 9 18 21 22
4 0 9 18 19 22
4 0 9 10 19 22
4 0 9 10 13 22
4 0 10 13 14 23
4 0 10 13 22 23
4 0 10 19 22 23
4 0 10 19 20 23
4 0 10 11 20 23
4 0 10 11 14 23
4 0 12 15 16 25
4 0 12 15 24 25
4 0 12 21 24 25
4 0 12 21 22 25
4 0 12 13 22 25
4 0 12 13 16 25
4 0 13 16 17 26
4 0 13 16 25 26
4 0 13 22 25 26
4 0 13 22 23 26
4 0 13 14 23 26
4 0 13 14 17 26
FACES:
3 1 0 3 4
3 1 0 4 1
3 330 18 21 22
3 330 18 22 19
3 1 1 4 5
3 1 1 5 2
3 330 19 22 23
3 330 19 23 20
3 1 3 6 7
3 1 3 7 4
3 330 21 24 25
3 330 21 25 22
3 1 4 7 8
3 1 4 8 5
3 330 22 25 26
3 330 22 26 23
3 330 14 11 2
3 330 14 2 5
3 1 12 9 0
3 1 12 0 3
3 330 17 14 5
3 330 17 5 8
3 1 15 12 3
3 1 15 3 6
3 330 23 20 11
3 330 23 11 14
3 1 21 18 9
3 1 21 9 12
3 330 26 23 14
3 330 26 14 17
3 1 24 21 12
3 1 24 12 15
3 1 0 9 10
3 1 0 10 1
3 330 6 15 16
3 330 6 16 7
3 1 1 10 11
3 1 1 11 2
3 330 7 16 17
3 330 7 17 8
3 1 9 18 19
3 1 9 19 10
3 330 15 24 25
3 330 15 25 16
3 1 10 19 20
3 1 10 20 11
3 330 16 25 26
3 330 16 26 17
VDATA:
3 -10 0 0
3 -10 0 0
3 -10 0 0
3 -10 0 0
3 -10 0 0
3 -10 0 0
3 -10 0 0
3 -10 0 0
3 -10 0 0
3 -10 0 0
3 -10 0 0
3 -10 0 0
3 -10 0 0
3 -10 0 0
3 -10 0 0
3 -10 0 0
3 -10 0 0
3 -10 0 0
3 -10 0 0
3 -10 0 0
3 -10 0 0
3 -10 0 0
3 -10 0 0
3 -10 0 0
3 -10 0 0
3 -10 0 0
3 -10 0 0
CDATA:
9 1 0 0 0 1 0 0 0 1
9 1 0 0 0 1 0 0 0 1
9 1 0 0 0 1 0 0 0 1
9 1 0 0 0 1 0 0 0 1
9 1 0 0 0 1 0 0 0 1
9 1 0 0 0 1 0 0 0 1
9 1 0 0 0 1 0 0 0 1
9 1 0 0 0 1 0 0 0 1
9 1 0 0 0 1 0 0 0 1
9 1 0 0 0 1 0 0 0 1
9 1 0 0 0 1 0 0 0 1
9 1 0 0 0 1 0 0 0 1
9 1 0 0 0 1 0 0 0 1
9 1 0 0 0 1 0 0 0 1
9 1 0 0 0 1 0 0 0 1
9 1 0 0 0 1 0 0 0 1
9 1 0 0 0 1 0 0 0 1
9 1 0 0 0 1 0 0 0 1
9 1 0 0 0 1 0 0 0 1
9 1 0 0 0 1 0 0 0 1
9 1 0 0 0 1 0 0 0 1
9 1 0 0 0 1 0 0 0 1
9 1 0 0 0 1 0 0 0 1
9 1 0 0 0 1 0 0 0 1
9 1 0 0 0 1 0 0 0 1
9 1 0 0 0 1 0 0 0 1
9 1 0 0 0 1 0 0 0 1
9 1 0 0 0 1 0 0 0 1
9 1 0 0 0 1 0 0 0 1
9 1 0 0 0 1 0 0 0 1
9 1 0 0 0 1 0 0 0 1
9 1 0 0 0 1 0 0 0 1
9 1 0 0 0 1 0 0 0 1
9 1 0 0 0 1 0 0 0 1
9 1 0 0 0 1 0 0 0 1
9 1 0 0 0 1 0 0 0 1
9 1 0 0 0 1 0 0 0 1
9 1 0 0 0 1 0 0 0 1
9 1 0 0 0 1 0 0 0 1
9 1 0 0 0 1 0 0 0 1
9 1 0 0 0 1 0 0 0 1
9 1 0 0 0 1 0 0 0 1
9 1 0 0 0 1 0 0 0 1
9 1 0 0 0 1 0 0 0 1
9 1 0 0 0 1 0 0 0 1
9 1 0 0 0 1 0 0 0 1
9 1 0 0 0 1 0 0 0 1
9 1 0 0 0 1 0 0 0 1
