POINTS:
0.0 0.0
0.0 0.5
0.0 1.0
0.0 1.5
0.0 2.0
0.0 2.5
0.0 3.0
0.0 3.5
0.0 4.0
0.0 4.5
0.0 5.0
0.0 5.5
0.0 6.0
0.0 6.5
0.0 7.0
0.0 7.5
0.0 8.0
0.0 8.5
0.0 9.0
0.0 9.5
0.0 10.0
0.0 10.5
0.0 11.0
0.0 11.5
0.0 12.0
0.0 12.5
0.0 13.0
0.0 13.5
0.0 14.0
0.0 14.5
0.0 15.0
0.0 15.5
0.0 16.0
0.5 0.0
0.5 0.5
0.5 1.0
0.5 1.5
0.5 2.0
0.5 2.5
0.5 3.0
0.5 3.5
0.5 4.0
0.5 4.5
0.5 5.0
0.5 5.5
0.5 6.0
0.5 6.5
0.5 7.0
0.5 7.5
0.5 8.0
0.5 8.5
0.5 9.0
0.5 9.5
0.5 10.0
0.5 10.5
0.5 11.0
0.5 11.5
0.5 12.0
0.5 12.5
0.5 13.0
0.5 13.5
0.5 14.0
0.5 14.5
0.5 15.0
0.5 15.5
0.5 16.0
1.0 0.0
1.0 0.5
1.0 1.0
1.0 1.5
1.0 2.0
1.0 2.5
1.0 3.0
1.0 3.5
1.0 4.0
1.0 4.5
1.0 5.0
1.0 5.5
1.0 6.0
1.0 6.5
1.0 7.0
1.0 7.5
1.0 8.0
1.0 8.5
1.0 9.0
1.0 9.5
1.0 10.0
1.0 10.5
1.0 11.0
1.0 11.5
1.0 12.0
1.0 12.5
1.0 13.0
1.0 13.5
1.0 14.0
1.0 14.5
1.0 15.0
1.0 15.5
1.0 16.0
1.5 0.0
1.5 0.5
1.5 1.0
1.5 1.5
1.5 2.0
1.5 2.5
1.5 3.0
1.5 3.5
1.5 4.0
1.5 4.5
1.5 5.0
1.5 5.5
1.5 6.0
1.5 6.5
1.5 7.0
1.5 7.5
1.5 8.0
1.5 8.5
1.5 9.0
1.5 9.5
1.5 10.0
1.5 10.5
1.5 11.0
1.5 11.5
1.5 12.0
1.5 12.5
1.5 13.0
1.5 13.5
1.5 14.0
1.5 14.5
1.5 15.0
1.5 15.5
1.5 16.0
2.0 0.0
2.0 0.5
2.0 1.0
2.0 1.5
2.0 2.0
2.0 2.5
2.0 3.0
2.0 3.5
2.0 4.0
2.0 4.5
2.0 5.0
2.0 5.5
2.0 6.0
2.0 6.5
2.0 7.0
2.0 7.5
2.0 8.0
2.0 8.5
2.0 9.0
2.0 9.5
2.0 10.0
2.0 10.5
2.0 11.0
2.0 11.5
2.0 12.0
2.0 12.5
2.0 13.0
2.0 13.5
2.0 14.0
2.0 14.5
2.0 15.0
2.0 15.5
2.0 16.0
2.5 0.0
2.5 0.5
2.5 1.0
2.5 1.5
2.5 2.0
2.5 2.5
2.5 3.0
2.5 3.5
2.5 4.0
2.5 4.5
2.5 5.0
2.5 5.5
2.5 6.0
2.5 6.5
2.5 7.0
2.5 7.5
2.5 8.0
2.5 8.5
2.5 9.0
2.5 9.5
2.5 10.0
2.5 10.5
2.5 11.0
2.5 11.5
2.5 12.0
2.5 12.5
2.5 13.0
2.5 13.5
2.5 14.0
2.5 14.5
2.5 15.0
2.5 15.5
2.5 16.0
3.0 0.0
3.0 0.5
3.0 1.0
3.0 1.5
3.0 2.0
3.0 2.5
3.0 3.0
3.0 3.5
3.0 4.0
3.0 4.5
3.0 5.0
3.0 5.5
3.0 6.0
3.0 6.5
3.0 7.0
3.0 7.5
3.0 8.0
3.0 8.5
3.0 9.0
3.0 9.5
3.0 10.0
3.0 10.5
3.0 11.0
3.0 11.5
3.0 12.0
3.0 12.5
3.0 13.0
3.0 13.5
3.0 14.0
3.0 14.5
3.0 15.0
3.0 15.5
3.0 16.0
3.5 0.0
3.5 0.5
3.5 1.0
3.5 1.5
3.5 2.0
3.5 2.5
3.5 3.0
3.5 3.5
3.5 4.0
3.5 4.5
3.5 5.0
3.5 5.5
3.5 6.0
3.5 6.5
3.5 7.0
3.5 7.5
3.5 8.0
3.5 8.5
3.5 9.0
3.5 9.5
3.5 10.0
3.5 10.5
3.5 11.0
3.5 11.5
3.5 12.0
3.5 12.5
3.5 13.0
3.5 13.5
3.5 14.0
3.5 14.5
3.5 15.0
3.5 15.5
3.5 16.0
4.0 0.0
4.0 0.5
4.0 1.0
4.0 1.5
4.0 2.0
4.0 2.5
4.0 3.0
4.0 3.5
4.0 4.0
4.0 4.5
4.0 5.0
4.0 5.5
4.0 6.0
4.0 6.5
4.0 7.0
4.0 7.5
4.0 8.0
4.0 8.5
4.0 9.0
4.0 9.5
4.0 10.0
4.0 10.5
4.0 11.0
4.0 11.5
4.0 12.0
4.0 12.5
4.0 13.0
4.0 13.5
4.0 14.0
4.0 14.5
4.0 15.0
4.0 15.5
4.0 16.0
4.5 0.0
4.5 0.5
4.5 1.0
4.5 1.5
4.5 2.0
4.5 2.5
4.5 3.0
4.5 3.5
4.5 4.0
4.5 4.5
4.5 5.0
4.5 5.5
4.5 6.0
4.5 6.5
4.5 7.0
4.5 7.5
4.5 8.0
4.5 8.5
4.5 9.0
4.5 9.5
4.5 10.0
4.5 10.5
4.5 11.0
4.5 11.5
4.5 12.0
4.5 12.5
4.5 13.0
4.5 13.5
4.5 14.0
4.5 14.5
4.5 15.0
4.5 15.5
4.5 16.0
5.0 0.0
5.0 0.5
5.0 1.0
5.0 1.5
5.0 2.0
5.0 2.5
5.0 3.0
5.0 3.5
5.0 4.0
5.0 4.5
5.0 5.0
5.0 5.5
5.0 6.0
5.0 6.5
5.0 7.0
5.0 7.5
5.0 8.0
5.0 8.5
5.0 9.0
5.0 9.5
5.0 10.0
5.0 10.5
5.0 11.0
5.0 11.5
5.0 12.0
5.0 12.5
5.0 13.0
5.0 13.5
5.0 14.0
5.0 14.5
5.0 15.0
5.0 15.5
5.0 16.0
5.5 0.0
5.5 0.5
5.5 1.0
5.5 1.5
5.5 2.0
5.5 2.5
5.5 3.0
5.5 3.5
5.5 4.0
5.5 4.5
5.5 5.0
5.5 5.5
5.5 6.0
5.5 6.5
5.5 7.0
5.5 7.5
5.5 8.0
5.5 8.5
5.5 9.0
5.5 9.5
5.5 10.0
5.5 10.5
5.5 11.0
5.5 11.5
5.5 12.0
5.5 12.5
5.5 13.0
5.5 13.5
5.5 14.0
5.5 14.5
5.5 15.0
5.5 15.5
5.5 16.0
6.0 0.0
6.0 0.5
6.0 1.0
6.0 1.5
6.0 2.0
6.0 2.5
6.0 3.0
6.0 3.5
6.0 4.0
6.0 4.5
6.0 5.0
6.0 5.5
6.0 6.0
6.0 6.5
6.0 7.0
6.0 7.5
6.0 8.0
6.0 8.5
6.0 9.0
6.0 9.5
6.0 10.0
6.0 10.5
6.0 11.0
6.0 11.5
6.0 12.0
6.0 12.5
6.0 13.0
6.0 13.5
6.0 14.0
6.0 14.5
6.0 15.0
6.0 15.5
6.0 16.0
6.5 0.0
6.5 0.5
6.5 1.0
6.5 1.5
6.5 2.0
6.5 2.5
6.5 3.0
6.5 3.5
6.5 4.0
6.5 4.5
6.5 5.0
6.5 5.5
6.5 6.0
6.5 6.5
6.5 7.0
6.5 7.5
6.5 8.0
6.5 8.5
6.5 9.0
6.5 9.5
6.5 10.0
6.5 10.5
6.5 11.0
6.5 11.5
6.5 12.0
6.5 12.5
6.5 13.0
6.5 13.5
6.5 14.0
6.5 14.5
6.5 15.0
6.5 15.5
6.5 16.0
7.0 0.0
7.0 0.5
7.0 1.0
7.0 1.5
7.0 2.0
7.0 2.5
7.0 3.0
7.0 3.5
7.0 4.0
7.0 4.5
7.0 5.0
7.0 5.5
7.0 6.0
7.0 6.5
7.0 7.0
7.0 7.5
7.0 8.0
7.0 8.5
7.0 9.0
7.0 9.5
7.0 10.0
7.0 10.5
7.0 11.0
7.0 11.5
7.0 12.0
7.0 12.5
7.0 13.0
7.0 13.5
7.0 14.0
7.0 14.5
7.0 15.0
7.0 15.5
7.0 16.0
7.5 0.0
7.5 0.5
7.5 1.0
7.5 1.5
7.5 2.0
7.5 2.5
7.5 3.0
7.5 3.5
7.5 4.0
7.5 4.5
7.5 5.0
7.5 5.5
7.5 6.0
7.5 6.5
7.5 7.0
7.5 7.5
7.5 8.0
7.5 8.5
7.5 9.0
7.5 9.5
7.5 10.0
7.5 10.5
7.5 11.0
7.5 11.5
7.5 12.0
7.5 12.5
7.5 13.0
7.5 13.5
7.5 14.0
7.5 14.5
7.5 15.0
7.5 15.5
7.5 16.0
8.0 0.0
8.0 0.5
8.0 1.0
8.0 1.5
8.0 2.0
8.0 2.5
8.0 3.0
8.0 3.5
8.0 4.0
8.0 4.5
8.0 5.0
8.0 5.5
8.0 6.0
8.0 6.5
8.0 7.0
8.0 7.5
8.0 8.0
8.0 8.5
8.0 9.0
8.0 9.5
8.0 10.0
8.0 10.5
8.0 11.0
8.0 11.5
8.0 12.0
8.0 12.5
8.0 13.0
8.0 13.5
8.0 14.0
8.0 14.5
8.0 15.0
8.0 15.5
8.0 16.0
8.5 0.0
8.5 0.5
8.5 1.0
8.5 1.5
8.5 2.0
8.5 2.5
8.5 3.0
8.5 3.5
8.5 4.0
8.5 4.5
8.5 5.0
8.5 5.5
8.5 6.0
8.5 6.5
8.5 7.0
8.5 7.5
8.5 8.0
8.5 8.5
8.5 9.0
8.5 9.5
8.5 10.0
8.5 10.5
8.5 11.0
8.5 11.5
8.5 12.0
8.5 12.5
8.5 13.0
8.5 13.5
8.5 14.0
8.5 14.5
8.5 15.0
8.5 15.5
8.5 16.0
9.0 0.0
9.0 0.5
9.0 1.0
9.0 1.5
9.0 2.0
9.0 2.5
9.0 3.0
9.0 3.5
9.0 4.0
9.0 4.5
9.0 5.0
9.0 5.5
9.0 6.0
9.0 6.5
9.0 7.0
9.0 7.5
9.0 8.0
9.0 8.5
9.0 9.0
9.0 9.5
9.0 10.0
9.0 10.5
9.0 11.0
9.0 11.5
9.0 12.0
9.0 12.5
9.0 13.0
9.0 13.5
9.0 14.0
9.0 14.5
9.0 15.0
9.0 15.5
9.0 16.0
9.5 0.0
9.5 0.5
9.5 1.0
9.5 1.5
9.5 2.0
9.5 2.5
9.5 3.0
9.5 3.5
9.5 4.0
9.5 4.5
9.5 5.0
9.5 5.5
9.5 6.0
9.5 6.5
9.5 7.0
9.5 7.5
9.5 8.0
9.5 8.5
9.5 9.0
9.5 9.5
9.5 10.0
9.5 10.5
9.5 11.0
9.5 11.5
9.5 12.0
9.5 12.5
9.5 13.0
9.5 13.5
9.5 14.0
9.5 14.5
9.5 15.0
9.5 15.5
9.5 16.0
10.0 0.0
10.0 0.5
10.0 1.0
10.0 1.5
10.0 2.0
10.0 2.5
10.0 3.0
10.0 3.5
10.0 4.0
10.0 4.5
10.0 5.0
10.0 5.5
10.0 6.0
10.0 6.5
10.0 7.0
10.0 7.5
10.0 8.0
10.0 8.5
10.0 9.0
10.0 9.5
10.0 10.0
10.0 10.5
10.0 11.0
10.0 11.5
10.0 12.0
10.0 12.5
10.0 13.0
10.0 13.5
10.0 14.0
10.0 14.5
10.0 15.0
10.0 15.5
10.0 16.0
10.5 0.0
10.5 0.5
10.5 1.0
10.5 1.5
10.5 2.0
10.5 2.5
10.5 3.0
10.5 3.5
10.5 4.0
10.5 4.5
10.5 5.0
10.5 5.5
10.5 6.0
10.5 6.5
10.5 7.0
10.5 7.5
10.5 8.0
10.5 8.5
10.5 9.0
10.5 9.5
10.5 10.0
10.5 10.5
10.5 11.0
10.5 11.5
10.5 12.0
10.5 12.5
10.5 13.0
10.5 13.5
10.5 14.0
10.5 14.5
10.5 15.0
10.5 15.5
10.5 16.0
11.0 0.0
11.0 0.5
11.0 1.0
11.0 1.5
11.0 2.0
11.0 2.5
11.0 3.0
11.0 3.5
11.0 4.0
11.0 4.5
11.0 5.0
11.0 5.5
11.0 6.0
11.0 6.5
11.0 7.0
11.0 7.5
11.0 8.0
11.0 8.5
11.0 9.0
11.0 9.5
11.0 10.0
11.0 10.5
11.0 11.0
11.0 11.5
11.0 12.0
11.0 12.5
11.0 13.0
11.0 13.5
11.0 14.0
11.0 14.5
11.0 15.0
11.0 15.5
11.0 16.0
11.5 0.0
11.5 0.5
11.5 1.0
11.5 1.5
11.5 2.0
11.5 2.5
11.5 3.0
11.5 3.5
11.5 4.0
11.5 4.5
11.5 5.0
11.5 5.5
11.5 6.0
11.5 6.5
11.5 7.0
11.5 7.5
11.5 8.0
11.5 8.5
11.5 9.0
11.5 9.5
11.5 10.0
11.5 10.5
11.5 11.0
11.5 11.5
11.5 12.0
11.5 12.5
11.5 13.0
11.5 13.5
11.5 14.0
11.5 14.5
11.5 15.0
11.5 15.5
11.5 16.0
12.0 0.0
12.0 0.5
12.0 1.0
12.0 1.5
12.0 2.0
12.0 2.5
12.0 3.0
12.0 3.5
12.0 4.0
12.0 4.5
12.0 5.0
12.0 5.5
12.0 6.0
12.0 6.5
12.0 7.0
12.0 7.5
12.0 8.0
12.0 8.5
12.0 9.0
12.0 9.5
12.0 10.0
12.0 10.5
12.0 11.0
12.0 11.5
12.0 12.0
12.0 12.5
12.0 13.0
12.0 13.5
12.0 14.0
12.0 14.5
12.0 15.0
12.0 15.5
12.0 16.0
12.5 0.0
12.5 0.5
12.5 1.0
12.5 1.5
12.5 2.0
12.5 2.5
12.5 3.0
12.5 3.5
12.5 4.0
12.5 4.5
12.5 5.0
12.5 5.5
12.5 6.0
12.5 6.5
12.5 7.0
12.5 7.5
12.5 8.0
12.5 8.5
12.5 9.0
12.5 9.5
12.5 10.0
12.5 10.5
12.5 11.0
12.5 11.5
12.5 12.0
12.5 12.5
12.5 13.0
12.5 13.5
12.5 14.0
12.5 14.5
12.5 15.0
12.5 15.5
12.5 16.0
13.0 0.0
13.0 0.5
13.0 1.0
13.0 1.5
13.0 2.0
13.0 2.5
13.0 3.0
13.0 3.5
13.0 4.0
13.0 4.5
13.0 5.0
13.0 5.5
13.0 6.0
13.0 6.5
13.0 7.0
13.0 7.5
13.0 8.0
13.0 8.5
13.0 9.0
13.0 9.5
13.0 10.0
13.0 10.5
13.0 11.0
13.0 11.5
13.0 12.0
13.0 12.5
13.0 13.0
13.0 13.5
13.0 14.0
13.0 14.5
13.0 15.0
13.0 15.5
13.0 16.0
13.5 0.0
13.5 0.5
13.5 1.0
13.5 1.5
13.5 2.0
13.5 2.5
13.5 3.0
13.5 3.5
13.5 4.0
13.5 4.5
13.5 5.0
13.5 5.5
13.5 6.0
13.5 6.5
13.5 7.0
13.5 7.5
13.5 8.0
13.5 8.5
13.5 9.0
13.5 9.5
13.5 10.0
13.5 10.5
13.5 11.0
13.5 11.5
13.5 12.0
13.5 12.5
13.5 13.0
13.5 13.5
13.5 14.0
13.5 14.5
13.5 15.0
13.5 15.5
13.5 16.0
14.0 0.0
14.0 0.5
14.0 1.0
14.0 1.5
14.0 2.0
14.0 2.5
14.0 3.0
14.0 3.5
14.0 4.0
14.0 4.5
14.0 5.0
14.0 5.5
14.0 6.0
14.0 6.5
14.0 7.0
14.0 7.5
14.0 8.0
14.0 8.5
14.0 9.0
14.0 9.5
14.0 10.0
14.0 10.5
14.0 11.0
14.0 11.5
14.0 12.0
14.0 12.5
14.0 13.0
14.0 13.5
14.0 14.0
14.0 14.5
14.0 15.0
14.0 15.5
14.0 16.0
14.5 0.0
14.5 0.5
14.5 1.0
14.5 1.5
14.5 2.0
14.5 2.5
14.5 3.0
14.5 3.5
14.5 4.0
14.5 4.5
14.5 5.0
14.5 5.5
14.5 6.0
14.5 6.5
14.5 7.0
14.5 7.5
14.5 8.0
14.5 8.5
14.5 9.0
14.5 9.5
14.5 10.0
14.5 10.5
14.5 11.0
14.5 11.5
14.5 12.0
14.5 12.5
14.5 13.0
14.5 13.5
14.5 14.0
14.5 14.5
14.5 15.0
14.5 15.5
14.5 16.0
15.0 0.0
15.0 0.5
15.0 1.0
15.0 1.5
15.0 2.0
15.0 2.5
15.0 3.0
15.0 3.5
15.0 4.0
15.0 4.5
15.0 5.0
15.0 5.5
15.0 6.0
15.0 6.5
15.0 7.0
15.0 7.5
15.0 8.0
15.0 8.5
15.0 9.0
15.0 9.5
15.0 10.0
15.0 10.5
15.0 11.0
15.0 11.5
15.0 12.0
15.0 12.5
15.0 13.0
15.0 13.5
15.0 14.0
15.0 14.5
15.0 15.0
15.0 15.5
15.0 16.0
15.5 0.0
15.5 0.5
15.5 1.0
15.5 1.5
15.5 2.0
15.5 2.5
15.5 3.0
15.5 3.5
15.5 4.0
15.5 4.5
15.5 5.0
15.5 5.5
15.5 6.0
15.5 6.5
15.5 7.0
15.5 7.5
15.5 8.0
15.5 8.5
15.5 9.0
15.5 9.5
15.5 10.0
15.5 10.5
15.5 11.0
15.5 11.5
15.5 12.0
15.5 12.5
15.5 13.0
15.5 13.5
15.5 14.0
15.5 14.5
15.5 15.0
15.5 15.5
15.5 16.0
16.0 0.0
16.0 0.5
16.0 1.0
16.0 1.5
16.0 2.0
16.0 2.5
16.0 3.0
16.0 3.5
16.0 4.0
16.0 4.5
16.0 5.0
16.0 5.5
16.0 6.0
16.0 6.5
16.0 7.0
16.0 7.5
16.0 8.0
16.0 8.5
16.0 9.0
16.0 9.5
16.0 10.0
16.0 10.5
16.0 11.0
16.0 11.5
16.0 12.0
16.0 12.5
16.0 13.0
16.0 13.5
16.0 14.0
16.0 14.5
16.0 15.0
16.0 15.5
16.0 16.0
16.5 0.0
16.5 0.5
16.5 1.0
16.5 1.5
16.5 2.0
16.5 2.5
16.5 3.0
16.5 3.5
16.5 4.0
16.5 4.5
16.5 5.0
16.5 5.5
16.5 6.0
16.5 6.5
16.5 7.0
16.5 7.5
16.5 8.0
16.5 8.5
16.5 9.0
16.5 9.5
16.5 10.0
16.5 10.5
16.5 11.0
16.5 11.5
16.5 12.0
16.5 12.5
16.5 13.0
16.5 13.5
16.5 14.0
16.5 14.5
16.5 15.0
16.5 15.5
16.5 16.0
17.0 0.0
17.0 0.5
17.0 1.0
17.0 1.5
17.0 2.0
17.0 2.5
17.0 3.0
17.0 3.5
17.0 4.0
17.0 4.5
17.0 5.0
17.0 5.5
17.0 6.0
17.0 6.5
17.0 7.0
17.0 7.5
17.0 8.0
17.0 8.5
17.0 9.0
17.0 9.5
17.0 10.0
17.0 10.5
17.0 11.0
17.0 11.5
17.0 12.0
17.0 12.5
17.0 13.0
17.0 13.5
17.0 14.0
17.0 14.5
17.0 15.0
17.0 15.5
17.0 16.0
17.5 0.0
17.5 0.5
17.5 1.0
17.5 1.5
17.5 2.0
17.5 2.5
17.5 3.0
17.5 3.5
17.5 4.0
17.5 4.5
17.5 5.0
17.5 5.5
17.5 6.0
17.5 6.5
17.5 7.0
17.5 7.5
17.5 8.0
17.5 8.5
17.5 9.0
17.5 9.5
17.5 10.0
17.5 10.5
17.5 11.0
17.5 11.5
17.5 12.0
17.5 12.5
17.5 13.0
17.5 13.5
17.5 14.0
17.5 14.5
17.5 15.0
17.5 15.5
17.5 16.0
18.0 0.0
18.0 0.5
18.0 1.0
18.0 1.5
18.0 2.0
18.0 2.5
18.0 3.0
18.0 3.5
18.0 4.0
18.0 4.5
18.0 5.0
18.0 5.5
18.0 6.0
18.0 6.5
18.0 7.0
18.0 7.5
18.0 8.0
18.0 8.5
18.0 9.0
18.0 9.5
18.0 10.0
18.0 10.5
18.0 11.0
18.0 11.5
18.0 12.0
18.0 12.5
18.0 13.0
18.0 13.5
18.0 14.0
18.0 14.5
18.0 15.0
18.0 15.5
18.0 16.0
18.5 0.0
18.5 0.5
18.5 1.0
18.5 1.5
18.5 2.0
18.5 2.5
18.5 3.0
18.5 3.5
18.5 4.0
18.5 4.5
18.5 5.0
18.5 5.5
18.5 6.0
18.5 6.5
18.5 7.0
18.5 7.5
18.5 8.0
18.5 8.5
18.5 9.0
18.5 9.5
18.5 10.0
18.5 10.5
18.5 11.0
18.5 11.5
18.5 12.0
18.5 12.5
18.5 13.0
18.5 13.5
18.5 14.0
18.5 14.5
18.5 15.0
18.5 15.5
18.5 16.0
19.0 0.0
19.0 0.5
19.0 1.0
19.0 1.5
19.0 2.0
19.0 2.5
19.0 3.0
19.0 3.5
19.0 4.0
19.0 4.5
19.0 5.0
19.0 5.5
19.0 6.0
19.0 6.5
19.0 7.0
19.0 7.5
19.0 8.0
19.0 8.5
19.0 9.0
19.0 9.5
19.0 10.0
19.0 10.5
19.0 11.0
19.0 11.5
19.0 12.0
19.0 12.5
19.0 13.0
19.0 13.5
19.0 14.0
19.0 14.5
19.0 15.0
19.0 15.5
19.0 16.0
19.5 0.0
19.5 0.5
19.5 1.0
19.5 1.5
19.5 2.0
19.5 2.5
19.5 3.0
19.5 3.5
19.5 4.0
19.5 4.5
19.5 5.0
19.5 5.5
19.5 6.0
19.5 6.5
19.5 7.0
19.5 7.5
19.5 8.0
19.5 8.5
19.5 9.0
19.5 9.5
19.5 10.0
19.5 10.5
19.5 11.0
19.5 11.5
19.5 12.0
19.5 12.5
19.5 13.0
19.5 13.5
19.5 14.0
19.5 14.5
19.5 15.0
19.5 15.5
19.5 16.0
20.0 0.0
20.0 0.5
20.0 1.0
20.0 1.5
20.0 2.0
20.0 2.5
20.0 3.0
20.0 3.5
20.0 4.0
20.0 4.5
20.0 5.0
20.0 5.5
20.0 6.0
20.0 6.5
20.0 7.0
20.0 7.5
20.0 8.0
20.0 8.5
20.0 9.0
20.0 9.5
20.0 10.0
20.0 10.5
20.0 11.0
20.0 11.5
20.0 12.0
20.0 12.5
20.0 13.0
20.0 13.5
20.0 14.0
20.0 14.5
20.0 15.0
20.0 15.5
20.0 16.0
CELLS:
4 0 0 33 34 1
4 0 1 34 35 2
4 0 2 35 36 3
4 0 3 36 37 4
4 0 4 37 38 5
4 0 5 38 39 6
4 0 6 39 40 7
4 0 7 40 41 8
4 0 8 41 42 9
4 0 9 42 43 10
4 0 10 43 44 11
4 0 11 44 45 12
4 0 12 45 46 13
4 0 13 46 47 14
4 0 14 47 48 15
4 0 15 48 49 16
4 0 16 49 50 17
4 0 17 50 51 18
4 0 18 51 52 19
4 0 19 52 53 20
4 0 20 53 54 21
4 0 21 54 55 22
4 0 22 55 56 23
4 0 23 56 57 24
4 0 24 57 58 25
4 0 25 58 59 26
4 0 26 59 60 27
4 0 27 60 61 28
4 0 28 61 62 29
4 0 29 62 63 30
4 0 30 63 64 31
4 0 31 64 65 32
4 0 33 66 67 34
4 0 34 67 68 35
4 0 35 68 69 36
4 0 36 69 70 37
4 0 37 70 71 38
4 0 38 71 72 39
4 0 39 72 73 40
4 0 40 73 74 41
4 0 41 74 75 42
4 0 42 75 76 43
4 0 43 76 77 44
4 0 44 77 78 45
4 0 45 78 79 46
4 0 46 79 80 47
4 0 47 80 81 48
4 0 48 81 82 49
4 0 49 82 83 50
4 0 50 83 84 51
4 0 51 84 85 52
4 0 52 85 86 53
4 0 53 86 87 54
4 0 54 87 88 55
4 0 55 88 89 56
4 0 56 89 90 57
4 0 57 90 91 58
4 0 58 91 92 59
4 0 59 92 93 60
4 0 60 93 94 61
4 0 61 94 95 62
4 0 62 95 96 63
4 0 63 96 97 64
4 0 64 97 98 65
4 0 66 99 100 67
4 0 67 100 101 68
4 0 68 101 102 69
4 0 69 102 103 70
4 0 70 103 104 71
4 0 71 104 105 72
4 0 72 105 106 73
4 0 73 106 107 74
4 0 74 107 108 75
4 0 75 108 109 76
4 0 76 109 110 77
4 0 77 110 111 78
4 0 78 111 112 79
4 0 79 112 113 80
4 0 80 113 114 81
4 0 81 114 115 82
4 0 82 115 116 83
4 0 83 116 117 84
4 0 84 117 118 85
4 0 85 118 119 86
4 0 86 119 120 87
4 0 87 120 121 88
4 0 88 121 122 89
4 0 89 122 123 90
4 0 90 123 124 91
4 0 91 124 125 92
4 0 92 125 126 93
4 0 93 126 127 94
4 0 94 127 128 95
4 0 95 128 129 96
4 0 96 129 130 97
4 0 97 130 131 98
4 0 99 132 133 100
4 0 100 133 134 101
4 0 101 134 135 102
4 0 102 135 136 103
4 0 103 136 137 104
4 0 104 137 138 105
4 0 105 138 139 106
4 0 106 139 140 107
4 0 107 140 141 108
4 0 108 141 142 109
4 0 109 142 143 110
4 0 110 143 144 111
4 0 111 144 145 112
4 0 112 145 146 113
4 0 113 146 147 114
4 0 114 147 148 115
4 0 115 148 149 116
4 0 116 149 150 117
4 0 117 150 151 118
4 0 118 151 152 119
4 0 119 152 153 120
4 0 120 153 154 121
4 0 121 154 155 122
4 0 122 155 156 123
4 0 123 156 157 124
4 0 124 157 158 125
4 0 125 158 159 126
4 0 126 159 160 127
4 0 127 160 161 128
4 0 128 161 162 129
4 0 129 162 163 130
4 0 130 163 164 131
4 0 132 165 166 133
4 0 133 166 167 134
4 0 134 167 168 135
4 0 135 168 169 136
4 0 136 169 170 137
4 0 137 170 171 138
4 0 138 171 172 139
4 0 139 172 173 140
4 0 140 173 174 141
4 0 141 174 175 142
4 0 142 175 176 143
4 0 143 176 177 144
4 0 144 177 178 145
4 0 145 178 179 146
4 0 146 179 180 147
4 0 147 180 181 148
4 0 148 181 182 149
4 0 149 182 183 150
4 0 150 183 184 151
4 0 151 184 185 152
4 0 152 185 186 153
4 0 153 186 187 154
4 0 154 187 188 155
4 0 155 188 189 156
4 0 156 189 190 157
4 0 157 190 191 158
4 0 158 191 192 159
4 0 159 192 193 160
4 0 160 193 194 161
4 0 161 194 195 162
4 0 162 195 196 163
4 0 163 196 197 164
4 0 165 198 199 166
4 0 166 199 200 167
4 0 167 200 201 168
4 0 168 201 202 169
4 0 169 202 203 170
4 0 170 203 204 171
4 0 171 204 205 172
4 0 172 205 206 173
4 0 173 206 207 174
4 0 174 207 208 175
4 0 175 208 209 176
4 0 176 209 210 177
4 0 177 210 211 178
4 0 178 211 212 179
4 0 179 212 213 180
4 0 180 213 214 181
4 0 181 214 215 182
4 0 182 215 216 183
4 0 183 216 217 184
4 0 184 217 218 185
4 0 185 218 219 186
4 0 186 219 220 187
4 0 187 220 221 188
4 0 188 221 222 189
4 0 189 222 223 190
4 0 190 223 224 191
4 0 191 224 225 192
4 0 192 225 226 193
4 0 193 226 227 194
4 0 194 227 228 195
4 0 195 228 229 196
4 0 196 229 230 197
4 0 198 231 232 199
4 0 199 232 233 200
4 0 200 233 234 201
4 0 201 234 235 202
4 0 202 235 236 203
4 0 203 236 237 204
4 0 204 237 238 205
4 0 205 238 239 206
4 0 206 239 240 207
4 0 207 240 241 208
4 0 208 241 242 209
4 0 209 242 243 210
4 0 210 243 244 211
4 0 211 244 245 212
4 0 212 245 246 213
4 0 213 246 247 214
4 0 214 247 248 215
4 0 215 248 249 216
4 0 216 249 250 217
4 0 217 250 251 218
4 0 218 251 252 219
4 0 219 252 253 220
4 0 220 253 254 221
4 0 221 254 255 222
4 0 222 255 256 223
4 0 223 256 257 224
4 0 224 257 258 225
4 0 225 258 259 226
4 0 226 259 260 227
4 0 227 260 261 228
4 0 228 261 262 229
4 0 229 262 263 230
4 0 231 264 265 232
4 0 232 265 266 233
4 0 233 266 267 234
4 0 234 267 268 235
4 0 235 268 269 236
4 0 236 269 270 237
4 0 237 270 271 238
4 0 238 271 272 239
4 0 239 272 273 240
4 0 240 273 274 241
4 0 241 274 275 242
4 0 242 275 276 243
4 0 243 276 277 244
4 0 244 277 278 245
4 0 245 278 279 246
4 0 246 279 280 247
4 0 247 280 281 248
4 0 248 281 282 249
4 0 249 282 283 250
4 0 250 283 284 251
4 0 251 284 285 252
4 0 252 285 286 253
4 0 253 286 287 254
4 0 254 287 288 255
4 0 255 288 289 256
4 0 256 289 290 257
4 0 257 290 291 258
4 0 258 291 292 259
4 0 259 292 293 260
4 0 260 293 294 261
4 0 261 294 295 262
4 0 262 295 296 263
4 0 264 297 298 265
4 0 265 298 299 266
4 0 266 299 300 267
4 0 267 300 301 268
4 0 268 301 302 269
4 0 269 302 303 270
4 0 270 303 304 271
4 0 271 304 305 272
4 0 272 305 306 273
4 0 273 306 307 274
4 0 274 307 308 275
4 0 275 308 309 276
4 0 276 309 310 277
4 0 277 310 311 278
4 0 278 311 312 279
4 0 279 312 313 280
4 0 280 313 314 281
4 0 281 314 315 282
4 0 282 315 316 283
4 0 283 316 317 284
4 0 284 317 318 285
4 0 285 318 319 286
4 0 286 319 320 287
4 0 287 320 321 288
4 0 288 321 322 289
4 0 289 322 323 290
4 0 290 323 324 291
4 0 291 324 325 292
4 0 292 325 326 293
4 0 293 326 327 294
4 0 294 327 328 295
4 0 295 328 329 296
4 0 297 330 331 298
4 0 298 331 332 299
4 0 299 332 333 300
4 0 300 333 334 301
4 0 301 334 335 302
4 0 302 335 336 303
4 0 303 336 337 304
4 0 304 337 338 305
4 0 305 338 339 306
4 0 306 339 340 307
4 0 307 340 341 308
4 0 308 341 342 309
4 0 309 342 343 310
4 0 310 343 344 311
4 0 311 344 345 312
4 0 312 345 346 313
4 0 313 346 347 314
4 0 314 347 348 315
4 0 315 348 349 316
4 0 316 349 350 317
4 0 317 350 351 318
4 0 318 351 352 319
4 0 319 352 353 320
4 0 320 353 354 321
4 0 321 354 355 322
4 0 322 355 356 323
4 0 323 356 357 324
4 0 324 357 358 325
4 0 325 358 359 326
4 0 326 359 360 327
4 0 327 360 361 328
4 0 328 361 362 329
4 0 330 363 364 331
4 0 331 364 365 332
4 0 332 365 366 333
4 0 333 366 367 334
4 0 334 367 368 335
4 0 335 368 369 336
4 0 336 369 370 337
4 0 337 370 371 338
4 0 338 371 372 339
4 0 339 372 373 340
4 0 340 373 374 341
4 0 341 374 375 342
4 0 342 375 376 343
4 0 343 376 377 344
4 0 344 377 378 345
4 0 345 378 379 346
4 0 346 379 380 347
4 0 347 380 381 348
4 0 348 381 382 349
4 0 349 382 383 350
4 0 350 383 384 351
4 0 351 384 385 352
4 0 352 385 386 353
4 0 353 386 387 354
4 0 354 387 388 355
4 0 355 388 389 356
4 0 356 389 390 357
4 0 357 390 391 358
4 0 358 391 392 359
4 0 359 392 393 360
4 0 360 393 394 361
4 0 361 394 395 362
4 0 363 396 397 364
4 0 364 397 398 365
4 0 365 398 399 366
4 0 366 399 400 367
4 0 367 400 401 368
4 0 368 401 402 369
4 0 369 402 403 370
4 0 370 403 404 371
4 0 371 404 405 372
4 0 372 405 406 373
4 0 373 406 407 374
4 0 374 407 408 375
4 0 375 408 409 376
4 0 376 409 410 377
4 0 377 410 411 378
4 0 378 411 412 379
4 0 379 412 413 380
4 0 380 413 414 381
4 0 381 414 415 382
4 0 382 415 416 383
4 0 383 416 417 384
4 0 384 417 418 385
4 0 385 418 419 386
4 0 386 419 420 387
4 0 387 420 421 388
4 0 388 421 422 389
4 0 389 422 423 390
4 0 390 423 424 391
4 0 391 424 425 392
4 0 392 425 426 393
4 0 393 426 427 394
4 0 394 427 428 395
4 0 396 429 430 397
4 0 397 430 431 398
4 0 398 431 432 399
4 0 399 432 433 400
4 0 400 433 434 401
4 0 401 434 435 402
4 0 402 435 436 403
4 0 403 436 437 404
4 0 404 437 438 405
4 0 405 438 439 406
4 0 406 439 440 407
4 0 407 440 441 408
4 0 408 441 442 409
4 0 409 442 443 410
4 0 410 443 444 411
4 0 411 444 445 412
4 0 412 445 446 413
4 0 413 446 447 414
4 0 414 447 448 415
4 0 415 448 449 416
4 0 416 449 450 417
4 0 417 450 451 418
4 0 418 451 452 419
4 0 419 452 453 420
4 0 420 453 454 421
4 0 421 454 455 422
4 0 422 455 456 423
4 0 423 456 457 424
4 0 424 457 458 425
4 0 425 458 459 426
4 0 426 459 460 427
4 0 427 460 461 428
4 0 429 462 463 430
4 0 430 463 464 431
4 0 431 464 465 432
4 0 432 465 466 433
4 0 433 466 467 434
4 0 434 467 468 435
4 0 435 468 469 436
4 0 436 469 470 437
4 0 437 470 471 438
4 0 438 471 472 439
4 0 439 472 473 440
4 0 440 473 474 441
4 0 441 474 475 442
4 0 442 475 476 443
4 0 443 476 477 444
4 0 444 477 478 445
4 0 445 478 479 446
4 0 446 479 480 447
4 0 447 480 481 448
4 0 448 481 482 449
4 0 449 482 483 450
4 0 450 483 484 451
4 0 451 484 485 452
4 0 452 485 486 453
4 0 453 486 487 454
4 0 454 487 488 455
4 0 455 488 489 456
4 0 456 489 490 457
4 0 457 490 491 458
4 0 458 491 492 459
4 0 459 492 493 460
4 0 460 493 494 461
4 0 462 495 496 463
4 0 463 496 497 464
4 0 464 497 498 465
4 0 465 498 499 466
4 0 466 499 500 467
4 0 467 500 501 468
4 0 468 501 502 469
4 0 469 502 503 470
4 0 470 503 504 471
4 0 471 504 505 472
4 0 472 505 506 473
4 0 473 506 507 474
4 0 474 507 508 475
4 0 475 508 509 476
4 0 476 509 510 477
4 0 477 510 511 478
4 0 478 511 512 479
4 0 479 512 513 480
4 0 480 513 514 481
4 0 481 514 515 482
4 0 482 515 516 483
4 0 483 516 517 484
4 0 484 517 518 485
4 0 485 518 519 486
4 0 486 519 520 487
4 0 487 520 521 488
4 0 488 521 522 489
4 0 489 522 523 490
4 0 490 523 524 491
4 0 491 524 525 492
4 0 492 525 526 493
4 0 493 526 527 494
4 0 495 528 529 496
4 0 496 529 530 497
4 0 497 530 531 498
4 0 498 531 532 499
4 0 499 532 533 500
4 0 500 533 534 501
4 0 501 534 535 502
4 0 502 535 536 503
4 0 503 536 537 504
4 0 504 537 538 505
4 0 505 538 539 506
4 0 506 539 540 507
4 0 507 540 541 508
4 0 508 541 542 509
4 0 509 542 543 510
4 0 510 543 544 511
4 0 511 544 545 512
4 0 512 545 546 513
4 0 513 546 547 514
4 0 514 547 548 515
4 0 515 548 549 516
4 0 516 549 550 517
4 0 517 550 551 518
4 0 518 551 552 519
4 0 519 552 553 520
4 0 520 553 554 521
4 0 521 554 555 522
4 0 522 555 556 523
4 0 523 556 557 524
4 0 524 557 558 525
4 0 525 558 559 526
4 0 526 559 560 527
4 0 528 561 562 529
4 0 529 562 563 530
4 0 530 563 564 531
4 0 531 564 565 532
4 0 532 565 566 533
4 0 533 566 567 534
4 0 534 567 568 535
4 0 535 568 569 536
4 0 536 569 570 537
4 0 537 570 571 538
4 0 538 571 572 539
4 0 539 572 573 540
4 0 540 573 574 541
4 0 541 574 575 542
4 0 542 575 576 543
4 0 543 576 577 544
4 0 544 577 578 545
4 0 545 578 579 546
4 0 546 579 580 547
4 0 547 580 581 548
4 0 548 581 582 549
4 0 549 582 583 550
4 0 550 583 584 551
4 0 551 584 585 552
4 0 552 585 586 553
4 0 553 586 587 554
4 0 554 587 588 555
4 0 555 588 589 556
4 0 556 589 590 557
4 0 557 590 591 558
4 0 558 591 592 559
4 0 559 592 593 560
4 0 561 594 595 562
4 0 562 595 596 563
4 0 563 596 597 564
4 0 564 597 598 565
4 0 565 598 599 566
4 0 566 599 600 567
4 0 567 600 601 568
4 0 568 601 602 569
4 0 569 602 603 570
4 0 570 603 604 571
4 0 571 604 605 572
4 0 572 605 606 573
4 0 573 606 607 574
4 0 574 607 608 575
4 0 575 608 609 576
4 0 576 609 610 577
4 0 577 610 611 578
4 0 578 611 612 579
4 0 579 612 613 580
4 0 580 613 614 581
4 0 581 614 615 582
4 0 582 615 616 583
4 0 583 616 617 584
4 0 584 617 618 585
4 0 585 618 619 586
4 0 586 619 620 587
4 0 587 620 621 588
4 0 588 621 622 589
4 0 589 622 623 590
4 0 590 623 624 591
4 0 591 624 625 592
4 0 592 625 626 593
4 0 594 627 628 595
4 0 595 628 629 596
4 0 596 629 630 597
4 0 597 630 631 598
4 0 598 631 632 599
4 0 599 632 633 600
4 0 600 633 634 601
4 0 601 634 635 602
4 0 602 635 636 603
4 0 603 636 637 604
4 0 604 637 638 605
4 0 605 638 639 606
4 0 606 639 640 607
4 0 607 640 641 608
4 0 608 641 642 609
4 0 609 642 643 610
4 0 610 643 644 611
4 0 611 644 645 612
4 0 612 645 646 613
4 0 613 646 647 614
4 0 614 647 648 615
4 0 615 648 649 616
4 0 616 649 650 617
4 0 617 650 651 618
4 0 618 651 652 619
4 0 619 652 653 620
4 0 620 653 654 621
4 0 621 654 655 622
4 0 622 655 656 623
4 0 623 656 657 624
4 0 624 657 658 625
4 0 625 658 659 626
4 0 627 660 661 628
4 0 628 661 662 629
4 0 629 662 663 630
4 0 630 663 664 631
4 0 631 664 665 632
4 0 632 665 666 633
4 0 633 666 667 634
4 0 634 667 668 635
4 0 635 668 669 636
4 0 636 669 670 637
4 0 637 670 671 638
4 0 638 671 672 639
4 0 639 672 673 640
4 0 640 673 674 641
4 0 641 674 675 642
4 0 642 675 676 643
4 0 643 676 677 644
4 0 644 677 678 645
4 0 645 678 679 646
4 0 646 679 680 647
4 0 647 680 681 648
4 0 648 681 682 649
4 0 649 682 683 650
4 0 650 683 684 651
4 0 651 684 685 652
4 0 652 685 686 653
4 0 653 686 687 654
4 0 654 687 688 655
4 0 655 688 689 656
4 0 656 689 690 657
4 0 657 690 691 658
4 0 658 691 692 659
4 0 660 693 694 661
4 0 661 694 695 662
4 0 662 695 696 663
4 0 663 696 697 664
4 0 664 697 698 665
4 0 665 698 699 666
4 0 666 699 700 667
4 0 667 700 701 668
4 0 668 701 702 669
4 0 669 702 703 670
4 0 670 703 704 671
4 0 671 704 705 672
4 0 672 705 706 673
4 0 673 706 707 674
4 0 674 707 708 675
4 0 675 708 709 676
4 0 676 709 710 677
4 0 677 710 711 678
4 0 678 711 712 679
4 0 679 712 713 680
4 0 680 713 714 681
4 0 681 714 715 682
4 0 682 715 716 683
4 0 683 716 717 684
4 0 684 717 718 685
4 0 685 718 719 686
4 0 686 719 720 687
4 0 687 720 721 688
4 0 688 721 722 689
4 0 689 722 723 690
4 0 690 723 724 691
4 0 691 724 725 692
4 0 693 726 727 694
4 0 694 727 728 695
4 0 695 728 729 696
4 0 696 729 730 697
4 0 697 730 731 698
4 0 698 731 732 699
4 0 699 732 733 700
4 0 700 733 734 701
4 0 701 734 735 702
4 0 702 735 736 703
4 0 703 736 737 704
4 0 704 737 738 705
4 0 705 738 739 706
4 0 706 739 740 707
4 0 707 740 741 708
4 0 708 741 742 709
4 0 709 742 743 710
4 0 710 743 744 711
4 0 711 744 745 712
4 0 712 745 746 713
4 0 713 746 747 714
4 0 714 747 748 715
4 0 715 748 749 716
4 0 716 749 750 717
4 0 717 750 751 718
4 0 718 751 752 719
4 0 719 752 753 720
4 0 720 753 754 721
4 0 721 754 755 722
4 0 722 755 756 723
4 0 723 756 757 724
4 0 724 757 758 725
4 0 726 759 760 727
4 0 727 760 761 728
4 0 728 761 762 729
4 0 729 762 763 730
4 0 730 763 764 731
4 0 731 764 765 732
4 0 732 765 766 733
4 0 733 766 767 734
4 0 734 767 768 735
4 0 735 768 769 736
4 0 736 769 770 737
4 0 737 770 771 738
4 0 738 771 772 739
4 0 739 772 773 740
4 0 740 773 774 741
4 0 741 774 775 742
4 0 742 775 776 743
4 0 743 776 777 744
4 0 744 777 778 745
4 0 745 778 779 746
4 0 746 779 780 747
4 0 747 780 781 748
4 0 748 781 782 749
4 0 749 782 783 750
4 0 750 783 784 751
4 0 751 784 785 752
4 0 752 785 786 753
4 0 753 786 787 754
4 0 754 787 788 755
4 0 755 788 789 756
4 0 756 789 790 757
4 0 757 790 791 758
4 0 759 792 793 760
4 0 760 793 794 761
4 0 761 794 795 762
4 0 762 795 796 763
4 0 763 796 797 764
4 0 764 797 798 765
4 0 765 798 799 766
4 0 766 799 800 767
4 0 767 800 801 768
4 0 768 801 802 769
4 0 769 802 803 770
4 0 770 803 804 771
4 0 771 804 805 772
4 0 772 805 806 773
4 0 773 806 807 774
4 0 774 807 808 775
4 0 775 808 809 776
4 0 776 809 810 777
4 0 777 810 811 778
4 0 778 811 812 779
4 0 779 812 813 780
4 0 780 813 814 781
4 0 781 814 815 782
4 0 782 815 816 783
4 0 783 816 817 784
4 0 784 817 818 785
4 0 785 818 819 786
4 0 786 819 820 787
4 0 787 820 821 788
4 0 788 821 822 789
4 0 789 822 823 790
4 0 790 823 824 791
4 0 792 825 826 793
4 0 793 826 827 794
4 0 794 827 828 795
4 0 795 828 829 796
4 0 796 829 830 797
4 0 797 830 831 798
4 0 798 831 832 799
4 0 799 832 833 800
4 0 800 833 834 801
4 0 801 834 835 802
4 0 802 835 836 803
4 0 803 836 837 804
4 0 804 837 838 805
4 0 805 838 839 806
4 0 806 839 840 807
4 0 807 840 841 808
4 0 808 841 842 809
4 0 809 842 843 810
4 0 810 843 844 811
4 0 811 844 845 812
4 0 812 845 846 813
4 0 813 846 847 814
4 0 814 847 848 815
4 0 815 848 849 816
4 0 816 849 850 817
4 0 817 850 851 818
4 0 818 851 852 819
4 0 819 852 853 820
4 0 820 853 854 821
4 0 821 854 855 822
4 0 822 855 856 823
4 0 823 856 857 824
4 0 825 858 859 826
4 0 826 859 860 827
4 0 827 860 861 828
4 0 828 861 862 829
4 0 829 862 863 830
4 0 830 863 864 831
4 0 831 864 865 832
4 0 832 865 866 833
4 0 833 866 867 834
4 0 834 867 868 835
4 0 835 868 869 836
4 0 836 869 870 837
4 0 837 870 871 838
4 0 838 871 872 839
4 0 839 872 873 840
4 0 840 873 874 841
4 0 841 874 875 842
4 0 842 875 876 843
4 0 843 876 877 844
4 0 844 877 878 845
4 0 845 878 879 846
4 0 846 879 880 847
4 0 847 880 881 848
4 0 848 881 882 849
4 0 849 882 883 850
4 0 850 883 884 851
4 0 851 884 885 852
4 0 852 885 886 853
4 0 853 886 887 854
4 0 854 887 888 855
4 0 855 888 889 856
4 0 856 889 890 857
4 0 858 891 892 859
4 0 859 892 893 860
4 0 860 893 894 861
4 0 861 894 895 862
4 0 862 895 896 863
4 0 863 896 897 864
4 0 864 897 898 865
4 0 865 898 899 866
4 0 866 899 900 867
4 0 867 900 901 868
4 0 868 901 902 869
4 0 869 902 903 870
4 0 870 903 904 871
4 0 871 904 905 872
4 0 872 905 906 873
4 0 873 906 907 874
4 0 874 907 908 875
4 0 875 908 909 876
4 0 876 909 910 877
4 0 877 910 911 878
4 0 878 911 912 879
4 0 879 912 913 880
4 0 880 913 914 881
4 0 881 914 915 882
4 0 882 915 916 883
4 0 883 916 917 884
4 0 884 917 918 885
4 0 885 918 919 886
4 0 886 919 920 887
4 0 887 920 921 888
4 0 888 921 922 889
4 0 889 922 923 890
4 0 891 924 925 892
4 0 892 925 926 893
4 0 893 926 927 894
4 0 894 927 928 895
4 0 895 928 929 896
4 0 896 929 930 897
4 0 897 930 931 898
4 0 898 931 932 899
4 0 899 932 933 900
4 0 900 933 934 901
4 0 901 934 935 902
4 0 902 935 936 903
4 0 903 936 937 904
4 0 904 937 938 905
4 0 905 938 939 906
4 0 906 939 940 907
4 0 907 940 941 908
4 0 908 941 942 909
4 0 909 942 943 910
4 0 910 943 944 911
4 0 911 944 945 912
4 0 912 945 946 913
4 0 913 946 947 914
4 0 914 947 948 915
4 0 915 948 949 916
4 0 916 949 950 917
4 0 917 950 951 918
4 0 918 951 952 919
4 0 919 952 953 920
4 0 920 953 954 921
4 0 921 954 955 922
4 0 922 955 956 923
4 0 924 957 958 925
4 0 925 958 959 926
4 0 926 959 960 927
4 0 927 960 961 928
4 0 928 961 962 929
4 0 929 962 963 930
4 0 930 963 964 931
4 0 931 964 965 932
4 0 932 965 966 933
4 0 933 966 967 934
4 0 934 967 968 935
4 0 935 968 969 936
4 0 936 969 970 937
4 0 937 970 971 938
4 0 938 971 972 939
4 0 939 972 973 940
4 0 940 973 974 941
4 0 941 974 975 942
4 0 942 975 976 943
4 0 943 976 977 944
4 0 944 977 978 945
4 0 945 978 979 946
4 0 946 979 980 947
4 0 947 980 981 948
4 0 948 981 982 949
4 0 949 982 983 950
4 0 950 983 984 951
4 0 951 984 985 952
4 0 952 985 986 953
4 0 953 986 987 954
4 0 954 987 988 955
4 0 955 988 989 956
4 0 957 990 991 958
4 0 958 991 992 959
4 0 959 992 993 960
4 0 960 993 994 961
4 0 961 994 995 962
4 0 962 995 996 963
4 0 963 996 997 964
4 0 964 997 998 965
4 0 965 998 999 966
4 0 966 999 1000 967
4 0 967 1000 1001 968
4 0 968 1001 1002 969
4 0 969 1002 1003 970
4 0 970 1003 1004 971
4 0 971 1004 1005 972
4 0 972 1005 1006 973
4 0 973 1006 1007 974
4 0 974 1007 1008 975
4 0 975 1008 1009 976
4 0 976 1009 1010 977
4 0 977 1010 1011 978
4 0 978 1011 1012 979
4 0 979 1012 1013 980
4 0 980 1013 1014 981
4 0 981 1014 1015 982
4 0 982 1015 1016 983
4 0 983 1016 1017 984
4 0 984 1017 1018 985
4 0 985 1018 1019 986
4 0 986 1019 1020 987
4 0 987 1020 1021 988
4 0 988 1021 1022 989
4 0 990 1023 1024 991
4 0 991 1024 1025 992
4 0 992 1025 1026 993
4 0 993 1026 1027 994
4 0 994 1027 1028 995
4 0 995 1028 1029 996
4 0 996 1029 1030 997
4 0 997 1030 1031 998
4 0 998 1031 1032 999
4 0 999 1032 1033 1000
4 0 1000 1033 1034 1001
4 0 1001 1034 1035 1002
4 0 1002 1035 1036 1003
4 0 1003 1036 1037 1004
4 0 1004 1037 1038 1005
4 0 1005 1038 1039 1006
4 0 1006 1039 1040 1007
4 0 1007 1040 1041 1008
4 0 1008 1041 1042 1009
4 0 1009 1042 1043 1010
4 0 1010 1043 1044 1011
4 0 1011 1044 1045 1012
4 0 1012 1045 1046 1013
4 0 1013 1046 1047 1014
4 0 1014 1047 1048 1015
4 0 1015 1048 1049 1016
4 0 1016 1049 1050 1017
4 0 1017 1050 1051 1018
4 0 1018 1051 1052 1019
4 0 1019 1052 1053 1020
4 0 1020 1053 1054 1021
4 0 1021 1054 1055 1022
4 0 1023 1056 1057 1024
4 0 1024 1057 1058 1025
4 0 1025 1058 1059 1026
4 0 1026 1059 1060 1027
4 0 1027 1060 1061 1028
4 0 1028 1061 1062 1029
4 0 1029 1062 1063 1030
4 0 1030 1063 1064 1031
4 0 1031 1064 1065 1032
4 0 1032 1065 1066 1033
4 0 1033 1066 1067 1034
4 0 1034 1067 1068 1035
4 0 1035 1068 1069 1036
4 0 1036 1069 1070 1037
4 0 1037 1070 1071 1038
4 0 1038 1071 1072 1039
4 0 1039 1072 1073 1040
4 0 1040 1073 1074 1041
4 0 1041 1074 1075 1042
4 0 1042 1075 1076 1043
4 0 1043 1076 1077 1044
4 0 1044 1077 1078 1045
4 0 1045 1078 1079 1046
4 0 1046 1079 1080 1047
4 0 1047 1080 1081 1048
4 0 1048 1081 1082 1049
4 0 1049 1082 1083 1050
4 0 1050 1083 1084 1051
4 0 1051 1084 1085 1052
4 0 1052 1085 1086 1053
4 0 1053 1086 1087 1054
4 0 1054 1087 1088 1055
4 0 1056 1089 1090 1057
4 0 1057 1090 1091 1058
4 0 1058 1091 1092 1059
4 0 1059 1092 1093 1060
4 0 1060 1093 1094 1061
4 0 1061 1094 1095 1062
4 0 1062 1095 1096 1063
4 0 1063 1096 1097 1064
4 0 1064 1097 1098 1065
4 0 1065 1098 1099 1066
4 0 1066 1099 1100 1067
4 0 1067 1100 1101 1068
4 0 1068 1101 1102 1069
4 0 1069 1102 1103 1070
4 0 1070 1103 1104 1071
4 0 1071 1104 1105 1072
4 0 1072 1105 1106 1073
4 0 1073 1106 1107 1074
4 0 1074 1107 1108 1075
4 0 1075 1108 1109 1076
4 0 1076 1109 1110 1077
4 0 1077 1110 1111 1078
4 0 1078 1111 1112 1079
4 0 1079 1112 1113 1080
4 0 1080 1113 1114 1081
4 0 1081 1114 1115 1082
4 0 1082 1115 1116 1083
4 0 1083 1116 1117 1084
4 0 1084 1117 1118 1085
4 0 1085 1118 1119 1086
4 0 1086 1119 1120 1087
4 0 1087 1120 1121 1088
4 0 1089 1122 1123 1090
4 0 1090 1123 1124 1091
4 0 1091 1124 1125 1092
4 0 1092 1125 1126 1093
4 0 1093 1126 1127 1094
4 0 1094 1127 1128 1095
4 0 1095 1128 1129 1096
4 0 1096 1129 1130 1097
4 0 1097 1130 1131 1098
4 0 1098 1131 1132 1099
4 0 1099 1132 1133 1100
4 0 1100 1133 1134 1101
4 0 1101 1134 1135 1102
4 0 1102 1135 1136 1103
4 0 1103 1136 1137 1104
4 0 1104 1137 1138 1105
4 0 1105 1138 1139 1106
4 0 1106 1139 1140 1107
4 0 1107 1140 1141 1108
4 0 1108 1141 1142 1109
4 0 1109 1142 1143 1110
4 0 1110 1143 1144 1111
4 0 1111 1144 1145 1112
4 0 1112 1145 1146 1113
4 0 1113 1146 1147 1114
4 0 1114 1147 1148 1115
4 0 1115 1148 1149 1116
4 0 1116 1149 1150 1117
4 0 1117 1150 1151 1118
4 0 1118 1151 1152 1119
4 0 1119 1152 1153 1120
4 0 1120 1153 1154 1121
4 0 1122 1155 1156 1123
4 0 1123 1156 1157 1124
4 0 1124 1157 1158 1125
4 0 1125 1158 1159 1126
4 0 1126 1159 1160 1127
4 0 1127 1160 1161 1128
4 0 1128 1161 1162 1129
4 0 1129 1162 1163 1130
4 0 1130 1163 1164 1131
4 0 1131 1164 1165 1132
4 0 1132 1165 1166 1133
4 0 1133 1166 1167 1134
4 0 1134 1167 1168 1135
4 0 1135 1168 1169 1136
4 0 1136 1169 1170 1137
4 0 1137 1170 1171 1138
4 0 1138 1171 1172 1139
4 0 1139 1172 1173 1140
4 0 1140 1173 1174 1141
4 0 1141 1174 1175 1142
4 0 1142 1175 1176 1143
4 0 1143 1176 1177 1144
4 0 1144 1177 1178 1145
4 0 1145 1178 1179 1146
4 0 1146 1179 1180 1147
4 0 1147 1180 1181 1148
4 0 1148 1181 1182 1149
4 0 1149 1182 1183 1150
4 0 1150 1183 1184 1151
4 0 1151 1184 1185 1152
4 0 1152 1185 1186 1153
4 0 1153 1186 1187 1154
4 0 1155 1188 1189 1156
4 0 1156 1189 1190 1157
4 0 1157 1190 1191 1158
4 0 1158 1191 1192 1159
4 0 1159 1192 1193 1160
4 0 1160 1193 1194 1161
4 0 1161 1194 1195 1162
4 0 1162 1195 1196 1163
4 0 1163 1196 1197 1164
4 0 1164 1197 1198 1165
4 0 1165 1198 1199 1166
4 0 1166 1199 1200 1167
4 0 1167 1200 1201 1168
4 0 1168 1201 1202 1169
4 0 1169 1202 1203 1170
4 0 1170 1203 1204 1171
4 0 1171 1204 1205 1172
4 0 1172 1205 1206 1173
4 0 1173 1206 1207 1174
4 0 1174 1207 1208 1175
4 0 1175 1208 1209 1176
4 0 1176 1209 1210 1177
4 0 1177 1210 1211 1178
4 0 1178 1211 1212 1179
4 0 1179 1212 1213 1180
4 0 1180 1213 1214 1181
4 0 1181 1214 1215 1182
4 0 1182 1215 1216 1183
4 0 1183 1216 1217 1184
4 0 1184 1217 1218 1185
4 0 1185 1218 1219 1186
4 0 1186 1219 1220 1187
4 0 1188 1221 1222 1189
4 0 1189 1222 1223 1190
4 0 1190 1223 1224 1191
4 0 1191 1224 1225 1192
4 0 1192 1225 1226 1193
4 0 1193 1226 1227 1194
4 0 1194 1227 1228 1195
4 0 1195 1228 1229 1196
4 0 1196 1229 1230 1197
4 0 1197 1230 1231 1198
4 0 1198 1231 1232 1199
4 0 1199 1232 1233 1200
4 0 1200 1233 1234 1201
4 0 1201 1234 1235 1202
4 0 1202 1235 1236 1203
4 0 1203 1236 1237 1204
4 0 1204 1237 1238 1205
4 0 1205 1238 1239 1206
4 0 1206 1239 1240 1207
4 0 1207 1240 1241 1208
4 0 1208 1241 1242 1209
4 0 1209 1242 1243 1210
4 0 1210 1243 1244 1211
4 0 1211 1244 1245 1212
4 0 1212 1245 1246 1213
4 0 1213 1246 1247 1214
4 0 1214 1247 1248 1215
4 0 1215 1248 1249 1216
4 0 1216 1249 1250 1217
4 0 1217 1250 1251 1218
4 0 1218 1251 1252 1219
4 0 1219 1252 1253 1220
4 0 1221 1254 1255 1222
4 0 1222 1255 1256 1223
4 0 1223 1256 1257 1224
4 0 1224 1257 1258 1225
4 0 1225 1258 1259 1226
4 0 1226 1259 1260 1227
4 0 1227 1260 1261 1228
4 0 1228 1261 1262 1229
4 0 1229 1262 1263 1230
4 0 1230 1263 1264 1231
4 0 1231 1264 1265 1232
4 0 1232 1265 1266 1233
4 0 1233 1266 1267 1234
4 0 1234 1267 1268 1235
4 0 1235 1268 1269 1236
4 0 1236 1269 1270 1237
4 0 1237 1270 1271 1238
4 0 1238 1271 1272 1239
4 0 1239 1272 1273 1240
4 0 1240 1273 1274 1241
4 0 1241 1274 1275 1242
4 0 1242 1275 1276 1243
4 0 1243 1276 1277 1244
4 0 1244 1277 1278 1245
4 0 1245 1278 1279 1246
4 0 1246 1279 1280 1247
4 0 1247 1280 1281 1248
4 0 1248 1281 1282 1249
4 0 1249 1282 1283 1250
4 0 1250 1283 1284 1251
4 0 1251 1284 1285 1252
4 0 1252 1285 1286 1253
4 0 1254 1287 1288 1255
4 0 1255 1288 1289 1256
4 0 1256 1289 1290 1257
4 0 1257 1290 1291 1258
4 0 1258 1291 1292 1259
4 0 1259 1292 1293 1260
4 0 1260 1293 1294 1261
4 0 1261 1294 1295 1262
4 0 1262 1295 1296 1263
4 0 1263 1296 1297 1264
4 0 1264 1297 1298 1265
4 0 1265 1298 1299 1266
4 0 1266 1299 1300 1267
4 0 1267 1300 1301 1268
4 0 1268 1301 1302 1269
4 0 1269 1302 1303 1270
4 0 1270 1303 1304 1271
4 0 1271 1304 1305 1272
4 0 1272 1305 1306 1273
4 0 1273 1306 1307 1274
4 0 1274 1307 1308 1275
4 0 1275 1308 1309 1276
4 0 1276 1309 1310 1277
4 0 1277 1310 1311 1278
4 0 1278 1311 1312 1279
4 0 1279 1312 1313 1280
4 0 1280 1313 1314 1281
4 0 1281 1314 1315 1282
4 0 1282 1315 1316 1283
4 0 1283 1316 1317 1284
4 0 1284 1317 1318 1285
4 0 1285 1318 1319 1286
4 0 1287 1320 1321 1288
4 0 1288 1321 1322 1289
4 0 1289 1322 1323 1290
4 0 1290 1323 1324 1291
4 0 1291 1324 1325 1292
4 0 1292 1325 1326 1293
4 0 1293 1326 1327 1294
4 0 1294 1327 1328 1295
4 0 1295 1328 1329 1296
4 0 1296 1329 1330 1297
4 0 1297 1330 1331 1298
4 0 1298 1331 1332 1299
4 0 1299 1332 1333 1300
4 0 1300 1333 1334 1301
4 0 1301 1334 1335 1302
4 0 1302 1335 1336 1303
4 0 1303 1336 1337 1304
4 0 1304 1337 1338 1305
4 0 1305 1338 1339 1306
4 0 1306 1339 1340 1307
4 0 1307 1340 1341 1308
4 0 1308 1341 1342 1309
4 0 1309 1342 1343 1310
4 0 1310 1343 1344 1311
4 0 1311 1344 1345 1312
4 0 1312 1345 1346 1313
4 0 1313 1346 1347 1314
4 0 1314 1347 1348 1315
4 0 1315 1348 1349 1316
4 0 1316 1349 1350 1317
4 0 1317 1350 1351 1318
4 0 1318 1351 1352 1319
FACES:
2 100 0 1
2 100 1 2
2 100 2 3
2 100 3 4
2 100 4 5
2 100 5 6
2 100 6 7
2 100 7 8
2 100 8 9
2 100 9 10
2 100 10 11
2 100 11 12
2 100 12 13
2 100 13 14
2 100 14 15
2 100 15 16
2 100 16 17
2 100 17 18
2 100 18 19
2 100 19 20
2 100 20 21
2 100 21 22
2 100 22 23
2 100 23 24
2 100 24 25
2 100 25 26
2 100 26 27
2 100 27 28
2 100 28 29
2 100 29 30
2 100 30 31
2 100 31 32
2 102 0 33
2 102 33 66
2 102 66 99
2 102 99 132
2 102 132 165
2 102 165 198
2 102 198 231
2 102 231 264
2 102 264 297
2 102 297 330
2 102 330 363
2 102 363 396
2 102 396 429
2 102 429 462
2 102 462 495
2 102 495 528
2 102 528 561
2 102 561 594
2 102 594 627
2 102 627 660
2 102 660 693
2 102 693 726
2 102 726 759
2 102 759 792
2 102 792 825
2 102 825 858
2 102 858 891
2 102 891 924
2 102 924 957
2 102 957 990
2 102 990 1023
2 102 1023 1056
2 102 1056 1089
2 102 1089 1122
2 102 1122 1155
2 102 1155 1188
2 102 1188 1221
2 102 1221 1254
2 102 1254 1287
2 102 1287 1320
VDATA:
3 0.0 0.002 20
3 0.0 0.002 20
3 0.0 0.002 20
3 0.0 0.002 20
3 -10.0 0.0 0.0
3 -10.0 0.0 0.0
3 -10.0 0.0 0.0
3 -10.0 0.0 0.0
3 -10.0 0.0 0.0
3 -10.0 0.0 0.0
3 -10.0 0.0 0.0
3 -10.0 0.0 0.0
3 -10.0 0.0 0.0
3 -10.0 0.0 0.0
3 -10.0 0.0 0.0
3 -10.0 0.0 0.0
3 -10.0 0.0 0.0
3 -10.0 0.0 0.0
3 -10.0 0.0 0.0
3 -10.0 0.0 0.0
3 -10.0 0.0 0.0
3 -10.0 0.0 0.0
3 -10.0 0.0 0.0
3 -10.0 0.0 0.0
3 -10.0 0.0 0.0
3 -10.0 0.0 0.0
3 -10.0 0.0 0.0
3 -10.0 0.0 0.0
3 -10.0 0.0 0.0
3 -10.0 0.0 0.0
3 -10.0 0.0 0.0
3 -10.0 0.0 0.0
3 -10.0 0.0 0.0
3 0.0 0.002 20
3 0.0 0.002 20
3 0.0 0.002 20
3 0.0 0.002 20
3 -10.0 0.0 0.0
3 -10.0 0.0 0.0
3 -10.0 0.0 0.0
3 -10.0 0.0 0.0
3 -10.0 0.0 0.0
3 -10.0 0.0 0.0
3 -10.0 0.0 0.0
3 -10.0 0.0 0.0
3 -10.0 0.0 0.0
3 -10.0 0.0 0.0
3 -10.0 0.0 0.0
3 -10.0 0.0 0.0
3 -10.0 0.0 0.0
3 -10.0 0.0 0.0
3 -10.0 0.0 0.0
3 -10.0 0.0 0.0
3 -10.0 0.0 0.0
3 -10.0 0.0 0.0
3 -10.0 0.0 0.0
3 -10.0 0.0 0.0
3 -10.0 0.0 0.0
3 -10.0 0.0 0.0
3 -10.0 0.0 0.0
3 -10.0 0.0 0.0
3 -10.0 0.0 0.0
3 -10.0 0.0 0.0
3 -10.0 0.0 0.0
3 -10.0 0.0 0.0
3 -10.0 0.0 0.0
3 0.0 0.002 20
3 0.0 0.002 20
3 0.0 0.002 20
3 0.0 0.002 20
3 -10.0 0.0 0.0
3 -10.0 0.0 0.0
3 -10.0 0.0 0.0
3 -10.0 0.0 0.0
3 -10.0 0.0 0.0
3 -10.0 0.0 0.0
3 -10.0 0.0 0.0
3 -10.0 0.0 0.0
3 -10.0 0.0 0.0
3 -10.0 0.0 0.0
3 -10.0 0.0 0.0
3 -10.0 0.0 0.0
3 -10.0 0.0 0.0
3 -10.0 0.0 0.0
3 -10.0 0.0 0.0
3 -10.0 0.0 0.0
3 -10.0 0.0 0.0
3 -10.0 0.0 0.0
3 -10.0 0.0 0.0
3 -10.0 0.0 0.0
3 -10.0 0.0 0.0
3 -10.0 0.0 0.0
3 -10.0 0.0 0.0
3 -10.0 0.0 0.0
3 -10.0 0.0 0.0
3 -10.0 0.0 0.0
3 -10.0 0.0 0.0
3 -10.0 0.0 0.0
3 -10.0 0.0 0.0
3 0.0 0.002 20
3 0.0 0.002 20
3 0.0 0.002 20
3 0.0 0.002 20
3 -10.0 0.0 0.0
3 -10.0 0.0 0.0
3 -10.0 0.0 0.0
3 -10.0 0.0 0.0
3 -10.0 0.0 0.0
3 -10.0 0.0 0.0
3 -10.0 0.0 0.0
3 -10.0 0.0 0.0
3 -10.0 0.0 0.0
3 -10.0 0.0 0.0
3 -10.0 0.0 0.0
3 -10.0 0.0 0.0
3 -10.0 0.0 0.0
3 -10.0 0.0 0.0
3 -10.0 0.0 0.0
3 -10.0 0.0 0.0
3 -10.0 0.0 0.0
3 -10.0 0.0 0.0
3 -10.0 0.0 0.0
3 -10.0 0.0 0.0
3 -10.0 0.0 0.0
3 -10.0 0.0 0.0
3 -10.0 0.0 0.0
3 -10.0 0.0 0.0
3 -10.0 0.0 0.0
3 -10.0 0.0 0.0
3 -10.0 0.0 0.0
3 -10.0 0.0 0.0
3 -10.0 0.0 0.0
3 -10.0 0.0 0.0
3 -10.0 0.0 0.0
3 -10.0 0.0 0.0
3 -10.0 0.0 0.0
3 -10.0 0.0 0.0
3 -10.0 0.0 0.0
3 -10.0 0.0 0.0
3 -10.0 0.0 0.0
3 -10.0 0.0 0.0
3 -10.0 0.0 0.0
3 -10.0 0.0 0.0
3 -10.0 0.0 0.0
3 -10.0 0.0 0.0
3 -10.0 0.0 0.0
3 -10.0 0.0 0.0
3 -10.0 0.0 0.0
3 -10.0 0.0 0.0
3 -10.0 0.0 0.0
3 -10.0 0.0 0.0
3 -10.0 0.0 0.0
3 -10.0 0.0 0.0
3 -10.0 0.0 0.0
3 -10.0 0.0 0.0
3 -10.0 0.0 0.0
3 -10.0 0.0 0.0
3 -10.0 0.0 0.0
3 -10.0 0.0 0.0
3 -10.0 0.0 0.0
3 -10.0 0.0 0.0
3 -10.0 0.0 0.0
3 -10.0 0.0 0.0
3 -10.0 0.0 0.0
3 -10.0 0.0 0.0
3 -10.0 0.0 0.0
3 -10.0 0.0 0.0
3 -10.0 0.0 0.0
3 -10.0 0.0 0.0
3 -10.0 0.0 0.0
3 -10.0 0.0 0.0
3 -10.0 0.0 0.0
3 -10.0 0.0 0.0
3 -10.0 0.0 0.0
3 -10.0 0.0 0.0
3 -10.0 0.0 0.0
3 -10.0 0.0 0.0
3 -10.0 0.0 0.0
3 -10.0 0.0 0.0
3 -10.0 0.0 0.0
3 -10.0 0.0 0.0
3 -10.0 0.0 0.0
3 -10.0 0.0 0.0
3 -10.0 0.0 0.0
3 -10.0 0.0 0.0
3 -10.0 0.0 0.0
3 -10.0 0.0 0.0
3 -10.0 0.0 0.0
3 -10.0 0.0 0.0
3 -10.0 0.0 0.0
3 -10.0 0.0 0.0
3 -10.0 0.0 0.0
3 -10.0 0.0 0.0
3 -10.0 0.0 0.0
3 -10.0 0.0 0.0
3 -10.0 0.0 0.0
3 -10.0 0.0 0.0
3 -10.0 0.0 0.0
3 -10.0 0.0 0.0
3 -10.0 0.0 0.0
3 -10.0 0.0 0.0
3 -10.0 0.0 0.0
3 -10.0 0.0 0.0
3 -10.0 0.0 0.0
3 -10.0 0.0 0.0
3 -10.0 0.0 0.0
3 -10.0 0.0 0.0
3 -10.0 0.0 0.0
3 -10.0 0.0 0.0
3 -10.0 0.0 0.0
3 -10.0 0.0 0.0
3 -10.0 0.0 0.0
3 -10.0 0.0 0.0
3 -10.0 0.0 0.0
3 -10.0 0.0 0.0
3 -10.0 0.0 0.0
3 -10.0 0.0 0.0
3 -10.0 0.0 0.0
3 -10.0 0.0 0.0
3 -10.0 0.0 0.0
3 -10.0 0.0 0.0
3 -10.0 0.0 0.0
3 -10.0 0.0 0.0
3 -10.0 0.0 0.0
3 -10.0 0.0 0.0
3 -10.0 0.0 0.0
3 -10.0 0.0 0.0
3 -10.0 0.0 0.0
3 -10.0 0.0 0.0
3 -10.0 0.0 0.0
3 -10.0 0.0 0.0
3 -10.0 0.0 0.0
3 -10.0 0.0 0.0
3 -10.0 0.0 0.0
3 -10.0 0.0 0.0
3 -10.0 0.0 0.0
3 -10.0 0.0 0.0
3 -10.0 0.0 0.0
3 -10.0 0.0 0.0
3 -10.0 0.0 0.0
3 -10.0 0.0 0.0
3 -10.0 0.0 0.0
3 -10.0 0.0 0.0
3 -10.0 0.0 0.0
3 -10.0 0.0 0.0
3 -10.0 0.0 0.0
3 -10.0 0.0 0.0
3 -10.0 0.0 0.0
3 -10.0 0.0 0.0
3 -10.0 0.0 0.0
3 -10.0 0.0 0.0
3 -10.0 0.0 0.0
3 -10.0 0.0 0.0
3 -10.0 0.0 0.0
3 -10.0 0.0 0.0
3 -10.0 0.0 0.0
3 -10.0 0.0 0.0
3 -10.0 0.0 0.0
3 -10.0 0.0 0.0
3 -10.0 0.0 0.0
3 -10.0 0.0 0.0
3 -10.0 0.0 0.0
3 -10.0 0.0 0.0
3 -10.0 0.0 0.0
3 -10.0 0.0 0.0
3 -10.0 0.0 0.0
3 -10.0 0.0 0.0
3 -10.0 0.0 0.0
3 -10.0 0.0 0.0
3 -10.0 0.0 0.0
3 -10.0 0.0 0.0
3 -10.0 0.0 0.0
3 -10.0 0.0 0.0
3 -10.0 0.0 0.0
3 -10.0 0.0 0.0
3 -10.0 0.0 0.0
3 -10.0 0.0 0.0
3 -10.0 0.0 0.0
3 -10.0 0.0 0.0
3 -10.0 0.0 0.0
3 -10.0 0.0 0.0
3 -10.0 0.0 0.0
3 -10.0 0.0 0.0
3 -10.0 0.0 0.0
3 -10.0 0.0 0.0
3 -10.0 0.0 0.0
3 -10.0 0.0 0.0
3 -10.0 0.0 0.0
3 -10.0 0.0 0.0
3 -10.0 0.0 0.0
3 -10.0 0.0 0.0
3 -10.0 0.0 0.0
3 -10.0 0.0 0.0
3 -10.0 0.0 0.0
3 -10.0 0.0 0.0
3 -10.0 0.0 0.0
3 -10.0 0.0 0.0
3 -10.0 0.0 0.0
3 -10.0 0.0 0.0
3 -10.0 0.0 0.0
3 -10.0 0.0 0.0
3 -10.0 0.0 0.0
3 -10.0 0.0 0.0
3 -10.0 0.0 0.0
3 -10.0 0.0 0.0
3 -10.0 0.0 0.0
3 -10.0 0.0 0.0
3 -10.0 0.0 0.0
3 -10.0 0.0 0.0
3 -10.0 0.0 0.0
3 -10.0 0.0 0.0
3 -10.0 0.0 0.0
3 -10.0 0.0 0.0
3 -10.0 0.0 0.0
3 -10.0 0.0 0.0
3 -10.0 0.0 0.0
3 -10.0 0.0 0.0
3 -10.0 0.0 0.0
3 -10.0 0.0 0.0
3 -10.0 0.0 0.0
3 -10.0 0.0 0.0
3 -10.0 0.0 0.0
3 -10.0 0.0 0.0
3 -10.0 0.0 0.0
3 -10.0 0.0 0.0
3 -10.0 0.0 0.0
3 -10.0 0.0 0.0
3 -10.0 0.0 0.0
3 -10.0 0.0 0.0
3 -10.0 0.0 0.0
3 -10.0 0.0 0.0
3 -10.0 0.0 0.0
3 -10.0 0.0 0.0
3 -10.0 0.0 0.0
3 -10.0 0.0 0.0
3 -10.0 0.0 0.0
3 -10.0 0.0 0.0
3 -10.0 0.0 0.0
3 -10.0 0.0 0.0
3 -10.0 0.0 0.0
3 -10.0 0.0 0.0
3 -10.0 0.0 0.0
3 -10.0 0.0 0.0
3 -10.0 0.0 0.0
3 -10.0 0.0 0.0
3 -10.0 0.0 0.0
3 -10.0 0.0 0.0
3 -10.0 0.0 0.0
3 -10.0 0.0 0.0
3 -10.0 0.0 0.0
3 -10.0 0.0 0.0
3 -10.0 0.0 0.0
3 -10.0 0.0 0.0
3 -10.0 0.0 0.0
3 -10.0 0.0 0.0
3 -10.0 0.0 0.0
3 -10.0 0.0 0.0
3 -10.0 0.0 0.0
3 -10.0 0.0 0.0
3 -10.0 0.0 0.0
3 -10.0 0.0 0.0
3 -10.0 0.0 0.0
3 -10.0 0.0 0.0
3 -10.0 0.0 0.0
3 -10.0 0.0 0.0
3 -10.0 0.0 0.0
3 -10.0 0.0 0.0
3 -10.0 0.0 0.0
3 -10.0 0.0 0.0
3 -10.0 0.0 0.0
3 -10.0 0.0 0.0
3 -10.0 0.0 0.0
3 -10.0 0.0 0.0
3 -10.0 0.0 0.0
3 -10.0 0.0 0.0
3 -10.0 0.0 0.0
3 -10.0 0.0 0.0
3 -10.0 0.0 0.0
3 -10.0 0.0 0.0
3 -10.0 0.0 0.0
3 -10.0 0.0 0.0
3 -10.0 0.0 0.0
3 -10.0 0.0 0.0
3 -10.0 0.0 0.0
3 -10.0 0.0 0.0
3 -10.0 0.0 0.0
3 -10.0 0.0 0.0
3 -10.0 0.0 0.0
3 -10.0 0.0 0.0
3 -10.0 0.0 0.0
3 -10.0 0.0 0.0
3 -10.0 0.0 0.0
3 -10.0 0.0 0.0
3 -10.0 0.0 0.0
3 -10.0 0.0 0.0
3 -10.0 0.0 0.0
3 -10.0 0.0 0.0
3 -10.0 0.0 0.0
3 -10.0 0.0 0.0
3 -10.0 0.0 0.0
3 -10.0 0.0 0.0
3 -10.0 0.0 0.0
3 -10.0 0.0 0.0
3 -10.0 0.0 0.0
3 -10.0 0.0 0.0
3 -10.0 0.0 0.0
3 -10.0 0.0 0.0
3 -10.0 0.0 0.0
3 -10.0 0.0 0.0
3 -10.0 0.0 0.0
3 -10.0 0.0 0.0
3 -10.0 0.0 0.0
3 -10.0 0.0 0.0
3 -10.0 0.0 0.0
3 -10.0 0.0 0.0
3 -10.0 0.0 0.0
3 -10.0 0.0 0.0
3 -10.0 0.0 0.0
3 -10.0 0.0 0.0
3 -10.0 0.0 0.0
3 -10.0 0.0 0.0
3 -10.0 0.0 0.0
3 -10.0 0.0 0.0
3 -10.0 0.0 0.0
3 -10.0 0.0 0.0
3 -10.0 0.0 0.0
3 -10.0 0.0 0.0
3 -10.0 0.0 0.0
3 -10.0 0.0 0.0
3 -10.0 0.0 0.0
3 -10.0 0.0 0.0
3 -10.0 0.0 0.0
3 -10.0 0.0 0.0
3 -10.0 0.0 0.0
3 -10.0 0.0 0.0
3 -10.0 0.0 0.0
3 -10.0 0.0 0.0
3 -10.0 0.0 0.0
3 -10.0 0.0 0.0
3 -10.0 0.0 0.0
3 -10.0 0.0 0.0
3 -10.0 0.0 0.0
3 -10.0 0.0 0.0
3 -10.0 0.0 0.0
3 -10.0 0.0 0.0
3 -10.0 0.0 0.0
3 -10.0 0.0 0.0
3 -10.0 0.0 0.0
3 -10.0 0.0 0.0
3 -10.0 0.0 0.0
3 -10.0 0.0 0.0
3 -10.0 0.0 0.0
3 -10.0 0.0 0.0
3 -10.0 0.0 0.0
3 -10.0 0.0 0.0
3 -10.0 0.0 0.0
3 -10.0 0.0 0.0
3 -10.0 0.0 0.0
3 -10.0 0.0 0.0
3 -10.0 0.0 0.0
3 -10.0 0.0 0.0
3 -10.0 0.0 0.0
3 -10.0 0.0 0.0
3 -10.0 0.0 0.0
3 -10.0 0.0 0.0
3 -10.0 0.0 0.0
3 -10.0 0.0 0.0
3 -10.0 0.0 0.0
3 -10.0 0.0 0.0
3 -10.0 0.0 0.0
3 -10.0 0.0 0.0
3 -10.0 0.0 0.0
3 -10.0 0.0 0.0
3 -10.0 0.0 0.0
3 -10.0 0.0 0.0
3 -10.0 0.0 0.0
3 -10.0 0.0 0.0
3 -10.0 0.0 0.0
3 -10.0 0.0 0.0
3 -10.0 0.0 0.0
3 -10.0 0.0 0.0
3 -10.0 0.0 0.0
3 -10.0 0.0 0.0
3 -10.0 0.0 0.0
3 -10.0 0.0 0.0
3 -10.0 0.0 0.0
3 -10.0 0.0 0.0
3 -10.0 0.0 0.0
3 -10.0 0.0 0.0
3 -10.0 0.0 0.0
3 -10.0 0.0 0.0
3 -10.0 0.0 0.0
3 -10.0 0.0 0.0
3 -10.0 0.0 0.0
3 -10.0 0.0 0.0
3 -10.0 0.0 0.0
3 -10.0 0.0 0.0
3 -10.0 0.0 0.0
3 -10.0 0.0 0.0
3 -10.0 0.0 0.0
3 -10.0 0.0 0.0
3 -10.0 0.0 0.0
3 -10.0 0.0 0.0
3 -10.0 0.0 0.0
3 -10.0 0.0 0.0
3 -10.0 0.0 0.0
3 -10.0 0.0 0.0
3 -10.0 0.0 0.0
3 -10.0 0.0 0.0
3 -10.0 0.0 0.0
3 -10.0 0.0 0.0
3 -10.0 0.0 0.0
3 -10.0 0.0 0.0
3 -10.0 0.0 0.0
3 -10.0 0.0 0.0
3 -10.0 0.0 0.0
3 -10.0 0.0 0.0
3 -10.0 0.0 0.0
3 -10.0 0.0 0.0
3 -10.0 0.0 0.0
3 -10.0 0.0 0.0
3 -10.0 0.0 0.0
3 -10.0 0.0 0.0
3 -10.0 0.0 0.0
3 -10.0 0.0 0.0
3 -10.0 0.0 0.0
3 -10.0 0.0 0.0
3 -10.0 0.0 0.0
3 -10.0 0.0 0.0
3 -10.0 0.0 0.0
3 -10.0 0.0 0.0
3 -10.0 0.0 0.0
3 -10.0 0.0 0.0
3 -10.0 0.0 0.0
3 -10.0 0.0 0.0
3 -10.0 0.0 0.0
3 -10.0 0.0 0.0
3 -10.0 0.0 0.0
3 -10.0 0.0 0.0
3 -10.0 0.0 0.0
3 -10.0 0.0 0.0
3 -10.0 0.0 0.0
3 -10.0 0.0 0.0
3 -10.0 0.0 0.0
3 -10.0 0.0 0.0
3 -10.0 0.0 0.0
3 -10.0 0.0 0.0
3 -10.0 0.0 0.0
3 -10.0 0.0 0.0
3 -10.0 0.0 0.0
3 -10.0 0.0 0.0
3 -10.0 0.0 0.0
3 -10.0 0.0 0.0
3 -10.0 0.0 0.0
3 -10.0 0.0 0.0
3 -10.0 0.0 0.0
3 -10.0 0.0 0.0
3 -10.0 0.0 0.0
3 -10.0 0.0 0.0
3 -10.0 0.0 0.0
3 -10.0 0.0 0.0
3 -10.0 0.0 0.0
3 -10.0 0.0 0.0
3 -10.0 0.0 0.0
3 -10.0 0.0 0.0
3 -10.0 0.0 0.0
3 -10.0 0.0 0.0
3 -10.0 0.0 0.0
3 -10.0 0.0 0.0
3 -10.0 0.0 0.0
3 -10.0 0.0 0.0
3 -10.0 0.0 0.0
3 -10.0 0.0 0.0
3 -10.0 0.0 0.0
3 -10.0 0.0 0.0
3 -10.0 0.0 0.0
3 -10.0 0.0 0.0
3 -10.0 0.0 0.0
3 -10.0 0.0 0.0
3 -10.0 0.0 0.0
3 -10.0 0.0 0.0
3 -10.0 0.0 0.0
3 -10.0 0.0 0.0
3 -10.0 0.0 0.0
3 -10.0 0.0 0.0
3 -10.0 0.0 0.0
3 -10.0 0.0 0.0
3 -10.0 0.0 0.0
3 -10.0 0.0 0.0
3 -10.0 0.0 0.0
3 -10.0 0.0 0.0
3 -10.0 0.0 0.0
3 -10.0 0.0 0.0
3 -10.0 0.0 0.0
3 -10.0 0.0 0.0
3 -10.0 0.0 0.0
3 -10.0 0.0 0.0
3 -10.0 0.0 0.0
3 -10.0 0.0 0.0
3 -10.0 0.0 0.0
3 -10.0 0.0 0.0
3 -10.0 0.0 0.0
3 -10.0 0.0 0.0
3 -10.0 0.0 0.0
3 -10.0 0.0 0.0
3 -10.0 0.0 0.0
3 -10.0 0.0 0.0
3 -10.0 0.0 0.0
3 -10.0 0.0 0.0
3 -10.0 0.0 0.0
3 -10.0 0.0 0.0
3 -10.0 0.0 0.0
3 -10.0 0.0 0.0
3 -10.0 0.0 0.0
3 -10.0 0.0 0.0
3 -10.0 0.0 0.0
3 -10.0 0.0 0.0
3 -10.0 0.0 0.0
3 -10.0 0.0 0.0
3 -10.0 0.0 0.0
3 -10.0 0.0 0.0
3 -10.0 0.0 0.0
3 -10.0 0.0 0.0
3 -10.0 0.0 0.0
3 -10.0 0.0 0.0
3 -10.0 0.0 0.0
3 -10.0 0.0 0.0
3 -10.0 0.0 0.0
3 -10.0 0.0 0.0
3 -10.0 0.0 0.0
3 -10.0 0.0 0.0
3 -10.0 0.0 0.0
3 -10.0 0.0 0.0
3 -10.0 0.0 0.0
3 -10.0 0.0 0.0
3 -10.0 0.0 0.0
3 -10.0 0.0 0.0
3 -10.0 0.0 0.0
3 -10.0 0.0 0.0
3 -10.0 0.0 0.0
3 -10.0 0.0 0.0
3 -10.0 0.0 0.0
3 -10.0 0.0 0.0
3 -10.0 0.0 0.0
3 -10.0 0.0 0.0
3 -10.0 0.0 0.0
3 -10.0 0.0 0.0
3 -10.0 0.0 0.0
3 -10.0 0.0 0.0
3 -10.0 0.0 0.0
3 -10.0 0.0 0.0
3 -10.0 0.0 0.0
3 -10.0 0.0 0.0
3 -10.0 0.0 0.0
3 -10.0 0.0 0.0
3 -10.0 0.0 0.0
3 -10.0 0.0 0.0
3 -10.0 0.0 0.0
3 -10.0 0.0 0.0
3 -10.0 0.0 0.0
3 -10.0 0.0 0.0
3 -10.0 0.0 0.0
3 -10.0 0.0 0.0
3 -10.0 0.0 0.0
3 -10.0 0.0 0.0
3 -10.0 0.0 0.0
3 -10.0 0.0 0.0
3 -10.0 0.0 0.0
3 -10.0 0.0 0.0
3 -10.0 0.0 0.0
3 -10.0 0.0 0.0
3 -10.0 0.0 0.0
3 -10.0 0.0 0.0
3 -10.0 0.0 0.0
3 -10.0 0.0 0.0
3 -10.0 0.0 0.0
3 -10.0 0.0 0.0
3 -10.0 0.0 0.0
3 -10.0 0.0 0.0
3 -10.0 0.0 0.0
3 -10.0 0.0 0.0
3 -10.0 0.0 0.0
3 -10.0 0.0 0.0
3 -10.0 0.0 0.0
3 -10.0 0.0 0.0
3 -10.0 0.0 0.0
3 -10.0 0.0 0.0
3 -10.0 0.0 0.0
3 -10.0 0.0 0.0
3 -10.0 0.0 0.0
3 -10.0 0.0 0.0
3 -10.0 0.0 0.0
3 -10.0 0.0 0.0
3 -10.0 0.0 0.0
3 -10.0 0.0 0.0
3 -10.0 0.0 0.0
3 -10.0 0.0 0.0
3 -10.0 0.0 0.0
3 -10.0 0.0 0.0
3 -10.0 0.0 0.0
3 -10.0 0.0 0.0
3 -10.0 0.0 0.0
3 -10.0 0.0 0.0
3 -10.0 0.0 0.0
3 -10.0 0.0 0.0
3 -10.0 0.0 0.0
3 -10.0 0.0 0.0
3 -10.0 0.0 0.0
3 -10.0 0.0 0.0
3 -10.0 0.0 0.0
3 -10.0 0.0 0.0
3 -10.0 0.0 0.0
3 -10.0 0.0 0.0
3 -10.0 0.0 0.0
3 -10.0 0.0 0.0
3 -10.0 0.0 0.0
3 -10.0 0.0 0.0
3 -10.0 0.0 0.0
3 -10.0 0.0 0.0
3 -10.0 0.0 0.0
3 -10.0 0.0 0.0
3 -10.0 0.0 0.0
3 -10.0 0.0 0.0
3 -10.0 0.0 0.0
3 -10.0 0.0 0.0
3 -10.0 0.0 0.0
3 -10.0 0.0 0.0
3 -10.0 0.0 0.0
3 -10.0 0.0 0.0
3 -10.0 0.0 0.0
3 -10.0 0.0 0.0
3 -10.0 0.0 0.0
3 -10.0 0.0 0.0
3 -10.0 0.0 0.0
3 -10.0 0.0 0.0
3 -10.0 0.0 0.0
3 -10.0 0.0 0.0
3 -10.0 0.0 0.0
3 -10.0 0.0 0.0
3 -10.0 0.0 0.0
3 -10.0 0.0 0.0
3 -10.0 0.0 0.0
3 -10.0 0.0 0.0
3 -10.0 0.0 0.0
3 -10.0 0.0 0.0
3 -10.0 0.0 0.0
3 -10.0 0.0 0.0
3 -10.0 0.0 0.0
3 -10.0 0.0 0.0
3 -10.0 0.0 0.0
3 -10.0 0.0 0.0
3 -10.0 0.0 0.0
3 -10.0 0.0 0.0
3 -10.0 0.0 0.0
3 -10.0 0.0 0.0
3 -10.0 0.0 0.0
3 -10.0 0.0 0.0
3 -10.0 0.0 0.0
3 -10.0 0.0 0.0
3 -10.0 0.0 0.0
3 -10.0 0.0 0.0
3 -10.0 0.0 0.0
3 -10.0 0.0 0.0
3 -10.0 0.0 0.0
3 -10.0 0.0 0.0
3 -10.0 0.0 0.0
3 -10.0 0.0 0.0
3 -10.0 0.0 0.0
3 -10.0 0.0 0.0
3 -10.0 0.0 0.0
3 -10.0 0.0 0.0
3 -10.0 0.0 0.0
3 -10.0 0.0 0.0
3 -10.0 0.0 0.0
3 -10.0 0.0 0.0
3 -10.0 0.0 0.0
3 -10.0 0.0 0.0
3 -10.0 0.0 0.0
3 -10.0 0.0 0.0
3 -10.0 0.0 0.0
3 -10.0 0.0 0.0
3 -10.0 0.0 0.0
3 -10.0 0.0 0.0
3 -10.0 0.0 0.0
3 -10.0 0.0 0.0
3 -10.0 0.0 0.0
3 -10.0 0.0 0.0
3 -10.0 0.0 0.0
3 -10.0 0.0 0.0
3 -10.0 0.0 0.0
3 -10.0 0.0 0.0
3 -10.0 0.0 0.0
3 -10.0 0.0 0.0
3 -10.0 0.0 0.0
3 -10.0 0.0 0.0
3 -10.0 0.0 0.0
3 -10.0 0.0 0.0
3 -10.0 0.0 0.0
3 -10.0 0.0 0.0
3 -10.0 0.0 0.0
3 -10.0 0.0 0.0
3 -10.0 0.0 0.0
3 -10.0 0.0 0.0
3 -10.0 0.0 0.0
3 -10.0 0.0 0.0
3 -10.0 0.0 0.0
3 -10.0 0.0 0.0
3 -10.0 0.0 0.0
3 -10.0 0.0 0.0
3 -10.0 0.0 0.0
3 -10.0 0.0 0.0
3 -10.0 0.0 0.0
3 -10.0 0.0 0.0
3 -10.0 0.0 0.0
3 -10.0 0.0 0.0
3 -10.0 0.0 0.0
3 -10.0 0.0 0.0
3 -10.0 0.0 0.0
3 -10.0 0.0 0.0
3 -10.0 0.0 0.0
3 -10.0 0.0 0.0
3 -10.0 0.0 0.0
3 -10.0 0.0 0.0
3 -10.0 0.0 0.0
3 -10.0 0.0 0.0
3 -10.0 0.0 0.0
3 -10.0 0.0 0.0
3 -10.0 0.0 0.0
3 -10.0 0.0 0.0
3 -10.0 0.0 0.0
3 -10.0 0.0 0.0
3 -10.0 0.0 0.0
3 -10.0 0.0 0.0
3 -10.0 0.0 0.0
3 -10.0 0.0 0.0
3 -10.0 0.0 0.0
3 -10.0 0.0 0.0
3 -10.0 0.0 0.0
3 -10.0 0.0 0.0
3 -10.0 0.0 0.0
3 -10.0 0.0 0.0
3 -10.0 0.0 0.0
3 -10.0 0.0 0.0
3 -10.0 0.0 0.0
3 -10.0 0.0 0.0
3 -10.0 0.0 0.0
3 -10.0 0.0 0.0
3 -10.0 0.0 0.0
3 -10.0 0.0 0.0
3 -10.0 0.0 0.0
3 -10.0 0.0 0.0
3 -10.0 0.0 0.0
3 -10.0 0.0 0.0
3 -10.0 0.0 0.0
3 -10.0 0.0 0.0
3 -10.0 0.0 0.0
3 -10.0 0.0 0.0
3 -10.0 0.0 0.0
3 -10.0 0.0 0.0
3 -10.0 0.0 0.0
3 -10.0 0.0 0.0
3 -10.0 0.0 0.0
3 -10.0 0.0 0.0
3 -10.0 0.0 0.0
3 -10.0 0.0 0.0
3 -10.0 0.0 0.0
3 -10.0 0.0 0.0
3 -10.0 0.0 0.0
3 -10.0 0.0 0.0
3 -10.0 0.0 0.0
3 -10.0 0.0 0.0
3 -10.0 0.0 0.0
3 -10.0 0.0 0.0
3 -10.0 0.0 0.0
3 -10.0 0.0 0.0
3 -10.0 0.0 0.0
3 -10.0 0.0 0.0
3 -10.0 0.0 0.0
3 -10.0 0.0 0.0
3 -10.0 0.0 0.0
3 -10.0 0.0 0.0
3 -10.0 0.0 0.0
3 -10.0 0.0 0.0
3 -10.0 0.0 0.0
3 -10.0 0.0 0.0
3 -10.0 0.0 0.0
3 -10.0 0.0 0.0
3 -10.0 0.0 0.0
3 -10.0 0.0 0.0
3 -10.0 0.0 0.0
3 -10.0 0.0 0.0
3 -10.0 0.0 0.0
3 -10.0 0.0 0.0
3 -10.0 0.0 0.0
3 -10.0 0.0 0.0
3 -10.0 0.0 0.0
3 -10.0 0.0 0.0
3 -10.0 0.0 0.0
3 -10.0 0.0 0.0
3 -10.0 0.0 0.0
3 -10.0 0.0 0.0
3 -10.0 0.0 0.0
3 -10.0 0.0 0.0
3 -10.0 0.0 0.0
3 -10.0 0.0 0.0
3 -10.0 0.0 0.0
3 -10.0 0.0 0.0
3 -10.0 0.0 0.0
3 -10.0 0.0 0.0
3 -10.0 0.0 0.0
3 -10.0 0.0 0.0
3 -10.0 0.0 0.0
3 -10.0 0.0 0.0
3 -10.0 0.0 0.0
3 -10.0 0.0 0.0
3 -10.0 0.0 0.0
3 -10.0 0.0 0.0
3 -10.0 0.0 0.0
3 -10.0 0.0 0.0
3 -10.0 0.0 0.0
3 -10.0 0.0 0.0
3 -10.0 0.0 0.0
3 -10.0 0.0 0.0
3 -10.0 0.0 0.0
3 -10.0 0.0 0.0
3 -10.0 0.0 0.0
3 -10.0 0.0 0.0
3 -10.0 0.0 0.0
3 -10.0 0.0 0.0
3 -10.0 0.0 0.0
3 -10.0 0.0 0.0
3 -10.0 0.0 0.0
3 -10.0 0.0 0.0
3 -10.0 0.0 0.0
3 -10.0 0.0 0.0
3 -10.0 0.0 0.0
3 -10.0 0.0 0.0
3 -10.0 0.0 0.0
3 -10.0 0.0 0.0
3 -10.0 0.0 0.0
3 -10.0 0.0 0.0
3 -10.0 0.0 0.0
3 -10.0 0.0 0.0
3 -10.0 0.0 0.0
3 -10.0 0.0 0.0
3 -10.0 0.0 0.0
3 -10.0 0.0 0.0
3 -10.0 0.0 0.0
3 -10.0 0.0 0.0
3 -10.0 0.0 0.0
3 -10.0 0.0 0.0
3 -10.0 0.0 0.0
3 -10.0 0.0 0.0
3 -10.0 0.0 0.0
3 -10.0 0.0 0.0
3 -10.0 0.0 0.0
3 -10.0 0.0 0.0
3 -10.0 0.0 0.0
3 -10.0 0.0 0.0
3 -10.0 0.0 0.0
3 -10.0 0.0 0.0
3 -10.0 0.0 0.0
3 -10.0 0.0 0.0
3 -10.0 0.0 0.0
3 -10.0 0.0 0.0
3 -10.0 0.0 0.0
3 -10.0 0.0 0.0
3 -10.0 0.0 0.0
3 -10.0 0.0 0.0
3 -10.0 0.0 0.0
3 -10.0 0.0 0.0
3 -10.0 0.0 0.0
3 -10.0 0.0 0.0
3 -10.0 0.0 0.0
3 -10.0 0.0 0.0
3 -10.0 0.0 0.0
3 -10.0 0.0 0.0
3 -10.0 0.0 0.0
3 -10.0 0.0 0.0
3 -10.0 0.0 0.0
3 -10.0 0.0 0.0
3 -10.0 0.0 0.0
3 -10.0 0.0 0.0
3 -10.0 0.0 0.0
3 -10.0 0.0 0.0
3 -10.0 0.0 0.0
3 -10.0 0.0 0.0
3 -10.0 0.0 0.0
3 -10.0 0.0 0.0
3 -10.0 0.0 0.0
3 -10.0 0.0 0.0
3 -10.0 0.0 0.0
3 -10.0 0.0 0.0
3 -10.0 0.0 0.0
3 -10.0 0.0 0.0
3 -10.0 0.0 0.0
3 -10.0 0.0 0.0
3 -10.0 0.0 0.0
3 -10.0 0.0 0.0
3 -10.0 0.0 0.0
3 -10.0 0.0 0.0
3 -10.0 0.0 0.0
3 -10.0 0.0 0.0
3 -10.0 0.0 0.0
3 -10.0 0.0 0.0
3 -10.0 0.0 0.0
3 -10.0 0.0 0.0
3 -10.0 0.0 0.0
3 -10.0 0.0 0.0
3 -10.0 0.0 0.0
3 -10.0 0.0 0.0
3 -10.0 0.0 0.0
3 -10.0 0.0 0.0
3 -10.0 0.0 0.0
3 -10.0 0.0 0.0
3 -10.0 0.0 0.0
3 -10.0 0.0 0.0
3 -10.0 0.0 0.0
3 -10.0 0.0 0.0
3 -10.0 0.0 0.0
3 -10.0 0.0 0.0
3 -10.0 0.0 0.0
3 -10.0 0.0 0.0
3 -10.0 0.0 0.0
3 -10.0 0.0 0.0
3 -10.0 0.0 0.0
3 -10.0 0.0 0.0
3 -10.0 0.0 0.0
3 -10.0 0.0 0.0
3 -10.0 0.0 0.0
3 -10.0 0.0 0.0
3 -10.0 0.0 0.0
3 -10.0 0.0 0.0
3 -10.0 0.0 0.0
3 -10.0 0.0 0.0
3 -10.0 0.0 0.0
3 -10.0 0.0 0.0
3 -10.0 0.0 0.0
3 -10.0 0.0 0.0
3 -10.0 0.0 0.0
3 -10.0 0.0 0.0
3 -10.0 0.0 0.0
3 -10.0 0.0 0.0
3 -10.0 0.0 0.0
3 -10.0 0.0 0.0
3 -10.0 0.0 0.0
3 -10.0 0.0 0.0
3 -10.0 0.0 0.0
3 -10.0 0.0 0.0
3 -10.0 0.0 0.0
3 -10.0 0.0 0.0
3 -10.0 0.0 0.0
3 -10.0 0.0 0.0
3 -10.0 0.0 0.0
3 -10.0 0.0 0.0
3 -10.0 0.0 0.0
3 -10.0 0.0 0.0
3 -10.0 0.0 0.0
3 -10.0 0.0 0.0
3 -10.0 0.0 0.0
3 -10.0 0.0 0.0
3 -10.0 0.0 0.0
3 -10.0 0.0 0.0
3 -10.0 0.0 0.0
3 -10.0 0.0 0.0
3 -10.0 0.0 0.0
3 -10.0 0.0 0.0
3 -10.0 0.0 0.0
3 -10.0 0.0 0.0
3 -10.0 0.0 0.0
3 -10.0 0.0 0.0
3 -10.0 0.0 0.0
3 -10.0 0.0 0.0
3 -10.0 0.0 0.0
3 -10.0 0.0 0.0
3 -10.0 0.0 0.0
3 -10.0 0.0 0.0
3 -10.0 0.0 0.0
3 -10.0 0.0 0.0
3 -10.0 0.0 0.0
3 -10.0 0.0 0.0
3 -10.0 0.0 0.0
3 -10.0 0.0 0.0
3 -10.0 0.0 0.0
3 -10.0 0.0 0.0
3 -10.0 0.0 0.0
3 -10.0 0.0 0.0
3 -10.0 0.0 0.0
3 -10.0 0.0 0.0
3 -10.0 0.0 0.0
3 -10.0 0.0 0.0
3 -10.0 0.0 0.0
3 -10.0 0.0 0.0
3 -10.0 0.0 0.0
3 -10.0 0.0 0.0
3 -10.0 0.0 0.0
3 -10.0 0.0 0.0
3 -10.0 0.0 0.0
3 -10.0 0.0 0.0
3 -10.0 0.0 0.0
3 -10.0 0.0 0.0
3 -10.0 0.0 0.0
3 -10.0 0.0 0.0
3 -10.0 0.0 0.0
3 -10.0 0.0 0.0
3 -10.0 0.0 0.0
3 -10.0 0.0 0.0
3 -10.0 0.0 0.0
3 -10.0 0.0 0.0
3 -10.0 0.0 0.0
3 -10.0 0.0 0.0
3 -10.0 0.0 0.0
3 -10.0 0.0 0.0
3 -10.0 0.0 0.0
3 -10.0 0.0 0.0
3 -10.0 0.0 0.0
3 -10.0 0.0 0.0
3 -10.0 0.0 0.0
3 -10.0 0.0 0.0
3 -10.0 0.0 0.0
3 -10.0 0.0 0.0
3 -10.0 0.0 0.0
3 -10.0 0.0 0.0
3 -10.0 0.0 0.0
3 -10.0 0.0 0.0
3 -10.0 0.0 0.0
3 -10.0 0.0 0.0
3 -10.0 0.0 0.0
3 -10.0 0.0 0.0
3 -10.0 0.0 0.0
3 -10.0 0.0 0.0
3 -10.0 0.0 0.0
3 -10.0 0.0 0.0
3 -10.0 0.0 0.0
3 -10.0 0.0 0.0
3 -10.0 0.0 0.0
3 -10.0 0.0 0.0
3 -10.0 0.0 0.0
3 -10.0 0.0 0.0
3 -10.0 0.0 0.0
3 -10.0 0.0 0.0
3 -10.0 0.0 0.0
3 -10.0 0.0 0.0
3 -10.0 0.0 0.0
3 -10.0 0.0 0.0
3 -10.0 0.0 0.0
3 -10.0 0.0 0.0
3 -10.0 0.0 0.0
3 -10.0 0.0 0.0
3 -10.0 0.0 0.0
3 -10.0 0.0 0.0
3 -10.0 0.0 0.0
3 -10.0 0.0 0.0
3 -10.0 0.0 0.0
3 -10.0 0.0 0.0
3 -10.0 0.0 0.0
3 -10.0 0.0 0.0
3 -10.0 0.0 0.0
3 -10.0 0.0 0.0
3 -10.0 0.0 0.0
3 -10.0 0.0 0.0
3 -10.0 0.0 0.0
3 -10.0 0.0 0.0
3 -10.0 0.0 0.0
3 -10.0 0.0 0.0
3 -10.0 0.0 0.0
3 -10.0 0.0 0.0
3 -10.0 0.0 0.0
3 -10.0 0.0 0.0
3 -10.0 0.0 0.0
3 -10.0 0.0 0.0
3 -10.0 0.0 0.0
3 -10.0 0.0 0.0
3 -10.0 0.0 0.0
3 -10.0 0.0 0.0
3 -10.0 0.0 0.0
3 -10.0 0.0 0.0
3 -10.0 0.0 0.0
3 -10.0 0.0 0.0
3 -10.0 0.0 0.0
3 -10.0 0.0 0.0
3 -10.0 0.0 0.0
3 -10.0 0.0 0.0
3 -10.0 0.0 0.0
3 -10.0 0.0 0.0
3 -10.0 0.0 0.0
3 -10.0 0.0 0.0
3 -10.0 0.0 0.0
3 -10.0 0.0 0.0
3 -10.0 0.0 0.0
3 -10.0 0.0 0.0
3 -10.0 0.0 0.0
3 -10.0 0.0 0.0
3 -10.0 0.0 0.0
3 -10.0 0.0 0.0
3 -10.0 0.0 0.0
3 -10.0 0.0 0.0
3 -10.0 0.0 0.0
3 -10.0 0.0 0.0
3 -10.0 0.0 0.0
3 -10.0 0.0 0.0
3 -10.0 0.0 0.0
3 -10.0 0.0 0.0
3 -10.0 0.0 0.0
3 -10.0 0.0 0.0
3 -10.0 0.0 0.0
3 -10.0 0.0 0.0
3 -10.0 0.0 0.0
3 -10.0 0.0 0.0
3 -10.0 0.0 0.0
3 -10.0 0.0 0.0
3 -10.0 0.0 0.0
3 -10.0 0.0 0.0
3 -10.0 0.0 0.0
3 -10.0 0.0 0.0
3 -10.0 0.0 0.0
3 -10.0 0.0 0.0
3 -10.0 0.0 0.0
3 -10.0 0.0 0.0
3 -10.0 0.0 0.0
3 -10.0 0.0 0.0
3 -10.0 0.0 0.0
3 -10.0 0.0 0.0
3 -10.0 0.0 0.0
3 -10.0 0.0 0.0
3 -10.0 0.0 0.0
3 -10.0 0.0 0.0
3 -10.0 0.0 0.0
3 -10.0 0.0 0.0
3 -10.0 0.0 0.0
3 -10.0 0.0 0.0
3 -10.0 0.0 0.0
3 -10.0 0.0 0.0
3 -10.0 0.0 0.0
3 -10.0 0.0 0.0
3 -10.0 0.0 0.0
3 -10.0 0.0 0.0
3 -10.0 0.0 0.0
3 -10.0 0.0 0.0
3 -10.0 0.0 0.0
3 -10.0 0.0 0.0
3 -10.0 0.0 0.0
3 -10.0 0.0 0.0
3 -10.0 0.0 0.0
3 -10.0 0.0 0.0
3 -10.0 0.0 0.0
3 -10.0 0.0 0.0
3 -10.0 0.0 0.0
3 -10.0 0.0 0.0
3 -10.0 0.0 0.0
3 -10.0 0.0 0.0
3 -10.0 0.0 0.0
3 -10.0 0.0 0.0
3 -10.0 0.0 0.0
3 -10.0 0.0 0.0
3 -10.0 0.0 0.0
3 -10.0 0.0 0.0
3 -10.0 0.0 0.0
3 -10.0 0.0 0.0
3 -10.0 0.0 0.0
3 -10.0 0.0 0.0
3 -10.0 0.0 0.0
3 -10.0 0.0 0.0
3 -10.0 0.0 0.0
3 -10.0 0.0 0.0
3 -10.0 0.0 0.0
3 -10.0 0.0 0.0
3 -10.0 0.0 0.0
3 -10.0 0.0 0.0
3 -10.0 0.0 0.0
3 -10.0 0.0 0.0
3 -10.0 0.0 0.0
3 -10.0 0.0 0.0
3 -10.0 0.0 0.0
3 -10.0 0.0 0.0
3 -10.0 0.0 0.0
3 -10.0 0.0 0.0
3 -10.0 0.0 0.0
3 -10.0 0.0 0.0
3 -10.0 0.0 0.0
3 -10.0 0.0 0.0
3 -10.0 0.0 0.0
3 -10.0 0.0 0.0
3 -10.0 0.0 0.0
3 -10.0 0.0 0.0
3 -10.0 0.0 0.0
3 -10.0 0.0 0.0
3 -10.0 0.0 0.0
3 -10.0 0.0 0.0
3 -10.0 0.0 0.0
3 -10.0 0.0 0.0
3 -10.0 0.0 0.0
3 -10.0 0.0 0.0
3 -10.0 0.0 0.0
3 -10.0 0.0 0.0
3 -10.0 0.0 0.0
3 -10.0 0.0 0.0
3 -10.0 0.0 0.0
3 -10.0 0.0 0.0
3 -10.0 0.0 0.0
3 -10.0 0.0 0.0
3 -10.0 0.0 0.0
3 -10.0 0.0 0.0
3 -10.0 0.0 0.0
3 -10.0 0.0 0.0
3 -10.0 0.0 0.0
3 -10.0 0.0 0.0
3 -10.0 0.0 0.0
3 -10.0 0.0 0.0
3 -10.0 0.0 0.0
3 -10.0 0.0 0.0
3 -10.0 0.0 0.0
3 -10.0 0.0 0.0
3 -10.0 0.0 0.0
3 -10.0 0.0 0.0
3 -10.0 0.0 0.0
3 -10.0 0.0 0.0
3 -10.0 0.0 0.0
3 -10.0 0.0 0.0
3 -10.0 0.0 0.0
3 -10.0 0.0 0.0
3 -10.0 0.0 0.0
3 -10.0 0.0 0.0
3 -10.0 0.0 0.0
3 -10.0 0.0 0.0
3 -10.0 0.0 0.0
3 -10.0 0.0 0.0
3 -10.0 0.0 0.0
3 -10.0 0.0 0.0
3 -10.0 0.0 0.0
3 -10.0 0.0 0.0
3 -10.0 0.0 0.0
3 -10.0 0.0 0.0
3 -10.0 0.0 0.0
3 -10.0 0.0 0.0
3 -10.0 0.0 0.0
3 -10.0 0.0 0.0
3 -10.0 0.0 0.0
3 -10.0 0.0 0.0
3 -10.0 0.0 0.0
3 -10.0 0.0 0.0
3 -10.0 0.0 0.0
3 -10.0 0.0 0.0
3 -10.0 0.0 0.0
3 -10.0 0.0 0.0
3 -10.0 0.0 0.0
3 -10.0 0.0 0.0
3 -10.0 0.0 0.0
3 -10.0 0.0 0.0
3 -10.0 0.0 0.0
3 -10.0 0.0 0.0
3 -10.0 0.0 0.0
3 -10.0 0.0 0.0
CDATA:
9 1 0 0 0 1 0 0 0 1
9 1 0 0 0 1 0 0 0 1
9 1 0 0 0 1 0 0 0 1
9 1 0 0 0 1 0 0 0 1
9 1 0 0 0 1 0 0 0 1
9 1 0 0 0 1 0 0 0 1
9 1 0 0 0 1 0 0 0 1
9 1 0 0 0 1 0 0 0 1
9 1 0 0 0 1 0 0 0 1
9 1 0 0 0 1 0 0 0 1
9 1 0 0 0 1 0 0 0 1
9 1 0 0 0 1 0 0 0 1
9 1 0 0 0 1 0 0 0 1
9 1 0 0 0 1 0 0 0 1
9 1 0 0 0 1 0 0 0 1
9 1 0 0 0 1 0 0 0 1
9 1 0 0 0 1 0 0 0 1
9 1 0 0 0 1 0 0 0 1
9 1 0 0 0 1 0 0 0 1
9 1 0 0 0 1 0 0 0 1
9 1 0 0 0 1 0 0 0 1
9 1 0 0 0 1 0 0 0 1
9 1 0 0 0 1 0 0 0 1
9 1 0 0 0 1 0 0 0 1
9 1 0 0 0 1 0 0 0 1
9 1 0 0 0 1 0 0 0 1
9 1 0 0 0 1 0 0 0 1
9 1 0 0 0 1 0 0 0 1
9 1 0 0 0 1 0 0 0 1
9 1 0 0 0 1 0 0 0 1
9 1 0 0 0 1 0 0 0 1
9 1 0 0 0 1 0 0 0 1
9 1 0 0 0 1 0 0 0 1
9 1 0 0 0 1 0 0 0 1
9 1 0 0 0 1 0 0 0 1
9 1 0 0 0 1 0 0 0 1
9 1 0 0 0 1 0 0 0 1
9 1 0 0 0 1 0 0 0 1
9 1 0 0 0 1 0 0 0 1
9 1 0 0 0 1 0 0 0 1
9 1 0 0 0 1 0 0 0 1
9 1 0 0 0 1 0 0 0 1
9 1 0 0 0 1 0 0 0 1
9 1 0 0 0 1 0 0 0 1
9 1 0 0 0 1 0 0 0 1
9 1 0 0 0 1 0 0 0 1
9 1 0 0 0 1 0 0 0 1
9 1 0 0 0 1 0 0 0 1
9 1 0 0 0 1 0 0 0 1
9 1 0 0 0 1 0 0 0 1
9 1 0 0 0 1 0 0 0 1
9 1 0 0 0 1 0 0 0 1
9 1 0 0 0 1 0 0 0 1
9 1 0 0 0 1 0 0 0 1
9 1 0 0 0 1 0 0 0 1
9 1 0 0 0 1 0 0 0 1
9 1 0 0 0 1 0 0 0 1
9 1 0 0 0 1 0 0 0 1
9 1 0 0 0 1 0 0 0 1
9 1 0 0 0 1 0 0 0 1
9 1 0 0 0 1 0 0 0 1
9 1 0 0 0 1 0 0 0 1
9 1 0 0 0 1 0 0 0 1
9 1 0 0 0 1 0 0 0 1
9 1 0 0 0 1 0 0 0 1
9 1 0 0 0 1 0 0 0 1
9 1 0 0 0 1 0 0 0 1
9 1 0 0 0 1 0 0 0 1
9 1 0 0 0 1 0 0 0 1
9 1 0 0 0 1 0 0 0 1
9 1 0 0 0 1 0 0 0 1
9 1 0 0 0 1 0 0 0 1
9 1 0 0 0 1 0 0 0 1
9 1 0 0 0 1 0 0 0 1
9 1 0 0 0 1 0 0 0 1
9 1 0 0 0 1 0 0 0 1
9 1 0 0 0 1 0 0 0 1
9 1 0 0 0 1 0 0 0 1
9 1 0 0 0 1 0 0 0 1
9 1 0 0 0 1 0 0 0 1
9 1 0 0 0 1 0 0 0 1
9 1 0 0 0 1 0 0 0 1
9 1 0 0 0 1 0 0 0 1
9 1 0 0 0 1 0 0 0 1
9 1 0 0 0 1 0 0 0 1
9 1 0 0 0 1 0 0 0 1
9 1 0 0 0 1 0 0 0 1
9 1 0 0 0 1 0 0 0 1
9 1 0 0 0 1 0 0 0 1
9 1 0 0 0 1 0 0 0 1
9 1 0 0 0 1 0 0 0 1
9 1 0 0 0 1 0 0 0 1
9 1 0 0 0 1 0 0 0 1
9 1 0 0 0 1 0 0 0 1
9 1 0 0 0 1 0 0 0 1
9 1 0 0 0 1 0 0 0 1
9 1 0 0 0 1 0 0 0 1
9 1 0 0 0 1 0 0 0 1
9 1 0 0 0 1 0 0 0 1
9 1 0 0 0 1 0 0 0 1
9 1 0 0 0 1 0 0 0 1
9 1 0 0 0 1 0 0 0 1
9 1 0 0 0 1 0 0 0 1
9 1 0 0 0 1 0 0 0 1
9 1 0 0 0 1 0 0 0 1
9 1 0 0 0 1 0 0 0 1
9 1 0 0 0 1 0 0 0 1
9 1 0 0 0 1 0 0 0 1
9 1 0 0 0 1 0 0 0 1
9 1 0 0 0 1 0 0 0 1
9 1 0 0 0 1 0 0 0 1
9 1 0 0 0 1 0 0 0 1
9 1 0 0 0 1 0 0 0 1
9 1 0 0 0 1 0 0 0 1
9 1 0 0 0 1 0 0 0 1
9 1 0 0 0 1 0 0 0 1
9 1 0 0 0 1 0 0 0 1
9 1 0 0 0 1 0 0 0 1
9 1 0 0 0 1 0 0 0 1
9 1 0 0 0 1 0 0 0 1
9 1 0 0 0 1 0 0 0 1
9 1 0 0 0 1 0 0 0 1
9 1 0 0 0 1 0 0 0 1
9 1 0 0 0 1 0 0 0 1
9 1 0 0 0 1 0 0 0 1
9 1 0 0 0 1 0 0 0 1
9 1 0 0 0 1 0 0 0 1
9 1 0 0 0 1 0 0 0 1
9 1 0 0 0 1 0 0 0 1
9 1 0 0 0 1 0 0 0 1
9 1 0 0 0 1 0 0 0 1
9 1 0 0 0 1 0 0 0 1
9 1 0 0 0 1 0 0 0 1
9 1 0 0 0 1 0 0 0 1
9 1 0 0 0 1 0 0 0 1
9 1 0 0 0 1 0 0 0 1
9 1 0 0 0 1 0 0 0 1
9 1 0 0 0 1 0 0 0 1
9 1 0 0 0 1 0 0 0 1
9 1 0 0 0 1 0 0 0 1
9 1 0 0 0 1 0 0 0 1
9 1 0 0 0 1 0 0 0 1
9 1 0 0 0 1 0 0 0 1
9 1 0 0 0 1 0 0 0 1
9 1 0 0 0 1 0 0 0 1
9 1 0 0 0 1 0 0 0 1
9 1 0 0 0 1 0 0 0 1
9 1 0 0 0 1 0 0 0 1
9 1 0 0 0 1 0 0 0 1
9 1 0 0 0 1 0 0 0 1
9 1 0 0 0 1 0 0 0 1
9 1 0 0 0 1 0 0 0 1
9 1 0 0 0 1 0 0 0 1
9 1 0 0 0 1 0 0 0 1
9 1 0 0 0 1 0 0 0 1
9 1 0 0 0 1 0 0 0 1
9 1 0 0 0 1 0 0 0 1
9 1 0 0 0 1 0 0 0 1
9 1 0 0 0 1 0 0 0 1
9 1 0 0 0 1 0 0 0 1
9 1 0 0 0 1 0 0 0 1
9 1 0 0 0 1 0 0 0 1
9 1 0 0 0 1 0 0 0 1
9 1 0 0 0 1 0 0 0 1
9 1 0 0 0 1 0 0 0 1
9 1 0 0 0 1 0 0 0 1
9 1 0 0 0 1 0 0 0 1
9 1 0 0 0 1 0 0 0 1
9 1 0 0 0 1 0 0 0 1
9 1 0 0 0 1 0 0 0 1
9 1 0 0 0 1 0 0 0 1
9 1 0 0 0 1 0 0 0 1
9 1 0 0 0 1 0 0 0 1
9 1 0 0 0 1 0 0 0 1
9 1 0 0 0 1 0 0 0 1
9 1 0 0 0 1 0 0 0 1
9 1 0 0 0 1 0 0 0 1
9 1 0 0 0 1 0 0 0 1
9 1 0 0 0 1 0 0 0 1
9 1 0 0 0 1 0 0 0 1
9 1 0 0 0 1 0 0 0 1
9 1 0 0 0 1 0 0 0 1
9 1 0 0 0 1 0 0 0 1
9 1 0 0 0 1 0 0 0 1
9 1 0 0 0 1 0 0 0 1
9 1 0 0 0 1 0 0 0 1
9 1 0 0 0 1 0 0 0 1
9 1 0 0 0 1 0 0 0 1
9 1 0 0 0 1 0 0 0 1
9 1 0 0 0 1 0 0 0 1
9 1 0 0 0 1 0 0 0 1
9 1 0 0 0 1 0 0 0 1
9 1 0 0 0 1 0 0 0 1
9 1 0 0 0 1 0 0 0 1
9 1 0 0 0 1 0 0 0 1
9 1 0 0 0 1 0 0 0 1
9 1 0 0 0 1 0 0 0 1
9 1 0 0 0 1 0 0 0 1
9 1 0 0 0 1 0 0 0 1
9 1 0 0 0 1 0 0 0 1
9 1 0 0 0 1 0 0 0 1
9 1 0 0 0 1 0 0 0 1
9 1 0 0 0 1 0 0 0 1
9 1 0 0 0 1 0 0 0 1
9 1 0 0 0 1 0 0 0 1
9 1 0 0 0 1 0 0 0 1
9 1 0 0 0 1 0 0 0 1
9 1 0 0 0 1 0 0 0 1
9 1 0 0 0 1 0 0 0 1
9 1 0 0 0 1 0 0 0 1
9 1 0 0 0 1 0 0 0 1
9 1 0 0 0 1 0 0 0 1
9 1 0 0 0 1 0 0 0 1
9 1 0 0 0 1 0 0 0 1
9 1 0 0 0 1 0 0 0 1
9 1 0 0 0 1 0 0 0 1
9 1 0 0 0 1 0 0 0 1
9 1 0 0 0 1 0 0 0 1
9 1 0 0 0 1 0 0 0 1
9 1 0 0 0 1 0 0 0 1
9 1 0 0 0 1 0 0 0 1
9 1 0 0 0 1 0 0 0 1
9 1 0 0 0 1 0 0 0 1
9 1 0 0 0 1 0 0 0 1
9 1 0 0 0 1 0 0 0 1
9 1 0 0 0 1 0 0 0 1
9 1 0 0 0 1 0 0 0 1
9 1 0 0 0 1 0 0 0 1
9 1 0 0 0 1 0 0 0 1
9 1 0 0 0 1 0 0 0 1
9 1 0 0 0 1 0 0 0 1
9 1 0 0 0 1 0 0 0 1
9 1 0 0 0 1 0 0 0 1
9 1 0 0 0 1 0 0 0 1
9 1 0 0 0 1 0 0 0 1
9 1 0 0 0 1 0 0 0 1
9 1 0 0 0 1 0 0 0 1
9 1 0 0 0 1 0 0 0 1
9 1 0 0 0 1 0 0 0 1
9 1 0 0 0 1 0 0 0 1
9 1 0 0 0 1 0 0 0 1
9 1 0 0 0 1 0 0 0 1
9 1 0 0 0 1 0 0 0 1
9 1 0 0 0 1 0 0 0 1
9 1 0 0 0 1 0 0 0 1
9 1 0 0 0 1 0 0 0 1
9 1 0 0 0 1 0 0 0 1
9 1 0 0 0 1 0 0 0 1
9 1 0 0 0 1 0 0 0 1
9 1 0 0 0 1 0 0 0 1
9 1 0 0 0 1 0 0 0 1
9 1 0 0 0 1 0 0 0 1
9 1 0 0 0 1 0 0 0 1
9 1 0 0 0 1 0 0 0 1
9 1 0 0 0 1 0 0 0 1
9 1 0 0 0 1 0 0 0 1
9 1 0 0 0 1 0 0 0 1
9 1 0 0 0 1 0 0 0 1
9 1 0 0 0 1 0 0 0 1
9 1 0 0 0 1 0 0 0 1
9 1 0 0 0 1 0 0 0 1
9 1 0 0 0 1 0 0 0 1
9 1 0 0 0 1 0 0 0 1
9 1 0 0 0 1 0 0 0 1
9 1 0 0 0 1 0 0 0 1
9 1 0 0 0 1 0 0 0 1
9 1 0 0 0 1 0 0 0 1
9 1 0 0 0 1 0 0 0 1
9 1 0 0 0 1 0 0 0 1
9 1 0 0 0 1 0 0 0 1
9 1 0 0 0 1 0 0 0 1
9 1 0 0 0 1 0 0 0 1
9 1 0 0 0 1 0 0 0 1
9 1 0 0 0 1 0 0 0 1
9 1 0 0 0 1 0 0 0 1
9 1 0 0 0 1 0 0 0 1
9 1 0 0 0 1 0 0 0 1
9 1 0 0 0 1 0 0 0 1
9 1 0 0 0 1 0 0 0 1
9 1 0 0 0 1 0 0 0 1
9 1 0 0 0 1 0 0 0 1
9 1 0 0 0 1 0 0 0 1
9 1 0 0 0 1 0 0 0 1
9 1 0 0 0 1 0 0 0 1
9 1 0 0 0 1 0 0 0 1
9 1 0 0 0 1 0 0 0 1
9 1 0 0 0 1 0 0 0 1
9 1 0 0 0 1 0 0 0 1
9 1 0 0 0 1 0 0 0 1
9 1 0 0 0 1 0 0 0 1
9 1 0 0 0 1 0 0 0 1
9 1 0 0 0 1 0 0 0 1
9 1 0 0 0 1 0 0 0 1
9 1 0 0 0 1 0 0 0 1
9 1 0 0 0 1 0 0 0 1
9 1 0 0 0 1 0 0 0 1
9 1 0 0 0 1 0 0 0 1
9 1 0 0 0 1 0 0 0 1
9 1 0 0 0 1 0 0 0 1
9 1 0 0 0 1 0 0 0 1
9 1 0 0 0 1 0 0 0 1
9 1 0 0 0 1 0 0 0 1
9 1 0 0 0 1 0 0 0 1
9 1 0 0 0 1 0 0 0 1
9 1 0 0 0 1 0 0 0 1
9 1 0 0 0 1 0 0 0 1
9 1 0 0 0 1 0 0 0 1
9 1 0 0 0 1 0 0 0 1
9 1 0 0 0 1 0 0 0 1
9 1 0 0 0 1 0 0 0 1
9 1 0 0 0 1 0 0 0 1
9 1 0 0 0 1 0 0 0 1
9 1 0 0 0 1 0 0 0 1
9 1 0 0 0 1 0 0 0 1
9 1 0 0 0 1 0 0 0 1
9 1 0 0 0 1 0 0 0 1
9 1 0 0 0 1 0 0 0 1
9 1 0 0 0 1 0 0 0 1
9 1 0 0 0 1 0 0 0 1
9 1 0 0 0 1 0 0 0 1
9 1 0 0 0 1 0 0 0 1
9 1 0 0 0 1 0 0 0 1
9 1 0 0 0 1 0 0 0 1
9 1 0 0 0 1 0 0 0 1
9 1 0 0 0 1 0 0 0 1
9 1 0 0 0 1 0 0 0 1
9 1 0 0 0 1 0 0 0 1
9 1 0 0 0 1 0 0 0 1
9 1 0 0 0 1 0 0 0 1
9 1 0 0 0 1 0 0 0 1
9 1 0 0 0 1 0 0 0 1
9 1 0 0 0 1 0 0 0 1
9 1 0 0 0 1 0 0 0 1
9 1 0 0 0 1 0 0 0 1
9 1 0 0 0 1 0 0 0 1
9 1 0 0 0 1 0 0 0 1
9 1 0 0 0 1 0 0 0 1
9 1 0 0 0 1 0 0 0 1
9 1 0 0 0 1 0 0 0 1
9 1 0 0 0 1 0 0 0 1
9 1 0 0 0 1 0 0 0 1
9 1 0 0 0 1 0 0 0 1
9 1 0 0 0 1 0 0 0 1
9 1 0 0 0 1 0 0 0 1
9 1 0 0 0 1 0 0 0 1
9 1 0 0 0 1 0 0 0 1
9 1 0 0 0 1 0 0 0 1
9 1 0 0 0 1 0 0 0 1
9 1 0 0 0 1 0 0 0 1
9 1 0 0 0 1 0 0 0 1
9 1 0 0 0 1 0 0 0 1
9 1 0 0 0 1 0 0 0 1
9 1 0 0 0 1 0 0 0 1
9 1 0 0 0 1 0 0 0 1
9 1 0 0 0 1 0 0 0 1
9 1 0 0 0 1 0 0 0 1
9 1 0 0 0 1 0 0 0 1
9 1 0 0 0 1 0 0 0 1
9 1 0 0 0 1 0 0 0 1
9 1 0 0 0 1 0 0 0 1
9 1 0 0 0 1 0 0 0 1
9 1 0 0 0 1 0 0 0 1
9 1 0 0 0 1 0 0 0 1
9 1 0 0 0 1 0 0 0 1
9 1 0 0 0 1 0 0 0 1
9 1 0 0 0 1 0 0 0 1
9 1 0 0 0 1 0 0 0 1
9 1 0 0 0 1 0 0 0 1
9 1 0 0 0 1 0 0 0 1
9 1 0 0 0 1 0 0 0 1
9 1 0 0 0 1 0 0 0 1
9 1 0 0 0 1 0 0 0 1
9 1 0 0 0 1 0 0 0 1
9 1 0 0 0 1 0 0 0 1
9 1 0 0 0 1 0 0 0 1
9 1 0 0 0 1 0 0 0 1
9 1 0 0 0 1 0 0 0 1
9 1 0 0 0 1 0 0 0 1
9 1 0 0 0 1 0 0 0 1
9 1 0 0 0 1 0 0 0 1
9 1 0 0 0 1 0 0 0 1
9 1 0 0 0 1 0 0 0 1
9 1 0 0 0 1 0 0 0 1
9 1 0 0 0 1 0 0 0 1
9 1 0 0 0 1 0 0 0 1
9 1 0 0 0 1 0 0 0 1
9 1 0 0 0 1 0 0 0 1
9 1 0 0 0 1 0 0 0 1
9 1 0 0 0 1 0 0 0 1
9 1 0 0 0 1 0 0 0 1
9 1 0 0 0 1 0 0 0 1
9 1 0 0 0 1 0 0 0 1
9 1 0 0 0 1 0 0 0 1
9 1 0 0 0 1 0 0 0 1
9 1 0 0 0 1 0 0 0 1
9 1 0 0 0 1 0 0 0 1
9 1 0 0 0 1 0 0 0 1
9 1 0 0 0 1 0 0 0 1
9 1 0 0 0 1 0 0 0 1
9 1 0 0 0 1 0 0 0 1
9 1 0 0 0 1 0 0 0 1
9 1 0 0 0 1 0 0 0 1
9 1 0 0 0 1 0 0 0 1
9 1 0 0 0 1 0 0 0 1
9 1 0 0 0 1 0 0 0 1
9 1 0 0 0 1 0 0 0 1
9 1 0 0 0 1 0 0 0 1
9 1 0 0 0 1 0 0 0 1
9 1 0 0 0 1 0 0 0 1
9 1 0 0 0 1 0 0 0 1
9 1 0 0 0 1 0 0 0 1
9 1 0 0 0 1 0 0 0 1
9 1 0 0 0 1 0 0 0 1
9 1 0 0 0 1 0 0 0 1
9 1 0 0 0 1 0 0 0 1
9 1 0 0 0 1 0 0 0 1
9 1 0 0 0 1 0 0 0 1
9 1 0 0 0 1 0 0 0 1
9 1 0 0 0 1 0 0 0 1
9 1 0 0 0 1 0 0 0 1
9 1 0 0 0 1 0 0 0 1
9 1 0 0 0 1 0 0 0 1
9 1 0 0 0 1 0 0 0 1
9 1 0 0 0 1 0 0 0 1
9 1 0 0 0 1 0 0 0 1
9 1 0 0 0 1 0 0 0 1
9 1 0 0 0 1 0 0 0 1
9 1 0 0 0 1 0 0 0 1
9 1 0 0 0 1 0 0 0 1
9 1 0 0 0 1 0 0 0 1
9 1 0 0 0 1 0 0 0 1
9 1 0 0 0 1 0 0 0 1
9 1 0 0 0 1 0 0 0 1
9 1 0 0 0 1 0 0 0 1
9 1 0 0 0 1 0 0 0 1
9 1 0 0 0 1 0 0 0 1
9 1 0 0 0 1 0 0 0 1
9 1 0 0 0 1 0 0 0 1
9 1 0 0 0 1 0 0 0 1
9 1 0 0 0 1 0 0 0 1
9 1 0 0 0 1 0 0 0 1
9 1 0 0 0 1 0 0 0 1
9 1 0 0 0 1 0 0 0 1
9 1 0 0 0 1 0 0 0 1
9 1 0 0 0 1 0 0 0 1
9 1 0 0 0 1 0 0 0 1
9 1 0 0 0 1 0 0 0 1
9 1 0 0 0 1 0 0 0 1
9 1 0 0 0 1 0 0 0 1
9 1 0 0 0 1 0 0 0 1
9 1 0 0 0 1 0 0 0 1
9 1 0 0 0 1 0 0 0 1
9 1 0 0 0 1 0 0 0 1
9 1 0 0 0 1 0 0 0 1
9 1 0 0 0 1 0 0 0 1
9 1 0 0 0 1 0 0 0 1
9 1 0 0 0 1 0 0 0 1
9 1 0 0 0 1 0 0 0 1
9 1 0 0 0 1 0 0 0 1
9 1 0 0 0 1 0 0 0 1
9 1 0 0 0 1 0 0 0 1
9 1 0 0 0 1 0 0 0 1
9 1 0 0 0 1 0 0 0 1
9 1 0 0 0 1 0 0 0 1
9 1 0 0 0 1 0 0 0 1
9 1 0 0 0 1 0 0 0 1
9 1 0 0 0 1 0 0 0 1
9 1 0 0 0 1 0 0 0 1
9 1 0 0 0 1 0 0 0 1
9 1 0 0 0 1 0 0 0 1
9 1 0 0 0 1 0 0 0 1
9 1 0 0 0 1 0 0 0 1
9 1 0 0 0 1 0 0 0 1
9 1 0 0 0 1 0 0 0 1
9 1 0 0 0 1 0 0 0 1
9 1 0 0 0 1 0 0 0 1
9 1 0 0 0 1 0 0 0 1
9 1 0 0 0 1 0 0 0 1
9 1 0 0 0 1 0 0 0 1
9 1 0 0 0 1 0 0 0 1
9 1 0 0 0 1 0 0 0 1
9 1 0 0 0 1 0 0 0 1
9 1 0 0 0 1 0 0 0 1
9 1 0 0 0 1 0 0 0 1
9 1 0 0 0 1 0 0 0 1
9 1 0 0 0 1 0 0 0 1
9 1 0 0 0 1 0 0 0 1
9 1 0 0 0 1 0 0 0 1
9 1 0 0 0 1 0 0 0 1
9 1 0 0 0 1 0 0 0 1
9 1 0 0 0 1 0 0 0 1
9 1 0 0 0 1 0 0 0 1
9 1 0 0 0 1 0 0 0 1
9 1 0 0 0 1 0 0 0 1
9 1 0 0 0 1 0 0 0 1
9 1 0 0 0 1 0 0 0 1
9 1 0 0 0 1 0 0 0 1
9 1 0 0 0 1 0 0 0 1
9 1 0 0 0 1 0 0 0 1
9 1 0 0 0 1 0 0 0 1
9 1 0 0 0 1 0 0 0 1
9 1 0 0 0 1 0 0 0 1
9 1 0 0 0 1 0 0 0 1
9 1 0 0 0 1 0 0 0 1
9 1 0 0 0 1 0 0 0 1
9 1 0 0 0 1 0 0 0 1
9 1 0 0 0 1 0 0 0 1
9 1 0 0 0 1 0 0 0 1
9 1 0 0 0 1 0 0 0 1
9 1 0 0 0 1 0 0 0 1
9 1 0 0 0 1 0 0 0 1
9 1 0 0 0 1 0 0 0 1
9 1 0 0 0 1 0 0 0 1
9 1 0 0 0 1 0 0 0 1
9 1 0 0 0 1 0 0 0 1
9 1 0 0 0 1 0 0 0 1
9 1 0 0 0 1 0 0 0 1
9 1 0 0 0 1 0 0 0 1
9 1 0 0 0 1 0 0 0 1
9 1 0 0 0 1 0 0 0 1
9 1 0 0 0 1 0 0 0 1
9 1 0 0 0 1 0 0 0 1
9 1 0 0 0 1 0 0 0 1
9 1 0 0 0 1 0 0 0 1
9 1 0 0 0 1 0 0 0 1
9 1 0 0 0 1 0 0 0 1
9 1 0 0 0 1 0 0 0 1
9 1 0 0 0 1 0 0 0 1
9 1 0 0 0 1 0 0 0 1
9 1 0 0 0 1 0 0 0 1
9 1 0 0 0 1 0 0 0 1
9 1 0 0 0 1 0 0 0 1
9 1 0 0 0 1 0 0 0 1
9 1 0 0 0 1 0 0 0 1
9 1 0 0 0 1 0 0 0 1
9 1 0 0 0 1 0 0 0 1
9 1 0 0 0 1 0 0 0 1
9 1 0 0 0 1 0 0 0 1
9 1 0 0 0 1 0 0 0 1
9 1 0 0 0 1 0 0 0 1
9 1 0 0 0 1 0 0 0 1
9 1 0 0 0 1 0 0 0 1
9 1 0 0 0 1 0 0 0 1
9 1 0 0 0 1 0 0 0 1
9 1 0 0 0 1 0 0 0 1
9 1 0 0 0 1 0 0 0 1
9 1 0 0 0 1 0 0 0 1
9 1 0 0 0 1 0 0 0 1
9 1 0 0 0 1 0 0 0 1
9 1 0 0 0 1 0 0 0 1
9 1 0 0 0 1 0 0 0 1
9 1 0 0 0 1 0 0 0 1
9 1 0 0 0 1 0 0 0 1
9 1 0 0 0 1 0 0 0 1
9 1 0 0 0 1 0 0 0 1
9 1 0 0 0 1 0 0 0 1
9 1 0 0 0 1 0 0 0 1
9 1 0 0 0 1 0 0 0 1
9 1 0 0 0 1 0 0 0 1
9 1 0 0 0 1 0 0 0 1
9 1 0 0 0 1 0 0 0 1
9 1 0 0 0 1 0 0 0 1
9 1 0 0 0 1 0 0 0 1
9 1 0 0 0 1 0 0 0 1
9 1 0 0 0 1 0 0 0 1
9 1 0 0 0 1 0 0 0 1
9 1 0 0 0 1 0 0 0 1
9 1 0 0 0 1 0 0 0 1
9 1 0 0 0 1 0 0 0 1
9 1 0 0 0 1 0 0 0 1
9 1 0 0 0 1 0 0 0 1
9 1 0 0 0 1 0 0 0 1
9 1 0 0 0 1 0 0 0 1
9 1 0 0 0 1 0 0 0 1
9 1 0 0 0 1 0 0 0 1
9 1 0 0 0 1 0 0 0 1
9 1 0 0 0 1 0 0 0 1
9 1 0 0 0 1 0 0 0 1
9 1 0 0 0 1 0 0 0 1
9 1 0 0 0 1 0 0 0 1
9 1 0 0 0 1 0 0 0 1
9 1 0 0 0 1 0 0 0 1
9 1 0 0 0 1 0 0 0 1
9 1 0 0 0 1 0 0 0 1
9 1 0 0 0 1 0 0 0 1
9 1 0 0 0 1 0 0 0 1
9 1 0 0 0 1 0 0 0 1
9 1 0 0 0 1 0 0 0 1
9 1 0 0 0 1 0 0 0 1
9 1 0 0 0 1 0 0 0 1
9 1 0 0 0 1 0 0 0 1
9 1 0 0 0 1 0 0 0 1
9 1 0 0 0 1 0 0 0 1
9 1 0 0 0 1 0 0 0 1
9 1 0 0 0 1 0 0 0 1
9 1 0 0 0 1 0 0 0 1
9 1 0 0 0 1 0 0 0 1
9 1 0 0 0 1 0 0 0 1
9 1 0 0 0 1 0 0 0 1
9 1 0 0 0 1 0 0 0 1
9 1 0 0 0 1 0 0 0 1
9 1 0 0 0 1 0 0 0 1
9 1 0 0 0 1 0 0 0 1
9 1 0 0 0 1 0 0 0 1
9 1 0 0 0 1 0 0 0 1
9 1 0 0 0 1 0 0 0 1
9 1 0 0 0 1 0 0 0 1
9 1 0 0 0 1 0 0 0 1
9 1 0 0 0 1 0 0 0 1
9 1 0 0 0 1 0 0 0 1
9 1 0 0 0 1 0 0 0 1
9 1 0 0 0 1 0 0 0 1
9 1 0 0 0 1 0 0 0 1
9 1 0 0 0 1 0 0 0 1
9 1 0 0 0 1 0 0 0 1
9 1 0 0 0 1 0 0 0 1
9 1 0 0 0 1 0 0 0 1
9 1 0 0 0 1 0 0 0 1
9 1 0 0 0 1 0 0 0 1
9 1 0 0 0 1 0 0 0 1
9 1 0 0 0 1 0 0 0 1
9 1 0 0 0 1 0 0 0 1
9 1 0 0 0 1 0 0 0 1
9 1 0 0 0 1 0 0 0 1
9 1 0 0 0 1 0 0 0 1
9 1 0 0 0 1 0 0 0 1
9 1 0 0 0 1 0 0 0 1
9 1 0 0 0 1 0 0 0 1
9 1 0 0 0 1 0 0 0 1
9 1 0 0 0 1 0 0 0 1
9 1 0 0 0 1 0 0 0 1
9 1 0 0 0 1 0 0 0 1
9 1 0 0 0 1 0 0 0 1
9 1 0 0 0 1 0 0 0 1
9 1 0 0 0 1 0 0 0 1
9 1 0 0 0 1 0 0 0 1
9 1 0 0 0 1 0 0 0 1
9 1 0 0 0 1 0 0 0 1
9 1 0 0 0 1 0 0 0 1
9 1 0 0 0 1 0 0 0 1
9 1 0 0 0 1 0 0 0 1
9 1 0 0 0 1 0 0 0 1
9 1 0 0 0 1 0 0 0 1
9 1 0 0 0 1 0 0 0 1
9 1 0 0 0 1 0 0 0 1
9 1 0 0 0 1 0 0 0 1
9 1 0 0 0 1 0 0 0 1
9 1 0 0 0 1 0 0 0 1
9 1 0 0 0 1 0 0 0 1
9 1 0 0 0 1 0 0 0 1
9 1 0 0 0 1 0 0 0 1
9 1 0 0 0 1 0 0 0 1
9 1 0 0 0 1 0 0 0 1
9 1 0 0 0 1 0 0 0 1
9 1 0 0 0 1 0 0 0 1
9 1 0 0 0 1 0 0 0 1
9 1 0 0 0 1 0 0 0 1
9 1 0 0 0 1 0 0 0 1
9 1 0 0 0 1 0 0 0 1
9 1 0 0 0 1 0 0 0 1
9 1 0 0 0 1 0 0 0 1
9 1 0 0 0 1 0 0 0 1
9 1 0 0 0 1 0 0 0 1
9 1 0 0 0 1 0 0 0 1
9 1 0 0 0 1 0 0 0 1
9 1 0 0 0 1 0 0 0 1
9 1 0 0 0 1 0 0 0 1
9 1 0 0 0 1 0 0 0 1
9 1 0 0 0 1 0 0 0 1
9 1 0 0 0 1 0 0 0 1
9 1 0 0 0 1 0 0 0 1
9 1 0 0 0 1 0 0 0 1
9 1 0 0 0 1 0 0 0 1
9 1 0 0 0 1 0 0 0 1
9 1 0 0 0 1 0 0 0 1
9 1 0 0 0 1 0 0 0 1
9 1 0 0 0 1 0 0 0 1
9 1 0 0 0 1 0 0 0 1
9 1 0 0 0 1 0 0 0 1
9 1 0 0 0 1 0 0 0 1
9 1 0 0 0 1 0 0 0 1
9 1 0 0 0 1 0 0 0 1
9 1 0 0 0 1 0 0 0 1
9 1 0 0 0 1 0 0 0 1
9 1 0 0 0 1 0 0 0 1
9 1 0 0 0 1 0 0 0 1
9 1 0 0 0 1 0 0 0 1
9 1 0 0 0 1 0 0 0 1
9 1 0 0 0 1 0 0 0 1
9 1 0 0 0 1 0 0 0 1
9 1 0 0 0 1 0 0 0 1
9 1 0 0 0 1 0 0 0 1
9 1 0 0 0 1 0 0 0 1
9 1 0 0 0 1 0 0 0 1
9 1 0 0 0 1 0 0 0 1
9 1 0 0 0 1 0 0 0 1
9 1 0 0 0 1 0 0 0 1
9 1 0 0 0 1 0 0 0 1
9 1 0 0 0 1 0 0 0 1
9 1 0 0 0 1 0 0 0 1
9 1 0 0 0 1 0 0 0 1
9 1 0 0 0 1 0 0 0 1
9 1 0 0 0 1 0 0 0 1
9 1 0 0 0 1 0 0 0 1
9 1 0 0 0 1 0 0 0 1
9 1 0 0 0 1 0 0 0 1
9 1 0 0 0 1 0 0 0 1
9 1 0 0 0 1 0 0 0 1
9 1 0 0 0 1 0 0 0 1
9 1 0 0 0 1 0 0 0 1
9 1 0 0 0 1 0 0 0 1
9 1 0 0 0 1 0 0 0 1
9 1 0 0 0 1 0 0 0 1
9 1 0 0 0 1 0 0 0 1
9 1 0 0 0 1 0 0 0 1
9 1 0 0 0 1 0 0 0 1
9 1 0 0 0 1 0 0 0 1
9 1 0 0 0 1 0 0 0 1
9 1 0 0 0 1 0 0 0 1
9 1 0 0 0 1 0 0 0 1
9 1 0 0 0 1 0 0 0 1
9 1 0 0 0 1 0 0 0 1
9 1 0 0 0 1 0 0 0 1
9 1 0 0 0 1 0 0 0 1
9 1 0 0 0 1 0 0 0 1
9 1 0 0 0 1 0 0 0 1
9 1 0 0 0 1 0 0 0 1
9 1 0 0 0 1 0 0 0 1
9 1 0 0 0 1 0 0 0 1
9 1 0 0 0 1 0 0 0 1
9 1 0 0 0 1 0 0 0 1
9 1 0 0 0 1 0 0 0 1
9 1 0 0 0 1 0 0 0 1
9 1 0 0 0 1 0 0 0 1
9 1 0 0 0 1 0 0 0 1
9 1 0 0 0 1 0 0 0 1
9 1 0 0 0 1 0 0 0 1
9 1 0 0 0 1 0 0 0 1
9 1 0 0 0 1 0 0 0 1
9 1 0 0 0 1 0 0 0 1
9 1 0 0 0 1 0 0 0 1
9 1 0 0 0 1 0 0 0 1
9 1 0 0 0 1 0 0 0 1
9 1 0 0 0 1 0 0 0 1
9 1 0 0 0 1 0 0 0 1
9 1 0 0 0 1 0 0 0 1
9 1 0 0 0 1 0 0 0 1
9 1 0 0 0 1 0 0 0 1
9 1 0 0 0 1 0 0 0 1
9 1 0 0 0 1 0 0 0 1
9 1 0 0 0 1 0 0 0 1
9 1 0 0 0 1 0 0 0 1
9 1 0 0 0 1 0 0 0 1
9 1 0 0 0 1 0 0 0 1
9 1 0 0 0 1 0 0 0 1
9 1 0 0 0 1 0 0 0 1
9 1 0 0 0 1 0 0 0 1
9 1 0 0 0 1 0 0 0 1
9 1 0 0 0 1 0 0 0 1
9 1 0 0 0 1 0 0 0 1
9 1 0 0 0 1 0 0 0 1
9 1 0 0 0 1 0 0 0 1
9 1 0 0 0 1 0 0 0 1
9 1 0 0 0 1 0 0 0 1
9 1 0 0 0 1 0 0 0 1
9 1 0 0 0 1 0 0 0 1
9 1 0 0 0 1 0 0 0 1
9 1 0 0 0 1 0 0 0 1
9 1 0 0 0 1 0 0 0 1
9 1 0 0 0 1 0 0 0 1
9 1 0 0 0 1 0 0 0 1
9 1 0 0 0 1 0 0 0 1
9 1 0 0 0 1 0 0 0 1
9 1 0 0 0 1 0 0 0 1
9 1 0 0 0 1 0 0 0 1
9 1 0 0 0 1 0 0 0 1
9 1 0 0 0 1 0 0 0 1
9 1 0 0 0 1 0 0 0 1
9 1 0 0 0 1 0 0 0 1
9 1 0 0 0 1 0 0 0 1
9 1 0 0 0 1 0 0 0 1
9 1 0 0 0 1 0 0 0 1
9 1 0 0 0 1 0 0 0 1
9 1 0 0 0 1 0 0 0 1
9 1 0 0 0 1 0 0 0 1
9 1 0 0 0 1 0 0 0 1
9 1 0 0 0 1 0 0 0 1
9 1 0 0 0 1 0 0 0 1
9 1 0 0 0 1 0 0 0 1
9 1 0 0 0 1 0 0 0 1
9 1 0 0 0 1 0 0 0 1
9 1 0 0 0 1 0 0 0 1
9 1 0 0 0 1 0 0 0 1
9 1 0 0 0 1 0 0 0 1
9 1 0 0 0 1 0 0 0 1
9 1 0 0 0 1 0 0 0 1
9 1 0 0 0 1 0 0 0 1
9 1 0 0 0 1 0 0 0 1
9 1 0 0 0 1 0 0 0 1
9 1 0 0 0 1 0 0 0 1
9 1 0 0 0 1 0 0 0 1
9 1 0 0 0 1 0 0 0 1
9 1 0 0 0 1 0 0 0 1
9 1 0 0 0 1 0 0 0 1
9 1 0 0 0 1 0 0 0 1
9 1 0 0 0 1 0 0 0 1
9 1 0 0 0 1 0 0 0 1
9 1 0 0 0 1 0 0 0 1
9 1 0 0 0 1 0 0 0 1
9 1 0 0 0 1 0 0 0 1
9 1 0 0 0 1 0 0 0 1
9 1 0 0 0 1 0 0 0 1
9 1 0 0 0 1 0 0 0 1
9 1 0 0 0 1 0 0 0 1
9 1 0 0 0 1 0 0 0 1
9 1 0 0 0 1 0 0 0 1
9 1 0 0 0 1 0 0 0 1
9 1 0 0 0 1 0 0 0 1
9 1 0 0 0 1 0 0 0 1
9 1 0 0 0 1 0 0 0 1
9 1 0 0 0 1 0 0 0 1
9 1 0 0 0 1 0 0 0 1
9 1 0 0 0 1 0 0 0 1
9 1 0 0 0 1 0 0 0 1
9 1 0 0 0 1 0 0 0 1
9 1 0 0 0 1 0 0 0 1
9 1 0 0 0 1 0 0 0 1
9 1 0 0 0 1 0 0 0 1
9 1 0 0 0 1 0 0 0 1
9 1 0 0 0 1 0 0 0 1
9 1 0 0 0 1 0 0 0 1
9 1 0 0 0 1 0 0 0 1
9 1 0 0 0 1 0 0 0 1
9 1 0 0 0 1 0 0 0 1
9 1 0 0 0 1 0 0 0 1
9 1 0 0 0 1 0 0 0 1
9 1 0 0 0 1 0 0 0 1
9 1 0 0 0 1 0 0 0 1
9 1 0 0 0 1 0 0 0 1
9 1 0 0 0 1 0 0 0 1
9 1 0 0 0 1 0 0 0 1
9 1 0 0 0 1 0 0 0 1
9 1 0 0 0 1 0 0 0 1
9 1 0 0 0 1 0 0 0 1
9 1 0 0 0 1 0 0 0 1
9 1 0 0 0 1 0 0 0 1
9 1 0 0 0 1 0 0 0 1
9 1 0 0 0 1 0 0 0 1
9 1 0 0 0 1 0 0 0 1
9 1 0 0 0 1 0 0 0 1
9 1 0 0 0 1 0 0 0 1
9 1 0 0 0 1 0 0 0 1
9 1 0 0 0 1 0 0 0 1
9 1 0 0 0 1 0 0 0 1
9 1 0 0 0 1 0 0 0 1
9 1 0 0 0 1 0 0 0 1
9 1 0 0 0 1 0 0 0 1
9 1 0 0 0 1 0 0 0 1
9 1 0 0 0 1 0 0 0 1
9 1 0 0 0 1 0 0 0 1
9 1 0 0 0 1 0 0 0 1
9 1 0 0 0 1 0 0 0 1
9 1 0 0 0 1 0 0 0 1
9 1 0 0 0 1 0 0 0 1
9 1 0 0 0 1 0 0 0 1
9 1 0 0 0 1 0 0 0 1
9 1 0 0 0 1 0 0 0 1
9 1 0 0 0 1 0 0 0 1
9 1 0 0 0 1 0 0 0 1
9 1 0 0 0 1 0 0 0 1
9 1 0 0 0 1 0 0 0 1
9 1 0 0 0 1 0 0 0 1
9 1 0 0 0 1 0 0 0 1
9 1 0 0 0 1 0 0 0 1
9 1 0 0 0 1 0 0 0 1
9 1 0 0 0 1 0 0 0 1
9 1 0 0 0 1 0 0 0 1
9 1 0 0 0 1 0 0 0 1
9 1 0 0 0 1 0 0 0 1
9 1 0 0 0 1 0 0 0 1
9 1 0 0 0 1 0 0 0 1
9 1 0 0 0 1 0 0 0 1
9 1 0 0 0 1 0 0 0 1
9 1 0 0 0 1 0 0 0 1
9 1 0 0 0 1 0 0 0 1
9 1 0 0 0 1 0 0 0 1
9 1 0 0 0 1 0 0 0 1
9 1 0 0 0 1 0 0 0 1
9 1 0 0 0 1 0 0 0 1
9 1 0 0 0 1 0 0 0 1
9 1 0 0 0 1 0 0 0 1
9 1 0 0 0 1 0 0 0 1
9 1 0 0 0 1 0 0 0 1
9 1 0 0 0 1 0 0 0 1
9 1 0 0 0 1 0 0 0 1
9 1 0 0 0 1 0 0 0 1
9 1 0 0 0 1 0 0 0 1
9 1 0 0 0 1 0 0 0 1
9 1 0 0 0 1 0 0 0 1
9 1 0 0 0 1 0 0 0 1
9 1 0 0 0 1 0 0 0 1
9 1 0 0 0 1 0 0 0 1
9 1 0 0 0 1 0 0 0 1
9 1 0 0 0 1 0 0 0 1
9 1 0 0 0 1 0 0 0 1
9 1 0 0 0 1 0 0 0 1
9 1 0 0 0 1 0 0 0 1
9 1 0 0 0 1 0 0 0 1
9 1 0 0 0 1 0 0 0 1
9 1 0 0 0 1 0 0 0 1
9 1 0 0 0 1 0 0 0 1
9 1 0 0 0 1 0 0 0 1
9 1 0 0 0 1 0 0 0 1
9 1 0 0 0 1 0 0 0 1
9 1 0 0 0 1 0 0 0 1
9 1 0 0 0 1 0 0 0 1
9 1 0 0 0 1 0 0 0 1
9 1 0 0 0 1 0 0 0 1
9 1 0 0 0 1 0 0 0 1
9 1 0 0 0 1 0 0 0 1
9 1 0 0 0 1 0 0 0 1
9 1 0 0 0 1 0 0 0 1
9 1 0 0 0 1 0 0 0 1
9 1 0 0 0 1 0 0 0 1
9 1 0 0 0 1 0 0 0 1
9 1 0 0 0 1 0 0 0 1
9 1 0 0 0 1 0 0 0 1
9 1 0 0 0 1 0 0 0 1
9 1 0 0 0 1 0 0 0 1
9 1 0 0 0 1 0 0 0 1
9 1 0 0 0 1 0 0 0 1
9 1 0 0 0 1 0 0 0 1
9 1 0 0 0 1 0 0 0 1
9 1 0 0 0 1 0 0 0 1
9 1 0 0 0 1 0 0 0 1
9 1 0 0 0 1 0 0 0 1
9 1 0 0 0 1 0 0 0 1
9 1 0 0 0 1 0 0 0 1
9 1 0 0 0 1 0 0 0 1
9 1 0 0 0 1 0 0 0 1
9 1 0 0 0 1 0 0 0 1
9 1 0 0 0 1 0 0 0 1
9 1 0 0 0 1 0 0 0 1
9 1 0 0 0 1 0 0 0 1
9 1 0 0 0 1 0 0 0 1
9 1 0 0 0 1 0 0 0 1
9 1 0 0 0 1 0 0 0 1
9 1 0 0 0 1 0 0 0 1
9 1 0 0 0 1 0 0 0 1
9 1 0 0 0 1 0 0 0 1
9 1 0 0 0 1 0 0 0 1
9 1 0 0 0 1 0 0 0 1
9 1 0 0 0 1 0 0 0 1
9 1 0 0 0 1 0 0 0 1
9 1 0 0 0 1 0 0 0 1
9 1 0 0 0 1 0 0 0 1
9 1 0 0 0 1 0 0 0 1
9 1 0 0 0 1 0 0 0 1
9 1 0 0 0 1 0 0 0 1
9 1 0 0 0 1 0 0 0 1
9 1 0 0 0 1 0 0 0 1
9 1 0 0 0 1 0 0 0 1
9 1 0 0 0 1 0 0 0 1
9 1 0 0 0 1 0 0 0 1
9 1 0 0 0 1 0 0 0 1
9 1 0 0 0 1 0 0 0 1
9 1 0 0 0 1 0 0 0 1
9 1 0 0 0 1 0 0 0 1
9 1 0 0 0 1 0 0 0 1
9 1 0 0 0 1 0 0 0 1
9 1 0 0 0 1 0 0 0 1
9 1 0 0 0 1 0 0 0 1
9 1 0 0 0 1 0 0 0 1
9 1 0 0 0 1 0 0 0 1
9 1 0 0 0 1 0 0 0 1
9 1 0 0 0 1 0 0 0 1
9 1 0 0 0 1 0 0 0 1
9 1 0 0 0 1 0 0 0 1
9 1 0 0 0 1 0 0 0 1
9 1 0 0 0 1 0 0 0 1
9 1 0 0 0 1 0 0 0 1
9 1 0 0 0 1 0 0 0 1
9 1 0 0 0 1 0 0 0 1
9 1 0 0 0 1 0 0 0 1
9 1 0 0 0 1 0 0 0 1
9 1 0 0 0 1 0 0 0 1
9 1 0 0 0 1 0 0 0 1
9 1 0 0 0 1 0 0 0 1
9 1 0 0 0 1 0 0 0 1
9 1 0 0 0 1 0 0 0 1
9 1 0 0 0 1 0 0 0 1
9 1 0 0 0 1 0 0 0 1
9 1 0 0 0 1 0 0 0 1
9 1 0 0 0 1 0 0 0 1
9 1 0 0 0 1 0 0 0 1
9 1 0 0 0 1 0 0 0 1
9 1 0 0 0 1 0 0 0 1
9 1 0 0 0 1 0 0 0 1
9 1 0 0 0 1 0 0 0 1
9 1 0 0 0 1 0 0 0 1
9 1 0 0 0 1 0 0 0 1
9 1 0 0 0 1 0 0 0 1
9 1 0 0 0 1 0 0 0 1
9 1 0 0 0 1 0 0 0 1
9 1 0 0 0 1 0 0 0 1
9 1 0 0 0 1 0 0 0 1
9 1 0 0 0 1 0 0 0 1
9 1 0 0 0 1 0 0 0 1
9 1 0 0 0 1 0 0 0 1
9 1 0 0 0 1 0 0 0 1
9 1 0 0 0 1 0 0 0 1
9 1 0 0 0 1 0 0 0 1
9 1 0 0 0 1 0 0 0 1
9 1 0 0 0 1 0 0 0 1
9 1 0 0 0 1 0 0 0 1
9 1 0 0 0 1 0 0 0 1
9 1 0 0 0 1 0 0 0 1
9 1 0 0 0 1 0 0 0 1
9 1 0 0 0 1 0 0 0 1
9 1 0 0 0 1 0 0 0 1
9 1 0 0 0 1 0 0 0 1
9 1 0 0 0 1 0 0 0 1
9 1 0 0 0 1 0 0 0 1
9 1 0 0 0 1 0 0 0 1
9 1 0 0 0 1 0 0 0 1
9 1 0 0 0 1 0 0 0 1
9 1 0 0 0 1 0 0 0 1
9 1 0 0 0 1 0 0 0 1
9 1 0 0 0 1 0 0 0 1
9 1 0 0 0 1 0 0 0 1
9 1 0 0 0 1 0 0 0 1
9 1 0 0 0 1 0 0 0 1
9 1 0 0 0 1 0 0 0 1
9 1 0 0 0 1 0 0 0 1
9 1 0 0 0 1 0 0 0 1
9 1 0 0 0 1 0 0 0 1
9 1 0 0 0 1 0 0 0 1
9 1 0 0 0 1 0 0 0 1
9 1 0 0 0 1 0 0 0 1
9 1 0 0 0 1 0 0 0 1
9 1 0 0 0 1 0 0 0 1
9 1 0 0 0 1 0 0 0 1
9 1 0 0 0 1 0 0 0 1
9 1 0 0 0 1 0 0 0 1
9 1 0 0 0 1 0 0 0 1
9 1 0 0 0 1 0 0 0 1
9 1 0 0 0 1 0 0 0 1
9 1 0 0 0 1 0 0 0 1
9 1 0 0 0 1 0 0 0 1
9 1 0 0 0 1 0 0 0 1
9 1 0 0 0 1 0 0 0 1
9 1 0 0 0 1 0 0 0 1
9 1 0 0 0 1 0 0 0 1
9 1 0 0 0 1 0 0 0 1
9 1 0 0 0 1 0 0 0 1
9 1 0 0 0 1 0 0 0 1
9 1 0 0 0 1 0 0 0 1
9 1 0 0 0 1 0 0 0 1
9 1 0 0 0 1 0 0 0 1
9 1 0 0 0 1 0 0 0 1
9 1 0 0 0 1 0 0 0 1
9 1 0 0 0 1 0 0 0 1
9 1 0 0 0 1 0 0 0 1
9 1 0 0 0 1 0 0 0 1
9 1 0 0 0 1 0 0 0 1
9 1 0 0 0 1 0 0 0 1
9 1 0 0 0 1 0 0 0 1
9 1 0 0 0 1 0 0 0 1
9 1 0 0 0 1 0 0 0 1
9 1 0 0 0 1 0 0 0 1
9 1 0 0 0 1 0 0 0 1
9 1 0 0 0 1 0 0 0 1
9 1 0 0 0 1 0 0 0 1
9 1 0 0 0 1 0 0 0 1
9 1 0 0 0 1 0 0 0 1
9 1 0 0 0 1 0 0 0 1
9 1 0 0 0 1 0 0 0 1
9 1 0 0 0 1 0 0 0 1
9 1 0 0 0 1 0 0 0 1
9 1 0 0 0 1 0 0 0 1
9 1 0 0 0 1 0 0 0 1
9 1 0 0 0 1 0 0 0 1
9 1 0 0 0 1 0 0 0 1
9 1 0 0 0 1 0 0 0 1
9 1 0 0 0 1 0 0 0 1
9 1 0 0 0 1 0 0 0 1
9 1 0 0 0 1 0 0 0 1
9 1 0 0 0 1 0 0 0 1
9 1 0 0 0 1 0 0 0 1
9 1 0 0 0 1 0 0 0 1
9 1 0 0 0 1 0 0 0 1
9 1 0 0 0 1 0 0 0 1
9 1 0 0 0 1 0 0 0 1
9 1 0 0 0 1 0 0 0 1
9 1 0 0 0 1 0 0 0 1
9 1 0 0 0 1 0 0 0 1
9 1 0 0 0 1 0 0 0 1
9 1 0 0 0 1 0 0 0 1
9 1 0 0 0 1 0 0 0 1
9 1 0 0 0 1 0 0 0 1
9 1 0 0 0 1 0 0 0 1
9 1 0 0 0 1 0 0 0 1
9 1 0 0 0 1 0 0 0 1
9 1 0 0 0 1 0 0 0 1
9 1 0 0 0 1 0 0 0 1
9 1 0 0 0 1 0 0 0 1
9 1 0 0 0 1 0 0 0 1
9 1 0 0 0 1 0 0 0 1
9 1 0 0 0 1 0 0 0 1
9 1 0 0 0 1 0 0 0 1
9 1 0 0 0 1 0 0 0 1
9 1 0 0 0 1 0 0 0 1
9 1 0 0 0 1 0 0 0 1
9 1 0 0 0 1 0 0 0 1
9 1 0 0 0 1 0 0 0 1
9 1 0 0 0 1 0 0 0 1
9 1 0 0 0 1 0 0 0 1
9 1 0 0 0 1 0 0 0 1
9 1 0 0 0 1 0 0 0 1
9 1 0 0 0 1 0 0 0 1
9 1 0 0 0 1 0 0 0 1
9 1 0 0 0 1 0 0 0 1
9 1 0 0 0 1 0 0 0 1
9 1 0 0 0 1 0 0 0 1
9 1 0 0 0 1 0 0 0 1
9 1 0 0 0 1 0 0 0 1
9 1 0 0 0 1 0 0 0 1
9 1 0 0 0 1 0 0 0 1
9 1 0 0 0 1 0 0 0 1
9 1 0 0 0 1 0 0 0 1
9 1 0 0 0 1 0 0 0 1
9 1 0 0 0 1 0 0 0 1
9 1 0 0 0 1 0 0 0 1
9 1 0 0 0 1 0 0 0 1
9 1 0 0 0 1 0 0 0 1
9 1 0 0 0 1 0 0 0 1
9 1 0 0 0 1 0 0 0 1
9 1 0 0 0 1 0 0 0 1
9 1 0 0 0 1 0 0 0 1
9 1 0 0 0 1 0 0 0 1
9 1 0 0 0 1 0 0 0 1
9 1 0 0 0 1 0 0 0 1
9 1 0 0 0 1 0 0 0 1
9 1 0 0 0 1 0 0 0 1
9 1 0 0 0 1 0 0 0 1
9 1 0 0 0 1 0 0 0 1
9 1 0 0 0 1 0 0 0 1
9 1 0 0 0 1 0 0 0 1
9 1 0 0 0 1 0 0 0 1
9 1 0 0 0 1 0 0 0 1
9 1 0 0 0 1 0 0 0 1
9 1 0 0 0 1 0 0 0 1
9 1 0 0 0 1 0 0 0 1
9 1 0 0 0 1 0 0 0 1
9 1 0 0 0 1 0 0 0 1
9 1 0 0 0 1 0 0 0 1
9 1 0 0 0 1 0 0 0 1
9 1 0 0 0 1 0 0 0 1
9 1 0 0 0 1 0 0 0 1
9 1 0 0 0 1 0 0 0 1
9 1 0 0 0 1 0 0 0 1
9 1 0 0 0 1 0 0 0 1
9 1 0 0 0 1 0 0 0 1
9 1 0 0 0 1 0 0 0 1
9 1 0 0 0 1 0 0 0 1
9 1 0 0 0 1 0 0 0 1
9 1 0 0 0 1 0 0 0 1
9 1 0 0 0 1 0 0 0 1
9 1 0 0 0 1 0 0 0 1
9 1 0 0 0 1 0 0 0 1
9 1 0 0 0 1 0 0 0 1
9 1 0 0 0 1 0 0 0 1
9 1 0 0 0 1 0 0 0 1
9 1 0 0 0 1 0 0 0 1
9 1 0 0 0 1 0 0 0 1
9 1 0 0 0 1 0 0 0 1
9 1 0 0 0 1 0 0 0 1
9 1 0 0 0 1 0 0 0 1
9 1 0 0 0 1 0 0 0 1
9 1 0 0 0 1 0 0 0 1
9 1 0 0 0 1 0 0 0 1
9 1 0 0 0 1 0 0 0 1
9 1 0 0 0 1 0 0 0 1
9 1 0 0 0 1 0 0 0 1
9 1 0 0 0 1 0 0 0 1
9 1 0 0 0 1 0 0 0 1
9 1 0 0 0 1 0 0 0 1
9 1 0 0 0 1 0 0 0 1
9 1 0 0 0 1 0 0 0 1
9 1 0 0 0 1 0 0 0 1
9 1 0 0 0 1 0 0 0 1
9 1 0 0 0 1 0 0 0 1
9 1 0 0 0 1 0 0 0 1
9 1 0 0 0 1 0 0 0 1
9 1 0 0 0 1 0 0 0 1
9 1 0 0 0 1 0 0 0 1
9 1 0 0 0 1 0 0 0 1
9 1 0 0 0 1 0 0 0 1
9 1 0 0 0 1 0 0 0 1
9 1 0 0 0 1 0 0 0 1
9 1 0 0 0 1 0 0 0 1
9 1 0 0 0 1 0 0 0 1
9 1 0 0 0 1 0 0 0 1
9 1 0 0 0 1 0 0 0 1
9 1 0 0 0 1 0 0 0 1
9 1 0 0 0 1 0 0 0 1
9 1 0 0 0 1 0 0 0 1
9 1 0 0 0 1 0 0 0 1
9 1 0 0 0 1 0 0 0 1
9 1 0 0 0 1 0 0 0 1
9 1 0 0 0 1 0 0 0 1
9 1 0 0 0 1 0 0 0 1
9 1 0 0 0 1 0 0 0 1
9 1 0 0 0 1 0 0 0 1
9 1 0 0 0 1 0 0 0 1
9 1 0 0 0 1 0 0 0 1
9 1 0 0 0 1 0 0 0 1
9 1 0 0 0 1 0 0 0 1
9 1 0 0 0 1 0 0 0 1
9 1 0 0 0 1 0 0 0 1
9 1 0 0 0 1 0 0 0 1
9 1 0 0 0 1 0 0 0 1
9 1 0 0 0 1 0 0 0 1
9 1 0 0 0 1 0 0 0 1
9 1 0 0 0 1 0 0 0 1
9 1 0 0 0 1 0 0 0 1
9 1 0 0 0 1 0 0 0 1
9 1 0 0 0 1 0 0 0 1
9 1 0 0 0 1 0 0 0 1
9 1 0 0 0 1 0 0 0 1
9 1 0 0 0 1 0 0 0 1
9 1 0 0 0 1 0 0 0 1
9 1 0 0 0 1 0 0 0 1
9 1 0 0 0 1 0 0 0 1
9 1 0 0 0 1 0 0 0 1
9 1 0 0 0 1 0 0 0 1
9 1 0 0 0 1 0 0 0 1
9 1 0 0 0 1 0 0 0 1
9 1 0 0 0 1 0 0 0 1
9 1 0 0 0 1 0 0 0 1
9 1 0 0 0 1 0 0 0 1
9 1 0 0 0 1 0 0 0 1
9 1 0 0 0 1 0 0 0 1
9 1 0 0 0 1 0 0 0 1
9 1 0 0 0 1 0 0 0 1
9 1 0 0 0 1 0 0 0 1
9 1 0 0 0 1 0 0 0 1
9 1 0 0 0 1 0 0 0 1
9 1 0 0 0 1 0 0 0 1
9 1 0 0 0 1 0 0 0 1
9 1 0 0 0 1 0 0 0 1
9 1 0 0 0 1 0 0 0 1
9 1 0 0 0 1 0 0 0 1
9 1 0 0 0 1 0 0 0 1
9 1 0 0 0 1 0 0 0 1
9 1 0 0 0 1 0 0 0 1
9 1 0 0 0 1 0 0 0 1
9 1 0 0 0 1 0 0 0 1
9 1 0 0 0 1 0 0 0 1
9 1 0 0 0 1 0 0 0 1
9 1 0 0 0 1 0 0 0 1
9 1 0 0 0 1 0 0 0 1
9 1 0 0 0 1 0 0 0 1
9 1 0 0 0 1 0 0 0 1
9 1 0 0 0 1 0 0 0 1
9 1 0 0 0 1 0 0 0 1
9 1 0 0 0 1 0 0 0 1
9 1 0 0 0 1 0 0 0 1
9 1 0 0 0 1 0 0 0 1
9 1 0 0 0 1 0 0 0 1
9 1 0 0 0 1 0 0 0 1
9 1 0 0 0 1 0 0 0 1
9 1 0 0 0 1 0 0 0 1
9 1 0 0 0 1 0 0 0 1
9 1 0 0 0 1 0 0 0 1
9 1 0 0 0 1 0 0 0 1
9 1 0 0 0 1 0 0 0 1
9 1 0 0 0 1 0 0 0 1
9 1 0 0 0 1 0 0 0 1
9 1 0 0 0 1 0 0 0 1
