POINTS:
0.0 0.0
0.0 0.5
0.0 1.0
0.5 0.0
0.5 0.5
0.5 1.0
1.0 0.0
1.0 0.5
1.0 1.0
CELLS:
4 0 0 3 4 1
4 0 1 4 5 2
4 0 3 6 7 4
4 0 4 7 8 5
FACES:
2 1 0 1
2 1 6 7
2 1 1 2
2 1 7 8
2 1 2 5
2 1 0 3
2 1 5 8
2 1 3 6
VDATA:
3 -10 0 0
3 -10 0 0
3 -10 0 0
3 -10 0 0
3 -10 0 0
3 -10 0 0
3 -10 0 0
3 -10 0 0
3 -10 0 0
CDATA:
9 1 0 0 0 1 0 0 0 1
9 1 0 0 0 1 0 0 0 1
9 1 0 0 0 1 0 0 0 1
9 1 0 0 0 1 0 0 0 1
