POINTS:
0.0 0.0
0.0 1.0
1.0 0.0
1.0 1.0
CELLS:
3 0 0 2 3
3 0 0 3 1
FACES:
2 1 0 1
2 1 2 3
2 1 1 3
2 1 0 2
VDATA:
3 -10 0 0
3 -10 0 0
3 -10 0 0
3 -10 0 0
CDATA:
9 1 0 0 0 1 0 0 0 1
9 1 0 0 0 1 0 0 0 1
