HEADER:
Checked=true
WithData=true
Cellformat=Vtu
POINTS:
0 0 0
0 0 1
0 1 0
0 1 1
1 0 0
1 0 1
1 1 0
1 1 1
CELLS:
10 0 0 2 3 7 
10 0 0 6 2 7 
10 0 0 4 6 7 
10 0 0 5 4 7 
10 0 0 1 5 7 
10 0 0 3 1 7 
FACES:
199 0 2 3 
199 0 3 1 
230 4 6 7 
230 4 7 5 
232 7 5 1 
232 7 1 3 
232 6 4 0 
232 6 0 2 
232 0 4 5 
232 0 5 1 
232 2 6 7 
232 2 7 3 
VDATA:
-10 0 0 
-10 0 0 
-10 0 0 
-10 0 0 
-10 0 0 
-10 0 0 
-10 0 0 
-10 0 0 
CDATA:
1 0 0 0 1 0 0 0 1 
1 0 0 0 1 0 0 0 1 
1 0 0 0 1 0 0 0 1 
1 0 0 0 1 0 0 0 1 
1 0 0 0 1 0 0 0 1 
1 0 0 0 1 0 0 0 1 
