POINTS:
0.0 0.0 0.0
0.0 0.0 0.5
0.0 0.0 1.0
0.0 0.0 1.5
0.0 0.0 2.0
0.0 0.0 2.5
0.0 0.0 3.0
0.0 0.5 0.0
0.0 0.5 0.5
0.0 0.5 1.0
0.0 0.5 1.5
0.0 0.5 2.0
0.0 0.5 2.5
0.0 0.5 3.0
0.0 1.0 0.0
0.0 1.0 0.5
0.0 1.0 1.0
0.0 1.0 1.5
0.0 1.0 2.0
0.0 1.0 2.5
0.0 1.0 3.0
0.0 1.5 0.0
0.0 1.5 0.5
0.0 1.5 1.0
0.0 1.5 1.5
0.0 1.5 2.0
0.0 1.5 2.5
0.0 1.5 3.0
0.0 2.0 0.0
0.0 2.0 0.5
0.0 2.0 1.0
0.0 2.0 1.5
0.0 2.0 2.0
0.0 2.0 2.5
0.0 2.0 3.0
0.0 2.5 0.0
0.0 2.5 0.5
0.0 2.5 1.0
0.0 2.5 1.5
0.0 2.5 2.0
0.0 2.5 2.5
0.0 2.5 3.0
0.0 3.0 0.0
0.0 3.0 0.5
0.0 3.0 1.0
0.0 3.0 1.5
0.0 3.0 2.0
0.0 3.0 2.5
0.0 3.0 3.0
0.0 3.5 0.0
0.0 3.5 0.5
0.0 3.5 1.0
0.0 3.5 1.5
0.0 3.5 2.0
0.0 3.5 2.5
0.0 3.5 3.0
0.0 4.0 0.0
0.0 4.0 0.5
0.0 4.0 1.0
0.0 4.0 1.5
0.0 4.0 2.0
0.0 4.0 2.5
0.0 4.0 3.0
0.5 0.0 0.0
0.5 0.0 0.5
0.5 0.0 1.0
0.5 0.0 1.5
0.5 0.0 2.0
0.5 0.0 2.5
0.5 0.0 3.0
0.5 0.5 0.0
0.5 0.5 0.5
0.5 0.5 1.0
0.5 0.5 1.5
0.5 0.5 2.0
0.5 0.5 2.5
0.5 0.5 3.0
0.5 1.0 0.0
0.5 1.0 0.5
0.5 1.0 1.0
0.5 1.0 1.5
0.5 1.0 2.0
0.5 1.0 2.5
0.5 1.0 3.0
0.5 1.5 0.0
0.5 1.5 0.5
0.5 1.5 1.0
0.5 1.5 1.5
0.5 1.5 2.0
0.5 1.5 2.5
0.5 1.5 3.0
0.5 2.0 0.0
0.5 2.0 0.5
0.5 2.0 1.0
0.5 2.0 1.5
0.5 2.0 2.0
0.5 2.0 2.5
0.5 2.0 3.0
0.5 2.5 0.0
0.5 2.5 0.5
0.5 2.5 1.0
0.5 2.5 1.5
0.5 2.5 2.0
0.5 2.5 2.5
0.5 2.5 3.0
0.5 3.0 0.0
0.5 3.0 0.5
0.5 3.0 1.0
0.5 3.0 1.5
0.5 3.0 2.0
0.5 3.0 2.5
0.5 3.0 3.0
0.5 3.5 0.0
0.5 3.5 0.5
0.5 3.5 1.0
0.5 3.5 1.5
0.5 3.5 2.0
0.5 3.5 2.5
0.5 3.5 3.0
0.5 4.0 0.0
0.5 4.0 0.5
0.5 4.0 1.0
0.5 4.0 1.5
0.5 4.0 2.0
0.5 4.0 2.5
0.5 4.0 3.0
1.0 0.0 0.0
1.0 0.0 0.5
1.0 0.0 1.0
1.0 0.0 1.5
1.0 0.0 2.0
1.0 0.0 2.5
1.0 0.0 3.0
1.0 0.5 0.0
1.0 0.5 0.5
1.0 0.5 1.0
1.0 0.5 1.5
1.0 0.5 2.0
1.0 0.5 2.5
1.0 0.5 3.0
1.0 1.0 0.0
1.0 1.0 0.5
1.0 1.0 1.0
1.0 1.0 1.5
1.0 1.0 2.0
1.0 1.0 2.5
1.0 1.0 3.0
1.0 1.5 0.0
1.0 1.5 0.5
1.0 1.5 1.0
1.0 1.5 1.5
1.0 1.5 2.0
1.0 1.5 2.5
1.0 1.5 3.0
1.0 2.0 0.0
1.0 2.0 0.5
1.0 2.0 1.0
1.0 2.0 1.5
1.0 2.0 2.0
1.0 2.0 2.5
1.0 2.0 3.0
1.0 2.5 0.0
1.0 2.5 0.5
1.0 2.5 1.0
1.0 2.5 1.5
1.0 2.5 2.0
1.0 2.5 2.5
1.0 2.5 3.0
1.0 3.0 0.0
1.0 3.0 0.5
1.0 3.0 1.0
1.0 3.0 1.5
1.0 3.0 2.0
1.0 3.0 2.5
1.0 3.0 3.0
1.0 3.5 0.0
1.0 3.5 0.5
1.0 3.5 1.0
1.0 3.5 1.5
1.0 3.5 2.0
1.0 3.5 2.5
1.0 3.5 3.0
1.0 4.0 0.0
1.0 4.0 0.5
1.0 4.0 1.0
1.0 4.0 1.5
1.0 4.0 2.0
1.0 4.0 2.5
1.0 4.0 3.0
1.5 0.0 0.0
1.5 0.0 0.5
1.5 0.0 1.0
1.5 0.0 1.5
1.5 0.0 2.0
1.5 0.0 2.5
1.5 0.0 3.0
1.5 0.5 0.0
1.5 0.5 0.5
1.5 0.5 1.0
1.5 0.5 1.5
1.5 0.5 2.0
1.5 0.5 2.5
1.5 0.5 3.0
1.5 1.0 0.0
1.5 1.0 0.5
1.5 1.0 1.0
1.5 1.0 1.5
1.5 1.0 2.0
1.5 1.0 2.5
1.5 1.0 3.0
1.5 1.5 0.0
1.5 1.5 0.5
1.5 1.5 1.0
1.5 1.5 1.5
1.5 1.5 2.0
1.5 1.5 2.5
1.5 1.5 3.0
1.5 2.0 0.0
1.5 2.0 0.5
1.5 2.0 1.0
1.5 2.0 1.5
1.5 2.0 2.0
1.5 2.0 2.5
1.5 2.0 3.0
1.5 2.5 0.0
1.5 2.5 0.5
1.5 2.5 1.0
1.5 2.5 1.5
1.5 2.5 2.0
1.5 2.5 2.5
1.5 2.5 3.0
1.5 3.0 0.0
1.5 3.0 0.5
1.5 3.0 1.0
1.5 3.0 1.5
1.5 3.0 2.0
1.5 3.0 2.5
1.5 3.0 3.0
1.5 3.5 0.0
1.5 3.5 0.5
1.5 3.5 1.0
1.5 3.5 1.5
1.5 3.5 2.0
1.5 3.5 2.5
1.5 3.5 3.0
1.5 4.0 0.0
1.5 4.0 0.5
1.5 4.0 1.0
1.5 4.0 1.5
1.5 4.0 2.0
1.5 4.0 2.5
1.5 4.0 3.0
2.0 0.0 0.0
2.0 0.0 0.5
2.0 0.0 1.0
2.0 0.0 1.5
2.0 0.0 2.0
2.0 0.0 2.5
2.0 0.0 3.0
2.0 0.5 0.0
2.0 0.5 0.5
2.0 0.5 1.0
2.0 0.5 1.5
2.0 0.5 2.0
2.0 0.5 2.5
2.0 0.5 3.0
2.0 1.0 0.0
2.0 1.0 0.5
2.0 1.0 1.0
2.0 1.0 1.5
2.0 1.0 2.0
2.0 1.0 2.5
2.0 1.0 3.0
2.0 1.5 0.0
2.0 1.5 0.5
2.0 1.5 1.0
2.0 1.5 1.5
2.0 1.5 2.0
2.0 1.5 2.5
2.0 1.5 3.0
2.0 2.0 0.0
2.0 2.0 0.5
2.0 2.0 1.0
2.0 2.0 1.5
2.0 2.0 2.0
2.0 2.0 2.5
2.0 2.0 3.0
2.0 2.5 0.0
2.0 2.5 0.5
2.0 2.5 1.0
2.0 2.5 1.5
2.0 2.5 2.0
2.0 2.5 2.5
2.0 2.5 3.0
2.0 3.0 0.0
2.0 3.0 0.5
2.0 3.0 1.0
2.0 3.0 1.5
2.0 3.0 2.0
2.0 3.0 2.5
2.0 3.0 3.0
2.0 3.5 0.0
2.0 3.5 0.5
2.0 3.5 1.0
2.0 3.5 1.5
2.0 3.5 2.0
2.0 3.5 2.5
2.0 3.5 3.0
2.0 4.0 0.0
2.0 4.0 0.5
2.0 4.0 1.0
2.0 4.0 1.5
2.0 4.0 2.0
2.0 4.0 2.5
2.0 4.0 3.0
2.5 0.0 0.0
2.5 0.0 0.5
2.5 0.0 1.0
2.5 0.0 1.5
2.5 0.0 2.0
2.5 0.0 2.5
2.5 0.0 3.0
2.5 0.5 0.0
2.5 0.5 0.5
2.5 0.5 1.0
2.5 0.5 1.5
2.5 0.5 2.0
2.5 0.5 2.5
2.5 0.5 3.0
2.5 1.0 0.0
2.5 1.0 0.5
2.5 1.0 1.0
2.5 1.0 1.5
2.5 1.0 2.0
2.5 1.0 2.5
2.5 1.0 3.0
2.5 1.5 0.0
2.5 1.5 0.5
2.5 1.5 1.0
2.5 1.5 1.5
2.5 1.5 2.0
2.5 1.5 2.5
2.5 1.5 3.0
2.5 2.0 0.0
2.5 2.0 0.5
2.5 2.0 1.0
2.5 2.0 1.5
2.5 2.0 2.0
2.5 2.0 2.5
2.5 2.0 3.0
2.5 2.5 0.0
2.5 2.5 0.5
2.5 2.5 1.0
2.5 2.5 1.5
2.5 2.5 2.0
2.5 2.5 2.5
2.5 2.5 3.0
2.5 3.0 0.0
2.5 3.0 0.5
2.5 3.0 1.0
2.5 3.0 1.5
2.5 3.0 2.0
2.5 3.0 2.5
2.5 3.0 3.0
2.5 3.5 0.0
2.5 3.5 0.5
2.5 3.5 1.0
2.5 3.5 1.5
2.5 3.5 2.0
2.5 3.5 2.5
2.5 3.5 3.0
2.5 4.0 0.0
2.5 4.0 0.5
2.5 4.0 1.0
2.5 4.0 1.5
2.5 4.0 2.0
2.5 4.0 2.5
2.5 4.0 3.0
3.0 0.0 0.0
3.0 0.0 0.5
3.0 0.0 1.0
3.0 0.0 1.5
3.0 0.0 2.0
3.0 0.0 2.5
3.0 0.0 3.0
3.0 0.5 0.0
3.0 0.5 0.5
3.0 0.5 1.0
3.0 0.5 1.5
3.0 0.5 2.0
3.0 0.5 2.5
3.0 0.5 3.0
3.0 1.0 0.0
3.0 1.0 0.5
3.0 1.0 1.0
3.0 1.0 1.5
3.0 1.0 2.0
3.0 1.0 2.5
3.0 1.0 3.0
3.0 1.5 0.0
3.0 1.5 0.5
3.0 1.5 1.0
3.0 1.5 1.5
3.0 1.5 2.0
3.0 1.5 2.5
3.0 1.5 3.0
3.0 2.0 0.0
3.0 2.0 0.5
3.0 2.0 1.0
3.0 2.0 1.5
3.0 2.0 2.0
3.0 2.0 2.5
3.0 2.0 3.0
3.0 2.5 0.0
3.0 2.5 0.5
3.0 2.5 1.0
3.0 2.5 1.5
3.0 2.5 2.0
3.0 2.5 2.5
3.0 2.5 3.0
3.0 3.0 0.0
3.0 3.0 0.5
3.0 3.0 1.0
3.0 3.0 1.5
3.0 3.0 2.0
3.0 3.0 2.5
3.0 3.0 3.0
3.0 3.5 0.0
3.0 3.5 0.5
3.0 3.5 1.0
3.0 3.5 1.5
3.0 3.5 2.0
3.0 3.5 2.5
3.0 3.5 3.0
3.0 4.0 0.0
3.0 4.0 0.5
3.0 4.0 1.0
3.0 4.0 1.5
3.0 4.0 2.0
3.0 4.0 2.5
3.0 4.0 3.0
3.5 0.0 0.0
3.5 0.0 0.5
3.5 0.0 1.0
3.5 0.0 1.5
3.5 0.0 2.0
3.5 0.0 2.5
3.5 0.0 3.0
3.5 0.5 0.0
3.5 0.5 0.5
3.5 0.5 1.0
3.5 0.5 1.5
3.5 0.5 2.0
3.5 0.5 2.5
3.5 0.5 3.0
3.5 1.0 0.0
3.5 1.0 0.5
3.5 1.0 1.0
3.5 1.0 1.5
3.5 1.0 2.0
3.5 1.0 2.5
3.5 1.0 3.0
3.5 1.5 0.0
3.5 1.5 0.5
3.5 1.5 1.0
3.5 1.5 1.5
3.5 1.5 2.0
3.5 1.5 2.5
3.5 1.5 3.0
3.5 2.0 0.0
3.5 2.0 0.5
3.5 2.0 1.0
3.5 2.0 1.5
3.5 2.0 2.0
3.5 2.0 2.5
3.5 2.0 3.0
3.5 2.5 0.0
3.5 2.5 0.5
3.5 2.5 1.0
3.5 2.5 1.5
3.5 2.5 2.0
3.5 2.5 2.5
3.5 2.5 3.0
3.5 3.0 0.0
3.5 3.0 0.5
3.5 3.0 1.0
3.5 3.0 1.5
3.5 3.0 2.0
3.5 3.0 2.5
3.5 3.0 3.0
3.5 3.5 0.0
3.5 3.5 0.5
3.5 3.5 1.0
3.5 3.5 1.5
3.5 3.5 2.0
3.5 3.5 2.5
3.5 3.5 3.0
3.5 4.0 0.0
3.5 4.0 0.5
3.5 4.0 1.0
3.5 4.0 1.5
3.5 4.0 2.0
3.5 4.0 2.5
3.5 4.0 3.0
4.0 0.0 0.0
4.0 0.0 0.5
4.0 0.0 1.0
4.0 0.0 1.5
4.0 0.0 2.0
4.0 0.0 2.5
4.0 0.0 3.0
4.0 0.5 0.0
4.0 0.5 0.5
4.0 0.5 1.0
4.0 0.5 1.5
4.0 0.5 2.0
4.0 0.5 2.5
4.0 0.5 3.0
4.0 1.0 0.0
4.0 1.0 0.5
4.0 1.0 1.0
4.0 1.0 1.5
4.0 1.0 2.0
4.0 1.0 2.5
4.0 1.0 3.0
4.0 1.5 0.0
4.0 1.5 0.5
4.0 1.5 1.0
4.0 1.5 1.5
4.0 1.5 2.0
4.0 1.5 2.5
4.0 1.5 3.0
4.0 2.0 0.0
4.0 2.0 0.5
4.0 2.0 1.0
4.0 2.0 1.5
4.0 2.0 2.0
4.0 2.0 2.5
4.0 2.0 3.0
4.0 2.5 0.0
4.0 2.5 0.5
4.0 2.5 1.0
4.0 2.5 1.5
4.0 2.5 2.0
4.0 2.5 2.5
4.0 2.5 3.0
4.0 3.0 0.0
4.0 3.0 0.5
4.0 3.0 1.0
4.0 3.0 1.5
4.0 3.0 2.0
4.0 3.0 2.5
4.0 3.0 3.0
4.0 3.5 0.0
4.0 3.5 0.5
4.0 3.5 1.0
4.0 3.5 1.5
4.0 3.5 2.0
4.0 3.5 2.5
4.0 3.5 3.0
4.0 4.0 0.0
4.0 4.0 0.5
4.0 4.0 1.0
4.0 4.0 1.5
4.0 4.0 2.0
4.0 4.0 2.5
4.0 4.0 3.0
4.5 0.0 0.0
4.5 0.0 0.5
4.5 0.0 1.0
4.5 0.0 1.5
4.5 0.0 2.0
4.5 0.0 2.5
4.5 0.0 3.0
4.5 0.5 0.0
4.5 0.5 0.5
4.5 0.5 1.0
4.5 0.5 1.5
4.5 0.5 2.0
4.5 0.5 2.5
4.5 0.5 3.0
4.5 1.0 0.0
4.5 1.0 0.5
4.5 1.0 1.0
4.5 1.0 1.5
4.5 1.0 2.0
4.5 1.0 2.5
4.5 1.0 3.0
4.5 1.5 0.0
4.5 1.5 0.5
4.5 1.5 1.0
4.5 1.5 1.5
4.5 1.5 2.0
4.5 1.5 2.5
4.5 1.5 3.0
4.5 2.0 0.0
4.5 2.0 0.5
4.5 2.0 1.0
4.5 2.0 1.5
4.5 2.0 2.0
4.5 2.0 2.5
4.5 2.0 3.0
4.5 2.5 0.0
4.5 2.5 0.5
4.5 2.5 1.0
4.5 2.5 1.5
4.5 2.5 2.0
4.5 2.5 2.5
4.5 2.5 3.0
4.5 3.0 0.0
4.5 3.0 0.5
4.5 3.0 1.0
4.5 3.0 1.5
4.5 3.0 2.0
4.5 3.0 2.5
4.5 3.0 3.0
4.5 3.5 0.0
4.5 3.5 0.5
4.5 3.5 1.0
4.5 3.5 1.5
4.5 3.5 2.0
4.5 3.5 2.5
4.5 3.5 3.0
4.5 4.0 0.0
4.5 4.0 0.5
4.5 4.0 1.0
4.5 4.0 1.5
4.5 4.0 2.0
4.5 4.0 2.5
4.5 4.0 3.0
5.0 0.0 0.0
5.0 0.0 0.5
5.0 0.0 1.0
5.0 0.0 1.5
5.0 0.0 2.0
5.0 0.0 2.5
5.0 0.0 3.0
5.0 0.5 0.0
5.0 0.5 0.5
5.0 0.5 1.0
5.0 0.5 1.5
5.0 0.5 2.0
5.0 0.5 2.5
5.0 0.5 3.0
5.0 1.0 0.0
5.0 1.0 0.5
5.0 1.0 1.0
5.0 1.0 1.5
5.0 1.0 2.0
5.0 1.0 2.5
5.0 1.0 3.0
5.0 1.5 0.0
5.0 1.5 0.5
5.0 1.5 1.0
5.0 1.5 1.5
5.0 1.5 2.0
5.0 1.5 2.5
5.0 1.5 3.0
5.0 2.0 0.0
5.0 2.0 0.5
5.0 2.0 1.0
5.0 2.0 1.5
5.0 2.0 2.0
5.0 2.0 2.5
5.0 2.0 3.0
5.0 2.5 0.0
5.0 2.5 0.5
5.0 2.5 1.0
5.0 2.5 1.5
5.0 2.5 2.0
5.0 2.5 2.5
5.0 2.5 3.0
5.0 3.0 0.0
5.0 3.0 0.5
5.0 3.0 1.0
5.0 3.0 1.5
5.0 3.0 2.0
5.0 3.0 2.5
5.0 3.0 3.0
5.0 3.5 0.0
5.0 3.5 0.5
5.0 3.5 1.0
5.0 3.5 1.5
5.0 3.5 2.0
5.0 3.5 2.5
5.0 3.5 3.0
5.0 4.0 0.0
5.0 4.0 0.5
5.0 4.0 1.0
5.0 4.0 1.5
5.0 4.0 2.0
5.0 4.0 2.5
5.0 4.0 3.0
CELLS:
8 0 0 7 70 63 1 8 71 64
8 0 1 8 71 64 2 9 72 65
8 0 2 9 72 65 3 10 73 66
8 0 3 10 73 66 4 11 74 67
8 0 4 11 74 67 5 12 75 68
8 0 5 12 75 68 6 13 76 69
8 0 7 14 77 70 8 15 78 71
8 0 8 15 78 71 9 16 79 72
8 0 9 16 79 72 10 17 80 73
8 0 10 17 80 73 11 18 81 74
8 0 11 18 81 74 12 19 82 75
8 0 12 19 82 75 13 20 83 76
8 0 14 21 84 77 15 22 85 78
8 0 15 22 85 78 16 23 86 79
8 0 16 23 86 79 17 24 87 80
8 0 17 24 87 80 18 25 88 81
8 0 18 25 88 81 19 26 89 82
8 0 19 26 89 82 20 27 90 83
8 0 21 28 91 84 22 29 92 85
8 0 22 29 92 85 23 30 93 86
8 0 23 30 93 86 24 31 94 87
8 0 24 31 94 87 25 32 95 88
8 0 25 32 95 88 26 33 96 89
8 0 26 33 96 89 27 34 97 90
8 0 28 35 98 91 29 36 99 92
8 0 29 36 99 92 30 37 100 93
8 0 30 37 100 93 31 38 101 94
8 0 31 38 101 94 32 39 102 95
8 0 32 39 102 95 33 40 103 96
8 0 33 40 103 96 34 41 104 97
8 0 35 42 105 98 36 43 106 99
8 0 36 43 106 99 37 44 107 100
8 0 37 44 107 100 38 45 108 101
8 0 38 45 108 101 39 46 109 102
8 0 39 46 109 102 40 47 110 103
8 0 40 47 110 103 41 48 111 104
8 0 42 49 112 105 43 50 113 106
8 0 43 50 113 106 44 51 114 107
8 0 44 51 114 107 45 52 115 108
8 0 45 52 115 108 46 53 116 109
8 0 46 53 116 109 47 54 117 110
8 0 47 54 117 110 48 55 118 111
8 0 49 56 119 112 50 57 120 113
8 0 50 57 120 113 51 58 121 114
8 0 51 58 121 114 52 59 122 115
8 0 52 59 122 115 53 60 123 116
8 0 53 60 123 116 54 61 124 117
8 0 54 61 124 117 55 62 125 118
8 0 63 70 133 126 64 71 134 127
8 0 64 71 134 127 65 72 135 128
8 0 65 72 135 128 66 73 136 129
8 0 66 73 136 129 67 74 137 130
8 0 67 74 137 130 68 75 138 131
8 0 68 75 138 131 69 76 139 132
8 0 70 77 140 133 71 78 141 134
8 0 71 78 141 134 72 79 142 135
8 0 72 79 142 135 73 80 143 136
8 0 73 80 143 136 74 81 144 137
8 0 74 81 144 137 75 82 145 138
8 0 75 82 145 138 76 83 146 139
8 0 77 84 147 140 78 85 148 141
8 0 78 85 148 141 79 86 149 142
8 0 79 86 149 142 80 87 150 143
8 0 80 87 150 143 81 88 151 144
8 0 81 88 151 144 82 89 152 145
8 0 82 89 152 145 83 90 153 146
8 0 84 91 154 147 85 92 155 148
8 0 85 92 155 148 86 93 156 149
8 0 86 93 156 149 87 94 157 150
8 0 87 94 157 150 88 95 158 151
8 0 88 95 158 151 89 96 159 152
8 0 89 96 159 152 90 97 160 153
8 0 91 98 161 154 92 99 162 155
8 0 92 99 162 155 93 100 163 156
8 0 93 100 163 156 94 101 164 157
8 0 94 101 164 157 95 102 165 158
8 0 95 102 165 158 96 103 166 159
8 0 96 103 166 159 97 104 167 160
8 0 98 105 168 161 99 106 169 162
8 0 99 106 169 162 100 107 170 163
8 0 100 107 170 163 101 108 171 164
8 0 101 108 171 164 102 109 172 165
8 0 102 109 172 165 103 110 173 166
8 0 103 110 173 166 104 111 174 167
8 0 105 112 175 168 106 113 176 169
8 0 106 113 176 169 107 114 177 170
8 0 107 114 177 170 108 115 178 171
8 0 108 115 178 171 109 116 179 172
8 0 109 116 179 172 110 117 180 173
8 0 110 117 180 173 111 118 181 174
8 0 112 119 182 175 113 120 183 176
8 0 113 120 183 176 114 121 184 177
8 0 114 121 184 177 115 122 185 178
8 0 115 122 185 178 116 123 186 179
8 0 116 123 186 179 117 124 187 180
8 0 117 124 187 180 118 125 188 181
8 0 126 133 196 189 127 134 197 190
8 0 127 134 197 190 128 135 198 191
8 0 128 135 198 191 129 136 199 192
8 0 129 136 199 192 130 137 200 193
8 0 130 137 200 193 131 138 201 194
8 0 131 138 201 194 132 139 202 195
8 0 133 140 203 196 134 141 204 197
8 0 134 141 204 197 135 142 205 198
8 0 135 142 205 198 136 143 206 199
8 0 136 143 206 199 137 144 207 200
8 0 137 144 207 200 138 145 208 201
8 0 138 145 208 201 139 146 209 202
8 0 140 147 210 203 141 148 211 204
8 0 141 148 211 204 142 149 212 205
8 0 142 149 212 205 143 150 213 206
8 0 143 150 213 206 144 151 214 207
8 0 144 151 214 207 145 152 215 208
8 0 145 152 215 208 146 153 216 209
8 0 147 154 217 210 148 155 218 211
8 0 148 155 218 211 149 156 219 212
8 0 149 156 219 212 150 157 220 213
8 0 150 157 220 213 151 158 221 214
8 0 151 158 221 214 152 159 222 215
8 0 152 159 222 215 153 160 223 216
8 0 154 161 224 217 155 162 225 218
8 0 155 162 225 218 156 163 226 219
8 0 156 163 226 219 157 164 227 220
8 0 157 164 227 220 158 165 228 221
8 0 158 165 228 221 159 166 229 222
8 0 159 166 229 222 160 167 230 223
8 0 161 168 231 224 162 169 232 225
8 0 162 169 232 225 163 170 233 226
8 0 163 170 233 226 164 171 234 227
8 0 164 171 234 227 165 172 235 228
8 0 165 172 235 228 166 173 236 229
8 0 166 173 236 229 167 174 237 230
8 0 168 175 238 231 169 176 239 232
8 0 169 176 239 232 170 177 240 233
8 0 170 177 240 233 171 178 241 234
8 0 171 178 241 234 172 179 242 235
8 0 172 179 242 235 173 180 243 236
8 0 173 180 243 236 174 181 244 237
8 0 175 182 245 238 176 183 246 239
8 0 176 183 246 239 177 184 247 240
8 0 177 184 247 240 178 185 248 241
8 0 178 185 248 241 179 186 249 242
8 0 179 186 249 242 180 187 250 243
8 0 180 187 250 243 181 188 251 244
8 0 189 196 259 252 190 197 260 253
8 0 190 197 260 253 191 198 261 254
8 0 191 198 261 254 192 199 262 255
8 0 192 199 262 255 193 200 263 256
8 0 193 200 263 256 194 201 264 257
8 0 194 201 264 257 195 202 265 258
8 0 196 203 266 259 197 204 267 260
8 0 197 204 267 260 198 205 268 261
8 0 198 205 268 261 199 206 269 262
8 0 199 206 269 262 200 207 270 263
8 0 200 207 270 263 201 208 271 264
8 0 201 208 271 264 202 209 272 265
8 0 203 210 273 266 204 211 274 267
8 0 204 211 274 267 205 212 275 268
8 0 205 212 275 268 206 213 276 269
8 0 206 213 276 269 207 214 277 270
8 0 207 214 277 270 208 215 278 271
8 0 208 215 278 271 209 216 279 272
8 0 210 217 280 273 211 218 281 274
8 0 211 218 281 274 212 219 282 275
8 0 212 219 282 275 213 220 283 276
8 0 213 220 283 276 214 221 284 277
8 0 214 221 284 277 215 222 285 278
8 0 215 222 285 278 216 223 286 279
8 0 217 224 287 280 218 225 288 281
8 0 218 225 288 281 219 226 289 282
8 0 219 226 289 282 220 227 290 283
8 0 220 227 290 283 221 228 291 284
8 0 221 228 291 284 222 229 292 285
8 0 222 229 292 285 223 230 293 286
8 0 224 231 294 287 225 232 295 288
8 0 225 232 295 288 226 233 296 289
8 0 226 233 296 289 227 234 297 290
8 0 227 234 297 290 228 235 298 291
8 0 228 235 298 291 229 236 299 292
8 0 229 236 299 292 230 237 300 293
8 0 231 238 301 294 232 239 302 295
8 0 232 239 302 295 233 240 303 296
8 0 233 240 303 296 234 241 304 297
8 0 234 241 304 297 235 242 305 298
8 0 235 242 305 298 236 243 306 299
8 0 236 243 306 299 237 244 307 300
8 0 238 245 308 301 239 246 309 302
8 0 239 246 309 302 240 247 310 303
8 0 240 247 310 303 241 248 311 304
8 0 241 248 311 304 242 249 312 305
8 0 242 249 312 305 243 250 313 306
8 0 243 250 313 306 244 251 314 307
8 0 252 259 322 315 253 260 323 316
8 0 253 260 323 316 254 261 324 317
8 0 254 261 324 317 255 262 325 318
8 0 255 262 325 318 256 263 326 319
8 0 256 263 326 319 257 264 327 320
8 0 257 264 327 320 258 265 328 321
8 0 259 266 329 322 260 267 330 323
8 0 260 267 330 323 261 268 331 324
8 0 261 268 331 324 262 269 332 325
8 0 262 269 332 325 263 270 333 326
8 0 263 270 333 326 264 271 334 327
8 0 264 271 334 327 265 272 335 328
8 0 266 273 336 329 267 274 337 330
8 0 267 274 337 330 268 275 338 331
8 0 268 275 338 331 269 276 339 332
8 0 269 276 339 332 270 277 340 333
8 0 270 277 340 333 271 278 341 334
8 0 271 278 341 334 272 279 342 335
8 0 273 280 343 336 274 281 344 337
8 0 274 281 344 337 275 282 345 338
8 0 275 282 345 338 276 283 346 339
8 0 276 283 346 339 277 284 347 340
8 0 277 284 347 340 278 285 348 341
8 0 278 285 348 341 279 286 349 342
8 0 280 287 350 343 281 288 351 344
8 0 281 288 351 344 282 289 352 345
8 0 282 289 352 345 283 290 353 346
8 0 283 290 353 346 284 291 354 347
8 0 284 291 354 347 285 292 355 348
8 0 285 292 355 348 286 293 356 349
8 0 287 294 357 350 288 295 358 351
8 0 288 295 358 351 289 296 359 352
8 0 289 296 359 352 290 297 360 353
8 0 290 297 360 353 291 298 361 354
8 0 291 298 361 354 292 299 362 355
8 0 292 299 362 355 293 300 363 356
8 0 294 301 364 357 295 302 365 358
8 0 295 302 365 358 296 303 366 359
8 0 296 303 366 359 297 304 367 360
8 0 297 304 367 360 298 305 368 361
8 0 298 305 368 361 299 306 369 362
8 0 299 306 369 362 300 307 370 363
8 0 301 308 371 364 302 309 372 365
8 0 302 309 372 365 303 310 373 366
8 0 303 310 373 366 304 311 374 367
8 0 304 311 374 367 305 312 375 368
8 0 305 312 375 368 306 313 376 369
8 0 306 313 376 369 307 314 377 370
8 0 315 322 385 378 316 323 386 379
8 0 316 323 386 379 317 324 387 380
8 0 317 324 387 380 318 325 388 381
8 0 318 325 388 381 319 326 389 382
8 0 319 326 389 382 320 327 390 383
8 0 320 327 390 383 321 328 391 384
8 0 322 329 392 385 323 330 393 386
8 0 323 330 393 386 324 331 394 387
8 0 324 331 394 387 325 332 395 388
8 0 325 332 395 388 326 333 396 389
8 0 326 333 396 389 327 334 397 390
8 0 327 334 397 390 328 335 398 391
8 0 329 336 399 392 330 337 400 393
8 0 330 337 400 393 331 338 401 394
8 0 331 338 401 394 332 339 402 395
8 0 332 339 402 395 333 340 403 396
8 0 333 340 403 396 334 341 404 397
8 0 334 341 404 397 335 342 405 398
8 0 336 343 406 399 337 344 407 400
8 0 337 344 407 400 338 345 408 401
8 0 338 345 408 401 339 346 409 402
8 0 339 346 409 402 340 347 410 403
8 0 340 347 410 403 341 348 411 404
8 0 341 348 411 404 342 349 412 405
8 0 343 350 413 406 344 351 414 407
8 0 344 351 414 407 345 352 415 408
8 0 345 352 415 408 346 353 416 409
8 0 346 353 416 409 347 354 417 410
8 0 347 354 417 410 348 355 418 411
8 0 348 355 418 411 349 356 419 412
8 0 350 357 420 413 351 358 421 414
8 0 351 358 421 414 352 359 422 415
8 0 352 359 422 415 353 360 423 416
8 0 353 360 423 416 354 361 424 417
8 0 354 361 424 417 355 362 425 418
8 0 355 362 425 418 356 363 426 419
8 0 357 364 427 420 358 365 428 421
8 0 358 365 428 421 359 366 429 422
8 0 359 366 429 422 360 367 430 423
8 0 360 367 430 423 361 368 431 424
8 0 361 368 431 424 362 369 432 425
8 0 362 369 432 425 363 370 433 426
8 0 364 371 434 427 365 372 435 428
8 0 365 372 435 428 366 373 436 429
8 0 366 373 436 429 367 374 437 430
8 0 367 374 437 430 368 375 438 431
8 0 368 375 438 431 369 376 439 432
8 0 369 376 439 432 370 377 440 433
8 0 378 385 448 441 379 386 449 442
8 0 379 386 449 442 380 387 450 443
8 0 380 387 450 443 381 388 451 444
8 0 381 388 451 444 382 389 452 445
8 0 382 389 452 445 383 390 453 446
8 0 383 390 453 446 384 391 454 447
8 0 385 392 455 448 386 393 456 449
8 0 386 393 456 449 387 394 457 450
8 0 387 394 457 450 388 395 458 451
8 0 388 395 458 451 389 396 459 452
8 0 389 396 459 452 390 397 460 453
8 0 390 397 460 453 391 398 461 454
8 0 392 399 462 455 393 400 463 456
8 0 393 400 463 456 394 401 464 457
8 0 394 401 464 457 395 402 465 458
8 0 395 402 465 458 396 403 466 459
8 0 396 403 466 459 397 404 467 460
8 0 397 404 467 460 398 405 468 461
8 0 399 406 469 462 400 407 470 463
8 0 400 407 470 463 401 408 471 464
8 0 401 408 471 464 402 409 472 465
8 0 402 409 472 465 403 410 473 466
8 0 403 410 473 466 404 411 474 467
8 0 404 411 474 467 405 412 475 468
8 0 406 413 476 469 407 414 477 470
8 0 407 414 477 470 408 415 478 471
8 0 408 415 478 471 409 416 479 472
8 0 409 416 479 472 410 417 480 473
8 0 410 417 480 473 411 418 481 474
8 0 411 418 481 474 412 419 482 475
8 0 413 420 483 476 414 421 484 477
8 0 414 421 484 477 415 422 485 478
8 0 415 422 485 478 416 423 486 479
8 0 416 423 486 479 417 424 487 480
8 0 417 424 487 480 418 425 488 481
8 0 418 425 488 481 419 426 489 482
8 0 420 427 490 483 421 428 491 484
8 0 421 428 491 484 422 429 492 485
8 0 422 429 492 485 423 430 493 486
8 0 423 430 493 486 424 431 494 487
8 0 424 431 494 487 425 432 495 488
8 0 425 432 495 488 426 433 496 489
8 0 427 434 497 490 428 435 498 491
8 0 428 435 498 491 429 436 499 492
8 0 429 436 499 492 430 437 500 493
8 0 430 437 500 493 431 438 501 494
8 0 431 438 501 494 432 439 502 495
8 0 432 439 502 495 433 440 503 496
8 0 441 448 511 504 442 449 512 505
8 0 442 449 512 505 443 450 513 506
8 0 443 450 513 506 444 451 514 507
8 0 444 451 514 507 445 452 515 508
8 0 445 452 515 508 446 453 516 509
8 0 446 453 516 509 447 454 517 510
8 0 448 455 518 511 449 456 519 512
8 0 449 456 519 512 450 457 520 513
8 0 450 457 520 513 451 458 521 514
8 0 451 458 521 514 452 459 522 515
8 0 452 459 522 515 453 460 523 516
8 0 453 460 523 516 454 461 524 517
8 0 455 462 525 518 456 463 526 519
8 0 456 463 526 519 457 464 527 520
8 0 457 464 527 520 458 465 528 521
8 0 458 465 528 521 459 466 529 522
8 0 459 466 529 522 460 467 530 523
8 0 460 467 530 523 461 468 531 524
8 0 462 469 532 525 463 470 533 526
8 0 463 470 533 526 464 471 534 527
8 0 464 471 534 527 465 472 535 528
8 0 465 472 535 528 466 473 536 529
8 0 466 473 536 529 467 474 537 530
8 0 467 474 537 530 468 475 538 531
8 0 469 476 539 532 470 477 540 533
8 0 470 477 540 533 471 478 541 534
8 0 471 478 541 534 472 479 542 535
8 0 472 479 542 535 473 480 543 536
8 0 473 480 543 536 474 481 544 537
8 0 474 481 544 537 475 482 545 538
8 0 476 483 546 539 477 484 547 540
8 0 477 484 547 540 478 485 548 541
8 0 478 485 548 541 479 486 549 542
8 0 479 486 549 542 480 487 550 543
8 0 480 487 550 543 481 488 551 544
8 0 481 488 551 544 482 489 552 545
8 0 483 490 553 546 484 491 554 547
8 0 484 491 554 547 485 492 555 548
8 0 485 492 555 548 486 493 556 549
8 0 486 493 556 549 487 494 557 550
8 0 487 494 557 550 488 495 558 551
8 0 488 495 558 551 489 496 559 552
8 0 490 497 560 553 491 498 561 554
8 0 491 498 561 554 492 499 562 555
8 0 492 499 562 555 493 500 563 556
8 0 493 500 563 556 494 501 564 557
8 0 494 501 564 557 495 502 565 558
8 0 495 502 565 558 496 503 566 559
8 0 504 511 574 567 505 512 575 568
8 0 505 512 575 568 506 513 576 569
8 0 506 513 576 569 507 514 577 570
8 0 507 514 577 570 508 515 578 571
8 0 508 515 578 571 509 516 579 572
8 0 509 516 579 572 510 517 580 573
8 0 511 518 581 574 512 519 582 575
8 0 512 519 582 575 513 520 583 576
8 0 513 520 583 576 514 521 584 577
8 0 514 521 584 577 515 522 585 578
8 0 515 522 585 578 516 523 586 579
8 0 516 523 586 579 517 524 587 580
8 0 518 525 588 581 519 526 589 582
8 0 519 526 589 582 520 527 590 583
8 0 520 527 590 583 521 528 591 584
8 0 521 528 591 584 522 529 592 585
8 0 522 529 592 585 523 530 593 586
8 0 523 530 593 586 524 531 594 587
8 0 525 532 595 588 526 533 596 589
8 0 526 533 596 589 527 534 597 590
8 0 527 534 597 590 528 535 598 591
8 0 528 535 598 591 529 536 599 592
8 0 529 536 599 592 530 537 600 593
8 0 530 537 600 593 531 538 601 594
8 0 532 539 602 595 533 540 603 596
8 0 533 540 603 596 534 541 604 597
8 0 534 541 604 597 535 542 605 598
8 0 535 542 605 598 536 543 606 599
8 0 536 543 606 599 537 544 607 600
8 0 537 544 607 600 538 545 608 601
8 0 539 546 609 602 540 547 610 603
8 0 540 547 610 603 541 548 611 604
8 0 541 548 611 604 542 549 612 605
8 0 542 549 612 605 543 550 613 606
8 0 543 550 613 606 544 551 614 607
8 0 544 551 614 607 545 552 615 608
8 0 546 553 616 609 547 554 617 610
8 0 547 554 617 610 548 555 618 611
8 0 548 555 618 611 549 556 619 612
8 0 549 556 619 612 550 557 620 613
8 0 550 557 620 613 551 558 621 614
8 0 551 558 621 614 552 559 622 615
8 0 553 560 623 616 554 561 624 617
8 0 554 561 624 617 555 562 625 618
8 0 555 562 625 618 556 563 626 619
8 0 556 563 626 619 557 564 627 620
8 0 557 564 627 620 558 565 628 621
8 0 558 565 628 621 559 566 629 622
8 0 567 574 637 630 568 575 638 631
8 0 568 575 638 631 569 576 639 632
8 0 569 576 639 632 570 577 640 633
8 0 570 577 640 633 571 578 641 634
8 0 571 578 641 634 572 579 642 635
8 0 572 579 642 635 573 580 643 636
8 0 574 581 644 637 575 582 645 638
8 0 575 582 645 638 576 583 646 639
8 0 576 583 646 639 577 584 647 640
8 0 577 584 647 640 578 585 648 641
8 0 578 585 648 641 579 586 649 642
8 0 579 586 649 642 580 587 650 643
8 0 581 588 651 644 582 589 652 645
8 0 582 589 652 645 583 590 653 646
8 0 583 590 653 646 584 591 654 647
8 0 584 591 654 647 585 592 655 648
8 0 585 592 655 648 586 593 656 649
8 0 586 593 656 649 587 594 657 650
8 0 588 595 658 651 589 596 659 652
8 0 589 596 659 652 590 597 660 653
8 0 590 597 660 653 591 598 661 654
8 0 591 598 661 654 592 599 662 655
8 0 592 599 662 655 593 600 663 656
8 0 593 600 663 656 594 601 664 657
8 0 595 602 665 658 596 603 666 659
8 0 596 603 666 659 597 604 667 660
8 0 597 604 667 660 598 605 668 661
8 0 598 605 668 661 599 606 669 662
8 0 599 606 669 662 600 607 670 663
8 0 600 607 670 663 601 608 671 664
8 0 602 609 672 665 603 610 673 666
8 0 603 610 673 666 604 611 674 667
8 0 604 611 674 667 605 612 675 668
8 0 605 612 675 668 606 613 676 669
8 0 606 613 676 669 607 614 677 670
8 0 607 614 677 670 608 615 678 671
8 0 609 616 679 672 610 617 680 673
8 0 610 617 680 673 611 618 681 674
8 0 611 618 681 674 612 619 682 675
8 0 612 619 682 675 613 620 683 676
8 0 613 620 683 676 614 621 684 677
8 0 614 621 684 677 615 622 685 678
8 0 616 623 686 679 617 624 687 680
8 0 617 624 687 680 618 625 688 681
8 0 618 625 688 681 619 626 689 682
8 0 619 626 689 682 620 627 690 683
8 0 620 627 690 683 621 628 691 684
8 0 621 628 691 684 622 629 692 685
FACES:
4 100 0 7 8 1
4 0 630 637 638 631
4 100 1 8 9 2
4 0 631 638 639 632
4 100 2 9 10 3
4 0 632 639 640 633
4 100 3 10 11 4
4 0 633 640 641 634
4 100 4 11 12 5
4 0 634 641 642 635
4 100 5 12 13 6
4 0 635 642 643 636
4 100 7 14 15 8
4 0 637 644 645 638
4 100 8 15 16 9
4 0 638 645 646 639
4 100 9 16 17 10
4 0 639 646 647 640
4 100 10 17 18 11
4 0 640 647 648 641
4 100 11 18 19 12
4 0 641 648 649 642
4 100 12 19 20 13
4 0 642 649 650 643
4 100 14 21 22 15
4 0 644 651 652 645
4 100 15 22 23 16
4 0 645 652 653 646
4 100 16 23 24 17
4 0 646 653 654 647
4 100 17 24 25 18
4 0 647 654 655 648
4 100 18 25 26 19
4 0 648 655 656 649
4 100 19 26 27 20
4 0 649 656 657 650
4 100 21 28 29 22
4 0 651 658 659 652
4 100 22 29 30 23
4 0 652 659 660 653
4 100 23 30 31 24
4 0 653 660 661 654
4 100 24 31 32 25
4 0 654 661 662 655
4 100 25 32 33 26
4 0 655 662 663 656
4 100 26 33 34 27
4 0 656 663 664 657
4 100 28 35 36 29
4 0 658 665 666 659
4 100 29 36 37 30
4 0 659 666 667 660
4 100 30 37 38 31
4 0 660 667 668 661
4 100 31 38 39 32
4 0 661 668 669 662
4 100 32 39 40 33
4 0 662 669 670 663
4 100 33 40 41 34
4 0 663 670 671 664
4 100 35 42 43 36
4 0 665 672 673 666
4 100 36 43 44 37
4 0 666 673 674 667
4 100 37 44 45 38
4 0 667 674 675 668
4 100 38 45 46 39
4 0 668 675 676 669
4 100 39 46 47 40
4 0 669 676 677 670
4 100 40 47 48 41
4 0 670 677 678 671
4 100 42 49 50 43
4 0 672 679 680 673
4 100 43 50 51 44
4 0 673 680 681 674
4 100 44 51 52 45
4 0 674 681 682 675
4 100 45 52 53 46
4 0 675 682 683 676
4 100 46 53 54 47
4 0 676 683 684 677
4 100 47 54 55 48
4 0 677 684 685 678
4 100 49 56 57 50
4 0 679 686 687 680
4 100 50 57 58 51
4 0 680 687 688 681
4 100 51 58 59 52
4 0 681 688 689 682
4 100 52 59 60 53
4 0 682 689 690 683
4 100 53 60 61 54
4 0 683 690 691 684
4 100 54 61 62 55
4 0 684 691 692 685
4 101 70 63 0 7
4 0 76 69 6 13
4 101 77 70 7 14
4 0 83 76 13 20
4 101 84 77 14 21
4 0 90 83 20 27
4 101 91 84 21 28
4 0 97 90 27 34
4 101 98 91 28 35
4 0 104 97 34 41
4 101 105 98 35 42
4 0 111 104 41 48
4 101 112 105 42 49
4 0 118 111 48 55
4 101 119 112 49 56
4 0 125 118 55 62
4 101 133 126 63 70
4 0 139 132 69 76
4 101 140 133 70 77
4 0 146 139 76 83
4 101 147 140 77 84
4 0 153 146 83 90
4 101 154 147 84 91
4 0 160 153 90 97
4 101 161 154 91 98
4 0 167 160 97 104
4 101 168 161 98 105
4 0 174 167 104 111
4 101 175 168 105 112
4 0 181 174 111 118
4 101 182 175 112 119
4 0 188 181 118 125
4 101 196 189 126 133
4 0 202 195 132 139
4 101 203 196 133 140
4 0 209 202 139 146
4 101 210 203 140 147
4 0 216 209 146 153
4 101 217 210 147 154
4 0 223 216 153 160
4 101 224 217 154 161
4 0 230 223 160 167
4 101 231 224 161 168
4 0 237 230 167 174
4 101 238 231 168 175
4 0 244 237 174 181
4 101 245 238 175 182
4 0 251 244 181 188
4 101 259 252 189 196
4 0 265 258 195 202
4 101 266 259 196 203
4 0 272 265 202 209
4 101 273 266 203 210
4 0 279 272 209 216
4 101 280 273 210 217
4 0 286 279 216 223
4 101 287 280 217 224
4 0 293 286 223 230
4 101 294 287 224 231
4 0 300 293 230 237
4 101 301 294 231 238
4 0 307 300 237 244
4 101 308 301 238 245
4 0 314 307 244 251
4 101 322 315 252 259
4 0 328 321 258 265
4 101 329 322 259 266
4 0 335 328 265 272
4 101 336 329 266 273
4 0 342 335 272 279
4 101 343 336 273 280
4 0 349 342 279 286
4 101 350 343 280 287
4 0 356 349 286 293
4 101 357 350 287 294
4 0 363 356 293 300
4 101 364 357 294 301
4 0 370 363 300 307
4 101 371 364 301 308
4 0 377 370 307 314
4 101 385 378 315 322
4 0 391 384 321 328
4 101 392 385 322 329
4 0 398 391 328 335
4 101 399 392 329 336
4 0 405 398 335 342
4 101 406 399 336 343
4 0 412 405 342 349
4 101 413 406 343 350
4 0 419 412 349 356
4 101 420 413 350 357
4 0 426 419 356 363
4 101 427 420 357 364
4 0 433 426 363 370
4 101 434 427 364 371
4 0 440 433 370 377
4 101 448 441 378 385
4 0 454 447 384 391
4 101 455 448 385 392
4 0 461 454 391 398
4 101 462 455 392 399
4 0 468 461 398 405
4 101 469 462 399 406
4 0 475 468 405 412
4 101 476 469 406 413
4 0 482 475 412 419
4 101 483 476 413 420
4 0 489 482 419 426
4 101 490 483 420 427
4 0 496 489 426 433
4 101 497 490 427 434
4 0 503 496 433 440
4 101 511 504 441 448
4 0 517 510 447 454
4 101 518 511 448 455
4 0 524 517 454 461
4 101 525 518 455 462
4 0 531 524 461 468
4 101 532 525 462 469
4 0 538 531 468 475
4 101 539 532 469 476
4 0 545 538 475 482
4 101 546 539 476 483
4 0 552 545 482 489
4 101 553 546 483 490
4 0 559 552 489 496
4 101 560 553 490 497
4 0 566 559 496 503
4 101 574 567 504 511
4 0 580 573 510 517
4 101 581 574 511 518
4 0 587 580 517 524
4 101 588 581 518 525
4 0 594 587 524 531
4 101 595 588 525 532
4 0 601 594 531 538
4 101 602 595 532 539
4 0 608 601 538 545
4 101 609 602 539 546
4 0 615 608 545 552
4 101 616 609 546 553
4 0 622 615 552 559
4 101 623 616 553 560
4 0 629 622 559 566
4 101 637 630 567 574
4 0 643 636 573 580
4 101 644 637 574 581
4 0 650 643 580 587
4 101 651 644 581 588
4 0 657 650 587 594
4 101 658 651 588 595
4 0 664 657 594 601
4 101 665 658 595 602
4 0 671 664 601 608
4 101 672 665 602 609
4 0 678 671 608 615
4 101 679 672 609 616
4 0 685 678 615 622
4 101 686 679 616 623
4 0 692 685 622 629
4 102 0 63 64 1
4 0 56 119 120 57
4 102 1 64 65 2
4 0 57 120 121 58
4 102 2 65 66 3
4 0 58 121 122 59
4 102 3 66 67 4
4 0 59 122 123 60
4 102 4 67 68 5
4 0 60 123 124 61
4 102 5 68 69 6
4 0 61 124 125 62
4 102 63 126 127 64
4 0 119 182 183 120
4 102 64 127 128 65
4 0 120 183 184 121
4 102 65 128 129 66
4 0 121 184 185 122
4 102 66 129 130 67
4 0 122 185 186 123
4 102 67 130 131 68
4 0 123 186 187 124
4 102 68 131 132 69
4 0 124 187 188 125
4 102 126 189 190 127
4 0 182 245 246 183
4 102 127 190 191 128
4 0 183 246 247 184
4 102 128 191 192 129
4 0 184 247 248 185
4 102 129 192 193 130
4 0 185 248 249 186
4 102 130 193 194 131
4 0 186 249 250 187
4 102 131 194 195 132
4 0 187 250 251 188
4 102 189 252 253 190
4 0 245 308 309 246
4 102 190 253 254 191
4 0 246 309 310 247
4 102 191 254 255 192
4 0 247 310 311 248
4 102 192 255 256 193
4 0 248 311 312 249
4 102 193 256 257 194
4 0 249 312 313 250
4 102 194 257 258 195
4 0 250 313 314 251
4 102 252 315 316 253
4 0 308 371 372 309
4 102 253 316 317 254
4 0 309 372 373 310
4 102 254 317 318 255
4 0 310 373 374 311
4 102 255 318 319 256
4 0 311 374 375 312
4 102 256 319 320 257
4 0 312 375 376 313
4 102 257 320 321 258
4 0 313 376 377 314
4 102 315 378 379 316
4 0 371 434 435 372
4 102 316 379 380 317
4 0 372 435 436 373
4 102 317 380 381 318
4 0 373 436 437 374
4 102 318 381 382 319
4 0 374 437 438 375
4 102 319 382 383 320
4 0 375 438 439 376
4 102 320 383 384 321
4 0 376 439 440 377
4 102 378 441 442 379
4 0 434 497 498 435
4 102 379 442 443 380
4 0 435 498 499 436
4 102 380 443 444 381
4 0 436 499 500 437
4 102 381 444 445 382
4 0 437 500 501 438
4 102 382 445 446 383
4 0 438 501 502 439
4 102 383 446 447 384
4 0 439 502 503 440
4 102 441 504 505 442
4 0 497 560 561 498
4 102 442 505 506 443
4 0 498 561 562 499
4 102 443 506 507 444
4 0 499 562 563 500
4 102 444 507 508 445
4 0 500 563 564 501
4 102 445 508 509 446
4 0 501 564 565 502
4 102 446 509 510 447
4 0 502 565 566 503
4 102 504 567 568 505
4 0 560 623 624 561
4 102 505 568 569 506
4 0 561 624 625 562
4 102 506 569 570 507
4 0 562 625 626 563
4 102 507 570 571 508
4 0 563 626 627 564
4 102 508 571 572 509
4 0 564 627 628 565
4 102 509 572 573 510
4 0 565 628 629 566
4 102 567 630 631 568
4 0 623 686 687 624
4 102 568 631 632 569
4 0 624 687 688 625
4 102 569 632 633 570
4 0 625 688 689 626
4 102 570 633 634 571
4 0 626 689 690 627
4 102 571 634 635 572
4 0 627 690 691 628
4 102 572 635 636 573
4 0 628 691 692 629
VDATA:
3 0.0 0.002 20
3 0.0 0.002 20
3 0.0 0.002 20
3 0.0 0.002 20
3 -10.0 0.0 0.0
3 -10.0 0.0 0.0
3 -10.0 0.0 0.0
3 0.0 0.002 20
3 0.0 0.002 20
3 0.0 0.002 20
3 0.0 0.002 20
3 -10.0 0.0 0.0
3 -10.0 0.0 0.0
3 -10.0 0.0 0.0
3 0.0 0.002 20
3 0.0 0.002 20
3 0.0 0.002 20
3 0.0 0.002 20
3 -10.0 0.0 0.0
3 -10.0 0.0 0.0
3 -10.0 0.0 0.0
3 0.0 0.002 20
3 0.0 0.002 20
3 0.0 0.002 20
3 0.0 0.002 20
3 -10.0 0.0 0.0
3 -10.0 0.0 0.0
3 -10.0 0.0 0.0
3 -10.0 0.0 0.0
3 -10.0 0.0 0.0
3 -10.0 0.0 0.0
3 -10.0 0.0 0.0
3 -10.0 0.0 0.0
3 -10.0 0.0 0.0
3 -10.0 0.0 0.0
3 -10.0 0.0 0.0
3 -10.0 0.0 0.0
3 -10.0 0.0 0.0
3 -10.0 0.0 0.0
3 -10.0 0.0 0.0
3 -10.0 0.0 0.0
3 -10.0 0.0 0.0
3 -10.0 0.0 0.0
3 -10.0 0.0 0.0
3 -10.0 0.0 0.0
3 -10.0 0.0 0.0
3 -10.0 0.0 0.0
3 -10.0 0.0 0.0
3 -10.0 0.0 0.0
3 -10.0 0.0 0.0
3 -10.0 0.0 0.0
3 -10.0 0.0 0.0
3 -10.0 0.0 0.0
3 -10.0 0.0 0.0
3 -10.0 0.0 0.0
3 -10.0 0.0 0.0
3 -10.0 0.0 0.0
3 -10.0 0.0 0.0
3 -10.0 0.0 0.0
3 -10.0 0.0 0.0
3 -10.0 0.0 0.0
3 -10.0 0.0 0.0
3 -10.0 0.0 0.0
3 0.0 0.002 20
3 0.0 0.002 20
3 0.0 0.002 20
3 0.0 0.002 20
3 -10.0 0.0 0.0
3 -10.0 0.0 0.0
3 -10.0 0.0 0.0
3 0.0 0.002 20
3 0.0 0.002 20
3 0.0 0.002 20
3 0.0 0.002 20
3 -10.0 0.0 0.0
3 -10.0 0.0 0.0
3 -10.0 0.0 0.0
3 0.0 0.002 20
3 0.0 0.002 20
3 0.0 0.002 20
3 0.0 0.002 20
3 -10.0 0.0 0.0
3 -10.0 0.0 0.0
3 -10.0 0.0 0.0
3 0.0 0.002 20
3 0.0 0.002 20
3 0.0 0.002 20
3 0.0 0.002 20
3 -10.0 0.0 0.0
3 -10.0 0.0 0.0
3 -10.0 0.0 0.0
3 -10.0 0.0 0.0
3 -10.0 0.0 0.0
3 -10.0 0.0 0.0
3 -10.0 0.0 0.0
3 -10.0 0.0 0.0
3 -10.0 0.0 0.0
3 -10.0 0.0 0.0
3 -10.0 0.0 0.0
3 -10.0 0.0 0.0
3 -10.0 0.0 0.0
3 -10.0 0.0 0.0
3 -10.0 0.0 0.0
3 -10.0 0.0 0.0
3 -10.0 0.0 0.0
3 -10.0 0.0 0.0
3 -10.0 0.0 0.0
3 -10.0 0.0 0.0
3 -10.0 0.0 0.0
3 -10.0 0.0 0.0
3 -10.0 0.0 0.0
3 -10.0 0.0 0.0
3 -10.0 0.0 0.0
3 -10.0 0.0 0.0
3 -10.0 0.0 0.0
3 -10.0 0.0 0.0
3 -10.0 0.0 0.0
3 -10.0 0.0 0.0
3 -10.0 0.0 0.0
3 -10.0 0.0 0.0
3 -10.0 0.0 0.0
3 -10.0 0.0 0.0
3 -10.0 0.0 0.0
3 -10.0 0.0 0.0
3 -10.0 0.0 0.0
3 -10.0 0.0 0.0
3 0.0 0.002 20
3 0.0 0.002 20
3 0.0 0.002 20
3 0.0 0.002 20
3 -10.0 0.0 0.0
3 -10.0 0.0 0.0
3 -10.0 0.0 0.0
3 0.0 0.002 20
3 0.0 0.002 20
3 0.0 0.002 20
3 0.0 0.002 20
3 -10.0 0.0 0.0
3 -10.0 0.0 0.0
3 -10.0 0.0 0.0
3 0.0 0.002 20
3 0.0 0.002 20
3 0.0 0.002 20
3 0.0 0.002 20
3 -10.0 0.0 0.0
3 -10.0 0.0 0.0
3 -10.0 0.0 0.0
3 0.0 0.002 20
3 0.0 0.002 20
3 0.0 0.002 20
3 0.0 0.002 20
3 -10.0 0.0 0.0
3 -10.0 0.0 0.0
3 -10.0 0.0 0.0
3 -10.0 0.0 0.0
3 -10.0 0.0 0.0
3 -10.0 0.0 0.0
3 -10.0 0.0 0.0
3 -10.0 0.0 0.0
3 -10.0 0.0 0.0
3 -10.0 0.0 0.0
3 -10.0 0.0 0.0
3 -10.0 0.0 0.0
3 -10.0 0.0 0.0
3 -10.0 0.0 0.0
3 -10.0 0.0 0.0
3 -10.0 0.0 0.0
3 -10.0 0.0 0.0
3 -10.0 0.0 0.0
3 -10.0 0.0 0.0
3 -10.0 0.0 0.0
3 -10.0 0.0 0.0
3 -10.0 0.0 0.0
3 -10.0 0.0 0.0
3 -10.0 0.0 0.0
3 -10.0 0.0 0.0
3 -10.0 0.0 0.0
3 -10.0 0.0 0.0
3 -10.0 0.0 0.0
3 -10.0 0.0 0.0
3 -10.0 0.0 0.0
3 -10.0 0.0 0.0
3 -10.0 0.0 0.0
3 -10.0 0.0 0.0
3 -10.0 0.0 0.0
3 -10.0 0.0 0.0
3 -10.0 0.0 0.0
3 -10.0 0.0 0.0
3 -10.0 0.0 0.0
3 0.0 0.002 20
3 0.0 0.002 20
3 0.0 0.002 20
3 0.0 0.002 20
3 -10.0 0.0 0.0
3 -10.0 0.0 0.0
3 -10.0 0.0 0.0
3 0.0 0.002 20
3 0.0 0.002 20
3 0.0 0.002 20
3 0.0 0.002 20
3 -10.0 0.0 0.0
3 -10.0 0.0 0.0
3 -10.0 0.0 0.0
3 0.0 0.002 20
3 0.0 0.002 20
3 0.0 0.002 20
3 0.0 0.002 20
3 -10.0 0.0 0.0
3 -10.0 0.0 0.0
3 -10.0 0.0 0.0
3 0.0 0.002 20
3 0.0 0.002 20
3 0.0 0.002 20
3 0.0 0.002 20
3 -10.0 0.0 0.0
3 -10.0 0.0 0.0
3 -10.0 0.0 0.0
3 -10.0 0.0 0.0
3 -10.0 0.0 0.0
3 -10.0 0.0 0.0
3 -10.0 0.0 0.0
3 -10.0 0.0 0.0
3 -10.0 0.0 0.0
3 -10.0 0.0 0.0
3 -10.0 0.0 0.0
3 -10.0 0.0 0.0
3 -10.0 0.0 0.0
3 -10.0 0.0 0.0
3 -10.0 0.0 0.0
3 -10.0 0.0 0.0
3 -10.0 0.0 0.0
3 -10.0 0.0 0.0
3 -10.0 0.0 0.0
3 -10.0 0.0 0.0
3 -10.0 0.0 0.0
3 -10.0 0.0 0.0
3 -10.0 0.0 0.0
3 -10.0 0.0 0.0
3 -10.0 0.0 0.0
3 -10.0 0.0 0.0
3 -10.0 0.0 0.0
3 -10.0 0.0 0.0
3 -10.0 0.0 0.0
3 -10.0 0.0 0.0
3 -10.0 0.0 0.0
3 -10.0 0.0 0.0
3 -10.0 0.0 0.0
3 -10.0 0.0 0.0
3 -10.0 0.0 0.0
3 -10.0 0.0 0.0
3 -10.0 0.0 0.0
3 -10.0 0.0 0.0
3 -10.0 0.0 0.0
3 -10.0 0.0 0.0
3 -10.0 0.0 0.0
3 -10.0 0.0 0.0
3 -10.0 0.0 0.0
3 -10.0 0.0 0.0
3 -10.0 0.0 0.0
3 -10.0 0.0 0.0
3 -10.0 0.0 0.0
3 -10.0 0.0 0.0
3 -10.0 0.0 0.0
3 -10.0 0.0 0.0
3 -10.0 0.0 0.0
3 -10.0 0.0 0.0
3 -10.0 0.0 0.0
3 -10.0 0.0 0.0
3 -10.0 0.0 0.0
3 -10.0 0.0 0.0
3 -10.0 0.0 0.0
3 -10.0 0.0 0.0
3 -10.0 0.0 0.0
3 -10.0 0.0 0.0
3 -10.0 0.0 0.0
3 -10.0 0.0 0.0
3 -10.0 0.0 0.0
3 -10.0 0.0 0.0
3 -10.0 0.0 0.0
3 -10.0 0.0 0.0
3 -10.0 0.0 0.0
3 -10.0 0.0 0.0
3 -10.0 0.0 0.0
3 -10.0 0.0 0.0
3 -10.0 0.0 0.0
3 -10.0 0.0 0.0
3 -10.0 0.0 0.0
3 -10.0 0.0 0.0
3 -10.0 0.0 0.0
3 -10.0 0.0 0.0
3 -10.0 0.0 0.0
3 -10.0 0.0 0.0
3 -10.0 0.0 0.0
3 -10.0 0.0 0.0
3 -10.0 0.0 0.0
3 -10.0 0.0 0.0
3 -10.0 0.0 0.0
3 -10.0 0.0 0.0
3 -10.0 0.0 0.0
3 -10.0 0.0 0.0
3 -10.0 0.0 0.0
3 -10.0 0.0 0.0
3 -10.0 0.0 0.0
3 -10.0 0.0 0.0
3 -10.0 0.0 0.0
3 -10.0 0.0 0.0
3 -10.0 0.0 0.0
3 -10.0 0.0 0.0
3 -10.0 0.0 0.0
3 -10.0 0.0 0.0
3 -10.0 0.0 0.0
3 -10.0 0.0 0.0
3 -10.0 0.0 0.0
3 -10.0 0.0 0.0
3 -10.0 0.0 0.0
3 -10.0 0.0 0.0
3 -10.0 0.0 0.0
3 -10.0 0.0 0.0
3 -10.0 0.0 0.0
3 -10.0 0.0 0.0
3 -10.0 0.0 0.0
3 -10.0 0.0 0.0
3 -10.0 0.0 0.0
3 -10.0 0.0 0.0
3 -10.0 0.0 0.0
3 -10.0 0.0 0.0
3 -10.0 0.0 0.0
3 -10.0 0.0 0.0
3 -10.0 0.0 0.0
3 -10.0 0.0 0.0
3 -10.0 0.0 0.0
3 -10.0 0.0 0.0
3 -10.0 0.0 0.0
3 -10.0 0.0 0.0
3 -10.0 0.0 0.0
3 -10.0 0.0 0.0
3 -10.0 0.0 0.0
3 -10.0 0.0 0.0
3 -10.0 0.0 0.0
3 -10.0 0.0 0.0
3 -10.0 0.0 0.0
3 -10.0 0.0 0.0
3 -10.0 0.0 0.0
3 -10.0 0.0 0.0
3 -10.0 0.0 0.0
3 -10.0 0.0 0.0
3 -10.0 0.0 0.0
3 -10.0 0.0 0.0
3 -10.0 0.0 0.0
3 -10.0 0.0 0.0
3 -10.0 0.0 0.0
3 -10.0 0.0 0.0
3 -10.0 0.0 0.0
3 -10.0 0.0 0.0
3 -10.0 0.0 0.0
3 -10.0 0.0 0.0
3 -10.0 0.0 0.0
3 -10.0 0.0 0.0
3 -10.0 0.0 0.0
3 -10.0 0.0 0.0
3 -10.0 0.0 0.0
3 -10.0 0.0 0.0
3 -10.0 0.0 0.0
3 -10.0 0.0 0.0
3 -10.0 0.0 0.0
3 -10.0 0.0 0.0
3 -10.0 0.0 0.0
3 -10.0 0.0 0.0
3 -10.0 0.0 0.0
3 -10.0 0.0 0.0
3 -10.0 0.0 0.0
3 -10.0 0.0 0.0
3 -10.0 0.0 0.0
3 -10.0 0.0 0.0
3 -10.0 0.0 0.0
3 -10.0 0.0 0.0
3 -10.0 0.0 0.0
3 -10.0 0.0 0.0
3 -10.0 0.0 0.0
3 -10.0 0.0 0.0
3 -10.0 0.0 0.0
3 -10.0 0.0 0.0
3 -10.0 0.0 0.0
3 -10.0 0.0 0.0
3 -10.0 0.0 0.0
3 -10.0 0.0 0.0
3 -10.0 0.0 0.0
3 -10.0 0.0 0.0
3 -10.0 0.0 0.0
3 -10.0 0.0 0.0
3 -10.0 0.0 0.0
3 -10.0 0.0 0.0
3 -10.0 0.0 0.0
3 -10.0 0.0 0.0
3 -10.0 0.0 0.0
3 -10.0 0.0 0.0
3 -10.0 0.0 0.0
3 -10.0 0.0 0.0
3 -10.0 0.0 0.0
3 -10.0 0.0 0.0
3 -10.0 0.0 0.0
3 -10.0 0.0 0.0
3 -10.0 0.0 0.0
3 -10.0 0.0 0.0
3 -10.0 0.0 0.0
3 -10.0 0.0 0.0
3 -10.0 0.0 0.0
3 -10.0 0.0 0.0
3 -10.0 0.0 0.0
3 -10.0 0.0 0.0
3 -10.0 0.0 0.0
3 -10.0 0.0 0.0
3 -10.0 0.0 0.0
3 -10.0 0.0 0.0
3 -10.0 0.0 0.0
3 -10.0 0.0 0.0
3 -10.0 0.0 0.0
3 -10.0 0.0 0.0
3 -10.0 0.0 0.0
3 -10.0 0.0 0.0
3 -10.0 0.0 0.0
3 -10.0 0.0 0.0
3 -10.0 0.0 0.0
3 -10.0 0.0 0.0
3 -10.0 0.0 0.0
3 -10.0 0.0 0.0
3 -10.0 0.0 0.0
3 -10.0 0.0 0.0
3 -10.0 0.0 0.0
3 -10.0 0.0 0.0
3 -10.0 0.0 0.0
3 -10.0 0.0 0.0
3 -10.0 0.0 0.0
3 -10.0 0.0 0.0
3 -10.0 0.0 0.0
3 -10.0 0.0 0.0
3 -10.0 0.0 0.0
3 -10.0 0.0 0.0
3 -10.0 0.0 0.0
3 -10.0 0.0 0.0
3 -10.0 0.0 0.0
3 -10.0 0.0 0.0
3 -10.0 0.0 0.0
3 -10.0 0.0 0.0
3 -10.0 0.0 0.0
3 -10.0 0.0 0.0
3 -10.0 0.0 0.0
3 -10.0 0.0 0.0
3 -10.0 0.0 0.0
3 -10.0 0.0 0.0
3 -10.0 0.0 0.0
3 -10.0 0.0 0.0
3 -10.0 0.0 0.0
3 -10.0 0.0 0.0
3 -10.0 0.0 0.0
3 -10.0 0.0 0.0
3 -10.0 0.0 0.0
3 -10.0 0.0 0.0
3 -10.0 0.0 0.0
3 -10.0 0.0 0.0
3 -10.0 0.0 0.0
3 -10.0 0.0 0.0
3 -10.0 0.0 0.0
3 -10.0 0.0 0.0
3 -10.0 0.0 0.0
3 -10.0 0.0 0.0
3 -10.0 0.0 0.0
3 -10.0 0.0 0.0
3 -10.0 0.0 0.0
3 -10.0 0.0 0.0
3 -10.0 0.0 0.0
3 -10.0 0.0 0.0
3 -10.0 0.0 0.0
3 -10.0 0.0 0.0
3 -10.0 0.0 0.0
3 -10.0 0.0 0.0
3 -10.0 0.0 0.0
3 -10.0 0.0 0.0
3 -10.0 0.0 0.0
3 -10.0 0.0 0.0
3 -10.0 0.0 0.0
3 -10.0 0.0 0.0
3 -10.0 0.0 0.0
3 -10.0 0.0 0.0
3 -10.0 0.0 0.0
3 -10.0 0.0 0.0
3 -10.0 0.0 0.0
3 -10.0 0.0 0.0
3 -10.0 0.0 0.0
3 -10.0 0.0 0.0
3 -10.0 0.0 0.0
3 -10.0 0.0 0.0
3 -10.0 0.0 0.0
3 -10.0 0.0 0.0
3 -10.0 0.0 0.0
3 -10.0 0.0 0.0
3 -10.0 0.0 0.0
3 -10.0 0.0 0.0
3 -10.0 0.0 0.0
3 -10.0 0.0 0.0
3 -10.0 0.0 0.0
3 -10.0 0.0 0.0
3 -10.0 0.0 0.0
3 -10.0 0.0 0.0
3 -10.0 0.0 0.0
3 -10.0 0.0 0.0
3 -10.0 0.0 0.0
3 -10.0 0.0 0.0
3 -10.0 0.0 0.0
3 -10.0 0.0 0.0
3 -10.0 0.0 0.0
3 -10.0 0.0 0.0
3 -10.0 0.0 0.0
3 -10.0 0.0 0.0
3 -10.0 0.0 0.0
3 -10.0 0.0 0.0
3 -10.0 0.0 0.0
3 -10.0 0.0 0.0
3 -10.0 0.0 0.0
3 -10.0 0.0 0.0
3 -10.0 0.0 0.0
3 -10.0 0.0 0.0
3 -10.0 0.0 0.0
3 -10.0 0.0 0.0
3 -10.0 0.0 0.0
3 -10.0 0.0 0.0
3 -10.0 0.0 0.0
3 -10.0 0.0 0.0
3 -10.0 0.0 0.0
3 -10.0 0.0 0.0
3 -10.0 0.0 0.0
3 -10.0 0.0 0.0
3 -10.0 0.0 0.0
3 -10.0 0.0 0.0
3 -10.0 0.0 0.0
3 -10.0 0.0 0.0
3 -10.0 0.0 0.0
3 -10.0 0.0 0.0
3 -10.0 0.0 0.0
3 -10.0 0.0 0.0
3 -10.0 0.0 0.0
3 -10.0 0.0 0.0
3 -10.0 0.0 0.0
3 -10.0 0.0 0.0
3 -10.0 0.0 0.0
3 -10.0 0.0 0.0
3 -10.0 0.0 0.0
3 -10.0 0.0 0.0
3 -10.0 0.0 0.0
3 -10.0 0.0 0.0
3 -10.0 0.0 0.0
3 -10.0 0.0 0.0
3 -10.0 0.0 0.0
3 -10.0 0.0 0.0
3 -10.0 0.0 0.0
3 -10.0 0.0 0.0
3 -10.0 0.0 0.0
3 -10.0 0.0 0.0
3 -10.0 0.0 0.0
3 -10.0 0.0 0.0
3 -10.0 0.0 0.0
3 -10.0 0.0 0.0
3 -10.0 0.0 0.0
3 -10.0 0.0 0.0
3 -10.0 0.0 0.0
3 -10.0 0.0 0.0
3 -10.0 0.0 0.0
3 -10.0 0.0 0.0
3 -10.0 0.0 0.0
3 -10.0 0.0 0.0
3 -10.0 0.0 0.0
3 -10.0 0.0 0.0
3 -10.0 0.0 0.0
3 -10.0 0.0 0.0
3 -10.0 0.0 0.0
3 -10.0 0.0 0.0
3 -10.0 0.0 0.0
3 -10.0 0.0 0.0
3 -10.0 0.0 0.0
3 -10.0 0.0 0.0
3 -10.0 0.0 0.0
3 -10.0 0.0 0.0
3 -10.0 0.0 0.0
3 -10.0 0.0 0.0
3 -10.0 0.0 0.0
3 -10.0 0.0 0.0
3 -10.0 0.0 0.0
3 -10.0 0.0 0.0
3 -10.0 0.0 0.0
3 -10.0 0.0 0.0
3 -10.0 0.0 0.0
3 -10.0 0.0 0.0
3 -10.0 0.0 0.0
3 -10.0 0.0 0.0
3 -10.0 0.0 0.0
3 -10.0 0.0 0.0
3 -10.0 0.0 0.0
3 -10.0 0.0 0.0
3 -10.0 0.0 0.0
3 -10.0 0.0 0.0
3 -10.0 0.0 0.0
3 -10.0 0.0 0.0
3 -10.0 0.0 0.0
3 -10.0 0.0 0.0
3 -10.0 0.0 0.0
3 -10.0 0.0 0.0
3 -10.0 0.0 0.0
3 -10.0 0.0 0.0
3 -10.0 0.0 0.0
3 -10.0 0.0 0.0
3 -10.0 0.0 0.0
3 -10.0 0.0 0.0
3 -10.0 0.0 0.0
3 -10.0 0.0 0.0
3 -10.0 0.0 0.0
3 -10.0 0.0 0.0
3 -10.0 0.0 0.0
3 -10.0 0.0 0.0
3 -10.0 0.0 0.0
3 -10.0 0.0 0.0
3 -10.0 0.0 0.0
3 -10.0 0.0 0.0
3 -10.0 0.0 0.0
3 -10.0 0.0 0.0
3 -10.0 0.0 0.0
3 -10.0 0.0 0.0
3 -10.0 0.0 0.0
3 -10.0 0.0 0.0
3 -10.0 0.0 0.0
3 -10.0 0.0 0.0
3 -10.0 0.0 0.0
3 -10.0 0.0 0.0
3 -10.0 0.0 0.0
3 -10.0 0.0 0.0
3 -10.0 0.0 0.0
3 -10.0 0.0 0.0
3 -10.0 0.0 0.0
3 -10.0 0.0 0.0
3 -10.0 0.0 0.0
3 -10.0 0.0 0.0
3 -10.0 0.0 0.0
3 -10.0 0.0 0.0
3 -10.0 0.0 0.0
3 -10.0 0.0 0.0
3 -10.0 0.0 0.0
3 -10.0 0.0 0.0
3 -10.0 0.0 0.0
3 -10.0 0.0 0.0
3 -10.0 0.0 0.0
3 -10.0 0.0 0.0
3 -10.0 0.0 0.0
3 -10.0 0.0 0.0
3 -10.0 0.0 0.0
3 -10.0 0.0 0.0
3 -10.0 0.0 0.0
3 -10.0 0.0 0.0
3 -10.0 0.0 0.0
3 -10.0 0.0 0.0
3 -10.0 0.0 0.0
3 -10.0 0.0 0.0
3 -10.0 0.0 0.0
3 -10.0 0.0 0.0
3 -10.0 0.0 0.0
3 -10.0 0.0 0.0
3 -10.0 0.0 0.0
3 -10.0 0.0 0.0
3 -10.0 0.0 0.0
3 -10.0 0.0 0.0
3 -10.0 0.0 0.0
3 -10.0 0.0 0.0
3 -10.0 0.0 0.0
3 -10.0 0.0 0.0
3 -10.0 0.0 0.0
3 -10.0 0.0 0.0
3 -10.0 0.0 0.0
3 -10.0 0.0 0.0
3 -10.0 0.0 0.0
3 -10.0 0.0 0.0
3 -10.0 0.0 0.0
3 -10.0 0.0 0.0
3 -10.0 0.0 0.0
3 -10.0 0.0 0.0
3 -10.0 0.0 0.0
3 -10.0 0.0 0.0
3 -10.0 0.0 0.0
3 -10.0 0.0 0.0
3 -10.0 0.0 0.0
3 -10.0 0.0 0.0
3 -10.0 0.0 0.0
3 -10.0 0.0 0.0
3 -10.0 0.0 0.0
3 -10.0 0.0 0.0
3 -10.0 0.0 0.0
CDATA:
9 1 0 0 0 1 0 0 0 1
9 1 0 0 0 1 0 0 0 1
9 1 0 0 0 1 0 0 0 1
9 1 0 0 0 1 0 0 0 1
9 1 0 0 0 1 0 0 0 1
9 1 0 0 0 1 0 0 0 1
9 1 0 0 0 1 0 0 0 1
9 1 0 0 0 1 0 0 0 1
9 1 0 0 0 1 0 0 0 1
9 1 0 0 0 1 0 0 0 1
9 1 0 0 0 1 0 0 0 1
9 1 0 0 0 1 0 0 0 1
9 1 0 0 0 1 0 0 0 1
9 1 0 0 0 1 0 0 0 1
9 1 0 0 0 1 0 0 0 1
9 1 0 0 0 1 0 0 0 1
9 1 0 0 0 1 0 0 0 1
9 1 0 0 0 1 0 0 0 1
9 1 0 0 0 1 0 0 0 1
9 1 0 0 0 1 0 0 0 1
9 1 0 0 0 1 0 0 0 1
9 1 0 0 0 1 0 0 0 1
9 1 0 0 0 1 0 0 0 1
9 1 0 0 0 1 0 0 0 1
9 1 0 0 0 1 0 0 0 1
9 1 0 0 0 1 0 0 0 1
9 1 0 0 0 1 0 0 0 1
9 1 0 0 0 1 0 0 0 1
9 1 0 0 0 1 0 0 0 1
9 1 0 0 0 1 0 0 0 1
9 1 0 0 0 1 0 0 0 1
9 1 0 0 0 1 0 0 0 1
9 1 0 0 0 1 0 0 0 1
9 1 0 0 0 1 0 0 0 1
9 1 0 0 0 1 0 0 0 1
9 1 0 0 0 1 0 0 0 1
9 1 0 0 0 1 0 0 0 1
9 1 0 0 0 1 0 0 0 1
9 1 0 0 0 1 0 0 0 1
9 1 0 0 0 1 0 0 0 1
9 1 0 0 0 1 0 0 0 1
9 1 0 0 0 1 0 0 0 1
9 1 0 0 0 1 0 0 0 1
9 1 0 0 0 1 0 0 0 1
9 1 0 0 0 1 0 0 0 1
9 1 0 0 0 1 0 0 0 1
9 1 0 0 0 1 0 0 0 1
9 1 0 0 0 1 0 0 0 1
9 1 0 0 0 1 0 0 0 1
9 1 0 0 0 1 0 0 0 1
9 1 0 0 0 1 0 0 0 1
9 1 0 0 0 1 0 0 0 1
9 1 0 0 0 1 0 0 0 1
9 1 0 0 0 1 0 0 0 1
9 1 0 0 0 1 0 0 0 1
9 1 0 0 0 1 0 0 0 1
9 1 0 0 0 1 0 0 0 1
9 1 0 0 0 1 0 0 0 1
9 1 0 0 0 1 0 0 0 1
9 1 0 0 0 1 0 0 0 1
9 1 0 0 0 1 0 0 0 1
9 1 0 0 0 1 0 0 0 1
9 1 0 0 0 1 0 0 0 1
9 1 0 0 0 1 0 0 0 1
9 1 0 0 0 1 0 0 0 1
9 1 0 0 0 1 0 0 0 1
9 1 0 0 0 1 0 0 0 1
9 1 0 0 0 1 0 0 0 1
9 1 0 0 0 1 0 0 0 1
9 1 0 0 0 1 0 0 0 1
9 1 0 0 0 1 0 0 0 1
9 1 0 0 0 1 0 0 0 1
9 1 0 0 0 1 0 0 0 1
9 1 0 0 0 1 0 0 0 1
9 1 0 0 0 1 0 0 0 1
9 1 0 0 0 1 0 0 0 1
9 1 0 0 0 1 0 0 0 1
9 1 0 0 0 1 0 0 0 1
9 1 0 0 0 1 0 0 0 1
9 1 0 0 0 1 0 0 0 1
9 1 0 0 0 1 0 0 0 1
9 1 0 0 0 1 0 0 0 1
9 1 0 0 0 1 0 0 0 1
9 1 0 0 0 1 0 0 0 1
9 1 0 0 0 1 0 0 0 1
9 1 0 0 0 1 0 0 0 1
9 1 0 0 0 1 0 0 0 1
9 1 0 0 0 1 0 0 0 1
9 1 0 0 0 1 0 0 0 1
9 1 0 0 0 1 0 0 0 1
9 1 0 0 0 1 0 0 0 1
9 1 0 0 0 1 0 0 0 1
9 1 0 0 0 1 0 0 0 1
9 1 0 0 0 1 0 0 0 1
9 1 0 0 0 1 0 0 0 1
9 1 0 0 0 1 0 0 0 1
9 1 0 0 0 1 0 0 0 1
9 1 0 0 0 1 0 0 0 1
9 1 0 0 0 1 0 0 0 1
9 1 0 0 0 1 0 0 0 1
9 1 0 0 0 1 0 0 0 1
9 1 0 0 0 1 0 0 0 1
9 1 0 0 0 1 0 0 0 1
9 1 0 0 0 1 0 0 0 1
9 1 0 0 0 1 0 0 0 1
9 1 0 0 0 1 0 0 0 1
9 1 0 0 0 1 0 0 0 1
9 1 0 0 0 1 0 0 0 1
9 1 0 0 0 1 0 0 0 1
9 1 0 0 0 1 0 0 0 1
9 1 0 0 0 1 0 0 0 1
9 1 0 0 0 1 0 0 0 1
9 1 0 0 0 1 0 0 0 1
9 1 0 0 0 1 0 0 0 1
9 1 0 0 0 1 0 0 0 1
9 1 0 0 0 1 0 0 0 1
9 1 0 0 0 1 0 0 0 1
9 1 0 0 0 1 0 0 0 1
9 1 0 0 0 1 0 0 0 1
9 1 0 0 0 1 0 0 0 1
9 1 0 0 0 1 0 0 0 1
9 1 0 0 0 1 0 0 0 1
9 1 0 0 0 1 0 0 0 1
9 1 0 0 0 1 0 0 0 1
9 1 0 0 0 1 0 0 0 1
9 1 0 0 0 1 0 0 0 1
9 1 0 0 0 1 0 0 0 1
9 1 0 0 0 1 0 0 0 1
9 1 0 0 0 1 0 0 0 1
9 1 0 0 0 1 0 0 0 1
9 1 0 0 0 1 0 0 0 1
9 1 0 0 0 1 0 0 0 1
9 1 0 0 0 1 0 0 0 1
9 1 0 0 0 1 0 0 0 1
9 1 0 0 0 1 0 0 0 1
9 1 0 0 0 1 0 0 0 1
9 1 0 0 0 1 0 0 0 1
9 1 0 0 0 1 0 0 0 1
9 1 0 0 0 1 0 0 0 1
9 1 0 0 0 1 0 0 0 1
9 1 0 0 0 1 0 0 0 1
9 1 0 0 0 1 0 0 0 1
9 1 0 0 0 1 0 0 0 1
9 1 0 0 0 1 0 0 0 1
9 1 0 0 0 1 0 0 0 1
9 1 0 0 0 1 0 0 0 1
9 1 0 0 0 1 0 0 0 1
9 1 0 0 0 1 0 0 0 1
9 1 0 0 0 1 0 0 0 1
9 1 0 0 0 1 0 0 0 1
9 1 0 0 0 1 0 0 0 1
9 1 0 0 0 1 0 0 0 1
9 1 0 0 0 1 0 0 0 1
9 1 0 0 0 1 0 0 0 1
9 1 0 0 0 1 0 0 0 1
9 1 0 0 0 1 0 0 0 1
9 1 0 0 0 1 0 0 0 1
9 1 0 0 0 1 0 0 0 1
9 1 0 0 0 1 0 0 0 1
9 1 0 0 0 1 0 0 0 1
9 1 0 0 0 1 0 0 0 1
9 1 0 0 0 1 0 0 0 1
9 1 0 0 0 1 0 0 0 1
9 1 0 0 0 1 0 0 0 1
9 1 0 0 0 1 0 0 0 1
9 1 0 0 0 1 0 0 0 1
9 1 0 0 0 1 0 0 0 1
9 1 0 0 0 1 0 0 0 1
9 1 0 0 0 1 0 0 0 1
9 1 0 0 0 1 0 0 0 1
9 1 0 0 0 1 0 0 0 1
9 1 0 0 0 1 0 0 0 1
9 1 0 0 0 1 0 0 0 1
9 1 0 0 0 1 0 0 0 1
9 1 0 0 0 1 0 0 0 1
9 1 0 0 0 1 0 0 0 1
9 1 0 0 0 1 0 0 0 1
9 1 0 0 0 1 0 0 0 1
9 1 0 0 0 1 0 0 0 1
9 1 0 0 0 1 0 0 0 1
9 1 0 0 0 1 0 0 0 1
9 1 0 0 0 1 0 0 0 1
9 1 0 0 0 1 0 0 0 1
9 1 0 0 0 1 0 0 0 1
9 1 0 0 0 1 0 0 0 1
9 1 0 0 0 1 0 0 0 1
9 1 0 0 0 1 0 0 0 1
9 1 0 0 0 1 0 0 0 1
9 1 0 0 0 1 0 0 0 1
9 1 0 0 0 1 0 0 0 1
9 1 0 0 0 1 0 0 0 1
9 1 0 0 0 1 0 0 0 1
9 1 0 0 0 1 0 0 0 1
9 1 0 0 0 1 0 0 0 1
9 1 0 0 0 1 0 0 0 1
9 1 0 0 0 1 0 0 0 1
9 1 0 0 0 1 0 0 0 1
9 1 0 0 0 1 0 0 0 1
9 1 0 0 0 1 0 0 0 1
9 1 0 0 0 1 0 0 0 1
9 1 0 0 0 1 0 0 0 1
9 1 0 0 0 1 0 0 0 1
9 1 0 0 0 1 0 0 0 1
9 1 0 0 0 1 0 0 0 1
9 1 0 0 0 1 0 0 0 1
9 1 0 0 0 1 0 0 0 1
9 1 0 0 0 1 0 0 0 1
9 1 0 0 0 1 0 0 0 1
9 1 0 0 0 1 0 0 0 1
9 1 0 0 0 1 0 0 0 1
9 1 0 0 0 1 0 0 0 1
9 1 0 0 0 1 0 0 0 1
9 1 0 0 0 1 0 0 0 1
9 1 0 0 0 1 0 0 0 1
9 1 0 0 0 1 0 0 0 1
9 1 0 0 0 1 0 0 0 1
9 1 0 0 0 1 0 0 0 1
9 1 0 0 0 1 0 0 0 1
9 1 0 0 0 1 0 0 0 1
9 1 0 0 0 1 0 0 0 1
9 1 0 0 0 1 0 0 0 1
9 1 0 0 0 1 0 0 0 1
9 1 0 0 0 1 0 0 0 1
9 1 0 0 0 1 0 0 0 1
9 1 0 0 0 1 0 0 0 1
9 1 0 0 0 1 0 0 0 1
9 1 0 0 0 1 0 0 0 1
9 1 0 0 0 1 0 0 0 1
9 1 0 0 0 1 0 0 0 1
9 1 0 0 0 1 0 0 0 1
9 1 0 0 0 1 0 0 0 1
9 1 0 0 0 1 0 0 0 1
9 1 0 0 0 1 0 0 0 1
9 1 0 0 0 1 0 0 0 1
9 1 0 0 0 1 0 0 0 1
9 1 0 0 0 1 0 0 0 1
9 1 0 0 0 1 0 0 0 1
9 1 0 0 0 1 0 0 0 1
9 1 0 0 0 1 0 0 0 1
9 1 0 0 0 1 0 0 0 1
9 1 0 0 0 1 0 0 0 1
9 1 0 0 0 1 0 0 0 1
9 1 0 0 0 1 0 0 0 1
9 1 0 0 0 1 0 0 0 1
9 1 0 0 0 1 0 0 0 1
9 1 0 0 0 1 0 0 0 1
9 1 0 0 0 1 0 0 0 1
9 1 0 0 0 1 0 0 0 1
9 1 0 0 0 1 0 0 0 1
9 1 0 0 0 1 0 0 0 1
9 1 0 0 0 1 0 0 0 1
9 1 0 0 0 1 0 0 0 1
9 1 0 0 0 1 0 0 0 1
9 1 0 0 0 1 0 0 0 1
9 1 0 0 0 1 0 0 0 1
9 1 0 0 0 1 0 0 0 1
9 1 0 0 0 1 0 0 0 1
9 1 0 0 0 1 0 0 0 1
9 1 0 0 0 1 0 0 0 1
9 1 0 0 0 1 0 0 0 1
9 1 0 0 0 1 0 0 0 1
9 1 0 0 0 1 0 0 0 1
9 1 0 0 0 1 0 0 0 1
9 1 0 0 0 1 0 0 0 1
9 1 0 0 0 1 0 0 0 1
9 1 0 0 0 1 0 0 0 1
9 1 0 0 0 1 0 0 0 1
9 1 0 0 0 1 0 0 0 1
9 1 0 0 0 1 0 0 0 1
9 1 0 0 0 1 0 0 0 1
9 1 0 0 0 1 0 0 0 1
9 1 0 0 0 1 0 0 0 1
9 1 0 0 0 1 0 0 0 1
9 1 0 0 0 1 0 0 0 1
9 1 0 0 0 1 0 0 0 1
9 1 0 0 0 1 0 0 0 1
9 1 0 0 0 1 0 0 0 1
9 1 0 0 0 1 0 0 0 1
9 1 0 0 0 1 0 0 0 1
9 1 0 0 0 1 0 0 0 1
9 1 0 0 0 1 0 0 0 1
9 1 0 0 0 1 0 0 0 1
9 1 0 0 0 1 0 0 0 1
9 1 0 0 0 1 0 0 0 1
9 1 0 0 0 1 0 0 0 1
9 1 0 0 0 1 0 0 0 1
9 1 0 0 0 1 0 0 0 1
9 1 0 0 0 1 0 0 0 1
9 1 0 0 0 1 0 0 0 1
9 1 0 0 0 1 0 0 0 1
9 1 0 0 0 1 0 0 0 1
9 1 0 0 0 1 0 0 0 1
9 1 0 0 0 1 0 0 0 1
9 1 0 0 0 1 0 0 0 1
9 1 0 0 0 1 0 0 0 1
9 1 0 0 0 1 0 0 0 1
9 1 0 0 0 1 0 0 0 1
9 1 0 0 0 1 0 0 0 1
9 1 0 0 0 1 0 0 0 1
9 1 0 0 0 1 0 0 0 1
9 1 0 0 0 1 0 0 0 1
9 1 0 0 0 1 0 0 0 1
9 1 0 0 0 1 0 0 0 1
9 1 0 0 0 1 0 0 0 1
9 1 0 0 0 1 0 0 0 1
9 1 0 0 0 1 0 0 0 1
9 1 0 0 0 1 0 0 0 1
9 1 0 0 0 1 0 0 0 1
9 1 0 0 0 1 0 0 0 1
9 1 0 0 0 1 0 0 0 1
9 1 0 0 0 1 0 0 0 1
9 1 0 0 0 1 0 0 0 1
9 1 0 0 0 1 0 0 0 1
9 1 0 0 0 1 0 0 0 1
9 1 0 0 0 1 0 0 0 1
9 1 0 0 0 1 0 0 0 1
9 1 0 0 0 1 0 0 0 1
9 1 0 0 0 1 0 0 0 1
9 1 0 0 0 1 0 0 0 1
9 1 0 0 0 1 0 0 0 1
9 1 0 0 0 1 0 0 0 1
9 1 0 0 0 1 0 0 0 1
9 1 0 0 0 1 0 0 0 1
9 1 0 0 0 1 0 0 0 1
9 1 0 0 0 1 0 0 0 1
9 1 0 0 0 1 0 0 0 1
9 1 0 0 0 1 0 0 0 1
9 1 0 0 0 1 0 0 0 1
9 1 0 0 0 1 0 0 0 1
9 1 0 0 0 1 0 0 0 1
9 1 0 0 0 1 0 0 0 1
9 1 0 0 0 1 0 0 0 1
9 1 0 0 0 1 0 0 0 1
9 1 0 0 0 1 0 0 0 1
9 1 0 0 0 1 0 0 0 1
9 1 0 0 0 1 0 0 0 1
9 1 0 0 0 1 0 0 0 1
9 1 0 0 0 1 0 0 0 1
9 1 0 0 0 1 0 0 0 1
9 1 0 0 0 1 0 0 0 1
9 1 0 0 0 1 0 0 0 1
9 1 0 0 0 1 0 0 0 1
9 1 0 0 0 1 0 0 0 1
9 1 0 0 0 1 0 0 0 1
9 1 0 0 0 1 0 0 0 1
9 1 0 0 0 1 0 0 0 1
9 1 0 0 0 1 0 0 0 1
9 1 0 0 0 1 0 0 0 1
9 1 0 0 0 1 0 0 0 1
9 1 0 0 0 1 0 0 0 1
9 1 0 0 0 1 0 0 0 1
9 1 0 0 0 1 0 0 0 1
9 1 0 0 0 1 0 0 0 1
9 1 0 0 0 1 0 0 0 1
9 1 0 0 0 1 0 0 0 1
9 1 0 0 0 1 0 0 0 1
9 1 0 0 0 1 0 0 0 1
9 1 0 0 0 1 0 0 0 1
9 1 0 0 0 1 0 0 0 1
9 1 0 0 0 1 0 0 0 1
9 1 0 0 0 1 0 0 0 1
9 1 0 0 0 1 0 0 0 1
9 1 0 0 0 1 0 0 0 1
9 1 0 0 0 1 0 0 0 1
9 1 0 0 0 1 0 0 0 1
9 1 0 0 0 1 0 0 0 1
9 1 0 0 0 1 0 0 0 1
9 1 0 0 0 1 0 0 0 1
9 1 0 0 0 1 0 0 0 1
9 1 0 0 0 1 0 0 0 1
9 1 0 0 0 1 0 0 0 1
9 1 0 0 0 1 0 0 0 1
9 1 0 0 0 1 0 0 0 1
9 1 0 0 0 1 0 0 0 1
9 1 0 0 0 1 0 0 0 1
9 1 0 0 0 1 0 0 0 1
9 1 0 0 0 1 0 0 0 1
9 1 0 0 0 1 0 0 0 1
9 1 0 0 0 1 0 0 0 1
9 1 0 0 0 1 0 0 0 1
9 1 0 0 0 1 0 0 0 1
9 1 0 0 0 1 0 0 0 1
9 1 0 0 0 1 0 0 0 1
9 1 0 0 0 1 0 0 0 1
9 1 0 0 0 1 0 0 0 1
9 1 0 0 0 1 0 0 0 1
9 1 0 0 0 1 0 0 0 1
9 1 0 0 0 1 0 0 0 1
9 1 0 0 0 1 0 0 0 1
9 1 0 0 0 1 0 0 0 1
9 1 0 0 0 1 0 0 0 1
9 1 0 0 0 1 0 0 0 1
9 1 0 0 0 1 0 0 0 1
9 1 0 0 0 1 0 0 0 1
9 1 0 0 0 1 0 0 0 1
9 1 0 0 0 1 0 0 0 1
9 1 0 0 0 1 0 0 0 1
9 1 0 0 0 1 0 0 0 1
9 1 0 0 0 1 0 0 0 1
9 1 0 0 0 1 0 0 0 1
9 1 0 0 0 1 0 0 0 1
9 1 0 0 0 1 0 0 0 1
9 1 0 0 0 1 0 0 0 1
9 1 0 0 0 1 0 0 0 1
9 1 0 0 0 1 0 0 0 1
9 1 0 0 0 1 0 0 0 1
9 1 0 0 0 1 0 0 0 1
9 1 0 0 0 1 0 0 0 1
9 1 0 0 0 1 0 0 0 1
9 1 0 0 0 1 0 0 0 1
9 1 0 0 0 1 0 0 0 1
9 1 0 0 0 1 0 0 0 1
9 1 0 0 0 1 0 0 0 1
9 1 0 0 0 1 0 0 0 1
9 1 0 0 0 1 0 0 0 1
9 1 0 0 0 1 0 0 0 1
9 1 0 0 0 1 0 0 0 1
9 1 0 0 0 1 0 0 0 1
9 1 0 0 0 1 0 0 0 1
9 1 0 0 0 1 0 0 0 1
9 1 0 0 0 1 0 0 0 1
9 1 0 0 0 1 0 0 0 1
9 1 0 0 0 1 0 0 0 1
9 1 0 0 0 1 0 0 0 1
9 1 0 0 0 1 0 0 0 1
9 1 0 0 0 1 0 0 0 1
9 1 0 0 0 1 0 0 0 1
9 1 0 0 0 1 0 0 0 1
9 1 0 0 0 1 0 0 0 1
9 1 0 0 0 1 0 0 0 1
9 1 0 0 0 1 0 0 0 1
9 1 0 0 0 1 0 0 0 1
9 1 0 0 0 1 0 0 0 1
9 1 0 0 0 1 0 0 0 1
9 1 0 0 0 1 0 0 0 1
9 1 0 0 0 1 0 0 0 1
9 1 0 0 0 1 0 0 0 1
9 1 0 0 0 1 0 0 0 1
9 1 0 0 0 1 0 0 0 1
9 1 0 0 0 1 0 0 0 1
9 1 0 0 0 1 0 0 0 1
9 1 0 0 0 1 0 0 0 1
9 1 0 0 0 1 0 0 0 1
9 1 0 0 0 1 0 0 0 1
9 1 0 0 0 1 0 0 0 1
9 1 0 0 0 1 0 0 0 1
9 1 0 0 0 1 0 0 0 1
9 1 0 0 0 1 0 0 0 1
9 1 0 0 0 1 0 0 0 1
9 1 0 0 0 1 0 0 0 1
9 1 0 0 0 1 0 0 0 1
9 1 0 0 0 1 0 0 0 1
9 1 0 0 0 1 0 0 0 1
9 1 0 0 0 1 0 0 0 1
9 1 0 0 0 1 0 0 0 1
9 1 0 0 0 1 0 0 0 1
9 1 0 0 0 1 0 0 0 1
9 1 0 0 0 1 0 0 0 1
9 1 0 0 0 1 0 0 0 1
9 1 0 0 0 1 0 0 0 1
9 1 0 0 0 1 0 0 0 1
9 1 0 0 0 1 0 0 0 1
9 1 0 0 0 1 0 0 0 1
9 1 0 0 0 1 0 0 0 1
9 1 0 0 0 1 0 0 0 1
9 1 0 0 0 1 0 0 0 1
9 1 0 0 0 1 0 0 0 1
9 1 0 0 0 1 0 0 0 1
9 1 0 0 0 1 0 0 0 1
9 1 0 0 0 1 0 0 0 1
9 1 0 0 0 1 0 0 0 1
9 1 0 0 0 1 0 0 0 1
9 1 0 0 0 1 0 0 0 1
9 1 0 0 0 1 0 0 0 1
9 1 0 0 0 1 0 0 0 1
9 1 0 0 0 1 0 0 0 1
9 1 0 0 0 1 0 0 0 1
9 1 0 0 0 1 0 0 0 1
9 1 0 0 0 1 0 0 0 1
9 1 0 0 0 1 0 0 0 1
