POINTS:
0.0000 0.0000 0.0000
0.0000 1.0000 0.0000
0.0000 -1.0000 0.0000
-1.0000 0.0000 0.0000
1.0000 0.0000 0.0000
-1.0000 1.0000 0.0000
1.0000 1.0000 0.0000
1.0000 -1.0000 0.0000
0.0000 0.0000 1.0000
0.0000 1.0000 1.0000
0.0000 -1.0000 1.0000
-1.0000 0.0000 1.0000
1.0000 0.0000 1.0000
-1.0000 1.0000 1.0000
1.0000 1.0000 1.0000
1.0000 -1.0000 1.0000
CELLS:
4 0000  0 1 9 13
4 0000  0 1 5 13
4 0000  0 3 5 13
4 0000  0 3 11 13
4 0000  0 8 11 13
4 0000  0 8 9 13
4 0000  0 1 9 14
4 0000  0 1 6 14
4 0000  0 4 6 14
4 0000  0 4 12 14
4 0000  0 8 12 14
4 0000  0 8 9 14
4 0000  0 2 10 15
4 0000  0 2 7 15
4 0000  0 4 7 15
4 0000  0 4 12 15
4 0000  0 8 12 15
4 0000  0 8 10 15
FACES:
3 1 3 5 11
3 1 5 13 11
3 1 4 6 12
3 1 6 14 12
3 1 4 7 12
3 1 7 15 12
3 1 0 2 8
3 1 2 10 8
3 1 2 7 10
3 1 7 15 10
3 1 1 6 9
3 1 6 14 9
3 1 1 5 9
3 1 5 13 9
3 1 0 3 8
3 1 3 11 8
3 1 0 1 3
3 1 1 5 3
3 1 0 4 1
3 1 4 6 1
3 1 0 2 4
3 1 2 7 4
3 1 8 9 11
3 1 9 13 11
3 1 8 12 9
3 1 12 14 9
3 1 8 10 12
3 1 10 15 12
VDATA:
12 1.0 0.0 0.0 0.0 1.0 0.0 0.0 0.0 1.0 -10.0 0.0 0.0
12 1.0 0.0 0.0 0.0 1.0 0.0 0.0 0.0 1.0 -10.0 0.0 0.0
12 1.0 0.0 0.0 0.0 1.0 0.0 0.0 0.0 1.0 -10.0 0.0 0.0
12 1.0 0.0 0.0 0.0 1.0 0.0 0.0 0.0 1.0 -10.0 0.0 0.0
12 1.0 0.0 0.0 0.0 1.0 0.0 0.0 0.0 1.0 -10.0 0.0 0.0
12 1.0 0.0 0.0 0.0 1.0 0.0 0.0 0.0 1.0 -10.0 0.0 0.0
12 1.0 0.0 0.0 0.0 1.0 0.0 0.0 0.0 1.0 -10.0 0.0 0.0
12 1.0 0.0 0.0 0.0 1.0 0.0 0.0 0.0 1.0 -10.0 0.0 0.0
12 1.0 0.0 0.0 0.0 1.0 0.0 0.0 0.0 1.0 -10.0 0.0 0.0
12 1.0 0.0 0.0 0.0 1.0 0.0 0.0 0.0 1.0 -10.0 0.0 0.0
12 1.0 0.0 0.0 0.0 1.0 0.0 0.0 0.0 1.0 -10.0 0.0 0.0
12 1.0 0.0 0.0 0.0 1.0 0.0 0.0 0.0 1.0 -10.0 0.0 0.0
12 1.0 0.0 0.0 0.0 1.0 0.0 0.0 0.0 1.0 -10.0 0.0 0.0
12 1.0 0.0 0.0 0.0 1.0 0.0 0.0 0.0 1.0 -10.0 0.0 0.0
12 1.0 0.0 0.0 0.0 1.0 0.0 0.0 0.0 1.0 -10.0 0.0 0.0
12 1.0 0.0 0.0 0.0 1.0 0.0 0.0 0.0 1.0 -10.0 0.0 0.0
