POINTS:
0 0
1 0
2 0
2 1
1 1
0 1
CELLS:
4 0000 0 1 4 5
4 3000 1 2 3 4
VDATA:
3 -10.0 0.0 0.0
3 -10.0 0.0 0.0
3 -10.0 0.0 0.0
3 -10.0 0.0 0.0
3 -10.0 0.0 0.0
3 -10.0 0.0 0.0
CDATA:
9 1 0 0 0 1 0 0 0 1
9 1 0 0 0 1 0 0 0 1
