POINTS:
0.0 0.0 0.0
0.0 0.0 0.1
0.0 0.1 0.0
0.0 0.1 0.1
0.1 0.0 0.0
0.1 0.0 0.1
0.1 0.1 0.0
0.1 0.1 0.1
0.2 0.0 0.0
0.2 0.0 0.1
0.2 0.1 0.0
0.2 0.1 0.1
0.3 0.0 0.0
0.3 0.0 0.1
0.3 0.1 0.0
0.3 0.1 0.1
0.4 0.0 0.0
0.4 0.0 0.1
0.4 0.1 0.0
0.4 0.1 0.1
0.5 0.0 0.0
0.5 0.0 0.1
0.5 0.1 0.0
0.5 0.1 0.1
0.6 0.0 0.0
0.6 0.0 0.1
0.6 0.1 0.0
0.6 0.1 0.1
0.7 0.0 0.0
0.7 0.0 0.1
0.7 0.1 0.0
0.7 0.1 0.1
0.8 0.0 0.0
0.8 0.0 0.1
0.8 0.1 0.0
0.8 0.1 0.1
0.9 0.0 0.0
0.9 0.0 0.1
0.9 0.1 0.0
0.9 0.1 0.1
1.0 0.0 0.0
1.0 0.0 0.1
1.0 0.1 0.0
1.0 0.1 0.1
1.1 0.0 0.0
1.1 0.0 0.1
1.1 0.1 0.0
1.1 0.1 0.1
1.2 0.0 0.0
1.2 0.0 0.1
1.2 0.1 0.0
1.2 0.1 0.1
1.3 0.0 0.0
1.3 0.0 0.1
1.3 0.1 0.0
1.3 0.1 0.1
1.4 0.0 0.0
1.4 0.0 0.1
1.4 0.1 0.0
1.4 0.1 0.1
1.5 0.0 0.0
1.5 0.0 0.1
1.5 0.1 0.0
1.5 0.1 0.1
1.6 0.0 0.0
1.6 0.0 0.1
1.6 0.1 0.0
1.6 0.1 0.1
1.7 0.0 0.0
1.7 0.0 0.1
1.7 0.1 0.0
1.7 0.1 0.1
1.8 0.0 0.0
1.8 0.0 0.1
1.8 0.1 0.0
1.8 0.1 0.1
1.9 0.0 0.0
1.9 0.0 0.1
1.9 0.1 0.0
1.9 0.1 0.1
2.0 0.0 0.0
2.0 0.0 0.1
2.0 0.1 0.0
2.0 0.1 0.1
2.1 0.0 0.0
2.1 0.0 0.1
2.1 0.1 0.0
2.1 0.1 0.1
2.2 0.0 0.0
2.2 0.0 0.1
2.2 0.1 0.0
2.2 0.1 0.1
2.3 0.0 0.0
2.3 0.0 0.1
2.3 0.1 0.0
2.3 0.1 0.1
2.4 0.0 0.0
2.4 0.0 0.1
2.4 0.1 0.0
2.4 0.1 0.1
2.5 0.0 0.0
2.5 0.0 0.1
2.5 0.1 0.0
2.5 0.1 0.1
2.6 0.0 0.0
2.6 0.0 0.1
2.6 0.1 0.0
2.6 0.1 0.1
2.7 0.0 0.0
2.7 0.0 0.1
2.7 0.1 0.0
2.7 0.1 0.1
2.8 0.0 0.0
2.8 0.0 0.1
2.8 0.1 0.0
2.8 0.1 0.1
2.9 0.0 0.0
2.9 0.0 0.1
2.9 0.1 0.0
2.9 0.1 0.1
3.0 0.0 0.0
3.0 0.0 0.1
3.0 0.1 0.0
3.0 0.1 0.1
3.1 0.0 0.0
3.1 0.0 0.1
3.1 0.1 0.0
3.1 0.1 0.1
3.2 0.0 0.0
3.2 0.0 0.1
3.2 0.1 0.0
3.2 0.1 0.1
3.3 0.0 0.0
3.3 0.0 0.1
3.3 0.1 0.0
3.3 0.1 0.1
3.4 0.0 0.0
3.4 0.0 0.1
3.4 0.1 0.0
3.4 0.1 0.1
3.5 0.0 0.0
3.5 0.0 0.1
3.5 0.1 0.0
3.5 0.1 0.1
3.6 0.0 0.0
3.6 0.0 0.1
3.6 0.1 0.0
3.6 0.1 0.1
3.7 0.0 0.0
3.7 0.0 0.1
3.7 0.1 0.0
3.7 0.1 0.1
3.8 0.0 0.0
3.8 0.0 0.1
3.8 0.1 0.0
3.8 0.1 0.1
3.9 0.0 0.0
3.9 0.0 0.1
3.9 0.1 0.0
3.9 0.1 0.1
4.0 0.0 0.0
4.0 0.0 0.1
4.0 0.1 0.0
4.0 0.1 0.1
4.1 0.0 0.0
4.1 0.0 0.1
4.1 0.1 0.0
4.1 0.1 0.1
4.2 0.0 0.0
4.2 0.0 0.1
4.2 0.1 0.0
4.2 0.1 0.1
4.3 0.0 0.0
4.3 0.0 0.1
4.3 0.1 0.0
4.3 0.1 0.1
4.4 0.0 0.0
4.4 0.0 0.1
4.4 0.1 0.0
4.4 0.1 0.1
4.5 0.0 0.0
4.5 0.0 0.1
4.5 0.1 0.0
4.5 0.1 0.1
4.6 0.0 0.0
4.6 0.0 0.1
4.6 0.1 0.0
4.6 0.1 0.1
4.7 0.0 0.0
4.7 0.0 0.1
4.7 0.1 0.0
4.7 0.1 0.1
4.8 0.0 0.0
4.8 0.0 0.1
4.8 0.1 0.0
4.8 0.1 0.1
4.9 0.0 0.0
4.9 0.0 0.1
4.9 0.1 0.0
4.9 0.1 0.1
5.0 0.0 0.0
5.0 0.0 0.1
5.0 0.1 0.0
5.0 0.1 0.1
5.1 0.0 0.0
5.1 0.0 0.1
5.1 0.1 0.0
5.1 0.1 0.1
5.2 0.0 0.0
5.2 0.0 0.1
5.2 0.1 0.0
5.2 0.1 0.1
5.3 0.0 0.0
5.3 0.0 0.1
5.3 0.1 0.0
5.3 0.1 0.1
5.4 0.0 0.0
5.4 0.0 0.1
5.4 0.1 0.0
5.4 0.1 0.1
5.5 0.0 0.0
5.5 0.0 0.1
5.5 0.1 0.0
5.5 0.1 0.1
5.6 0.0 0.0
5.6 0.0 0.1
5.6 0.1 0.0
5.6 0.1 0.1
5.7 0.0 0.0
5.7 0.0 0.1
5.7 0.1 0.0
5.7 0.1 0.1
5.8 0.0 0.0
5.8 0.0 0.1
5.8 0.1 0.0
5.8 0.1 0.1
5.9 0.0 0.0
5.9 0.0 0.1
5.9 0.1 0.0
5.9 0.1 0.1
6.0 0.0 0.0
6.0 0.0 0.1
6.0 0.1 0.0
6.0 0.1 0.1
6.1 0.0 0.0
6.1 0.0 0.1
6.1 0.1 0.0
6.1 0.1 0.1
6.2 0.0 0.0
6.2 0.0 0.1
6.2 0.1 0.0
6.2 0.1 0.1
6.3 0.0 0.0
6.3 0.0 0.1
6.3 0.1 0.0
6.3 0.1 0.1
6.4 0.0 0.0
6.4 0.0 0.1
6.4 0.1 0.0
6.4 0.1 0.1
6.5 0.0 0.0
6.5 0.0 0.1
6.5 0.1 0.0
6.5 0.1 0.1
6.6 0.0 0.0
6.6 0.0 0.1
6.6 0.1 0.0
6.6 0.1 0.1
6.7 0.0 0.0
6.7 0.0 0.1
6.7 0.1 0.0
6.7 0.1 0.1
6.8 0.0 0.0
6.8 0.0 0.1
6.8 0.1 0.0
6.8 0.1 0.1
6.9 0.0 0.0
6.9 0.0 0.1
6.9 0.1 0.0
6.9 0.1 0.1
7.0 0.0 0.0
7.0 0.0 0.1
7.0 0.1 0.0
7.0 0.1 0.1
7.1 0.0 0.0
7.1 0.0 0.1
7.1 0.1 0.0
7.1 0.1 0.1
7.2 0.0 0.0
7.2 0.0 0.1
7.2 0.1 0.0
7.2 0.1 0.1
7.3 0.0 0.0
7.3 0.0 0.1
7.3 0.1 0.0
7.3 0.1 0.1
7.4 0.0 0.0
7.4 0.0 0.1
7.4 0.1 0.0
7.4 0.1 0.1
7.5 0.0 0.0
7.5 0.0 0.1
7.5 0.1 0.0
7.5 0.1 0.1
7.6 0.0 0.0
7.6 0.0 0.1
7.6 0.1 0.0
7.6 0.1 0.1
7.7 0.0 0.0
7.7 0.0 0.1
7.7 0.1 0.0
7.7 0.1 0.1
7.8 0.0 0.0
7.8 0.0 0.1
7.8 0.1 0.0
7.8 0.1 0.1
7.9 0.0 0.0
7.9 0.0 0.1
7.9 0.1 0.0
7.9 0.1 0.1
8.0 0.0 0.0
8.0 0.0 0.1
8.0 0.1 0.0
8.0 0.1 0.1
8.1 0.0 0.0
8.1 0.0 0.1
8.1 0.1 0.0
8.1 0.1 0.1
8.2 0.0 0.0
8.2 0.0 0.1
8.2 0.1 0.0
8.2 0.1 0.1
8.3 0.0 0.0
8.3 0.0 0.1
8.3 0.1 0.0
8.3 0.1 0.1
8.4 0.0 0.0
8.4 0.0 0.1
8.4 0.1 0.0
8.4 0.1 0.1
8.5 0.0 0.0
8.5 0.0 0.1
8.5 0.1 0.0
8.5 0.1 0.1
8.6 0.0 0.0
8.6 0.0 0.1
8.6 0.1 0.0
8.6 0.1 0.1
8.7 0.0 0.0
8.7 0.0 0.1
8.7 0.1 0.0
8.7 0.1 0.1
8.8 0.0 0.0
8.8 0.0 0.1
8.8 0.1 0.0
8.8 0.1 0.1
8.9 0.0 0.0
8.9 0.0 0.1
8.9 0.1 0.0
8.9 0.1 0.1
9.0 0.0 0.0
9.0 0.0 0.1
9.0 0.1 0.0
9.0 0.1 0.1
9.1 0.0 0.0
9.1 0.0 0.1
9.1 0.1 0.0
9.1 0.1 0.1
9.2 0.0 0.0
9.2 0.0 0.1
9.2 0.1 0.0
9.2 0.1 0.1
9.3 0.0 0.0
9.3 0.0 0.1
9.3 0.1 0.0
9.3 0.1 0.1
9.4 0.0 0.0
9.4 0.0 0.1
9.4 0.1 0.0
9.4 0.1 0.1
9.5 0.0 0.0
9.5 0.0 0.1
9.5 0.1 0.0
9.5 0.1 0.1
9.6 0.0 0.0
9.6 0.0 0.1
9.6 0.1 0.0
9.6 0.1 0.1
9.7 0.0 0.0
9.7 0.0 0.1
9.7 0.1 0.0
9.7 0.1 0.1
9.8 0.0 0.0
9.8 0.0 0.1
9.8 0.1 0.0
9.8 0.1 0.1
9.9 0.0 0.0
9.9 0.0 0.1
9.9 0.1 0.0
9.9 0.1 0.1
10.0 0.0 0.0
10.0 0.0 0.1
10.0 0.1 0.0
10.0 0.1 0.1
CELLS:
8 0 0 2 6 4 1 3 7 5
8 0 4 6 10 8 5 7 11 9
8 0 8 10 14 12 9 11 15 13
8 0 12 14 18 16 13 15 19 17
8 0 16 18 22 20 17 19 23 21
8 0 20 22 26 24 21 23 27 25
8 0 24 26 30 28 25 27 31 29
8 0 28 30 34 32 29 31 35 33
8 0 32 34 38 36 33 35 39 37
8 0 36 38 42 40 37 39 43 41
8 0 40 42 46 44 41 43 47 45
8 0 44 46 50 48 45 47 51 49
8 0 48 50 54 52 49 51 55 53
8 0 52 54 58 56 53 55 59 57
8 0 56 58 62 60 57 59 63 61
8 0 60 62 66 64 61 63 67 65
8 0 64 66 70 68 65 67 71 69
8 0 68 70 74 72 69 71 75 73
8 0 72 74 78 76 73 75 79 77
8 0 76 78 82 80 77 79 83 81
8 0 80 82 86 84 81 83 87 85
8 0 84 86 90 88 85 87 91 89
8 0 88 90 94 92 89 91 95 93
8 0 92 94 98 96 93 95 99 97
8 0 96 98 102 100 97 99 103 101
8 0 100 102 106 104 101 103 107 105
8 0 104 106 110 108 105 107 111 109
8 0 108 110 114 112 109 111 115 113
8 0 112 114 118 116 113 115 119 117
8 0 116 118 122 120 117 119 123 121
8 0 120 122 126 124 121 123 127 125
8 0 124 126 130 128 125 127 131 129
8 0 128 130 134 132 129 131 135 133
8 0 132 134 138 136 133 135 139 137
8 0 136 138 142 140 137 139 143 141
8 0 140 142 146 144 141 143 147 145
8 0 144 146 150 148 145 147 151 149
8 0 148 150 154 152 149 151 155 153
8 0 152 154 158 156 153 155 159 157
8 0 156 158 162 160 157 159 163 161
8 0 160 162 166 164 161 163 167 165
8 0 164 166 170 168 165 167 171 169
8 0 168 170 174 172 169 171 175 173
8 0 172 174 178 176 173 175 179 177
8 0 176 178 182 180 177 179 183 181
8 0 180 182 186 184 181 183 187 185
8 0 184 186 190 188 185 187 191 189
8 0 188 190 194 192 189 191 195 193
8 0 192 194 198 196 193 195 199 197
8 0 196 198 202 200 197 199 203 201
8 0 200 202 206 204 201 203 207 205
8 0 204 206 210 208 205 207 211 209
8 0 208 210 214 212 209 211 215 213
8 0 212 214 218 216 213 215 219 217
8 0 216 218 222 220 217 219 223 221
8 0 220 222 226 224 221 223 227 225
8 0 224 226 230 228 225 227 231 229
8 0 228 230 234 232 229 231 235 233
8 0 232 234 238 236 233 235 239 237
8 0 236 238 242 240 237 239 243 241
8 0 240 242 246 244 241 243 247 245
8 0 244 246 250 248 245 247 251 249
8 0 248 250 254 252 249 251 255 253
8 0 252 254 258 256 253 255 259 257
8 0 256 258 262 260 257 259 263 261
8 0 260 262 266 264 261 263 267 265
8 0 264 266 270 268 265 267 271 269
8 0 268 270 274 272 269 271 275 273
8 0 272 274 278 276 273 275 279 277
8 0 276 278 282 280 277 279 283 281
8 0 280 282 286 284 281 283 287 285
8 0 284 286 290 288 285 287 291 289
8 0 288 290 294 292 289 291 295 293
8 0 292 294 298 296 293 295 299 297
8 0 296 298 302 300 297 299 303 301
8 0 300 302 306 304 301 303 307 305
8 0 304 306 310 308 305 307 311 309
8 0 308 310 314 312 309 311 315 313
8 0 312 314 318 316 313 315 319 317
8 0 316 318 322 320 317 319 323 321
8 0 320 322 326 324 321 323 327 325
8 0 324 326 330 328 325 327 331 329
8 0 328 330 334 332 329 331 335 333
8 0 332 334 338 336 333 335 339 337
8 0 336 338 342 340 337 339 343 341
8 0 340 342 346 344 341 343 347 345
8 0 344 346 350 348 345 347 351 349
8 0 348 350 354 352 349 351 355 353
8 0 352 354 358 356 353 355 359 357
8 0 356 358 362 360 357 359 363 361
8 0 360 362 366 364 361 363 367 365
8 0 364 366 370 368 365 367 371 369
8 0 368 370 374 372 369 371 375 373
8 0 372 374 378 376 373 375 379 377
8 0 376 378 382 380 377 379 383 381
8 0 380 382 386 384 381 383 387 385
8 0 384 386 390 388 385 387 391 389
8 0 388 390 394 392 389 391 395 393
8 0 392 394 398 396 393 395 399 397
8 0 396 398 402 400 397 399 403 401
FACES:
4 199 0 2 3 1
4 0 400 402 403 401
4 0 6 4 0 2
4 0 7 5 1 3
4 0 10 8 4 6
4 0 11 9 5 7
4 0 14 12 8 10
4 0 15 13 9 11
4 0 18 16 12 14
4 0 19 17 13 15
4 0 22 20 16 18
4 0 23 21 17 19
4 0 26 24 20 22
4 0 27 25 21 23
4 0 30 28 24 26
4 0 31 29 25 27
4 0 34 32 28 30
4 0 35 33 29 31
4 0 38 36 32 34
4 0 39 37 33 35
4 0 42 40 36 38
4 0 43 41 37 39
4 0 46 44 40 42
4 0 47 45 41 43
4 0 50 48 44 46
4 0 51 49 45 47
4 0 54 52 48 50
4 0 55 53 49 51
4 0 58 56 52 54
4 0 59 57 53 55
4 0 62 60 56 58
4 0 63 61 57 59
4 0 66 64 60 62
4 0 67 65 61 63
4 0 70 68 64 66
4 0 71 69 65 67
4 0 74 72 68 70
4 0 75 73 69 71
4 0 78 76 72 74
4 0 79 77 73 75
4 0 82 80 76 78
4 0 83 81 77 79
4 0 86 84 80 82
4 0 87 85 81 83
4 0 90 88 84 86
4 0 91 89 85 87
4 0 94 92 88 90
4 0 95 93 89 91
4 0 98 96 92 94
4 0 99 97 93 95
4 0 102 100 96 98
4 0 103 101 97 99
4 0 106 104 100 102
4 0 107 105 101 103
4 0 110 108 104 106
4 0 111 109 105 107
4 0 114 112 108 110
4 0 115 113 109 111
4 0 118 116 112 114
4 0 119 117 113 115
4 0 122 120 116 118
4 0 123 121 117 119
4 0 126 124 120 122
4 0 127 125 121 123
4 0 130 128 124 126
4 0 131 129 125 127
4 0 134 132 128 130
4 0 135 133 129 131
4 0 138 136 132 134
4 0 139 137 133 135
4 0 142 140 136 138
4 0 143 141 137 139
4 0 146 144 140 142
4 0 147 145 141 143
4 0 150 148 144 146
4 0 151 149 145 147
4 0 154 152 148 150
4 0 155 153 149 151
4 0 158 156 152 154
4 0 159 157 153 155
4 0 162 160 156 158
4 0 163 161 157 159
4 0 166 164 160 162
4 0 167 165 161 163
4 0 170 168 164 166
4 0 171 169 165 167
4 0 174 172 168 170
4 0 175 173 169 171
4 0 178 176 172 174
4 0 179 177 173 175
4 0 182 180 176 178
4 0 183 181 177 179
4 0 186 184 180 182
4 0 187 185 181 183
4 0 190 188 184 186
4 0 191 189 185 187
4 0 194 192 188 190
4 0 195 193 189 191
4 0 198 196 192 194
4 0 199 197 193 195
4 0 202 200 196 198
4 0 203 201 197 199
4 0 206 204 200 202
4 0 207 205 201 203
4 0 210 208 204 206
4 0 211 209 205 207
4 0 214 212 208 210
4 0 215 213 209 211
4 0 218 216 212 214
4 0 219 217 213 215
4 0 222 220 216 218
4 0 223 221 217 219
4 0 226 224 220 222
4 0 227 225 221 223
4 0 230 228 224 226
4 0 231 229 225 227
4 0 234 232 228 230
4 0 235 233 229 231
4 0 238 236 232 234
4 0 239 237 233 235
4 0 242 240 236 238
4 0 243 241 237 239
4 0 246 244 240 242
4 0 247 245 241 243
4 0 250 248 244 246
4 0 251 249 245 247
4 0 254 252 248 250
4 0 255 253 249 251
4 0 258 256 252 254
4 0 259 257 253 255
4 0 262 260 256 258
4 0 263 261 257 259
4 0 266 264 260 262
4 0 267 265 261 263
4 0 270 268 264 266
4 0 271 269 265 267
4 0 274 272 268 270
4 0 275 273 269 271
4 0 278 276 272 274
4 0 279 277 273 275
4 0 282 280 276 278
4 0 283 281 277 279
4 0 286 284 280 282
4 0 287 285 281 283
4 0 290 288 284 286
4 0 291 289 285 287
4 0 294 292 288 290
4 0 295 293 289 291
4 0 298 296 292 294
4 0 299 297 293 295
4 0 302 300 296 298
4 0 303 301 297 299
4 0 306 304 300 302
4 0 307 305 301 303
4 0 310 308 304 306
4 0 311 309 305 307
4 0 314 312 308 310
4 0 315 313 309 311
4 0 318 316 312 314
4 0 319 317 313 315
4 0 322 320 316 318
4 0 323 321 317 319
4 0 326 324 320 322
4 0 327 325 321 323
4 0 330 328 324 326
4 0 331 329 325 327
4 0 334 332 328 330
4 0 335 333 329 331
4 0 338 336 332 334
4 0 339 337 333 335
4 0 342 340 336 338
4 0 343 341 337 339
4 0 346 344 340 342
4 0 347 345 341 343
4 0 350 348 344 346
4 0 351 349 345 347
4 0 354 352 348 350
4 0 355 353 349 351
4 0 358 356 352 354
4 0 359 357 353 355
4 0 362 360 356 358
4 0 363 361 357 359
4 0 366 364 360 362
4 0 367 365 361 363
4 0 370 368 364 366
4 0 371 369 365 367
4 0 374 372 368 370
4 0 375 373 369 371
4 0 378 376 372 374
4 0 379 377 373 375
4 0 382 380 376 378
4 0 383 381 377 379
4 0 386 384 380 382
4 0 387 385 381 383
4 0 390 388 384 386
4 0 391 389 385 387
4 0 394 392 388 390
4 0 395 393 389 391
4 0 398 396 392 394
4 0 399 397 393 395
4 0 402 400 396 398
4 0 403 401 397 399
4 0 0 4 5 1
4 0 2 6 7 3
4 0 4 8 9 5
4 0 6 10 11 7
4 0 8 12 13 9
4 0 10 14 15 11
4 0 12 16 17 13
4 0 14 18 19 15
4 0 16 20 21 17
4 0 18 22 23 19
4 0 20 24 25 21
4 0 22 26 27 23
4 0 24 28 29 25
4 0 26 30 31 27
4 0 28 32 33 29
4 0 30 34 35 31
4 0 32 36 37 33
4 0 34 38 39 35
4 0 36 40 41 37
4 0 38 42 43 39
4 0 40 44 45 41
4 0 42 46 47 43
4 0 44 48 49 45
4 0 46 50 51 47
4 0 48 52 53 49
4 0 50 54 55 51
4 0 52 56 57 53
4 0 54 58 59 55
4 0 56 60 61 57
4 0 58 62 63 59
4 0 60 64 65 61
4 0 62 66 67 63
4 0 64 68 69 65
4 0 66 70 71 67
4 0 68 72 73 69
4 0 70 74 75 71
4 0 72 76 77 73
4 0 74 78 79 75
4 0 76 80 81 77
4 0 78 82 83 79
4 0 80 84 85 81
4 0 82 86 87 83
4 0 84 88 89 85
4 0 86 90 91 87
4 0 88 92 93 89
4 0 90 94 95 91
4 0 92 96 97 93
4 0 94 98 99 95
4 0 96 100 101 97
4 0 98 102 103 99
4 0 100 104 105 101
4 0 102 106 107 103
4 0 104 108 109 105
4 0 106 110 111 107
4 0 108 112 113 109
4 0 110 114 115 111
4 0 112 116 117 113
4 0 114 118 119 115
4 0 116 120 121 117
4 0 118 122 123 119
4 0 120 124 125 121
4 0 122 126 127 123
4 0 124 128 129 125
4 0 126 130 131 127
4 0 128 132 133 129
4 0 130 134 135 131
4 0 132 136 137 133
4 0 134 138 139 135
4 0 136 140 141 137
4 0 138 142 143 139
4 0 140 144 145 141
4 0 142 146 147 143
4 0 144 148 149 145
4 0 146 150 151 147
4 0 148 152 153 149
4 0 150 154 155 151
4 0 152 156 157 153
4 0 154 158 159 155
4 0 156 160 161 157
4 0 158 162 163 159
4 0 160 164 165 161
4 0 162 166 167 163
4 0 164 168 169 165
4 0 166 170 171 167
4 0 168 172 173 169
4 0 170 174 175 171
4 0 172 176 177 173
4 0 174 178 179 175
4 0 176 180 181 177
4 0 178 182 183 179
4 0 180 184 185 181
4 0 182 186 187 183
4 0 184 188 189 185
4 0 186 190 191 187
4 0 188 192 193 189
4 0 190 194 195 191
4 0 192 196 197 193
4 0 194 198 199 195
4 0 196 200 201 197
4 0 198 202 203 199
4 0 200 204 205 201
4 0 202 206 207 203
4 0 204 208 209 205
4 0 206 210 211 207
4 0 208 212 213 209
4 0 210 214 215 211
4 0 212 216 217 213
4 0 214 218 219 215
4 0 216 220 221 217
4 0 218 222 223 219
4 0 220 224 225 221
4 0 222 226 227 223
4 0 224 228 229 225
4 0 226 230 231 227
4 0 228 232 233 229
4 0 230 234 235 231
4 0 232 236 237 233
4 0 234 238 239 235
4 0 236 240 241 237
4 0 238 242 243 239
4 0 240 244 245 241
4 0 242 246 247 243
4 0 244 248 249 245
4 0 246 250 251 247
4 0 248 252 253 249
4 0 250 254 255 251
4 0 252 256 257 253
4 0 254 258 259 255
4 0 256 260 261 257
4 0 258 262 263 259
4 0 260 264 265 261
4 0 262 266 267 263
4 0 264 268 269 265
4 0 266 270 271 267
4 0 268 272 273 269
4 0 270 274 275 271
4 0 272 276 277 273
4 0 274 278 279 275
4 0 276 280 281 277
4 0 278 282 283 279
4 0 280 284 285 281
4 0 282 286 287 283
4 0 284 288 289 285
4 0 286 290 291 287
4 0 288 292 293 289
4 0 290 294 295 291
4 0 292 296 297 293
4 0 294 298 299 295
4 0 296 300 301 297
4 0 298 302 303 299
4 0 300 304 305 301
4 0 302 306 307 303
4 0 304 308 309 305
4 0 306 310 311 307
4 0 308 312 313 309
4 0 310 314 315 311
4 0 312 316 317 313
4 0 314 318 319 315
4 0 316 320 321 317
4 0 318 322 323 319
4 0 320 324 325 321
4 0 322 326 327 323
4 0 324 328 329 325
4 0 326 330 331 327
4 0 328 332 333 329
4 0 330 334 335 331
4 0 332 336 337 333
4 0 334 338 339 335
4 0 336 340 341 337
4 0 338 342 343 339
4 0 340 344 345 341
4 0 342 346 347 343
4 0 344 348 349 345
4 0 346 350 351 347
4 0 348 352 353 349
4 0 350 354 355 351
4 0 352 356 357 353
4 0 354 358 359 355
4 0 356 360 361 357
4 0 358 362 363 359
4 0 360 364 365 361
4 0 362 366 367 363
4 0 364 368 369 365
4 0 366 370 371 367
4 0 368 372 373 369
4 0 370 374 375 371
4 0 372 376 377 373
4 0 374 378 379 375
4 0 376 380 381 377
4 0 378 382 383 379
4 0 380 384 385 381
4 0 382 386 387 383
4 0 384 388 389 385
4 0 386 390 391 387
4 0 388 392 393 389
4 0 390 394 395 391
4 0 392 396 397 393
4 0 394 398 399 395
4 0 396 400 401 397
4 0 398 402 403 399
VDATA:
3 0.0 0.002 20
3 0.0 0.002 20
3 0.0 0.002 20
3 0.0 0.002 20
3 0.0 0.002 20
3 0.0 0.002 20
3 0.0 0.002 20
3 0.0 0.002 20
3 0.0 0.002 20
3 0.0 0.002 20
3 0.0 0.002 20
3 0.0 0.002 20
3 0.0 0.002 20
3 0.0 0.002 20
3 0.0 0.002 20
3 0.0 0.002 20
3 0.0 0.002 20
3 0.0 0.002 20
3 0.0 0.002 20
3 0.0 0.002 20
3 0.0 0.002 20
3 0.0 0.002 20
3 0.0 0.002 20
3 0.0 0.002 20
3 0.0 0.002 20
3 0.0 0.002 20
3 0.0 0.002 20
3 0.0 0.002 20
3 0.0 0.002 20
3 0.0 0.002 20
3 0.0 0.002 20
3 0.0 0.002 20
3 0.0 0.002 20
3 0.0 0.002 20
3 0.0 0.002 20
3 0.0 0.002 20
3 0.0 0.002 20
3 0.0 0.002 20
3 0.0 0.002 20
3 0.0 0.002 20
3 0.0 0.002 20
3 0.0 0.002 20
3 0.0 0.002 20
3 0.0 0.002 20
3 -10.0 0.0 0.0
3 -10.0 0.0 0.0
3 -10.0 0.0 0.0
3 -10.0 0.0 0.0
3 -10.0 0.0 0.0
3 -10.0 0.0 0.0
3 -10.0 0.0 0.0
3 -10.0 0.0 0.0
3 -10.0 0.0 0.0
3 -10.0 0.0 0.0
3 -10.0 0.0 0.0
3 -10.0 0.0 0.0
3 -10.0 0.0 0.0
3 -10.0 0.0 0.0
3 -10.0 0.0 0.0
3 -10.0 0.0 0.0
3 -10.0 0.0 0.0
3 -10.0 0.0 0.0
3 -10.0 0.0 0.0
3 -10.0 0.0 0.0
3 -10.0 0.0 0.0
3 -10.0 0.0 0.0
3 -10.0 0.0 0.0
3 -10.0 0.0 0.0
3 -10.0 0.0 0.0
3 -10.0 0.0 0.0
3 -10.0 0.0 0.0
3 -10.0 0.0 0.0
3 -10.0 0.0 0.0
3 -10.0 0.0 0.0
3 -10.0 0.0 0.0
3 -10.0 0.0 0.0
3 -10.0 0.0 0.0
3 -10.0 0.0 0.0
3 -10.0 0.0 0.0
3 -10.0 0.0 0.0
3 -10.0 0.0 0.0
3 -10.0 0.0 0.0
3 -10.0 0.0 0.0
3 -10.0 0.0 0.0
3 -10.0 0.0 0.0
3 -10.0 0.0 0.0
3 -10.0 0.0 0.0
3 -10.0 0.0 0.0
3 -10.0 0.0 0.0
3 -10.0 0.0 0.0
3 -10.0 0.0 0.0
3 -10.0 0.0 0.0
3 -10.0 0.0 0.0
3 -10.0 0.0 0.0
3 -10.0 0.0 0.0
3 -10.0 0.0 0.0
3 -10.0 0.0 0.0
3 -10.0 0.0 0.0
3 -10.0 0.0 0.0
3 -10.0 0.0 0.0
3 -10.0 0.0 0.0
3 -10.0 0.0 0.0
3 -10.0 0.0 0.0
3 -10.0 0.0 0.0
3 -10.0 0.0 0.0
3 -10.0 0.0 0.0
3 -10.0 0.0 0.0
3 -10.0 0.0 0.0
3 -10.0 0.0 0.0
3 -10.0 0.0 0.0
3 -10.0 0.0 0.0
3 -10.0 0.0 0.0
3 -10.0 0.0 0.0
3 -10.0 0.0 0.0
3 -10.0 0.0 0.0
3 -10.0 0.0 0.0
3 -10.0 0.0 0.0
3 -10.0 0.0 0.0
3 -10.0 0.0 0.0
3 -10.0 0.0 0.0
3 -10.0 0.0 0.0
3 -10.0 0.0 0.0
3 -10.0 0.0 0.0
3 -10.0 0.0 0.0
3 -10.0 0.0 0.0
3 -10.0 0.0 0.0
3 -10.0 0.0 0.0
3 -10.0 0.0 0.0
3 -10.0 0.0 0.0
3 -10.0 0.0 0.0
3 -10.0 0.0 0.0
3 -10.0 0.0 0.0
3 -10.0 0.0 0.0
3 -10.0 0.0 0.0
3 -10.0 0.0 0.0
3 -10.0 0.0 0.0
3 -10.0 0.0 0.0
3 -10.0 0.0 0.0
3 -10.0 0.0 0.0
3 -10.0 0.0 0.0
3 -10.0 0.0 0.0
3 -10.0 0.0 0.0
3 -10.0 0.0 0.0
3 -10.0 0.0 0.0
3 -10.0 0.0 0.0
3 -10.0 0.0 0.0
3 -10.0 0.0 0.0
3 -10.0 0.0 0.0
3 -10.0 0.0 0.0
3 -10.0 0.0 0.0
3 -10.0 0.0 0.0
3 -10.0 0.0 0.0
3 -10.0 0.0 0.0
3 -10.0 0.0 0.0
3 -10.0 0.0 0.0
3 -10.0 0.0 0.0
3 -10.0 0.0 0.0
3 -10.0 0.0 0.0
3 -10.0 0.0 0.0
3 -10.0 0.0 0.0
3 -10.0 0.0 0.0
3 -10.0 0.0 0.0
3 -10.0 0.0 0.0
3 -10.0 0.0 0.0
3 -10.0 0.0 0.0
3 -10.0 0.0 0.0
3 -10.0 0.0 0.0
3 -10.0 0.0 0.0
3 -10.0 0.0 0.0
3 -10.0 0.0 0.0
3 -10.0 0.0 0.0
3 -10.0 0.0 0.0
3 -10.0 0.0 0.0
3 -10.0 0.0 0.0
3 -10.0 0.0 0.0
3 -10.0 0.0 0.0
3 -10.0 0.0 0.0
3 -10.0 0.0 0.0
3 -10.0 0.0 0.0
3 -10.0 0.0 0.0
3 -10.0 0.0 0.0
3 -10.0 0.0 0.0
3 -10.0 0.0 0.0
3 -10.0 0.0 0.0
3 -10.0 0.0 0.0
3 -10.0 0.0 0.0
3 -10.0 0.0 0.0
3 -10.0 0.0 0.0
3 -10.0 0.0 0.0
3 -10.0 0.0 0.0
3 -10.0 0.0 0.0
3 -10.0 0.0 0.0
3 -10.0 0.0 0.0
3 -10.0 0.0 0.0
3 -10.0 0.0 0.0
3 -10.0 0.0 0.0
3 -10.0 0.0 0.0
3 -10.0 0.0 0.0
3 -10.0 0.0 0.0
3 -10.0 0.0 0.0
3 -10.0 0.0 0.0
3 -10.0 0.0 0.0
3 -10.0 0.0 0.0
3 -10.0 0.0 0.0
3 -10.0 0.0 0.0
3 -10.0 0.0 0.0
3 -10.0 0.0 0.0
3 -10.0 0.0 0.0
3 -10.0 0.0 0.0
3 -10.0 0.0 0.0
3 -10.0 0.0 0.0
3 -10.0 0.0 0.0
3 -10.0 0.0 0.0
3 -10.0 0.0 0.0
3 -10.0 0.0 0.0
3 -10.0 0.0 0.0
3 -10.0 0.0 0.0
3 -10.0 0.0 0.0
3 -10.0 0.0 0.0
3 -10.0 0.0 0.0
3 -10.0 0.0 0.0
3 -10.0 0.0 0.0
3 -10.0 0.0 0.0
3 -10.0 0.0 0.0
3 -10.0 0.0 0.0
3 -10.0 0.0 0.0
3 -10.0 0.0 0.0
3 -10.0 0.0 0.0
3 -10.0 0.0 0.0
3 -10.0 0.0 0.0
3 -10.0 0.0 0.0
3 -10.0 0.0 0.0
3 -10.0 0.0 0.0
3 -10.0 0.0 0.0
3 -10.0 0.0 0.0
3 -10.0 0.0 0.0
3 -10.0 0.0 0.0
3 -10.0 0.0 0.0
3 -10.0 0.0 0.0
3 -10.0 0.0 0.0
3 -10.0 0.0 0.0
3 -10.0 0.0 0.0
3 -10.0 0.0 0.0
3 -10.0 0.0 0.0
3 -10.0 0.0 0.0
3 -10.0 0.0 0.0
3 -10.0 0.0 0.0
3 -10.0 0.0 0.0
3 -10.0 0.0 0.0
3 -10.0 0.0 0.0
3 -10.0 0.0 0.0
3 -10.0 0.0 0.0
3 -10.0 0.0 0.0
3 -10.0 0.0 0.0
3 -10.0 0.0 0.0
3 -10.0 0.0 0.0
3 -10.0 0.0 0.0
3 -10.0 0.0 0.0
3 -10.0 0.0 0.0
3 -10.0 0.0 0.0
3 -10.0 0.0 0.0
3 -10.0 0.0 0.0
3 -10.0 0.0 0.0
3 -10.0 0.0 0.0
3 -10.0 0.0 0.0
3 -10.0 0.0 0.0
3 -10.0 0.0 0.0
3 -10.0 0.0 0.0
3 -10.0 0.0 0.0
3 -10.0 0.0 0.0
3 -10.0 0.0 0.0
3 -10.0 0.0 0.0
3 -10.0 0.0 0.0
3 -10.0 0.0 0.0
3 -10.0 0.0 0.0
3 -10.0 0.0 0.0
3 -10.0 0.0 0.0
3 -10.0 0.0 0.0
3 -10.0 0.0 0.0
3 -10.0 0.0 0.0
3 -10.0 0.0 0.0
3 -10.0 0.0 0.0
3 -10.0 0.0 0.0
3 -10.0 0.0 0.0
3 -10.0 0.0 0.0
3 -10.0 0.0 0.0
3 -10.0 0.0 0.0
3 -10.0 0.0 0.0
3 -10.0 0.0 0.0
3 -10.0 0.0 0.0
3 -10.0 0.0 0.0
3 -10.0 0.0 0.0
3 -10.0 0.0 0.0
3 -10.0 0.0 0.0
3 -10.0 0.0 0.0
3 -10.0 0.0 0.0
3 -10.0 0.0 0.0
3 -10.0 0.0 0.0
3 -10.0 0.0 0.0
3 -10.0 0.0 0.0
3 -10.0 0.0 0.0
3 -10.0 0.0 0.0
3 -10.0 0.0 0.0
3 -10.0 0.0 0.0
3 -10.0 0.0 0.0
3 -10.0 0.0 0.0
3 -10.0 0.0 0.0
3 -10.0 0.0 0.0
3 -10.0 0.0 0.0
3 -10.0 0.0 0.0
3 -10.0 0.0 0.0
3 -10.0 0.0 0.0
3 -10.0 0.0 0.0
3 -10.0 0.0 0.0
3 -10.0 0.0 0.0
3 -10.0 0.0 0.0
3 -10.0 0.0 0.0
3 -10.0 0.0 0.0
3 -10.0 0.0 0.0
3 -10.0 0.0 0.0
3 -10.0 0.0 0.0
3 -10.0 0.0 0.0
3 -10.0 0.0 0.0
3 -10.0 0.0 0.0
3 -10.0 0.0 0.0
3 -10.0 0.0 0.0
3 -10.0 0.0 0.0
3 -10.0 0.0 0.0
3 -10.0 0.0 0.0
3 -10.0 0.0 0.0
3 -10.0 0.0 0.0
3 -10.0 0.0 0.0
3 -10.0 0.0 0.0
3 -10.0 0.0 0.0
3 -10.0 0.0 0.0
3 -10.0 0.0 0.0
3 -10.0 0.0 0.0
3 -10.0 0.0 0.0
3 -10.0 0.0 0.0
3 -10.0 0.0 0.0
3 -10.0 0.0 0.0
3 -10.0 0.0 0.0
3 -10.0 0.0 0.0
3 -10.0 0.0 0.0
3 -10.0 0.0 0.0
3 -10.0 0.0 0.0
3 -10.0 0.0 0.0
3 -10.0 0.0 0.0
3 -10.0 0.0 0.0
3 -10.0 0.0 0.0
3 -10.0 0.0 0.0
3 -10.0 0.0 0.0
3 -10.0 0.0 0.0
3 -10.0 0.0 0.0
3 -10.0 0.0 0.0
3 -10.0 0.0 0.0
3 -10.0 0.0 0.0
3 -10.0 0.0 0.0
3 -10.0 0.0 0.0
3 -10.0 0.0 0.0
3 -10.0 0.0 0.0
3 -10.0 0.0 0.0
3 -10.0 0.0 0.0
3 -10.0 0.0 0.0
3 -10.0 0.0 0.0
3 -10.0 0.0 0.0
3 -10.0 0.0 0.0
3 -10.0 0.0 0.0
3 -10.0 0.0 0.0
3 -10.0 0.0 0.0
3 -10.0 0.0 0.0
3 -10.0 0.0 0.0
3 -10.0 0.0 0.0
3 -10.0 0.0 0.0
3 -10.0 0.0 0.0
3 -10.0 0.0 0.0
3 -10.0 0.0 0.0
3 -10.0 0.0 0.0
3 -10.0 0.0 0.0
3 -10.0 0.0 0.0
3 -10.0 0.0 0.0
3 -10.0 0.0 0.0
3 -10.0 0.0 0.0
3 -10.0 0.0 0.0
3 -10.0 0.0 0.0
3 -10.0 0.0 0.0
3 -10.0 0.0 0.0
3 -10.0 0.0 0.0
3 -10.0 0.0 0.0
3 -10.0 0.0 0.0
3 -10.0 0.0 0.0
3 -10.0 0.0 0.0
3 -10.0 0.0 0.0
3 -10.0 0.0 0.0
3 -10.0 0.0 0.0
3 -10.0 0.0 0.0
3 -10.0 0.0 0.0
3 -10.0 0.0 0.0
3 -10.0 0.0 0.0
3 -10.0 0.0 0.0
3 -10.0 0.0 0.0
3 -10.0 0.0 0.0
3 -10.0 0.0 0.0
3 -10.0 0.0 0.0
CDATA:
9 1 0 0 0 1 0 0 0 1
9 1 0 0 0 1 0 0 0 1
9 1 0 0 0 1 0 0 0 1
9 1 0 0 0 1 0 0 0 1
9 1 0 0 0 1 0 0 0 1
9 1 0 0 0 1 0 0 0 1
9 1 0 0 0 1 0 0 0 1
9 1 0 0 0 1 0 0 0 1
9 1 0 0 0 1 0 0 0 1
9 1 0 0 0 1 0 0 0 1
9 1 0 0 0 1 0 0 0 1
9 1 0 0 0 1 0 0 0 1
9 1 0 0 0 1 0 0 0 1
9 1 0 0 0 1 0 0 0 1
9 1 0 0 0 1 0 0 0 1
9 1 0 0 0 1 0 0 0 1
9 1 0 0 0 1 0 0 0 1
9 1 0 0 0 1 0 0 0 1
9 1 0 0 0 1 0 0 0 1
9 1 0 0 0 1 0 0 0 1
9 1 0 0 0 1 0 0 0 1
9 1 0 0 0 1 0 0 0 1
9 1 0 0 0 1 0 0 0 1
9 1 0 0 0 1 0 0 0 1
9 1 0 0 0 1 0 0 0 1
9 1 0 0 0 1 0 0 0 1
9 1 0 0 0 1 0 0 0 1
9 1 0 0 0 1 0 0 0 1
9 1 0 0 0 1 0 0 0 1
9 1 0 0 0 1 0 0 0 1
9 1 0 0 0 1 0 0 0 1
9 1 0 0 0 1 0 0 0 1
9 1 0 0 0 1 0 0 0 1
9 1 0 0 0 1 0 0 0 1
9 1 0 0 0 1 0 0 0 1
9 1 0 0 0 1 0 0 0 1
9 1 0 0 0 1 0 0 0 1
9 1 0 0 0 1 0 0 0 1
9 1 0 0 0 1 0 0 0 1
9 1 0 0 0 1 0 0 0 1
9 1 0 0 0 1 0 0 0 1
9 1 0 0 0 1 0 0 0 1
9 1 0 0 0 1 0 0 0 1
9 1 0 0 0 1 0 0 0 1
9 1 0 0 0 1 0 0 0 1
9 1 0 0 0 1 0 0 0 1
9 1 0 0 0 1 0 0 0 1
9 1 0 0 0 1 0 0 0 1
9 1 0 0 0 1 0 0 0 1
9 1 0 0 0 1 0 0 0 1
9 1 0 0 0 1 0 0 0 1
9 1 0 0 0 1 0 0 0 1
9 1 0 0 0 1 0 0 0 1
9 1 0 0 0 1 0 0 0 1
9 1 0 0 0 1 0 0 0 1
9 1 0 0 0 1 0 0 0 1
9 1 0 0 0 1 0 0 0 1
9 1 0 0 0 1 0 0 0 1
9 1 0 0 0 1 0 0 0 1
9 1 0 0 0 1 0 0 0 1
9 1 0 0 0 1 0 0 0 1
9 1 0 0 0 1 0 0 0 1
9 1 0 0 0 1 0 0 0 1
9 1 0 0 0 1 0 0 0 1
9 1 0 0 0 1 0 0 0 1
9 1 0 0 0 1 0 0 0 1
9 1 0 0 0 1 0 0 0 1
9 1 0 0 0 1 0 0 0 1
9 1 0 0 0 1 0 0 0 1
9 1 0 0 0 1 0 0 0 1
9 1 0 0 0 1 0 0 0 1
9 1 0 0 0 1 0 0 0 1
9 1 0 0 0 1 0 0 0 1
9 1 0 0 0 1 0 0 0 1
9 1 0 0 0 1 0 0 0 1
9 1 0 0 0 1 0 0 0 1
9 1 0 0 0 1 0 0 0 1
9 1 0 0 0 1 0 0 0 1
9 1 0 0 0 1 0 0 0 1
9 1 0 0 0 1 0 0 0 1
9 1 0 0 0 1 0 0 0 1
9 1 0 0 0 1 0 0 0 1
9 1 0 0 0 1 0 0 0 1
9 1 0 0 0 1 0 0 0 1
9 1 0 0 0 1 0 0 0 1
9 1 0 0 0 1 0 0 0 1
9 1 0 0 0 1 0 0 0 1
9 1 0 0 0 1 0 0 0 1
9 1 0 0 0 1 0 0 0 1
9 1 0 0 0 1 0 0 0 1
9 1 0 0 0 1 0 0 0 1
9 1 0 0 0 1 0 0 0 1
9 1 0 0 0 1 0 0 0 1
9 1 0 0 0 1 0 0 0 1
9 1 0 0 0 1 0 0 0 1
9 1 0 0 0 1 0 0 0 1
9 1 0 0 0 1 0 0 0 1
9 1 0 0 0 1 0 0 0 1
9 1 0 0 0 1 0 0 0 1
9 1 0 0 0 1 0 0 0 1
