POINTS:
0.0 0.0
0.0 0.5
0.0 1.0
0.5 0.0
0.5 0.5
0.5 1.0
1.0 0.0
1.0 0.5
1.0 1.0
CELLS:
3 0 0 3 4
3 0 0 4 1
3 0 1 4 5
3 0 1 5 2
3 0 3 6 7
3 0 3 7 4
3 0 4 7 8
3 0 4 8 5
FACES:
2 1 0 1
2 231 6 7
2 1 1 2
2 231 7 8
2 230 2 5
2 1 0 3
2 230 5 8
2 1 3 6
VDATA:
3 -10 0 0
3 -10 0 0
3 -10 0 0
3 -10 0 0
3 -10 0 0
3 -10 0 0
3 -10 0 0
3 -10 0 0
3 -10 0 0
CDATA:
9 1 0 0 0 1 0 0 0 1
9 1 0 0 0 1 0 0 0 1
9 1 0 0 0 1 0 0 0 1
9 1 0 0 0 1 0 0 0 1
9 1 0 0 0 1 0 0 0 1
9 1 0 0 0 1 0 0 0 1
9 1 0 0 0 1 0 0 0 1
9 1 0 0 0 1 0 0 0 1
