\relax 
\@writefile{toc}{\contentsline {section}{\tocsection {}{11}{Experiments}}{27}}
\newlabel{sec:experiments}{{11}{27}}
\newlabel{geoLevel0}{{7a}{27}}
\newlabel{sub@geoLevel0}{{a}{27}}
\newlabel{geoLevel1}{{7b}{27}}
\newlabel{sub@geoLevel1}{{b}{27}}
\@writefile{lof}{\contentsline {figure}{\numberline {7}{\ignorespaces Reference geometry approximating ventricles and atria on level $\ell =0$ and with three uniform refinement steps.\relax }}{27}}
\newlabel{fig:mesh}{{7}{27}}
\@writefile{lot}{\contentsline {table}{\numberline {6}{\ignorespaces Discretization parameters for the linear finite elements space $\ensuremath  {\mathchoice {\unhbox \voidb@x \hbox {\relax \mathversion  {bold}$\displaystyle \mathbf  {V}$}} {\unhbox \voidb@x \hbox {\relax \mathversion  {bold}$\textstyle \mathbf  {V}$}} {\unhbox \voidb@x \hbox {\relax \mathversion  {bold}$\scriptstyle \mathbf  {V}$}} {\unhbox \voidb@x \hbox {\relax \mathversion  {bold}$\scriptscriptstyle \mathbf  {V}$}}}^h$ approximating the electric potential on the meshes in Fig.\nonbreakingspace 7\hbox {} (all lengths are given in mm).\relax }}{27}}
\newlabel{tab:meshes}{{6}{27}}
\@writefile{toc}{\contentsline {paragraph}{\tocparagraph {}{}{\bf  Numerical evaluation of the convergence properties}}{27}}
\@writefile{lof}{\contentsline {figure}{\numberline {8}{\ignorespaces Illustration of the Purkinje fibers and the stimulus points at the end of each branch are shown with their respective activation time. The external stimulus points of the sinus node at $t = 0$\tmspace  +\thinmuskip {.1667em}s is shown in green.\relax }}{28}}
\newlabel{fig:Purkinje}{{8}{28}}
\@writefile{toc}{\contentsline {paragraph}{\tocparagraph {}{}{\bf  Digression on extrapolation}}{28}}
\newlabel{eq: extrapolation}{{31}{28}}
\@writefile{lof}{\contentsline {figure}{\numberline {9}{\ignorespaces Potential $V_\text  {m}$ for different time steps, substeps and reference points.\relax }}{28}}
\newlabel{fig:Potential}{{9}{28}}
\@writefile{lot}{\contentsline {table}{\numberline {7}{\ignorespaces $\mathrm  L_2$-norm of the potential on level $\ell =1$ with ${\vartriangle } t = 2^{-j}$ ms.\relax }}{29}}
\newlabel{tab:convergence coarse}{{7}{29}}
\@writefile{lot}{\contentsline {table}{\numberline {8}{\ignorespaces Convergence test for the substepping steps $M=2^m$ for different time step size ${\vartriangle } t = 2^{-j}$ ms.\relax }}{29}}
\newlabel{tab: substeps coarse}{{8}{29}}
\@writefile{lot}{\contentsline {table}{\numberline {9}{\ignorespaces Convergence test in time ${\vartriangle } t = 2^{-j}$ ms for the different substepping steps $M=2^m$.\relax }}{30}}
\newlabel{tab: timestep coarse}{{9}{30}}
\@writefile{lot}{\contentsline {table}{\numberline {10}{\ignorespaces $\mathrm  L_2$-norm of the potential on level $\ell =1$ with ${\vartriangle } t = 0.1\cdot 2^{-j}$ ms.\relax }}{31}}
\newlabel{tab:convergence fine}{{10}{31}}
\@writefile{lot}{\contentsline {table}{\numberline {11}{\ignorespaces Convergence test for the substepping steps $M=2^m$ for different timestep size ${\vartriangle } t = 0.1\cdot 2^{-j}$ ms.\relax }}{31}}
\newlabel{tab: substep fine}{{11}{31}}
\@writefile{lot}{\contentsline {table}{\numberline {12}{\ignorespaces Convergence test in time ${\vartriangle } t = 0.1\cdot 2^{-j}$ ms for the different substepping steps $M=2^m$.\relax }}{32}}
\newlabel{tab: timestep fine}{{12}{32}}
\@writefile{lof}{\contentsline {figure}{\numberline {10}{\ignorespaces Potential $V_\text  {m}$ for different time steps, substeps and reference points.\relax }}{32}}
\newlabel{fig:Potential}{{10}{32}}
\@writefile{lot}{\contentsline {table}{\numberline {13}{\ignorespaces $\mathrm  L_2$-distance of the potential on level $\ell =1$ with ${\vartriangle } t = 0.1\cdot 2^{-j}$ ms with a reference solution on level 2 with ${\vartriangle } t = 0.0000125$ ms and $m=8$.\relax }}{33}}
\newlabel{tab:convergence fine}{{13}{33}}
\@writefile{lof}{\contentsline {figure}{\numberline {11}{\ignorespaces The excitation function $I_\text  {ext}$ for different scaling factors with duration $\tau _j = 0.003$s,amplitude $A_j=0.8202$V and starting time $t_j=17$s. \relax }}{34}}
\newlabel{fig:Sigmoid}{{11}{34}}
\@writefile{lot}{\contentsline {table}{\numberline {14}{\ignorespaces  \textbf  {smooth excitation }$\mathrm  L_2$-norm of the potential on level $\ell =1$ with ${\vartriangle } t = 2^{-j}$ ms with a reference solution on level 1 with ${\vartriangle } t = 0.0000125$ ms and $m=16$.\relax }}{35}}
\newlabel{tab:convergence coarse}{{14}{35}}
\@writefile{lot}{\contentsline {table}{\numberline {15}{\ignorespaces  \textbf  {smooth excitation }$\mathrm  L_2$-norm of the potential on level $\ell =1$ with ${\vartriangle } t = 2^{-j}$ ms.\relax }}{37}}
\newlabel{tab:convergence coarse}{{15}{37}}
\@writefile{lot}{\contentsline {table}{\numberline {16}{\ignorespaces \textbf  {smooth excitation }Convergence test for the substepping steps $M=2^m$ for different time step size ${\vartriangle } t = 2^{-j}$ ms.\relax }}{37}}
\newlabel{tab: substeps coarse}{{16}{37}}
\@writefile{lot}{\contentsline {table}{\numberline {17}{\ignorespaces \textbf  {smooth excitation }Convergence test in time ${\vartriangle } t = 2^{-j}$ ms for the different substepping steps $M=2^m$.\relax }}{38}}
\newlabel{tab: timestep coarse}{{17}{38}}
\@writefile{lof}{\contentsline {figure}{\numberline {12}{\ignorespaces Potential $V_\text  {m}$ for different excitation and schemes for time integration.\relax }}{38}}
\newlabel{fig:Potential}{{12}{38}}
\@writefile{lot}{\contentsline {table}{\numberline {18}{\ignorespaces Duration of the simulation on level $\ell =1$ with ${\vartriangle } t = 0.1 \cdot 2^{-j}$ ms, $T=0.7$, smoothed exitation and on 128 procs(hours:minutes:seconds).\relax }}{38}}
\newlabel{tab:convergence coarse}{{18}{38}}
\@writefile{lot}{\contentsline {table}{\numberline {19}{\ignorespaces \textbf  {smooth excitation }Convergence test for the substepping steps $M=2^m$ for different time step size ${\vartriangle } t = 0.1 \cdot 2^{-j}$ ms.\relax }}{39}}
\newlabel{tab: substeps coarse}{{19}{39}}
\@setckpt{Experiments}{
\setcounter{page}{40}
\setcounter{equation}{31}
\setcounter{enumi}{3}
\setcounter{enumii}{0}
\setcounter{enumiii}{0}
\setcounter{enumiv}{0}
\setcounter{footnote}{0}
\setcounter{mpfootnote}{0}
\setcounter{parentequation}{23}
\setcounter{part}{0}
\setcounter{section}{11}
\setcounter{subsection}{0}
\setcounter{subsubsection}{0}
\setcounter{paragraph}{0}
\setcounter{subparagraph}{0}
\setcounter{figure}{12}
\setcounter{table}{19}
\setcounter{thrm}{0}
\setcounter{float@type}{8}
\setcounter{ContinuedFloat}{0}
\setcounter{subfigure}{0}
\setcounter{subtable}{0}
\setcounter{algorithm}{0}
\setcounter{ALC@unique}{0}
\setcounter{ALC@line}{0}
\setcounter{ALC@rem}{0}
\setcounter{ALC@depth}{0}
\setcounter{theorem}{0}
}
