/* XPM */
static char *magick[] = {
/* columns rows colors chars-per-pixel */
"263 166 32 1",
"  c #030303",
". c #0b0b0b",
"X c #141414",
"o c #1b1b1b",
"O c #232323",
"+ c #2b2b2b",
"@ c #333333",
"# c #3c3c3c",
"$ c #434343",
"% c #4c4c4c",
"& c #545454",
"* c #5b5b5b",
"= c #646464",
"- c #6c6c6c",
"; c #747474",
": c #7b7b7b",
"> c #838383",
", c #8c8c8c",
"< c #939393",
"1 c #9c9c9c",
"2 c #a4a4a4",
"3 c #acacac",
"4 c #b3b3b3",
"5 c #bbbbbb",
"6 c #c4c4c4",
"7 c #cbcbcb",
"8 c #d3d3d3",
"9 c #dcdcdc",
"0 c #e4e4e4",
"q c #ececec",
"w c #f4f4f4",
"e c #fefefe",
/* pixels */
"eeeeeeeeeeeeeeeeeeeeeeeeeeeeeeeeeeeeeeeeeeeeeeeeeeeeeeeeeeeeeeeeeeeeeeeeeeeeeeeeeeeeeeeeeeeeeeeeeeeeeeeeeeeeeeeeeeeeeeeeeeeeeeeeeeeeeeeeeeeeeeeeeeeeeeeeeeeeeeeeeeeeeeeeeeeeeeeeeeeeeeeeeeeeeeeeeeeeeeeeeeeeeeeeeeeeeeeeeeeeeeeeeeeeeeeeeeeeeeeeeeeeeeeeeeeeeeeeeeeeeee",
"eeeeeeeeeeeeeeeeeeeeeeeeeeeeeeeeeeeeeeeeeeeeeeeeeeeeeeeeeeeeeeeeeeeeeeeeeeeeeeeeeeeeeeeeeeeeeeeeeeeeeeeeeeeeeeeeeeeeeeeeeeeeeeeeeeeeeeeeeeeeeeeeeeeeeeeeeeeeeeeeeeeeeeeeeeeeeeeeeeeeeeeeeeeeeeeeeeeeeeeeeeeeeeeeeeeeeeeeeeeeeeeeeeeeeeeeeeeeeeeeeeeeeeeeeeeeeeeeeeeeeee",
"eeeeeeeeeeeeeeeeeeeeeeeeeeeeeeeeeeeeeeeeeeeeeeeeeeeeeeeeeeeeeeeeeeeeeeeeeeeeeeeeeeeeeeeeeeeeeeeeeeeeeeeeeeeeeeeeeeeeeeeeeeeeeeeeeeeeeeeeeeeeeeeeeeeeeeeeeeeeeeeeeeeeeeeeeeeeeeeeeeeeeeeeeeeeeeeeeeeeeeeeeeeeeeeeeeeeeeeeeeeeeeeeeeeeeeeeeeeeeeeeeeeeeeeeeeeeeeeeeeeeeee",
"eeeeeeeeeeeeeeeeeeeeeeeeeeeeeeeeeeeeeeeeeeeeeeeeeeeeeeeeeeeeeeeeeeeeeeeeeeeeeeeeeeeeeeeeeeeeeeeeeeeeeeeeeeeeeeeeeeeeeeeeeeeeeeeeeeeeeeeeeeeeeeeeeeeeeeeeeeeeeeeeeeeeeeeeeeeeeeeeeeeeeeeeeeeeeeeeeeeeeeeeeeeeeeeeeeeeeeeeeeeeeeeeeeeeeeeeeeeeeeeeeeeeeeeeeeeeeeeeeeeeeee",
"eeeeeeeeeeeeeeeeeeeeeeeeeeeeeeeeeeeeeeeeeeeeeeeeeeeeeeeeeeeeeeeeeeeeeeeeeeeeeeeeeeeeeeeeeeeeeeeeeeeeeeeeeeeeeeeeeeeeeeeeeeeeeeeeeeeeeeeeeeeeeeeeeeeeeeeeeeeeeeeeeeeeeeeeeeeeeeeeeeeeeeeeeeeeeeeeeeeeeeeeeeeeeeeeeeeeeeeeeeeeeeeeeeeeeeeeeeeeeeeeeeeeeeeeeeeeeeeeeeeeeee",
"eeeeeeeeeeeeeeeeeeeeeeeeeeeeeeeeeeeeeeeeeeeeeeeeeeeeeeeeeeeeeeeeeeeeeeeeeeeeeeeeeeeeeeeeeeeeeeeeeeeeeeeeeeeeeeeeeeeeeeeeeeeeeeeeeeeeeeeeeeeeeeeeeeeeeeeeeeeeeeeeeeeeeeeeeeeeeeeeeeeeeeeeeeeeeeeeeeeeeeeeeeeeeeeeeeeeeeeeeeeeeeeeeeeeeeeeeeeeeeeeeeeeeeeeeeeeeeeeeeeeeee",
"eeeeeeeeeeeeeeeeeeeeeeeeeeeeeeeeeeeeeeeeeeeeeeeeeeeeeeeeeeeeeeeeeeeeeeeeeeeeeeeeeeeeeeeeeeeeeeeeeeeeeeeeeeeeeeeeeeeeeeeeeeeeeeeeeeeeeeeeeeeeeeeeeeeeeeeeeeeeeeeeeeeeeeeeeeeeeeeeeeeeeeeeeeeeeeeeeeeeeeeeeeeeeeeeeeeeeeeeeeeeeeeeeeeeeeeeeeeeeeeeeeeeeeeeeeeeeeeeeeeeeee",
"eeeeeeeeeeeeeeeeeeeeeeeeeeeeeeeeeeeeeeeeeeeeeeeeeeeeeeeeeeeeeeeeeeeeeeeeeeeeeeeeeeeeeeeeeeeeeeeeeeeeeeeeeeeeeeeeeeeeeeeeeeeeeeeeeeeeeeeeeeeeeeeeeeeeeeeeeeeeeeeeeeeeeeeeeeeeeeeeeeeeeeeeeeeeeeeeeeeeeeeeeeeeeeeeeeeeeeeeeeeeeeeeeeeeeeeeeeeeeeeeeeeeeeeeeeeeeeeeeeeeeee",
"eeeeeeeeeeeeeeeeeeeeeeeeeeeeeeeeeeeeeeeeeeeeeeeeeeeeeeeeeeeeeeeeeeeeeeeeeeeeeeeeeeeeeeeeeeeeeeeeeeeeeeeeeeeeeeeeeeeeeeeeeeeeeeeeeeeeeeeeeeeeeeeeeeeeeeeeeeeeeeeeeeeeeeeeeeeeeeeeeeeeeeeeeeeeeeeeeeeeeeeeeeeeeeeeeeeeeeeeeeeeeeeeeeeeeeeeeeeeeeeeeeeeeeeeeeeeeeeeeeeeeee",
"eeeeeeeeeeeeeeeeeeeeeeeeeeeeeeeeeeeeeeeeeeeeeeeeeeeeeeeeeeeeeeeeeeeeeeeeeeeeeeeeeeeeeeeeeeeeeeeeeeeeeeeeeeeeeeeeeeeeeeeeeeeeeeeeeeeeeeeeeeeeeeeeeeeeeeeeeeeeeeeeeeeeeeeeeeeeeeeeeeeeeeeeeeeeeeeeeeeeeeeeeeeeeeeeeeeeeeeeeeeeeeeeeeeeeeeeeeeeeeeeeeeeeeeeeeeeeeeeeeeeeee",
"eeeeeeeeeeeeeeeeeeeeeeeeeeeeeeeeeeeeeeeeeeeeeeeeeeeeeeeeeeeeeeeeeeeeeeeeeeeeeeeeeeeeeeeeeeeeeeeeeeeeeeeeeeeeeeeeeeeeeeeeeeeeeeeeeeeeeeeeeeeeeeeeeeeeeeeeeeeeeeeeeeeeeeeeeeeeeeeeeeeeeeeeeeeeeeeeeeeeeeeeeeeeeeeeeeeeeeeeeeeeeeeeeeeeeeeeeeeeeeeeeeeeeeeeeeeeeeeeeeeeeee",
"eeeeeeeeeeeeeeeeeeeeeeeeeeeeeeeeeeeeeeeeeeeeeeeeeeeeeeeeeeeeeeeeeeeeeeeeeeeeeeeeeeeeeeeeeeeeeeeeeeeeeeeeeeeeeeeeeeeeeeeeeeeeeeeeeeeeeeeeeeeeeeeeeeeeeeeeeeeeeeeeeeeeeeeeeeeeeeeeeeeeeeeeeeeeeeeeeeeeeeeeeeeeeeeeeeeeeeeeeeeeeeeeeeeeeeeeeeeeeeeeeeeeeeeeeeeeeeeeeeeeeee",
"eeeeeeeeeeeeeeeeeeeeeeeeeeeeeeeeeeeeeeeeeeeeeeeeeeeeeeeeeeeeeeeeeeeeeeeeeeeeeeeeeeeeeeeeeeeeeeeeeeeeeeeeeeeeeeeeeeeeeeeeeeeeeeeeeeeeeeeeeeeeeeeeeeeeeeeeeeeeeeeeeeeeeeeeeeeeeeeeeeeeeeeeeeeeeeeeeeeeeeeeeeeeeeeeeeeeeeeeeeeeeeeeeeeeeeeeeeeeeeeeeeeeeeeeeeeeeeeeeeeeeee",
"eeeeeeeeeeeeeeeeeeeeeeeeeeeeeeeeeeeeeeeeeeeeeeeeeeeeeeeeeeeeeeeweeeweeeweeewweeeeeeeeeeeeeeeeeeeeeeeeeeeeeeeeeeeeeeeeeeeeeeeeeeeeeeeeeeeeeeeeeeeeeeeeeeeeeeeeeeewewewwew9332225weeeeeweeeeeeeeeeeeeeeeeeeeeeeeeeeeeeeeeeeeeeeeeeeeeeeeeeeeeeeeeeeeeeeeeeeeeeeeeeeeeeeee",
"eeeeeeeeeeeeeeeeeeeeeeeeeeeeeeeeeeeeeeeeeeeeeeeeeeeeeeeeeeeeeweww94,----:37qeeeeeeeeeeeeeeeeeeeeeeeeeeeeeeeeeeeeeeeeeeeeeeeeeeeeeeeeeeeeeeeeeeeeeeeeeeeeeeeeeeeeeewe03-o.     .X#,6weweeeeeeeeeeeeeeeeeeeeeeeeeeeeeeeeeeeeeeeeeeeeeeeeeeeeeeeeeeeeeeeeeeeeeeeeeeeeeeeee",
"eeeeeeeeeeeeeeeeeeeeeeeeeeeeeeeeeeeeeeeeeeeeeeeeeeeeeeeeeeeeee0<#X        .O*6weeeeeeeeeeeeeeeeeeeeeeeeeeeeeeeeeeeeeeeeeeeeeeeeeeeeeeeeeeeeeeeeeeeeeeeeeeeeeeeeeeww:o    .@#$O.   .$7weeeeeeeeeeeeeeeeeeeeeeeeeeeeeeeeeeeeeeeeeeeeeeeeeeeeeeeeeeeeeeeeeeeeeeeeeeeeeeeee",
"eeeeeeeeeeeeeeeeeeeeeeeeeeeeeeeeeeeeeeeeeeeeeeeeeeeeeeeeeeewq:o   O#-1<>&+.   $5weweeeeeeeeeeeeeeeeeeeeeeeeeeeeeeeeeeeeeeeeeeeeeeeeeeeeeeeeeeeeeeeeeeeeeeeeeeeeww2+  .%18qweew05:O   *9eweeeeeeeeeeeeeeeeeeeeeeeeeeeeeeeeeeeeeeeeeeeeeeeeeeeeeeeeeeeeeeeeeeeeeeeeeeeeee",
"eeeeeeeeeeeeeeeeeeeeeeeeeeeeeeeeeeeeeeeeeeeeeeeeeeeeeeeeeew3@  o;4qeweweww7,@  X=0eeeeeeeeeeeeeeeeeeeeeeeeeeeeeeeeeeeeeeeeeeeeeeeeeeeeeeeeeeeeeeeeeeeeeeeeeeeweq-. .*6wweeeeeweewq,O  O6eeeeeeeeeeeeeeeeeeeeeeeeeeeeeeeeeeeeeeeeeeeeeeeeeeeeeeeeeeeeeeeeeeeeeeeeeeeeeee",
"eeeeeeeeeeeeeeeeeeeeeeeeeeeeeeeeeeeeeeeeeeeeeeeeeeeeeeeeew<. X:9weeeeeeeeewww3#  $7eeeeeeeeeeeeeeeeeeeeeeeeeeeeeeeeeeeeeeeeeeeeeeeeeeeeeeeeeeeeeeeeeeeeeeeeeewq& .$8eweeweeeeeeeeeww,X o3eeeeeeeeeeeeeeeeeeeeeeeeeeeeeeeeeeeeeeeeeeeeeeeeeeeeeeeeeeeeeeeeeeeeeeeeeeeeee",
"eeeeeeeeeeeeeeeeeeeeeeeeeeeeeeeeeeeeeeeeeeeeeeeeeeeeeewew=  @7eeeeeeeeeeeeeeewq;  o7weeeeeeeeeeeeeeeeeeeeeeeeeeeeeeeeeeeeeeeeeeeeeeeeeeeeeeeeeeeeeeeeeeeeeeeew&  ;qweeeeeeeeeeeeeeeee4o o4weeeeeeeeeeeeeeeeeeeeeeeeeeeeeeeeeeeeeeeeeeeeeeeeeeeeeeeeeeeeeeeeeeeeeeeeeeee",
"eeeeeeeeeeeeeeeeeeeeeeeeeeeeeeeeeeeeeeeeeeeeeeeeeeeeeeew: .&qeeweeeeeeeeeeeeewwe2X +9eeeeeeeeeeeeeeeeeeeeeeeeeeeeeeeeeeeeeeeeeeeeeeeeeeeeeeeeeeeeeeeeeeeeeeww;  >weeeeeeeeeeeeeeeeeeww8O o8eeeeeeeeeeeeeeeeeeeeeeeeeeeeeeeeeeeeeeeeeeeeeeeeeeeeeeeeeeeeeeeeeeeeeeeeeeee",
"eeeeeeeeeeeeeeeeeeeeeeeeeeeeeeeeeeeeeeeeeeeeeeeeeeeeeee2. *qweeeeeeeeeeeeeeeewewe3. &weeeeeeeeeeeeeeeeeeeeeeeeeeeeeeeeeeeeeeeeeeeeeeeeeeeeeeeeeeeeeeeeeeeeee4. =weeeeeeeeeeeeeeeeeeeewe5o @wweeeeeeeeeeeeeeeeeeeeeeeeeeeeeeeeeeeeeeeeeeeeeeeeeeeeeeeeeeeeeeeeeeeeeeeeee",
"eeeeeeeeeeeeeeeeeeeeeeeeeeeeeeeeeeeeeeeeeeeeeeeeeeeeee9O @qeweeeeeeeeeeeeeeeeeeeew: .<weeeeeeeeeeeeeeeeeeeeeeeeeeeeeeeeeeeeeeeeeeeeeeeeeeeeeeeeeeeeeeeeeeeew# #qeweeeeeeeeeeeeeeeeeeeeew4  2eeeeeeeeeeeeeeeeeeeeeeeeeeeeeeeeeeeeeeeeeeeeeeeeeeeeeeeeeeeeeeeeeeeeeeeeeee",
"eeeeeeeeeeeeeeeeeeeeeeeeeeeeeeeeeeeeeeeeeeeeeeeeeeeeew: X7eeeeeeeeeeeeeeeeeeeeeeeew& oweeeeeeeeeeeeeeeeeeeeeeeeeeeeeeeeeeeeeeeeeeeeeeeeeeeeeeeeeeeeeeeeeeew2  4eeeeeeeeeeeeeeeeeeeeeeeeew# +8eeeeeeeeeeeeeeeeeeeeeeeeeeeeeeeeeeeeeeeeeeeeeeeeeeeeeeeeeeeeeeeeeeeeeeeeee",
"eeeeeeeeeeeeeeeeeeeeeeeeeeeeeeeeeeeeeeeeeeeeeeeeeeeee9X -eeeeeeeeeeeeeeeeeeeeeeeewe7. <eeeeeeeeeeeeeeeeeeeeeeeeeeeeeeeeeeeeeeeeeeeeeeeeeeeeeeeeeeeeeeeeeeeqO $wweeeeeeeeeeeeeeeeeeeeeeeew4. >eeeeeeeeeeeeeeeeeeeeeeeeeeeeeeeeeeeeeeeeeeeeeeeeeeeeeeeeeeeeeeeeeeeeeeeeee",
"eeeeeeeeeeeeeeeeeeeeeeeeeeeeeeeeeeeeeeeeeeeeeeeeeeeee> X9eeeweeeeeeeeeeeeewweeeeeewe& Oqweeeeeeeeeeeeeeeeeeeeeeeeeeeeeeeeeeeeeeeeeeeeeeeeeeeeeeeeeeeeeeeee4  3eeeeeq58eeee44ewee938eeeeeew% $eeeeeeeeeeeeeeeeeeeeeeeeeeeeeeeeeeeeeeeeeeeeeeeeeeeeeeeeeeeeeeeeeeeeeeeeee",
"eeeeeeeeeeeeeeeeeeeeeeeeeeeeeeeeeeeeeeeeeeeeeeeeeeeew@ =weeew,,qewe3:www8-O@,qweeeee5. 3eeeeeeeeeeeeeweeeeeeeeeeeeeeeeeeeeeeeeeeeeeeeeeeeeeeeeeeeeeeeeeeee* Oweweee4.o8ee0o+qww*X.:eeeeeee3 X9weeeeeeeeeeeeeeeeeeeeeeeeeeeeeeeeeeeeeeeeeeeeeeeeeeeeeeeeeeeeeeeeeeeeeeee",
"eeeeeeeeeeeeeeeeeeeeeeeeeeeeeeeeeeeeeeeeeeeeeeeeeeee7..4eeeew+ 2eee-Oqeq+@1-X-weeeeew@ *weeeeeeeeeewwweeeeeeeeeeeeeeeeeeeeeeeeeeeeeeeeeeeeeeeeeeeeeeeeeeee+ ;eeeeee3  *ee0oO0e9o*X-eeeeeee9. 3eeeeeeeeeeeeeeeeeeeeeeeeeeeeeeeeeeeeeeeeeeeeeeeeeeeeeeeeeeeeeeeeeeeeeeeee",
"eeeeeeeeeeeeeeeeeeeeeeeeeeeeeeeeeeeeeeeeeeeeeeeeeeee1 Oqweeeq+ o8ee;o0w< 2ww; 8eeeeee:.@wweeeeeeew0<$,eeeeeeeeeeeeeeeeeeeeeeeeeeeeeeeeeeeeeeeeeeeeeeeeeee9X 1eeweee3  .2ewoOqwwqqo:eeeeeeew@ :eweeeeeeeeeeeeeeeeeeeeeeeeeeeeeeeeeeeeeeeeeeeeeeeeeeeeeeeeeeeeeeeeeeeeeee",
"eeeeeeeeeeeeeeeeeeeeeeeeeeeeeeeeeeeeeeeeeeeeeeeeeeew; *weeeewO..&ww:o9e$+wee5.1eeeeee4 Xweeeeeww4*O  &weeeeeeeeeeeeeeeeeeeeeeeewweweeweeeeeeeeeweeeeeweee8X 6eeeeee3 o o8qoOqeeeqX:eeeeeeew& %weeeeeeeeeeeeeeeeeeeeeeeeeeeeeeeeeeeeeeeeeeeeeeeeeeeeeeeeeeeeeeeeeeeeeeee",
"eeeeeeeeeeeeeeeeeeeeeeeeeeeeeeeeeeeeeeeeeeeeeeeeeeee- ,eeeeeq+%*.2w,o0qO*eeeqo-eeeeee7..8ewew7:+     #wwweewwewwwwwwwwwwwwwwwwqwwqqqqqqqqqqqq0qqqq0qq0wee7.o0eeeeee3 -- *0OOqeeeqo;weeeeeee; %eeeeeeeeeeeeeeeeeeeeeeeeeeeeeeeeeeeeeeeeeeeeeeeeeeeeeeeeeeeeeeeeeeeeeeeee",
"eeeeeeeeeeeeeeeeeeeeeeeeeeeeeeeeeeeeeeeeeeeeeeeeeeee$ :eweeew+%9OOq:o9qO=eweqO*weeeew7  4ew2$        X&*%*&%$%$###########@#@@@@+++OO+OooooOooOOooooOo9ee7.oqeeeeee4 :0O 1OOqeeeqX,eeeeeeee: #weeeeeeeeeeeeeeeeeeeeeeeeeeeeeeeeeeeeeeeeeeeeeeeeeeeeeeeeeeeeeeeeeeeeeeee",
"eeeeeeeeeeeeeeeeeeeeeeeeeeeeeeeeeeeeeeeeeeeeeeeeeeee+ <eweeewO$e< *=o0q+*eeeq+*weeeew8X 5e5&X         %;-;;:::,<<,<<<1<<<<<<<,112323444455454455445767wee7.X0eeeeee3 ;e2.X.oqeeeqo:eeeeeeew: #weeeeeeeeeeeeeeeeeeeeeeeeeeeeeeeeeeeeweeeweeeeeeeeeeeeeeeeeeeeeeeeeeeeeee",
"eeeeeeeeeeeeeeeeweweeeeeeeeeeeeeeeeeeeeeeeeeeeeeeeew$ :weeeew+%ew&Xoo0w#@wwe7.:eeeeee6  9eew91%X     @weeweweeeweeeeweeeweeeeeeeeeeweeeeeeeeeeeeeeeeeeeee7. 8eeeeee5 :ww*  oqeeewo-eeeeeeew* $weeeeeeeeeeeeeeeeeeeeeeeeeeeeeeeeeeewq2:2qwweeeeeeeeeeeeeeeeeeeeeeeeeeeee",
"eeeeeeeeeeeeeeeew9qweeeeeeeeeeeeeeeeeeeeeeeeeeeeeeee; ;eeeeew@%we8o O0e>.6ew> 4weeeee5.Xqwewwewq,@.  &weeweeeeeeeeeeeeeeeeeeeeeeweeeeeeeeeeeeeeeeeeeweeee9X 2eeeeee4.;we0O oqeeewX-eeeeeeew$ :eeeeeeeeeeeeeeeeeeeeeeeeeeeeeeeeeewww$*,%$weeeeeeeeeeeeeeeeeeeeeeeeeeeeee",
"eeeweeeeeeeeeww1#+O,eweeeeeeeeeeeeeeeeeeeeeeeeeeeeee: $wweeew+%eew<.o9w9o#74o%wweeeee1 oweeeeeeeww7,@:eeeeeeeeeeeeeeeeeeeeeeeeeeeeeeeeeeeeeeeeeeeeeeeeeeee# ;weeeee7.:ewe3.OqeeewX;eeeeeeeqX 2weeeeeeeeeeeeeeeeeeeeeeeeeqqeeeeeeeee7weqX5eeweeeeeeeeeeeeeeeeeeeeeeeeeee",
"weweeweeeeeeew9%8w4Xqeeeeeeeeeeeeeeeeeeeeeeeeeeeeeee3 .8eweew*&weeq-@9we1@XX$5weeeeew* $weeeeeeeeeeewqweeeeeeeeeeeeeeeeeeeeeeeeeeeeeeeeeeeeeeeeeeeeeeeeeee: +wweeeeq69eeee88weeew9qeeeeeee4 X0eeeeeeeeeeeeeeeeeeeeeeeq>##@*qweeeeeeeww1O9ee7=eeeeeeeeeeeeeeeeeeeeeeeeee",
"eeq3>,7wweeeeweeww7.9ew88weeeeeeeeeeeeeeeeeeeeeeeeee0o ,eeeeewweewwweeewww78weeweeeeqo <eeeeeeeeeeeweweeeeeeeeeeeeeeeeeeeeeeeeeeeeeeeeeeeeeeeeeeeeeeeeeeee6 .5eeeeeeweeeeweweeeeeeeeeeeeew& #eweeeeeeeeeeeeeeeeeeeeew;%8eq*=weeeeeeww3o3eww6$eeeeeeeeeeeeeeeeeeeeeeeeee",
"w5+;2,@1weeeeweewq$%wwe1:weeeeeeeeeeeeeeeeeeeeeeeeeee* #weeeeeeeeeeeeweeeeeeeeeeeeew1 X8weeeeeeeeeeeeeeeeeeeeeeeeeeeeeeeeeeeeeeeeeeeeeeeeeeeeeeeeeeeeeeeeeq+ %wweeeeeeeeeeeeeeeeeeeeeeeee6. <eeeeeeeeeeeeeeeeeeeeeee9o8eee06weeweewe:@3ee982+578eeeeeeeeeeeeeeeeeeeeeee",
"w@1wee5-wweeeewe8$*qeew1:eeweeeeeeeeweweeweeeeeeeeeew5. 3eeeeeeeeeeeeeeeeeeeeeeeewew+ &weeeeeeeeeeeeeeeeeeeeeeeeeeeeeeeeeeww38eeeeeeeeeeeeeeeeeeeeeeeeeeeew2 .4eeeeeeeeeeeeeeeeeeeeeeeeww% +0eeeeeeeeeeeeeeeeeeeeeew<#weeeeww2&$-8e<+8www:*%X**3eeeeeeeeeeeeeeeeeeeeeee",
"4Xwweewwww638we8+:we9*%OO&*0eeeeeeew0qweweeeeeeeeeeeew$ @weeeeeeeeeeeeeeeeeeeeeeeew1  5eeeeeeeeeeeeeeeeeeeeeeeeeeeeeeeeeeew8X<eweeeeeeeeeeeeeeeeeeeeeeeeeeww@ +0eeeeeeeeeeeeeeeeeeeeeeee1  ,eeeeeeeeeeeeeeeeeeeeeeew=;eeeeww:$58*%qO4eewwwe8$weweeeeeeeeeeeeeeeeeeeeeee",
":&eeeeew7@&*O:w&;weww78-*88weeeeeee4X++&;3qeeeeeeeewew4. ;weeeeeeeeeeeeeeeeeeeeeew7X -weweeeeeeeeeeeeeeeeeeeeeeeeeeeeeeeeeewo3weeeeeeeeeeeeeeeeeeeeeeeeeeeee3. ;weeeeeeeeeeeeeeeeeeeeee5O #wweeeeeeeeeeeeeeeeeeeeeee*>eeeeew50ww,o5.:<1<7ew8%eeeeeeeeeeeeeeeeeeeeeeeeee",
"-=eeeeee:2ww1+8X8qqqwew1:eeeeeeeeeew53,-$oO-7weeeeeeeew*  1eweeeeeeeeeeeeeeeeeeww0+ o9eeeeeeeeeeeeeeeeeeeeeeeeeeeeewewqqeqww#8weeeeeeeeeeeeeeeeeeeeeeeeeeeeew: .-wweeeeeeeeeeeeeeeeeee8O o8eeeeeeeeeeeeeeeeeeeeeeeee-*eeeewwe6=+oO8>>,,<7weq6eeeeeeeeeeeeeeeeeeeeeeeeee",
";*eeeeweww8<#X8O@$#$1we4<eeeeeeeeeeeeewww9<@X&5weeeeeeeq$ .2weeeeeeeeeeeeeeeewew9$ .4eweeeeeeeeeeeeeeeeeeeeeeeeeeeee8*+$:%<e4weeeeeeeeeeeeeeeeeeeeeeeeeeeeewew=  -weeeeeeeeeeeeeeeeew6o o5eweeeeeeeeeeeeeeeeeeeeeeee3Oqeeeee<@<82o8eweweweeeweeeeeeeeeeeeeeeeeeeeeeeeee",
",@eeeeew8%@*:.wqqqqqweweweeeeeeeeeeeweeeewew4%X-qeeeeeee7o .;wweeeeeeeeeeeeeewe7+..;weeeeeeeeeeeeeeeeeeeeeeeeeeeeeew#*9w:.:eweeeeeeeeeeeeeeeeeeeeeeeeeeeeeeeeew=  %8weeeeeeeeeeeeeew<o o5eweweeeeeeeeeeeeeeeeeeeeeewq@,eee7-#-ww*o0eweeeeeeeweeeeeeeeeeeeeeeeeeeeeeeeee",
"7X9eeww7$*ww<Xweeeeeeeeeeeeeeeeeeeeeeeeeeeeeew1X+5weeeewe8@  &8weeweeeweeeweeq,o X<weeeeeeeeeeeeeeeeeeeeeeeeeeeeeee0o7wew+:eeeeeeeeeeeeeeeeeeeeeeeeeeeeeeeeeeeww-  X;8weeeeeeweeew4$  O5eeeeeeeeeeeeeeweeeeewqeweeeew4O286@<>X*$@.8eeeeeeeeeeeeeeeeeeeeeeeeeeeeeeeeeeee",
"w=%9ww:#*+83X.wweeeeeeeeeeeeeeeeeeeeeeeeeeeeeew7#X,wweeeee0&  X-8weeewweweeq5$  o4eeeeeeeeeeeeeeeeeeeeeeeeeeeeeeeee7Oqeew%:eeeeeeeeeeeeeeeeeeeeeeeeeeeeeeeeeeeeew1o  X*49wweewq7<$. .$8eeeeeeeeeeeeeeeeq4<;%+#0eeeeeee8;&&2ww4,5q19eeeeeeeeeeeeeeeeeeeeeeeeeeeeeeeeeeee",
"ew:@*%#87%@%3#7weeeeeeeeeeeeeeeeeeeeeeeeeeeeeweww;.:weeeweww>o . $>58wqq73=O  .&7weeeeeeeeeeeeeeeeeeeeeeeeeeeeeeeeeqo5eeqo>eeeeeeeeeeeeeeeeeeeeeeeeeeeeeeeeeeeweww9;o   .O$**#O.   #4wweweeeeeeeeeeew8,O.@%:<7eweeeewwewweweweewweeeeeeeeeeeeeeeeeeeeeeeeeeeeeeeeeeeeee",
"eewq56weewwweweeeeeeeeeeeeeeeeeeeeeeeeeeeeeeeeeeee;.3weeeeeee8;o   .XoXX.   .$4weeeeeeeeeeeeeeeeeeeeeeeeeeeeeeeeeeee&&qq>.,eeeeeeeeeeeeeeeeeeeeeeeeeeeeeeeeeeeeeeeee8,$o.       O;2weeeeeeeeeeeeeew5*o+,8qeeeeeeeeeeeeeeeeeeeeeeeeeeeeeeeeeeeeeeeeeeeeeeeeeeeeeeeeeeeee",
"eeeeeeeeeeeeeeeeeeeeeeeeeeeeeeeeeeeeeeeeeeeeeeeeeww-o4eeweeeeweq4*oX    .+%,8eweeeeeeeeeeeeeeeeeeeeeeeeeeeeeeeeeeeewq&#$:$>wweeeeeeeeeeeeeeeeeeeeeeeeeeeeeeeeeeeeeeewewq6<:,,>26weeeeeeeeeeeeeeewq*.$3qeweeeeeeeeeeeeeeeeeeeeeeeeeeeeeeeeeeeeeeeeeeeeeeeeeeeeeeeeeeeeee",
"eeeeeeeeeeeeeeeeeeeeeeeeeeeeeeeeeeeeeeeeeeeeeeeeewww*o7eeeeeewwewe0q75688qweeeeweeeeeeeeeeeeeeeeeeeeeeeeeeeeeeeeeeewww99w@4eeeeeeeeeeeeeeeeeeeeeeeeeeeeeeeeeeeeeeeeeeeewewweweweeweeeeeeeeeeeeee8#o2wwweeweeeeeeeeeeeeeeeeeeeeeeeeeeeeeeeeeeeeeeeeeeeeeeeeeeeeeeeeeeeee",
"eeeeeeeeeeeeeeeeeeeeeeeeeeeeeeeeeeeeeeeeeeeeeeeeeeeeq$#qeeeeeeeeeeeeeeeeeeeeeweeeeeeeeeeeeeeeeeeeeeeeeeeeeeeeeeeeeew%;88:oqeeeeeeeeeeeeeeeeeeeeeeeeeeeeeeeeeeeeeeee8wweeeeeeeeeeeeeeeeeeeeeeeww1O@8eeeeeeeeeeeeeeeeeeeeeeeeeeeeeeeeeeeeeeeeeeeeeeeeeeeeeeeeeeeeeeeeeeee",
"eeeeeeeeeeeeeeeeeeeeeeeeeeeeeeeeeeeeeeeeeeeeeeeeeeeew8o;weeeeeeeeeeeeeeeeeeeeeweeeeeeeeeeeeeeeeeeeeeeeeeeeeeeeeeeeew7*+#-7weeeeeeeeeeeeeeeeeeeeeeeeeeeeeeeeeeeeeeew%4eweeeeeeeeeeeeeeeeeeeeeee:.:weeeeeeeeeeeeeeeeeeeeeeeeeeeeeeeeeeeeeeeeeeeeeeeeeeeeeeeeeeeeeeeeeeeee",
"eeeeeeeeeeeeeeeeeeeeeeeeeeeeeeeeeeeeeeeeeeeeeeeeeeeewe,X5eeeeeeeeeeeeeeeeeeee8<weeeeeeeeeeeeeeeeeeeeeeeeeeeeeeeeeeeeweeweeeweeeeeeeeeeeeeeeeeeeeeeeeeeeeeeeeeeeewe8 *eeeeeeeeeeeeeew0weeeeeew2X:wwweeeeeeeeeeeeeeeeeeeeeeeeeeeeeeeeeeeeeeeeeeeeeeeeeeeeeeeeeeeeeeeeeeee",
"eeeeeeeeeeeeeeeeeeeeeeeeeeeeeeeeeeeeeeeeeeeeeeeeeeeeeeq+#weeeeeeeeeeeeeeeeeee,Oqeeeeeeeeeeeeeeeeeeeeeeeeeeeeeeeeeeeeeeeeeeeeeeeeeeeeeeeeeeeeeeeeeeeeeeeeeeeeeeeeee; X8eeeeeeeeeeeee7Oqeeeeee3X-weeeeeeeeeeeeeeeeeeeeeeeeeeeeeeeeeeeeeeeeeeeeeeeeeeeeeeeeeeeeeeeeeeeeeee",
"eeeeeeeeeeeeeeeeeeeeeeeeeeeeeeeeeeeeeeeeeeeeeeeeeeeeeew6.<we76weeeeeeeeeeeewq@ 4eeeeeeeeeeeeeeeeeeeeeeeeeeeeeeeeeeeeeeeeeeeeeeeeeeeeeeeeeeeeeeeeeeeeeeeeeeeeeeeeew+  ,eeeeeeeeeeeee6Xqeeeew4X%weeeeeeeeeeeeeeeeeeeeeeeeeeeeeeeeeeeeeeeeeeeeeeeeeeeeeeeeeeeeeeeeeeeeeeee",
"eeeeeeeeeeeeeeeeeeeeeeeeeeeeeeeeeeeeeeeeeeeeeeeeeeeeeeee&+ww;&weeeeeeeeeeeew5. &weeeeeeeeeeeeeeeeeeeeeeeeeeeeeeeeeeeeeeeeeeeeeeeeeeeeeeeeeeeeeeeeeeeeeeeeeeeeeeew7X  $weeeeeeeeeeee7X0eeee0+#0wweeeeeeeeeeeeeeeeeeeeeeeeeeeeeeeeeeeeeeeeeeeeeeeeeeeeeeeeeeeeeeeeeeeeeee",
"eeeeeeeeeeeeeeeeeeeeeeeeeeeeeeeeeeeeeeeeeeeeeeeeeeeeeeew7.3e;%eeeeeeeeeeeeee;  .7eeeeeeeeeeeeeeeeeeeeeeeeeeeeeeeeeeeeeeeeeeeeeeeeeeeeeeeeeeeeeeeeeeeeeeeeeeeeeeee:    5eeeeeeeeeeee8X8eeee=o8eeeeeeeeeeeeeeeeeeeeeeeeeeeeeeeeeeeeeeeeeeeeeeeeeeeeeeeeeeeeeeeeeeeeeeeeee",
"eeeeeeeeeeeeeeeeeeeeeeeeeeeeeeeeeeeeeeeeeeeeeeeeeeeeeeeww-#w:&eeeeeeeeeeeewwO   ,weeeeeeeeeeeeeeeeeeeeeeeeeeeeeeeeeeeeeeeeeeeeeeeeeeeeeeeeeeeeeeeeeeeeeeeeeeeeeewo    =eeeeeeeeeeee8o8ewe4X,weeeeeeeeeeeeeeeeeeeeeeeeeeeeeeeeeeeeeeeeeeeeeeeeeeeeeeeeeeeeeeeeeeeeeeeeee",
"eeeeeeeeeeeeeeeeeeeeeeeeeeeeeeeeeeeeeeeeeeeeeeeeeeeeeeeee5.3;%eweeeeeeeeeee5    @weeeeeeeeeeeeeeeeeeeeeeeeeeeeeeeeeeeeeeeeeeeeeeeeeeeeeeeeeeeeeeeeeeeeeeeeeeeeee4     oqeeeeeeeeeee8o6eeq#%weeeeeeeeeeeeeeeeeeeeeeeeeeeeeeeeeeeeeeeeeeeeeeeeeeeeeeeeeeeeeeeeeeeeeeeeeee",
"eeeeeeeeeeeeeeeeeeeeeeeeeeeeeeeeeeeeeeeeeeeeeeeeeeeeeeeeew@&:#wweeeeeeeeeew-    .5eeeeeeeeeeeeeeeeeeeeeeeeeeeeeeeeeeeeeeeeeeeeeeeeeeeeeeeeeeeeeeeeeeeeeeeeeeeeee-      2weeeeeeeeee8o7ew<X7eweeeeeeeeeeeeeeeeeeeeeeeeeeeeeeeeeeeeeeeeeeeeeeeeeeeeeeeeeeeeeeeeeeeeeeeeee",
"eeeeeeeeeeeeeeeeeeeeeeeeeeeeeeeeeeeeeeeeeeeeeeeeeeeeeeeeee< *$weeeeeeeeeeeqO     *weeeeeeeeeeeeeeeeeeeeeeeeeeeeeeeeeeeeeeeeeeeeeeeeeeeeeeeeeeeeeeeeeeeeeeeeeeewqo      &weeeeeeeeee0o7e9o-weeeeeeeeeeeeeeeeeeeeeeeeeeeeeeeeeeeeeeeeeeeeeeeeeeeeeeeeeeeeeeeeeeeeeeeeeeee",
"eeeeeeeeeeeeeeeeeeeeeeeeeeeeeeeeeeeeeeeeeeeeeeeeeeeeeeeeee8.O%weeeeeeeeeee2      oqeeeeeeeeeeeeeeeeeeeeeeeeeeeeeeeeeeeeeeeeeeeeeeeeeeeeeeeeeeeeeeeeeeeeeeeeeeweq:%O .@*2weeeeeeeeee9o7e,X8eeeeeeeeeeeeeeeeeeeeeeeeeeeeeeeeeeeeeeeeeeeeeeeeeeeeeeeeeeeeeeeeeeeeeeeeeeeee",
"eeeeeeeeeeeeeeeeeeeeeeeeeeeeeeeeeeeeeeeeeeeeeeeeeeeeeeeeeew@ %weeeeeeeeeee:.     o9eeeeeeeeeeeeeeeeeeeeeeeeeeeeeeeeeeeeeeeeeeeeeeeeeeeeeeeeeeeeeeeeeeeeeeeeeeeewee0O1wewweeeeeeeeee0o6w#*eeeeeeeeeeeeeeeeeeeeeeeeeeeeeeeeeeeeeeeeeeeeeeeeeeeeeeeeeeeeeeeeeeeeeeeeeeeeee",
"eeeeeeeeeeeeeeeeeeeeeeeeeeeeeeeeeeeeeeeeeeeeeeeeeeeeeeeeeee- @weeeeeeeeeeew72%.:50eeeeeeeeeeeeeeeeeeeeeeeeeeeeeeeeeeeeeeeeeeeeeeeeeeeeeeeeeeeeeeeeeeeeeeeeeeeeeewewO1eeeeeeeeeeeeee9o67.5weeeeeeeeeeeeeeeeeeeeeeeeeeeeeeeeeeeeeeeeeeeeeeeeeeeeeeeeeeeeeeeeeeeeeeeeeeeee",
"eeeeeeeeeeeeeeeeeeeeeeeeeeeeeeeeeeeeeeeeeeeeeeeeeeeeeeeeeew4 %weeeeeeeeeeeeee3O9eeeeeeeeeeeeeeeeeeeeeeeeeeeeeeeeeeeeeeeeeeeeeeeeeeeeeeeeeeeeeeeeeeeeeeeeeeeeeeeeeeqo1eeeeeeeeeeeeee0o4-+weeeeeeeeeeeeeeeeeeeeeeeeeeeeeeeeeeeeeeeeeeeeeeeeeeeeeeeeeeeeeeeeeeeeeeeeeeeeee",
"eeeeeeeeeeeeeeeeeeeeeeeeeeeeeeeeeeeeeeeeeeeeeeeeeeeeeeeeeewq.#weeeeeeeeeeeeee3OweeeeeeeeeeeeeeeeeeeeeeeeeeeeeeeeeeeeeeeeeeeeeeeeeeeeeeeeeeeeeeeeeeeeeeeeeeeeeeeeeewO2eeeeeeeeeeeeee9o2o:weeeeeeeeeeeeeeeeeeeeeeeeeeeeeeeeeeeeeeeeeeeeeeeeeeeeeeeeeeeeeeeeeeeeeeeeeeeeee",
"eeeeeeeeeeeeeeeeeeeeeeeeeeeeeeeeeeeeeeeeeeeeeeeeeeeeeeeeeeee$@weeeeeeeeeeeeee3oqeeeeeeeeeeeeeeeeeeeeeeeeeeeeeeeeeeeeeeeeeeeeeeeeeeeeeeeeeeeeeeeeeeeeeeeeeeeeeeeeeew@<weeeeeeeeeeeee0O;.8eeeeeeeeeeeeeeeeeeeeeeeeeeeeeeeeeeeeeeeeeeeeeeeeeeeeeeeeeeeeeeeeeeeeeeeeeeeeeee",
"eeeeeeeeeeeeeeeeeeeeeeeeeeeeeeeeeeeeeeeeeeeeeeeeeeeeeeeeeeee=@weeeeeeeeeeeeee4Oweeeeeeeeeeeeeeeeeeeeeeeeeeeeeeeeeeeeeeeeeeeeeeeeeeeeeeeeeeeeeeeeeeeeeeeeeeeeeeeewew#,eeeeeeeeeeeeee0oO+weeeeeeeeeeeeeeeeeeeeeeeeeeeeeeeeeeeeeeeeeeeeeeeeeeeeeeeeeeeeeeeeeeeeeeeeeeeeeee",
"eeeeeeeeeeeeeeeeeeeeeeeeeeeeeeeeeeeeeeeeeeeeeeeeeeeeeeeeeeew,#weeeeeeeeeeeeee4Oweeeeeeeeeeeeeeeeeeeeeeeeeeeeeeeeeeeeeeeeeeeeeeeeeeeeeeeeeeeeeeeeeeeeeeeeeeeeeeeeeew@<eeeeeeeeeeeeee0o ;weweeeeeeeeeeeeeeeeeeeeeeeeeeeeeeeeeeeeeeeeeeeeeeeeeeeeeeeeeeeeeeeeeeeeeeeeeeeee",
"eeeeeeeeeeeeeeeeeeeeeeeeeeeeeeeeeeeeeeeeeeeeeeeeeeeeeeeeeeew,#weeeeeeeeeeeeee4Oqeeeeeeeeeeeeeeeeeeeeeeeeeeeeeeeeeeeeeeeeeeeeeeeeeeeeeeeeeeeeeeeeeeeeeeeeeeeeeeeeeew+<weeeeeeeeeeeee9X 1eeeeeeeeeeeeeeeeeeeeeeeeeeeeeeeeeeeeeeeeeeeeeeeeeeeeeeeeeeeeeeeeeeeeeeeeeeeeeeee",
"eeeeeeeeeeeeeeeeeeeeeeeeeeeeeeeeeeeeeeeeeeeeeeeeeeeeeeeeeeee1Xwweeeeeeeeeeeee4oqeeeeeeeeeeeeeeeeeeeeeeeeeeeeeeeeeeeeeeeeeeeeeeeeeeeeeeeeeeeeeeeeeeeeeeeeeeeeeeeewew@<eeeeeeeeeeeeee9oX9eeeeeeeeeeeeeeeeeeeeeeeeeeeeeeeeeeeeeeeeeeeeeeeeeeeeeeeeeeeeeeeeeeeeeeeeeeeeeeee",
"eeeeeeeeeeeeeeeeeeeeeeeeeeeeeeeeeeeeeeeeeeeeeeeeeeeeeeeeeeee6 0eeeeeeeeeeeeee4Oqeeeeeeeeeeeeeeeeeeeeeeeeeeeeeeeeeeeeeeeeeeeeeeeeeeeeeeeeeeeeeeeeeeeeeeeeeeeeeeeeeew$<eeeeeeeeeeeeee0oOqeeeeeeeeeeeeeeeeeeeeeeeeeeeeeeeeeeeeeeeeeeeeeeeeeeeeeeeeeeeeeeeeeeeeeeeeeeeeeeee",
"eeeeeeeeeeeeeeeeeeeeeeeeeeeeeeeeeeeeeeeeeeeeeeeeeeeeeeeeeeee8X9eeeeeeeeeeeeee5o9eeeeeeeeeeeeeeeeeeeeeeeeeeeeeeeeeeeeeeeeeeeeeeeeeeeeeeeeeeeeeeeeeeeeeeeeeeeeeeeewew#,eeeeeeeeeeeeee0X&eeeeeeeeeeeeeeeeeeeeeeeeeeeeeeeeeeeeeeeeeeeeeeeeeeeeeeeeeeeeeeeeeeeeeeeeeeeeeeeee",
"eeeeeeeeeeeeeeeeeeeeeeeeeeeeeeeeeeeeeeeeeeeeeeeeeeeeeeeeeewe8X9eeeeeeeeeeeeee4Oweeeeeeeeeeeeeeeeeeeeeeeeeeeeeeeeeeeeeeeeeeeeeeeeeeeeeeeeeeeeeeeeeeeeeeeeeeeeeeeeeew#<eeeeeeeeeeeeee9X-eeeeeweeeeeweeeeeeeeeeeeeeeeeeeeeeeeeeeeeeeeeeeeeeeeeeeeeeeeeeeeeeeeeeeeeeeeeeeee",
"eeeeeeeeeeeeeeeeeeeeeeeeeeeeeeeeeeeeeeeeeeeeeeeeeeeeeeeeeewe4Xweeeeeeeeeeeeee4Oqeeeeeeeeeeeeeeeeeeeeeeeeeeeeeeeeeeeeeeeeeeeeeeeeeeeeeeeeeeeeeeeeeeeeeeeeeeeeeeeeeee#,eeeeeeeeeeeeee0o;eeeeeeeeeeeeweeeeeeeeeeeeeeeeeeeeeeeeeeeeeeeeeeeeeeeeeeeeeeeeeeeeeeeeeeeeeeeeeeee",
"eeeeeeeeeeeeeeeeeeeeeeeeeeeeeeeeeeeeeeeeeeeeeeeeeeeeeeeeeewe1@weeeeeeeeeeeeee5O0eeeeeeeeeeeeeeeeeeeeeeeeeeeeeeeeeeeeeeeeeeeeeeeeeeeeeeeeeeeeeeeeeeeeeeeeeeeeeeeeeee#,eeeeeeeeeeeeee9X2weee98eeee97weeeeeeeeeeeeeeeeeeeeeeeeeeeeeeeeeeeeeeeeeeeeeeeeeeeeeeeeeeeeeeeeeeee",
"eeeeeeeeeeeeeeeeeeeeeeeeeeeeeeeeeeeeeeeeeeeeeeeeeeeeeeeeeeee2+weeeeeeeeeeeeee6o9eeeeweeeeeeeeeeeeeeeeeeeeeeeeeeeeeeeeeeeeeeeeeeeeeeeeeweeeeweeeeeeeeeeeeeeeeeeeeeew#<eeeeeeeeeeeeeeqO4eeee-*weee:Oqeeeeeeeeeeeeeeeeeeeeeeeeeeeeeeeeeeeeeeeeeeeeeeeeeeeeeeeeeeeeeeeeeeee",
"eeeeeeeeeeeeeeeeeeeeeeeeeeeeeeeeeeeewewweeeeeeeeeeeeeeeeeeee1+weeeeeeeeeeeeee6o0eeeew4qeeeeeeeeeeeeeeeeeeeeeeeeeeeeeeeeeeeeeeeeeeeeeweeeeeweweeeeeeeeeeeeeeeeeeeeee#,eeeeeeeeeeeeeeqo3weee-*eeew,+qeeeeeeeeeeeeeeeeeeeeeeeeeeeeeeeeeeeeeeeeeeeeeeeeeeeeeeeeeeeeeeeeeeee",
"eeeeeeeeeeeeeeeeeeeeeeeeeeeeeeeeeeeew:-eweeeeeeeeeeeeeeeeeee1+weeeeeeeeeeeeee7o9eeeeqO4eeeeeeeeeeeeeeeeeeeeeeeeeeeeeeeeeeeeeeeeeeeee82weeew23eeeeeeeeeeeeeeeeeeeeew#<eeeeeeeeeeeeee8.3eeee=&ewe92%wweeeeeeeeeeeeeeeeeeeeeeeeeeeeeeeeeeeeeeeeeeeeeeeeeeeeeeeeeeeeeeeeeee",
"eeeeeeeeeeeeeeeeeeeeeeeeeeeeeeeeeeeee;*eweweeeeeeeeeeeeeeeee2+weeeeeeeeeeeeee7o9eeeeqo4eeweeeeeeeeeeeeeeeeeeeeeeeeeeeeeeeeeeeeeeeeee4+qeeew*=eeeeeeeeeeeeeeeeeeeeew$,eeeeeeeeeeeeee8.3eeee:%ew>#42weeeeeeeeeeeeeeeeeeeeeeeeeeeeeeeeeeeeeeeeeeeeeeeeeeeeeeeeeeeeeeeeeeee",
"eeeeeeeeeeeeeeeeeeeeeeeeeeeeeeeeeeeee;*weeeeeeeeeeeeeeeeeeee1+weeeeeeeeeeeeee8o9eeeeqO4eeq9eweeeeeeeeeeeeeeeeeeeeeeeeeeeeeeeeeeeeeee5oqeeww;:eeeeeeeeeeeeeeeeeeeeww$>eeeeeeeeeeeeeewo3eeee-#w:@9eeeeeeeeeeeeeeeeeeeeeeeeeeeeeeeeeeeeeeeeeeeeeeeeeeeeeeeeeeeeeeeeeeeeeee",
"eeeeeeeeeeeeeeeeeeeeeeeeeeeeeeeeeeeee;&ee4*7eeeeeeeeeeeeeeee2Oweeeeeeeeeeeeee7o9eeeeqo4e8#<wweeeeeeeeeeeeeeeeeeeeeeeeeeeeeeeeeeeeeew3Oqee89<<eeeeeeeeeeeeeeeeeeeeew$:eeeeeeeeeeeeeewO2eeee:#<O8eeeeeeeeeeeeeeeeeeeeeeeeeeeeeeeeeeeeeeeeeeeeeeeeeeeeeeeeeeeeeeeeeeeeeeee",
"eeeeeeeeeeeeeeeeeeeeeeeeeeeeeeeeeeeew;&e3o3eweeeeeeeeeeeeewe2@weeeeeeeeeeeeee7o9eeeeqO48@:weeeeeeeeeq9ee90weeeeeeeeeeeeeeeeeeeeeeeee4Xqw<+800eeeeeeeeeewweeeeweeeew%;eeeeeeeeeeeeeew+3eeee:oo:wwewewweeeeeweweeeeeeeeeeeeeeeeeeeeeeeeeeeeeeeeeeeeeeeeeeeeeeeeeeeeeeeeee",
"eeeeeeeeeeeeeeeeeeeeeeeeeeeeeeeeeeeee;%4o1weeeeeeeeeeeeeeeew2owweeeeeeeeeeeee7o9eeeeqO:@-weeeeeeeew,+*w;+;wweeeeeeeeeeeeeeeeeeeeeeee5Xq<O7eweeeeeeeeewe95www69eeeee%,eeeeeeeeeeeeeeeO4eeee:&5O1eeeeww05qw70q70eeeeeeeeeeeeeeeeeeeeeeeeeeeeeeeeeeeeeeeeeeeeeeeeeeeeeeeee",
"eeeeeeeeeeeeeeeeeeeeeeeeeeeeeeeeeeeee:oX:weeeeeeeeeeeeeeeeee1@weeeeeeeeeeeeee7o9eeeeqO@o6eeeeeeeewqo1e8X4eeweeeeeeeeeeeeeeeeeeeeeeew3X:O6eeeeeeeeeeeee:o*q9+&4eweew$:eeeeeeeeeeeeeewO2eeee:$w2X4eeew;O%O%++&%O9weeeeeeeeeeeeeeeeeeeeeeeeeeeeeeeeeeeeeeeeeeeeeeeeeeeeeee",
"eeeeeeeeeeeeeeeeeeeeeeeeeeeeeeeeeeewe:#,+7eewqwewweweeeeewee1@weeeeeeeeeeeeee7o9eeewqo3:O8eew928we< :<; >2weeeeeeeeeeeeeeeeeeeeeeeee6.$+9eeeweeeeeeewwo<ee1+qeeewew%-eeeeeeeeeeeeeew+2eeee>$ww,+8we7X7w8O @wwX1eeeeeeeeeeeeeeeeeeeeeeeeeeeeeeeeeeeeeeeeeeeeeeeeeeeeeeee",
"eeeeeeeeeeeeeeeeeeeeeeeeeeeeeeeeeeeee<$w:o84%@#:%$*@&9eeeeee2owweeeeeeeeeeeee7o9eeee0O2w*o0q%@-+&w;.*;- -1weeeeeeeeeeeeeeeeeeeeeeeee7X8*$9eweeww6,17w>.$-6+X*3weeee&;eweeeeeeeeeeeew+2eeewq8eew9qew2#wee& ;ew+>eeeeeeeeeeeeeeeeeeeeeeeeeeeeeeeeeeeeeeeeeeeeeeeeeeeeeeee",
"eeeeeeeeeeeeeeeeeeeeeeeeeeeeeeeeeeeew>%eq&OX<05o X89O<eeeeee2oweeeeeeeeeeeeee7X8eeeww@3e0%%1Oqw9X39o8e9.9weweeeeeeeeeeeeeeeeeeeeeeee7Xq9+*weeew:O;*O3<.*<9&X>7ewwee*-eeeeeeeeeeeeeee+2eeeeeweeweeee2+wew% :ew@:eeeeeeeeeeeeeeeeeeeeeeeeeeeeeeeeeeeeeeeeeeeeeeeeeeeeeeee",
"eeeeeeeeeeeeeeeeeeeeeeeeeeeeeeeeeeeee83wwe-Xwwe* %ww*;eeeeew3owweeeeeeeeeeeee7X8eeeew0wweeq;#wee#,0X7e8.8eeeweeeeeeeeeeeeeeeeeeeeeee8+qw9%<wweqo4ww;$wo2ew1@wweeeee==eeeeeeeeeeeeeewO<eeeeeeeeeewee9O104o.;ee$:eeeeeeeeeeeeeeeeeeeeeeeeeeeeeeeeeeeeeeeeeeeeeeeeeeeeeeee",
"eeeeeeeeeeeeeeeeeeeeeeeeeeeeeeeeeeeeeeeeee4Xwwe* =we&;eeeeew5oweeeeeeeeeeeeee6X8eeeeeeeeeew,#ewe@>9.5e8.8eeeeeeeeeeeeeeeeeeeeeeeeeeewqeeewqeew8X8ew3O0o2ee1+weeeeew*-eeeeeeeeeeeeeeeO<eeeeeeeeeeeeee3@+#<%:ww&1weeeeeeeeeeeeeeeeeeeeeeeeeeeeeeeeeeeeeeeeeeeeeeeeeeeeeee",
"eeeeeeeeeeeeeeeeeeeeeeeeeeeeeeeeeeeeeeeeee9o4w0+ -ee&;eeeeee5Xweeeeeeeeeeeeee7X8eeeeeeeeeee5X29<o90o5e8.8eeeeeeeeeeeeeeeeeeeeeeeeeeeewweeweeeeqX4ee:#qo2we2@weeeeee*-eeeeeeeeeeeeeewO1eeeeeeeeeeeeeewwqwwwweeewweeeeeeeeeeeeeeeeeeeeeeeeeeeeeeeeeeeeeeeeeeeeeeeeeeeeeee",
"eeeeeeeeeeeeeeeeeeeeeeeeeeeeeeeeeeeeeeeeeew>o%@%$;we&;eeeeee1.qeeeeeeeeeeeeee7X7eeeeeeeeeeew3#O%4eq@7w9+qeeeeeeeeeeeeeeeeeeeeeeeeeeeeeeeeeeeeww*+42O<qO4ee1@weeeeee*=eeeeeeeeeeeeeee+2eeeeeeeeeeeeeewweweweeeweeeeeeeeeeeeeeeeeeeeeeeeeeeeeeeeeeeeeeeeeeeeeeeeeeeeeeeee",
"eeeeeeeeeeeeeeeeeeeeeeeeeeeeeeeeeeeeeeeeeeweq47w98ee89eeeewe4.weeeeeeeeeeeeee8X7eeeeeeeeeeeeewqeeeeeeeeeeeeeeeeeeeeeeeeeeeeeeeeeeeeeeeeeeeeeeewq,$&2we&5ee4*weeeeee==eeeeeeeeeeeeeew+:eeeeeeeeeeeeeeeeeeeeeeeeeeeeeeeeeeeeeeeeeeeeeeeeeeeeeeeeeeeeeeeeeeeeeeeeeeeeeeeee",
"eeeeeeeeeeeeeeeeeeeeeeeeeeeeeeeeeeeeeeeeeeeeeeeeeeeweeeeeeee4oweeeeeeeeeeeeee8X6eeeeeeeeeeeeeeeeeeeeeeeeeeeeeeeeeeeeeeeeeeeeeeeeeeeeeeeeeeeeeweeewweewwweweeeeeewee*=eeeeeeeeeeeeeewO<eeeeeeeeeeeeeeeeeeeeeeeeeeeeeeeeeeeeeeeeeeeeeeeeeeeeeeeeeeeeeeeeeeeeeeeeeeeeeeeee",
"eeeeeeeeeeeeeeeeeeeeeeeeeeeeeeeeeeeeeeeeeeeeeweeweeeeweeeeee4.weeeeeeeeeeeeee7X6eeeeeeeeeeeeeeeeeeeeeeeeeeeeeeeeeeeeeeeeeeeeeeeeeeeeeeeeeeeeeeeeeeeweeeweeeweeeeeee*-eeeeeeeeeeeeeee+1eeeeeeeeeeeeeeeeeeeeeeeeeeeeeeeeeeeeeeeeeeeeeeeeeeeeeeeeeeeeeeeeeeeeeeeeeeeeeeeee",
"eeeeeeeeeeeeeeeeeeeeeeeeeeeeeeeeeeeeeeeeeeeeeeeeeeeeeeeeeeee4Xweeeeeeeeeeeeee7X7eeeeeeeeeeeeeeeeeeeeeeeeeeeeeeeeeeeeeeeeeeeeeeeeeeeeeeeeeeeeeeeeeeeeeeeeeeeeeeeeeew*-eeeeeeeeeeeeeew+<eeeeeeeeeeeeeeeeeeeeeeeeeeeeeeeeeeeeeeeeeeeeeeeeeeeeeeeeeeeeeeeeeeeeeeeeeeeeeeeee",
"eeeeeeeeeeeeeeeeeeeeeeeeeeeeeeeeeeeeeeeeeeeeeeeeeeeeeeeeeewe5Xwweeeeeeeeeeeee7.6eeeeeeeeeeeeeeeeeeeeeeeeeeeeeeeeeeeeeeeeeeeeeeeeeeeeeeeeeeeeeeeeeeeeeeeeeeeeeeeeeee*=eeeeeeeeeeeeeew@>eeeeeeeeeeeeeeeeeeeeeeeeeeeeeeeeeeeeeeeeeeeeeeeeeeeeeeeeeeeeeeeeeeeeeeeeeeeeeeeee",
"eeeeeeeeeeeeeeeeeeeeeeeeeeeeeeeeeeeeeeeeeeeeeeeeeeeeeeeeeeee6.weeeeeeeeeeeeee8X7eeeeeeeeeeeeeeeeeeeeeeeeeeeeeeeeeeeeeeeeeeeeeeeeeeeeeeeeeeeeeeeeeeeeeeeeeeeeeeeeeee=-eeeeeeeeeeeeeee@,eeeeeeeeeeeeeeeeeeeeeeeeeeeeeeeeeeeeeeeeeeeeeeeeeeeeeeeeeeeeeeeeeeeeeeeeeeeeeeeee",
"eeeeeeeeeeeeeeeeeeeeeeeeeeeeeeeeeeeeeeeeeeeeeeeeeeeeeeeeeeee6.qeeeeeeeeeeeeee8X6eeeeeeeeeeeeeeeeeeeeeeeeeeeeeeeeeeeeeeeeeeeeeeeeeeeeeeeeeeeeeeeeeeeeeeeeeeeeeeeeeee==eeeeeeeeeeeeeew@,weeeeeeeeeeeeeeeeeeeeeeeeeeeeeeeeeeeeeeeeeeeeeeeeeeeeeeeeeeeeeeeeeeeeeeeeeeeeeeee",
"eeeeeeeeeeeeeeeeeeeeeeeeeeeeeeeeeeeeeeeeeeeeeeeeeeeeeeeeeeee6.qeeeeeeeeeeeeeewX7eeeeeeeeeeeeeeeeeeeeeeeeeeeeeeeeeeeeeeeeeeeeeeeeeeeeeeeeeeeeeeeeeeeeeeeeeeeeeeeeeee==eeeeeeeeeeeeeee$:eeweeeeeeeeeeeeeeeeeeeeeeeeeeeeeeeeeeeeeeeeeeeeeeeeeeeeeeeeeeeeeeeeeeeeeeeeeeeeee",
"eeeeeeeeeeeeeeeeeeeeeeeeeeeeeeeeeeeeeeeeeeeeeeeeeeeeeeeeeeee6.0eeeeeeeeeeeeee9X6eeeeeeeeeeeeeeeeeeeeeeeeeeeeeeeeeeeeeeeeeeeeeeeeeeeeeeeeeeeeeeeeeeeeeeeeeeeeeeeeeee*=eeeeeeeeeeeweww$>weeeeeeeeeeeeeeeeeeeeeeeeeeeeeeeeeeeeeeeeeeeeeeeeeeeeeeeeeeeeeeeeeeeeeeeeeeeeeeee",
"eeeeeeeeeeeeeeeeeeeeeeeeeeeeeeeeeeeeeeeeeeeeeeeeeeeeeeeeeeee6.0eeeeeeeeeeeeee9X6eeeeeeeeeeeeeeeeeeeeeeeeeeeeeeeeeeeeeeeeeeeeeeeeeeeeeeeeeeeeeeeeeeeeeeeeeeeeeeeeeee==eeeeeeeeeeee71*X+*>3weeeeeeeeeeeeeeeeeeeeeeeeeeeeeeeeeeeeeeeeeeeeeeeeeeeeeeeeeeeeeeeeeeeeeeeeeeeee",
"eeeeeeeeeeeeeeeeeeeeeeeeeeeeeeeeeeeeeeeeeeeeeeeeeeeeeeeeeeww4.7wwweeeeeeeeeeeqX6eeeeeeeeeeeeeeeeeeeeeeeeeeeeeeeeeeeeeeeeeeeeeeeeeeeeeeeeeeeeeeeeeeeeeeeeeeeeeeeeeee*-eeeeeeeeeeew$      oqeeeeeeeeeeeeeeeeeeeeeeeeeeeeeeeeeeeeeeeeeeeeeeeeeeeeeeeeeeeeeeeeeeeeeeeeeeeee",
"eeeeeeeeeeeeeeeeeeeeeeeeeeeeeeeeeeeeeeeeeeeeeeeeeeeeeeeeew1&o o@*4weeeeeeeeeeqX7eeeeeeeeeeeeeeeeeeeeeeeeeeeeeeeeeeeeeeeeeeeeeeeeeeeeeeeeeeeeeeeeeeeeeeeeeeeeeeeeeee*-eeeeeeeeeeee1      -eeeeeeeeeeeeeeeeeeeeeeeeeeeeeeeeeeeeeeeeeeeeeeeeeeeeeeeeeeeeeeeeeeeeeeeeeeeeee",
"eeeeeeeeeeeeeeeeeeeeeeeeeeeeeeeeeeeeeeeeeeeeeeeeeeeeeeeeeqX     .:weeeeeeeeeeqX6eeeeeeeeeeeeeeeeeeeeeeeeeeeeeeeeeeeeeeeeeeeeeeeeeeeeeeeeeeeeeeeeeeeeeeeeeeeeeeeeeee=*eeeeeeeeeeew9o     3weeeeeeeeeeeeeeeeeeeeeeeeeeeeeeeeeeeeeeeeeeeeeeeeeeeeeeeeeeeeeeeeeeeeeeeeeeeee",
"eeeeeeeeeeeeeeeeeeeeeeeeeeeeeeeeeeeeeeeeeeeeeeeeeeeeeeeeee%     .6eeeeeeeeeeeqX7eeeeeeeeeeeeeeeeeeeeeeeeeeeeeeeeeeeeeeeeeeeeeeeeeeeeeeeeeeeeeeeeeeeeeeeeeeeeeeeeeee=-eeeeeeeeeeeee%    Oqeeeeeeeeeeeeeeeeeeeeeeeeeeeeeeeeeeeeeeeeeeeeeeeeeeeeeeeeeeeeeeeeeeeeeeeeeeeeee",
"eeeeeeeeeeeeeeeeeeeeeeeeeeeeeeeeeeeeeeeeeeeeeeeeeeeeeeeeee<     $eeeeeeeeeeeeqX5eeeeeeeeeeeeeeeeeeeeeeeeeeeeeeeeeeeeeeeeeeeeeeeeeeeeeeeeeeeeeeeeeeeeeeeeeeeeeeeeeee=*eweeeeeeeeeww3    :weeeeeeeeeeeeeeeeeeeeeeeeeeeeeeeeeeeeeeeeeeeeeeeeeeeeeeeeeeeeeeeeeeeeeeeeeeeeee",
"eeeeeeeeeeeeeeeeeeeeeeeeeeeeeeeeeeeeeeeeeeeeeeeeeeeeeeeeee8o    ,eweeeeeeeeeeqX4eeeeeeeeeeeeeeeeeeeeeeeeeeeeeeeeeeeeeeeeeeeeeeeeeeeeeeeeeeeeeeeeeeeeeeeeeeeeeeeeeee=&eeeeeeeeeeeeeqO   5eeeeeeeeeeeeeeeeeeeeeeeeeeeeeeeeeeeeeeeeeeeeeeeeeeeeeeeeeeeeeeeeeeeeeeeeeeeeeee",
"eeeeeeeeeeeeeeeeeeeeeeeeeeeeeeeeeeeeeeeeeeeeeeeeeeeeeeeeeee;   .8eeeeeeeeeeeeqX4eeeeeeeeeeeeeeeeeeeeeeeeeeeeeeeeeeeeeeeeeewew72qeeeeeeeeeeeeeeeeeeeeeeeeeeeeeeeeeee;%weeeeeeeeeeeee;  +weeeeeeeeeeeeeeeeeeeeeeeeeeeeeeeeeeeeeeeeeeeeeeeeeeeeeeeeeeeeeeeeeeeeeeeeeeeeeee",
"eeeeeeeeeeeeeeeeeeeeeeeeeeeeeeeeeeeeeeeeeeeeeeeeeeeeeeeeeew6.  &weweeeeeeeeeeqX5eeeeeeeeeeeeeeeeeeeeeeeeeeeeeeeeeeeeeeeeeeew=$>qeeeeeeeeeeeeeeeeeeeeeeeeeeeeeeeeeee:$eeeeeeeeeeeeee5  ,wweeeeeeeeeeeeeeeeeeeeeeeeeeeeeeeeeeeeeeeeeeeeeeeeeeeeeeeeeeeeeeeeeeeeeeeeeeeeee",
"eeeeeeeeeeeeeeeeeeeeeeeeeeeeeeeeeeeeeeeeeeeeeeeeeeeeeeeeeeewo  3eeeeeeeeeeeeeqX4eeeeeeeeeeeeeeeeeeeeeeeeeeeeeeeeeeeeeeeeeee0o8wweeeeeeeeeeeeeeeeeeeeeeeeeeeeeeeeeee1;weeeeeeeeeeeeew# 7eeeeeeeeeeeeeeeeeeeeeeeeeeeeeeeeeeeeeeeeeeeeeeeeeeeeeeeeeeeeeeeeeeeeeeeeeeeeeeee",
"eeeeeeeeeeeeeeeeeeeeeeeeeeeeeeeeeeeeeeeeeeeeeeeeeeeeeeeeeewe> X8eeeeeeeeeeeeeqX4eeeeeeeeeeeeeeeeeeeeeeeeeeeeeeeeeeeeeeeeeew4X40weeeeeeeeeeeeeeeeeeeeeeeeeeeeeeeeeeeeeeeeeeeeeweeeeee<@weeeeeeeeeeeeeeeeeeeeeeeeeeeeeeeeeeeeeeeeeeeeeeeeeeeeeeeeeeeeeeeeeeeeeeeeeeeeeeee",
"eeeeeeeeeeeeeeeeeeeeeeeeeeeeeeeeeeeeeeeeeeeeeeeeeeeeeeeeeeee7.&weeeeeeeeeeeeew60eeeeeeeeeeeeeeeeeeeeeeeeeeeeeeeeeeeeeeeeee4@.@#8eeeeeeeeeeeeeeeeeeeeeeeeeeeeeeeeeeeeeeeeeweeeeeeeeee92eeeeeeeeeeeeeeeeeeeeeeeeeeeeeeeeeeeeeeeeeeeeeeeeeeeeeeeeeeeeeeeeeeeeeeeeeeeeeeeee",
"eeeeeeeeeeeeeeeeeeeeeeeeeeeeeeeeeeeeeeeeeeeeeeeeeeeeeeeeeeeew$4eeeeeeeeeeeeeeeweeeeeeeeeeeeeeeeeeeeeeeeeeeeeeeeeeeeeeeeeeee8o7eeeeeeeeeeeeeeeeeeeeeeeeeeeeeeeeeeeeeeeeeeeeweweewweeweweeeeeeeeeeeeeeeeeeeeeeeeeeeeeeeeeeeeeeeeeeeeeeeeeeeeeeeeeeeeeeeeeeeeeeeeeeeeeeeee",
"eeeeeeeeeeeeeeeeeeeeeeeeeeeeeeeeeeeeeeeeeeeeeeeeeeeeeeeeeeeww60eeeewq0669qwweeeeeeeeeeeeeeeeeeeeeeeeeeeeeeeeeeeeeeeeeeeeeee9o7weeeeeeeeeeeeeeeeeeeeeeeeeeeeeeeeeeeeewew5:=%+o+#%;4qeweeeeeeeeeeeeeeeeeeeeeeeeeeeeeeeeeeeeeeeeeeeeeeeeeeeeeeeeeeeeeeeeeeeeeeeeeeeeeeeeee",
"eeeeeeeeeeeeeeeeeeeeeeeeeeeeeeeeeeeeeeeeeeeeeeeeeeeeeeeeeeeeeeewq3=#OX .Xo@-30eweweeeeeeeeeeeeeeeeeeeeeeeeeeeeeeeeeeeeeeeee8X8eeeeeeeeeeeeeeeeeeeeeeeeeeeeeeeeeeeewe9:+           O:9eeeeeeeeeeeeeeeeeeeeeeeeeeeeeeeeeeeeeeeeeeeeeeeeeeeeeeeeeeeeeeeeeeeeeeeeeeeeeeeeee",
"eeeeeeeeeeeeeeeeeeeeeeeeeeeeeeeeeeeeeeeeeeeeeeeeeeeeeeeeeeeeew8-X.  ..OX.   .o*8eeweeeeeeeeeeeeeeeeeeeeeeeeeeeeeeeeeeeeeeee8o8eeeeeeeeeeeeeeeeeeeeeeeeeeeeeeeeeewe9:O  .@;,<<11-@.  o:9wweeeeeeeeeeeeeeeeeeeeeeeeeeeeeeeeeeeeeeeeeeeeeeeeeeeeeeeeeeeeeeeeeeeeeeeeeeeeee",
"eeeeeeeeeeeeeeeeeeeeeeeeeeeeeeeeeeeeeeeeeeeeeeeeeeeeeeeeeeeeq:X  o*167q874,&X  .:qeeeeeeeeeeeeeeeeeeeeeeeeeeeeeeeeeeeeeeeee9X8eeeeeeeeeeeeeeeeeeeeeeeeeeeeeeeeeew3O  O-8weeeeeeew5=X  O4eeeeeeeeeeeeeeeeeeeeeeeeeeeeeeeeeeeeeeeeeeeeeeeeeeeeeeeeeeeeeeeeeeeeeeeeeeeeeee",
"eeeeeeeeeeeeeeeeeeeeeeeeeeeeeeeeeeeeeeeeeeeeeeeeeeeeeeeeeew7@  O,0weeeeeeeew0:O. #5eweeeeeeeeeeeeeeeeeeeeeeeeeeeeeeeeeeeeee8O8eeeeeeeeeeeeeeeeeeeeeeeeeeeeeeeeww<X.o;9weeeeeeeeeeew8-X X:wweeeeeeeeeeeeeeeeeeeeeeeeeeeeeeeeeeeeeeeeeeeeeeeeeeeeeeeeeeeeeeeeeeeeeeeeeeee",
"eeeeeeeeeeeeeeeeeeeeeeeeeeeeeeeeeeeeeeeeeeeeeeeeeeeeeeeewe3X .:0weeeeeeeeeeeweq;. o3eweeeeeeeeeeeeeeeeeeeeeeeeeeeeeeeeeeeeew8weweeeeeeeeeeeeeeeeeeeeeeeeeeeeeww;  @8eeeeeeeeeeeeeeewe7+ .:weeeeeeeeeeeeeeeeeeeeeeeeeeeeeeeeeeeeeeeeeeeeeeeeeeeeeeeeeeeeeeeeeeeeeeeeeeee",
"eeeeeeeeeeeeeeeeeeeeeeeeeeeeeeeeeeeeeeeeeeeeeeeeeeeeeeeee4X +4weewweeeeeeeweeeew3o X4eeeeeeeeeeeeeeeeeeeeeeeeeeeeeeeeeeeeeweweeeeeeeeeeeeeeeeeweeeeeeeeeeeeeee3  %9eeweeeeeeeeeeeeeeew9% X<wweeeeeeeeeeeeeeeeeeeeeeeeeeeeeeeeeeeeeeeeeeeeeeeeeeeeeeeeeeeeeeeeeeeeeeeeee",
"eeeeeeeeeeeeeeeeeeeeeeeeeeeeeeeeeeeeeeeeeeeeeeeeeeeeeeew6X @8eeeeeeeeeeeeeeeeeeew8+ X8eweeeeeeeeeeeeeeeeeeeeeeeeeeeeeeeeeeeeeeeeeeeeeeeeeeeee2*10eweewweeeeee5X #qweeeeeeeeeeeeeeeeeeeeq# .5eeeeeeeeeeeeeeeeeeeeeeeeeeeeeeeeeeeeeeeeeeeeeeeeeeeeeeeeeeeeeeeeeeeeeeeeeee",
"eeeeeeeeeeeeeeeeeeeeeeeeeeeeeeeeeeeeeeeeeeeeeeeeeeeeeeew+ O8eeeeeeeeeeeeeeeeeeeeew6o #weweeeeeeeeeeeeeeeeeeeeeeeeeeeeeeeeeeeeeeeeeeeeeeeeeeew*  X%40eeeeeewew$ o8weeeeeeeeeeeeeeeeeeeeee8+ $qeeeeeeeeeeeeeeeeeeeeeeeeeeeeeeeeeeeeeeeeeeeeeeeeeeeeeeeeeeeeeeeeeeeeeeeeee",
"eeeeeeeeeeeeeeeeeeeeeeeeeeeeeeeeeeeeeeeeeeeeeeeeeeeeeee:  4eweeeeeeeeeeeeeeeeeeewee2. :eeeeeeeeeeeeeeeeeeeeeeeeeeeeeeeeeeeeeeeeeeeeeeeeweeeww@     X=4qeeeee< .4wweeeeeeeeeeeeeeeeeeeeewe1. <eeeeeeeeeeeeeeeeeeeeeeeeeeeeeeeeeeeeeeeeeeeeeeeeeeeeeeeeeeeeeeeeeeeeeeeeee",
"eeeeeeeeeeeeeeeeeeeeeeeeeeeeeeeeeeeeeeeeeeeeeeeeeeeeew8X -eweeeeeeeeeeeeeeeeeeeeeeew* o9weee9885865554444444344443312212111<,,,,,,,,,,,,::;-=         O>8ewq+ &weeeeeeeeeeeeeeeeeeeeeeeeew% Oqeweeeeeeeeeeeeeeeeeeeeeeeeeeeeeeeeeeeeeeeeeeeeeeeeeeeeeeeeeeeeeeeeeeeeeee",
"eeeeeeeeeeeeeeeeeeeeeeeeeeeeeeeeeeeeeeeeeeeeeeeeeeeeew; o0eeeeeeeeeeeeeeeeeeeeeeeeew8X ;eeee&Xoo.oOOOOOOOoOOOOoO+@@@@@@@##$$#$#$##$%$%&&&***&         O;8ee2 .5eeeeeeeeeeeeeeeeeeeeeeeeeee6  2eeeeeeeeeeeeeeeeeeeeeeeeeeeeeeeeeeeeeeeeeeeeeeeeeeeeeeeeeeeeeeeeeeeeeeeee",
"eeeeeeeeeeeeeeeeeeeeeeeeeeeeeeeeeeeeeeeeeeeeeeeeeeeeeqo :weeeeeeeeeeeeeeeeeeeeeeeeeee; +wwewq00q0qqqqqqqqqwqqwwqqwwwwwwqwwwwewewewwweeweweeww+     X*30weew* #weeeeeeeeeeeeeeeeeeeeeeeeeeew# *weeeeeeeeeeeeeeeeeeeeeeeeeeeeeeeeeeeeeeeeeeeeeeeeeeeeeeeeeeeeeeeeeeeeeeee",
"eeeeeeeeeeeeeeeeeeeeeeeeeeeeeeeeeeeeeeeeeeeeeeeeeeewe4 .9eeeeeeeeeeeeweeeewqeweeeeeee6  7weeeeeeeeeeeeeeeeeeeeeeeeeeeeeeeeeeeeeeeeeeeeeeeeeee&  .#,8eeeeweqo <eweeeeew212238ewew726eeeeeeee> o0weeeeeeeeeeeeeeeeeeeeeeeeeeeeeeeeeeeeeeeeeeeeeeeeeeeeeeeeeeeeeeeeeeeeeee",
"eeeeeeeeeeeeeeeeeeeeeeeeeeeeeeeeeeeeeeeeeeeeeeeeeeeew; #weeeeww-*%#%<qwe8&Oo&8eweeeeewO :eeeeeeeeeeeeeeeeeeeeeeeeeeeeeeeeeeeeeeeeeeeeeeeeeeee<+:8weeeeeeee7  5eeeeeew0oX+#X.1ww&X &weeeeeew7. 7eeeeeeeeeeeeeeeeeeeeeeeeeeeeeeeeeeeeeeeeeeeeeeeeeeeeeeeeeeeeeeeeeeeeeeee",
"eeeeeeeeeeeeeeeeeeeeeeeeeeeeeeeeeeeeeeeeeeeeeeeeeeeew$ :eeeeeeqOo::% =wq#o42O+qweeeeew- *eeeeeeeeeeeeeeeeeeeeeeeeeeeeeeeeeeeeeeeeeeeeeeeeeeeewwwweeeeeeeee2 X9eeeeeee0o:we8O+ew#;+$eeeeeeee0o 3weeeeeeeeeeeeeeeeeeeeeeeeeeeeeeeeeeeeeeeeeeeeeeeeeeeeeeeeeeeeeeeeeeeeeee",
"eeeeeeeeeeeeeeeeeeeeeeeeeeeeeeeeeeeeeeeeeeeeeeeeeeeew@ 2eeeeewq+%eww$Xq3.1we2 <weeeeee< %weeeeeeeeeeeeeeeeeeeeeeeeeeeeeeeeeeeeeeeeeeeeeeeeeeeweeeeeeeeeeee1 +eweeeeeeqo:eww*Xwwww#%eeeeeeewe@ :eeeeeeeeeeeeeeeeeeeeeeeeeeeeeeeeeeeeeeeeeeeeeeeeeeeeeeeeeeeeeeeeeeeeeeee",
"eeeeeeeeeeeeeeeeeeeeeeeeeeeeeeeeeeeeeeeeeeeeeeeeeeeew+ 3weeeeew+$wee- 9-X8eeqo*eeeeeee1.Oqeeeeeeeeeeeeeeeeeeeeeeeeeeeeeeeeeeeeeeeeeeeeeeeeeeeeeeeeeeeeeeee1 #eeeeeeeeqo;ew9+@eeew@$eeeeeeeew# ;eeeeeeeeeeeeeeeeeeeeeeeeeeeeeeeeeeeeeeeeeeeeeeeeeeeeeeeeeeeeeeeeeeeeeeee",
"eeeeeeeeeeeeeeeeeeeeeeeeeeeeeeeeeeeeeeeeeeeeeeeeeeee9X.6eeeeeeq+#ew9o@w%+weew%$eeeeeee6 .8eeeeeeeeeeeeeeeeeeeeeeeeeeeeeeeeeeeeeeeeeeeeeeeeeeeeeeeeeeeeeeee1 $eeeeeeee0X$41#X1eeee#$eeeeeeewe* ;eeeeeeeeeeeeeeeeeeeeeeeeeeeeeeeeeeeeeeeeeeeeeeeeeeeeeeeeeeeeeeeeeeeeeeee",
"eeeeeeeeeeeeeeeeeeeeeeeeeeeeeeeeeeeeeeeeeeeeeeeeeeee9X.4eeeeeew@o;&oO4w$#weee&#eeeeeee3 X0eeeeeeeeeeeeeeeeeeeeeeeeeeeeeeeeeeeeeeeeeeeeeeeeeeeeeeeeeeeeeeee1 @eeeeeeee0X.O+*4weeew#%eeeeeeeew# ;eeeeeeeeeeeeeeeeeeeeeeeeeeeeeeeeeeeeeeeeeeeeeeeeeeeeeeeeeeeeeeeeeeeeeeee",
"eeeeeeeeeeeeeeeeeeeeeeeeeeeeeeeeeeeeeeeeeeeeeeeeeeewq+ 4eeeeeww+X%=19ew$@weww##weeeeew< #weeeeeeeeeeeeeeeeeeeeeeeeeeeeeeeeeeeeeeeeeeeeeeeeeeeeeeeeeeeeeeee4 Xqeweeeee0o*0qeeeeeew#$eeeeeeeewO 1eeeeeeeeeeeeeeeeeeeeeeeeeeeeeeeeeeeeeeeeeeeeeeeeeeeeeeeeeeeeeeeeeeeeeeee",
"eeeeeeeeeeeeeeeeeeeeeeeeeeeeeeeeeeeeeeeeeeeeeeeeeeeew# ,eeeeeew+%eeeeee=X8ee9o%eeeeeww> %eeeeeeeeeeeeeeeeeeeeeeeeeeeeeeeeeeeeeeeeeeeeeeeeeeeeeeeeeeeeeeeee8 .7eweeeee0o-eeeeeeeew@$eeeeeeee7. 7eeeeeeeeeeeeeeeeeeeeeeeeeeeeeeeeeeeeeeeeeeeeeeeeeeeeeeeeeeeeeeeeeeeeeeee",
"eeeeeeeeeeeeeeeeeeeeeeeeeeeeeeeeeeeeeeeeeeeeeeeeeeeee% &weeeeeqO#wweewe3.<ew1 2weeeeee@ -weeeeeeeeeeeeeeeeeeeeeeeeeeeeeeeeeeeeeeeeeeeeeeeeeeeeeeeeeeeeeeeeqo :eeeeeeeqo-wweeeeeee#$eeeeeeew, o0eeeeeeeeeeeeeeeeeeeeeeeeeeeeeeeeeeeeeeeeeeeeeeeeeeeeeeeeeeeeeeeeeeeeeeee",
"eeeeeeeeeeeeeeeeeeeeeeeeeeeeeeeeeeeeeeeeeeeeeeeeeeeew2 Xwweeeww@#eeeeeew@o22O@qeeeeee8. 4eeeeeeeeeeeweeeeeeeeeeeeeeeeeeeeeeeeeeeeeeeeeeeeeeeeeeeeeeeeeeeewe* #wweeeew0o-eeeeeeeew$&eeeeeeew$ %weeeeeeeeeeeeeeeeeeeeeeeeeeeeeeeeeeeeeeeeeeeeeeeeeeeeeeeeeeeeeeeeeeeeeeee",
"eeeeeeeeeeeeeeeeeeeeeeeeeeeeeeeeeeeeeeeeeeeeeeeeeeewe0. 3eeeeew&=eweeeew6%oo&5eweeeee1 X0eeeeeeeeww8:6eeeeeeeeeeeeeeeeeeeeeeeeeeeeeeeeeeeeeeeeeeeeeeeeeeeee3  8eeeewew9qeweeeeeee9qeeeeeee8. 1eeeeeeeeeeeeeeeeeeeeeeeeeeeeeeeeeeeeeeeeeeeeeeeeeeeeeeeeeeeeeeeeeeeeeeeee",
"eeeeeeeeeeeeeeeeeeeeeeeeeeeeeeeeeeeeeeeeeeeeeeeeeeeeew# %weeeweweweeeeewwwq9eweweeeew# $weeeeeee9<$  :eeeeeeeeeeeeeeeeeeeeeeeeeeeeeeeeeeeeeeeeeeeeeeeeeeeeeq@ *weeeeweeeeeeeeeeeeeeeeeeeew* o9eeeeeeeeeeeeeeeeeeeeeeeeeeeeeeeeeeeeeeeeeeeeeeeeeeeeeeeeeeeeeeeeeeeeeeeee",
"eeeeeeeeeeeeeeeeeeeeeeeeeeeeeeeeeeeeeeeeeeeeeeeeeeeeee2 .2eweeeeeeeeeeeeeeeeeeeeewee1  3eeweeq4*X    &weweeeeeeeeeeeeeeeeeeeweeeweweweweeeeweeeweeeweweeeeee, .4eeeeeeeeeeeeeeeeeeeeeeeee4. ,eeeeeeeeeeeeeeeeeeeeeeeeeeeeeeeeeeeeeeeeeeeeeeeeeeeeeeeeeeeeeeeeeeeeeeeeee",
"eeeeeeeeeeeeeeeeeeeeeeeeeeeeeeeeeeeeeeeeeeeeeeeeeeeeeeq$ o9weeeeeeeeeeeeeeeeeeeewew0O &wwew5-O       o<:1,,;;;::;::::::;:;:::::--*&&&&&*&&%&&&&&&&&&&*qeeeeww# +8wweeeeeeeeeeeeeeeeeeeew8O @qeeeeeeeeeeeeeeeeeeeeeeeeeeeeeeeeeeeeeeeeeeeeeeeeeeeeeeeeeeeeeeeeeeeeeeeeee",
"eeeeeeeeeeeeeeeeeeeeeeeeeeeeeeeeeeeeeeeeeeeeeeeeeeeeeee5. -wweeeeeeeeeeeeeeeeeeeeeq* .7eew3+         .+@+$#$%%&%%%%%%%%%%&&&*--*=;;;;--;;;;:::::;>::<2weeeeew5X @0eeeeeeeeeeeeeeeeeeeeeq$ .4weeeeeeeeeeeeeeeeeeeeeeeeeeeeeeeeeeeeeeeeeeeeeeeeeeeeeeeeeeeeeeeeeeeeeeeeee",
"eeeeeeeeeeeeeeeeeeeeeeeeeeeeeeeeeeeeeeeeeeeeeeeeeeeeeeee,  :weeeeeeeeeeeeeeeeeeeew&  <weeeew3=o      @weeeeeeeeeeeeeeeeeeeeeeeeeeeeeeeeeeeeeeeeeeeeeeeeeeeeeee2. %0eeeeeeeeeeeeeeeeeweq&  2eeeeeeeeeeeeeeeeeeeeeeeeeeeeeeeeeeeeeeeeeeeeeeeeeeeeeeeeeeeeeeeeeeeeeeeeeeee",
"eeeeeeeeeeeeeeeeeeeeeeeeeeeeeeeeeeeeeeeeeeeeeeeeeeeeeeeew& .;qwweeeeeeeeeeeeeeeww*  -weeeeeeeeq2*o   =eeeeeeeeeeeeeeeeeeeeeeeeeeeeeeeeeeeeeeeeeeeeeeeeeeeeeeeww:  @6weeeeeeeeeeeweeee8+ .;weweeeeeeeeeeeeeeeeeeeeeeeeeeeeeeeeeeeeeeeeeeeeeeeeeeeeeeeeeeeeeeeeeeeeeeeeee",
"eeeeeeeeeeeeeeeeeeeeeeeeeeeeeeeeeeeeeeeeeeeeeeeeeeeeeeewww&  $8eeeeeeeeeeeeeeew8$  =qeeeeeeeweeewq1$X>eeeeeeeeeeeeeeeeeeeeeeeeeeeeeeeeeeeeeeeeeeeeeeeeeeeeeeeeww<. X>qeeweeeeeeeeee9<X X>eeweeeeeeeeeeeeeeeeeeeeeeeeeeeeeeeeeeeeeeeeeeeeeeeeeeeeeeeeeeeeeeeeeeeeeeeeeee",
"eeeeeeeeeeeeeeeeeeeeeeeeeeeeeeeeeeeeeeeeeeeeeeeeeeeeeeeeeeq=  o<weeeeeeeeeeeww>o .:weweeeeeeeeeeeeew98eeeeeeeeeeeeeeeeeeeeeeeeeeeeeeeeeeeeeeeeeeeeeeeeeeeeeeeeeew4o. +<9weeeeeeew91O  o3eweeeeeeeeeeeeeeeeeeeeeeeeeeeeeeeeeeeeeeeeeeeeeeeeeeeeeeeeeeeeeeeeeeeeeeeeeeeee",
"eeeeeeeeeeeeeeeeeeeeeeeeeeeeeeeeeeeeeeeeeeeeeeeeeeeeeeeeeeew1O  O,7wweweeeq6;+  O2weeeeeeeeeeeeeeeeeeeeeeeeeeeeeeeeeeeeeeeeeeweewweeeeeeeeeeeeeeeeeeeeeeeeeeeeeewe8*X  .$>33433<%X  .-9weeeeeeeeeeeeeeeeeeeeeeeeeeeeeeeeeeeeeeeeeeeeeeeeeeeeeeeeeeeeeeeeeeeeeeeeeeeeeee",
"eeeeeeeeeeeeeeeeeeeeeeeeeeeeeeeeeeeeeeeeeeeeeeeeeeeeeeeeeewee9*.   @*;;>-*O.  .-9eeeeeeeeeeeeeeeeeeeeeeeeeeeeeeeeeeeeeeeeeeeeeweeeweeeeeeeeeeeeeeeeeeeeeeeeeeeeeeeew8-X     .     o*6eeeeweeeeeeeeeeeeeeeeeeeeeeeeeeeeeeeeeeeeeeeeeeeeeeeeeeeeeeeeeeeeeeeeeeeeeeeeeeeee",
"eeeeeeeeeeeeeeeeeeeeeeeeeeeeeeeeeeeeeeeeeeeeeeeeeeeeeeeeeeweewe5;@.        .#;6weweeeeeeeeeeeeeeeeeeeeeeeeeeeeeeeeeeeeeeeeee931033eeeeeeeeeeeeeeeeeeeeeeeeeeeeeeweeeewq3=$@O.o@$*3qeeweeeeeeeeeeeeeeeeeeeeeeeeeeeeeeeeeeeeeeeeeeeeeeeeeeeeeeeeeeeeeeeeeeeeeeeeeeeeeeeee",
"eeeeeeeeeeeeeeeeeeeeeeeeeeeeeeeeeeeeeeeeeeeeeeeeeeeeeeeeeeeeeeeeeq8<;*##*:<8weeeeeeeeeeeeeeeeeeeeeeeeeeeeeeeeeeeeeeeeeeeeew6O%>&+:weeeeeeeeeeeeeeeeeeeeeeeeeeeeeeeeeeeeeeww099wweeeeeeeeeeeeeeeeeeeeeeeeeeeeeeeeeeeeeeeeeeeeeeeeeeeeeeeeeeeeeeeeeeeeeeeeeeeeeeeeeeeeeee",
"eeeeeeeeeeeeeeeeeeeeeeeeeeeeeeeeeeeeeeeeeeeeeeeeeeeeeeeeeeeeeeeeweeweeeeeeweeeeeeeeeeeeeeeeeeeeeeeeeeeeeeeeeeeeeeeeeeeeeeww%;we9o-weeeeeeeeeeeeeeeeeeeeeeeeeeeeeeeeeeeeeeeeeeweeeeeeeeeeeeeeeeeeeeeeeeeeeeeeeeeeeeeeeeeeeeeeeeeeeeeeeeeeeeeeeeeeeeeeeeeeeeeeeeeeeeeeeee",
"eeeeeeeeeeeeeeeeeeeeeeeeeeeeeeeeeeeeeeeeeeeeeeeeeeeeeeeeeeeeeeeeeeeeeewwweeeeeeeeeeeeeeeeeeeeeeeeeeeeeeeeeeeeeeeeeeeeeeeeeqo6ewe%-eeeeeeeeeeeeeeeeeeeeeeeeeeeeeeeeeeeeeeeeeeeeeeeeeeeeeeeeeeeeeeeeeeeeeeeeeeeeeeeeeeeeeeeeeeeeeeeeeeeeeeeeeeeeeeeeeeeeeeeeeeeeeeeeeeeee",
"eeeeeeeeeeeeeeeeeeeeeeeeeeeeeeeeeeeeeeeeeeeeeeeeeeeeeeeeeeeeeeeeeeeeeeeeeeeeeeeeeeeeeeeeeeeeeeeeeeeeeeeeeeeeeeeeeeeeeeeeeeqo7wwe%=weeeeeeeeeeeeeeeeeeeeeeeeeeeeeeeeeeeeeeeeeeeeeeeeeeeeeeeeeeeeeeeeeeeeeeeeeeeeeeeeeeeeeeeeeeeeeeeeeeeeeeeeeeeeeeeeeeeeeeeeeeeeeeeeeeee",
"eeeeeeeeeeeeeeeeeeeeeeeeeeeeeeeeeeeeeeeeeeeeeeeeeeeeeeeeeeeeeeeeeeeeeeeeeeeeeeeeeeeeeeeeeeeeeeeeeeeeeeeeeeeeeeeeeeeeeeeeeew$:ee0o-eeeeeeeeeeeeeeeeeeeeeeeeeeeeeeeeeeeeeeeeeeeeeeeeeeeeeeeeeeeeeeeeeeeeeeeeeeeeeeeeeeeeeeeeeeeeeeeeeeeeeeeeeeeeeeeeeeeeeeeeeeeeeeeeeeeee",
"eeeeeeeeeeeeeeeeeeeeeeeeeeeeeeeeeeeeeeeeeeeeeeeeeeeeeeeeeeeeeeeeeeeeeeeeeeeeeeeeeeeeeeeeeeeeeeeeeeeeeeeeeeeeeeeeeeeeeeeeeew4o15&o-weeeeeeeeeeeeeeeeeeeeeeeeeeeeeeeeeeeeeeeeeeeeeeeeeeeeeeeeeeeeeeeeeeeeeeeeeeeeeeeeeeeeeeeeeeeeeeeeeeeeeeeeeeeeeeeeeeeeeeeeeeeeeeeeeeee",
"eeeeeeeeeeeeeeeeeeeeeeeeeeeeeeeeeeeeeeeeeeeeeeeeeeeeeeeeeeeeeeeeeeeeeeeeeeeeeeeeeeeeeeeeeeeeeeeeeeeeeeeeeeeeeeeeeeeeeeeeeeww5**5&;weeeeeeeeeeeeeeeeeeeeeeeeeeeeeeeeeeeeeeeeeeeeeeeeeeeeeeeeeeeeeeeeeeeeeeeeeeeeeeeeeeeeeeeeeeeeeeeeeeeeeeeeeeeeeeeeeeeeeeeeeeeeeeeeeeee",
"eeeeeeeeeeeeeeeeeeeeeeeeeeeeeeeeeeeeeeeeeeeeeeeeeeeeeeeeeeeeeeeeeeeeeeeeeeeeeeeeeeeeeeeeeeeeeeeeeeeeeeeeeeeeeeeeeeeeeeeeeew69ewq@4eeeeeeeeeeeeeeeeeeeeeeeeeeeeeeeeeeeeeeeeeeeeeeeeeeeeeeeeeeeeeeeeeeeeeeeeeeeeeeeeeeeeeeeeeeeeeeeeeeeeeeeeeeeeeeeeeeeeeeeeeeeeeeeeeeeee",
"eeeeeeeeeeeeeeeeeeeeeeeeeeeeeeeeeeeeeeeeeeeeeeeeeeeeeeeeeeeeeeeeeeeeeeeeeeeeeeeeeeeeeeeeeeeeeeeeeeeeeeeeeeeeeeeeeeeeeeeeeew-O::$$qeeeeeeeeeeeeeeeeeeeeeeeeeeeeeeeeeeeeeeeeeeeeeeeeeeeeeeeeeeeeeeeeeeeeeeeeeeeeeeeeeeeeeeeeeeeeeeeeeeeeeeeeeeeeeeeeeeeeeeeeeeeeeeeeeeeee",
"eeeeeeeeeeeeeeeeeeeeeeeeeeeeeeeeeeeeeeeeeeeeeeeeeeeeeeeeeeeeeeeeeeeeeeeeeeeeeeeeeeeeeeeeeeeeeeeeeeeeeeeeeeeeeeeeeeeeeeeeeeee7<,4weeeeeeeeeeeeeeeeeeeeeeeeeeeeeeeeeeeeeeeeeeeeeeeeeeeeeeeeeeeeeeeeeeeeeeeeeeeeeeeeeeeeeeeeeeeeeeeeeeeeeeeeeeeeeeeeeeeeeeeeeeeeeeeeeeeeee",
"eeeeeeeeeeeeeeeeeeeeeeeeeeeeeeeeeeeeeeeeeeeeeeeeeeeeeeeeeeeeeeeeeeeeeeeeeeeeeeeeeeeeeeeeeeeeeeeeeeeeeeeeeeeeeeeeeeeeeeeeeeeeeeweeeeeeeeeeeeeeeeeeeeeeeeeeeeeeeeeeeeeeeeeeeeeeeeeeeeeeeeeeeeeeeeeeeeeeeeeeeeeeeeeeeeeeeeeeeeeeeeeeeeeeeeeeeeeeeeeeeeeeeeeeeeeeeeeeeeeeee",
"eeeeeeeeeeeeeeeeeeeeeeeeeeeeeeeeeeeeeeeeeeeeeeeeeeeeeeeeeeeeeeeeeeeeeeeeeeeeeeeeeeeeeeeeeeeeeeeeeeeeeeeeeeeeeeeeeeeeeeeeeeeeeweeeeeeeeeeeeeeeeeeeeeeeeeeeeeeeeeeeeeeeeeeeeeeeeeeeeeeeeeeeeeeeeeeeeeeeeeeeeeeeeeeeeeeeeeeeeeeeeeeeeeeeeeeeeeeeeeeeeeeeeeeeeeeeeeeeeeeeee",
"eeeeeeeeeeeeeeeeeeeeeeeeeeeeeeeeeeeeeeeeeeeeeeeeeeeeeeeeeeeeeeeeeeeeeeeeeeeeeeeeeeeeeeeeeeeeeeeeeeeeeeeeeeeeeeeeeeeeeeeeeeeeeeeeeeeeeeeeeeeeeeeeeeeeeeeeeeeeeeeeeeeeeeeeeeeeeeeeeeeeeeeeeeeeeeeeeeeeeeeeeeeeeeeeeeeeeeeeeeeeeeeeeeeeeeeeeeeeeeeeeeeeeeeeeeeeeeeeeeeeeee",
"eeeeeeeeeeeeeeeeeeeeeeeeeeeeeeeeeeeeeeeeeeeeeeeeeeeeeeeeeeeeeeeeeeeeeeeeeeeeeeeeeeeeeeeeeeeeeeeeeeeeeeeeeeeeeeeeeeeeeeeeeeeeeeeeeeeeeeeeeeeeeeeeeeeeeeeeeeeeeeeeeeeeeeeeeeeeeeeeeeeeeeeeeeeeeeeeeeeeeeeeeeeeeeeeeeeeeeeeeeeeeeeeeeeeeeeeeeeeeeeeeeeeeeeeeeeeeeeeeeeeeee",
"eeeeeeeeeeeeeeeeeeeeeeeeeeeeeeeeeeeeeeeeeeeeeeeeeeeeeeeeeeeeeeeeeeeeeeeeeeeeeeeeeeeeeeeeeeeeeeeeeeeeeeeeeeeeeeeeeeeeeeeeeeeeeeeeeeeeeeeeeeeeeeeeeeeeeeeeeeeeeeeeeeeeeeeeeeeeeeeeeeeeeeeeeeeeeeeeeeeeeeeeeeeeeeeeeeeeeeeeeeeeeeeeeeeeeeeeeeeeeeeeeeeeeeeeeeeeeeeeeeeeeee"
};
