HEADER:
Checked=true
WithData=true
Cellformat=Vtu
POINTS:
0 0 0
0 0 1
0 1 0
0 1 1
1 0 0
1 0 1
1 1 0
1 1 1
2 0 0
2 0 1
2 1 0
2 1 1
3 0 0
3 0 1
3 1 0
3 1 1
4 0 0
4 0 1
4 1 0
4 1 1
5 0 0
5 0 1
5 1 0
5 1 1
6 0 0
6 0 1
6 1 0
6 1 1
7 0 0
7 0 1
7 1 0
7 1 1
8 0 0
8 0 1
8 1 0
8 1 1
9 0 0
9 0 1
9 1 0
9 1 1
10 0 0
10 0 1
10 1 0
10 1 1
CELLS:
10 0 0 2 3 7 
10 0 0 6 2 7 
10 0 0 4 6 7 
10 0 0 5 4 7 
10 0 0 1 5 7 
10 0 0 3 1 7 
10 0 4 6 7 11 
10 0 4 10 6 11 
10 0 4 8 10 11 
10 0 4 9 8 11 
10 0 4 5 9 11 
10 0 4 7 5 11 
10 0 8 10 11 15 
10 0 8 14 10 15 
10 0 8 12 14 15 
10 0 8 13 12 15 
10 0 8 9 13 15 
10 0 8 11 9 15 
10 0 12 14 15 19 
10 0 12 18 14 19 
10 0 12 16 18 19 
10 0 12 17 16 19 
10 0 12 13 17 19 
10 0 12 15 13 19 
10 0 16 18 19 23 
10 0 16 22 18 23 
10 0 16 20 22 23 
10 0 16 21 20 23 
10 0 16 17 21 23 
10 0 16 19 17 23 
10 0 20 22 23 27 
10 0 20 26 22 27 
10 0 20 24 26 27 
10 0 20 25 24 27 
10 0 20 21 25 27 
10 0 20 23 21 27 
10 0 24 26 27 31 
10 0 24 30 26 31 
10 0 24 28 30 31 
10 0 24 29 28 31 
10 0 24 25 29 31 
10 0 24 27 25 31 
10 0 28 30 31 35 
10 0 28 34 30 35 
10 0 28 32 34 35 
10 0 28 33 32 35 
10 0 28 29 33 35 
10 0 28 31 29 35 
10 0 32 34 35 39 
10 0 32 38 34 39 
10 0 32 36 38 39 
10 0 32 37 36 39 
10 0 32 33 37 39 
10 0 32 35 33 39 
10 0 36 38 39 43 
10 0 36 42 38 43 
10 0 36 40 42 43 
10 0 36 41 40 43 
10 0 36 37 41 43 
10 0 36 39 37 43 
FACES:
199 0 2 3 
199 0 3 1 
230 40 42 43 
230 40 43 41 
232 7 5 1 
232 7 1 3 
232 6 4 0 
232 6 0 2 
232 11 9 5 
232 11 5 7 
232 10 8 4 
232 10 4 6 
232 15 13 9 
232 15 9 11 
232 14 12 8 
232 14 8 10 
232 19 17 13 
232 19 13 15 
232 18 16 12 
232 18 12 14 
232 23 21 17 
232 23 17 19 
232 22 20 16 
232 22 16 18 
232 27 25 21 
232 27 21 23 
232 26 24 20 
232 26 20 22 
232 31 29 25 
232 31 25 27 
232 30 28 24 
232 30 24 26 
232 35 33 29 
232 35 29 31 
232 34 32 28 
232 34 28 30 
232 39 37 33 
232 39 33 35 
232 38 36 32 
232 38 32 34 
232 43 41 37 
232 43 37 39 
232 42 40 36 
232 42 36 38 
232 0 4 5 
232 0 5 1 
232 2 6 7 
232 2 7 3 
232 4 8 9 
232 4 9 5 
232 6 10 11 
232 6 11 7 
232 8 12 13 
232 8 13 9 
232 10 14 15 
232 10 15 11 
232 12 16 17 
232 12 17 13 
232 14 18 19 
232 14 19 15 
232 16 20 21 
232 16 21 17 
232 18 22 23 
232 18 23 19 
232 20 24 25 
232 20 25 21 
232 22 26 27 
232 22 27 23 
232 24 28 29 
232 24 29 25 
232 26 30 31 
232 26 31 27 
232 28 32 33 
232 28 33 29 
232 30 34 35 
232 30 35 31 
232 32 36 37 
232 32 37 33 
232 34 38 39 
232 34 39 35 
232 36 40 41 
232 36 41 37 
232 38 42 43 
232 38 43 39 
VDATA:
0 0.002 20 
0 0.002 20 
0 0.002 20 
0 0.002 20 
0 0.002 20 
0 0.002 20 
0 0.002 20 
0 0.002 20 
-10 0 0 
-10 0 0 
-10 0 0 
-10 0 0 
-10 0 0 
-10 0 0 
-10 0 0 
-10 0 0 
-10 0 0 
-10 0 0 
-10 0 0 
-10 0 0 
-10 0 0 
-10 0 0 
-10 0 0 
-10 0 0 
-10 0 0 
-10 0 0 
-10 0 0 
-10 0 0 
-10 0 0 
-10 0 0 
-10 0 0 
-10 0 0 
-10 0 0 
-10 0 0 
-10 0 0 
-10 0 0 
-10 0 0 
-10 0 0 
-10 0 0 
-10 0 0 
-10 0 0 
-10 0 0 
-10 0 0 
-10 0 0 
CDATA:
1 0 0 0 1 0 0 0 1 
1 0 0 0 1 0 0 0 1 
1 0 0 0 1 0 0 0 1 
1 0 0 0 1 0 0 0 1 
1 0 0 0 1 0 0 0 1 
1 0 0 0 1 0 0 0 1 
1 0 0 0 1 0 0 0 1 
1 0 0 0 1 0 0 0 1 
1 0 0 0 1 0 0 0 1 
1 0 0 0 1 0 0 0 1 
1 0 0 0 1 0 0 0 1 
1 0 0 0 1 0 0 0 1 
1 0 0 0 1 0 0 0 1 
1 0 0 0 1 0 0 0 1 
1 0 0 0 1 0 0 0 1 
1 0 0 0 1 0 0 0 1 
1 0 0 0 1 0 0 0 1 
1 0 0 0 1 0 0 0 1 
1 0 0 0 1 0 0 0 1 
1 0 0 0 1 0 0 0 1 
1 0 0 0 1 0 0 0 1 
1 0 0 0 1 0 0 0 1 
1 0 0 0 1 0 0 0 1 
1 0 0 0 1 0 0 0 1 
1 0 0 0 1 0 0 0 1 
1 0 0 0 1 0 0 0 1 
1 0 0 0 1 0 0 0 1 
1 0 0 0 1 0 0 0 1 
1 0 0 0 1 0 0 0 1 
1 0 0 0 1 0 0 0 1 
1 0 0 0 1 0 0 0 1 
1 0 0 0 1 0 0 0 1 
1 0 0 0 1 0 0 0 1 
1 0 0 0 1 0 0 0 1 
1 0 0 0 1 0 0 0 1 
1 0 0 0 1 0 0 0 1 
1 0 0 0 1 0 0 0 1 
1 0 0 0 1 0 0 0 1 
1 0 0 0 1 0 0 0 1 
1 0 0 0 1 0 0 0 1 
1 0 0 0 1 0 0 0 1 
1 0 0 0 1 0 0 0 1 
1 0 0 0 1 0 0 0 1 
1 0 0 0 1 0 0 0 1 
1 0 0 0 1 0 0 0 1 
1 0 0 0 1 0 0 0 1 
1 0 0 0 1 0 0 0 1 
1 0 0 0 1 0 0 0 1 
1 0 0 0 1 0 0 0 1 
1 0 0 0 1 0 0 0 1 
1 0 0 0 1 0 0 0 1 
1 0 0 0 1 0 0 0 1 
1 0 0 0 1 0 0 0 1 
1 0 0 0 1 0 0 0 1 
1 0 0 0 1 0 0 0 1 
1 0 0 0 1 0 0 0 1 
1 0 0 0 1 0 0 0 1 
1 0 0 0 1 0 0 0 1 
1 0 0 0 1 0 0 0 1 
1 0 0 0 1 0 0 0 1 
