POINTS:
0.0 0.0 0.0
0.0 0.0 1.0
0.0 0.0 2.0
0.0 0.0 3.0
0.0 1.0 0.0
0.0 1.0 1.0
0.0 1.0 2.0
0.0 1.0 3.0
0.0 2.0 0.0
0.0 2.0 1.0
0.0 2.0 2.0
0.0 2.0 3.0
0.0 3.0 0.0
0.0 3.0 1.0
0.0 3.0 2.0
0.0 3.0 3.0
0.0 4.0 0.0
0.0 4.0 1.0
0.0 4.0 2.0
0.0 4.0 3.0
1.0 0.0 0.0
1.0 0.0 1.0
1.0 0.0 2.0
1.0 0.0 3.0
1.0 1.0 0.0
1.0 1.0 1.0
1.0 1.0 2.0
1.0 1.0 3.0
1.0 2.0 0.0
1.0 2.0 1.0
1.0 2.0 2.0
1.0 2.0 3.0
1.0 3.0 0.0
1.0 3.0 1.0
1.0 3.0 2.0
1.0 3.0 3.0
1.0 4.0 0.0
1.0 4.0 1.0
1.0 4.0 2.0
1.0 4.0 3.0
2.0 0.0 0.0
2.0 0.0 1.0
2.0 0.0 2.0
2.0 0.0 3.0
2.0 1.0 0.0
2.0 1.0 1.0
2.0 1.0 2.0
2.0 1.0 3.0
2.0 2.0 0.0
2.0 2.0 1.0
2.0 2.0 2.0
2.0 2.0 3.0
2.0 3.0 0.0
2.0 3.0 1.0
2.0 3.0 2.0
2.0 3.0 3.0
2.0 4.0 0.0
2.0 4.0 1.0
2.0 4.0 2.0
2.0 4.0 3.0
3.0 0.0 0.0
3.0 0.0 1.0
3.0 0.0 2.0
3.0 0.0 3.0
3.0 1.0 0.0
3.0 1.0 1.0
3.0 1.0 2.0
3.0 1.0 3.0
3.0 2.0 0.0
3.0 2.0 1.0
3.0 2.0 2.0
3.0 2.0 3.0
3.0 3.0 0.0
3.0 3.0 1.0
3.0 3.0 2.0
3.0 3.0 3.0
3.0 4.0 0.0
3.0 4.0 1.0
3.0 4.0 2.0
3.0 4.0 3.0
4.0 0.0 0.0
4.0 0.0 1.0
4.0 0.0 2.0
4.0 0.0 3.0
4.0 1.0 0.0
4.0 1.0 1.0
4.0 1.0 2.0
4.0 1.0 3.0
4.0 2.0 0.0
4.0 2.0 1.0
4.0 2.0 2.0
4.0 2.0 3.0
4.0 3.0 0.0
4.0 3.0 1.0
4.0 3.0 2.0
4.0 3.0 3.0
4.0 4.0 0.0
4.0 4.0 1.0
4.0 4.0 2.0
4.0 4.0 3.0
CELLS:
4 9000 0 4 5 25
4 9000 0 4 24 25
4 9000 0 20 24 25
4 9000 0 20 21 25
4 9000 0 1 21 25
4 9000 0 1 5 25
4 9000 1 5 6 26
4 9000 1 5 25 26
4 9000 1 21 25 26
4 9000 1 21 22 26
4 9000 1 2 22 26
4 9000 1 2 6 26
4 9000 2 6 7 27
4 9000 2 6 26 27
4 9000 2 22 26 27
4 9000 2 22 23 27
4 9000 2 3 23 27
4 9000 2 3 7 27
4 9000 4 8 9 29
4 9000 4 8 28 29
4 9000 4 24 28 29
4 9000 4 24 25 29
4 9000 4 5 25 29
4 9000 4 5 9 29
4 9000 5 9 10 30
4 9000 5 9 29 30
4 9000 5 25 29 30
4 9000 5 25 26 30
4 9000 5 6 26 30
4 9000 5 6 10 30
4 9000 6 10 11 31
4 9000 6 10 30 31
4 9000 6 26 30 31
4 9000 6 26 27 31
4 9000 6 7 27 31
4 9000 6 7 11 31
4 9000 8 12 13 33
4 9000 8 12 32 33
4 9000 8 28 32 33
4 9000 8 28 29 33
4 9000 8 9 29 33
4 9000 8 9 13 33
4 9000 9 13 14 34
4 9000 9 13 33 34
4 9000 9 29 33 34
4 9000 9 29 30 34
4 9000 9 10 30 34
4 9000 9 10 14 34
4 9000 10 14 15 35
4 9000 10 14 34 35
4 9000 10 30 34 35
4 9000 10 30 31 35
4 9000 10 11 31 35
4 9000 10 11 15 35
4 9000 12 16 17 37
4 9000 12 16 36 37
4 9000 12 32 36 37
4 9000 12 32 33 37
4 9000 12 13 33 37
4 9000 12 13 17 37
4 9000 13 17 18 38
4 9000 13 17 37 38
4 9000 13 33 37 38
4 9000 13 33 34 38
4 9000 13 14 34 38
4 9000 13 14 18 38
4 9000 14 18 19 39
4 9000 14 18 38 39
4 9000 14 34 38 39
4 9000 14 34 35 39
4 9000 14 15 35 39
4 9000 14 15 19 39
4 9000 20 24 25 45
4 9000 20 24 44 45
4 9000 20 40 44 45
4 9000 20 40 41 45
4 9000 20 21 41 45
4 9000 20 21 25 45
4 9000 21 25 26 46
4 9000 21 25 45 46
4 9000 21 41 45 46
4 9000 21 41 42 46
4 9000 21 22 42 46
4 9000 21 22 26 46
4 9000 22 26 27 47
4 9000 22 26 46 47
4 9000 22 42 46 47
4 9000 22 42 43 47
4 9000 22 23 43 47
4 9000 22 23 27 47
4 9000 24 28 29 49
4 9000 24 28 48 49
4 9000 24 44 48 49
4 9000 24 44 45 49
4 9000 24 25 45 49
4 9000 24 25 29 49
4 0 25 29 30 50
4 0 25 29 49 50
4 0 25 45 49 50
4 0 25 45 46 50
4 0 25 26 46 50
4 0 25 26 30 50
4 9000 26 30 31 51
4 9000 26 30 50 51
4 9000 26 46 50 51
4 9000 26 46 47 51
4 9000 26 27 47 51
4 9000 26 27 31 51
4 9000 28 32 33 53
4 9000 28 32 52 53
4 9000 28 48 52 53
4 9000 28 48 49 53
4 9000 28 29 49 53
4 9000 28 29 33 53
4 2000 29 33 34 54
4 2000 29 33 53 54
4 2000 29 49 53 54
4 2000 29 49 50 54
4 2000 29 30 50 54
4 2000 29 30 34 54
4 9000 30 34 35 55
4 9000 30 34 54 55
4 9000 30 50 54 55
4 9000 30 50 51 55
4 9000 30 31 51 55
4 9000 30 31 35 55
4 9000 32 36 37 57
4 9000 32 36 56 57
4 9000 32 52 56 57
4 9000 32 52 53 57
4 9000 32 33 53 57
4 9000 32 33 37 57
4 9000 33 37 38 58
4 9000 33 37 57 58
4 9000 33 53 57 58
4 9000 33 53 54 58
4 9000 33 34 54 58
4 9000 33 34 38 58
4 9000 34 38 39 59
4 9000 34 38 58 59
4 9000 34 54 58 59
4 9000 34 54 55 59
4 9000 34 35 55 59
4 9000 34 35 39 59
4 9000 40 44 45 65
4 9000 40 44 64 65
4 9000 40 60 64 65
4 9000 40 60 61 65
4 9000 40 41 61 65
4 9000 40 41 45 65
4 9000 41 45 46 66
4 9000 41 45 65 66
4 9000 41 61 65 66
4 9000 41 61 62 66
4 9000 41 42 62 66
4 9000 41 42 46 66
4 9000 42 46 47 67
4 9000 42 46 66 67
4 9000 42 62 66 67
4 9000 42 62 63 67
4 9000 42 43 63 67
4 9000 42 43 47 67
4 9000 44 48 49 69
4 9000 44 48 68 69
4 9000 44 64 68 69
4 9000 44 64 65 69
4 9000 44 45 65 69
4 9000 44 45 49 69
4 1000 45 49 50 70
4 1000 45 49 69 70
4 1000 45 65 69 70
4 1000 45 65 66 70
4 1000 45 46 66 70
4 1000 45 46 50 70
4 9000 46 50 51 71
4 9000 46 50 70 71
4 9000 46 66 70 71
4 9000 46 66 67 71
4 9000 46 47 67 71
4 9000 46 47 51 71
4 9000 48 52 53 73
4 9000 48 52 72 73
4 9000 48 68 72 73
4 9000 48 68 69 73
4 9000 48 49 69 73
4 9000 48 49 53 73
4 3000 49 53 54 74
4 3000 49 53 73 74
4 3000 49 69 73 74
4 3000 49 69 70 74
4 3000 49 50 70 74
4 3000 49 50 54 74
4 9000 50 54 55 75
4 9000 50 54 74 75
4 9000 50 70 74 75
4 9000 50 70 71 75
4 9000 50 51 71 75
4 9000 50 51 55 75
4 9000 52 56 57 77
4 9000 52 56 76 77
4 9000 52 72 76 77
4 9000 52 72 73 77
4 9000 52 53 73 77
4 9000 52 53 57 77
4 9000 53 57 58 78
4 9000 53 57 77 78
4 9000 53 73 77 78
4 9000 53 73 74 78
4 9000 53 54 74 78
4 9000 53 54 58 78
4 9000 54 58 59 79
4 9000 54 58 78 79
4 9000 54 74 78 79
4 9000 54 74 75 79
4 9000 54 55 75 79
4 9000 54 55 59 79
4 9000 60 64 65 85
4 9000 60 64 84 85
4 9000 60 80 84 85
4 9000 60 80 81 85
4 9000 60 61 81 85
4 9000 60 61 65 85
4 9000 61 65 66 86
4 9000 61 65 85 86
4 9000 61 81 85 86
4 9000 61 81 82 86
4 9000 61 62 82 86
4 9000 61 62 66 86
4 9000 62 66 67 87
4 9000 62 66 86 87
4 9000 62 82 86 87
4 9000 62 82 83 87
4 9000 62 63 83 87
4 9000 62 63 67 87
4 9000 64 68 69 89
4 9000 64 68 88 89
4 9000 64 84 88 89
4 9000 64 84 85 89
4 9000 64 65 85 89
4 9000 64 65 69 89
4 9000 65 69 70 90
4 9000 65 69 89 90
4 9000 65 85 89 90
4 9000 65 85 86 90
4 9000 65 66 86 90
4 9000 65 66 70 90
4 9000 66 70 71 91
4 9000 66 70 90 91
4 9000 66 86 90 91
4 9000 66 86 87 91
4 9000 66 67 87 91
4 9000 66 67 71 91
4 9000 68 72 73 93
4 9000 68 72 92 93
4 9000 68 88 92 93
4 9000 68 88 89 93
4 9000 68 69 89 93
4 9000 68 69 73 93
4 9000 69 73 74 94
4 9000 69 73 93 94
4 9000 69 89 93 94
4 9000 69 89 90 94
4 9000 69 70 90 94
4 9000 69 70 74 94
4 9000 70 74 75 95
4 9000 70 74 94 95
4 9000 70 90 94 95
4 9000 70 90 91 95
4 9000 70 71 91 95
4 9000 70 71 75 95
4 9000 72 76 77 97
4 9000 72 76 96 97
4 9000 72 92 96 97
4 9000 72 92 93 97
4 9000 72 73 93 97
4 9000 72 73 77 97
4 9000 73 77 78 98
4 9000 73 77 97 98
4 9000 73 93 97 98
4 9000 73 93 94 98
4 9000 73 74 94 98
4 9000 73 74 78 98
4 9000 74 78 79 99
4 9000 74 78 98 99
4 9000 74 94 98 99
4 9000 74 94 95 99
4 9000 74 75 95 99
4 9000 74 75 79 99
FACES:
3 1 0 4 5
3 1 0 5 1
3 1 80 84 85
3 1 80 85 81
3 1 1 5 6
3 1 1 6 2
3 1 81 85 86
3 1 81 86 82
3 1 2 6 7
3 1 2 7 3
3 1 82 86 87
3 1 82 87 83
3 1 4 8 9
3 1 4 9 5
3 1 84 88 89
3 1 84 89 85
3 1 5 9 10
3 1 5 10 6
3 1 85 89 90
3 1 85 90 86
3 1 6 10 11
3 1 6 11 7
3 1 86 90 91
3 1 86 91 87
3 1 8 12 13
3 1 8 13 9
3 1 88 92 93
3 1 88 93 89
3 1 9 13 14
3 1 9 14 10
3 1 89 93 94
3 1 89 94 90
3 1 10 14 15
3 1 10 15 11
3 1 90 94 95
3 1 90 95 91
3 1 12 16 17
3 1 12 17 13
3 1 92 96 97
3 1 92 97 93
3 1 13 17 18
3 1 13 18 14
3 1 93 97 98
3 1 93 98 94
3 1 14 18 19
3 1 14 19 15
3 1 94 98 99
3 1 94 99 95
3 1 27 23 3
3 1 27 3 7
3 1 24 20 0
3 1 24 0 4
3 1 31 27 7
3 1 31 7 11
3 1 28 24 4
3 1 28 4 8
3 1 35 31 11
3 1 35 11 15
3 1 32 28 8
3 1 32 8 12
3 1 39 35 15
3 1 39 15 19
3 1 36 32 12
3 1 36 12 16
3 1 47 43 23
3 1 47 23 27
3 1 44 40 20
3 1 44 20 24
3 1 51 47 27
3 1 51 27 31
3 1 48 44 24
3 1 48 24 28
3 1 55 51 31
3 1 55 31 35
3 1 52 48 28
3 1 52 28 32
3 1 59 55 35
3 1 59 35 39
3 1 56 52 32
3 1 56 32 36
3 1 67 63 43
3 1 67 43 47
3 1 64 60 40
3 1 64 40 44
3 1 71 67 47
3 1 71 47 51
3 1 68 64 44
3 1 68 44 48
3 1 75 71 51
3 1 75 51 55
3 1 72 68 48
3 1 72 48 52
3 1 79 75 55
3 1 79 55 59
3 1 76 72 52
3 1 76 52 56
3 1 87 83 63
3 1 87 63 67
3 1 84 80 60
3 1 84 60 64
3 1 91 87 67
3 1 91 67 71
3 1 88 84 64
3 1 88 64 68
3 1 95 91 71
3 1 95 71 75
3 1 92 88 68
3 1 92 68 72
3 1 99 95 75
3 1 99 75 79
3 1 96 92 72
3 1 96 72 76
3 1 0 20 21
3 1 0 21 1
3 1 16 36 37
3 1 16 37 17
3 1 1 21 22
3 1 1 22 2
3 1 17 37 38
3 1 17 38 18
3 1 2 22 23
3 1 2 23 3
3 1 18 38 39
3 1 18 39 19
3 1 20 40 41
3 1 20 41 21
3 1 36 56 57
3 1 36 57 37
3 1 21 41 42
3 1 21 42 22
3 1 37 57 58
3 1 37 58 38
3 1 22 42 43
3 1 22 43 23
3 1 38 58 59
3 1 38 59 39
3 1 40 60 61
3 1 40 61 41
3 1 56 76 77
3 1 56 77 57
3 1 41 61 62
3 1 41 62 42
3 1 57 77 78
3 1 57 78 58
3 1 42 62 63
3 1 42 63 43
3 1 58 78 79
3 1 58 79 59
3 1 60 80 81
3 1 60 81 61
3 1 76 96 97
3 1 76 97 77
3 1 61 81 82
3 1 61 82 62
3 1 77 97 98
3 1 77 98 78
3 1 62 82 83
3 1 62 83 63
3 1 78 98 99
3 1 78 99 79
VDATA:
3 -10 0 0
3 -10 0 0
3 -10 0 0
3 -10 0 0
3 -10 0 0
3 -10 0 0
3 -10 0 0
3 -10 0 0
3 -10 0 0
3 -10 0 0
3 -10 0 0
3 -10 0 0
3 -10 0 0
3 -10 0 0
3 -10 0 0
3 -10 0 0
3 -10 0 0
3 -10 0 0
3 -10 0 0
3 -10 0 0
3 -10 0 0
3 -10 0 0
3 -10 0 0
3 -10 0 0
3 -10 0 0
3 -10 0 0
3 -10 0 0
3 -10 0 0
3 -10 0 0
3 -10 0 0
3 -10 0 0
3 -10 0 0
3 -10 0 0
3 -10 0 0
3 -10 0 0
3 -10 0 0
3 -10 0 0
3 -10 0 0
3 -10 0 0
3 -10 0 0
3 -10 0 0
3 -10 0 0
3 -10 0 0
3 -10 0 0
3 -10 0 0
3 -10 0 0
3 -10 0 0
3 -10 0 0
3 -10 0 0
3 -10 0 0
3 -10 0 0
3 -10 0 0
3 -10 0 0
3 -10 0 0
3 -10 0 0
3 -10 0 0
3 -10 0 0
3 -10 0 0
3 -10 0 0
3 -10 0 0
3 -10 0 0
3 -10 0 0
3 -10 0 0
3 -10 0 0
3 -10 0 0
3 -10 0 0
3 -10 0 0
3 -10 0 0
3 -10 0 0
3 -10 0 0
3 -10 0 0
3 -10 0 0
3 -10 0 0
3 -10 0 0
3 -10 0 0
3 -10 0 0
3 -10 0 0
3 -10 0 0
3 -10 0 0
3 -10 0 0
3 -10 0 0
3 -10 0 0
3 -10 0 0
3 -10 0 0
3 -10 0 0
3 -10 0 0
3 -10 0 0
3 -10 0 0
3 -10 0 0
3 -10 0 0
3 -10 0 0
3 -10 0 0
3 -10 0 0
3 -10 0 0
3 -10 0 0
3 -10 0 0
3 -10 0 0
3 -10 0 0
3 -10 0 0
3 -10 0 0
CDATA:
9 1 0 0 0 1 0 0 0 1
9 1 0 0 0 1 0 0 0 1
9 1 0 0 0 1 0 0 0 1
9 1 0 0 0 1 0 0 0 1
9 1 0 0 0 1 0 0 0 1
9 1 0 0 0 1 0 0 0 1
9 1 0 0 0 1 0 0 0 1
9 1 0 0 0 1 0 0 0 1
9 1 0 0 0 1 0 0 0 1
9 1 0 0 0 1 0 0 0 1
9 1 0 0 0 1 0 0 0 1
9 1 0 0 0 1 0 0 0 1
9 1 0 0 0 1 0 0 0 1
9 1 0 0 0 1 0 0 0 1
9 1 0 0 0 1 0 0 0 1
9 1 0 0 0 1 0 0 0 1
9 1 0 0 0 1 0 0 0 1
9 1 0 0 0 1 0 0 0 1
9 1 0 0 0 1 0 0 0 1
9 1 0 0 0 1 0 0 0 1
9 1 0 0 0 1 0 0 0 1
9 1 0 0 0 1 0 0 0 1
9 1 0 0 0 1 0 0 0 1
9 1 0 0 0 1 0 0 0 1
9 1 0 0 0 1 0 0 0 1
9 1 0 0 0 1 0 0 0 1
9 1 0 0 0 1 0 0 0 1
9 1 0 0 0 1 0 0 0 1
9 1 0 0 0 1 0 0 0 1
9 1 0 0 0 1 0 0 0 1
9 1 0 0 0 1 0 0 0 1
9 1 0 0 0 1 0 0 0 1
9 1 0 0 0 1 0 0 0 1
9 1 0 0 0 1 0 0 0 1
9 1 0 0 0 1 0 0 0 1
9 1 0 0 0 1 0 0 0 1
9 1 0 0 0 1 0 0 0 1
9 1 0 0 0 1 0 0 0 1
9 1 0 0 0 1 0 0 0 1
9 1 0 0 0 1 0 0 0 1
9 1 0 0 0 1 0 0 0 1
9 1 0 0 0 1 0 0 0 1
9 1 0 0 0 1 0 0 0 1
9 1 0 0 0 1 0 0 0 1
9 1 0 0 0 1 0 0 0 1
9 1 0 0 0 1 0 0 0 1
9 1 0 0 0 1 0 0 0 1
9 1 0 0 0 1 0 0 0 1
9 1 0 0 0 1 0 0 0 1
9 1 0 0 0 1 0 0 0 1
9 1 0 0 0 1 0 0 0 1
9 1 0 0 0 1 0 0 0 1
9 1 0 0 0 1 0 0 0 1
9 1 0 0 0 1 0 0 0 1
9 1 0 0 0 1 0 0 0 1
9 1 0 0 0 1 0 0 0 1
9 1 0 0 0 1 0 0 0 1
9 1 0 0 0 1 0 0 0 1
9 1 0 0 0 1 0 0 0 1
9 1 0 0 0 1 0 0 0 1
9 1 0 0 0 1 0 0 0 1
9 1 0 0 0 1 0 0 0 1
9 1 0 0 0 1 0 0 0 1
9 1 0 0 0 1 0 0 0 1
9 1 0 0 0 1 0 0 0 1
9 1 0 0 0 1 0 0 0 1
9 1 0 0 0 1 0 0 0 1
9 1 0 0 0 1 0 0 0 1
9 1 0 0 0 1 0 0 0 1
9 1 0 0 0 1 0 0 0 1
9 1 0 0 0 1 0 0 0 1
9 1 0 0 0 1 0 0 0 1
9 1 0 0 0 1 0 0 0 1
9 1 0 0 0 1 0 0 0 1
9 1 0 0 0 1 0 0 0 1
9 1 0 0 0 1 0 0 0 1
9 1 0 0 0 1 0 0 0 1
9 1 0 0 0 1 0 0 0 1
9 1 0 0 0 1 0 0 0 1
9 1 0 0 0 1 0 0 0 1
9 1 0 0 0 1 0 0 0 1
9 1 0 0 0 1 0 0 0 1
9 1 0 0 0 1 0 0 0 1
9 1 0 0 0 1 0 0 0 1
9 1 0 0 0 1 0 0 0 1
9 1 0 0 0 1 0 0 0 1
9 1 0 0 0 1 0 0 0 1
9 1 0 0 0 1 0 0 0 1
9 1 0 0 0 1 0 0 0 1
9 1 0 0 0 1 0 0 0 1
9 1 0 0 0 1 0 0 0 1
9 1 0 0 0 1 0 0 0 1
9 1 0 0 0 1 0 0 0 1
9 1 0 0 0 1 0 0 0 1
9 1 0 0 0 1 0 0 0 1
9 1 0 0 0 1 0 0 0 1
9 1 0 0 0 1 0 0 0 1
9 1 0 0 0 1 0 0 0 1
9 1 0 0 0 1 0 0 0 1
9 1 0 0 0 1 0 0 0 1
9 1 0 0 0 1 0 0 0 1
9 1 0 0 0 1 0 0 0 1
9 1 0 0 0 1 0 0 0 1
9 1 0 0 0 1 0 0 0 1
9 1 0 0 0 1 0 0 0 1
9 1 0 0 0 1 0 0 0 1
9 1 0 0 0 1 0 0 0 1
9 1 0 0 0 1 0 0 0 1
9 1 0 0 0 1 0 0 0 1
9 1 0 0 0 1 0 0 0 1
9 1 0 0 0 1 0 0 0 1
9 1 0 0 0 1 0 0 0 1
9 1 0 0 0 1 0 0 0 1
9 1 0 0 0 1 0 0 0 1
9 1 0 0 0 1 0 0 0 1
9 1 0 0 0 1 0 0 0 1
9 1 0 0 0 1 0 0 0 1
9 1 0 0 0 1 0 0 0 1
9 1 0 0 0 1 0 0 0 1
9 1 0 0 0 1 0 0 0 1
9 1 0 0 0 1 0 0 0 1
9 1 0 0 0 1 0 0 0 1
9 1 0 0 0 1 0 0 0 1
9 1 0 0 0 1 0 0 0 1
9 1 0 0 0 1 0 0 0 1
9 1 0 0 0 1 0 0 0 1
9 1 0 0 0 1 0 0 0 1
9 1 0 0 0 1 0 0 0 1
9 1 0 0 0 1 0 0 0 1
9 1 0 0 0 1 0 0 0 1
9 1 0 0 0 1 0 0 0 1
9 1 0 0 0 1 0 0 0 1
9 1 0 0 0 1 0 0 0 1
9 1 0 0 0 1 0 0 0 1
9 1 0 0 0 1 0 0 0 1
9 1 0 0 0 1 0 0 0 1
9 1 0 0 0 1 0 0 0 1
9 1 0 0 0 1 0 0 0 1
9 1 0 0 0 1 0 0 0 1
9 1 0 0 0 1 0 0 0 1
9 1 0 0 0 1 0 0 0 1
9 1 0 0 0 1 0 0 0 1
9 1 0 0 0 1 0 0 0 1
9 1 0 0 0 1 0 0 0 1
9 1 0 0 0 1 0 0 0 1
9 1 0 0 0 1 0 0 0 1
9 1 0 0 0 1 0 0 0 1
9 1 0 0 0 1 0 0 0 1
9 1 0 0 0 1 0 0 0 1
9 1 0 0 0 1 0 0 0 1
9 1 0 0 0 1 0 0 0 1
9 1 0 0 0 1 0 0 0 1
9 1 0 0 0 1 0 0 0 1
9 1 0 0 0 1 0 0 0 1
9 1 0 0 0 1 0 0 0 1
9 1 0 0 0 1 0 0 0 1
9 1 0 0 0 1 0 0 0 1
9 1 0 0 0 1 0 0 0 1
9 1 0 0 0 1 0 0 0 1
9 1 0 0 0 1 0 0 0 1
9 1 0 0 0 1 0 0 0 1
9 1 0 0 0 1 0 0 0 1
9 1 0 0 0 1 0 0 0 1
9 1 0 0 0 1 0 0 0 1
9 1 0 0 0 1 0 0 0 1
9 1 0 0 0 1 0 0 0 1
9 1 0 0 0 1 0 0 0 1
9 1 0 0 0 1 0 0 0 1
9 1 0 0 0 1 0 0 0 1
9 1 0 0 0 1 0 0 0 1
9 1 0 0 0 1 0 0 0 1
9 1 0 0 0 1 0 0 0 1
9 1 0 0 0 1 0 0 0 1
9 1 0 0 0 1 0 0 0 1
9 1 0 0 0 1 0 0 0 1
9 1 0 0 0 1 0 0 0 1
9 1 0 0 0 1 0 0 0 1
9 1 0 0 0 1 0 0 0 1
9 1 0 0 0 1 0 0 0 1
9 1 0 0 0 1 0 0 0 1
9 1 0 0 0 1 0 0 0 1
9 1 0 0 0 1 0 0 0 1
9 1 0 0 0 1 0 0 0 1
9 1 0 0 0 1 0 0 0 1
9 1 0 0 0 1 0 0 0 1
9 1 0 0 0 1 0 0 0 1
9 1 0 0 0 1 0 0 0 1
9 1 0 0 0 1 0 0 0 1
9 1 0 0 0 1 0 0 0 1
9 1 0 0 0 1 0 0 0 1
9 1 0 0 0 1 0 0 0 1
9 1 0 0 0 1 0 0 0 1
9 1 0 0 0 1 0 0 0 1
9 1 0 0 0 1 0 0 0 1
9 1 0 0 0 1 0 0 0 1
9 1 0 0 0 1 0 0 0 1
9 1 0 0 0 1 0 0 0 1
9 1 0 0 0 1 0 0 0 1
9 1 0 0 0 1 0 0 0 1
9 1 0 0 0 1 0 0 0 1
9 1 0 0 0 1 0 0 0 1
9 1 0 0 0 1 0 0 0 1
9 1 0 0 0 1 0 0 0 1
9 1 0 0 0 1 0 0 0 1
9 1 0 0 0 1 0 0 0 1
9 1 0 0 0 1 0 0 0 1
9 1 0 0 0 1 0 0 0 1
9 1 0 0 0 1 0 0 0 1
9 1 0 0 0 1 0 0 0 1
9 1 0 0 0 1 0 0 0 1
9 1 0 0 0 1 0 0 0 1
9 1 0 0 0 1 0 0 0 1
9 1 0 0 0 1 0 0 0 1
9 1 0 0 0 1 0 0 0 1
9 1 0 0 0 1 0 0 0 1
9 1 0 0 0 1 0 0 0 1
9 1 0 0 0 1 0 0 0 1
9 1 0 0 0 1 0 0 0 1
9 1 0 0 0 1 0 0 0 1
9 1 0 0 0 1 0 0 0 1
9 1 0 0 0 1 0 0 0 1
9 1 0 0 0 1 0 0 0 1
9 1 0 0 0 1 0 0 0 1
9 1 0 0 0 1 0 0 0 1
9 1 0 0 0 1 0 0 0 1
9 1 0 0 0 1 0 0 0 1
9 1 0 0 0 1 0 0 0 1
9 1 0 0 0 1 0 0 0 1
9 1 0 0 0 1 0 0 0 1
9 1 0 0 0 1 0 0 0 1
9 1 0 0 0 1 0 0 0 1
9 1 0 0 0 1 0 0 0 1
9 1 0 0 0 1 0 0 0 1
9 1 0 0 0 1 0 0 0 1
9 1 0 0 0 1 0 0 0 1
9 1 0 0 0 1 0 0 0 1
9 1 0 0 0 1 0 0 0 1
9 1 0 0 0 1 0 0 0 1
9 1 0 0 0 1 0 0 0 1
9 1 0 0 0 1 0 0 0 1
9 1 0 0 0 1 0 0 0 1
9 1 0 0 0 1 0 0 0 1
9 1 0 0 0 1 0 0 0 1
9 1 0 0 0 1 0 0 0 1
9 1 0 0 0 1 0 0 0 1
9 1 0 0 0 1 0 0 0 1
9 1 0 0 0 1 0 0 0 1
9 1 0 0 0 1 0 0 0 1
9 1 0 0 0 1 0 0 0 1
9 1 0 0 0 1 0 0 0 1
9 1 0 0 0 1 0 0 0 1
9 1 0 0 0 1 0 0 0 1
9 1 0 0 0 1 0 0 0 1
9 1 0 0 0 1 0 0 0 1
9 1 0 0 0 1 0 0 0 1
9 1 0 0 0 1 0 0 0 1
9 1 0 0 0 1 0 0 0 1
9 1 0 0 0 1 0 0 0 1
9 1 0 0 0 1 0 0 0 1
9 1 0 0 0 1 0 0 0 1
9 1 0 0 0 1 0 0 0 1
9 1 0 0 0 1 0 0 0 1
9 1 0 0 0 1 0 0 0 1
9 1 0 0 0 1 0 0 0 1
9 1 0 0 0 1 0 0 0 1
9 1 0 0 0 1 0 0 0 1
9 1 0 0 0 1 0 0 0 1
9 1 0 0 0 1 0 0 0 1
9 1 0 0 0 1 0 0 0 1
9 1 0 0 0 1 0 0 0 1
9 1 0 0 0 1 0 0 0 1
9 1 0 0 0 1 0 0 0 1
9 1 0 0 0 1 0 0 0 1
9 1 0 0 0 1 0 0 0 1
9 1 0 0 0 1 0 0 0 1
9 1 0 0 0 1 0 0 0 1
9 1 0 0 0 1 0 0 0 1
9 1 0 0 0 1 0 0 0 1
9 1 0 0 0 1 0 0 0 1
9 1 0 0 0 1 0 0 0 1
9 1 0 0 0 1 0 0 0 1
9 1 0 0 0 1 0 0 0 1
9 1 0 0 0 1 0 0 0 1
9 1 0 0 0 1 0 0 0 1
9 1 0 0 0 1 0 0 0 1
9 1 0 0 0 1 0 0 0 1
9 1 0 0 0 1 0 0 0 1
9 1 0 0 0 1 0 0 0 1
