POINTS:
0.0000 0.0000 0.0000
0.0000 0.0000 1.0000
0.0000 1.0000 0.0000
0.0000 1.0000 1.0000
1.0000 0.0000 0.0000
1.0000 0.0000 1.0000
1.0000 1.0000 0.0000
1.0000 1.0000 1.0000
CELLS:
4 0000  0 2 6 3
4 0000  0 6 4 5
4 0000  0 3 1 5
4 0000  6 7 3 5
4 0000  0 6 5 3
FACES:
3 100 0 2 3
3 100 0 3 1
3 101 0 1 5
3 101 0 5 4
3 102 6 2 0
3 102 6 0 4
VDATA:
12 1.0 0.0 0.0 0.0 1.0 0.0 0.0 0.0 1.0 0.05 0.01 0.05
12 1.0 0.0 0.0 0.0 1.0 0.0 0.0 0.0 1.0 0.05 0.01 0.05
12 1.0 0.0 0.0 0.0 1.0 0.0 0.0 0.0 1.0 0.05 0.01 0.05
12 1.0 0.0 0.0 0.0 1.0 0.0 0.0 0.0 1.0 0.05 0.01 0.05
12 1.0 0.0 0.0 0.0 1.0 0.0 0.0 0.0 1.0 0.05 0.01 0.05
12 1.0 0.0 0.0 0.0 1.0 0.0 0.0 0.0 1.0 0.05 0.01 0.05
12 1.0 0.0 0.0 0.0 1.0 0.0 0.0 0.0 1.0 0.05 0.01 0.05
12 1.0 0.0 0.0 0.0 1.0 0.0 0.0 0.0 1.0 0.05 0.01 0.05
