HEADER:
Checked=true
WithData=true
Cellformat=Vtu
POINTS:
0 0 0
0 0 0.5
0 0 1
0 0 1.5
0 0 2
0 0 2.5
0 0 3
0 0.5 0
0 0.5 0.5
0 0.5 1
0 0.5 1.5
0 0.5 2
0 0.5 2.5
0 0.5 3
0 1 0
0 1 0.5
0 1 1
0 1 1.5
0 1 2
0 1 2.5
0 1 3
0 1.5 0
0 1.5 0.5
0 1.5 1
0 1.5 1.5
0 1.5 2
0 1.5 2.5
0 1.5 3
0 2 0
0 2 0.5
0 2 1
0 2 1.5
0 2 2
0 2 2.5
0 2 3
0 2.5 0
0 2.5 0.5
0 2.5 1
0 2.5 1.5
0 2.5 2
0 2.5 2.5
0 2.5 3
0 3 0
0 3 0.5
0 3 1
0 3 1.5
0 3 2
0 3 2.5
0 3 3
0 3.5 0
0 3.5 0.5
0 3.5 1
0 3.5 1.5
0 3.5 2
0 3.5 2.5
0 3.5 3
0 4 0
0 4 0.5
0 4 1
0 4 1.5
0 4 2
0 4 2.5
0 4 3
0 4.5 0
0 4.5 0.5
0 4.5 1
0 4.5 1.5
0 4.5 2
0 4.5 2.5
0 4.5 3
0 5 0
0 5 0.5
0 5 1
0 5 1.5
0 5 2
0 5 2.5
0 5 3
0 5.5 0
0 5.5 0.5
0 5.5 1
0 5.5 1.5
0 5.5 2
0 5.5 2.5
0 5.5 3
0 6 0
0 6 0.5
0 6 1
0 6 1.5
0 6 2
0 6 2.5
0 6 3
0.5 0 0
0.5 0 0.5
0.5 0 1
0.5 0 1.5
0.5 0 2
0.5 0 2.5
0.5 0 3
0.5 0.5 0
0.5 0.5 0.5
0.5 0.5 1
0.5 0.5 1.5
0.5 0.5 2
0.5 0.5 2.5
0.5 0.5 3
0.5 1 0
0.5 1 0.5
0.5 1 1
0.5 1 1.5
0.5 1 2
0.5 1 2.5
0.5 1 3
0.5 1.5 0
0.5 1.5 0.5
0.5 1.5 1
0.5 1.5 1.5
0.5 1.5 2
0.5 1.5 2.5
0.5 1.5 3
0.5 2 0
0.5 2 0.5
0.5 2 1
0.5 2 1.5
0.5 2 2
0.5 2 2.5
0.5 2 3
0.5 2.5 0
0.5 2.5 0.5
0.5 2.5 1
0.5 2.5 1.5
0.5 2.5 2
0.5 2.5 2.5
0.5 2.5 3
0.5 3 0
0.5 3 0.5
0.5 3 1
0.5 3 1.5
0.5 3 2
0.5 3 2.5
0.5 3 3
0.5 3.5 0
0.5 3.5 0.5
0.5 3.5 1
0.5 3.5 1.5
0.5 3.5 2
0.5 3.5 2.5
0.5 3.5 3
0.5 4 0
0.5 4 0.5
0.5 4 1
0.5 4 1.5
0.5 4 2
0.5 4 2.5
0.5 4 3
0.5 4.5 0
0.5 4.5 0.5
0.5 4.5 1
0.5 4.5 1.5
0.5 4.5 2
0.5 4.5 2.5
0.5 4.5 3
0.5 5 0
0.5 5 0.5
0.5 5 1
0.5 5 1.5
0.5 5 2
0.5 5 2.5
0.5 5 3
0.5 5.5 0
0.5 5.5 0.5
0.5 5.5 1
0.5 5.5 1.5
0.5 5.5 2
0.5 5.5 2.5
0.5 5.5 3
0.5 6 0
0.5 6 0.5
0.5 6 1
0.5 6 1.5
0.5 6 2
0.5 6 2.5
0.5 6 3
1 0 0
1 0 0.5
1 0 1
1 0 1.5
1 0 2
1 0 2.5
1 0 3
1 0.5 0
1 0.5 0.5
1 0.5 1
1 0.5 1.5
1 0.5 2
1 0.5 2.5
1 0.5 3
1 1 0
1 1 0.5
1 1 1
1 1 1.5
1 1 2
1 1 2.5
1 1 3
1 1.5 0
1 1.5 0.5
1 1.5 1
1 1.5 1.5
1 1.5 2
1 1.5 2.5
1 1.5 3
1 2 0
1 2 0.5
1 2 1
1 2 1.5
1 2 2
1 2 2.5
1 2 3
1 2.5 0
1 2.5 0.5
1 2.5 1
1 2.5 1.5
1 2.5 2
1 2.5 2.5
1 2.5 3
1 3 0
1 3 0.5
1 3 1
1 3 1.5
1 3 2
1 3 2.5
1 3 3
1 3.5 0
1 3.5 0.5
1 3.5 1
1 3.5 1.5
1 3.5 2
1 3.5 2.5
1 3.5 3
1 4 0
1 4 0.5
1 4 1
1 4 1.5
1 4 2
1 4 2.5
1 4 3
1 4.5 0
1 4.5 0.5
1 4.5 1
1 4.5 1.5
1 4.5 2
1 4.5 2.5
1 4.5 3
1 5 0
1 5 0.5
1 5 1
1 5 1.5
1 5 2
1 5 2.5
1 5 3
1 5.5 0
1 5.5 0.5
1 5.5 1
1 5.5 1.5
1 5.5 2
1 5.5 2.5
1 5.5 3
1 6 0
1 6 0.5
1 6 1
1 6 1.5
1 6 2
1 6 2.5
1 6 3
1.5 0 0
1.5 0 0.5
1.5 0 1
1.5 0 1.5
1.5 0 2
1.5 0 2.5
1.5 0 3
1.5 0.5 0
1.5 0.5 0.5
1.5 0.5 1
1.5 0.5 1.5
1.5 0.5 2
1.5 0.5 2.5
1.5 0.5 3
1.5 1 0
1.5 1 0.5
1.5 1 1
1.5 1 1.5
1.5 1 2
1.5 1 2.5
1.5 1 3
1.5 1.5 0
1.5 1.5 0.5
1.5 1.5 1
1.5 1.5 2
1.5 1.5 2.5
1.5 1.5 3
1.5 2 0
1.5 2 0.5
1.5 2 1
1.5 2 1.5
1.5 2 2
1.5 2 2.5
1.5 2 3
1.5 2.5 0
1.5 2.5 0.5
1.5 2.5 1
1.5 2.5 1.5
1.5 2.5 2
1.5 2.5 2.5
1.5 2.5 3
1.5 3 0
1.5 3 0.5
1.5 3 1
1.5 3 1.5
1.5 3 2
1.5 3 2.5
1.5 3 3
1.5 3.5 0
1.5 3.5 0.5
1.5 3.5 1
1.5 3.5 1.5
1.5 3.5 2
1.5 3.5 2.5
1.5 3.5 3
1.5 4 0
1.5 4 0.5
1.5 4 1
1.5 4 1.5
1.5 4 2
1.5 4 2.5
1.5 4 3
1.5 4.5 0
1.5 4.5 0.5
1.5 4.5 1
1.5 4.5 2
1.5 4.5 2.5
1.5 4.5 3
1.5 5 0
1.5 5 0.5
1.5 5 1
1.5 5 1.5
1.5 5 2
1.5 5 2.5
1.5 5 3
1.5 5.5 0
1.5 5.5 0.5
1.5 5.5 1
1.5 5.5 1.5
1.5 5.5 2
1.5 5.5 2.5
1.5 5.5 3
1.5 6 0
1.5 6 0.5
1.5 6 1
1.5 6 1.5
1.5 6 2
1.5 6 2.5
1.5 6 3
2 0 0
2 0 0.5
2 0 1
2 0 1.5
2 0 2
2 0 2.5
2 0 3
2 0.5 0
2 0.5 0.5
2 0.5 1
2 0.5 1.5
2 0.5 2
2 0.5 2.5
2 0.5 3
2 1 0
2 1 0.5
2 1 1
2 1 1.5
2 1 2
2 1 2.5
2 1 3
2 1.5 0
2 1.5 0.5
2 1.5 1
2 1.5 1.5
2 1.5 2
2 1.5 2.5
2 1.5 3
2 2 0
2 2 0.5
2 2 1
2 2 1.5
2 2 2
2 2 2.5
2 2 3
2 2.5 0
2 2.5 0.5
2 2.5 1
2 2.5 1.5
2 2.5 2
2 2.5 2.5
2 2.5 3
2 3 0
2 3 0.5
2 3 1
2 3 1.5
2 3 2
2 3 2.5
2 3 3
2 3.5 0
2 3.5 0.5
2 3.5 1
2 3.5 1.5
2 3.5 2
2 3.5 2.5
2 3.5 3
2 4 0
2 4 0.5
2 4 1
2 4 1.5
2 4 2
2 4 2.5
2 4 3
2 4.5 0
2 4.5 0.5
2 4.5 1
2 4.5 1.5
2 4.5 2
2 4.5 2.5
2 4.5 3
2 5 0
2 5 0.5
2 5 1
2 5 1.5
2 5 2
2 5 2.5
2 5 3
2 5.5 0
2 5.5 0.5
2 5.5 1
2 5.5 1.5
2 5.5 2
2 5.5 2.5
2 5.5 3
2 6 0
2 6 0.5
2 6 1
2 6 1.5
2 6 2
2 6 2.5
2 6 3
2.5 0 0
2.5 0 0.5
2.5 0 1
2.5 0 1.5
2.5 0 2
2.5 0 2.5
2.5 0 3
2.5 0.5 0
2.5 0.5 0.5
2.5 0.5 1
2.5 0.5 1.5
2.5 0.5 2
2.5 0.5 2.5
2.5 0.5 3
2.5 1 0
2.5 1 0.5
2.5 1 1
2.5 1 1.5
2.5 1 2
2.5 1 2.5
2.5 1 3
2.5 1.5 0
2.5 1.5 0.5
2.5 1.5 1
2.5 1.5 1.5
2.5 1.5 2
2.5 1.5 2.5
2.5 1.5 3
2.5 2 0
2.5 2 0.5
2.5 2 1
2.5 2 1.5
2.5 2 2
2.5 2 2.5
2.5 2 3
2.5 2.5 0
2.5 2.5 0.5
2.5 2.5 1
2.5 2.5 1.5
2.5 2.5 2
2.5 2.5 2.5
2.5 2.5 3
2.5 3 0
2.5 3 0.5
2.5 3 1
2.5 3 1.5
2.5 3 2
2.5 3 2.5
2.5 3 3
2.5 3.5 0
2.5 3.5 0.5
2.5 3.5 1
2.5 3.5 1.5
2.5 3.5 2
2.5 3.5 2.5
2.5 3.5 3
2.5 4 0
2.5 4 0.5
2.5 4 1
2.5 4 1.5
2.5 4 2
2.5 4 2.5
2.5 4 3
2.5 4.5 0
2.5 4.5 0.5
2.5 4.5 1
2.5 4.5 1.5
2.5 4.5 2
2.5 4.5 2.5
2.5 4.5 3
2.5 5 0
2.5 5 0.5
2.5 5 1
2.5 5 1.5
2.5 5 2
2.5 5 2.5
2.5 5 3
2.5 5.5 0
2.5 5.5 0.5
2.5 5.5 1
2.5 5.5 1.5
2.5 5.5 2
2.5 5.5 2.5
2.5 5.5 3
2.5 6 0
2.5 6 0.5
2.5 6 1
2.5 6 1.5
2.5 6 2
2.5 6 2.5
2.5 6 3
3 0 0
3 0 0.5
3 0 1
3 0 1.5
3 0 2
3 0 2.5
3 0 3
3 0.5 0
3 0.5 0.5
3 0.5 1
3 0.5 1.5
3 0.5 2
3 0.5 2.5
3 0.5 3
3 1 0
3 1 0.5
3 1 1
3 1 1.5
3 1 2
3 1 2.5
3 1 3
3 1.5 0
3 1.5 0.5
3 1.5 1
3 1.5 1.5
3 1.5 2
3 1.5 2.5
3 1.5 3
3 2 0
3 2 0.5
3 2 1
3 2 1.5
3 2 2
3 2 2.5
3 2 3
3 2.5 0
3 2.5 0.5
3 2.5 1
3 2.5 1.5
3 2.5 2
3 2.5 2.5
3 2.5 3
3 3 0
3 3 0.5
3 3 1
3 3 1.5
3 3 2
3 3 2.5
3 3 3
3 3.5 0
3 3.5 0.5
3 3.5 1
3 3.5 1.5
3 3.5 2
3 3.5 2.5
3 3.5 3
3 4 0
3 4 0.5
3 4 1
3 4 1.5
3 4 2
3 4 2.5
3 4 3
3 4.5 0
3 4.5 0.5
3 4.5 1
3 4.5 1.5
3 4.5 2
3 4.5 2.5
3 4.5 3
3 5 0
3 5 0.5
3 5 1
3 5 1.5
3 5 2
3 5 2.5
3 5 3
3 5.5 0
3 5.5 0.5
3 5.5 1
3 5.5 1.5
3 5.5 2
3 5.5 2.5
3 5.5 3
3 6 0
3 6 0.5
3 6 1
3 6 1.5
3 6 2
3 6 2.5
3 6 3
3.5 0 0
3.5 0 0.5
3.5 0 1
3.5 0 1.5
3.5 0 2
3.5 0 2.5
3.5 0 3
3.5 0.5 0
3.5 0.5 0.5
3.5 0.5 1
3.5 0.5 1.5
3.5 0.5 2
3.5 0.5 2.5
3.5 0.5 3
3.5 1 0
3.5 1 0.5
3.5 1 1
3.5 1 1.5
3.5 1 2
3.5 1 2.5
3.5 1 3
3.5 1.5 0
3.5 1.5 0.5
3.5 1.5 1
3.5 1.5 1.5
3.5 1.5 2
3.5 1.5 2.5
3.5 1.5 3
3.5 2 0
3.5 2 0.5
3.5 2 1
3.5 2 1.5
3.5 2 2
3.5 2 2.5
3.5 2 3
3.5 2.5 0
3.5 2.5 0.5
3.5 2.5 1
3.5 2.5 1.5
3.5 2.5 2
3.5 2.5 2.5
3.5 2.5 3
3.5 3 0
3.5 3 0.5
3.5 3 1
3.5 3 1.5
3.5 3 2
3.5 3 2.5
3.5 3 3
3.5 3.5 0
3.5 3.5 0.5
3.5 3.5 1
3.5 3.5 1.5
3.5 3.5 2
3.5 3.5 2.5
3.5 3.5 3
3.5 4 0
3.5 4 0.5
3.5 4 1
3.5 4 1.5
3.5 4 2
3.5 4 2.5
3.5 4 3
3.5 4.5 0
3.5 4.5 0.5
3.5 4.5 1
3.5 4.5 1.5
3.5 4.5 2
3.5 4.5 2.5
3.5 4.5 3
3.5 5 0
3.5 5 0.5
3.5 5 1
3.5 5 1.5
3.5 5 2
3.5 5 2.5
3.5 5 3
3.5 5.5 0
3.5 5.5 0.5
3.5 5.5 1
3.5 5.5 1.5
3.5 5.5 2
3.5 5.5 2.5
3.5 5.5 3
3.5 6 0
3.5 6 0.5
3.5 6 1
3.5 6 1.5
3.5 6 2
3.5 6 2.5
3.5 6 3
4 0 0
4 0 0.5
4 0 1
4 0 1.5
4 0 2
4 0 2.5
4 0 3
4 0.5 0
4 0.5 0.5
4 0.5 1
4 0.5 1.5
4 0.5 2
4 0.5 2.5
4 0.5 3
4 1 0
4 1 0.5
4 1 1
4 1 1.5
4 1 2
4 1 2.5
4 1 3
4 1.5 0
4 1.5 0.5
4 1.5 1
4 1.5 1.5
4 1.5 2
4 1.5 2.5
4 1.5 3
4 2 0
4 2 0.5
4 2 1
4 2 1.5
4 2 2
4 2 2.5
4 2 3
4 2.5 0
4 2.5 0.5
4 2.5 1
4 2.5 1.5
4 2.5 2
4 2.5 2.5
4 2.5 3
4 3 0
4 3 0.5
4 3 1
4 3 1.5
4 3 2
4 3 2.5
4 3 3
4 3.5 0
4 3.5 0.5
4 3.5 1
4 3.5 1.5
4 3.5 2
4 3.5 2.5
4 3.5 3
4 4 0
4 4 0.5
4 4 1
4 4 1.5
4 4 2
4 4 2.5
4 4 3
4 4.5 0
4 4.5 0.5
4 4.5 1
4 4.5 1.5
4 4.5 2
4 4.5 2.5
4 4.5 3
4 5 0
4 5 0.5
4 5 1
4 5 1.5
4 5 2
4 5 2.5
4 5 3
4 5.5 0
4 5.5 0.5
4 5.5 1
4 5.5 1.5
4 5.5 2
4 5.5 2.5
4 5.5 3
4 6 0
4 6 0.5
4 6 1
4 6 1.5
4 6 2
4 6 2.5
4 6 3
4.5 0 0
4.5 0 0.5
4.5 0 1
4.5 0 1.5
4.5 0 2
4.5 0 2.5
4.5 0 3
4.5 0.5 0
4.5 0.5 0.5
4.5 0.5 1
4.5 0.5 1.5
4.5 0.5 2
4.5 0.5 2.5
4.5 0.5 3
4.5 1 0
4.5 1 0.5
4.5 1 1
4.5 1 1.5
4.5 1 2
4.5 1 2.5
4.5 1 3
4.5 1.5 0
4.5 1.5 0.5
4.5 1.5 1
4.5 1.5 2
4.5 1.5 2.5
4.5 1.5 3
4.5 2 0
4.5 2 0.5
4.5 2 1
4.5 2 1.5
4.5 2 2
4.5 2 2.5
4.5 2 3
4.5 2.5 0
4.5 2.5 0.5
4.5 2.5 1
4.5 2.5 1.5
4.5 2.5 2
4.5 2.5 2.5
4.5 2.5 3
4.5 3 0
4.5 3 0.5
4.5 3 1
4.5 3 1.5
4.5 3 2
4.5 3 2.5
4.5 3 3
4.5 3.5 0
4.5 3.5 0.5
4.5 3.5 1
4.5 3.5 1.5
4.5 3.5 2
4.5 3.5 2.5
4.5 3.5 3
4.5 4 0
4.5 4 0.5
4.5 4 1
4.5 4 1.5
4.5 4 2
4.5 4 2.5
4.5 4 3
4.5 4.5 0
4.5 4.5 0.5
4.5 4.5 1
4.5 4.5 2
4.5 4.5 2.5
4.5 4.5 3
4.5 5 0
4.5 5 0.5
4.5 5 1
4.5 5 1.5
4.5 5 2
4.5 5 2.5
4.5 5 3
4.5 5.5 0
4.5 5.5 0.5
4.5 5.5 1
4.5 5.5 1.5
4.5 5.5 2
4.5 5.5 2.5
4.5 5.5 3
4.5 6 0
4.5 6 0.5
4.5 6 1
4.5 6 1.5
4.5 6 2
4.5 6 2.5
4.5 6 3
5 0 0
5 0 0.5
5 0 1
5 0 1.5
5 0 2
5 0 2.5
5 0 3
5 0.5 0
5 0.5 0.5
5 0.5 1
5 0.5 1.5
5 0.5 2
5 0.5 2.5
5 0.5 3
5 1 0
5 1 0.5
5 1 1
5 1 1.5
5 1 2
5 1 2.5
5 1 3
5 1.5 0
5 1.5 0.5
5 1.5 1
5 1.5 1.5
5 1.5 2
5 1.5 2.5
5 1.5 3
5 2 0
5 2 0.5
5 2 1
5 2 1.5
5 2 2
5 2 2.5
5 2 3
5 2.5 0
5 2.5 0.5
5 2.5 1
5 2.5 1.5
5 2.5 2
5 2.5 2.5
5 2.5 3
5 3 0
5 3 0.5
5 3 1
5 3 1.5
5 3 2
5 3 2.5
5 3 3
5 3.5 0
5 3.5 0.5
5 3.5 1
5 3.5 1.5
5 3.5 2
5 3.5 2.5
5 3.5 3
5 4 0
5 4 0.5
5 4 1
5 4 1.5
5 4 2
5 4 2.5
5 4 3
5 4.5 0
5 4.5 0.5
5 4.5 1
5 4.5 1.5
5 4.5 2
5 4.5 2.5
5 4.5 3
5 5 0
5 5 0.5
5 5 1
5 5 1.5
5 5 2
5 5 2.5
5 5 3
5 5.5 0
5 5.5 0.5
5 5.5 1
5 5.5 1.5
5 5.5 2
5 5.5 2.5
5 5.5 3
5 6 0
5 6 0.5
5 6 1
5 6 1.5
5 6 2
5 6 2.5
5 6 3
5.5 0 0
5.5 0 0.5
5.5 0 1
5.5 0 1.5
5.5 0 2
5.5 0 2.5
5.5 0 3
5.5 0.5 0
5.5 0.5 0.5
5.5 0.5 1
5.5 0.5 1.5
5.5 0.5 2
5.5 0.5 2.5
5.5 0.5 3
5.5 1 0
5.5 1 0.5
5.5 1 1
5.5 1 1.5
5.5 1 2
5.5 1 2.5
5.5 1 3
5.5 1.5 0
5.5 1.5 0.5
5.5 1.5 1
5.5 1.5 1.5
5.5 1.5 2
5.5 1.5 2.5
5.5 1.5 3
5.5 2 0
5.5 2 0.5
5.5 2 1
5.5 2 1.5
5.5 2 2
5.5 2 2.5
5.5 2 3
5.5 2.5 0
5.5 2.5 0.5
5.5 2.5 1
5.5 2.5 1.5
5.5 2.5 2
5.5 2.5 2.5
5.5 2.5 3
5.5 3 0
5.5 3 0.5
5.5 3 1
5.5 3 1.5
5.5 3 2
5.5 3 2.5
5.5 3 3
5.5 3.5 0
5.5 3.5 0.5
5.5 3.5 1
5.5 3.5 1.5
5.5 3.5 2
5.5 3.5 2.5
5.5 3.5 3
5.5 4 0
5.5 4 0.5
5.5 4 1
5.5 4 1.5
5.5 4 2
5.5 4 2.5
5.5 4 3
5.5 4.5 0
5.5 4.5 0.5
5.5 4.5 1
5.5 4.5 1.5
5.5 4.5 2
5.5 4.5 2.5
5.5 4.5 3
5.5 5 0
5.5 5 0.5
5.5 5 1
5.5 5 1.5
5.5 5 2
5.5 5 2.5
5.5 5 3
5.5 5.5 0
5.5 5.5 0.5
5.5 5.5 1
5.5 5.5 1.5
5.5 5.5 2
5.5 5.5 2.5
5.5 5.5 3
5.5 6 0
5.5 6 0.5
5.5 6 1
5.5 6 1.5
5.5 6 2
5.5 6 2.5
5.5 6 3
6 0 0
6 0 0.5
6 0 1
6 0 1.5
6 0 2
6 0 2.5
6 0 3
6 0.5 0
6 0.5 0.5
6 0.5 1
6 0.5 1.5
6 0.5 2
6 0.5 2.5
6 0.5 3
6 1 0
6 1 0.5
6 1 1
6 1 1.5
6 1 2
6 1 2.5
6 1 3
6 1.5 0
6 1.5 0.5
6 1.5 1
6 1.5 1.5
6 1.5 2
6 1.5 2.5
6 1.5 3
6 2 0
6 2 0.5
6 2 1
6 2 1.5
6 2 2
6 2 2.5
6 2 3
6 2.5 0
6 2.5 0.5
6 2.5 1
6 2.5 1.5
6 2.5 2
6 2.5 2.5
6 2.5 3
6 3 0
6 3 0.5
6 3 1
6 3 1.5
6 3 2
6 3 2.5
6 3 3
6 3.5 0
6 3.5 0.5
6 3.5 1
6 3.5 1.5
6 3.5 2
6 3.5 2.5
6 3.5 3
6 4 0
6 4 0.5
6 4 1
6 4 1.5
6 4 2
6 4 2.5
6 4 3
6 4.5 0
6 4.5 0.5
6 4.5 1
6 4.5 1.5
6 4.5 2
6 4.5 2.5
6 4.5 3
6 5 0
6 5 0.5
6 5 1
6 5 1.5
6 5 2
6 5 2.5
6 5 3
6 5.5 0
6 5.5 0.5
6 5.5 1
6 5.5 1.5
6 5.5 2
6 5.5 2.5
6 5.5 3
6 6 0
6 6 0.5
6 6 1
6 6 1.5
6 6 2
6 6 2.5
6 6 3
CELLS:
12 0 91 98 7 0 92 99 8 1 
12 0 92 99 8 1 93 100 9 2 
12 0 93 100 9 2 94 101 10 3 
12 0 94 101 10 3 95 102 11 4 
12 0 95 102 11 4 96 103 12 5 
12 0 96 103 12 5 97 104 13 6 
12 0 98 105 14 7 99 106 15 8 
12 0 99 106 15 8 100 107 16 9 
12 0 100 107 16 9 101 108 17 10 
12 0 101 108 17 10 102 109 18 11 
12 0 102 109 18 11 103 110 19 12 
12 0 103 110 19 12 104 111 20 13 
12 0 105 112 21 14 106 113 22 15 
12 0 106 113 22 15 107 114 23 16 
12 0 107 114 23 16 108 115 24 17 
12 0 108 115 24 17 109 116 25 18 
12 0 109 116 25 18 110 117 26 19 
12 0 110 117 26 19 111 118 27 20 
12 0 112 119 28 21 113 120 29 22 
12 0 113 120 29 22 114 121 30 23 
12 0 114 121 30 23 115 122 31 24 
12 0 115 122 31 24 116 123 32 25 
12 0 116 123 32 25 117 124 33 26 
12 0 117 124 33 26 118 125 34 27 
12 0 119 126 35 28 120 127 36 29 
12 0 120 127 36 29 121 128 37 30 
12 0 121 128 37 30 122 129 38 31 
12 0 122 129 38 31 123 130 39 32 
12 0 123 130 39 32 124 131 40 33 
12 0 124 131 40 33 125 132 41 34 
12 0 126 133 42 35 127 134 43 36 
12 0 127 134 43 36 128 135 44 37 
12 0 128 135 44 37 129 136 45 38 
12 0 129 136 45 38 130 137 46 39 
12 0 130 137 46 39 131 138 47 40 
12 0 131 138 47 40 132 139 48 41 
12 0 133 140 49 42 134 141 50 43 
12 0 134 141 50 43 135 142 51 44 
12 0 135 142 51 44 136 143 52 45 
12 0 136 143 52 45 137 144 53 46 
12 0 137 144 53 46 138 145 54 47 
12 0 138 145 54 47 139 146 55 48 
12 0 140 147 56 49 141 148 57 50 
12 0 141 148 57 50 142 149 58 51 
12 0 142 149 58 51 143 150 59 52 
12 0 143 150 59 52 144 151 60 53 
12 0 144 151 60 53 145 152 61 54 
12 0 145 152 61 54 146 153 62 55 
12 0 147 154 63 56 148 155 64 57 
12 0 148 155 64 57 149 156 65 58 
12 0 149 156 65 58 150 157 66 59 
12 0 150 157 66 59 151 158 67 60 
12 0 151 158 67 60 152 159 68 61 
12 0 152 159 68 61 153 160 69 62 
12 0 154 161 70 63 155 162 71 64 
12 0 155 162 71 64 156 163 72 65 
12 0 156 163 72 65 157 164 73 66 
12 0 157 164 73 66 158 165 74 67 
12 0 158 165 74 67 159 166 75 68 
12 0 159 166 75 68 160 167 76 69 
12 0 161 168 77 70 162 169 78 71 
12 0 162 169 78 71 163 170 79 72 
12 0 163 170 79 72 164 171 80 73 
12 0 164 171 80 73 165 172 81 74 
12 0 165 172 81 74 166 173 82 75 
12 0 166 173 82 75 167 174 83 76 
12 0 168 175 84 77 169 176 85 78 
12 0 169 176 85 78 170 177 86 79 
12 0 170 177 86 79 171 178 87 80 
12 0 171 178 87 80 172 179 88 81 
12 0 172 179 88 81 173 180 89 82 
12 0 173 180 89 82 174 181 90 83 
12 0 182 189 98 91 183 190 99 92 
12 0 183 190 99 92 184 191 100 93 
12 0 184 191 100 93 185 192 101 94 
12 0 185 192 101 94 186 193 102 95 
12 0 186 193 102 95 187 194 103 96 
12 0 187 194 103 96 188 195 104 97 
12 0 189 196 105 98 190 197 106 99 
12 0 190 197 106 99 191 198 107 100 
12 0 191 198 107 100 192 199 108 101 
12 0 192 199 108 101 193 200 109 102 
12 0 193 200 109 102 194 201 110 103 
12 0 194 201 110 103 195 202 111 104 
12 0 196 203 112 105 197 204 113 106 
12 0 197 204 113 106 198 205 114 107 
12 0 198 205 114 107 199 206 115 108 
12 0 199 206 115 108 200 207 116 109 
12 0 200 207 116 109 201 208 117 110 
12 0 201 208 117 110 202 209 118 111 
12 0 203 210 119 112 204 211 120 113 
12 0 204 211 120 113 205 212 121 114 
12 0 205 212 121 114 206 213 122 115 
12 0 206 213 122 115 207 214 123 116 
12 0 207 214 123 116 208 215 124 117 
12 0 208 215 124 117 209 216 125 118 
12 0 210 217 126 119 211 218 127 120 
12 0 211 218 127 120 212 219 128 121 
12 0 212 219 128 121 213 220 129 122 
12 0 213 220 129 122 214 221 130 123 
12 0 214 221 130 123 215 222 131 124 
12 0 215 222 131 124 216 223 132 125 
12 0 217 224 133 126 218 225 134 127 
12 0 218 225 134 127 219 226 135 128 
12 0 219 226 135 128 220 227 136 129 
12 0 220 227 136 129 221 228 137 130 
12 0 221 228 137 130 222 229 138 131 
12 0 222 229 138 131 223 230 139 132 
12 0 224 231 140 133 225 232 141 134 
12 0 225 232 141 134 226 233 142 135 
12 0 226 233 142 135 227 234 143 136 
12 0 227 234 143 136 228 235 144 137 
12 0 228 235 144 137 229 236 145 138 
12 0 229 236 145 138 230 237 146 139 
12 0 231 238 147 140 232 239 148 141 
12 0 232 239 148 141 233 240 149 142 
12 0 233 240 149 142 234 241 150 143 
12 0 234 241 150 143 235 242 151 144 
12 0 235 242 151 144 236 243 152 145 
12 0 236 243 152 145 237 244 153 146 
12 0 238 245 154 147 239 246 155 148 
12 0 239 246 155 148 240 247 156 149 
12 0 240 247 156 149 241 248 157 150 
12 0 241 248 157 150 242 249 158 151 
12 0 242 249 158 151 243 250 159 152 
12 0 243 250 159 152 244 251 160 153 
12 0 245 252 161 154 246 253 162 155 
12 0 246 253 162 155 247 254 163 156 
12 0 247 254 163 156 248 255 164 157 
12 0 248 255 164 157 249 256 165 158 
12 0 249 256 165 158 250 257 166 159 
12 0 250 257 166 159 251 258 167 160 
12 0 252 259 168 161 253 260 169 162 
12 0 253 260 169 162 254 261 170 163 
12 0 254 261 170 163 255 262 171 164 
12 0 255 262 171 164 256 263 172 165 
12 0 256 263 172 165 257 264 173 166 
12 0 257 264 173 166 258 265 174 167 
12 0 259 266 175 168 260 267 176 169 
12 0 260 267 176 169 261 268 177 170 
12 0 261 268 177 170 262 269 178 171 
12 0 262 269 178 171 263 270 179 172 
12 0 263 270 179 172 264 271 180 173 
12 0 264 271 180 173 265 272 181 174 
12 0 273 280 189 182 274 281 190 183 
12 0 274 281 190 183 275 282 191 184 
12 0 275 282 191 184 276 283 192 185 
12 0 276 283 192 185 277 284 193 186 
12 0 277 284 193 186 278 285 194 187 
12 0 278 285 194 187 279 286 195 188 
12 0 280 287 196 189 281 288 197 190 
12 0 281 288 197 190 282 289 198 191 
12 0 282 289 198 191 283 290 199 192 
12 0 283 290 199 192 284 291 200 193 
12 0 284 291 200 193 285 292 201 194 
12 0 285 292 201 194 286 293 202 195 
12 0 287 294 203 196 288 295 204 197 
12 0 288 295 204 197 289 296 205 198 
12 0 291 297 207 200 292 298 208 201 
12 0 292 298 208 201 293 299 209 202 
12 0 294 300 210 203 295 301 211 204 
12 0 295 301 211 204 296 302 212 205 
12 0 297 304 214 207 298 305 215 208 
12 0 298 305 215 208 299 306 216 209 
12 0 300 307 217 210 301 308 218 211 
12 0 301 308 218 211 302 309 219 212 
12 0 302 309 219 212 303 310 220 213 
12 0 303 310 220 213 304 311 221 214 
12 0 304 311 221 214 305 312 222 215 
12 0 305 312 222 215 306 313 223 216 
12 0 307 314 224 217 308 315 225 218 
12 0 308 315 225 218 309 316 226 219 
12 0 309 316 226 219 310 317 227 220 
12 0 310 317 227 220 311 318 228 221 
12 0 311 318 228 221 312 319 229 222 
12 0 312 319 229 222 313 320 230 223 
12 0 314 321 231 224 315 322 232 225 
12 0 315 322 232 225 316 323 233 226 
12 0 316 323 233 226 317 324 234 227 
12 0 317 324 234 227 318 325 235 228 
12 0 318 325 235 228 319 326 236 229 
12 0 319 326 236 229 320 327 237 230 
12 0 321 328 238 231 322 329 239 232 
12 0 322 329 239 232 323 330 240 233 
12 0 323 330 240 233 324 331 241 234 
12 0 324 331 241 234 325 332 242 235 
12 0 325 332 242 235 326 333 243 236 
12 0 326 333 243 236 327 334 244 237 
12 0 328 335 245 238 329 336 246 239 
12 0 329 336 246 239 330 337 247 240 
12 0 332 338 249 242 333 339 250 243 
12 0 333 339 250 243 334 340 251 244 
12 0 335 341 252 245 336 342 253 246 
12 0 336 342 253 246 337 343 254 247 
12 0 338 345 256 249 339 346 257 250 
12 0 339 346 257 250 340 347 258 251 
12 0 341 348 259 252 342 349 260 253 
12 0 342 349 260 253 343 350 261 254 
12 0 343 350 261 254 344 351 262 255 
12 0 344 351 262 255 345 352 263 256 
12 0 345 352 263 256 346 353 264 257 
12 0 346 353 264 257 347 354 265 258 
12 0 348 355 266 259 349 356 267 260 
12 0 349 356 267 260 350 357 268 261 
12 0 350 357 268 261 351 358 269 262 
12 0 351 358 269 262 352 359 270 263 
12 0 352 359 270 263 353 360 271 264 
12 0 353 360 271 264 354 361 272 265 
12 0 362 369 280 273 363 370 281 274 
12 0 363 370 281 274 364 371 282 275 
12 0 364 371 282 275 365 372 283 276 
12 0 365 372 283 276 366 373 284 277 
12 0 366 373 284 277 367 374 285 278 
12 0 367 374 285 278 368 375 286 279 
12 0 369 376 287 280 370 377 288 281 
12 0 370 377 288 281 371 378 289 282 
12 0 371 378 289 282 372 379 290 283 
12 0 372 379 290 283 373 380 291 284 
12 0 373 380 291 284 374 381 292 285 
12 0 374 381 292 285 375 382 293 286 
12 0 376 383 294 287 377 384 295 288 
12 0 377 384 295 288 378 385 296 289 
12 0 380 387 297 291 381 388 298 292 
12 0 381 388 298 292 382 389 299 293 
12 0 383 390 300 294 384 391 301 295 
12 0 384 391 301 295 385 392 302 296 
12 0 387 394 304 297 388 395 305 298 
12 0 388 395 305 298 389 396 306 299 
12 0 390 397 307 300 391 398 308 301 
12 0 391 398 308 301 392 399 309 302 
12 0 392 399 309 302 393 400 310 303 
12 0 393 400 310 303 394 401 311 304 
12 0 394 401 311 304 395 402 312 305 
12 0 395 402 312 305 396 403 313 306 
12 0 397 404 314 307 398 405 315 308 
12 0 398 405 315 308 399 406 316 309 
12 0 399 406 316 309 400 407 317 310 
12 0 400 407 317 310 401 408 318 311 
12 0 401 408 318 311 402 409 319 312 
12 0 402 409 319 312 403 410 320 313 
12 0 404 411 321 314 405 412 322 315 
12 0 405 412 322 315 406 413 323 316 
12 0 406 413 323 316 407 414 324 317 
12 0 407 414 324 317 408 415 325 318 
12 0 408 415 325 318 409 416 326 319 
12 0 409 416 326 319 410 417 327 320 
12 0 411 418 328 321 412 419 329 322 
12 0 412 419 329 322 413 420 330 323 
12 0 413 420 330 323 414 421 331 324 
12 0 414 421 331 324 415 422 332 325 
12 0 415 422 332 325 416 423 333 326 
12 0 416 423 333 326 417 424 334 327 
12 0 418 425 335 328 419 426 336 329 
12 0 419 426 336 329 420 427 337 330 
12 0 422 429 338 332 423 430 339 333 
12 0 423 430 339 333 424 431 340 334 
12 0 425 432 341 335 426 433 342 336 
12 0 426 433 342 336 427 434 343 337 
12 0 429 436 345 338 430 437 346 339 
12 0 430 437 346 339 431 438 347 340 
12 0 432 439 348 341 433 440 349 342 
12 0 433 440 349 342 434 441 350 343 
12 0 434 441 350 343 435 442 351 344 
12 0 435 442 351 344 436 443 352 345 
12 0 436 443 352 345 437 444 353 346 
12 0 437 444 353 346 438 445 354 347 
12 0 439 446 355 348 440 447 356 349 
12 0 440 447 356 349 441 448 357 350 
12 0 441 448 357 350 442 449 358 351 
12 0 442 449 358 351 443 450 359 352 
12 0 443 450 359 352 444 451 360 353 
12 0 444 451 360 353 445 452 361 354 
12 0 453 460 369 362 454 461 370 363 
12 0 454 461 370 363 455 462 371 364 
12 0 455 462 371 364 456 463 372 365 
12 0 456 463 372 365 457 464 373 366 
12 0 457 464 373 366 458 465 374 367 
12 0 458 465 374 367 459 466 375 368 
12 0 460 467 376 369 461 468 377 370 
12 0 461 468 377 370 462 469 378 371 
12 0 462 469 378 371 463 470 379 372 
12 0 463 470 379 372 464 471 380 373 
12 0 464 471 380 373 465 472 381 374 
12 0 465 472 381 374 466 473 382 375 
12 0 467 474 383 376 468 475 384 377 
12 0 468 475 384 377 469 476 385 378 
12 0 469 476 385 378 470 477 386 379 
12 0 470 477 386 379 471 478 387 380 
12 0 471 478 387 380 472 479 388 381 
12 0 472 479 388 381 473 480 389 382 
12 0 474 481 390 383 475 482 391 384 
12 0 475 482 391 384 476 483 392 385 
12 0 476 483 392 385 477 484 393 386 
12 0 477 484 393 386 478 485 394 387 
12 0 478 485 394 387 479 486 395 388 
12 0 479 486 395 388 480 487 396 389 
12 0 481 488 397 390 482 489 398 391 
12 0 482 489 398 391 483 490 399 392 
12 0 483 490 399 392 484 491 400 393 
12 0 484 491 400 393 485 492 401 394 
12 0 485 492 401 394 486 493 402 395 
12 0 486 493 402 395 487 494 403 396 
12 0 488 495 404 397 489 496 405 398 
12 0 489 496 405 398 490 497 406 399 
12 0 490 497 406 399 491 498 407 400 
12 0 491 498 407 400 492 499 408 401 
12 0 492 499 408 401 493 500 409 402 
12 0 493 500 409 402 494 501 410 403 
12 0 495 502 411 404 496 503 412 405 
12 0 496 503 412 405 497 504 413 406 
12 0 497 504 413 406 498 505 414 407 
12 0 498 505 414 407 499 506 415 408 
12 0 499 506 415 408 500 507 416 409 
12 0 500 507 416 409 501 508 417 410 
12 0 502 509 418 411 503 510 419 412 
12 0 503 510 419 412 504 511 420 413 
12 0 504 511 420 413 505 512 421 414 
12 0 505 512 421 414 506 513 422 415 
12 0 506 513 422 415 507 514 423 416 
12 0 507 514 423 416 508 515 424 417 
12 0 509 516 425 418 510 517 426 419 
12 0 510 517 426 419 511 518 427 420 
12 0 511 518 427 420 512 519 428 421 
12 0 512 519 428 421 513 520 429 422 
12 0 513 520 429 422 514 521 430 423 
12 0 514 521 430 423 515 522 431 424 
12 0 516 523 432 425 517 524 433 426 
12 0 517 524 433 426 518 525 434 427 
12 0 518 525 434 427 519 526 435 428 
12 0 519 526 435 428 520 527 436 429 
12 0 520 527 436 429 521 528 437 430 
12 0 521 528 437 430 522 529 438 431 
12 0 523 530 439 432 524 531 440 433 
12 0 524 531 440 433 525 532 441 434 
12 0 525 532 441 434 526 533 442 435 
12 0 526 533 442 435 527 534 443 436 
12 0 527 534 443 436 528 535 444 437 
12 0 528 535 444 437 529 536 445 438 
12 0 530 537 446 439 531 538 447 440 
12 0 531 538 447 440 532 539 448 441 
12 0 532 539 448 441 533 540 449 442 
12 0 533 540 449 442 534 541 450 443 
12 0 534 541 450 443 535 542 451 444 
12 0 535 542 451 444 536 543 452 445 
12 0 544 551 460 453 545 552 461 454 
12 0 545 552 461 454 546 553 462 455 
12 0 546 553 462 455 547 554 463 456 
12 0 547 554 463 456 548 555 464 457 
12 0 548 555 464 457 549 556 465 458 
12 0 549 556 465 458 550 557 466 459 
12 0 551 558 467 460 552 559 468 461 
12 0 552 559 468 461 553 560 469 462 
12 0 553 560 469 462 554 561 470 463 
12 0 554 561 470 463 555 562 471 464 
12 0 555 562 471 464 556 563 472 465 
12 0 556 563 472 465 557 564 473 466 
12 0 558 565 474 467 559 566 475 468 
12 0 559 566 475 468 560 567 476 469 
12 0 560 567 476 469 561 568 477 470 
12 0 561 568 477 470 562 569 478 471 
12 0 562 569 478 471 563 570 479 472 
12 0 563 570 479 472 564 571 480 473 
12 0 565 572 481 474 566 573 482 475 
12 0 566 573 482 475 567 574 483 476 
12 0 567 574 483 476 568 575 484 477 
12 0 568 575 484 477 569 576 485 478 
12 0 569 576 485 478 570 577 486 479 
12 0 570 577 486 479 571 578 487 480 
12 0 572 579 488 481 573 580 489 482 
12 0 573 580 489 482 574 581 490 483 
12 0 574 581 490 483 575 582 491 484 
12 0 575 582 491 484 576 583 492 485 
12 0 576 583 492 485 577 584 493 486 
12 0 577 584 493 486 578 585 494 487 
12 0 579 586 495 488 580 587 496 489 
12 0 580 587 496 489 581 588 497 490 
12 0 581 588 497 490 582 589 498 491 
12 0 582 589 498 491 583 590 499 492 
12 0 583 590 499 492 584 591 500 493 
12 0 584 591 500 493 585 592 501 494 
12 0 586 593 502 495 587 594 503 496 
12 0 587 594 503 496 588 595 504 497 
12 0 588 595 504 497 589 596 505 498 
12 0 589 596 505 498 590 597 506 499 
12 0 590 597 506 499 591 598 507 500 
12 0 591 598 507 500 592 599 508 501 
12 0 593 600 509 502 594 601 510 503 
12 0 594 601 510 503 595 602 511 504 
12 0 595 602 511 504 596 603 512 505 
12 0 596 603 512 505 597 604 513 506 
12 0 597 604 513 506 598 605 514 507 
12 0 598 605 514 507 599 606 515 508 
12 0 600 607 516 509 601 608 517 510 
12 0 601 608 517 510 602 609 518 511 
12 0 602 609 518 511 603 610 519 512 
12 0 603 610 519 512 604 611 520 513 
12 0 604 611 520 513 605 612 521 514 
12 0 605 612 521 514 606 613 522 515 
12 0 607 614 523 516 608 615 524 517 
12 0 608 615 524 517 609 616 525 518 
12 0 609 616 525 518 610 617 526 519 
12 0 610 617 526 519 611 618 527 520 
12 0 611 618 527 520 612 619 528 521 
12 0 612 619 528 521 613 620 529 522 
12 0 614 621 530 523 615 622 531 524 
12 0 615 622 531 524 616 623 532 525 
12 0 616 623 532 525 617 624 533 526 
12 0 617 624 533 526 618 625 534 527 
12 0 618 625 534 527 619 626 535 528 
12 0 619 626 535 528 620 627 536 529 
12 0 621 628 537 530 622 629 538 531 
12 0 622 629 538 531 623 630 539 532 
12 0 623 630 539 532 624 631 540 533 
12 0 624 631 540 533 625 632 541 534 
12 0 625 632 541 534 626 633 542 535 
12 0 626 633 542 535 627 634 543 536 
12 0 635 642 551 544 636 643 552 545 
12 0 636 643 552 545 637 644 553 546 
12 0 637 644 553 546 638 645 554 547 
12 0 638 645 554 547 639 646 555 548 
12 0 639 646 555 548 640 647 556 549 
12 0 640 647 556 549 641 648 557 550 
12 0 642 649 558 551 643 650 559 552 
12 0 643 650 559 552 644 651 560 553 
12 0 644 651 560 553 645 652 561 554 
12 0 645 652 561 554 646 653 562 555 
12 0 646 653 562 555 647 654 563 556 
12 0 647 654 563 556 648 655 564 557 
12 0 649 656 565 558 650 657 566 559 
12 0 650 657 566 559 651 658 567 560 
12 0 651 658 567 560 652 659 568 561 
12 0 652 659 568 561 653 660 569 562 
12 0 653 660 569 562 654 661 570 563 
12 0 654 661 570 563 655 662 571 564 
12 0 656 663 572 565 657 664 573 566 
12 0 657 664 573 566 658 665 574 567 
12 0 658 665 574 567 659 666 575 568 
12 0 659 666 575 568 660 667 576 569 
12 0 660 667 576 569 661 668 577 570 
12 0 661 668 577 570 662 669 578 571 
12 0 663 670 579 572 664 671 580 573 
12 0 664 671 580 573 665 672 581 574 
12 0 665 672 581 574 666 673 582 575 
12 0 666 673 582 575 667 674 583 576 
12 0 667 674 583 576 668 675 584 577 
12 0 668 675 584 577 669 676 585 578 
12 0 670 677 586 579 671 678 587 580 
12 0 671 678 587 580 672 679 588 581 
12 0 672 679 588 581 673 680 589 582 
12 0 673 680 589 582 674 681 590 583 
12 0 674 681 590 583 675 682 591 584 
12 0 675 682 591 584 676 683 592 585 
12 0 677 684 593 586 678 685 594 587 
12 0 678 685 594 587 679 686 595 588 
12 0 679 686 595 588 680 687 596 589 
12 0 680 687 596 589 681 688 597 590 
12 0 681 688 597 590 682 689 598 591 
12 0 682 689 598 591 683 690 599 592 
12 0 684 691 600 593 685 692 601 594 
12 0 685 692 601 594 686 693 602 595 
12 0 686 693 602 595 687 694 603 596 
12 0 687 694 603 596 688 695 604 597 
12 0 688 695 604 597 689 696 605 598 
12 0 689 696 605 598 690 697 606 599 
12 0 691 698 607 600 692 699 608 601 
12 0 692 699 608 601 693 700 609 602 
12 0 693 700 609 602 694 701 610 603 
12 0 694 701 610 603 695 702 611 604 
12 0 695 702 611 604 696 703 612 605 
12 0 696 703 612 605 697 704 613 606 
12 0 698 705 614 607 699 706 615 608 
12 0 699 706 615 608 700 707 616 609 
12 0 700 707 616 609 701 708 617 610 
12 0 701 708 617 610 702 709 618 611 
12 0 702 709 618 611 703 710 619 612 
12 0 703 710 619 612 704 711 620 613 
12 0 705 712 621 614 706 713 622 615 
12 0 706 713 622 615 707 714 623 616 
12 0 707 714 623 616 708 715 624 617 
12 0 708 715 624 617 709 716 625 618 
12 0 709 716 625 618 710 717 626 619 
12 0 710 717 626 619 711 718 627 620 
12 0 712 719 628 621 713 720 629 622 
12 0 713 720 629 622 714 721 630 623 
12 0 714 721 630 623 715 722 631 624 
12 0 715 722 631 624 716 723 632 625 
12 0 716 723 632 625 717 724 633 626 
12 0 717 724 633 626 718 725 634 627 
12 0 726 733 642 635 727 734 643 636 
12 0 727 734 643 636 728 735 644 637 
12 0 728 735 644 637 729 736 645 638 
12 0 729 736 645 638 730 737 646 639 
12 0 730 737 646 639 731 738 647 640 
12 0 731 738 647 640 732 739 648 641 
12 0 733 740 649 642 734 741 650 643 
12 0 734 741 650 643 735 742 651 644 
12 0 735 742 651 644 736 743 652 645 
12 0 736 743 652 645 737 744 653 646 
12 0 737 744 653 646 738 745 654 647 
12 0 738 745 654 647 739 746 655 648 
12 0 740 747 656 649 741 748 657 650 
12 0 741 748 657 650 742 749 658 651 
12 0 742 749 658 651 743 750 659 652 
12 0 743 750 659 652 744 751 660 653 
12 0 744 751 660 653 745 752 661 654 
12 0 745 752 661 654 746 753 662 655 
12 0 747 754 663 656 748 755 664 657 
12 0 748 755 664 657 749 756 665 658 
12 0 749 756 665 658 750 757 666 659 
12 0 750 757 666 659 751 758 667 660 
12 0 751 758 667 660 752 759 668 661 
12 0 752 759 668 661 753 760 669 662 
12 0 754 761 670 663 755 762 671 664 
12 0 755 762 671 664 756 763 672 665 
12 0 756 763 672 665 757 764 673 666 
12 0 757 764 673 666 758 765 674 667 
12 0 758 765 674 667 759 766 675 668 
12 0 759 766 675 668 760 767 676 669 
12 0 761 768 677 670 762 769 678 671 
12 0 762 769 678 671 763 770 679 672 
12 0 763 770 679 672 764 771 680 673 
12 0 764 771 680 673 765 772 681 674 
12 0 765 772 681 674 766 773 682 675 
12 0 766 773 682 675 767 774 683 676 
12 0 768 775 684 677 769 776 685 678 
12 0 769 776 685 678 770 777 686 679 
12 0 770 777 686 679 771 778 687 680 
12 0 771 778 687 680 772 779 688 681 
12 0 772 779 688 681 773 780 689 682 
12 0 773 780 689 682 774 781 690 683 
12 0 775 782 691 684 776 783 692 685 
12 0 776 783 692 685 777 784 693 686 
12 0 777 784 693 686 778 785 694 687 
12 0 778 785 694 687 779 786 695 688 
12 0 779 786 695 688 780 787 696 689 
12 0 780 787 696 689 781 788 697 690 
12 0 782 789 698 691 783 790 699 692 
12 0 783 790 699 692 784 791 700 693 
12 0 784 791 700 693 785 792 701 694 
12 0 785 792 701 694 786 793 702 695 
12 0 786 793 702 695 787 794 703 696 
12 0 787 794 703 696 788 795 704 697 
12 0 789 796 705 698 790 797 706 699 
12 0 790 797 706 699 791 798 707 700 
12 0 791 798 707 700 792 799 708 701 
12 0 792 799 708 701 793 800 709 702 
12 0 793 800 709 702 794 801 710 703 
12 0 794 801 710 703 795 802 711 704 
12 0 796 803 712 705 797 804 713 706 
12 0 797 804 713 706 798 805 714 707 
12 0 798 805 714 707 799 806 715 708 
12 0 799 806 715 708 800 807 716 709 
12 0 800 807 716 709 801 808 717 710 
12 0 801 808 717 710 802 809 718 711 
12 0 803 810 719 712 804 811 720 713 
12 0 804 811 720 713 805 812 721 714 
12 0 805 812 721 714 806 813 722 715 
12 0 806 813 722 715 807 814 723 716 
12 0 807 814 723 716 808 815 724 717 
12 0 808 815 724 717 809 816 725 718 
12 0 817 824 733 726 818 825 734 727 
12 0 818 825 734 727 819 826 735 728 
12 0 819 826 735 728 820 827 736 729 
12 0 820 827 736 729 821 828 737 730 
12 0 821 828 737 730 822 829 738 731 
12 0 822 829 738 731 823 830 739 732 
12 0 824 831 740 733 825 832 741 734 
12 0 825 832 741 734 826 833 742 735 
12 0 826 833 742 735 827 834 743 736 
12 0 827 834 743 736 828 835 744 737 
12 0 828 835 744 737 829 836 745 738 
12 0 829 836 745 738 830 837 746 739 
12 0 831 838 747 740 832 839 748 741 
12 0 832 839 748 741 833 840 749 742 
12 0 835 841 751 744 836 842 752 745 
12 0 836 842 752 745 837 843 753 746 
12 0 838 844 754 747 839 845 755 748 
12 0 839 845 755 748 840 846 756 749 
12 0 841 848 758 751 842 849 759 752 
12 0 842 849 759 752 843 850 760 753 
12 0 844 851 761 754 845 852 762 755 
12 0 845 852 762 755 846 853 763 756 
12 0 846 853 763 756 847 854 764 757 
12 0 847 854 764 757 848 855 765 758 
12 0 848 855 765 758 849 856 766 759 
12 0 849 856 766 759 850 857 767 760 
12 0 851 858 768 761 852 859 769 762 
12 0 852 859 769 762 853 860 770 763 
12 0 853 860 770 763 854 861 771 764 
12 0 854 861 771 764 855 862 772 765 
12 0 855 862 772 765 856 863 773 766 
12 0 856 863 773 766 857 864 774 767 
12 0 858 865 775 768 859 866 776 769 
12 0 859 866 776 769 860 867 777 770 
12 0 860 867 777 770 861 868 778 771 
12 0 861 868 778 771 862 869 779 772 
12 0 862 869 779 772 863 870 780 773 
12 0 863 870 780 773 864 871 781 774 
12 0 865 872 782 775 866 873 783 776 
12 0 866 873 783 776 867 874 784 777 
12 0 867 874 784 777 868 875 785 778 
12 0 868 875 785 778 869 876 786 779 
12 0 869 876 786 779 870 877 787 780 
12 0 870 877 787 780 871 878 788 781 
12 0 872 879 789 782 873 880 790 783 
12 0 873 880 790 783 874 881 791 784 
12 0 876 882 793 786 877 883 794 787 
12 0 877 883 794 787 878 884 795 788 
12 0 879 885 796 789 880 886 797 790 
12 0 880 886 797 790 881 887 798 791 
12 0 882 889 800 793 883 890 801 794 
12 0 883 890 801 794 884 891 802 795 
12 0 885 892 803 796 886 893 804 797 
12 0 886 893 804 797 887 894 805 798 
12 0 887 894 805 798 888 895 806 799 
12 0 888 895 806 799 889 896 807 800 
12 0 889 896 807 800 890 897 808 801 
12 0 890 897 808 801 891 898 809 802 
12 0 892 899 810 803 893 900 811 804 
12 0 893 900 811 804 894 901 812 805 
12 0 894 901 812 805 895 902 813 806 
12 0 895 902 813 806 896 903 814 807 
12 0 896 903 814 807 897 904 815 808 
12 0 897 904 815 808 898 905 816 809 
12 0 906 913 824 817 907 914 825 818 
12 0 907 914 825 818 908 915 826 819 
12 0 908 915 826 819 909 916 827 820 
12 0 909 916 827 820 910 917 828 821 
12 0 910 917 828 821 911 918 829 822 
12 0 911 918 829 822 912 919 830 823 
12 0 913 920 831 824 914 921 832 825 
12 0 914 921 832 825 915 922 833 826 
12 0 915 922 833 826 916 923 834 827 
12 0 916 923 834 827 917 924 835 828 
12 0 917 924 835 828 918 925 836 829 
12 0 918 925 836 829 919 926 837 830 
12 0 920 927 838 831 921 928 839 832 
12 0 921 928 839 832 922 929 840 833 
12 0 924 931 841 835 925 932 842 836 
12 0 925 932 842 836 926 933 843 837 
12 0 927 934 844 838 928 935 845 839 
12 0 928 935 845 839 929 936 846 840 
12 0 931 938 848 841 932 939 849 842 
12 0 932 939 849 842 933 940 850 843 
12 0 934 941 851 844 935 942 852 845 
12 0 935 942 852 845 936 943 853 846 
12 0 936 943 853 846 937 944 854 847 
12 0 937 944 854 847 938 945 855 848 
12 0 938 945 855 848 939 946 856 849 
12 0 939 946 856 849 940 947 857 850 
12 0 941 948 858 851 942 949 859 852 
12 0 942 949 859 852 943 950 860 853 
12 0 943 950 860 853 944 951 861 854 
12 0 944 951 861 854 945 952 862 855 
12 0 945 952 862 855 946 953 863 856 
12 0 946 953 863 856 947 954 864 857 
12 0 948 955 865 858 949 956 866 859 
12 0 949 956 866 859 950 957 867 860 
12 0 950 957 867 860 951 958 868 861 
12 0 951 958 868 861 952 959 869 862 
12 0 952 959 869 862 953 960 870 863 
12 0 953 960 870 863 954 961 871 864 
12 0 955 962 872 865 956 963 873 866 
12 0 956 963 873 866 957 964 874 867 
12 0 957 964 874 867 958 965 875 868 
12 0 958 965 875 868 959 966 876 869 
12 0 959 966 876 869 960 967 877 870 
12 0 960 967 877 870 961 968 878 871 
12 0 962 969 879 872 963 970 880 873 
12 0 963 970 880 873 964 971 881 874 
12 0 966 973 882 876 967 974 883 877 
12 0 967 974 883 877 968 975 884 878 
12 0 969 976 885 879 970 977 886 880 
12 0 970 977 886 880 971 978 887 881 
12 0 973 980 889 882 974 981 890 883 
12 0 974 981 890 883 975 982 891 884 
12 0 976 983 892 885 977 984 893 886 
12 0 977 984 893 886 978 985 894 887 
12 0 978 985 894 887 979 986 895 888 
12 0 979 986 895 888 980 987 896 889 
12 0 980 987 896 889 981 988 897 890 
12 0 981 988 897 890 982 989 898 891 
12 0 983 990 899 892 984 991 900 893 
12 0 984 991 900 893 985 992 901 894 
12 0 985 992 901 894 986 993 902 895 
12 0 986 993 902 895 987 994 903 896 
12 0 987 994 903 896 988 995 904 897 
12 0 988 995 904 897 989 996 905 898 
12 0 997 1004 913 906 998 1005 914 907 
12 0 998 1005 914 907 999 1006 915 908 
12 0 999 1006 915 908 1000 1007 916 909 
12 0 1000 1007 916 909 1001 1008 917 910 
12 0 1001 1008 917 910 1002 1009 918 911 
12 0 1002 1009 918 911 1003 1010 919 912 
12 0 1004 1011 920 913 1005 1012 921 914 
12 0 1005 1012 921 914 1006 1013 922 915 
12 0 1006 1013 922 915 1007 1014 923 916 
12 0 1007 1014 923 916 1008 1015 924 917 
12 0 1008 1015 924 917 1009 1016 925 918 
12 0 1009 1016 925 918 1010 1017 926 919 
12 0 1011 1018 927 920 1012 1019 928 921 
12 0 1012 1019 928 921 1013 1020 929 922 
12 0 1013 1020 929 922 1014 1021 930 923 
12 0 1014 1021 930 923 1015 1022 931 924 
12 0 1015 1022 931 924 1016 1023 932 925 
12 0 1016 1023 932 925 1017 1024 933 926 
12 0 1018 1025 934 927 1019 1026 935 928 
12 0 1019 1026 935 928 1020 1027 936 929 
12 0 1020 1027 936 929 1021 1028 937 930 
12 0 1021 1028 937 930 1022 1029 938 931 
12 0 1022 1029 938 931 1023 1030 939 932 
12 0 1023 1030 939 932 1024 1031 940 933 
12 0 1025 1032 941 934 1026 1033 942 935 
12 0 1026 1033 942 935 1027 1034 943 936 
12 0 1027 1034 943 936 1028 1035 944 937 
12 0 1028 1035 944 937 1029 1036 945 938 
12 0 1029 1036 945 938 1030 1037 946 939 
12 0 1030 1037 946 939 1031 1038 947 940 
12 0 1032 1039 948 941 1033 1040 949 942 
12 0 1033 1040 949 942 1034 1041 950 943 
12 0 1034 1041 950 943 1035 1042 951 944 
12 0 1035 1042 951 944 1036 1043 952 945 
12 0 1036 1043 952 945 1037 1044 953 946 
12 0 1037 1044 953 946 1038 1045 954 947 
12 0 1039 1046 955 948 1040 1047 956 949 
12 0 1040 1047 956 949 1041 1048 957 950 
12 0 1041 1048 957 950 1042 1049 958 951 
12 0 1042 1049 958 951 1043 1050 959 952 
12 0 1043 1050 959 952 1044 1051 960 953 
12 0 1044 1051 960 953 1045 1052 961 954 
12 0 1046 1053 962 955 1047 1054 963 956 
12 0 1047 1054 963 956 1048 1055 964 957 
12 0 1048 1055 964 957 1049 1056 965 958 
12 0 1049 1056 965 958 1050 1057 966 959 
12 0 1050 1057 966 959 1051 1058 967 960 
12 0 1051 1058 967 960 1052 1059 968 961 
12 0 1053 1060 969 962 1054 1061 970 963 
12 0 1054 1061 970 963 1055 1062 971 964 
12 0 1055 1062 971 964 1056 1063 972 965 
12 0 1056 1063 972 965 1057 1064 973 966 
12 0 1057 1064 973 966 1058 1065 974 967 
12 0 1058 1065 974 967 1059 1066 975 968 
12 0 1060 1067 976 969 1061 1068 977 970 
12 0 1061 1068 977 970 1062 1069 978 971 
12 0 1062 1069 978 971 1063 1070 979 972 
12 0 1063 1070 979 972 1064 1071 980 973 
12 0 1064 1071 980 973 1065 1072 981 974 
12 0 1065 1072 981 974 1066 1073 982 975 
12 0 1067 1074 983 976 1068 1075 984 977 
12 0 1068 1075 984 977 1069 1076 985 978 
12 0 1069 1076 985 978 1070 1077 986 979 
12 0 1070 1077 986 979 1071 1078 987 980 
12 0 1071 1078 987 980 1072 1079 988 981 
12 0 1072 1079 988 981 1073 1080 989 982 
12 0 1074 1081 990 983 1075 1082 991 984 
12 0 1075 1082 991 984 1076 1083 992 985 
12 0 1076 1083 992 985 1077 1084 993 986 
12 0 1077 1084 993 986 1078 1085 994 987 
12 0 1078 1085 994 987 1079 1086 995 988 
12 0 1079 1086 995 988 1080 1087 996 989 
12 0 1088 1095 1004 997 1089 1096 1005 998 
12 0 1089 1096 1005 998 1090 1097 1006 999 
12 0 1090 1097 1006 999 1091 1098 1007 1000 
12 0 1091 1098 1007 1000 1092 1099 1008 1001 
12 0 1092 1099 1008 1001 1093 1100 1009 1002 
12 0 1093 1100 1009 1002 1094 1101 1010 1003 
12 0 1095 1102 1011 1004 1096 1103 1012 1005 
12 0 1096 1103 1012 1005 1097 1104 1013 1006 
12 0 1097 1104 1013 1006 1098 1105 1014 1007 
12 0 1098 1105 1014 1007 1099 1106 1015 1008 
12 0 1099 1106 1015 1008 1100 1107 1016 1009 
12 0 1100 1107 1016 1009 1101 1108 1017 1010 
12 0 1102 1109 1018 1011 1103 1110 1019 1012 
12 0 1103 1110 1019 1012 1104 1111 1020 1013 
12 0 1104 1111 1020 1013 1105 1112 1021 1014 
12 0 1105 1112 1021 1014 1106 1113 1022 1015 
12 0 1106 1113 1022 1015 1107 1114 1023 1016 
12 0 1107 1114 1023 1016 1108 1115 1024 1017 
12 0 1109 1116 1025 1018 1110 1117 1026 1019 
12 0 1110 1117 1026 1019 1111 1118 1027 1020 
12 0 1111 1118 1027 1020 1112 1119 1028 1021 
12 0 1112 1119 1028 1021 1113 1120 1029 1022 
12 0 1113 1120 1029 1022 1114 1121 1030 1023 
12 0 1114 1121 1030 1023 1115 1122 1031 1024 
12 0 1116 1123 1032 1025 1117 1124 1033 1026 
12 0 1117 1124 1033 1026 1118 1125 1034 1027 
12 0 1118 1125 1034 1027 1119 1126 1035 1028 
12 0 1119 1126 1035 1028 1120 1127 1036 1029 
12 0 1120 1127 1036 1029 1121 1128 1037 1030 
12 0 1121 1128 1037 1030 1122 1129 1038 1031 
12 0 1123 1130 1039 1032 1124 1131 1040 1033 
12 0 1124 1131 1040 1033 1125 1132 1041 1034 
12 0 1125 1132 1041 1034 1126 1133 1042 1035 
12 0 1126 1133 1042 1035 1127 1134 1043 1036 
12 0 1127 1134 1043 1036 1128 1135 1044 1037 
12 0 1128 1135 1044 1037 1129 1136 1045 1038 
12 0 1130 1137 1046 1039 1131 1138 1047 1040 
12 0 1131 1138 1047 1040 1132 1139 1048 1041 
12 0 1132 1139 1048 1041 1133 1140 1049 1042 
12 0 1133 1140 1049 1042 1134 1141 1050 1043 
12 0 1134 1141 1050 1043 1135 1142 1051 1044 
12 0 1135 1142 1051 1044 1136 1143 1052 1045 
12 0 1137 1144 1053 1046 1138 1145 1054 1047 
12 0 1138 1145 1054 1047 1139 1146 1055 1048 
12 0 1139 1146 1055 1048 1140 1147 1056 1049 
12 0 1140 1147 1056 1049 1141 1148 1057 1050 
12 0 1141 1148 1057 1050 1142 1149 1058 1051 
12 0 1142 1149 1058 1051 1143 1150 1059 1052 
12 0 1144 1151 1060 1053 1145 1152 1061 1054 
12 0 1145 1152 1061 1054 1146 1153 1062 1055 
12 0 1146 1153 1062 1055 1147 1154 1063 1056 
12 0 1147 1154 1063 1056 1148 1155 1064 1057 
12 0 1148 1155 1064 1057 1149 1156 1065 1058 
12 0 1149 1156 1065 1058 1150 1157 1066 1059 
12 0 1151 1158 1067 1060 1152 1159 1068 1061 
12 0 1152 1159 1068 1061 1153 1160 1069 1062 
12 0 1153 1160 1069 1062 1154 1161 1070 1063 
12 0 1154 1161 1070 1063 1155 1162 1071 1064 
12 0 1155 1162 1071 1064 1156 1163 1072 1065 
12 0 1156 1163 1072 1065 1157 1164 1073 1066 
12 0 1158 1165 1074 1067 1159 1166 1075 1068 
12 0 1159 1166 1075 1068 1160 1167 1076 1069 
12 0 1160 1167 1076 1069 1161 1168 1077 1070 
12 0 1161 1168 1077 1070 1162 1169 1078 1071 
12 0 1162 1169 1078 1071 1163 1170 1079 1072 
12 0 1163 1170 1079 1072 1164 1171 1080 1073 
12 0 1165 1172 1081 1074 1166 1173 1082 1075 
12 0 1166 1173 1082 1075 1167 1174 1083 1076 
12 0 1167 1174 1083 1076 1168 1175 1084 1077 
12 0 1168 1175 1084 1077 1169 1176 1085 1078 
12 0 1169 1176 1085 1078 1170 1177 1086 1079 
12 0 1170 1177 1086 1079 1171 1178 1087 1080 
FACES:
1 0 7 8 1 
1 1088 1095 1096 1089 
1 1 8 9 2 
1 1089 1096 1097 1090 
1 2 9 10 3 
1 1090 1097 1098 1091 
1 3 10 11 4 
1 1091 1098 1099 1092 
1 4 11 12 5 
1 1092 1099 1100 1093 
1 5 12 13 6 
1 1093 1100 1101 1094 
1 7 14 15 8 
1 1095 1102 1103 1096 
1 8 15 16 9 
1 1096 1103 1104 1097 
1 9 16 17 10 
1 1097 1104 1105 1098 
1 10 17 18 11 
1 1098 1105 1106 1099 
1 11 18 19 12 
1 1099 1106 1107 1100 
1 12 19 20 13 
1 1100 1107 1108 1101 
1 14 21 22 15 
1 1102 1109 1110 1103 
1 15 22 23 16 
1 1103 1110 1111 1104 
1 16 23 24 17 
1 1104 1111 1112 1105 
1 17 24 25 18 
1 1105 1112 1113 1106 
1 18 25 26 19 
1 1106 1113 1114 1107 
1 19 26 27 20 
1 1107 1114 1115 1108 
1 21 28 29 22 
1 1109 1116 1117 1110 
1 22 29 30 23 
1 1110 1117 1118 1111 
1 23 30 31 24 
1 1111 1118 1119 1112 
1 24 31 32 25 
1 1112 1119 1120 1113 
1 25 32 33 26 
1 1113 1120 1121 1114 
1 26 33 34 27 
1 1114 1121 1122 1115 
1 28 35 36 29 
1 1116 1123 1124 1117 
1 29 36 37 30 
1 1117 1124 1125 1118 
1 30 37 38 31 
1 1118 1125 1126 1119 
1 31 38 39 32 
1 1119 1126 1127 1120 
1 32 39 40 33 
1 1120 1127 1128 1121 
1 33 40 41 34 
1 1121 1128 1129 1122 
1 35 42 43 36 
1 1123 1130 1131 1124 
1 36 43 44 37 
1 1124 1131 1132 1125 
1 37 44 45 38 
1 1125 1132 1133 1126 
1 38 45 46 39 
1 1126 1133 1134 1127 
1 39 46 47 40 
1 1127 1134 1135 1128 
1 40 47 48 41 
1 1128 1135 1136 1129 
1 42 49 50 43 
1 1130 1137 1138 1131 
1 43 50 51 44 
1 1131 1138 1139 1132 
1 44 51 52 45 
1 1132 1139 1140 1133 
1 45 52 53 46 
1 1133 1140 1141 1134 
1 46 53 54 47 
1 1134 1141 1142 1135 
1 47 54 55 48 
1 1135 1142 1143 1136 
1 49 56 57 50 
1 1137 1144 1145 1138 
1 50 57 58 51 
1 1138 1145 1146 1139 
1 51 58 59 52 
1 1139 1146 1147 1140 
1 52 59 60 53 
1 1140 1147 1148 1141 
1 53 60 61 54 
1 1141 1148 1149 1142 
1 54 61 62 55 
1 1142 1149 1150 1143 
1 56 63 64 57 
1 1144 1151 1152 1145 
1 57 64 65 58 
1 1145 1152 1153 1146 
1 58 65 66 59 
1 1146 1153 1154 1147 
1 59 66 67 60 
1 1147 1154 1155 1148 
1 60 67 68 61 
1 1148 1155 1156 1149 
1 61 68 69 62 
1 1149 1156 1157 1150 
1 63 70 71 64 
1 1151 1158 1159 1152 
1 64 71 72 65 
1 1152 1159 1160 1153 
1 65 72 73 66 
1 1153 1160 1161 1154 
1 66 73 74 67 
1 1154 1161 1162 1155 
1 67 74 75 68 
1 1155 1162 1163 1156 
1 68 75 76 69 
1 1156 1163 1164 1157 
1 70 77 78 71 
1 1158 1165 1166 1159 
1 71 78 79 72 
1 1159 1166 1167 1160 
1 72 79 80 73 
1 1160 1167 1168 1161 
1 73 80 81 74 
1 1161 1168 1169 1162 
1 74 81 82 75 
1 1162 1169 1170 1163 
1 75 82 83 76 
1 1163 1170 1171 1164 
1 77 84 85 78 
1 1165 1172 1173 1166 
1 78 85 86 79 
1 1166 1173 1174 1167 
1 79 86 87 80 
1 1167 1174 1175 1168 
1 80 87 88 81 
1 1168 1175 1176 1169 
1 81 88 89 82 
1 1169 1176 1177 1170 
1 82 89 90 83 
1 1170 1177 1178 1171 
1 0 91 92 1 
1 84 175 176 85 
1 1 92 93 2 
1 85 176 177 86 
1 2 93 94 3 
1 86 177 178 87 
1 3 94 95 4 
1 87 178 179 88 
1 4 95 96 5 
1 88 179 180 89 
1 5 96 97 6 
1 89 180 181 90 
1 91 182 183 92 
1 175 266 267 176 
1 92 183 184 93 
1 176 267 268 177 
1 93 184 185 94 
1 177 268 269 178 
1 94 185 186 95 
1 178 269 270 179 
1 95 186 187 96 
1 179 270 271 180 
1 96 187 188 97 
1 180 271 272 181 
1 182 273 274 183 
1 266 355 356 267 
1 183 274 275 184 
1 267 356 357 268 
1 184 275 276 185 
1 268 357 358 269 
1 185 276 277 186 
1 269 358 359 270 
1 186 277 278 187 
1 270 359 360 271 
1 187 278 279 188 
1 271 360 361 272 
1 273 362 363 274 
1 355 446 447 356 
1 274 363 364 275 
1 356 447 448 357 
1 275 364 365 276 
1 357 448 449 358 
1 276 365 366 277 
1 358 449 450 359 
1 277 366 367 278 
1 359 450 451 360 
1 278 367 368 279 
1 360 451 452 361 
1 362 453 454 363 
1 446 537 538 447 
1 363 454 455 364 
1 447 538 539 448 
1 364 455 456 365 
1 448 539 540 449 
1 365 456 457 366 
1 449 540 541 450 
1 366 457 458 367 
1 450 541 542 451 
1 367 458 459 368 
1 451 542 543 452 
1 453 544 545 454 
1 537 628 629 538 
1 454 545 546 455 
1 538 629 630 539 
1 455 546 547 456 
1 539 630 631 540 
1 456 547 548 457 
1 540 631 632 541 
1 457 548 549 458 
1 541 632 633 542 
1 458 549 550 459 
1 542 633 634 543 
1 544 635 636 545 
1 628 719 720 629 
1 545 636 637 546 
1 629 720 721 630 
1 546 637 638 547 
1 630 721 722 631 
1 547 638 639 548 
1 631 722 723 632 
1 548 639 640 549 
1 632 723 724 633 
1 549 640 641 550 
1 633 724 725 634 
1 635 726 727 636 
1 719 810 811 720 
1 636 727 728 637 
1 720 811 812 721 
1 637 728 729 638 
1 721 812 813 722 
1 638 729 730 639 
1 722 813 814 723 
1 639 730 731 640 
1 723 814 815 724 
1 640 731 732 641 
1 724 815 816 725 
1 726 817 818 727 
1 810 899 900 811 
1 727 818 819 728 
1 811 900 901 812 
1 728 819 820 729 
1 812 901 902 813 
1 729 820 821 730 
1 813 902 903 814 
1 730 821 822 731 
1 814 903 904 815 
1 731 822 823 732 
1 815 904 905 816 
1 817 906 907 818 
1 899 990 991 900 
1 818 907 908 819 
1 900 991 992 901 
1 819 908 909 820 
1 901 992 993 902 
1 820 909 910 821 
1 902 993 994 903 
1 821 910 911 822 
1 903 994 995 904 
1 822 911 912 823 
1 904 995 996 905 
1 906 997 998 907 
1 990 1081 1082 991 
1 907 998 999 908 
1 991 1082 1083 992 
1 908 999 1000 909 
1 992 1083 1084 993 
1 909 1000 1001 910 
1 993 1084 1085 994 
1 910 1001 1002 911 
1 994 1085 1086 995 
1 911 1002 1003 912 
1 995 1086 1087 996 
1 997 1088 1089 998 
1 1081 1172 1173 1082 
1 998 1089 1090 999 
1 1082 1173 1174 1083 
1 999 1090 1091 1000 
1 1083 1174 1175 1084 
1 1000 1091 1092 1001 
1 1084 1175 1176 1085 
1 1001 1092 1093 1002 
1 1085 1176 1177 1086 
1 1002 1093 1094 1003 
1 1086 1177 1178 1087 
1 98 91 0 7 
1 104 97 6 13 
1 105 98 7 14 
1 111 104 13 20 
1 112 105 14 21 
1 118 111 20 27 
1 119 112 21 28 
1 125 118 27 34 
1 126 119 28 35 
1 132 125 34 41 
1 133 126 35 42 
1 139 132 41 48 
1 140 133 42 49 
1 146 139 48 55 
1 147 140 49 56 
1 153 146 55 62 
1 154 147 56 63 
1 160 153 62 69 
1 161 154 63 70 
1 167 160 69 76 
1 168 161 70 77 
1 174 167 76 83 
1 175 168 77 84 
1 181 174 83 90 
1 189 182 91 98 
1 195 188 97 104 
1 196 189 98 105 
1 202 195 104 111 
1 203 196 105 112 
1 209 202 111 118 
1 210 203 112 119 
1 216 209 118 125 
1 217 210 119 126 
1 223 216 125 132 
1 224 217 126 133 
1 230 223 132 139 
1 231 224 133 140 
1 237 230 139 146 
1 238 231 140 147 
1 244 237 146 153 
1 245 238 147 154 
1 251 244 153 160 
1 252 245 154 161 
1 258 251 160 167 
1 259 252 161 168 
1 265 258 167 174 
1 266 259 168 175 
1 272 265 174 181 
1 280 273 182 189 
1 286 279 188 195 
1 287 280 189 196 
1 293 286 195 202 
1 294 287 196 203 
1 299 293 202 209 
1 300 294 203 210 
1 306 299 209 216 
1 307 300 210 217 
1 313 306 216 223 
1 314 307 217 224 
1 320 313 223 230 
1 321 314 224 231 
1 327 320 230 237 
1 328 321 231 238 
1 334 327 237 244 
1 335 328 238 245 
1 340 334 244 251 
1 341 335 245 252 
1 347 340 251 258 
1 348 341 252 259 
1 354 347 258 265 
1 355 348 259 266 
1 361 354 265 272 
1 369 362 273 280 
1 375 368 279 286 
1 376 369 280 287 
1 382 375 286 293 
1 383 376 287 294 
1 389 382 293 299 
1 390 383 294 300 
1 396 389 299 306 
1 397 390 300 307 
1 403 396 306 313 
1 404 397 307 314 
1 410 403 313 320 
1 411 404 314 321 
1 417 410 320 327 
1 418 411 321 328 
1 424 417 327 334 
1 425 418 328 335 
1 431 424 334 340 
1 432 425 335 341 
1 438 431 340 347 
1 439 432 341 348 
1 445 438 347 354 
1 446 439 348 355 
1 452 445 354 361 
1 460 453 362 369 
1 466 459 368 375 
1 467 460 369 376 
1 473 466 375 382 
1 474 467 376 383 
1 480 473 382 389 
1 481 474 383 390 
1 487 480 389 396 
1 488 481 390 397 
1 494 487 396 403 
1 495 488 397 404 
1 501 494 403 410 
1 502 495 404 411 
1 508 501 410 417 
1 509 502 411 418 
1 515 508 417 424 
1 516 509 418 425 
1 522 515 424 431 
1 523 516 425 432 
1 529 522 431 438 
1 530 523 432 439 
1 536 529 438 445 
1 537 530 439 446 
1 543 536 445 452 
1 551 544 453 460 
1 557 550 459 466 
1 558 551 460 467 
1 564 557 466 473 
1 565 558 467 474 
1 571 564 473 480 
1 572 565 474 481 
1 578 571 480 487 
1 579 572 481 488 
1 585 578 487 494 
1 586 579 488 495 
1 592 585 494 501 
1 593 586 495 502 
1 599 592 501 508 
1 600 593 502 509 
1 606 599 508 515 
1 607 600 509 516 
1 613 606 515 522 
1 614 607 516 523 
1 620 613 522 529 
1 621 614 523 530 
1 627 620 529 536 
1 628 621 530 537 
1 634 627 536 543 
1 642 635 544 551 
1 648 641 550 557 
1 649 642 551 558 
1 655 648 557 564 
1 656 649 558 565 
1 662 655 564 571 
1 663 656 565 572 
1 669 662 571 578 
1 670 663 572 579 
1 676 669 578 585 
1 677 670 579 586 
1 683 676 585 592 
1 684 677 586 593 
1 690 683 592 599 
1 691 684 593 600 
1 697 690 599 606 
1 698 691 600 607 
1 704 697 606 613 
1 705 698 607 614 
1 711 704 613 620 
1 712 705 614 621 
1 718 711 620 627 
1 719 712 621 628 
1 725 718 627 634 
1 733 726 635 642 
1 739 732 641 648 
1 740 733 642 649 
1 746 739 648 655 
1 747 740 649 656 
1 753 746 655 662 
1 754 747 656 663 
1 760 753 662 669 
1 761 754 663 670 
1 767 760 669 676 
1 768 761 670 677 
1 774 767 676 683 
1 775 768 677 684 
1 781 774 683 690 
1 782 775 684 691 
1 788 781 690 697 
1 789 782 691 698 
1 795 788 697 704 
1 796 789 698 705 
1 802 795 704 711 
1 803 796 705 712 
1 809 802 711 718 
1 810 803 712 719 
1 816 809 718 725 
1 824 817 726 733 
1 830 823 732 739 
1 831 824 733 740 
1 837 830 739 746 
1 838 831 740 747 
1 843 837 746 753 
1 844 838 747 754 
1 850 843 753 760 
1 851 844 754 761 
1 857 850 760 767 
1 858 851 761 768 
1 864 857 767 774 
1 865 858 768 775 
1 871 864 774 781 
1 872 865 775 782 
1 878 871 781 788 
1 879 872 782 789 
1 884 878 788 795 
1 885 879 789 796 
1 891 884 795 802 
1 892 885 796 803 
1 898 891 802 809 
1 899 892 803 810 
1 905 898 809 816 
1 913 906 817 824 
1 919 912 823 830 
1 920 913 824 831 
1 926 919 830 837 
1 927 920 831 838 
1 933 926 837 843 
1 934 927 838 844 
1 940 933 843 850 
1 941 934 844 851 
1 947 940 850 857 
1 948 941 851 858 
1 954 947 857 864 
1 955 948 858 865 
1 961 954 864 871 
1 962 955 865 872 
1 968 961 871 878 
1 969 962 872 879 
1 975 968 878 884 
1 976 969 879 885 
1 982 975 884 891 
1 983 976 885 892 
1 989 982 891 898 
1 990 983 892 899 
1 996 989 898 905 
1 1004 997 906 913 
1 1010 1003 912 919 
1 1011 1004 913 920 
1 1017 1010 919 926 
1 1018 1011 920 927 
1 1024 1017 926 933 
1 1025 1018 927 934 
1 1031 1024 933 940 
1 1032 1025 934 941 
1 1038 1031 940 947 
1 1039 1032 941 948 
1 1045 1038 947 954 
1 1046 1039 948 955 
1 1052 1045 954 961 
1 1053 1046 955 962 
1 1059 1052 961 968 
1 1060 1053 962 969 
1 1066 1059 968 975 
1 1067 1060 969 976 
1 1073 1066 975 982 
1 1074 1067 976 983 
1 1080 1073 982 989 
1 1081 1074 983 990 
1 1087 1080 989 996 
1 1095 1088 997 1004 
1 1101 1094 1003 1010 
1 1102 1095 1004 1011 
1 1108 1101 1010 1017 
1 1109 1102 1011 1018 
1 1115 1108 1017 1024 
1 1116 1109 1018 1025 
1 1122 1115 1024 1031 
1 1123 1116 1025 1032 
1 1129 1122 1031 1038 
1 1130 1123 1032 1039 
1 1136 1129 1038 1045 
1 1137 1130 1039 1046 
1 1143 1136 1045 1052 
1 1144 1137 1046 1053 
1 1150 1143 1052 1059 
1 1151 1144 1053 1060 
1 1157 1150 1059 1066 
1 1158 1151 1060 1067 
1 1164 1157 1066 1073 
1 1165 1158 1067 1074 
1 1171 1164 1073 1080 
1 1172 1165 1074 1081 
1 1178 1171 1080 1087 
230 198 205 206 199 
230 378 385 386 379 
230 199 206 207 200 
230 379 386 387 380 
230 205 212 213 206 
230 385 392 393 386 
230 206 213 214 207 
230 386 393 394 387 
230 198 289 290 199 
230 212 302 303 213 
230 199 290 291 200 
230 213 303 304 214 
230 289 378 379 290 
230 302 392 393 303 
230 290 379 380 291 
230 303 393 394 304 
230 296 289 198 205 
230 297 291 200 207 
230 302 296 205 212 
230 304 297 207 214 
230 385 378 289 296 
230 387 380 291 297 
230 392 385 296 302 
230 394 387 297 304 
231 742 749 750 743 
231 922 929 930 923 
231 743 750 751 744 
231 923 930 931 924 
231 749 756 757 750 
231 929 936 937 930 
231 750 757 758 751 
231 930 937 938 931 
231 742 833 834 743 
231 756 846 847 757 
231 743 834 835 744 
231 757 847 848 758 
231 833 922 923 834 
231 846 936 937 847 
231 834 923 924 835 
231 847 937 938 848 
231 840 833 742 749 
231 841 835 744 751 
231 846 840 749 756 
231 848 841 751 758 
231 929 922 833 840 
231 931 924 835 841 
231 936 929 840 846 
231 938 931 841 848 
232 240 247 248 241 
232 420 427 428 421 
232 241 248 249 242 
232 421 428 429 422 
232 247 254 255 248 
232 427 434 435 428 
232 248 255 256 249 
232 428 435 436 429 
232 240 330 331 241 
232 254 343 344 255 
232 241 331 332 242 
232 255 344 345 256 
232 330 420 421 331 
232 343 434 435 344 
232 331 421 422 332 
232 344 435 436 345 
232 337 330 240 247 
232 338 332 242 249 
232 343 337 247 254 
232 345 338 249 256 
232 427 420 330 337 
232 429 422 332 338 
232 434 427 337 343 
232 436 429 338 345 
233 784 791 792 785 
233 964 971 972 965 
233 785 792 793 786 
233 965 972 973 966 
233 791 798 799 792 
233 971 978 979 972 
233 792 799 800 793 
233 972 979 980 973 
233 784 874 875 785 
233 798 887 888 799 
233 785 875 876 786 
233 799 888 889 800 
233 874 964 965 875 
233 887 978 979 888 
233 875 965 966 876 
233 888 979 980 889 
233 881 874 784 791 
233 882 876 786 793 
233 887 881 791 798 
233 889 882 793 800 
233 971 964 874 881 
233 973 966 876 882 
233 978 971 881 887 
233 980 973 882 889 
VDATA:
-10 0 0 
-10 0 0 
-10 0 0 
-10 0 0 
-10 0 0 
-10 0 0 
-10 0 0 
-10 0 0 
-10 0 0 
-10 0 0 
-10 0 0 
-10 0 0 
-10 0 0 
-10 0 0 
-10 0 0 
-10 0 0 
-10 0 0 
-10 0 0 
-10 0 0 
-10 0 0 
-10 0 0 
-10 0 0 
-10 0 0 
-10 0 0 
-10 0 0 
-10 0 0 
-10 0 0 
-10 0 0 
-10 0 0 
-10 0 0 
-10 0 0 
-10 0 0 
-10 0 0 
-10 0 0 
-10 0 0 
-10 0 0 
-10 0 0 
-10 0 0 
-10 0 0 
-10 0 0 
-10 0 0 
-10 0 0 
-10 0 0 
-10 0 0 
-10 0 0 
-10 0 0 
-10 0 0 
-10 0 0 
-10 0 0 
-10 0 0 
-10 0 0 
-10 0 0 
-10 0 0 
-10 0 0 
-10 0 0 
-10 0 0 
-10 0 0 
-10 0 0 
-10 0 0 
-10 0 0 
-10 0 0 
-10 0 0 
-10 0 0 
-10 0 0 
-10 0 0 
-10 0 0 
-10 0 0 
-10 0 0 
-10 0 0 
-10 0 0 
-10 0 0 
-10 0 0 
-10 0 0 
-10 0 0 
-10 0 0 
-10 0 0 
-10 0 0 
-10 0 0 
-10 0 0 
-10 0 0 
-10 0 0 
-10 0 0 
-10 0 0 
-10 0 0 
-10 0 0 
-10 0 0 
-10 0 0 
-10 0 0 
-10 0 0 
-10 0 0 
-10 0 0 
-10 0 0 
-10 0 0 
-10 0 0 
-10 0 0 
-10 0 0 
-10 0 0 
-10 0 0 
-10 0 0 
-10 0 0 
-10 0 0 
-10 0 0 
-10 0 0 
-10 0 0 
-10 0 0 
-10 0 0 
-10 0 0 
-10 0 0 
-10 0 0 
-10 0 0 
-10 0 0 
-10 0 0 
-10 0 0 
-10 0 0 
-10 0 0 
-10 0 0 
-10 0 0 
-10 0 0 
-10 0 0 
-10 0 0 
-10 0 0 
-10 0 0 
-10 0 0 
-10 0 0 
-10 0 0 
-10 0 0 
-10 0 0 
-10 0 0 
-10 0 0 
-10 0 0 
-10 0 0 
-10 0 0 
-10 0 0 
-10 0 0 
-10 0 0 
-10 0 0 
-10 0 0 
-10 0 0 
-10 0 0 
-10 0 0 
-10 0 0 
-10 0 0 
-10 0 0 
-10 0 0 
-10 0 0 
-10 0 0 
-10 0 0 
-10 0 0 
-10 0 0 
-10 0 0 
-10 0 0 
-10 0 0 
-10 0 0 
-10 0 0 
-10 0 0 
-10 0 0 
-10 0 0 
-10 0 0 
-10 0 0 
-10 0 0 
-10 0 0 
-10 0 0 
-10 0 0 
-10 0 0 
-10 0 0 
-10 0 0 
-10 0 0 
-10 0 0 
-10 0 0 
-10 0 0 
-10 0 0 
-10 0 0 
-10 0 0 
-10 0 0 
-10 0 0 
-10 0 0 
-10 0 0 
-10 0 0 
-10 0 0 
-10 0 0 
-10 0 0 
-10 0 0 
-10 0 0 
-10 0 0 
-10 0 0 
-10 0 0 
-10 0 0 
-10 0 0 
-10 0 0 
-10 0 0 
-10 0 0 
-10 0 0 
-10 0 0 
-10 0 0 
-10 0 0 
-10 0 0 
-10 0 0 
-10 0 0 
-10 0 0 
-10 0 0 
-10 0 0 
-10 0 0 
-10 0 0 
-10 0 0 
-10 0 0 
-10 0 0 
-10 0 0 
-10 0 0 
-10 0 0 
-10 0 0 
-10 0 0 
-10 0 0 
-10 0 0 
-10 0 0 
-10 0 0 
-10 0 0 
-10 0 0 
-10 0 0 
-10 0 0 
-10 0 0 
-10 0 0 
-10 0 0 
-10 0 0 
-10 0 0 
-10 0 0 
-10 0 0 
-10 0 0 
-10 0 0 
-10 0 0 
-10 0 0 
-10 0 0 
-10 0 0 
-10 0 0 
-10 0 0 
-10 0 0 
-10 0 0 
-10 0 0 
-10 0 0 
-10 0 0 
-10 0 0 
-10 0 0 
-10 0 0 
-10 0 0 
-10 0 0 
-10 0 0 
-10 0 0 
-10 0 0 
-10 0 0 
-10 0 0 
-10 0 0 
-10 0 0 
-10 0 0 
-10 0 0 
-10 0 0 
-10 0 0 
-10 0 0 
-10 0 0 
-10 0 0 
-10 0 0 
-10 0 0 
-10 0 0 
-10 0 0 
-10 0 0 
-10 0 0 
-10 0 0 
-10 0 0 
-10 0 0 
-10 0 0 
-10 0 0 
-10 0 0 
-10 0 0 
-10 0 0 
-10 0 0 
-10 0 0 
-10 0 0 
-10 0 0 
-10 0 0 
-10 0 0 
-10 0 0 
-10 0 0 
-10 0 0 
-10 0 0 
-10 0 0 
-10 0 0 
-10 0 0 
-10 0 0 
-10 0 0 
-10 0 0 
-10 0 0 
-10 0 0 
-10 0 0 
-10 0 0 
-10 0 0 
-10 0 0 
-10 0 0 
-10 0 0 
-10 0 0 
-10 0 0 
-10 0 0 
-10 0 0 
-10 0 0 
-10 0 0 
-10 0 0 
-10 0 0 
-10 0 0 
-10 0 0 
-10 0 0 
-10 0 0 
-10 0 0 
-10 0 0 
-10 0 0 
-10 0 0 
-10 0 0 
-10 0 0 
-10 0 0 
-10 0 0 
-10 0 0 
-10 0 0 
-10 0 0 
-10 0 0 
-10 0 0 
-10 0 0 
-10 0 0 
-10 0 0 
-10 0 0 
-10 0 0 
-10 0 0 
-10 0 0 
-10 0 0 
-10 0 0 
-10 0 0 
-10 0 0 
-10 0 0 
-10 0 0 
-10 0 0 
-10 0 0 
-10 0 0 
-10 0 0 
-10 0 0 
-10 0 0 
-10 0 0 
-10 0 0 
-10 0 0 
-10 0 0 
-10 0 0 
-10 0 0 
-10 0 0 
-10 0 0 
-10 0 0 
-10 0 0 
-10 0 0 
-10 0 0 
-10 0 0 
-10 0 0 
-10 0 0 
-10 0 0 
-10 0 0 
-10 0 0 
-10 0 0 
-10 0 0 
-10 0 0 
-10 0 0 
-10 0 0 
-10 0 0 
-10 0 0 
-10 0 0 
-10 0 0 
-10 0 0 
-10 0 0 
-10 0 0 
-10 0 0 
-10 0 0 
-10 0 0 
-10 0 0 
-10 0 0 
-10 0 0 
-10 0 0 
-10 0 0 
-10 0 0 
-10 0 0 
-10 0 0 
-10 0 0 
-10 0 0 
-10 0 0 
-10 0 0 
-10 0 0 
-10 0 0 
-10 0 0 
-10 0 0 
-10 0 0 
-10 0 0 
-10 0 0 
-10 0 0 
-10 0 0 
-10 0 0 
-10 0 0 
-10 0 0 
-10 0 0 
-10 0 0 
-10 0 0 
-10 0 0 
-10 0 0 
-10 0 0 
-10 0 0 
-10 0 0 
-10 0 0 
-10 0 0 
-10 0 0 
-10 0 0 
-10 0 0 
-10 0 0 
-10 0 0 
-10 0 0 
-10 0 0 
-10 0 0 
-10 0 0 
-10 0 0 
-10 0 0 
-10 0 0 
-10 0 0 
-10 0 0 
-10 0 0 
-10 0 0 
-10 0 0 
-10 0 0 
-10 0 0 
-10 0 0 
-10 0 0 
-10 0 0 
-10 0 0 
-10 0 0 
-10 0 0 
-10 0 0 
-10 0 0 
-10 0 0 
-10 0 0 
-10 0 0 
-10 0 0 
-10 0 0 
-10 0 0 
-10 0 0 
-10 0 0 
-10 0 0 
-10 0 0 
-10 0 0 
-10 0 0 
-10 0 0 
-10 0 0 
-10 0 0 
-10 0 0 
-10 0 0 
-10 0 0 
-10 0 0 
-10 0 0 
-10 0 0 
-10 0 0 
-10 0 0 
-10 0 0 
-10 0 0 
-10 0 0 
-10 0 0 
-10 0 0 
-10 0 0 
-10 0 0 
-10 0 0 
-10 0 0 
-10 0 0 
-10 0 0 
-10 0 0 
-10 0 0 
-10 0 0 
-10 0 0 
-10 0 0 
-10 0 0 
-10 0 0 
-10 0 0 
-10 0 0 
-10 0 0 
-10 0 0 
-10 0 0 
-10 0 0 
-10 0 0 
-10 0 0 
-10 0 0 
-10 0 0 
-10 0 0 
-10 0 0 
-10 0 0 
-10 0 0 
-10 0 0 
-10 0 0 
-10 0 0 
-10 0 0 
-10 0 0 
-10 0 0 
-10 0 0 
-10 0 0 
-10 0 0 
-10 0 0 
-10 0 0 
-10 0 0 
-10 0 0 
-10 0 0 
-10 0 0 
-10 0 0 
-10 0 0 
-10 0 0 
-10 0 0 
-10 0 0 
-10 0 0 
-10 0 0 
-10 0 0 
-10 0 0 
-10 0 0 
-10 0 0 
-10 0 0 
-10 0 0 
-10 0 0 
-10 0 0 
-10 0 0 
-10 0 0 
-10 0 0 
-10 0 0 
-10 0 0 
-10 0 0 
-10 0 0 
-10 0 0 
-10 0 0 
-10 0 0 
-10 0 0 
-10 0 0 
-10 0 0 
-10 0 0 
-10 0 0 
-10 0 0 
-10 0 0 
-10 0 0 
-10 0 0 
-10 0 0 
-10 0 0 
-10 0 0 
-10 0 0 
-10 0 0 
-10 0 0 
-10 0 0 
-10 0 0 
-10 0 0 
-10 0 0 
-10 0 0 
-10 0 0 
-10 0 0 
-10 0 0 
-10 0 0 
-10 0 0 
-10 0 0 
-10 0 0 
-10 0 0 
-10 0 0 
-10 0 0 
-10 0 0 
-10 0 0 
-10 0 0 
-10 0 0 
-10 0 0 
-10 0 0 
-10 0 0 
-10 0 0 
-10 0 0 
-10 0 0 
-10 0 0 
-10 0 0 
-10 0 0 
-10 0 0 
-10 0 0 
-10 0 0 
-10 0 0 
-10 0 0 
-10 0 0 
-10 0 0 
-10 0 0 
-10 0 0 
-10 0 0 
-10 0 0 
-10 0 0 
-10 0 0 
-10 0 0 
-10 0 0 
-10 0 0 
-10 0 0 
-10 0 0 
-10 0 0 
-10 0 0 
-10 0 0 
-10 0 0 
-10 0 0 
-10 0 0 
-10 0 0 
-10 0 0 
-10 0 0 
-10 0 0 
-10 0 0 
-10 0 0 
-10 0 0 
-10 0 0 
-10 0 0 
-10 0 0 
-10 0 0 
-10 0 0 
-10 0 0 
-10 0 0 
-10 0 0 
-10 0 0 
-10 0 0 
-10 0 0 
-10 0 0 
-10 0 0 
-10 0 0 
-10 0 0 
-10 0 0 
-10 0 0 
-10 0 0 
-10 0 0 
-10 0 0 
-10 0 0 
-10 0 0 
-10 0 0 
-10 0 0 
-10 0 0 
-10 0 0 
-10 0 0 
-10 0 0 
-10 0 0 
-10 0 0 
-10 0 0 
-10 0 0 
-10 0 0 
-10 0 0 
-10 0 0 
-10 0 0 
-10 0 0 
-10 0 0 
-10 0 0 
-10 0 0 
-10 0 0 
-10 0 0 
-10 0 0 
-10 0 0 
-10 0 0 
-10 0 0 
-10 0 0 
-10 0 0 
-10 0 0 
-10 0 0 
-10 0 0 
-10 0 0 
-10 0 0 
-10 0 0 
-10 0 0 
-10 0 0 
-10 0 0 
-10 0 0 
-10 0 0 
-10 0 0 
-10 0 0 
-10 0 0 
-10 0 0 
-10 0 0 
-10 0 0 
-10 0 0 
-10 0 0 
-10 0 0 
-10 0 0 
-10 0 0 
-10 0 0 
-10 0 0 
-10 0 0 
-10 0 0 
-10 0 0 
-10 0 0 
-10 0 0 
-10 0 0 
-10 0 0 
-10 0 0 
-10 0 0 
-10 0 0 
-10 0 0 
-10 0 0 
-10 0 0 
-10 0 0 
-10 0 0 
-10 0 0 
-10 0 0 
-10 0 0 
-10 0 0 
-10 0 0 
-10 0 0 
-10 0 0 
-10 0 0 
-10 0 0 
-10 0 0 
-10 0 0 
-10 0 0 
-10 0 0 
-10 0 0 
-10 0 0 
-10 0 0 
-10 0 0 
-10 0 0 
-10 0 0 
-10 0 0 
-10 0 0 
-10 0 0 
-10 0 0 
-10 0 0 
-10 0 0 
-10 0 0 
-10 0 0 
-10 0 0 
-10 0 0 
-10 0 0 
-10 0 0 
-10 0 0 
-10 0 0 
-10 0 0 
-10 0 0 
-10 0 0 
-10 0 0 
-10 0 0 
-10 0 0 
-10 0 0 
-10 0 0 
-10 0 0 
-10 0 0 
-10 0 0 
-10 0 0 
-10 0 0 
-10 0 0 
-10 0 0 
-10 0 0 
-10 0 0 
-10 0 0 
-10 0 0 
-10 0 0 
-10 0 0 
-10 0 0 
-10 0 0 
-10 0 0 
-10 0 0 
-10 0 0 
-10 0 0 
-10 0 0 
-10 0 0 
-10 0 0 
-10 0 0 
-10 0 0 
-10 0 0 
-10 0 0 
-10 0 0 
-10 0 0 
-10 0 0 
-10 0 0 
-10 0 0 
-10 0 0 
-10 0 0 
-10 0 0 
-10 0 0 
-10 0 0 
-10 0 0 
-10 0 0 
-10 0 0 
-10 0 0 
-10 0 0 
-10 0 0 
-10 0 0 
-10 0 0 
-10 0 0 
-10 0 0 
-10 0 0 
-10 0 0 
-10 0 0 
-10 0 0 
-10 0 0 
-10 0 0 
-10 0 0 
-10 0 0 
-10 0 0 
-10 0 0 
-10 0 0 
-10 0 0 
-10 0 0 
-10 0 0 
-10 0 0 
-10 0 0 
-10 0 0 
-10 0 0 
-10 0 0 
-10 0 0 
-10 0 0 
-10 0 0 
-10 0 0 
-10 0 0 
-10 0 0 
-10 0 0 
-10 0 0 
-10 0 0 
-10 0 0 
-10 0 0 
-10 0 0 
-10 0 0 
-10 0 0 
-10 0 0 
-10 0 0 
-10 0 0 
-10 0 0 
-10 0 0 
-10 0 0 
-10 0 0 
-10 0 0 
-10 0 0 
-10 0 0 
-10 0 0 
-10 0 0 
-10 0 0 
-10 0 0 
-10 0 0 
-10 0 0 
-10 0 0 
-10 0 0 
-10 0 0 
-10 0 0 
-10 0 0 
-10 0 0 
-10 0 0 
-10 0 0 
-10 0 0 
-10 0 0 
-10 0 0 
-10 0 0 
-10 0 0 
-10 0 0 
-10 0 0 
-10 0 0 
-10 0 0 
-10 0 0 
-10 0 0 
-10 0 0 
-10 0 0 
-10 0 0 
-10 0 0 
-10 0 0 
-10 0 0 
-10 0 0 
-10 0 0 
-10 0 0 
-10 0 0 
-10 0 0 
-10 0 0 
-10 0 0 
-10 0 0 
-10 0 0 
-10 0 0 
-10 0 0 
-10 0 0 
-10 0 0 
-10 0 0 
-10 0 0 
-10 0 0 
-10 0 0 
-10 0 0 
-10 0 0 
-10 0 0 
-10 0 0 
-10 0 0 
-10 0 0 
-10 0 0 
-10 0 0 
-10 0 0 
-10 0 0 
-10 0 0 
-10 0 0 
-10 0 0 
-10 0 0 
-10 0 0 
-10 0 0 
-10 0 0 
-10 0 0 
-10 0 0 
-10 0 0 
-10 0 0 
-10 0 0 
-10 0 0 
-10 0 0 
-10 0 0 
-10 0 0 
-10 0 0 
-10 0 0 
-10 0 0 
-10 0 0 
-10 0 0 
-10 0 0 
-10 0 0 
-10 0 0 
-10 0 0 
-10 0 0 
-10 0 0 
-10 0 0 
-10 0 0 
-10 0 0 
-10 0 0 
-10 0 0 
-10 0 0 
-10 0 0 
-10 0 0 
-10 0 0 
-10 0 0 
-10 0 0 
-10 0 0 
-10 0 0 
-10 0 0 
-10 0 0 
-10 0 0 
-10 0 0 
-10 0 0 
-10 0 0 
-10 0 0 
-10 0 0 
-10 0 0 
-10 0 0 
-10 0 0 
-10 0 0 
-10 0 0 
-10 0 0 
-10 0 0 
-10 0 0 
-10 0 0 
-10 0 0 
-10 0 0 
-10 0 0 
-10 0 0 
-10 0 0 
-10 0 0 
-10 0 0 
-10 0 0 
-10 0 0 
-10 0 0 
-10 0 0 
-10 0 0 
-10 0 0 
-10 0 0 
-10 0 0 
-10 0 0 
-10 0 0 
-10 0 0 
-10 0 0 
-10 0 0 
-10 0 0 
-10 0 0 
-10 0 0 
-10 0 0 
-10 0 0 
-10 0 0 
-10 0 0 
-10 0 0 
-10 0 0 
-10 0 0 
-10 0 0 
-10 0 0 
-10 0 0 
-10 0 0 
-10 0 0 
-10 0 0 
-10 0 0 
-10 0 0 
-10 0 0 
-10 0 0 
-10 0 0 
-10 0 0 
-10 0 0 
-10 0 0 
-10 0 0 
-10 0 0 
-10 0 0 
-10 0 0 
-10 0 0 
-10 0 0 
-10 0 0 
-10 0 0 
-10 0 0 
-10 0 0 
-10 0 0 
-10 0 0 
-10 0 0 
-10 0 0 
-10 0 0 
-10 0 0 
-10 0 0 
-10 0 0 
-10 0 0 
-10 0 0 
-10 0 0 
-10 0 0 
-10 0 0 
-10 0 0 
-10 0 0 
-10 0 0 
-10 0 0 
-10 0 0 
-10 0 0 
-10 0 0 
-10 0 0 
-10 0 0 
-10 0 0 
-10 0 0 
-10 0 0 
-10 0 0 
-10 0 0 
-10 0 0 
-10 0 0 
-10 0 0 
-10 0 0 
-10 0 0 
-10 0 0 
-10 0 0 
-10 0 0 
-10 0 0 
-10 0 0 
-10 0 0 
-10 0 0 
-10 0 0 
-10 0 0 
-10 0 0 
-10 0 0 
-10 0 0 
-10 0 0 
-10 0 0 
-10 0 0 
-10 0 0 
-10 0 0 
-10 0 0 
-10 0 0 
-10 0 0 
-10 0 0 
-10 0 0 
-10 0 0 
-10 0 0 
-10 0 0 
-10 0 0 
-10 0 0 
-10 0 0 
-10 0 0 
-10 0 0 
-10 0 0 
-10 0 0 
-10 0 0 
-10 0 0 
-10 0 0 
-10 0 0 
-10 0 0 
-10 0 0 
-10 0 0 
-10 0 0 
-10 0 0 
-10 0 0 
-10 0 0 
-10 0 0 
-10 0 0 
-10 0 0 
-10 0 0 
-10 0 0 
-10 0 0 
-10 0 0 
-10 0 0 
-10 0 0 
-10 0 0 
-10 0 0 
-10 0 0 
-10 0 0 
-10 0 0 
-10 0 0 
-10 0 0 
-10 0 0 
-10 0 0 
-10 0 0 
-10 0 0 
-10 0 0 
-10 0 0 
-10 0 0 
-10 0 0 
-10 0 0 
-10 0 0 
-10 0 0 
-10 0 0 
-10 0 0 
-10 0 0 
-10 0 0 
-10 0 0 
-10 0 0 
-10 0 0 
-10 0 0 
-10 0 0 
-10 0 0 
-10 0 0 
-10 0 0 
-10 0 0 
-10 0 0 
-10 0 0 
-10 0 0 
-10 0 0 
-10 0 0 
-10 0 0 
-10 0 0 
-10 0 0 
-10 0 0 
-10 0 0 
-10 0 0 
-10 0 0 
-10 0 0 
-10 0 0 
-10 0 0 
-10 0 0 
-10 0 0 
-10 0 0 
-10 0 0 
-10 0 0 
-10 0 0 
-10 0 0 
-10 0 0 
-10 0 0 
-10 0 0 
-10 0 0 
-10 0 0 
-10 0 0 
-10 0 0 
-10 0 0 
-10 0 0 
-10 0 0 
-10 0 0 
-10 0 0 
-10 0 0 
-10 0 0 
-10 0 0 
-10 0 0 
-10 0 0 
-10 0 0 
-10 0 0 
-10 0 0 
-10 0 0 
-10 0 0 
-10 0 0 
-10 0 0 
-10 0 0 
-10 0 0 
-10 0 0 
-10 0 0 
-10 0 0 
-10 0 0 
-10 0 0 
-10 0 0 
-10 0 0 
-10 0 0 
-10 0 0 
-10 0 0 
-10 0 0 
-10 0 0 
-10 0 0 
-10 0 0 
-10 0 0 
-10 0 0 
-10 0 0 
-10 0 0 
-10 0 0 
-10 0 0 
-10 0 0 
-10 0 0 
-10 0 0 
-10 0 0 
-10 0 0 
-10 0 0 
-10 0 0 
CDATA:
1 0 0 0 1 0 0 0 1 
1 0 0 0 1 0 0 0 1 
1 0 0 0 1 0 0 0 1 
1 0 0 0 1 0 0 0 1 
1 0 0 0 1 0 0 0 1 
1 0 0 0 1 0 0 0 1 
1 0 0 0 1 0 0 0 1 
1 0 0 0 1 0 0 0 1 
1 0 0 0 1 0 0 0 1 
1 0 0 0 1 0 0 0 1 
1 0 0 0 1 0 0 0 1 
1 0 0 0 1 0 0 0 1 
1 0 0 0 1 0 0 0 1 
1 0 0 0 1 0 0 0 1 
1 0 0 0 1 0 0 0 1 
1 0 0 0 1 0 0 0 1 
1 0 0 0 1 0 0 0 1 
1 0 0 0 1 0 0 0 1 
1 0 0 0 1 0 0 0 1 
1 0 0 0 1 0 0 0 1 
1 0 0 0 1 0 0 0 1 
1 0 0 0 1 0 0 0 1 
1 0 0 0 1 0 0 0 1 
1 0 0 0 1 0 0 0 1 
1 0 0 0 1 0 0 0 1 
1 0 0 0 1 0 0 0 1 
1 0 0 0 1 0 0 0 1 
1 0 0 0 1 0 0 0 1 
1 0 0 0 1 0 0 0 1 
1 0 0 0 1 0 0 0 1 
1 0 0 0 1 0 0 0 1 
1 0 0 0 1 0 0 0 1 
1 0 0 0 1 0 0 0 1 
1 0 0 0 1 0 0 0 1 
1 0 0 0 1 0 0 0 1 
1 0 0 0 1 0 0 0 1 
1 0 0 0 1 0 0 0 1 
1 0 0 0 1 0 0 0 1 
1 0 0 0 1 0 0 0 1 
1 0 0 0 1 0 0 0 1 
1 0 0 0 1 0 0 0 1 
1 0 0 0 1 0 0 0 1 
1 0 0 0 1 0 0 0 1 
1 0 0 0 1 0 0 0 1 
1 0 0 0 1 0 0 0 1 
1 0 0 0 1 0 0 0 1 
1 0 0 0 1 0 0 0 1 
1 0 0 0 1 0 0 0 1 
1 0 0 0 1 0 0 0 1 
1 0 0 0 1 0 0 0 1 
1 0 0 0 1 0 0 0 1 
1 0 0 0 1 0 0 0 1 
1 0 0 0 1 0 0 0 1 
1 0 0 0 1 0 0 0 1 
1 0 0 0 1 0 0 0 1 
1 0 0 0 1 0 0 0 1 
1 0 0 0 1 0 0 0 1 
1 0 0 0 1 0 0 0 1 
1 0 0 0 1 0 0 0 1 
1 0 0 0 1 0 0 0 1 
1 0 0 0 1 0 0 0 1 
1 0 0 0 1 0 0 0 1 
1 0 0 0 1 0 0 0 1 
1 0 0 0 1 0 0 0 1 
1 0 0 0 1 0 0 0 1 
1 0 0 0 1 0 0 0 1 
1 0 0 0 1 0 0 0 1 
1 0 0 0 1 0 0 0 1 
1 0 0 0 1 0 0 0 1 
1 0 0 0 1 0 0 0 1 
1 0 0 0 1 0 0 0 1 
1 0 0 0 1 0 0 0 1 
1 0 0 0 1 0 0 0 1 
1 0 0 0 1 0 0 0 1 
1 0 0 0 1 0 0 0 1 
1 0 0 0 1 0 0 0 1 
1 0 0 0 1 0 0 0 1 
1 0 0 0 1 0 0 0 1 
1 0 0 0 1 0 0 0 1 
1 0 0 0 1 0 0 0 1 
1 0 0 0 1 0 0 0 1 
1 0 0 0 1 0 0 0 1 
1 0 0 0 1 0 0 0 1 
1 0 0 0 1 0 0 0 1 
1 0 0 0 1 0 0 0 1 
1 0 0 0 1 0 0 0 1 
1 0 0 0 1 0 0 0 1 
1 0 0 0 1 0 0 0 1 
1 0 0 0 1 0 0 0 1 
1 0 0 0 1 0 0 0 1 
1 0 0 0 1 0 0 0 1 
1 0 0 0 1 0 0 0 1 
1 0 0 0 1 0 0 0 1 
1 0 0 0 1 0 0 0 1 
1 0 0 0 1 0 0 0 1 
1 0 0 0 1 0 0 0 1 
1 0 0 0 1 0 0 0 1 
1 0 0 0 1 0 0 0 1 
1 0 0 0 1 0 0 0 1 
1 0 0 0 1 0 0 0 1 
1 0 0 0 1 0 0 0 1 
1 0 0 0 1 0 0 0 1 
1 0 0 0 1 0 0 0 1 
1 0 0 0 1 0 0 0 1 
1 0 0 0 1 0 0 0 1 
1 0 0 0 1 0 0 0 1 
1 0 0 0 1 0 0 0 1 
1 0 0 0 1 0 0 0 1 
1 0 0 0 1 0 0 0 1 
1 0 0 0 1 0 0 0 1 
1 0 0 0 1 0 0 0 1 
1 0 0 0 1 0 0 0 1 
1 0 0 0 1 0 0 0 1 
1 0 0 0 1 0 0 0 1 
1 0 0 0 1 0 0 0 1 
1 0 0 0 1 0 0 0 1 
1 0 0 0 1 0 0 0 1 
1 0 0 0 1 0 0 0 1 
1 0 0 0 1 0 0 0 1 
1 0 0 0 1 0 0 0 1 
1 0 0 0 1 0 0 0 1 
1 0 0 0 1 0 0 0 1 
1 0 0 0 1 0 0 0 1 
1 0 0 0 1 0 0 0 1 
1 0 0 0 1 0 0 0 1 
1 0 0 0 1 0 0 0 1 
1 0 0 0 1 0 0 0 1 
1 0 0 0 1 0 0 0 1 
1 0 0 0 1 0 0 0 1 
1 0 0 0 1 0 0 0 1 
1 0 0 0 1 0 0 0 1 
1 0 0 0 1 0 0 0 1 
1 0 0 0 1 0 0 0 1 
1 0 0 0 1 0 0 0 1 
1 0 0 0 1 0 0 0 1 
1 0 0 0 1 0 0 0 1 
1 0 0 0 1 0 0 0 1 
1 0 0 0 1 0 0 0 1 
1 0 0 0 1 0 0 0 1 
1 0 0 0 1 0 0 0 1 
1 0 0 0 1 0 0 0 1 
1 0 0 0 1 0 0 0 1 
1 0 0 0 1 0 0 0 1 
1 0 0 0 1 0 0 0 1 
1 0 0 0 1 0 0 0 1 
1 0 0 0 1 0 0 0 1 
1 0 0 0 1 0 0 0 1 
1 0 0 0 1 0 0 0 1 
1 0 0 0 1 0 0 0 1 
1 0 0 0 1 0 0 0 1 
1 0 0 0 1 0 0 0 1 
1 0 0 0 1 0 0 0 1 
1 0 0 0 1 0 0 0 1 
1 0 0 0 1 0 0 0 1 
1 0 0 0 1 0 0 0 1 
1 0 0 0 1 0 0 0 1 
1 0 0 0 1 0 0 0 1 
1 0 0 0 1 0 0 0 1 
1 0 0 0 1 0 0 0 1 
1 0 0 0 1 0 0 0 1 
1 0 0 0 1 0 0 0 1 
1 0 0 0 1 0 0 0 1 
1 0 0 0 1 0 0 0 1 
1 0 0 0 1 0 0 0 1 
1 0 0 0 1 0 0 0 1 
1 0 0 0 1 0 0 0 1 
1 0 0 0 1 0 0 0 1 
1 0 0 0 1 0 0 0 1 
1 0 0 0 1 0 0 0 1 
1 0 0 0 1 0 0 0 1 
1 0 0 0 1 0 0 0 1 
1 0 0 0 1 0 0 0 1 
1 0 0 0 1 0 0 0 1 
1 0 0 0 1 0 0 0 1 
1 0 0 0 1 0 0 0 1 
1 0 0 0 1 0 0 0 1 
1 0 0 0 1 0 0 0 1 
1 0 0 0 1 0 0 0 1 
1 0 0 0 1 0 0 0 1 
1 0 0 0 1 0 0 0 1 
1 0 0 0 1 0 0 0 1 
1 0 0 0 1 0 0 0 1 
1 0 0 0 1 0 0 0 1 
1 0 0 0 1 0 0 0 1 
1 0 0 0 1 0 0 0 1 
1 0 0 0 1 0 0 0 1 
1 0 0 0 1 0 0 0 1 
1 0 0 0 1 0 0 0 1 
1 0 0 0 1 0 0 0 1 
1 0 0 0 1 0 0 0 1 
1 0 0 0 1 0 0 0 1 
1 0 0 0 1 0 0 0 1 
1 0 0 0 1 0 0 0 1 
1 0 0 0 1 0 0 0 1 
1 0 0 0 1 0 0 0 1 
1 0 0 0 1 0 0 0 1 
1 0 0 0 1 0 0 0 1 
1 0 0 0 1 0 0 0 1 
1 0 0 0 1 0 0 0 1 
1 0 0 0 1 0 0 0 1 
1 0 0 0 1 0 0 0 1 
1 0 0 0 1 0 0 0 1 
1 0 0 0 1 0 0 0 1 
1 0 0 0 1 0 0 0 1 
1 0 0 0 1 0 0 0 1 
1 0 0 0 1 0 0 0 1 
1 0 0 0 1 0 0 0 1 
1 0 0 0 1 0 0 0 1 
1 0 0 0 1 0 0 0 1 
1 0 0 0 1 0 0 0 1 
1 0 0 0 1 0 0 0 1 
1 0 0 0 1 0 0 0 1 
1 0 0 0 1 0 0 0 1 
1 0 0 0 1 0 0 0 1 
1 0 0 0 1 0 0 0 1 
1 0 0 0 1 0 0 0 1 
1 0 0 0 1 0 0 0 1 
1 0 0 0 1 0 0 0 1 
1 0 0 0 1 0 0 0 1 
1 0 0 0 1 0 0 0 1 
1 0 0 0 1 0 0 0 1 
1 0 0 0 1 0 0 0 1 
1 0 0 0 1 0 0 0 1 
1 0 0 0 1 0 0 0 1 
1 0 0 0 1 0 0 0 1 
1 0 0 0 1 0 0 0 1 
1 0 0 0 1 0 0 0 1 
1 0 0 0 1 0 0 0 1 
1 0 0 0 1 0 0 0 1 
1 0 0 0 1 0 0 0 1 
1 0 0 0 1 0 0 0 1 
1 0 0 0 1 0 0 0 1 
1 0 0 0 1 0 0 0 1 
1 0 0 0 1 0 0 0 1 
1 0 0 0 1 0 0 0 1 
1 0 0 0 1 0 0 0 1 
1 0 0 0 1 0 0 0 1 
1 0 0 0 1 0 0 0 1 
1 0 0 0 1 0 0 0 1 
1 0 0 0 1 0 0 0 1 
1 0 0 0 1 0 0 0 1 
1 0 0 0 1 0 0 0 1 
1 0 0 0 1 0 0 0 1 
1 0 0 0 1 0 0 0 1 
1 0 0 0 1 0 0 0 1 
1 0 0 0 1 0 0 0 1 
1 0 0 0 1 0 0 0 1 
1 0 0 0 1 0 0 0 1 
1 0 0 0 1 0 0 0 1 
1 0 0 0 1 0 0 0 1 
1 0 0 0 1 0 0 0 1 
1 0 0 0 1 0 0 0 1 
1 0 0 0 1 0 0 0 1 
1 0 0 0 1 0 0 0 1 
1 0 0 0 1 0 0 0 1 
1 0 0 0 1 0 0 0 1 
1 0 0 0 1 0 0 0 1 
1 0 0 0 1 0 0 0 1 
1 0 0 0 1 0 0 0 1 
1 0 0 0 1 0 0 0 1 
1 0 0 0 1 0 0 0 1 
1 0 0 0 1 0 0 0 1 
1 0 0 0 1 0 0 0 1 
1 0 0 0 1 0 0 0 1 
1 0 0 0 1 0 0 0 1 
1 0 0 0 1 0 0 0 1 
1 0 0 0 1 0 0 0 1 
1 0 0 0 1 0 0 0 1 
1 0 0 0 1 0 0 0 1 
1 0 0 0 1 0 0 0 1 
1 0 0 0 1 0 0 0 1 
1 0 0 0 1 0 0 0 1 
1 0 0 0 1 0 0 0 1 
1 0 0 0 1 0 0 0 1 
1 0 0 0 1 0 0 0 1 
1 0 0 0 1 0 0 0 1 
1 0 0 0 1 0 0 0 1 
1 0 0 0 1 0 0 0 1 
1 0 0 0 1 0 0 0 1 
1 0 0 0 1 0 0 0 1 
1 0 0 0 1 0 0 0 1 
1 0 0 0 1 0 0 0 1 
1 0 0 0 1 0 0 0 1 
1 0 0 0 1 0 0 0 1 
1 0 0 0 1 0 0 0 1 
1 0 0 0 1 0 0 0 1 
1 0 0 0 1 0 0 0 1 
1 0 0 0 1 0 0 0 1 
1 0 0 0 1 0 0 0 1 
1 0 0 0 1 0 0 0 1 
1 0 0 0 1 0 0 0 1 
1 0 0 0 1 0 0 0 1 
1 0 0 0 1 0 0 0 1 
1 0 0 0 1 0 0 0 1 
1 0 0 0 1 0 0 0 1 
1 0 0 0 1 0 0 0 1 
1 0 0 0 1 0 0 0 1 
1 0 0 0 1 0 0 0 1 
1 0 0 0 1 0 0 0 1 
1 0 0 0 1 0 0 0 1 
1 0 0 0 1 0 0 0 1 
1 0 0 0 1 0 0 0 1 
1 0 0 0 1 0 0 0 1 
1 0 0 0 1 0 0 0 1 
1 0 0 0 1 0 0 0 1 
1 0 0 0 1 0 0 0 1 
1 0 0 0 1 0 0 0 1 
1 0 0 0 1 0 0 0 1 
1 0 0 0 1 0 0 0 1 
1 0 0 0 1 0 0 0 1 
1 0 0 0 1 0 0 0 1 
1 0 0 0 1 0 0 0 1 
1 0 0 0 1 0 0 0 1 
1 0 0 0 1 0 0 0 1 
1 0 0 0 1 0 0 0 1 
1 0 0 0 1 0 0 0 1 
1 0 0 0 1 0 0 0 1 
1 0 0 0 1 0 0 0 1 
1 0 0 0 1 0 0 0 1 
1 0 0 0 1 0 0 0 1 
1 0 0 0 1 0 0 0 1 
1 0 0 0 1 0 0 0 1 
1 0 0 0 1 0 0 0 1 
1 0 0 0 1 0 0 0 1 
1 0 0 0 1 0 0 0 1 
1 0 0 0 1 0 0 0 1 
1 0 0 0 1 0 0 0 1 
1 0 0 0 1 0 0 0 1 
1 0 0 0 1 0 0 0 1 
1 0 0 0 1 0 0 0 1 
1 0 0 0 1 0 0 0 1 
1 0 0 0 1 0 0 0 1 
1 0 0 0 1 0 0 0 1 
1 0 0 0 1 0 0 0 1 
1 0 0 0 1 0 0 0 1 
1 0 0 0 1 0 0 0 1 
1 0 0 0 1 0 0 0 1 
1 0 0 0 1 0 0 0 1 
1 0 0 0 1 0 0 0 1 
1 0 0 0 1 0 0 0 1 
1 0 0 0 1 0 0 0 1 
1 0 0 0 1 0 0 0 1 
1 0 0 0 1 0 0 0 1 
1 0 0 0 1 0 0 0 1 
1 0 0 0 1 0 0 0 1 
1 0 0 0 1 0 0 0 1 
1 0 0 0 1 0 0 0 1 
1 0 0 0 1 0 0 0 1 
1 0 0 0 1 0 0 0 1 
1 0 0 0 1 0 0 0 1 
1 0 0 0 1 0 0 0 1 
1 0 0 0 1 0 0 0 1 
1 0 0 0 1 0 0 0 1 
1 0 0 0 1 0 0 0 1 
1 0 0 0 1 0 0 0 1 
1 0 0 0 1 0 0 0 1 
1 0 0 0 1 0 0 0 1 
1 0 0 0 1 0 0 0 1 
1 0 0 0 1 0 0 0 1 
1 0 0 0 1 0 0 0 1 
1 0 0 0 1 0 0 0 1 
1 0 0 0 1 0 0 0 1 
1 0 0 0 1 0 0 0 1 
1 0 0 0 1 0 0 0 1 
1 0 0 0 1 0 0 0 1 
1 0 0 0 1 0 0 0 1 
1 0 0 0 1 0 0 0 1 
1 0 0 0 1 0 0 0 1 
1 0 0 0 1 0 0 0 1 
1 0 0 0 1 0 0 0 1 
1 0 0 0 1 0 0 0 1 
1 0 0 0 1 0 0 0 1 
1 0 0 0 1 0 0 0 1 
1 0 0 0 1 0 0 0 1 
1 0 0 0 1 0 0 0 1 
1 0 0 0 1 0 0 0 1 
1 0 0 0 1 0 0 0 1 
1 0 0 0 1 0 0 0 1 
1 0 0 0 1 0 0 0 1 
1 0 0 0 1 0 0 0 1 
1 0 0 0 1 0 0 0 1 
1 0 0 0 1 0 0 0 1 
1 0 0 0 1 0 0 0 1 
1 0 0 0 1 0 0 0 1 
1 0 0 0 1 0 0 0 1 
1 0 0 0 1 0 0 0 1 
1 0 0 0 1 0 0 0 1 
1 0 0 0 1 0 0 0 1 
1 0 0 0 1 0 0 0 1 
1 0 0 0 1 0 0 0 1 
1 0 0 0 1 0 0 0 1 
1 0 0 0 1 0 0 0 1 
1 0 0 0 1 0 0 0 1 
1 0 0 0 1 0 0 0 1 
1 0 0 0 1 0 0 0 1 
1 0 0 0 1 0 0 0 1 
1 0 0 0 1 0 0 0 1 
1 0 0 0 1 0 0 0 1 
1 0 0 0 1 0 0 0 1 
1 0 0 0 1 0 0 0 1 
1 0 0 0 1 0 0 0 1 
1 0 0 0 1 0 0 0 1 
1 0 0 0 1 0 0 0 1 
1 0 0 0 1 0 0 0 1 
1 0 0 0 1 0 0 0 1 
1 0 0 0 1 0 0 0 1 
1 0 0 0 1 0 0 0 1 
1 0 0 0 1 0 0 0 1 
1 0 0 0 1 0 0 0 1 
1 0 0 0 1 0 0 0 1 
1 0 0 0 1 0 0 0 1 
1 0 0 0 1 0 0 0 1 
1 0 0 0 1 0 0 0 1 
1 0 0 0 1 0 0 0 1 
1 0 0 0 1 0 0 0 1 
1 0 0 0 1 0 0 0 1 
1 0 0 0 1 0 0 0 1 
1 0 0 0 1 0 0 0 1 
1 0 0 0 1 0 0 0 1 
1 0 0 0 1 0 0 0 1 
1 0 0 0 1 0 0 0 1 
1 0 0 0 1 0 0 0 1 
1 0 0 0 1 0 0 0 1 
1 0 0 0 1 0 0 0 1 
1 0 0 0 1 0 0 0 1 
1 0 0 0 1 0 0 0 1 
1 0 0 0 1 0 0 0 1 
1 0 0 0 1 0 0 0 1 
1 0 0 0 1 0 0 0 1 
1 0 0 0 1 0 0 0 1 
1 0 0 0 1 0 0 0 1 
1 0 0 0 1 0 0 0 1 
1 0 0 0 1 0 0 0 1 
1 0 0 0 1 0 0 0 1 
1 0 0 0 1 0 0 0 1 
1 0 0 0 1 0 0 0 1 
1 0 0 0 1 0 0 0 1 
1 0 0 0 1 0 0 0 1 
1 0 0 0 1 0 0 0 1 
1 0 0 0 1 0 0 0 1 
1 0 0 0 1 0 0 0 1 
1 0 0 0 1 0 0 0 1 
1 0 0 0 1 0 0 0 1 
1 0 0 0 1 0 0 0 1 
1 0 0 0 1 0 0 0 1 
1 0 0 0 1 0 0 0 1 
1 0 0 0 1 0 0 0 1 
1 0 0 0 1 0 0 0 1 
1 0 0 0 1 0 0 0 1 
1 0 0 0 1 0 0 0 1 
1 0 0 0 1 0 0 0 1 
1 0 0 0 1 0 0 0 1 
1 0 0 0 1 0 0 0 1 
1 0 0 0 1 0 0 0 1 
1 0 0 0 1 0 0 0 1 
1 0 0 0 1 0 0 0 1 
1 0 0 0 1 0 0 0 1 
1 0 0 0 1 0 0 0 1 
1 0 0 0 1 0 0 0 1 
1 0 0 0 1 0 0 0 1 
1 0 0 0 1 0 0 0 1 
1 0 0 0 1 0 0 0 1 
1 0 0 0 1 0 0 0 1 
1 0 0 0 1 0 0 0 1 
1 0 0 0 1 0 0 0 1 
1 0 0 0 1 0 0 0 1 
1 0 0 0 1 0 0 0 1 
1 0 0 0 1 0 0 0 1 
1 0 0 0 1 0 0 0 1 
1 0 0 0 1 0 0 0 1 
1 0 0 0 1 0 0 0 1 
1 0 0 0 1 0 0 0 1 
1 0 0 0 1 0 0 0 1 
1 0 0 0 1 0 0 0 1 
1 0 0 0 1 0 0 0 1 
1 0 0 0 1 0 0 0 1 
1 0 0 0 1 0 0 0 1 
1 0 0 0 1 0 0 0 1 
1 0 0 0 1 0 0 0 1 
1 0 0 0 1 0 0 0 1 
1 0 0 0 1 0 0 0 1 
1 0 0 0 1 0 0 0 1 
1 0 0 0 1 0 0 0 1 
1 0 0 0 1 0 0 0 1 
1 0 0 0 1 0 0 0 1 
1 0 0 0 1 0 0 0 1 
1 0 0 0 1 0 0 0 1 
1 0 0 0 1 0 0 0 1 
1 0 0 0 1 0 0 0 1 
1 0 0 0 1 0 0 0 1 
1 0 0 0 1 0 0 0 1 
1 0 0 0 1 0 0 0 1 
1 0 0 0 1 0 0 0 1 
1 0 0 0 1 0 0 0 1 
1 0 0 0 1 0 0 0 1 
1 0 0 0 1 0 0 0 1 
1 0 0 0 1 0 0 0 1 
1 0 0 0 1 0 0 0 1 
1 0 0 0 1 0 0 0 1 
1 0 0 0 1 0 0 0 1 
1 0 0 0 1 0 0 0 1 
1 0 0 0 1 0 0 0 1 
1 0 0 0 1 0 0 0 1 
1 0 0 0 1 0 0 0 1 
1 0 0 0 1 0 0 0 1 
1 0 0 0 1 0 0 0 1 
1 0 0 0 1 0 0 0 1 
1 0 0 0 1 0 0 0 1 
1 0 0 0 1 0 0 0 1 
1 0 0 0 1 0 0 0 1 
1 0 0 0 1 0 0 0 1 
1 0 0 0 1 0 0 0 1 
1 0 0 0 1 0 0 0 1 
1 0 0 0 1 0 0 0 1 
1 0 0 0 1 0 0 0 1 
1 0 0 0 1 0 0 0 1 
1 0 0 0 1 0 0 0 1 
1 0 0 0 1 0 0 0 1 
1 0 0 0 1 0 0 0 1 
1 0 0 0 1 0 0 0 1 
1 0 0 0 1 0 0 0 1 
1 0 0 0 1 0 0 0 1 
1 0 0 0 1 0 0 0 1 
1 0 0 0 1 0 0 0 1 
1 0 0 0 1 0 0 0 1 
1 0 0 0 1 0 0 0 1 
1 0 0 0 1 0 0 0 1 
1 0 0 0 1 0 0 0 1 
1 0 0 0 1 0 0 0 1 
1 0 0 0 1 0 0 0 1 
1 0 0 0 1 0 0 0 1 
1 0 0 0 1 0 0 0 1 
1 0 0 0 1 0 0 0 1 
1 0 0 0 1 0 0 0 1 
1 0 0 0 1 0 0 0 1 
1 0 0 0 1 0 0 0 1 
1 0 0 0 1 0 0 0 1 
1 0 0 0 1 0 0 0 1 
1 0 0 0 1 0 0 0 1 
1 0 0 0 1 0 0 0 1 
1 0 0 0 1 0 0 0 1 
1 0 0 0 1 0 0 0 1 
1 0 0 0 1 0 0 0 1 
1 0 0 0 1 0 0 0 1 
1 0 0 0 1 0 0 0 1 
1 0 0 0 1 0 0 0 1 
1 0 0 0 1 0 0 0 1 
1 0 0 0 1 0 0 0 1 
1 0 0 0 1 0 0 0 1 
1 0 0 0 1 0 0 0 1 
1 0 0 0 1 0 0 0 1 
1 0 0 0 1 0 0 0 1 
1 0 0 0 1 0 0 0 1 
1 0 0 0 1 0 0 0 1 
1 0 0 0 1 0 0 0 1 
1 0 0 0 1 0 0 0 1 
1 0 0 0 1 0 0 0 1 
1 0 0 0 1 0 0 0 1 
1 0 0 0 1 0 0 0 1 
1 0 0 0 1 0 0 0 1 
1 0 0 0 1 0 0 0 1 
1 0 0 0 1 0 0 0 1 
1 0 0 0 1 0 0 0 1 
1 0 0 0 1 0 0 0 1 
1 0 0 0 1 0 0 0 1 
1 0 0 0 1 0 0 0 1 
1 0 0 0 1 0 0 0 1 
1 0 0 0 1 0 0 0 1 
1 0 0 0 1 0 0 0 1 
1 0 0 0 1 0 0 0 1 
1 0 0 0 1 0 0 0 1 
1 0 0 0 1 0 0 0 1 
1 0 0 0 1 0 0 0 1 
1 0 0 0 1 0 0 0 1 
1 0 0 0 1 0 0 0 1 
1 0 0 0 1 0 0 0 1 
1 0 0 0 1 0 0 0 1 
1 0 0 0 1 0 0 0 1 
1 0 0 0 1 0 0 0 1 
1 0 0 0 1 0 0 0 1 
1 0 0 0 1 0 0 0 1 
1 0 0 0 1 0 0 0 1 
1 0 0 0 1 0 0 0 1 
1 0 0 0 1 0 0 0 1 
1 0 0 0 1 0 0 0 1 
1 0 0 0 1 0 0 0 1 
1 0 0 0 1 0 0 0 1 
1 0 0 0 1 0 0 0 1 
1 0 0 0 1 0 0 0 1 
1 0 0 0 1 0 0 0 1 
1 0 0 0 1 0 0 0 1 
1 0 0 0 1 0 0 0 1 
1 0 0 0 1 0 0 0 1 
1 0 0 0 1 0 0 0 1 
1 0 0 0 1 0 0 0 1 
1 0 0 0 1 0 0 0 1 
1 0 0 0 1 0 0 0 1 
1 0 0 0 1 0 0 0 1 
1 0 0 0 1 0 0 0 1 
1 0 0 0 1 0 0 0 1 
1 0 0 0 1 0 0 0 1 
1 0 0 0 1 0 0 0 1 
1 0 0 0 1 0 0 0 1 
1 0 0 0 1 0 0 0 1 
1 0 0 0 1 0 0 0 1 
1 0 0 0 1 0 0 0 1 
1 0 0 0 1 0 0 0 1 
1 0 0 0 1 0 0 0 1 
1 0 0 0 1 0 0 0 1 
1 0 0 0 1 0 0 0 1 
1 0 0 0 1 0 0 0 1 
1 0 0 0 1 0 0 0 1 
1 0 0 0 1 0 0 0 1 
1 0 0 0 1 0 0 0 1 
1 0 0 0 1 0 0 0 1 
1 0 0 0 1 0 0 0 1 
1 0 0 0 1 0 0 0 1 
1 0 0 0 1 0 0 0 1 
1 0 0 0 1 0 0 0 1 
1 0 0 0 1 0 0 0 1 
1 0 0 0 1 0 0 0 1 
1 0 0 0 1 0 0 0 1 
1 0 0 0 1 0 0 0 1 
1 0 0 0 1 0 0 0 1 
1 0 0 0 1 0 0 0 1 
1 0 0 0 1 0 0 0 1 
1 0 0 0 1 0 0 0 1 
1 0 0 0 1 0 0 0 1 
1 0 0 0 1 0 0 0 1 
1 0 0 0 1 0 0 0 1 
1 0 0 0 1 0 0 0 1 
1 0 0 0 1 0 0 0 1 
1 0 0 0 1 0 0 0 1 
1 0 0 0 1 0 0 0 1 
1 0 0 0 1 0 0 0 1 
1 0 0 0 1 0 0 0 1 
1 0 0 0 1 0 0 0 1 
1 0 0 0 1 0 0 0 1 
1 0 0 0 1 0 0 0 1 
1 0 0 0 1 0 0 0 1 
1 0 0 0 1 0 0 0 1 
1 0 0 0 1 0 0 0 1 
1 0 0 0 1 0 0 0 1 
1 0 0 0 1 0 0 0 1 
1 0 0 0 1 0 0 0 1 
1 0 0 0 1 0 0 0 1 
1 0 0 0 1 0 0 0 1 
1 0 0 0 1 0 0 0 1 
1 0 0 0 1 0 0 0 1 
1 0 0 0 1 0 0 0 1 
1 0 0 0 1 0 0 0 1 
1 0 0 0 1 0 0 0 1 
1 0 0 0 1 0 0 0 1 
1 0 0 0 1 0 0 0 1 
1 0 0 0 1 0 0 0 1 
1 0 0 0 1 0 0 0 1 
1 0 0 0 1 0 0 0 1 
1 0 0 0 1 0 0 0 1 
1 0 0 0 1 0 0 0 1 
1 0 0 0 1 0 0 0 1 
1 0 0 0 1 0 0 0 1 
1 0 0 0 1 0 0 0 1 
1 0 0 0 1 0 0 0 1 
1 0 0 0 1 0 0 0 1 
1 0 0 0 1 0 0 0 1 
1 0 0 0 1 0 0 0 1 
1 0 0 0 1 0 0 0 1 
1 0 0 0 1 0 0 0 1 
1 0 0 0 1 0 0 0 1 
1 0 0 0 1 0 0 0 1 
1 0 0 0 1 0 0 0 1 
1 0 0 0 1 0 0 0 1 
1 0 0 0 1 0 0 0 1 
1 0 0 0 1 0 0 0 1 
1 0 0 0 1 0 0 0 1 
1 0 0 0 1 0 0 0 1 
1 0 0 0 1 0 0 0 1 
1 0 0 0 1 0 0 0 1 
1 0 0 0 1 0 0 0 1 
1 0 0 0 1 0 0 0 1 
1 0 0 0 1 0 0 0 1 
1 0 0 0 1 0 0 0 1 
1 0 0 0 1 0 0 0 1 
1 0 0 0 1 0 0 0 1 
1 0 0 0 1 0 0 0 1 
1 0 0 0 1 0 0 0 1 
1 0 0 0 1 0 0 0 1 
1 0 0 0 1 0 0 0 1 
1 0 0 0 1 0 0 0 1 
1 0 0 0 1 0 0 0 1 
1 0 0 0 1 0 0 0 1 
1 0 0 0 1 0 0 0 1 
1 0 0 0 1 0 0 0 1 
1 0 0 0 1 0 0 0 1 
1 0 0 0 1 0 0 0 1 
1 0 0 0 1 0 0 0 1 
1 0 0 0 1 0 0 0 1 
1 0 0 0 1 0 0 0 1 
1 0 0 0 1 0 0 0 1 
1 0 0 0 1 0 0 0 1 
1 0 0 0 1 0 0 0 1 
1 0 0 0 1 0 0 0 1 
1 0 0 0 1 0 0 0 1 
1 0 0 0 1 0 0 0 1 
1 0 0 0 1 0 0 0 1 
1 0 0 0 1 0 0 0 1 
1 0 0 0 1 0 0 0 1 
1 0 0 0 1 0 0 0 1 
1 0 0 0 1 0 0 0 1 
1 0 0 0 1 0 0 0 1 
1 0 0 0 1 0 0 0 1 
1 0 0 0 1 0 0 0 1 
1 0 0 0 1 0 0 0 1 
1 0 0 0 1 0 0 0 1 
1 0 0 0 1 0 0 0 1 
1 0 0 0 1 0 0 0 1 
1 0 0 0 1 0 0 0 1 
1 0 0 0 1 0 0 0 1 
1 0 0 0 1 0 0 0 1 
1 0 0 0 1 0 0 0 1 
1 0 0 0 1 0 0 0 1 
1 0 0 0 1 0 0 0 1 
1 0 0 0 1 0 0 0 1 
1 0 0 0 1 0 0 0 1 
1 0 0 0 1 0 0 0 1 
1 0 0 0 1 0 0 0 1 
1 0 0 0 1 0 0 0 1 
1 0 0 0 1 0 0 0 1 
1 0 0 0 1 0 0 0 1 
1 0 0 0 1 0 0 0 1 
1 0 0 0 1 0 0 0 1 
1 0 0 0 1 0 0 0 1 
1 0 0 0 1 0 0 0 1 
1 0 0 0 1 0 0 0 1 
1 0 0 0 1 0 0 0 1 
1 0 0 0 1 0 0 0 1 
1 0 0 0 1 0 0 0 1 
1 0 0 0 1 0 0 0 1 
1 0 0 0 1 0 0 0 1 
1 0 0 0 1 0 0 0 1 
1 0 0 0 1 0 0 0 1 
1 0 0 0 1 0 0 0 1 
1 0 0 0 1 0 0 0 1 
1 0 0 0 1 0 0 0 1 
1 0 0 0 1 0 0 0 1 
1 0 0 0 1 0 0 0 1 
1 0 0 0 1 0 0 0 1 
1 0 0 0 1 0 0 0 1 
1 0 0 0 1 0 0 0 1 
1 0 0 0 1 0 0 0 1 
1 0 0 0 1 0 0 0 1 
1 0 0 0 1 0 0 0 1 
1 0 0 0 1 0 0 0 1 
1 0 0 0 1 0 0 0 1 
1 0 0 0 1 0 0 0 1 
1 0 0 0 1 0 0 0 1 
1 0 0 0 1 0 0 0 1 
1 0 0 0 1 0 0 0 1 
1 0 0 0 1 0 0 0 1 
1 0 0 0 1 0 0 0 1 
1 0 0 0 1 0 0 0 1 
1 0 0 0 1 0 0 0 1 
1 0 0 0 1 0 0 0 1 
1 0 0 0 1 0 0 0 1 
1 0 0 0 1 0 0 0 1 
1 0 0 0 1 0 0 0 1 
1 0 0 0 1 0 0 0 1 
1 0 0 0 1 0 0 0 1 
1 0 0 0 1 0 0 0 1 
1 0 0 0 1 0 0 0 1 
1 0 0 0 1 0 0 0 1 
1 0 0 0 1 0 0 0 1 
1 0 0 0 1 0 0 0 1 
1 0 0 0 1 0 0 0 1 
1 0 0 0 1 0 0 0 1 
1 0 0 0 1 0 0 0 1 
1 0 0 0 1 0 0 0 1 
1 0 0 0 1 0 0 0 1 
1 0 0 0 1 0 0 0 1 
1 0 0 0 1 0 0 0 1 
1 0 0 0 1 0 0 0 1 
1 0 0 0 1 0 0 0 1 
1 0 0 0 1 0 0 0 1 
1 0 0 0 1 0 0 0 1 
1 0 0 0 1 0 0 0 1 
1 0 0 0 1 0 0 0 1 
1 0 0 0 1 0 0 0 1 
1 0 0 0 1 0 0 0 1 
1 0 0 0 1 0 0 0 1 
1 0 0 0 1 0 0 0 1 
1 0 0 0 1 0 0 0 1 
1 0 0 0 1 0 0 0 1 
1 0 0 0 1 0 0 0 1 
1 0 0 0 1 0 0 0 1 
1 0 0 0 1 0 0 0 1 
1 0 0 0 1 0 0 0 1 
1 0 0 0 1 0 0 0 1 
1 0 0 0 1 0 0 0 1 
1 0 0 0 1 0 0 0 1 
1 0 0 0 1 0 0 0 1 
1 0 0 0 1 0 0 0 1 
1 0 0 0 1 0 0 0 1 
1 0 0 0 1 0 0 0 1 
1 0 0 0 1 0 0 0 1 
1 0 0 0 1 0 0 0 1 
1 0 0 0 1 0 0 0 1 
1 0 0 0 1 0 0 0 1 
1 0 0 0 1 0 0 0 1 
1 0 0 0 1 0 0 0 1 
1 0 0 0 1 0 0 0 1 
1 0 0 0 1 0 0 0 1 
1 0 0 0 1 0 0 0 1 
1 0 0 0 1 0 0 0 1 
1 0 0 0 1 0 0 0 1 
1 0 0 0 1 0 0 0 1 
1 0 0 0 1 0 0 0 1 
1 0 0 0 1 0 0 0 1 
1 0 0 0 1 0 0 0 1 
1 0 0 0 1 0 0 0 1 
1 0 0 0 1 0 0 0 1 
1 0 0 0 1 0 0 0 1 
1 0 0 0 1 0 0 0 1 
1 0 0 0 1 0 0 0 1 
1 0 0 0 1 0 0 0 1 
1 0 0 0 1 0 0 0 1 
1 0 0 0 1 0 0 0 1 
1 0 0 0 1 0 0 0 1 
1 0 0 0 1 0 0 0 1 
1 0 0 0 1 0 0 0 1 
1 0 0 0 1 0 0 0 1 
1 0 0 0 1 0 0 0 1 
1 0 0 0 1 0 0 0 1 
