POINTS:
0.0 0.0
0.0 1.0
0.0 2.0
0.0 3.0
1.0 0.0
1.0 1.0
1.0 2.0
1.0 3.0
2.0 0.0
2.0 1.0
2.0 2.0
2.0 3.0
3.0 0.0
3.0 1.0
3.0 2.0
3.0 3.0
CELLS:
3 0 0 4 5
3 0 0 5 1
3 0 1 5 6
3 0 1 6 2
3 0 2 6 7
3 0 2 7 3
3 0 4 8 9
3 0 4 9 5
3 0 5 9 10
3 0 5 10 6
3 0 6 10 11
3 0 6 11 7
3 0 8 12 13
3 0 8 13 9
3 0 9 13 14
3 0 9 14 10
3 0 10 14 15
3 0 10 15 11
FACES:
VDATA:
3 0.0 0.002 20
3 0.0 0.002 20
3 -10.0 0.0 0.0
3 -10.0 0.0 0.0
3 0.0 0.002 20
3 0.0 0.002 20
3 -10.0 0.0 0.0
3 -10.0 0.0 0.0
3 -10.0 0.0 0.0
3 -10.0 0.0 0.0
3 -10.0 0.0 0.0
3 -10.0 0.0 0.0
3 -10.0 0.0 0.0
3 -10.0 0.0 0.0
3 -10.0 0.0 0.0
3 -10.0 0.0 0.0
CDATA:
9 1 0 0 0 1 0 0 0 1
9 1 0 0 0 1 0 0 0 1
9 1 0 0 0 1 0 0 0 1
9 1 0 0 0 1 0 0 0 1
9 1 0 0 0 1 0 0 0 1
9 1 0 0 0 1 0 0 0 1
9 1 0 0 0 1 0 0 0 1
9 1 0 0 0 1 0 0 0 1
9 1 0 0 0 1 0 0 0 1
9 1 0 0 0 1 0 0 0 1
9 1 0 0 0 1 0 0 0 1
9 1 0 0 0 1 0 0 0 1
9 1 0 0 0 1 0 0 0 1
9 1 0 0 0 1 0 0 0 1
9 1 0 0 0 1 0 0 0 1
9 1 0 0 0 1 0 0 0 1
9 1 0 0 0 1 0 0 0 1
9 1 0 0 0 1 0 0 0 1
