POINTS:
0.0 0.0
0.0 0.1
0.1 0.0
0.1 0.1
0.2 0.0
0.2 0.1
0.3 0.0
0.3 0.1
0.4 0.0
0.4 0.1
0.5 0.0
0.5 0.1
0.6 0.0
0.6 0.1
0.7 0.0
0.7 0.1
0.8 0.0
0.8 0.1
0.9 0.0
0.9 0.1
1.0 0.0
1.0 0.1
1.1 0.0
1.1 0.1
1.2 0.0
1.2 0.1
1.3 0.0
1.3 0.1
1.4 0.0
1.4 0.1
1.5 0.0
1.5 0.1
1.6 0.0
1.6 0.1
1.7 0.0
1.7 0.1
1.8 0.0
1.8 0.1
1.9 0.0
1.9 0.1
2.0 0.0
2.0 0.1
2.1 0.0
2.1 0.1
2.2 0.0
2.2 0.1
2.3 0.0
2.3 0.1
2.4 0.0
2.4 0.1
2.5 0.0
2.5 0.1
2.6 0.0
2.6 0.1
2.7 0.0
2.7 0.1
2.8 0.0
2.8 0.1
2.9 0.0
2.9 0.1
3.0 0.0
3.0 0.1
3.1 0.0
3.1 0.1
3.2 0.0
3.2 0.1
3.3 0.0
3.3 0.1
3.4 0.0
3.4 0.1
3.5 0.0
3.5 0.1
3.6 0.0
3.6 0.1
3.7 0.0
3.7 0.1
3.8 0.0
3.8 0.1
3.9 0.0
3.9 0.1
4.0 0.0
4.0 0.1
4.1 0.0
4.1 0.1
4.2 0.0
4.2 0.1
4.3 0.0
4.3 0.1
4.4 0.0
4.4 0.1
4.5 0.0
4.5 0.1
4.6 0.0
4.6 0.1
4.7 0.0
4.7 0.1
4.8 0.0
4.8 0.1
4.9 0.0
4.9 0.1
5.0 0.0
5.0 0.1
5.1 0.0
5.1 0.1
5.2 0.0
5.2 0.1
5.3 0.0
5.3 0.1
5.4 0.0
5.4 0.1
5.5 0.0
5.5 0.1
5.6 0.0
5.6 0.1
5.7 0.0
5.7 0.1
5.8 0.0
5.8 0.1
5.9 0.0
5.9 0.1
6.0 0.0
6.0 0.1
6.1 0.0
6.1 0.1
6.2 0.0
6.2 0.1
6.3 0.0
6.3 0.1
6.4 0.0
6.4 0.1
6.5 0.0
6.5 0.1
6.6 0.0
6.6 0.1
6.7 0.0
6.7 0.1
6.8 0.0
6.8 0.1
6.9 0.0
6.9 0.1
7.0 0.0
7.0 0.1
7.1 0.0
7.1 0.1
7.2 0.0
7.2 0.1
7.3 0.0
7.3 0.1
7.4 0.0
7.4 0.1
7.5 0.0
7.5 0.1
7.6 0.0
7.6 0.1
7.7 0.0
7.7 0.1
7.8 0.0
7.8 0.1
7.9 0.0
7.9 0.1
8.0 0.0
8.0 0.1
8.1 0.0
8.1 0.1
8.2 0.0
8.2 0.1
8.3 0.0
8.3 0.1
8.4 0.0
8.4 0.1
8.5 0.0
8.5 0.1
8.6 0.0
8.6 0.1
8.7 0.0
8.7 0.1
8.8 0.0
8.8 0.1
8.9 0.0
8.9 0.1
9.0 0.0
9.0 0.1
9.1 0.0
9.1 0.1
9.2 0.0
9.2 0.1
9.3 0.0
9.3 0.1
9.4 0.0
9.4 0.1
9.5 0.0
9.5 0.1
9.6 0.0
9.6 0.1
9.7 0.0
9.7 0.1
9.8 0.0
9.8 0.1
9.9 0.0
9.9 0.1
10.0 0.0
10.0 0.1
CELLS:
4 0 0 2 3 1
4 0 2 4 5 3
4 0 4 6 7 5
4 0 6 8 9 7
4 0 8 10 11 9
4 0 10 12 13 11
4 0 12 14 15 13
4 0 14 16 17 15
4 0 16 18 19 17
4 0 18 20 21 19
4 0 20 22 23 21
4 0 22 24 25 23
4 0 24 26 27 25
4 0 26 28 29 27
4 0 28 30 31 29
4 0 30 32 33 31
4 0 32 34 35 33
4 0 34 36 37 35
4 0 36 38 39 37
4 0 38 40 41 39
4 0 40 42 43 41
4 0 42 44 45 43
4 0 44 46 47 45
4 0 46 48 49 47
4 0 48 50 51 49
4 0 50 52 53 51
4 0 52 54 55 53
4 0 54 56 57 55
4 0 56 58 59 57
4 0 58 60 61 59
4 0 60 62 63 61
4 0 62 64 65 63
4 0 64 66 67 65
4 0 66 68 69 67
4 0 68 70 71 69
4 0 70 72 73 71
4 0 72 74 75 73
4 0 74 76 77 75
4 0 76 78 79 77
4 0 78 80 81 79
4 0 80 82 83 81
4 0 82 84 85 83
4 0 84 86 87 85
4 0 86 88 89 87
4 0 88 90 91 89
4 0 90 92 93 91
4 0 92 94 95 93
4 0 94 96 97 95
4 0 96 98 99 97
4 0 98 100 101 99
4 0 100 102 103 101
4 0 102 104 105 103
4 0 104 106 107 105
4 0 106 108 109 107
4 0 108 110 111 109
4 0 110 112 113 111
4 0 112 114 115 113
4 0 114 116 117 115
4 0 116 118 119 117
4 0 118 120 121 119
4 0 120 122 123 121
4 0 122 124 125 123
4 0 124 126 127 125
4 0 126 128 129 127
4 0 128 130 131 129
4 0 130 132 133 131
4 0 132 134 135 133
4 0 134 136 137 135
4 0 136 138 139 137
4 0 138 140 141 139
4 0 140 142 143 141
4 0 142 144 145 143
4 0 144 146 147 145
4 0 146 148 149 147
4 0 148 150 151 149
4 0 150 152 153 151
4 0 152 154 155 153
4 0 154 156 157 155
4 0 156 158 159 157
4 0 158 160 161 159
4 0 160 162 163 161
4 0 162 164 165 163
4 0 164 166 167 165
4 0 166 168 169 167
4 0 168 170 171 169
4 0 170 172 173 171
4 0 172 174 175 173
4 0 174 176 177 175
4 0 176 178 179 177
4 0 178 180 181 179
4 0 180 182 183 181
4 0 182 184 185 183
4 0 184 186 187 185
4 0 186 188 189 187
4 0 188 190 191 189
4 0 190 192 193 191
4 0 192 194 195 193
4 0 194 196 197 195
4 0 196 198 199 197
4 0 198 200 201 199
FACES:
2 199 0 1
VDATA:
3 0.0 0.002 20
3 0.0 0.002 20
3 0.0 0.002 20
3 0.0 0.002 20
3 0.0 0.002 20
3 0.0 0.002 20
3 0.0 0.002 20
3 0.0 0.002 20
3 0.0 0.002 20
3 0.0 0.002 20
3 0.0 0.002 20
3 0.0 0.002 20
3 0.0 0.002 20
3 0.0 0.002 20
3 0.0 0.002 20
3 0.0 0.002 20
3 0.0 0.002 20
3 0.0 0.002 20
3 0.0 0.002 20
3 0.0 0.002 20
3 0.0 0.002 20
3 0.0 0.002 20
3 -10.0 0.0 0.0
3 -10.0 0.0 0.0
3 -10.0 0.0 0.0
3 -10.0 0.0 0.0
3 -10.0 0.0 0.0
3 -10.0 0.0 0.0
3 -10.0 0.0 0.0
3 -10.0 0.0 0.0
3 -10.0 0.0 0.0
3 -10.0 0.0 0.0
3 -10.0 0.0 0.0
3 -10.0 0.0 0.0
3 -10.0 0.0 0.0
3 -10.0 0.0 0.0
3 -10.0 0.0 0.0
3 -10.0 0.0 0.0
3 -10.0 0.0 0.0
3 -10.0 0.0 0.0
3 -10.0 0.0 0.0
3 -10.0 0.0 0.0
3 -10.0 0.0 0.0
3 -10.0 0.0 0.0
3 -10.0 0.0 0.0
3 -10.0 0.0 0.0
3 -10.0 0.0 0.0
3 -10.0 0.0 0.0
3 -10.0 0.0 0.0
3 -10.0 0.0 0.0
3 -10.0 0.0 0.0
3 -10.0 0.0 0.0
3 -10.0 0.0 0.0
3 -10.0 0.0 0.0
3 -10.0 0.0 0.0
3 -10.0 0.0 0.0
3 -10.0 0.0 0.0
3 -10.0 0.0 0.0
3 -10.0 0.0 0.0
3 -10.0 0.0 0.0
3 -10.0 0.0 0.0
3 -10.0 0.0 0.0
3 -10.0 0.0 0.0
3 -10.0 0.0 0.0
3 -10.0 0.0 0.0
3 -10.0 0.0 0.0
3 -10.0 0.0 0.0
3 -10.0 0.0 0.0
3 -10.0 0.0 0.0
3 -10.0 0.0 0.0
3 -10.0 0.0 0.0
3 -10.0 0.0 0.0
3 -10.0 0.0 0.0
3 -10.0 0.0 0.0
3 -10.0 0.0 0.0
3 -10.0 0.0 0.0
3 -10.0 0.0 0.0
3 -10.0 0.0 0.0
3 -10.0 0.0 0.0
3 -10.0 0.0 0.0
3 -10.0 0.0 0.0
3 -10.0 0.0 0.0
3 -10.0 0.0 0.0
3 -10.0 0.0 0.0
3 -10.0 0.0 0.0
3 -10.0 0.0 0.0
3 -10.0 0.0 0.0
3 -10.0 0.0 0.0
3 -10.0 0.0 0.0
3 -10.0 0.0 0.0
3 -10.0 0.0 0.0
3 -10.0 0.0 0.0
3 -10.0 0.0 0.0
3 -10.0 0.0 0.0
3 -10.0 0.0 0.0
3 -10.0 0.0 0.0
3 -10.0 0.0 0.0
3 -10.0 0.0 0.0
3 -10.0 0.0 0.0
3 -10.0 0.0 0.0
3 -10.0 0.0 0.0
3 -10.0 0.0 0.0
3 -10.0 0.0 0.0
3 -10.0 0.0 0.0
3 -10.0 0.0 0.0
3 -10.0 0.0 0.0
3 -10.0 0.0 0.0
3 -10.0 0.0 0.0
3 -10.0 0.0 0.0
3 -10.0 0.0 0.0
3 -10.0 0.0 0.0
3 -10.0 0.0 0.0
3 -10.0 0.0 0.0
3 -10.0 0.0 0.0
3 -10.0 0.0 0.0
3 -10.0 0.0 0.0
3 -10.0 0.0 0.0
3 -10.0 0.0 0.0
3 -10.0 0.0 0.0
3 -10.0 0.0 0.0
3 -10.0 0.0 0.0
3 -10.0 0.0 0.0
3 -10.0 0.0 0.0
3 -10.0 0.0 0.0
3 -10.0 0.0 0.0
3 -10.0 0.0 0.0
3 -10.0 0.0 0.0
3 -10.0 0.0 0.0
3 -10.0 0.0 0.0
3 -10.0 0.0 0.0
3 -10.0 0.0 0.0
3 -10.0 0.0 0.0
3 -10.0 0.0 0.0
3 -10.0 0.0 0.0
3 -10.0 0.0 0.0
3 -10.0 0.0 0.0
3 -10.0 0.0 0.0
3 -10.0 0.0 0.0
3 -10.0 0.0 0.0
3 -10.0 0.0 0.0
3 -10.0 0.0 0.0
3 -10.0 0.0 0.0
3 -10.0 0.0 0.0
3 -10.0 0.0 0.0
3 -10.0 0.0 0.0
3 -10.0 0.0 0.0
3 -10.0 0.0 0.0
3 -10.0 0.0 0.0
3 -10.0 0.0 0.0
3 -10.0 0.0 0.0
3 -10.0 0.0 0.0
3 -10.0 0.0 0.0
3 -10.0 0.0 0.0
3 -10.0 0.0 0.0
3 -10.0 0.0 0.0
3 -10.0 0.0 0.0
3 -10.0 0.0 0.0
3 -10.0 0.0 0.0
3 -10.0 0.0 0.0
3 -10.0 0.0 0.0
3 -10.0 0.0 0.0
3 -10.0 0.0 0.0
3 -10.0 0.0 0.0
3 -10.0 0.0 0.0
3 -10.0 0.0 0.0
3 -10.0 0.0 0.0
3 -10.0 0.0 0.0
3 -10.0 0.0 0.0
3 -10.0 0.0 0.0
3 -10.0 0.0 0.0
3 -10.0 0.0 0.0
3 -10.0 0.0 0.0
3 -10.0 0.0 0.0
3 -10.0 0.0 0.0
3 -10.0 0.0 0.0
3 -10.0 0.0 0.0
3 -10.0 0.0 0.0
3 -10.0 0.0 0.0
3 -10.0 0.0 0.0
3 -10.0 0.0 0.0
3 -10.0 0.0 0.0
3 -10.0 0.0 0.0
3 -10.0 0.0 0.0
3 -10.0 0.0 0.0
3 -10.0 0.0 0.0
3 -10.0 0.0 0.0
3 -10.0 0.0 0.0
3 -10.0 0.0 0.0
3 -10.0 0.0 0.0
3 -10.0 0.0 0.0
3 -10.0 0.0 0.0
3 -10.0 0.0 0.0
3 -10.0 0.0 0.0
3 -10.0 0.0 0.0
3 -10.0 0.0 0.0
3 -10.0 0.0 0.0
3 -10.0 0.0 0.0
3 -10.0 0.0 0.0
3 -10.0 0.0 0.0
3 -10.0 0.0 0.0
3 -10.0 0.0 0.0
3 -10.0 0.0 0.0
CDATA:
9 1 0 0 0 1 0 0 0 1
9 1 0 0 0 1 0 0 0 1
9 1 0 0 0 1 0 0 0 1
9 1 0 0 0 1 0 0 0 1
9 1 0 0 0 1 0 0 0 1
9 1 0 0 0 1 0 0 0 1
9 1 0 0 0 1 0 0 0 1
9 1 0 0 0 1 0 0 0 1
9 1 0 0 0 1 0 0 0 1
9 1 0 0 0 1 0 0 0 1
9 1 0 0 0 1 0 0 0 1
9 1 0 0 0 1 0 0 0 1
9 1 0 0 0 1 0 0 0 1
9 1 0 0 0 1 0 0 0 1
9 1 0 0 0 1 0 0 0 1
9 1 0 0 0 1 0 0 0 1
9 1 0 0 0 1 0 0 0 1
9 1 0 0 0 1 0 0 0 1
9 1 0 0 0 1 0 0 0 1
9 1 0 0 0 1 0 0 0 1
9 1 0 0 0 1 0 0 0 1
9 1 0 0 0 1 0 0 0 1
9 1 0 0 0 1 0 0 0 1
9 1 0 0 0 1 0 0 0 1
9 1 0 0 0 1 0 0 0 1
9 1 0 0 0 1 0 0 0 1
9 1 0 0 0 1 0 0 0 1
9 1 0 0 0 1 0 0 0 1
9 1 0 0 0 1 0 0 0 1
9 1 0 0 0 1 0 0 0 1
9 1 0 0 0 1 0 0 0 1
9 1 0 0 0 1 0 0 0 1
9 1 0 0 0 1 0 0 0 1
9 1 0 0 0 1 0 0 0 1
9 1 0 0 0 1 0 0 0 1
9 1 0 0 0 1 0 0 0 1
9 1 0 0 0 1 0 0 0 1
9 1 0 0 0 1 0 0 0 1
9 1 0 0 0 1 0 0 0 1
9 1 0 0 0 1 0 0 0 1
9 1 0 0 0 1 0 0 0 1
9 1 0 0 0 1 0 0 0 1
9 1 0 0 0 1 0 0 0 1
9 1 0 0 0 1 0 0 0 1
9 1 0 0 0 1 0 0 0 1
9 1 0 0 0 1 0 0 0 1
9 1 0 0 0 1 0 0 0 1
9 1 0 0 0 1 0 0 0 1
9 1 0 0 0 1 0 0 0 1
9 1 0 0 0 1 0 0 0 1
9 1 0 0 0 1 0 0 0 1
9 1 0 0 0 1 0 0 0 1
9 1 0 0 0 1 0 0 0 1
9 1 0 0 0 1 0 0 0 1
9 1 0 0 0 1 0 0 0 1
9 1 0 0 0 1 0 0 0 1
9 1 0 0 0 1 0 0 0 1
9 1 0 0 0 1 0 0 0 1
9 1 0 0 0 1 0 0 0 1
9 1 0 0 0 1 0 0 0 1
9 1 0 0 0 1 0 0 0 1
9 1 0 0 0 1 0 0 0 1
9 1 0 0 0 1 0 0 0 1
9 1 0 0 0 1 0 0 0 1
9 1 0 0 0 1 0 0 0 1
9 1 0 0 0 1 0 0 0 1
9 1 0 0 0 1 0 0 0 1
9 1 0 0 0 1 0 0 0 1
9 1 0 0 0 1 0 0 0 1
9 1 0 0 0 1 0 0 0 1
9 1 0 0 0 1 0 0 0 1
9 1 0 0 0 1 0 0 0 1
9 1 0 0 0 1 0 0 0 1
9 1 0 0 0 1 0 0 0 1
9 1 0 0 0 1 0 0 0 1
9 1 0 0 0 1 0 0 0 1
9 1 0 0 0 1 0 0 0 1
9 1 0 0 0 1 0 0 0 1
9 1 0 0 0 1 0 0 0 1
9 1 0 0 0 1 0 0 0 1
9 1 0 0 0 1 0 0 0 1
9 1 0 0 0 1 0 0 0 1
9 1 0 0 0 1 0 0 0 1
9 1 0 0 0 1 0 0 0 1
9 1 0 0 0 1 0 0 0 1
9 1 0 0 0 1 0 0 0 1
9 1 0 0 0 1 0 0 0 1
9 1 0 0 0 1 0 0 0 1
9 1 0 0 0 1 0 0 0 1
9 1 0 0 0 1 0 0 0 1
9 1 0 0 0 1 0 0 0 1
9 1 0 0 0 1 0 0 0 1
9 1 0 0 0 1 0 0 0 1
9 1 0 0 0 1 0 0 0 1
9 1 0 0 0 1 0 0 0 1
9 1 0 0 0 1 0 0 0 1
9 1 0 0 0 1 0 0 0 1
9 1 0 0 0 1 0 0 0 1
9 1 0 0 0 1 0 0 0 1
9 1 0 0 0 1 0 0 0 1
