POINTS:
0.0 0.0 0.0
0.0 0.0 1.0
0.0 0.0 2.0
0.0 0.0 3.0
0.0 1.0 0.0
0.0 1.0 1.0
0.0 1.0 2.0
0.0 1.0 3.0
0.0 2.0 0.0
0.0 2.0 1.0
0.0 2.0 2.0
0.0 2.0 3.0
0.0 3.0 0.0
0.0 3.0 1.0
0.0 3.0 2.0
0.0 3.0 3.0
1.0 0.0 0.0
1.0 0.0 1.0
1.0 0.0 2.0
1.0 0.0 3.0
1.0 1.0 0.0
1.0 1.0 1.0
1.0 1.0 2.0
1.0 1.0 3.0
1.0 2.0 0.0
1.0 2.0 1.0
1.0 2.0 2.0
1.0 2.0 3.0
1.0 3.0 0.0
1.0 3.0 1.0
1.0 3.0 2.0
1.0 3.0 3.0
2.0 0.0 0.0
2.0 0.0 1.0
2.0 0.0 2.0
2.0 0.0 3.0
2.0 1.0 0.0
2.0 1.0 1.0
2.0 1.0 2.0
2.0 1.0 3.0
2.0 2.0 0.0
2.0 2.0 1.0
2.0 2.0 2.0
2.0 2.0 3.0
2.0 3.0 0.0
2.0 3.0 1.0
2.0 3.0 2.0
2.0 3.0 3.0
3.0 0.0 0.0
3.0 0.0 1.0
3.0 0.0 2.0
3.0 0.0 3.0
3.0 1.0 0.0
3.0 1.0 1.0
3.0 1.0 2.0
3.0 1.0 3.0
3.0 2.0 0.0
3.0 2.0 1.0
3.0 2.0 2.0
3.0 2.0 3.0
3.0 3.0 0.0
3.0 3.0 1.0
3.0 3.0 2.0
3.0 3.0 3.0
CELLS:
8 0 0 4 20 16 1 5 21 17
8 0 1 5 21 17 2 6 22 18
8 0 2 6 22 18 3 7 23 19
8 0 4 8 24 20 5 9 25 21
8 0 5 9 25 21 6 10 26 22
8 0 6 10 26 22 7 11 27 23
8 0 8 12 28 24 9 13 29 25
8 0 9 13 29 25 10 14 30 26
8 0 10 14 30 26 11 15 31 27
8 0 16 20 36 32 17 21 37 33
8 0 17 21 37 33 18 22 38 34
8 0 18 22 38 34 19 23 39 35
8 0 20 24 40 36 21 25 41 37
8 0 21 25 41 37 22 26 42 38
8 0 22 26 42 38 23 27 43 39
8 0 24 28 44 40 25 29 45 41
8 0 25 29 45 41 26 30 46 42
8 0 26 30 46 42 27 31 47 43
8 0 32 36 52 48 33 37 53 49
8 0 33 37 53 49 34 38 54 50
8 0 34 38 54 50 35 39 55 51
8 0 36 40 56 52 37 41 57 53
8 0 37 41 57 53 38 42 58 54
8 0 38 42 58 54 39 43 59 55
8 0 40 44 60 56 41 45 61 57
8 0 41 45 61 57 42 46 62 58
8 0 42 46 62 58 43 47 63 59
FACES:
4 0 0 4 5 1
4 0 48 52 53 49
4 0 1 5 6 2
4 0 49 53 54 50
4 0 2 6 7 3
4 0 50 54 55 51
4 0 4 8 9 5
4 0 52 56 57 53
4 0 5 9 10 6
4 0 53 57 58 54
4 0 6 10 11 7
4 0 54 58 59 55
4 0 8 12 13 9
4 0 56 60 61 57
4 0 9 13 14 10
4 0 57 61 62 58
4 0 10 14 15 11
4 0 58 62 63 59
4 0 20 16 0 4
4 0 23 19 3 7
4 0 24 20 4 8
4 0 27 23 7 11
4 0 28 24 8 12
4 0 31 27 11 15
4 0 36 32 16 20
4 0 39 35 19 23
4 0 40 36 20 24
4 0 43 39 23 27
4 0 44 40 24 28
4 0 47 43 27 31
4 0 52 48 32 36
4 0 55 51 35 39
4 0 56 52 36 40
4 0 59 55 39 43
4 0 60 56 40 44
4 0 63 59 43 47
4 0 0 16 17 1
4 0 12 28 29 13
4 0 1 17 18 2
4 0 13 29 30 14
4 0 2 18 19 3
4 0 14 30 31 15
4 0 16 32 33 17
4 0 28 44 45 29
4 0 17 33 34 18
4 0 29 45 46 30
4 0 18 34 35 19
4 0 30 46 47 31
4 0 32 48 49 33
4 0 44 60 61 45
4 0 33 49 50 34
4 0 45 61 62 46
4 0 34 50 51 35
4 0 46 62 63 47
VDATA:
3 0.0 0.002 20
3 0.0 0.002 20
3 -10.0 0.0 0.0
3 -10.0 0.0 0.0
3 0.0 0.002 20
3 0.0 0.002 20
3 -10.0 0.0 0.0
3 -10.0 0.0 0.0
3 -10.0 0.0 0.0
3 -10.0 0.0 0.0
3 -10.0 0.0 0.0
3 -10.0 0.0 0.0
3 -10.0 0.0 0.0
3 -10.0 0.0 0.0
3 -10.0 0.0 0.0
3 -10.0 0.0 0.0
3 0.0 0.002 20
3 0.0 0.002 20
3 -10.0 0.0 0.0
3 -10.0 0.0 0.0
3 0.0 0.002 20
3 0.0 0.002 20
3 -10.0 0.0 0.0
3 -10.0 0.0 0.0
3 -10.0 0.0 0.0
3 -10.0 0.0 0.0
3 -10.0 0.0 0.0
3 -10.0 0.0 0.0
3 -10.0 0.0 0.0
3 -10.0 0.0 0.0
3 -10.0 0.0 0.0
3 -10.0 0.0 0.0
3 -10.0 0.0 0.0
3 -10.0 0.0 0.0
3 -10.0 0.0 0.0
3 -10.0 0.0 0.0
3 -10.0 0.0 0.0
3 -10.0 0.0 0.0
3 -10.0 0.0 0.0
3 -10.0 0.0 0.0
3 -10.0 0.0 0.0
3 -10.0 0.0 0.0
3 -10.0 0.0 0.0
3 -10.0 0.0 0.0
3 -10.0 0.0 0.0
3 -10.0 0.0 0.0
3 -10.0 0.0 0.0
3 -10.0 0.0 0.0
3 -10.0 0.0 0.0
3 -10.0 0.0 0.0
3 -10.0 0.0 0.0
3 -10.0 0.0 0.0
3 -10.0 0.0 0.0
3 -10.0 0.0 0.0
3 -10.0 0.0 0.0
3 -10.0 0.0 0.0
3 -10.0 0.0 0.0
3 -10.0 0.0 0.0
3 -10.0 0.0 0.0
3 -10.0 0.0 0.0
3 -10.0 0.0 0.0
3 -10.0 0.0 0.0
3 -10.0 0.0 0.0
3 -10.0 0.0 0.0
CDATA:
9 1 0 0 0 1 0 0 0 1
9 1 0 0 0 1 0 0 0 1
9 1 0 0 0 1 0 0 0 1
9 1 0 0 0 1 0 0 0 1
9 1 0 0 0 1 0 0 0 1
9 1 0 0 0 1 0 0 0 1
9 1 0 0 0 1 0 0 0 1
9 1 0 0 0 1 0 0 0 1
9 1 0 0 0 1 0 0 0 1
9 1 0 0 0 1 0 0 0 1
9 1 0 0 0 1 0 0 0 1
9 1 0 0 0 1 0 0 0 1
9 1 0 0 0 1 0 0 0 1
9 1 0 0 0 1 0 0 0 1
9 1 0 0 0 1 0 0 0 1
9 1 0 0 0 1 0 0 0 1
9 1 0 0 0 1 0 0 0 1
9 1 0 0 0 1 0 0 0 1
9 1 0 0 0 1 0 0 0 1
9 1 0 0 0 1 0 0 0 1
9 1 0 0 0 1 0 0 0 1
9 1 0 0 0 1 0 0 0 1
9 1 0 0 0 1 0 0 0 1
9 1 0 0 0 1 0 0 0 1
9 1 0 0 0 1 0 0 0 1
9 1 0 0 0 1 0 0 0 1
9 1 0 0 0 1 0 0 0 1
