POINTS:
0.0 0.0
0.0 0.5
0.0 1.0
0.0 1.5
0.0 2.0
0.0 2.5
0.0 3.0
0.5 0.0
0.5 0.5
0.5 1.0
0.5 1.5
0.5 2.0
0.5 2.5
0.5 3.0
1.0 0.0
1.0 0.5
1.0 1.0
1.0 1.5
1.0 2.0
1.0 2.5
1.0 3.0
1.5 0.0
1.5 0.5
1.5 1.0
1.5 1.5
1.5 2.0
1.5 2.5
1.5 3.0
2.0 0.0
2.0 0.5
2.0 1.0
2.0 1.5
2.0 2.0
2.0 2.5
2.0 3.0
2.5 0.0
2.5 0.5
2.5 1.0
2.5 1.5
2.5 2.0
2.5 2.5
2.5 3.0
3.0 0.0
3.0 0.5
3.0 1.0
3.0 1.5
3.0 2.0
3.0 2.5
3.0 3.0
CELLS:
3 0 0 7 8
3 0 0 8 1
3 0 1 8 9
3 0 1 9 2
3 0 2 9 10
3 0 2 10 3
3 0 3 10 11
3 0 3 11 4
3 0 4 11 12
3 0 4 12 5
3 0 5 12 13
3 0 5 13 6
3 0 7 14 15
3 0 7 15 8
3 0 8 15 16
3 0 8 16 9
3 0 9 16 17
3 0 9 17 10
3 0 10 17 18
3 0 10 18 11
3 0 11 18 19
3 0 11 19 12
3 0 12 19 20
3 0 12 20 13
3 0 14 21 22
3 0 14 22 15
3 0 15 22 23
3 0 15 23 16
3 0 16 23 24
3 0 16 24 17
3 0 17 24 25
3 0 17 25 18
3 0 18 25 26
3 0 18 26 19
3 0 19 26 27
3 0 19 27 20
3 0 21 28 29
3 0 21 29 22
3 0 22 29 30
3 0 22 30 23
3 0 23 30 31
3 0 23 31 24
3 0 24 31 32
3 0 24 32 25
3 0 25 32 33
3 0 25 33 26
3 0 26 33 34
3 0 26 34 27
3 0 28 35 36
3 0 28 36 29
3 0 29 36 37
3 0 29 37 30
3 0 30 37 38
3 0 30 38 31
3 0 31 38 39
3 0 31 39 32
3 0 32 39 40
3 0 32 40 33
3 0 33 40 41
3 0 33 41 34
3 0 35 42 43
3 0 35 43 36
3 0 36 43 44
3 0 36 44 37
3 0 37 44 45
3 0 37 45 38
3 0 38 45 46
3 0 38 46 39
3 0 39 46 47
3 0 39 47 40
3 0 40 47 48
3 0 40 48 41
FACES:
VDATA:
3 0.0 0.002 20
3 0.0 0.002 20
3 0.0 0.002 20
3 0.0 0.002 20
3 -10.0 0.0 0.0
3 -10.0 0.0 0.0
3 -10.0 0.0 0.0
3 0.0 0.002 20
3 0.0 0.002 20
3 0.0 0.002 20
3 0.0 0.002 20
3 -10.0 0.0 0.0
3 -10.0 0.0 0.0
3 -10.0 0.0 0.0
3 0.0 0.002 20
3 0.0 0.002 20
3 0.0 0.002 20
3 0.0 0.002 20
3 -10.0 0.0 0.0
3 -10.0 0.0 0.0
3 -10.0 0.0 0.0
3 0.0 0.002 20
3 0.0 0.002 20
3 0.0 0.002 20
3 0.0 0.002 20
3 -10.0 0.0 0.0
3 -10.0 0.0 0.0
3 -10.0 0.0 0.0
3 -10.0 0.0 0.0
3 -10.0 0.0 0.0
3 -10.0 0.0 0.0
3 -10.0 0.0 0.0
3 -10.0 0.0 0.0
3 -10.0 0.0 0.0
3 -10.0 0.0 0.0
3 -10.0 0.0 0.0
3 -10.0 0.0 0.0
3 -10.0 0.0 0.0
3 -10.0 0.0 0.0
3 -10.0 0.0 0.0
3 -10.0 0.0 0.0
3 -10.0 0.0 0.0
3 -10.0 0.0 0.0
3 -10.0 0.0 0.0
3 -10.0 0.0 0.0
3 -10.0 0.0 0.0
3 -10.0 0.0 0.0
3 -10.0 0.0 0.0
3 -10.0 0.0 0.0
CDATA:
9 1 0 0 0 1 0 0 0 1
9 1 0 0 0 1 0 0 0 1
9 1 0 0 0 1 0 0 0 1
9 1 0 0 0 1 0 0 0 1
9 1 0 0 0 1 0 0 0 1
9 1 0 0 0 1 0 0 0 1
9 1 0 0 0 1 0 0 0 1
9 1 0 0 0 1 0 0 0 1
9 1 0 0 0 1 0 0 0 1
9 1 0 0 0 1 0 0 0 1
9 1 0 0 0 1 0 0 0 1
9 1 0 0 0 1 0 0 0 1
9 1 0 0 0 1 0 0 0 1
9 1 0 0 0 1 0 0 0 1
9 1 0 0 0 1 0 0 0 1
9 1 0 0 0 1 0 0 0 1
9 1 0 0 0 1 0 0 0 1
9 1 0 0 0 1 0 0 0 1
9 1 0 0 0 1 0 0 0 1
9 1 0 0 0 1 0 0 0 1
9 1 0 0 0 1 0 0 0 1
9 1 0 0 0 1 0 0 0 1
9 1 0 0 0 1 0 0 0 1
9 1 0 0 0 1 0 0 0 1
9 1 0 0 0 1 0 0 0 1
9 1 0 0 0 1 0 0 0 1
9 1 0 0 0 1 0 0 0 1
9 1 0 0 0 1 0 0 0 1
9 1 0 0 0 1 0 0 0 1
9 1 0 0 0 1 0 0 0 1
9 1 0 0 0 1 0 0 0 1
9 1 0 0 0 1 0 0 0 1
9 1 0 0 0 1 0 0 0 1
9 1 0 0 0 1 0 0 0 1
9 1 0 0 0 1 0 0 0 1
9 1 0 0 0 1 0 0 0 1
9 1 0 0 0 1 0 0 0 1
9 1 0 0 0 1 0 0 0 1
9 1 0 0 0 1 0 0 0 1
9 1 0 0 0 1 0 0 0 1
9 1 0 0 0 1 0 0 0 1
9 1 0 0 0 1 0 0 0 1
9 1 0 0 0 1 0 0 0 1
9 1 0 0 0 1 0 0 0 1
9 1 0 0 0 1 0 0 0 1
9 1 0 0 0 1 0 0 0 1
9 1 0 0 0 1 0 0 0 1
9 1 0 0 0 1 0 0 0 1
9 1 0 0 0 1 0 0 0 1
9 1 0 0 0 1 0 0 0 1
9 1 0 0 0 1 0 0 0 1
9 1 0 0 0 1 0 0 0 1
9 1 0 0 0 1 0 0 0 1
9 1 0 0 0 1 0 0 0 1
9 1 0 0 0 1 0 0 0 1
9 1 0 0 0 1 0 0 0 1
9 1 0 0 0 1 0 0 0 1
9 1 0 0 0 1 0 0 0 1
9 1 0 0 0 1 0 0 0 1
9 1 0 0 0 1 0 0 0 1
9 1 0 0 0 1 0 0 0 1
9 1 0 0 0 1 0 0 0 1
9 1 0 0 0 1 0 0 0 1
9 1 0 0 0 1 0 0 0 1
9 1 0 0 0 1 0 0 0 1
9 1 0 0 0 1 0 0 0 1
9 1 0 0 0 1 0 0 0 1
9 1 0 0 0 1 0 0 0 1
9 1 0 0 0 1 0 0 0 1
9 1 0 0 0 1 0 0 0 1
9 1 0 0 0 1 0 0 0 1
9 1 0 0 0 1 0 0 0 1
