POINTS:
0.0 0.0
0.0 0.5
0.0 1.0
0.0 1.5
0.0 2.0
0.0 2.5
0.0 3.0
0.5 0.0
0.5 0.5
0.5 1.0
0.5 1.5
0.5 2.0
0.5 2.5
0.5 3.0
1.0 0.0
1.0 0.5
1.0 1.0
1.0 1.5
1.0 2.0
1.0 2.5
1.0 3.0
1.5 0.0
1.5 0.5
1.5 1.0
1.5 1.5
1.5 2.0
1.5 2.5
1.5 3.0
2.0 0.0
2.0 0.5
2.0 1.0
2.0 1.5
2.0 2.0
2.0 2.5
2.0 3.0
2.5 0.0
2.5 0.5
2.5 1.0
2.5 1.5
2.5 2.0
2.5 2.5
2.5 3.0
3.0 0.0
3.0 0.5
3.0 1.0
3.0 1.5
3.0 2.0
3.0 2.5
3.0 3.0
CELLS:
4 0 0 7 8 1
4 0 1 8 9 2
4 0 2 9 10 3
4 0 3 10 11 4
4 0 4 11 12 5
4 0 5 12 13 6
4 0 7 14 15 8
4 0 8 15 16 9
4 0 9 16 17 10
4 0 10 17 18 11
4 0 11 18 19 12
4 0 12 19 20 13
4 0 14 21 22 15
4 0 15 22 23 16
4 0 16 23 24 17
4 0 17 24 25 18
4 0 18 25 26 19
4 0 19 26 27 20
4 0 21 28 29 22
4 0 22 29 30 23
4 0 23 30 31 24
4 0 24 31 32 25
4 0 25 32 33 26
4 0 26 33 34 27
4 0 28 35 36 29
4 0 29 36 37 30
4 0 30 37 38 31
4 0 31 38 39 32
4 0 32 39 40 33
4 0 33 40 41 34
4 0 35 42 43 36
4 0 36 43 44 37
4 0 37 44 45 38
4 0 38 45 46 39
4 0 39 46 47 40
4 0 40 47 48 41
FACES:
VDATA:
3 0.0 0.002 20
3 0.0 0.002 20
3 0.0 0.002 20
3 0.0 0.002 20
3 -10.0 0.0 0.0
3 -10.0 0.0 0.0
3 -10.0 0.0 0.0
3 0.0 0.002 20
3 0.0 0.002 20
3 0.0 0.002 20
3 0.0 0.002 20
3 -10.0 0.0 0.0
3 -10.0 0.0 0.0
3 -10.0 0.0 0.0
3 0.0 0.002 20
3 0.0 0.002 20
3 0.0 0.002 20
3 0.0 0.002 20
3 -10.0 0.0 0.0
3 -10.0 0.0 0.0
3 -10.0 0.0 0.0
3 0.0 0.002 20
3 0.0 0.002 20
3 0.0 0.002 20
3 0.0 0.002 20
3 -10.0 0.0 0.0
3 -10.0 0.0 0.0
3 -10.0 0.0 0.0
3 -10.0 0.0 0.0
3 -10.0 0.0 0.0
3 -10.0 0.0 0.0
3 -10.0 0.0 0.0
3 -10.0 0.0 0.0
3 -10.0 0.0 0.0
3 -10.0 0.0 0.0
3 -10.0 0.0 0.0
3 -10.0 0.0 0.0
3 -10.0 0.0 0.0
3 -10.0 0.0 0.0
3 -10.0 0.0 0.0
3 -10.0 0.0 0.0
3 -10.0 0.0 0.0
3 -10.0 0.0 0.0
3 -10.0 0.0 0.0
3 -10.0 0.0 0.0
3 -10.0 0.0 0.0
3 -10.0 0.0 0.0
3 -10.0 0.0 0.0
3 -10.0 0.0 0.0
CDATA:
9 1 0 0 0 1 0 0 0 1
9 1 0 0 0 1 0 0 0 1
9 1 0 0 0 1 0 0 0 1
9 1 0 0 0 1 0 0 0 1
9 1 0 0 0 1 0 0 0 1
9 1 0 0 0 1 0 0 0 1
9 1 0 0 0 1 0 0 0 1
9 1 0 0 0 1 0 0 0 1
9 1 0 0 0 1 0 0 0 1
9 1 0 0 0 1 0 0 0 1
9 1 0 0 0 1 0 0 0 1
9 1 0 0 0 1 0 0 0 1
9 1 0 0 0 1 0 0 0 1
9 1 0 0 0 1 0 0 0 1
9 1 0 0 0 1 0 0 0 1
9 1 0 0 0 1 0 0 0 1
9 1 0 0 0 1 0 0 0 1
9 1 0 0 0 1 0 0 0 1
9 1 0 0 0 1 0 0 0 1
9 1 0 0 0 1 0 0 0 1
9 1 0 0 0 1 0 0 0 1
9 1 0 0 0 1 0 0 0 1
9 1 0 0 0 1 0 0 0 1
9 1 0 0 0 1 0 0 0 1
9 1 0 0 0 1 0 0 0 1
9 1 0 0 0 1 0 0 0 1
9 1 0 0 0 1 0 0 0 1
9 1 0 0 0 1 0 0 0 1
9 1 0 0 0 1 0 0 0 1
9 1 0 0 0 1 0 0 0 1
9 1 0 0 0 1 0 0 0 1
9 1 0 0 0 1 0 0 0 1
9 1 0 0 0 1 0 0 0 1
9 1 0 0 0 1 0 0 0 1
9 1 0 0 0 1 0 0 0 1
9 1 0 0 0 1 0 0 0 1
