\relax 
\@writefile{toc}{\contentsline {section}{\tocsection {}{11}{Experiments for the mechanical model}}{30}}
\newlabel{sec:ex_mech}{{11}{30}}
\@setckpt{Experiments2}{
\setcounter{page}{31}
\setcounter{equation}{27}
\setcounter{enumi}{3}
\setcounter{enumii}{0}
\setcounter{enumiii}{0}
\setcounter{enumiv}{0}
\setcounter{footnote}{0}
\setcounter{mpfootnote}{0}
\setcounter{parentequation}{20}
\setcounter{part}{0}
\setcounter{section}{11}
\setcounter{subsection}{0}
\setcounter{subsubsection}{0}
\setcounter{paragraph}{0}
\setcounter{subparagraph}{0}
\setcounter{figure}{3}
\setcounter{table}{1}
\setcounter{thrm}{0}
\setcounter{float@type}{8}
\setcounter{ContinuedFloat}{0}
\setcounter{subfigure}{0}
\setcounter{subtable}{0}
\setcounter{algorithm}{0}
\setcounter{ALC@unique}{0}
\setcounter{ALC@line}{0}
\setcounter{ALC@rem}{0}
\setcounter{ALC@depth}{0}
\setcounter{theorem}{0}
}
