\relax 
\@writefile{toc}{\contentsline {section}{\tocsection {}{3}{The monodomain equation}}{4}}
\newlabel{sec:monodomain}{{3}{4}}
\@writefile{toc}{\contentsline {paragraph}{\tocparagraph {}{}{\bf  The monodomain data}}{4}}
\newlabel{eq:I_ext}{{1}{4}}
\@writefile{toc}{\contentsline {paragraph}{\tocparagraph {}{}{\bf  The monodomain evolution}}{4}}
\newlabel{eq:mono1}{{2a}{4}}
\newlabel{eq:mono2}{{2b}{4}}
\@setckpt{Monodomain}{
\setcounter{page}{5}
\setcounter{equation}{2}
\setcounter{enumi}{0}
\setcounter{enumii}{0}
\setcounter{enumiii}{0}
\setcounter{enumiv}{0}
\setcounter{footnote}{0}
\setcounter{mpfootnote}{0}
\setcounter{parentequation}{2}
\setcounter{part}{0}
\setcounter{section}{3}
\setcounter{subsection}{0}
\setcounter{subsubsection}{0}
\setcounter{paragraph}{0}
\setcounter{subparagraph}{0}
\setcounter{figure}{0}
\setcounter{table}{0}
\setcounter{thrm}{0}
\setcounter{float@type}{8}
\setcounter{ContinuedFloat}{0}
\setcounter{subfigure}{0}
\setcounter{subtable}{0}
\setcounter{algorithm}{0}
\setcounter{ALC@unique}{0}
\setcounter{ALC@line}{0}
\setcounter{ALC@rem}{0}
\setcounter{ALC@depth}{0}
\setcounter{theorem}{0}
}
