HEADER:
Checked=true
WithData=true
Cellformat=Vtu
POINTS:
0 0 0
0 1 0
1 0 0
1 1 0
CELLS:
5 0 0 2 3 
5 0 0 3 1 
FACES:
330 0 1 
330 2 3 
330 1 3 
330 0 2 
VDATA:
-10 0 0 
-10 0 0 
-10 0 0 
-10 0 0 
CDATA:
1 0 0 0 1 0 0 0 1 
1 0 0 0 1 0 0 0 1 
