\relax 
\citation{tentusscher}
\citation{kohlsachsSAC,taviSAC}
\@writefile{toc}{\contentsline {section}{\tocsection {}{7}{The ten Tusscher cell model}}{13}}
\newlabel{sec:TenTusscher}{{7}{13}}
\@writefile{toc}{\contentsline {paragraph}{\tocparagraph {}{}{\bf  The evolution of ion concentrations}}{14}}
\citation{croninHodgkin}
\@writefile{toc}{\contentsline {paragraph}{\tocparagraph {}{}{\bf  The gating mechanism}}{15}}
\newlabel{eq:gatingDifferentialgleichung}{{25}{15}}
\newlabel{eq:y_update}{{26}{15}}
\@writefile{toc}{\contentsline {paragraph}{\tocparagraph {}{}{\bf  The gating evolution in the ten Tusscher model}}{15}}
\@setckpt{TenTuscher}{
\setcounter{page}{18}
\setcounter{equation}{26}
\setcounter{enumi}{3}
\setcounter{enumii}{0}
\setcounter{enumiii}{0}
\setcounter{enumiv}{0}
\setcounter{footnote}{0}
\setcounter{mpfootnote}{0}
\setcounter{parentequation}{20}
\setcounter{part}{0}
\setcounter{section}{7}
\setcounter{subsection}{0}
\setcounter{subsubsection}{0}
\setcounter{paragraph}{0}
\setcounter{subparagraph}{0}
\setcounter{figure}{0}
\setcounter{table}{0}
\setcounter{thrm}{0}
\setcounter{float@type}{8}
\setcounter{ContinuedFloat}{0}
\setcounter{subfigure}{0}
\setcounter{subtable}{0}
\setcounter{algorithm}{0}
\setcounter{ALC@unique}{0}
\setcounter{ALC@line}{0}
\setcounter{ALC@rem}{0}
\setcounter{ALC@depth}{0}
\setcounter{theorem}{0}
}
