\relax 
\@writefile{toc}{\contentsline {section}{\tocsection {}{10}{Experiments for Benchmark}}{24}}
\newlabel{sec:experimentsBM}{{10}{24}}
\@writefile{lof}{\contentsline {figure}{\numberline {6}{\ignorespaces Reference geometry with excitation for space discretization $dx=0.5$mm.\relax }}{24}}
\newlabel{fig:Cuboid Excitation 0.5}{{6}{24}}
\@writefile{lot}{\contentsline {table}{\numberline {1}{\ignorespaces Convergence test for the substepping with dx=0.5mm and ${\vartriangle } t = 0.1*2^{-j}$ ms.\relax }}{25}}
\newlabel{tab: convergence substepping 0.5}{{1}{25}}
\@writefile{lot}{\contentsline {table}{\numberline {2}{\ignorespaces Convergence test for the timestepping with dx=0.5mm and ${\vartriangle } t = 0.1*2^{-j}$ ms.\relax }}{25}}
\newlabel{tab: convergence timestepping 0.5}{{2}{25}}
\@writefile{lot}{\contentsline {table}{\numberline {3}{\ignorespaces Convergence test for the substepping with dx=0.2mm and ${\vartriangle } t = 0.1*2^{-j}$ ms.\relax }}{25}}
\@writefile{lot}{\contentsline {table}{\numberline {4}{\ignorespaces Convergence test for the timestepping with dx=0.2mm and ${\vartriangle } t = 0.1*2^{-j}$ ms.\relax }}{26}}
\@writefile{lot}{\contentsline {table}{\numberline {5}{\ignorespaces Duration of the simulation with different space discretization and ${\vartriangle } t = 0.1 \cdot 2^{-j}$ ms, $T=0.7$ s, no substepping, smoothed exitation and on 128 procs(hours:minutes:seconds).\relax }}{26}}
\newlabel{tab:convergence coarse}{{5}{26}}
\@setckpt{ExperimentsTest}{
\setcounter{page}{27}
\setcounter{equation}{30}
\setcounter{enumi}{3}
\setcounter{enumii}{0}
\setcounter{enumiii}{0}
\setcounter{enumiv}{0}
\setcounter{footnote}{0}
\setcounter{mpfootnote}{0}
\setcounter{parentequation}{23}
\setcounter{part}{0}
\setcounter{section}{10}
\setcounter{subsection}{0}
\setcounter{subsubsection}{0}
\setcounter{paragraph}{0}
\setcounter{subparagraph}{0}
\setcounter{figure}{6}
\setcounter{table}{5}
\setcounter{thrm}{0}
\setcounter{float@type}{8}
\setcounter{ContinuedFloat}{0}
\setcounter{subfigure}{0}
\setcounter{subtable}{0}
\setcounter{algorithm}{0}
\setcounter{ALC@unique}{0}
\setcounter{ALC@line}{0}
\setcounter{ALC@rem}{0}
\setcounter{ALC@depth}{0}
\setcounter{theorem}{0}
}
