<?xml version="1.0" encoding="UTF-8" standalone="no"?>
<!-- Created with Inkscape (http://www.inkscape.org/) -->

<svg
   version="1.1"
   width="226.25"
   height="35"
   id="svg2"
   xml:space="preserve"
   sodipodi:docname="KIT-CERT-Logo-white.svg"
   inkscape:version="1.3 (0e150ed6c4, 2023-07-21)"
   xmlns:inkscape="http://www.inkscape.org/namespaces/inkscape"
   xmlns:sodipodi="http://sodipodi.sourceforge.net/DTD/sodipodi-0.dtd"
   xmlns="http://www.w3.org/2000/svg"
   xmlns:svg="http://www.w3.org/2000/svg"
   xmlns:rdf="http://www.w3.org/1999/02/22-rdf-syntax-ns#"
   xmlns:cc="http://creativecommons.org/ns#"
   xmlns:dc="http://purl.org/dc/elements/1.1/"><sodipodi:namedview
     id="namedview1"
     pagecolor="#ffffff"
     bordercolor="#000000"
     borderopacity="0.25"
     inkscape:showpageshadow="2"
     inkscape:pageopacity="0.0"
     inkscape:pagecheckerboard="0"
     inkscape:deskcolor="#d1d1d1"
     inkscape:zoom="5.5911602"
     inkscape:cx="113.125"
     inkscape:cy="17.527668"
     inkscape:window-width="2560"
     inkscape:window-height="1378"
     inkscape:window-x="1920"
     inkscape:window-y="0"
     inkscape:window-maximized="1"
     inkscape:current-layer="g10" /><metadata
     id="metadata8"><rdf:RDF><cc:Work
         rdf:about=""><dc:format>image/svg+xml</dc:format><dc:type
           rdf:resource="http://purl.org/dc/dcmitype/StillImage" /></cc:Work></rdf:RDF></metadata><defs
     id="defs6"><clipPath
       id="clipPath18"><path
         d="M 0,0 791,0 791,280 0,280 0,0 z"
         inkscape:connector-curvature="0"
         id="path20" /></clipPath></defs><g
     transform="matrix(1.25,0,0,-1.25,0,35)"
     id="g10"><g
       transform="scale(0.1,0.1)"
       id="g12"><g
         id="g14"><g
           clip-path="url(#clipPath18)"
           id="g16"><path
             d="m 494.012,-0.558594 -86.282,0 L 305.199,109.73 l 0,62.989 99.403,109.972 88.789,0 L 378.969,140.129 494.012,-0.558594"
             inkscape:connector-curvature="0"
             id="path22"
             style="fill:#ffffff;fill-opacity:1;fill-rule:nonzero;stroke:none" /><path
             d="m 507.109,0 77.5234,0 0,282.469 -77.5234,0 0,-282.469 z"
             inkscape:connector-curvature="0"
             id="path24"
             style="fill:#ffffff;fill-opacity:1;fill-rule:nonzero;stroke:none" /><path
             d="m 790.309,282.48 -186.93,0 0,-63.89 54.711,0 0,-219.379062 77.531,0 0,219.379062 54.699,0 0,63.89"
             inkscape:connector-curvature="0"
             id="path26"
             style="fill:#ffffff;fill-opacity:1;fill-rule:nonzero;stroke:none" /><path
             d="M 65.3594,178.93 C 50.5195,160.969 37.8789,141.141 27.7695,119.879 L 286.629,-0.570312 65.3594,178.922"
             inkscape:connector-curvature="0"
             id="path28"
             style="fill:#ffffff;fill-opacity:1;fill-rule:nonzero;stroke:none" /><path
             d="M 286.59,-0.441406 165.82,256.23 c -21.32,-9.82 -41.211,-22.179 -59.281,-36.718 l 180.09,-220.04325 -0.027,0.089844"
             inkscape:connector-curvature="0"
             id="path30"
             style="fill:#ffffff;fill-opacity:1;fill-rule:nonzero;stroke:none" /><path
             d="M 9.23828,68.7812 C 3.55078,46.6016 0.511719,23.3711 0.378906,-0.558594 l 286.160094,0 L 9.23828,68.7812"
             inkscape:connector-curvature="0"
             id="path32"
             style="fill:#ffffff;fill-opacity:1;fill-rule:nonzero;stroke:none" /><path
             d="m 286.641,-0.5 0.129,282.711 c -0.731,0 -1.418,0.051 -2.141,0.051 -23.039,0 -45.43,-2.813 -66.867,-8 l 68.84,-274.711219 0.046,-0.0625"
             inkscape:connector-curvature="0"
             id="path34"
             style="fill:#ffffff;fill-opacity:1;fill-rule:nonzero;stroke:none" /></g></g><path
         d="m 1086.72,65 0,33 -35.17,9.73 0,-69.7808 -144.98,0 0,202.3318 144.98,0 0,-63.301 35.17,8.661 0,26.519 c 0,51.942 -10.83,66 -48.69,66 l -117.409,0 c -37.871,0 -49.23,-14.609 -49.23,-66 l 0,-147.16 c 0,-51.3906 11.359,-66 49.23,-66 l 117.409,0 c 37.86,0 48.69,14.0586 48.69,66"
         inkscape:connector-curvature="0"
         id="path36"
         style="fill:#ffffff;fill-opacity:1;fill-rule:nonzero;stroke:none" /><path
         d="m 1322.52,-1 0,38.4102 -168.25,0 0,88.7308 101.7,0 0,36.781 -101.7,0 0,77.906 166.63,0 0,37.332 -201.25,0 0,-279.16 202.88,0"
         inkscape:connector-curvature="0"
         id="path38"
         style="fill:#ffffff;fill-opacity:1;fill-rule:nonzero;stroke:none" /><path
         d="m 1585.36,-1 -95.77,108.73 30.84,0 c 30.3,0 43.81,15.161 43.81,54.11 l 0,62.219 c 0,38.953 -13.52,54.089 -43.81,54.089 l -168.8,0 0,-279.15972 34.63,0 0,108.73072 61.67,0 85.48,-108.73072 51.94,0 0.01,0.01172 z m -56.27,173.66 c 0,-23.801 -7.03,-28.672 -22.72,-28.672 l -120.11,0 0,97.922 120.11,0 c 15.69,0 22.72,-5.41 22.72,-28.672 l 0,-40.578"
         inkscape:connector-curvature="0"
         id="path40"
         style="fill:#ffffff;fill-opacity:1;fill-rule:nonzero;stroke:none" /><path
         d="m 1808.55,240.281 0,37.879 -226.67,0 0,-37.879 95.75,0 0,-241.281 35.17,0 0,241.281 95.75,0"
         inkscape:connector-curvature="0"
         id="path42"
         style="fill:#ffffff;fill-opacity:1;fill-rule:nonzero;stroke:none" /></g></g></svg>
