[0-9]+linkIDs
active_session_components
active_sessions
Allcomponent_namesAll
asrcomponent_infoAll
asrIndexNextChunk[0-9]+/[0-9]+
asrNextIndexWithinChunk[0-9]+/[0-9]+
asrNumChunks[0-9]+/[0-9]+
Count/Data/[0-9]+/[0-9]+
Data/[0-9]+/[0-9]+
facedubbing_videos
groups:admin
groups:presenter
Listkitalllecture
Listkitemployeelecture
Listlecture
Listmeeting
mtcomponent_infoAll
Session[0-9]+
SessionCreationArguments[0-9]+
sessionIDs
Subscribers_[0-9]+
Subscribers_undefined
user_to_audiosample
user_to_name

user_access////Other/Interviews/Titanic/SWR_interview
user_access//Other/Interviews/Titanic/SWR_interview
...
LTArchive_/Other/Interviews/Titanic_mediatype
LTArchive_/Other/Interviews/Titanic/SWR_interview_mediatype
LTArchive_/Other/Interviews/Titanic/SWR_interview_version
...
LTArchive_/Test_mediatype
LTArchive_/Test_version
LTArchive__version

MessageList[0-9]+:asr:[0-9]+
MessageList[0-9]+:lip:[0-9]+
MessageList[0-9]+:mt:[0-9]+
MessageList[0-9]+:prep:[0-9]+
MessageList[0-9]+:textseg:asr[0-9]+
MessageList[0-9]+:textseg:mt[0-9]+
MessageList[0-9]+:textseg:mt[0-9]+summarizer
MessageList[0-9]+:textseg:tts[0-9]+
MessageList[0-9]+:tts:[0-9]+
MessageList[0-9]+:user:[0-9]+
prepIndexNextChunk[0-9]+/[0-9]+
prepNextIndexWithinChunk[0-9]+/[0-9]+
prepNumChunks[0-9]+/[0-9]+
lipChunk[0-9]+/[0-9]+
lipIndexNextChunk[0-9]+/[0-9]+
lipNextIndexWithinChunk[0-9]+/[0-9]+
lipNumChunks[0-9]+/[0-9]+
lipStartTime[0-9]+/[0-9]+
lipVChunk[0-9]+/[0-9]+
lipVIndexNextChunk[0-9]+/[0-9]+
lipVNumChunks[0-9]+/[0-9]+
textsegChunkText[0-9]+/asr[0-9]+
textsegChunkText[0-9]+/asr[0-9]+summarizer
textsegChunkText[0-9]+/mt[0-9]+
textsegChunkText[0-9]+/mt[0-9]+summarizer
textsegChunkText[0-9]+/tts[0-9]+
textsegIndexNextChunkText[0-9]+/asr[0-9]+
textsegIndexNextChunkText[0-9]+/asr[0-9]+summarizer
textsegIndexNextChunkText[0-9]+/mt[0-9]+
textsegIndexNextChunkText[0-9]+/mt[0-9]+summarizer
textsegIndexNextChunkText[0-9]+/tts[0-9]+
textsegNumChunksText[0-9]+/asr[0-9]+
textsegNumChunksText[0-9]+/asr[0-9]+summarizer
textsegNumChunksText[0-9]+/mt[0-9]+
textsegNumChunksText[0-9]+/mt[0-9]+summarizer
textsegNumChunksText[0-9]+/tts[0-9]+
ttsChunk[0-9]+/[0-9]+
ttsChunkText[0-9]+/[0-9]+
ttscomponent_infoAll
ttsIndexNextChunk[0-9]+/[0-9]+
ttsIndexNextChunkText[0-9]+/[0-9]+
ttsNextIndexWithinChunk[0-9]+/[0-9]+
ttsNumChunks[0-9]+/[0-9]+
ttsNumChunksText[0-9]+/[0-9]+
ttsStartTime[0-9]+/[0-9]+

log/[0-9]+//directory
log/[0-9]+///logs//[0-9]+/[0-9]+/[0-9]+//[0-9]+
log/[0-9]+//property_keys
asr/[0-9]+/[0-9]+/asr_server_{language}
asr/[0-9]+/[0-9]+/display_language
asr/[0-9]+/[0-9]+/dummy_asr
asr/[0-9]+/[0-9]+/language
asr/[0-9]+/[0-9]+/max_segment_length
asr/[0-9]+/[0-9]+/min_segment_length
asr/[0-9]+/[0-9]+/mode
asr/[0-9]+/[0-9]+/property_keys
asr/[0-9]+/[0-9]+/segmenter
asr/[0-9]+/[0-9]+/stability_detection
asr/[0-9]+/[0-9]+/version
mt/[0-9]+/[0-9]+/display_language
mt/[0-9]+/[0-9]+/language
mt/[0-9]+/[0-9]+/LastStablePrefix
mt/[0-9]+/[0-9]+/lastTranslation
mt/[0-9]+/[0-9]+/mode
mt/[0-9]+/[0-9]+/property_keys
mt/[0-9]+/[0-9]+/StableEndTime
mt/[0-9]+/[0-9]+/StablePrefix
mt/[0-9]+/[0-9]+/StableStartTime
mt/[0-9]+/[0-9]+/StableTargetPrefix
mt/[0-9]+/[0-9]+/UnstablePrefix
mt/[0-9]+/[0-9]+/version
prep/[0-9]+/[0-9]+/property_keys
prep/[0-9]+/[0-9]+/sample_names
prep/[0-9]+/[0-9]+/task
lip/[0-9]+/[0-9]+/display_language
lip/[0-9]+/[0-9]+/facedubbing_video
lip/[0-9]+/[0-9]+/language
lip/[0-9]+/[0-9]+/property_keys
lip/[0-9]+/[0-9]+/version
textseg/[0-9]+/asr[0-9]+/display_language
textseg/[0-9]+/asr[0-9]+/language
textseg/[0-9]+/asr[0-9]+/method
textseg/[0-9]+/asr[0-9]+/property_keys
textseg/[0-9]+/asr[0-9]+summarizer/display_language
textseg/[0-9]+/asr[0-9]+summarizer/method
textseg/[0-9]+/asr[0-9]+summarizer/property_keys
textseg/[0-9]+/asrErrorCorrection[0-9]+/method
textseg/[0-9]+/asrErrorCorrection[0-9]+/property_keys
textseg/[0-9]+/ErrorCorrection[0-9]+/display_language
textseg/[0-9]+/ErrorCorrection[0-9]+/property_keys
textseg/[0-9]+/mt[0-9]+/display_language
textseg/[0-9]+/mt[0-9]+/language
textseg/[0-9]+/mt[0-9]+/method
textseg/[0-9]+/mt[0-9]+/property_keys
textseg/[0-9]+/mt[0-9]+summarizer/display_language
textseg/[0-9]+/mt[0-9]+summarizer/method
textseg/[0-9]+/mt[0-9]+summarizer/property_keys
textseg/[0-9]+/textseg:ErrorCorrection[0-9]+/language
textseg/[0-9]+/textseg:ErrorCorrection[0-9]+/property_keys
textseg/[0-9]+/tts[0-9]+/method
textseg/[0-9]+/tts[0-9]+/property_keys
tts/[0-9]+/[0-9]+/display_language
tts/[0-9]+/[0-9]+/language
tts/[0-9]+/[0-9]+/property_keys
tts/[0-9]+/[0-9]+/tts_server
tts/[0-9]+/[0-9]+/version
