# vtk DataFile Version 5.1
vtk output
ASCII
DATASET POLYDATA
POINTS 25 float
26.9381 64.728 7.20409 27.9524 65.112 7.08876 28.5201 64.3895 6.60629 
29.1379 63.668 6.1871 30.1517 63.8321 6.12339 30.7818 63.0825 5.78562 
31.6255 63.2904 5.8188 32.5559 63.0544 5.73944 33.4796 62.3789 5.59929 
34.5254 61.9333 5.61934 35.3979 61.2864 5.63635 36.2458 60.8436 5.75376 
37.1184 61.2685 6.07226 37.9812 60.643 6.28177 38.8039 59.9575 6.58566 
39.4218 59.1566 6.90479 40.1963 59.1168 7.60172 40.7456 58.5806 8.42401 
41.0404 58.1428 9.37864 41.0999 58.0267 10.4698 41.0549 58.9111 11.2777 
40.7406 58.371 12.0862 40.3633 58.3845 12.915 39.8261 58.4067 13.8016 
39.2196 58.351 14.6022 
LINES 2 25
OFFSETS vtktypeint64
0 25 
CONNECTIVITY vtktypeint64
0 1 2 3 4 5 6 7 8 
9 10 11 12 13 14 15 16 17 
18 19 20 21 22 23 24 
