# vtk DataFile Version 5.1
vtk output
ASCII
DATASET POLYDATA
POINTS 26 float
41.9886 17.1933 5.18773 41.9367 17.4562 4.84089 41.7776 17.9292 4.0981 
41.7837 18.9248 3.42816 41.7777 19.8479 2.80937 41.7217 20.6987 2.11383 
41.6542 21.4886 1.42886 41.5849 22.1425 0.862027 41.2469 22.3034 0.0886251 
40.7634 22.5141 -0.936368 40.4101 23.2097 -1.9237 40.3687 24.2624 -2.40509 
40.2331 25.3007 -2.93551 39.7922 25.782 -3.85772 39.3449 26.219 -4.77574 
38.9293 26.8918 -5.67853 38.8639 27.8484 -5.99668 38.5748 28.3854 -6.66984 
38.281 28.8957 -7.35416 38.3082 29.7465 -7.59197 37.9966 30.2057 -8.40322 
37.7699 30.8984 -9.25129 37.6399 31.6146 -10.0801 37.6481 32.327 -10.8524 
37.8653 33.0875 -11.5772 38.2369 33.8324 -12.312 
LINES 2 26
OFFSETS vtktypeint64
0 26 
CONNECTIVITY vtktypeint64
0 1 2 3 4 5 6 7 8 
9 10 11 12 13 14 15 16 17 
18 19 20 21 22 23 24 25 
