# vtk DataFile Version 5.1
vtk output
ASCII
DATASET POLYDATA
POINTS 69 float
15.5072 21.1241 30.1349 14.7233 20.9931 29.9117 13.7156 21.4555 29.8064 
12.7649 21.9039 29.6926 11.8432 22.3188 29.5821 10.9321 22.7275 29.4847 
10.1373 23.2681 29.4485 9.20704 23.0299 29.1567 8.22166 22.9938 28.9027 
7.22067 23.09 28.7022 6.26425 23.0713 28.5007 5.32875 23.128 28.3292 
4.32274 23.3314 28.2097 3.29543 23.6123 28.143 2.28863 23.8838 28.0807 
1.37967 24.1605 28.0006 0.624081 24.3729 27.8869 0.0712824 24.9341 27.8995 
-0.61674 25.578 27.8854 -1.51747 25.3143 27.5451 -2.34318 25.8066 27.4196 
-3.30381 25.7582 27.065 -4.29278 26.1367 26.834 -5.16915 26.3963 26.6138 
-6.17262 26.5554 26.3143 -7.16096 26.3152 25.9001 -7.96655 26.0597 25.5411 
-8.82456 26.5139 25.4137 -9.78089 26.9639 25.2277 -10.7042 27.1486 24.9208 
-11.6489 27.1166 24.4793 -12.4816 27.0769 24.0557 -13.3544 26.9975 23.5897 
-14.2682 27.542 23.3478 -15.503 27.6602 22.7538 -16.48 28.043 22.2929 
-17.4314 28.0412 21.6931 -18.1811 28.2069 21.2678 -18.862 28.75 20.979 
-19.437 29.2949 20.7109 -20.0824 29.4642 20.1598 -20.8135 29.7307 19.4471 
-21.488 29.8769 18.6369 -22.1035 30.0948 17.8565 -22.7028 30.444 16.9683 
-23.2499 30.967 16.1603 -23.7425 31.2271 15.3576 -24.2289 31.5073 14.5813 
-24.6964 31.889 13.8747 -25.1495 32.1907 13.1568 -25.5272 32.1112 12.3345 
-25.9606 32.1933 11.4163 -26.3897 32.3464 10.4229 -26.9061 33.0884 9.68636 
-27.3614 33.7168 8.96518 -27.843 34.447 8.35665 -28.2577 35.117 7.95622 
-28.4155 35.3693 7.19084 -28.5208 35.6799 6.2604 -28.5474 36.0572 5.21056 
-28.3285 36.0541 4.25777 -28.3947 36.6345 3.59011 -28.4616 37.4684 2.81306 
-28.302 38.0939 1.78443 -28.3913 39.2016 1.23833 -27.9092 39.5096 0.232699 
-27.623 40.4882 -0.3912 -27.3074 41.4284 -0.881675 -26.9948 42.4803 -1.28621 

LINES 2 69
OFFSETS vtktypeint64
0 69 
CONNECTIVITY vtktypeint64
0 1 2 3 4 5 6 7 8 
9 10 11 12 13 14 15 16 17 
18 19 20 21 22 23 24 25 26 
27 28 29 30 31 32 33 34 35 
36 37 38 39 40 41 42 43 44 
45 46 47 48 49 50 51 52 53 
54 55 56 57 58 59 60 61 62 
63 64 65 66 67 68 
