# vtk DataFile Version 5.1
vtk output
ASCII
DATASET POLYDATA
POINTS 44 float
-20.7089 59.0119 8.54077 -19.4864 59.401 8.42461 -18.4964 59.7817 7.78394 
-17.6208 60.0373 7.15136 -16.8088 60.2027 6.43613 -16.1007 60.3041 5.66869 
-15.5176 60.3697 5.00226 -14.6862 60.4962 4.89426 -14.2159 60.5319 3.95383 
-13.0324 60.8144 3.82483 -12.1547 60.9688 3.05028 -11.4361 61.0514 2.28004 
-10.7223 61.0996 1.57141 -9.97846 61.1352 0.934926 -9.21454 61.1451 0.333599 
-8.437 61.1124 -0.250582 -7.51555 61.0272 -0.902982 -6.34046 61.1471 -1.29473 
-5.21784 61.4122 -1.41987 -4.22325 61.4601 -1.696 -3.20396 61.2465 -2.2187 
-2.26923 61.1937 -2.50945 -1.43558 61.3947 -2.44304 -0.283712 61.5629 -2.4088 
0.745558 61.2611 -2.96131 1.603 61.4653 -2.77781 2.63946 61.363 -3.03858 
3.83726 61.4838 -2.95247 4.93442 61.5882 -2.86149 5.98885 61.7321 -2.69907 
6.99628 61.9115 -2.49879 7.67867 61.8189 -3.27087 8.61136 62.0818 -3.15317 
9.26072 62.0828 -3.86351 10.1757 62.3386 -4.12391 11.2093 62.6889 -4.41868 
12.2103 63.0742 -4.6302 13.2069 63.4882 -4.80636 14.2456 63.9678 -5.01729 
15.2121 64.4308 -5.23869 16.1471 64.915 -5.38319 17.0846 65.3796 -5.54349 
18.1366 65.8871 -5.66435 19.1063 66.2582 -6.18263 
LINES 2 44
OFFSETS vtktypeint64
0 44 
CONNECTIVITY vtktypeint64
0 1 2 3 4 5 6 7 8 
9 10 11 12 13 14 15 16 17 
18 19 20 21 22 23 24 25 26 
27 28 29 30 31 32 33 34 35 
36 37 38 39 40 41 42 43 
