{
  "@context": [
    "https://doi.org/10.5063/schema/codemeta-2.0",
    "http://schema.org"
  ],
  "@type": "SoftwareSourceCode",
  "name": "DIVAID",
  "description": "DIVAID is an open pipeline that divides atrial geometries into clinically important regions according to previously proposed definitions.",
  "author": [
    {
      "@id": "https://orcid.org/0009-0006-5222-4390",
      "@type": "Person",
      "familyName": "Goetz",
      "givenName": "Christian",
      "affiliation": [
        {
          "@type": "Organization",
          "@id": "https://ror.org/013czdx64",
          "name": "University Hospital Heidelberg"
        },
        {
          "@type": "Organization",
          "@id": "https://ror.org/04t3en479",
          "name": "Karlsruhe Institute of Technology (KIT)"
        }
      ]
    },
    {
      "@id": "https://orcid.org/0009-0006-9762-2982",
      "@type": "Person",
      "familyName": "Martínez Díaz",
      "givenName": "Patricia",
      "affiliation": [
        {
          "@type": "Organization",
          "@id": "https://ror.org/04t3en479",
          "name": "Karlsruhe Institute of Technology (KIT)"
        }
      ]
    },
    {
      "@id": "https://orcid.org/0000-0002-2487-4744",
      "@type": "Person",
      "familyName": "Loewe",
      "givenName": "Axel",
      "affiliation": [
        {
          "@type": "Organization",
          "@id": "https://ror.org/04t3en479",
          "name": "Karlsruhe Institute of Technology (KIT)"
        }
      ]
    }
  ],
  "copyrightHolder": [
    {
      "@id": "https://ror.org/04t3en479",
      "@type": "Organization",
      "name": "Karlsruhe Institute of Technology (KIT)"
    }
  ],
  "publisher": {
    "@id": "https://ror.org/04t3en479",
    "@type": "Organization",
    "name": "Karlsruhe Institute of Technology (KIT)"
  },
  "keywords": [
    "atria",
    "segments",
    "regions",
    {
      "@type": "DefinedTerm",
      "name": "Cardiology",
      "url": "http://id.loc.gov/authorities/subjects/sh85020214",
      "inDefinedTermSet": "http://id.loc.gov/authorities/subjects"
    },
    {
      "@type": "DefinedTerm",
      "name": "Cardiology--Research",
      "url": "http://id.loc.gov/authorities/subjects/sh85020215",
      "inDefinedTermSet": "http://id.loc.gov/authorities/subjects"
    },
    {
      "@type": "DefinedTerm",
      "name": "Heart--Imaging",
      "url": "http://id.loc.gov/authorities/subjects/sh87005052 ",
      "inDefinedTermSet": "http://id.loc.gov/authorities/subjects"
    },
    {
      "@type": "DefinedTerm",
      "name": "Heart Atrium",
      "url": "http://id.loc.gov/authorities/subjects/sh85059740",
      "inDefinedTermSet": "http://id.loc.gov/authorities/subjects"
    },
    {
      "@type": "DefinedTerm",
      "name": "Medicine",
      "inDefinedTermSet": "https://www.radar-service.eu/schemas/descriptive/radar/v09/radar-types"
    }
  ],
  "license": "https://spdx.org/licenses/Apache-2.0",
  "issueTracker": "https://gitlab.kit.edu/kit/ibt-public/divaid/-/issues",
  "codeRepository": "https://gitlab.kit.edu/kit/ibt-public/divaid",
  "developmentStatus": "active",
  "version": "v1.2",
  "dateModified": "2024-09-28",
  "maintainer": "https://orcid.org/0009-0006-5222-4390",
  "identifier": [
    {
      "@type": "PropertyValue",
      "propertyID": "DOI",
      "value": "10.35097/yyf3axgmmj84tc38"
    },
    {
      "@type": "PropertyValue",
      "propertyID": "RADAR",
      "value": "yyf3axgmmj84tc38"
    }
  ],
  "@id": "https://doi.org/10.35097/yyf3axgmmj84tc38",
  "funding": [
    {
      "@type": "Grant",
      "name": "Rolling out the openCARP simulator as a sustainable e-research infrastructure: CARPe-diem",
      "identifier": 507828355,
      "url": "https://gepris.dfg.de/gepris/projekt/507828355?language=en",
      "funder": {
        "@type": "Organization",
        "@id": "https://ror.org/018mejw64",
        "name": "Deutsche Forschungsgemeinschaft"
      }
    },
    {
      "@type": "Grant",
      "name": "PersonalizeAF",
      "identifier": 860974,
      "url": "https://personalizeaf.net",
      "funder": {
        "@type": "Organization",
        "@id": "https://ror.org/00k4n6c32",
        "name": "European Commission"
      }
    }
  ]
}