%!PS-Adobe-3.0 EPSF-3.0
%%Creator: (MATLAB, The Mathworks, Inc. Version 9.8.0.1359463 \(R2020a\) Update 1. Operating System: Mac OS X)
%%Title: Straights/ScanG1.eps
%%CreationDate: 2022-08-02T07:37:20
%%Pages: (atend)
%%BoundingBox:    11    12   340   327
%%LanguageLevel: 3
%%EndComments
%%BeginProlog
%%BeginResource: procset (Apache XML Graphics Std ProcSet) 1.2 0
%%Version: 1.2 0
%%Copyright: (Copyright 2001-2003,2010 The Apache Software Foundation. License terms: http://www.apache.org/licenses/LICENSE-2.0)
/bd{bind def}bind def
/ld{load def}bd
/GR/grestore ld
/GS/gsave ld
/RM/rmoveto ld
/C/curveto ld
/t/show ld
/L/lineto ld
/ML/setmiterlimit ld
/CT/concat ld
/f/fill ld
/N/newpath ld
/S/stroke ld
/CC/setcmykcolor ld
/A/ashow ld
/cp/closepath ld
/RC/setrgbcolor ld
/LJ/setlinejoin ld
/GC/setgray ld
/LW/setlinewidth ld
/M/moveto ld
/re {4 2 roll M
1 index 0 rlineto
0 exch rlineto
neg 0 rlineto
cp } bd
/_ctm matrix def
/_tm matrix def
/BT { _ctm currentmatrix pop matrix _tm copy pop 0 0 moveto } bd
/ET { _ctm setmatrix } bd
/iTm { _ctm setmatrix _tm concat } bd
/Tm { _tm astore pop iTm 0 0 moveto } bd
/ux 0.0 def
/uy 0.0 def
/F {
  /Tp exch def
  /Tf exch def
  Tf findfont Tp scalefont setfont
  /cf Tf def  /cs Tp def
} bd
/ULS {currentpoint /uy exch def /ux exch def} bd
/ULE {
  /Tcx currentpoint pop def
  gsave
  newpath
  cf findfont cs scalefont dup
  /FontMatrix get 0 get /Ts exch def /FontInfo get dup
  /UnderlinePosition get Ts mul /To exch def
  /UnderlineThickness get Ts mul /Tt exch def
  ux uy To add moveto  Tcx uy To add lineto
  Tt setlinewidth stroke
  grestore
} bd
/OLE {
  /Tcx currentpoint pop def
  gsave
  newpath
  cf findfont cs scalefont dup
  /FontMatrix get 0 get /Ts exch def /FontInfo get dup
  /UnderlinePosition get Ts mul /To exch def
  /UnderlineThickness get Ts mul /Tt exch def
  ux uy To add cs add moveto Tcx uy To add cs add lineto
  Tt setlinewidth stroke
  grestore
} bd
/SOE {
  /Tcx currentpoint pop def
  gsave
  newpath
  cf findfont cs scalefont dup
  /FontMatrix get 0 get /Ts exch def /FontInfo get dup
  /UnderlinePosition get Ts mul /To exch def
  /UnderlineThickness get Ts mul /Tt exch def
  ux uy To add cs 10 mul 26 idiv add moveto Tcx uy To add cs 10 mul 26 idiv add lineto
  Tt setlinewidth stroke
  grestore
} bd
/QT {
/Y22 exch store
/X22 exch store
/Y21 exch store
/X21 exch store
currentpoint
/Y21 load 2 mul add 3 div exch
/X21 load 2 mul add 3 div exch
/X21 load 2 mul /X22 load add 3 div
/Y21 load 2 mul /Y22 load add 3 div
/X22 load /Y22 load curveto
} bd
/SSPD {
dup length /d exch dict def
{
/v exch def
/k exch def
currentpagedevice k known {
/cpdv currentpagedevice k get def
v cpdv ne {
/upd false def
/nullv v type /nulltype eq def
/nullcpdv cpdv type /nulltype eq def
nullv nullcpdv or
{
/upd true def
} {
/sametype v type cpdv type eq def
sametype {
v type /arraytype eq {
/vlen v length def
/cpdvlen cpdv length def
vlen cpdvlen eq {
0 1 vlen 1 sub {
/i exch def
/obj v i get def
/cpdobj cpdv i get def
obj cpdobj ne {
/upd true def
exit
} if
} for
} {
/upd true def
} ifelse
} {
v type /dicttype eq {
v {
/dv exch def
/dk exch def
/cpddv cpdv dk get def
dv cpddv ne {
/upd true def
exit
} if
} forall
} {
/upd true def
} ifelse
} ifelse
} if
} ifelse
upd true eq {
d k v put
} if
} if
} if
} forall
d length 0 gt {
d setpagedevice
} if
} bd
/RE { % /NewFontName [NewEncodingArray] /FontName RE -
  findfont dup length dict begin
  {
    1 index /FID ne
    {def} {pop pop} ifelse
  } forall
  /Encoding exch def
  /FontName 1 index def
  currentdict definefont pop
  end
} bind def
%%EndResource
%%BeginResource: procset (Apache XML Graphics EPS ProcSet) 1.0 0
%%Version: 1.0 0
%%Copyright: (Copyright 2002-2003 The Apache Software Foundation. License terms: http://www.apache.org/licenses/LICENSE-2.0)
/BeginEPSF { %def
/b4_Inc_state save def         % Save state for cleanup
/dict_count countdictstack def % Count objects on dict stack
/op_count count 1 sub def      % Count objects on operand stack
userdict begin                 % Push userdict on dict stack
/showpage { } def              % Redefine showpage, { } = null proc
0 setgray 0 setlinecap         % Prepare graphics state
1 setlinewidth 0 setlinejoin
10 setmiterlimit [ ] 0 setdash newpath
/languagelevel where           % If level not equal to 1 then
{pop languagelevel             % set strokeadjust and
1 ne                           % overprint to their defaults.
{false setstrokeadjust false setoverprint
} if
} if
} bd
/EndEPSF { %def
count op_count sub {pop} repeat            % Clean up stacks
countdictstack dict_count sub {end} repeat
b4_Inc_state restore
} bd
%%EndResource
%FOPBeginFontDict
%%IncludeResource: font Courier-Oblique
%%IncludeResource: font Courier-BoldOblique
%%IncludeResource: font Courier-Bold
%%IncludeResource: font ZapfDingbats
%%IncludeResource: font Symbol
%%IncludeResource: font Helvetica
%%IncludeResource: font Helvetica-Oblique
%%IncludeResource: font Helvetica-Bold
%%IncludeResource: font Helvetica-BoldOblique
%%IncludeResource: font Times-Roman
%%IncludeResource: font Times-Italic
%%IncludeResource: font Times-Bold
%%IncludeResource: font Times-BoldItalic
%%IncludeResource: font Courier
%FOPEndFontDict
%%BeginResource: encoding WinAnsiEncoding
/WinAnsiEncoding [
/.notdef /.notdef /.notdef /.notdef /.notdef
/.notdef /.notdef /.notdef /.notdef /.notdef
/.notdef /.notdef /.notdef /.notdef /.notdef
/.notdef /.notdef /.notdef /.notdef /.notdef
/.notdef /.notdef /.notdef /.notdef /.notdef
/.notdef /.notdef /.notdef /.notdef /.notdef
/.notdef /.notdef /space /exclam /quotedbl
/numbersign /dollar /percent /ampersand /quotesingle
/parenleft /parenright /asterisk /plus /comma
/hyphen /period /slash /zero /one
/two /three /four /five /six
/seven /eight /nine /colon /semicolon
/less /equal /greater /question /at
/A /B /C /D /E
/F /G /H /I /J
/K /L /M /N /O
/P /Q /R /S /T
/U /V /W /X /Y
/Z /bracketleft /backslash /bracketright /asciicircum
/underscore /quoteleft /a /b /c
/d /e /f /g /h
/i /j /k /l /m
/n /o /p /q /r
/s /t /u /v /w
/x /y /z /braceleft /bar
/braceright /asciitilde /bullet /Euro /bullet
/quotesinglbase /florin /quotedblbase /ellipsis /dagger
/daggerdbl /circumflex /perthousand /Scaron /guilsinglleft
/OE /bullet /Zcaron /bullet /bullet
/quoteleft /quoteright /quotedblleft /quotedblright /bullet
/endash /emdash /asciitilde /trademark /scaron
/guilsinglright /oe /bullet /zcaron /Ydieresis
/space /exclamdown /cent /sterling /currency
/yen /brokenbar /section /dieresis /copyright
/ordfeminine /guillemotleft /logicalnot /sfthyphen /registered
/macron /degree /plusminus /twosuperior /threesuperior
/acute /mu /paragraph /middot /cedilla
/onesuperior /ordmasculine /guillemotright /onequarter /onehalf
/threequarters /questiondown /Agrave /Aacute /Acircumflex
/Atilde /Adieresis /Aring /AE /Ccedilla
/Egrave /Eacute /Ecircumflex /Edieresis /Igrave
/Iacute /Icircumflex /Idieresis /Eth /Ntilde
/Ograve /Oacute /Ocircumflex /Otilde /Odieresis
/multiply /Oslash /Ugrave /Uacute /Ucircumflex
/Udieresis /Yacute /Thorn /germandbls /agrave
/aacute /acircumflex /atilde /adieresis /aring
/ae /ccedilla /egrave /eacute /ecircumflex
/edieresis /igrave /iacute /icircumflex /idieresis
/eth /ntilde /ograve /oacute /ocircumflex
/otilde /odieresis /divide /oslash /ugrave
/uacute /ucircumflex /udieresis /yacute /thorn
/ydieresis
] def
%%EndResource
%FOPBeginFontReencode
/Courier-Oblique findfont
dup length dict begin
  {1 index /FID ne {def} {pop pop} ifelse} forall
  /Encoding WinAnsiEncoding def
  currentdict
end
/Courier-Oblique exch definefont pop
/Courier-BoldOblique findfont
dup length dict begin
  {1 index /FID ne {def} {pop pop} ifelse} forall
  /Encoding WinAnsiEncoding def
  currentdict
end
/Courier-BoldOblique exch definefont pop
/Courier-Bold findfont
dup length dict begin
  {1 index /FID ne {def} {pop pop} ifelse} forall
  /Encoding WinAnsiEncoding def
  currentdict
end
/Courier-Bold exch definefont pop
/Helvetica findfont
dup length dict begin
  {1 index /FID ne {def} {pop pop} ifelse} forall
  /Encoding WinAnsiEncoding def
  currentdict
end
/Helvetica exch definefont pop
/Helvetica-Oblique findfont
dup length dict begin
  {1 index /FID ne {def} {pop pop} ifelse} forall
  /Encoding WinAnsiEncoding def
  currentdict
end
/Helvetica-Oblique exch definefont pop
/Helvetica-Bold findfont
dup length dict begin
  {1 index /FID ne {def} {pop pop} ifelse} forall
  /Encoding WinAnsiEncoding def
  currentdict
end
/Helvetica-Bold exch definefont pop
/Helvetica-BoldOblique findfont
dup length dict begin
  {1 index /FID ne {def} {pop pop} ifelse} forall
  /Encoding WinAnsiEncoding def
  currentdict
end
/Helvetica-BoldOblique exch definefont pop
/Times-Roman findfont
dup length dict begin
  {1 index /FID ne {def} {pop pop} ifelse} forall
  /Encoding WinAnsiEncoding def
  currentdict
end
/Times-Roman exch definefont pop
/Times-Italic findfont
dup length dict begin
  {1 index /FID ne {def} {pop pop} ifelse} forall
  /Encoding WinAnsiEncoding def
  currentdict
end
/Times-Italic exch definefont pop
/Times-Bold findfont
dup length dict begin
  {1 index /FID ne {def} {pop pop} ifelse} forall
  /Encoding WinAnsiEncoding def
  currentdict
end
/Times-Bold exch definefont pop
/Times-BoldItalic findfont
dup length dict begin
  {1 index /FID ne {def} {pop pop} ifelse} forall
  /Encoding WinAnsiEncoding def
  currentdict
end
/Times-BoldItalic exch definefont pop
/Courier findfont
dup length dict begin
  {1 index /FID ne {def} {pop pop} ifelse} forall
  /Encoding WinAnsiEncoding def
  currentdict
end
/Courier exch definefont pop
%FOPEndFontReencode
%%EndProlog
%%Page: 1 1
%%PageBoundingBox: 0 0 334 345
%%BeginPageSetup
[1 0 0 -1 0 345] CT
%%EndPageSetup
GS
1 GC
N
0 0 334 345 re
f
GR
GS
1 GC
N
0 0 334 345 re
f
GR
GS
1 GC
N
59 288.5 M
280.5 288.5 L
280.5 26 L
59 26 L
cp
f
GR
GS
0.66 GC
1 LJ
1.2 LW
N
59 288.5 M
59 26 L
S
GR
GS
0.66 GC
1 LJ
1.2 LW
N
103.3 288.5 M
103.3 26 L
S
GR
GS
0.66 GC
1 LJ
1.2 LW
N
147.6 288.5 M
147.6 26 L
S
GR
GS
0.66 GC
1 LJ
1.2 LW
N
191.9 288.5 M
191.9 26 L
S
GR
GS
0.66 GC
1 LJ
1.2 LW
N
236.2 288.5 M
236.2 26 L
S
GR
GS
0.66 GC
1 LJ
1.2 LW
N
280.5 288.5 M
280.5 26 L
S
GR
GS
0.6 GC
1 LJ
1.2 LW
N
280.5 288.5 M
59 288.5 L
S
GR
GS
0.6 GC
1 LJ
1.2 LW
N
280.5 236 M
59 236 L
S
GR
GS
0.6 GC
1 LJ
1.2 LW
N
280.5 183.5 M
59 183.5 L
S
GR
GS
0.6 GC
1 LJ
1.2 LW
N
280.5 131 M
59 131 L
S
GR
GS
0.6 GC
1 LJ
1.2 LW
N
280.5 78.5 M
59 78.5 L
S
GR
GS
0.6 GC
1 LJ
1.2 LW
N
280.5 26 M
59 26 L
S
GR
GS
0.149 GC
2 setlinecap
1 LJ
1.2 LW
N
59 288.5 M
280.5 288.5 L
S
GR
GS
0.149 GC
2 setlinecap
1 LJ
1.2 LW
N
59 26 M
280.5 26 L
S
GR
GS
0.149 GC
2 setlinecap
1 LJ
1.2 LW
N
59 288.5 M
59 281.938 L
S
GR
GS
0.149 GC
2 setlinecap
1 LJ
1.2 LW
N
103.3 288.5 M
103.3 281.938 L
S
GR
GS
0.149 GC
2 setlinecap
1 LJ
1.2 LW
N
147.6 288.5 M
147.6 281.938 L
S
GR
GS
0.149 GC
2 setlinecap
1 LJ
1.2 LW
N
191.9 288.5 M
191.9 281.938 L
S
GR
GS
0.149 GC
2 setlinecap
1 LJ
1.2 LW
N
236.2 288.5 M
236.2 281.938 L
S
GR
GS
0.149 GC
2 setlinecap
1 LJ
1.2 LW
N
280.5 288.5 M
280.5 281.938 L
S
GR
GS
0.149 GC
2 setlinecap
1 LJ
1.2 LW
N
59 26 M
59 32.562 L
S
GR
GS
0.149 GC
2 setlinecap
1 LJ
1.2 LW
N
103.3 26 M
103.3 32.562 L
S
GR
GS
0.149 GC
2 setlinecap
1 LJ
1.2 LW
N
147.6 26 M
147.6 32.562 L
S
GR
GS
0.149 GC
2 setlinecap
1 LJ
1.2 LW
N
191.9 26 M
191.9 32.562 L
S
GR
GS
0.149 GC
2 setlinecap
1 LJ
1.2 LW
N
236.2 26 M
236.2 32.562 L
S
GR
GS
0.149 GC
2 setlinecap
1 LJ
1.2 LW
N
280.5 26 M
280.5 32.562 L
S
GR
GS
[1 0 0 1 59 293.70001] CT
0.149 GC
/Helvetica 16 F
GS
[1 0 0 1 0 0] CT
-13.5 16 moveto 
1 -1 scale
(300) t 
GR
GR
GS
[1 0 0 1 103.3 293.70001] CT
0.149 GC
/Helvetica 16 F
GS
[1 0 0 1 0 0] CT
-13.5 16 moveto 
1 -1 scale
(400) t 
GR
GR
GS
[1 0 0 1 147.60001 293.70001] CT
0.149 GC
/Helvetica 16 F
GS
[1 0 0 1 0 0] CT
-13.5 16 moveto 
1 -1 scale
(500) t 
GR
GR
GS
[1 0 0 1 191.89999 293.70001] CT
0.149 GC
/Helvetica 16 F
GS
[1 0 0 1 0 0] CT
-13.5 16 moveto 
1 -1 scale
(600) t 
GR
GR
GS
[1 0 0 1 236.2 293.70001] CT
0.149 GC
/Helvetica 16 F
GS
[1 0 0 1 0 0] CT
-13.5 16 moveto 
1 -1 scale
(700) t 
GR
GR
GS
[1 0 0 1 280.5 293.70001] CT
0.149 GC
/Helvetica 16 F
GS
[1 0 0 1 0 0] CT
-13.5 16 moveto 
1 -1 scale
(800) t 
GR
GR
GS
[1 0 0 1 169.75011 313.70001] CT
0.149 GC
N
-66.424 14.784 M
-66.424 14.143 L
-65.815 14.143 -65.416 14.05 QT
-65.018 13.956 -65.018 13.581 QT
-65.018 7.659 L
-66.409 7.659 L
-66.409 7.018 L
-65.018 7.018 L
-65.018 4.862 L
-65.018 4.284 -64.776 3.784 QT
-64.534 3.284 -64.127 2.901 QT
-63.721 2.518 -63.19 2.307 QT
-62.659 2.096 -62.096 2.096 QT
-61.487 2.096 -60.995 2.456 QT
-60.502 2.815 -60.502 3.409 QT
-60.502 3.753 -60.737 3.987 QT
-60.971 4.221 -61.315 4.221 QT
-61.659 4.221 -61.901 3.987 QT
-62.143 3.753 -62.143 3.409 QT
-62.143 2.846 -61.659 2.659 QT
-61.955 2.565 -62.174 2.565 QT
-62.705 2.565 -63.08 2.932 QT
-63.455 3.3 -63.635 3.839 QT
-63.815 4.378 -63.815 4.909 QT
-63.815 7.018 L
-61.752 7.018 L
-61.752 7.659 L
-63.752 7.659 L
-63.752 13.581 L
-63.752 13.956 -63.229 14.05 QT
-62.705 14.143 -62.018 14.143 QT
-62.018 14.784 L
-66.424 14.784 L
cp
f
GR
GS
[1 0 0 1 169.75011 313.70001] CT
0.149 GC
N
-61.156 14.784 M
-61.156 14.143 L
-60.546 14.143 -60.148 14.05 QT
-59.75 13.956 -59.75 13.581 QT
-59.75 8.659 L
-59.75 8.19 -59.898 7.971 QT
-60.046 7.753 -60.32 7.706 QT
-60.593 7.659 -61.156 7.659 QT
-61.156 7.018 L
-58.578 6.831 L
-58.578 8.581 L
-58.296 7.8 -57.757 7.315 QT
-57.218 6.831 -56.453 6.831 QT
-55.921 6.831 -55.5 7.143 QT
-55.078 7.456 -55.078 7.987 QT
-55.078 8.3 -55.312 8.542 QT
-55.546 8.784 -55.89 8.784 QT
-56.218 8.784 -56.453 8.55 QT
-56.687 8.315 -56.687 7.987 QT
-56.687 7.503 -56.343 7.3 QT
-56.453 7.3 L
-57.187 7.3 -57.648 7.823 QT
-58.109 8.346 -58.304 9.128 QT
-58.5 9.909 -58.5 10.628 QT
-58.5 13.581 L
-58.5 14.143 -56.75 14.143 QT
-56.75 14.784 L
-61.156 14.784 L
cp
f
GR
GS
[1 0 0 1 169.75011 313.70001] CT
0.149 GC
N
-50.247 14.987 M
-51.341 14.987 -52.262 14.409 QT
-53.184 13.831 -53.708 12.87 QT
-54.231 11.909 -54.231 10.831 QT
-54.231 9.784 -53.755 8.831 QT
-53.278 7.878 -52.419 7.3 QT
-51.559 6.721 -50.497 6.721 QT
-49.684 6.721 -49.067 6.995 QT
-48.45 7.268 -48.059 7.76 QT
-47.669 8.253 -47.466 8.925 QT
-47.262 9.596 -47.262 10.393 QT
-47.262 10.628 -47.45 10.628 QT
-52.653 10.628 L
-52.653 10.815 L
-52.653 12.315 -52.051 13.385 QT
-51.45 14.456 -50.091 14.456 QT
-49.544 14.456 -49.067 14.214 QT
-48.591 13.971 -48.247 13.526 QT
-47.903 13.081 -47.778 12.581 QT
-47.762 12.518 -47.716 12.471 QT
-47.669 12.425 -47.606 12.425 QT
-47.45 12.425 L
-47.262 12.425 -47.262 12.659 QT
-47.512 13.675 -48.356 14.331 QT
-49.2 14.987 -50.247 14.987 QT
cp
-52.637 10.175 M
-48.528 10.175 L
-48.528 9.503 -48.723 8.807 QT
-48.919 8.112 -49.356 7.651 QT
-49.794 7.19 -50.497 7.19 QT
-51.528 7.19 -52.083 8.143 QT
-52.637 9.096 -52.637 10.175 QT
cp
f
GR
GS
[1 0 0 1 169.75011 313.70001] CT
0.149 GC
N
-41.518 18.268 M
-41.518 17.643 L
-40.893 17.643 -40.503 17.542 QT
-40.112 17.44 -40.112 17.065 QT
-40.112 13.737 L
-40.534 14.3 -41.175 14.643 QT
-41.815 14.987 -42.518 14.987 QT
-43.315 14.987 -44.011 14.651 QT
-44.706 14.315 -45.221 13.745 QT
-45.737 13.175 -46.026 12.425 QT
-46.315 11.675 -46.315 10.893 QT
-46.315 9.831 -45.784 8.885 QT
-45.253 7.94 -44.339 7.385 QT
-43.425 6.831 -42.362 6.831 QT
-41.596 6.831 -40.94 7.26 QT
-40.284 7.69 -39.909 8.409 QT
-39.268 6.831 L
-38.784 6.831 L
-38.784 17.065 L
-38.784 17.44 -38.393 17.542 QT
-38.003 17.643 -37.393 17.643 QT
-37.393 18.268 L
-41.518 18.268 L
cp
-42.409 14.518 M
-41.612 14.518 -40.979 13.979 QT
-40.346 13.44 -40.05 12.643 QT
-40.05 9.471 L
-40.237 8.612 -40.815 7.979 QT
-41.393 7.346 -42.206 7.346 QT
-42.815 7.346 -43.3 7.675 QT
-43.784 8.003 -44.104 8.542 QT
-44.425 9.081 -44.589 9.714 QT
-44.753 10.346 -44.753 10.909 QT
-44.753 11.643 -44.495 12.487 QT
-44.237 13.331 -43.706 13.925 QT
-43.175 14.518 -42.409 14.518 QT
cp
f
GR
GS
[1 0 0 1 169.75011 313.70001] CT
0.149 GC
N
-35.683 12.643 M
-35.683 8.659 L
-35.683 8.19 -35.823 7.971 QT
-35.964 7.753 -36.237 7.706 QT
-36.511 7.659 -37.089 7.659 QT
-37.089 7.018 L
-34.354 6.831 L
-34.354 12.643 L
-34.354 13.346 -34.253 13.737 QT
-34.151 14.128 -33.823 14.323 QT
-33.495 14.518 -32.776 14.518 QT
-31.808 14.518 -31.237 13.706 QT
-30.667 12.893 -30.667 11.862 QT
-30.667 8.659 L
-30.667 8.19 -30.815 7.971 QT
-30.964 7.753 -31.229 7.706 QT
-31.495 7.659 -32.073 7.659 QT
-32.073 7.018 L
-29.354 6.831 L
-29.354 13.143 L
-29.354 13.628 -29.214 13.839 QT
-29.073 14.05 -28.8 14.096 QT
-28.526 14.143 -27.948 14.143 QT
-27.948 14.784 L
-30.62 14.987 L
-30.62 13.471 L
-30.948 14.143 -31.55 14.565 QT
-32.151 14.987 -32.87 14.987 QT
-34.151 14.987 -34.917 14.44 QT
-35.683 13.893 -35.683 12.643 QT
cp
f
GR
GS
[1 0 0 1 169.75011 313.70001] CT
0.149 GC
N
-23.358 14.987 M
-24.452 14.987 -25.373 14.409 QT
-26.295 13.831 -26.819 12.87 QT
-27.342 11.909 -27.342 10.831 QT
-27.342 9.784 -26.866 8.831 QT
-26.389 7.878 -25.53 7.3 QT
-24.67 6.721 -23.608 6.721 QT
-22.795 6.721 -22.178 6.995 QT
-21.561 7.268 -21.17 7.76 QT
-20.78 8.253 -20.577 8.925 QT
-20.373 9.596 -20.373 10.393 QT
-20.373 10.628 -20.561 10.628 QT
-25.764 10.628 L
-25.764 10.815 L
-25.764 12.315 -25.163 13.385 QT
-24.561 14.456 -23.202 14.456 QT
-22.655 14.456 -22.178 14.214 QT
-21.702 13.971 -21.358 13.526 QT
-21.014 13.081 -20.889 12.581 QT
-20.873 12.518 -20.827 12.471 QT
-20.78 12.425 -20.717 12.425 QT
-20.561 12.425 L
-20.373 12.425 -20.373 12.659 QT
-20.623 13.675 -21.467 14.331 QT
-22.311 14.987 -23.358 14.987 QT
cp
-25.748 10.175 M
-21.639 10.175 L
-21.639 9.503 -21.834 8.807 QT
-22.03 8.112 -22.467 7.651 QT
-22.905 7.19 -23.608 7.19 QT
-24.639 7.19 -25.194 8.143 QT
-25.748 9.096 -25.748 10.175 QT
cp
f
GR
GS
[1 0 0 1 169.75011 313.70001] CT
0.149 GC
N
-19.489 14.784 M
-19.489 14.143 L
-18.864 14.143 -18.473 14.05 QT
-18.083 13.956 -18.083 13.581 QT
-18.083 8.659 L
-18.083 8.19 -18.223 7.971 QT
-18.364 7.753 -18.637 7.706 QT
-18.911 7.659 -19.489 7.659 QT
-19.489 7.018 L
-16.879 6.831 L
-16.879 8.581 L
-16.52 7.815 -15.809 7.323 QT
-15.098 6.831 -14.27 6.831 QT
-13.02 6.831 -12.387 7.425 QT
-11.754 8.018 -11.754 9.253 QT
-11.754 13.581 L
-11.754 13.956 -11.364 14.05 QT
-10.973 14.143 -10.348 14.143 QT
-10.348 14.784 L
-14.473 14.784 L
-14.473 14.143 L
-13.864 14.143 -13.465 14.05 QT
-13.067 13.956 -13.067 13.581 QT
-13.067 9.315 L
-13.067 8.425 -13.325 7.862 QT
-13.583 7.3 -14.364 7.3 QT
-15.411 7.3 -16.083 8.135 QT
-16.754 8.971 -16.754 10.034 QT
-16.754 13.581 L
-16.754 13.956 -16.364 14.05 QT
-15.973 14.143 -15.364 14.143 QT
-15.364 14.784 L
-19.489 14.784 L
cp
f
GR
GS
[1 0 0 1 169.75011 313.70001] CT
0.149 GC
N
-5.758 14.987 M
-6.852 14.987 -7.734 14.417 QT
-8.617 13.846 -9.133 12.901 QT
-9.648 11.956 -9.648 10.893 QT
-9.648 9.831 -9.141 8.854 QT
-8.633 7.878 -7.742 7.3 QT
-6.852 6.721 -5.758 6.721 QT
-4.711 6.721 -3.844 7.128 QT
-2.977 7.534 -2.977 8.487 QT
-2.977 8.831 -3.227 9.089 QT
-3.477 9.346 -3.836 9.346 QT
-4.195 9.346 -4.445 9.089 QT
-4.695 8.831 -4.695 8.487 QT
-4.695 8.159 -4.492 7.932 QT
-4.289 7.706 -3.992 7.643 QT
-4.617 7.237 -5.742 7.237 QT
-6.602 7.237 -7.133 7.807 QT
-7.664 8.378 -7.875 9.221 QT
-8.086 10.065 -8.086 10.893 QT
-8.086 11.768 -7.82 12.581 QT
-7.555 13.393 -6.984 13.925 QT
-6.414 14.456 -5.539 14.456 QT
-4.68 14.456 -4.086 13.932 QT
-3.492 13.409 -3.273 12.565 QT
-3.273 12.456 -3.133 12.456 QT
-2.914 12.456 L
-2.852 12.456 -2.813 12.51 QT
-2.773 12.565 -2.773 12.628 QT
-2.773 12.675 L
-3.039 13.737 -3.852 14.362 QT
-4.664 14.987 -5.758 14.987 QT
cp
f
GR
GS
[1 0 0 1 169.75011 313.70001] CT
0.149 GC
N
-1.186 17.737 M
-0.842 18.003 -0.42 18.003 QT
0.705 18.003 1.424 16.3 QT
2.049 14.784 L
-0.654 8.175 L
-0.826 7.846 -1.162 7.753 QT
-1.498 7.659 -2.076 7.659 QT
-2.076 7.018 L
1.705 7.018 L
1.705 7.659 L
0.705 7.659 0.705 8.081 QT
0.705 8.159 0.721 8.19 QT
2.736 13.112 L
4.533 8.69 L
4.58 8.55 4.58 8.378 QT
4.58 8.159 4.463 7.995 QT
4.346 7.831 4.158 7.745 QT
3.971 7.659 3.736 7.659 QT
3.736 7.018 L
6.721 7.018 L
6.721 7.659 L
6.174 7.659 5.752 7.909 QT
5.33 8.159 5.111 8.659 QT
1.986 16.3 L
1.752 16.878 1.416 17.362 QT
1.08 17.846 0.611 18.159 QT
0.142 18.471 -0.42 18.471 QT
-1.076 18.471 -1.576 18.042 QT
-2.076 17.612 -2.076 16.971 QT
-2.076 16.628 -1.85 16.401 QT
-1.623 16.175 -1.279 16.175 QT
-1.061 16.175 -0.881 16.276 QT
-0.701 16.378 -0.6 16.55 QT
-0.498 16.721 -0.498 16.971 QT
-0.498 17.253 -0.693 17.479 QT
-0.889 17.706 -1.186 17.737 QT
cp
f
GR
GS
[1 0 0 1 169.75011 313.70001] CT
0.149 GC
N
13.282 14.784 M
13.282 14.143 L
13.907 14.143 14.298 14.05 QT
14.689 13.956 14.689 13.581 QT
14.689 8.659 L
14.689 7.971 14.423 7.815 QT
14.157 7.659 13.376 7.659 QT
13.376 7.018 L
15.954 6.831 L
15.954 13.581 L
15.954 13.956 16.298 14.05 QT
16.642 14.143 17.22 14.143 QT
17.22 14.784 L
13.282 14.784 L
cp
14.048 3.737 M
14.048 3.346 14.353 3.042 QT
14.657 2.737 15.032 2.737 QT
15.298 2.737 15.532 2.87 QT
15.767 3.003 15.9 3.245 QT
16.032 3.487 16.032 3.737 QT
16.032 4.128 15.736 4.425 QT
15.439 4.721 15.032 4.721 QT
14.657 4.721 14.353 4.425 QT
14.048 4.128 14.048 3.737 QT
cp
f
GR
GS
[1 0 0 1 169.75011 313.70001] CT
0.149 GC
N
18.156 14.784 M
18.156 14.143 L
18.781 14.143 19.171 14.05 QT
19.562 13.956 19.562 13.581 QT
19.562 8.659 L
19.562 8.19 19.421 7.971 QT
19.281 7.753 19.007 7.706 QT
18.734 7.659 18.156 7.659 QT
18.156 7.018 L
20.765 6.831 L
20.765 8.581 L
21.124 7.815 21.835 7.323 QT
22.546 6.831 23.374 6.831 QT
24.624 6.831 25.257 7.425 QT
25.89 8.018 25.89 9.253 QT
25.89 13.581 L
25.89 13.956 26.281 14.05 QT
26.671 14.143 27.296 14.143 QT
27.296 14.784 L
23.171 14.784 L
23.171 14.143 L
23.781 14.143 24.179 14.05 QT
24.578 13.956 24.578 13.581 QT
24.578 9.315 L
24.578 8.425 24.32 7.862 QT
24.062 7.3 23.281 7.3 QT
22.234 7.3 21.562 8.135 QT
20.89 8.971 20.89 10.034 QT
20.89 13.581 L
20.89 13.956 21.281 14.05 QT
21.671 14.143 22.281 14.143 QT
22.281 14.784 L
18.156 14.784 L
cp
f
GR
GS
[1 0 0 1 169.75011 313.70001] CT
0.149 GC
N
36.316 14.784 M
36.316 14.143 L
37.222 14.143 38.074 14.05 QT
38.925 13.956 38.925 13.581 QT
38.925 3.69 L
38.925 3.3 38.706 3.214 QT
38.488 3.128 38.003 3.128 QT
37.253 3.128 L
35.769 3.128 35.144 3.768 QT
34.816 4.096 34.675 4.815 QT
34.535 5.534 34.441 6.612 QT
33.925 6.612 L
34.269 2.487 L
45.253 2.487 L
45.597 6.612 L
45.066 6.612 L
44.972 5.456 44.839 4.768 QT
44.706 4.081 44.378 3.768 QT
43.753 3.128 42.269 3.128 QT
41.519 3.128 L
41.191 3.128 41.011 3.151 QT
40.831 3.175 40.714 3.3 QT
40.597 3.425 40.597 3.69 QT
40.597 13.581 L
40.597 13.956 41.449 14.05 QT
42.3 14.143 43.206 14.143 QT
43.206 14.784 L
36.316 14.784 L
cp
f
GR
GS
[1 0 0 1 169.75011 313.70001] CT
0.149 GC
N
46.527 14.784 M
46.527 14.143 L
48.386 14.143 48.386 13.581 QT
48.386 3.69 L
48.386 3.128 46.527 3.128 QT
46.527 2.487 L
51.918 2.487 L
51.918 3.128 L
50.074 3.128 50.074 3.69 QT
50.074 8.065 L
55.371 8.065 L
55.371 3.69 L
55.371 3.128 53.527 3.128 QT
53.527 2.487 L
58.902 2.487 L
58.902 3.128 L
57.058 3.128 57.058 3.69 QT
57.058 13.581 L
57.058 14.143 58.902 14.143 QT
58.902 14.784 L
53.527 14.784 L
53.527 14.143 L
55.371 14.143 55.371 13.581 QT
55.371 8.706 L
50.074 8.706 L
50.074 13.581 L
50.074 14.143 51.918 14.143 QT
51.918 14.784 L
46.527 14.784 L
cp
f
GR
GS
[1 0 0 1 169.75011 313.70001] CT
0.149 GC
N
59.883 14.784 M
59.68 14.784 59.68 14.581 QT
59.68 14.44 L
59.68 14.378 59.727 14.315 QT
64.758 7.503 L
63.149 7.503 L
62.383 7.503 61.883 7.596 QT
61.383 7.69 61.063 7.956 QT
60.743 8.221 60.602 8.698 QT
60.461 9.175 60.461 9.987 QT
59.93 9.987 L
60.133 7.018 L
66.164 7.018 L
66.243 7.018 66.305 7.081 QT
66.368 7.143 66.368 7.221 QT
66.368 7.331 L
66.368 7.378 66.321 7.456 QT
61.289 14.268 L
63.008 14.268 L
63.789 14.268 64.313 14.167 QT
64.836 14.065 65.211 13.706 QT
65.555 13.362 65.68 12.784 QT
65.805 12.206 65.883 11.346 QT
66.399 11.346 L
66.086 14.784 L
59.883 14.784 L
cp
f
GR
GS
2 setlinecap
1 LJ
1.2 LW
N
59 288.5 M
59 26 L
S
GR
GS
2 setlinecap
1 LJ
1.2 LW
N
59 288.5 M
65.563 288.5 L
S
GR
GS
2 setlinecap
1 LJ
1.2 LW
N
59 236 M
65.563 236 L
S
GR
GS
2 setlinecap
1 LJ
1.2 LW
N
59 183.5 M
65.563 183.5 L
S
GR
GS
2 setlinecap
1 LJ
1.2 LW
N
59 131 M
65.563 131 L
S
GR
GS
2 setlinecap
1 LJ
1.2 LW
N
59 78.5 M
65.563 78.5 L
S
GR
GS
2 setlinecap
1 LJ
1.2 LW
N
59 26 M
65.563 26 L
S
GR
GS
[1 0 0 1 53.8 288.5] CT
/Helvetica 16 F
GS
[1 0 0 1 0 0] CT
-9 6 moveto 
1 -1 scale
(0) t 
GR
GR
GS
[1 0 0 1 53.8 236] CT
/Helvetica 16 F
GS
[1 0 0 1 0 0] CT
-23 6 moveto 
1 -1 scale
(0.2) t 
GR
GR
GS
[1 0 0 1 53.8 183.5] CT
/Helvetica 16 F
GS
[1 0 0 1 0 0] CT
-23 6 moveto 
1 -1 scale
(0.4) t 
GR
GR
GS
[1 0 0 1 53.8 131] CT
/Helvetica 16 F
GS
[1 0 0 1 0 0] CT
-23 6 moveto 
1 -1 scale
(0.6) t 
GR
GR
GS
[1 0 0 1 53.8 78.5] CT
/Helvetica 16 F
GS
[1 0 0 1 0 0] CT
-23 6 moveto 
1 -1 scale
(0.8) t 
GR
GR
GS
[1 0 0 1 53.8 26] CT
/Helvetica 16 F
GS
[1 0 0 1 0 0] CT
-9 6 moveto 
1 -1 scale
(1) t 
GR
GR
GS
[0 -1 1 0 28.3 157.24988] CT
N
-103.449 -5.76 M
-103.449 -6.323 L
-102.902 -6.323 -102.551 -6.408 QT
-102.199 -6.494 -102.199 -6.838 QT
-102.199 -11.198 L
-102.199 -11.635 -102.332 -11.823 QT
-102.465 -12.01 -102.707 -12.057 QT
-102.949 -12.104 -103.449 -12.104 QT
-103.449 -12.666 L
-101.137 -12.838 L
-101.137 -11.276 L
-100.809 -11.963 -100.184 -12.401 QT
-99.559 -12.838 -98.809 -12.838 QT
-97.699 -12.838 -97.144 -12.307 QT
-96.59 -11.776 -96.59 -10.682 QT
-96.59 -6.838 L
-96.59 -6.494 -96.238 -6.408 QT
-95.887 -6.323 -95.34 -6.323 QT
-95.34 -5.76 L
-98.996 -5.76 L
-98.996 -6.323 L
-98.449 -6.323 -98.098 -6.408 QT
-97.746 -6.494 -97.746 -6.838 QT
-97.746 -10.635 L
-97.746 -11.416 -97.973 -11.916 QT
-98.199 -12.416 -98.902 -12.416 QT
-99.84 -12.416 -100.434 -11.674 QT
-101.027 -10.932 -101.027 -9.994 QT
-101.027 -6.838 L
-101.027 -6.494 -100.676 -6.408 QT
-100.324 -6.323 -99.793 -6.323 QT
-99.793 -5.76 L
-103.449 -5.76 L
cp
f
GR
GS
[0 -1 1 0 28.3 157.24988] CT
N
-91.045 -5.573 M
-91.998 -5.573 -92.818 -6.065 QT
-93.638 -6.557 -94.115 -7.377 QT
-94.591 -8.198 -94.591 -9.166 QT
-94.591 -9.901 -94.334 -10.58 QT
-94.076 -11.26 -93.584 -11.799 QT
-93.091 -12.338 -92.443 -12.635 QT
-91.795 -12.932 -91.045 -12.932 QT
-90.06 -12.932 -89.248 -12.416 QT
-88.435 -11.901 -87.966 -11.026 QT
-87.498 -10.151 -87.498 -9.166 QT
-87.498 -8.213 -87.974 -7.385 QT
-88.451 -6.557 -89.271 -6.065 QT
-90.091 -5.573 -91.045 -5.573 QT
cp
-91.045 -6.057 M
-89.763 -6.057 -89.334 -6.987 QT
-88.904 -7.916 -88.904 -9.354 QT
-88.904 -10.151 -88.99 -10.682 QT
-89.076 -11.213 -89.357 -11.635 QT
-89.545 -11.901 -89.818 -12.104 QT
-90.091 -12.307 -90.404 -12.408 QT
-90.716 -12.51 -91.045 -12.51 QT
-91.545 -12.51 -91.99 -12.283 QT
-92.435 -12.057 -92.732 -11.635 QT
-93.029 -11.182 -93.115 -10.643 QT
-93.201 -10.104 -93.201 -9.354 QT
-93.201 -8.448 -93.045 -7.737 QT
-92.888 -7.026 -92.412 -6.541 QT
-91.935 -6.057 -91.045 -6.057 QT
cp
f
GR
GS
[0 -1 1 0 28.3 157.24988] CT
N
-86.623 -5.76 M
-86.623 -6.323 L
-86.076 -6.323 -85.724 -6.408 QT
-85.373 -6.494 -85.373 -6.838 QT
-85.373 -11.198 L
-85.373 -11.635 -85.506 -11.823 QT
-85.638 -12.01 -85.881 -12.057 QT
-86.123 -12.104 -86.623 -12.104 QT
-86.623 -12.666 L
-84.341 -12.838 L
-84.341 -11.276 L
-84.076 -11.963 -83.599 -12.401 QT
-83.123 -12.838 -82.451 -12.838 QT
-81.966 -12.838 -81.591 -12.557 QT
-81.216 -12.276 -81.216 -11.807 QT
-81.216 -11.526 -81.427 -11.307 QT
-81.638 -11.088 -81.935 -11.088 QT
-82.232 -11.088 -82.443 -11.299 QT
-82.654 -11.51 -82.654 -11.807 QT
-82.654 -12.244 -82.357 -12.416 QT
-82.451 -12.416 L
-83.091 -12.416 -83.506 -11.948 QT
-83.92 -11.479 -84.091 -10.783 QT
-84.263 -10.088 -84.263 -9.463 QT
-84.263 -6.838 L
-84.263 -6.323 -82.701 -6.323 QT
-82.701 -5.76 L
-86.623 -5.76 L
cp
f
GR
GS
[0 -1 1 0 28.3 157.24988] CT
N
-80.294 -5.76 M
-80.294 -6.323 L
-79.747 -6.323 -79.395 -6.408 QT
-79.044 -6.494 -79.044 -6.838 QT
-79.044 -11.198 L
-79.044 -11.635 -79.176 -11.823 QT
-79.309 -12.01 -79.551 -12.057 QT
-79.794 -12.104 -80.294 -12.104 QT
-80.294 -12.666 L
-77.981 -12.838 L
-77.981 -11.276 L
-77.653 -11.963 -77.028 -12.401 QT
-76.403 -12.838 -75.653 -12.838 QT
-73.809 -12.838 -73.497 -11.338 QT
-73.169 -12.01 -72.551 -12.424 QT
-71.934 -12.838 -71.2 -12.838 QT
-70.481 -12.838 -69.981 -12.604 QT
-69.481 -12.369 -69.231 -11.885 QT
-68.981 -11.401 -68.981 -10.682 QT
-68.981 -6.838 L
-68.981 -6.494 -68.629 -6.408 QT
-68.278 -6.323 -67.731 -6.323 QT
-67.731 -5.76 L
-71.403 -5.76 L
-71.403 -6.323 L
-70.856 -6.323 -70.504 -6.408 QT
-70.153 -6.494 -70.153 -6.838 QT
-70.153 -10.635 L
-70.153 -11.432 -70.379 -11.924 QT
-70.606 -12.416 -71.309 -12.416 QT
-72.231 -12.416 -72.833 -11.674 QT
-73.434 -10.932 -73.434 -9.994 QT
-73.434 -6.838 L
-73.434 -6.494 -73.083 -6.408 QT
-72.731 -6.323 -72.184 -6.323 QT
-72.184 -5.76 L
-75.84 -5.76 L
-75.84 -6.323 L
-75.294 -6.323 -74.942 -6.408 QT
-74.59 -6.494 -74.59 -6.838 QT
-74.59 -10.635 L
-74.59 -11.416 -74.817 -11.916 QT
-75.044 -12.416 -75.747 -12.416 QT
-76.684 -12.416 -77.278 -11.674 QT
-77.872 -10.932 -77.872 -9.994 QT
-77.872 -6.838 L
-77.872 -6.494 -77.52 -6.408 QT
-77.169 -6.323 -76.637 -6.323 QT
-76.637 -5.76 L
-80.294 -5.76 L
cp
f
GR
GS
[0 -1 1 0 28.3 157.24988] CT
N
-66.804 -7.338 M
-66.804 -8.291 -66.054 -8.885 QT
-65.304 -9.479 -64.249 -9.729 QT
-63.195 -9.979 -62.257 -9.979 QT
-62.257 -10.635 L
-62.257 -11.088 -62.46 -11.526 QT
-62.663 -11.963 -63.046 -12.237 QT
-63.429 -12.51 -63.882 -12.51 QT
-64.945 -12.51 -65.507 -12.041 QT
-65.195 -12.041 -64.999 -11.807 QT
-64.804 -11.573 -64.804 -11.276 QT
-64.804 -10.948 -65.03 -10.721 QT
-65.257 -10.494 -65.57 -10.494 QT
-65.882 -10.494 -66.109 -10.721 QT
-66.335 -10.948 -66.335 -11.276 QT
-66.335 -12.119 -65.57 -12.526 QT
-64.804 -12.932 -63.882 -12.932 QT
-63.241 -12.932 -62.585 -12.658 QT
-61.929 -12.385 -61.507 -11.869 QT
-61.085 -11.354 -61.085 -10.666 QT
-61.085 -7.057 L
-61.085 -6.744 -60.952 -6.487 QT
-60.82 -6.229 -60.538 -6.229 QT
-60.273 -6.229 -60.148 -6.494 QT
-60.023 -6.76 -60.023 -7.057 QT
-60.023 -8.088 L
-59.554 -8.088 L
-59.554 -7.057 L
-59.554 -6.698 -59.741 -6.377 QT
-59.929 -6.057 -60.241 -5.862 QT
-60.554 -5.666 -60.929 -5.666 QT
-61.398 -5.666 -61.734 -6.033 QT
-62.07 -6.401 -62.116 -6.901 QT
-62.413 -6.291 -62.991 -5.932 QT
-63.57 -5.573 -64.226 -5.573 QT
-64.835 -5.573 -65.421 -5.76 QT
-66.007 -5.948 -66.405 -6.33 QT
-66.804 -6.713 -66.804 -7.338 QT
cp
-65.507 -7.338 M
-65.507 -6.776 -65.093 -6.393 QT
-64.679 -6.01 -64.116 -6.01 QT
-63.601 -6.01 -63.179 -6.268 QT
-62.757 -6.526 -62.507 -6.971 QT
-62.257 -7.416 -62.257 -7.901 QT
-62.257 -9.573 L
-62.976 -9.573 -63.741 -9.33 QT
-64.507 -9.088 -65.007 -8.58 QT
-65.507 -8.073 -65.507 -7.338 QT
cp
f
GR
GS
[0 -1 1 0 28.3 157.24988] CT
N
-58.945 -5.76 M
-58.945 -6.323 L
-58.398 -6.323 -58.046 -6.408 QT
-57.695 -6.494 -57.695 -6.838 QT
-57.695 -15.229 L
-57.695 -15.666 -57.827 -15.854 QT
-57.96 -16.041 -58.202 -16.088 QT
-58.445 -16.135 -58.945 -16.135 QT
-58.945 -16.698 L
-56.57 -16.869 L
-56.57 -6.838 L
-56.57 -6.494 -56.218 -6.408 QT
-55.866 -6.323 -55.335 -6.323 QT
-55.335 -5.76 L
-58.945 -5.76 L
cp
f
GR
GS
[0 -1 1 0 28.3 157.24988] CT
N
-54.5 -5.76 M
-54.5 -6.323 L
-53.953 -6.323 -53.602 -6.408 QT
-53.25 -6.494 -53.25 -6.838 QT
-53.25 -11.198 L
-53.25 -11.823 -53.492 -11.963 QT
-53.734 -12.104 -54.438 -12.104 QT
-54.438 -12.666 L
-52.125 -12.838 L
-52.125 -6.838 L
-52.125 -6.494 -51.82 -6.408 QT
-51.516 -6.323 -51.016 -6.323 QT
-51.016 -5.76 L
-54.5 -5.76 L
cp
-53.828 -15.588 M
-53.828 -15.932 -53.563 -16.198 QT
-53.297 -16.463 -52.953 -16.463 QT
-52.719 -16.463 -52.508 -16.346 QT
-52.297 -16.229 -52.18 -16.018 QT
-52.063 -15.807 -52.063 -15.588 QT
-52.063 -15.244 -52.328 -14.979 QT
-52.594 -14.713 -52.953 -14.713 QT
-53.297 -14.713 -53.563 -14.979 QT
-53.828 -15.244 -53.828 -15.588 QT
cp
f
GR
GS
[0 -1 1 0 28.3 157.24988] CT
N
-49.931 -5.76 M
-50.102 -5.76 -50.102 -5.948 QT
-50.102 -6.073 L
-50.102 -6.135 -50.056 -6.182 QT
-45.587 -12.244 L
-47.024 -12.244 L
-47.712 -12.244 -48.149 -12.158 QT
-48.587 -12.073 -48.876 -11.83 QT
-49.165 -11.588 -49.29 -11.174 QT
-49.415 -10.76 -49.415 -10.026 QT
-49.884 -10.026 L
-49.696 -12.666 L
-44.337 -12.666 L
-44.274 -12.666 -44.22 -12.612 QT
-44.165 -12.557 -44.165 -12.479 QT
-44.165 -12.385 L
-44.165 -12.338 -44.196 -12.276 QT
-48.681 -6.229 L
-47.149 -6.229 L
-46.446 -6.229 -45.985 -6.315 QT
-45.524 -6.401 -45.196 -6.729 QT
-44.884 -7.026 -44.774 -7.541 QT
-44.665 -8.057 -44.602 -8.823 QT
-44.134 -8.823 L
-44.415 -5.76 L
-49.931 -5.76 L
cp
f
GR
GS
[0 -1 1 0 28.3 157.24988] CT
N
-39.46 -5.573 M
-40.429 -5.573 -41.249 -6.088 QT
-42.069 -6.604 -42.53 -7.463 QT
-42.991 -8.323 -42.991 -9.276 QT
-42.991 -10.213 -42.569 -11.057 QT
-42.148 -11.901 -41.382 -12.416 QT
-40.616 -12.932 -39.679 -12.932 QT
-38.944 -12.932 -38.405 -12.69 QT
-37.866 -12.448 -37.515 -12.01 QT
-37.163 -11.573 -36.984 -10.979 QT
-36.804 -10.385 -36.804 -9.666 QT
-36.804 -9.463 -36.96 -9.463 QT
-41.601 -9.463 L
-41.601 -9.291 L
-41.601 -7.963 -41.062 -7.01 QT
-40.523 -6.057 -39.319 -6.057 QT
-38.819 -6.057 -38.405 -6.276 QT
-37.991 -6.494 -37.679 -6.885 QT
-37.366 -7.276 -37.257 -7.713 QT
-37.241 -7.776 -37.202 -7.815 QT
-37.163 -7.854 -37.101 -7.854 QT
-36.96 -7.854 L
-36.804 -7.854 -36.804 -7.651 QT
-37.023 -6.744 -37.773 -6.158 QT
-38.523 -5.573 -39.46 -5.573 QT
cp
-41.585 -9.854 M
-37.929 -9.854 L
-37.929 -10.463 -38.101 -11.08 QT
-38.273 -11.698 -38.663 -12.104 QT
-39.054 -12.51 -39.679 -12.51 QT
-40.585 -12.51 -41.085 -11.666 QT
-41.585 -10.823 -41.585 -9.854 QT
cp
f
GR
GS
[0 -1 1 0 28.3 157.24988] CT
N
-32.427 -5.573 M
-33.365 -5.573 -34.146 -6.088 QT
-34.927 -6.604 -35.365 -7.44 QT
-35.802 -8.276 -35.802 -9.213 QT
-35.802 -10.182 -35.326 -11.018 QT
-34.849 -11.854 -34.036 -12.346 QT
-33.224 -12.838 -32.255 -12.838 QT
-31.661 -12.838 -31.138 -12.588 QT
-30.615 -12.338 -30.24 -11.901 QT
-30.24 -15.229 L
-30.24 -15.666 -30.365 -15.854 QT
-30.49 -16.041 -30.732 -16.088 QT
-30.974 -16.135 -31.474 -16.135 QT
-31.474 -16.698 L
-29.115 -16.869 L
-29.115 -7.213 L
-29.115 -6.791 -28.982 -6.604 QT
-28.849 -6.416 -28.615 -6.369 QT
-28.38 -6.323 -27.865 -6.323 QT
-27.865 -5.76 L
-30.286 -5.573 L
-30.286 -6.588 L
-30.693 -6.119 -31.263 -5.846 QT
-31.833 -5.573 -32.427 -5.573 QT
cp
-34.052 -7.151 M
-33.786 -6.635 -33.326 -6.323 QT
-32.865 -6.01 -32.333 -6.01 QT
-31.661 -6.01 -31.107 -6.393 QT
-30.552 -6.776 -30.286 -7.385 QT
-30.286 -11.213 L
-30.474 -11.573 -30.755 -11.846 QT
-31.036 -12.119 -31.396 -12.268 QT
-31.755 -12.416 -32.146 -12.416 QT
-32.99 -12.416 -33.497 -11.948 QT
-34.005 -11.479 -34.208 -10.744 QT
-34.411 -10.01 -34.411 -9.198 QT
-34.411 -8.557 -34.341 -8.08 QT
-34.271 -7.604 -34.052 -7.151 QT
cp
f
GR
GS
[0 -1 1 0 28.3 157.24988] CT
N
-18.127 -5.573 M
-19.096 -5.573 -19.885 -6.08 QT
-20.674 -6.588 -21.127 -7.432 QT
-21.58 -8.276 -21.58 -9.213 QT
-21.58 -10.166 -21.127 -11.033 QT
-20.674 -11.901 -19.885 -12.416 QT
-19.096 -12.932 -18.127 -12.932 QT
-17.189 -12.932 -16.416 -12.565 QT
-15.642 -12.198 -15.642 -11.369 QT
-15.642 -11.057 -15.869 -10.823 QT
-16.096 -10.588 -16.408 -10.588 QT
-16.736 -10.588 -16.955 -10.823 QT
-17.174 -11.057 -17.174 -11.369 QT
-17.174 -11.651 -16.994 -11.854 QT
-16.814 -12.057 -16.549 -12.119 QT
-17.111 -12.463 -18.111 -12.463 QT
-18.877 -12.463 -19.346 -11.955 QT
-19.814 -11.448 -20.002 -10.698 QT
-20.189 -9.948 -20.189 -9.213 QT
-20.189 -8.448 -19.955 -7.721 QT
-19.721 -6.994 -19.213 -6.526 QT
-18.705 -6.057 -17.924 -6.057 QT
-17.174 -6.057 -16.642 -6.518 QT
-16.111 -6.979 -15.908 -7.729 QT
-15.908 -7.823 -15.783 -7.823 QT
-15.596 -7.823 L
-15.549 -7.823 -15.51 -7.783 QT
-15.471 -7.744 -15.471 -7.682 QT
-15.471 -7.635 L
-15.705 -6.698 -16.424 -6.135 QT
-17.142 -5.573 -18.127 -5.573 QT
cp
f
GR
GS
[0 -1 1 0 28.3 157.24988] CT
N
-14.96 -5.76 M
-14.96 -6.323 L
-14.413 -6.323 -14.062 -6.408 QT
-13.71 -6.494 -13.71 -6.838 QT
-13.71 -15.229 L
-13.71 -15.666 -13.843 -15.854 QT
-13.976 -16.041 -14.218 -16.088 QT
-14.46 -16.135 -14.96 -16.135 QT
-14.96 -16.698 L
-12.585 -16.869 L
-12.585 -11.369 L
-12.257 -12.026 -11.655 -12.432 QT
-11.054 -12.838 -10.319 -12.838 QT
-9.21 -12.838 -8.655 -12.307 QT
-8.101 -11.776 -8.101 -10.682 QT
-8.101 -6.838 L
-8.101 -6.494 -7.749 -6.408 QT
-7.398 -6.323 -6.851 -6.323 QT
-6.851 -5.76 L
-10.507 -5.76 L
-10.507 -6.323 L
-9.96 -6.323 -9.609 -6.408 QT
-9.257 -6.494 -9.257 -6.838 QT
-9.257 -10.635 L
-9.257 -11.416 -9.484 -11.916 QT
-9.71 -12.416 -10.413 -12.416 QT
-11.351 -12.416 -11.944 -11.674 QT
-12.538 -10.932 -12.538 -9.994 QT
-12.538 -6.838 L
-12.538 -6.494 -12.187 -6.408 QT
-11.835 -6.323 -11.304 -6.323 QT
-11.304 -5.76 L
-14.96 -5.76 L
cp
f
GR
GS
[0 -1 1 0 28.3 157.24988] CT
N
-6.056 -5.76 M
-6.056 -6.323 L
-5.509 -6.323 -5.157 -6.408 QT
-4.806 -6.494 -4.806 -6.838 QT
-4.806 -11.198 L
-4.806 -11.823 -5.048 -11.963 QT
-5.29 -12.104 -5.993 -12.104 QT
-5.993 -12.666 L
-3.681 -12.838 L
-3.681 -6.838 L
-3.681 -6.494 -3.376 -6.408 QT
-3.071 -6.323 -2.571 -6.323 QT
-2.571 -5.76 L
-6.056 -5.76 L
cp
-5.384 -15.588 M
-5.384 -15.932 -5.118 -16.198 QT
-4.852 -16.463 -4.509 -16.463 QT
-4.274 -16.463 -4.063 -16.346 QT
-3.852 -16.229 -3.735 -16.018 QT
-3.618 -15.807 -3.618 -15.588 QT
-3.618 -15.244 -3.884 -14.979 QT
-4.149 -14.713 -4.509 -14.713 QT
-4.852 -14.713 -5.118 -14.979 QT
-5.384 -15.244 -5.384 -15.588 QT
cp
f
GR
GS
[0 -1 1 0 28.3 157.24988] CT
N
-1.689 -5.76 M
-1.689 -6.323 L
-1.142 -6.323 -0.791 -6.408 QT
-0.439 -6.494 -0.439 -6.838 QT
-0.439 -11.198 L
-0.439 -11.635 -0.572 -11.823 QT
-0.705 -12.01 -0.947 -12.057 QT
-1.189 -12.104 -1.689 -12.104 QT
-1.689 -12.666 L
0.592 -12.838 L
0.592 -11.276 L
0.858 -11.963 1.334 -12.401 QT
1.811 -12.838 2.483 -12.838 QT
2.967 -12.838 3.342 -12.557 QT
3.717 -12.276 3.717 -11.807 QT
3.717 -11.526 3.506 -11.307 QT
3.295 -11.088 2.998 -11.088 QT
2.701 -11.088 2.49 -11.299 QT
2.28 -11.51 2.28 -11.807 QT
2.28 -12.244 2.576 -12.416 QT
2.483 -12.416 L
1.842 -12.416 1.428 -11.948 QT
1.014 -11.479 0.842 -10.783 QT
0.67 -10.088 0.67 -9.463 QT
0.67 -6.838 L
0.67 -6.323 2.233 -6.323 QT
2.233 -5.76 L
-1.689 -5.76 L
cp
f
GR
GS
[0 -1 1 0 28.3 157.24988] CT
N
4.796 -7.338 M
4.796 -8.291 5.546 -8.885 QT
6.296 -9.479 7.351 -9.729 QT
8.406 -9.979 9.343 -9.979 QT
9.343 -10.635 L
9.343 -11.088 9.14 -11.526 QT
8.937 -11.963 8.554 -12.237 QT
8.171 -12.51 7.718 -12.51 QT
6.656 -12.51 6.093 -12.041 QT
6.406 -12.041 6.601 -11.807 QT
6.796 -11.573 6.796 -11.276 QT
6.796 -10.948 6.57 -10.721 QT
6.343 -10.494 6.031 -10.494 QT
5.718 -10.494 5.492 -10.721 QT
5.265 -10.948 5.265 -11.276 QT
5.265 -12.119 6.031 -12.526 QT
6.796 -12.932 7.718 -12.932 QT
8.359 -12.932 9.015 -12.658 QT
9.671 -12.385 10.093 -11.869 QT
10.515 -11.354 10.515 -10.666 QT
10.515 -7.057 L
10.515 -6.744 10.648 -6.487 QT
10.781 -6.229 11.062 -6.229 QT
11.327 -6.229 11.452 -6.494 QT
11.577 -6.76 11.577 -7.057 QT
11.577 -8.088 L
12.046 -8.088 L
12.046 -7.057 L
12.046 -6.698 11.859 -6.377 QT
11.671 -6.057 11.359 -5.862 QT
11.046 -5.666 10.671 -5.666 QT
10.202 -5.666 9.867 -6.033 QT
9.531 -6.401 9.484 -6.901 QT
9.187 -6.291 8.609 -5.932 QT
8.031 -5.573 7.374 -5.573 QT
6.765 -5.573 6.179 -5.76 QT
5.593 -5.948 5.195 -6.33 QT
4.796 -6.713 4.796 -7.338 QT
cp
6.093 -7.338 M
6.093 -6.776 6.507 -6.393 QT
6.921 -6.01 7.484 -6.01 QT
7.999 -6.01 8.421 -6.268 QT
8.843 -6.526 9.093 -6.971 QT
9.343 -7.416 9.343 -7.901 QT
9.343 -9.573 L
8.624 -9.573 7.859 -9.33 QT
7.093 -9.088 6.593 -8.58 QT
6.093 -8.073 6.093 -7.338 QT
cp
f
GR
GS
[0 -1 1 0 28.3 157.24988] CT
N
12.656 -5.76 M
12.656 -6.323 L
13.202 -6.323 13.554 -6.408 QT
13.906 -6.494 13.906 -6.838 QT
13.906 -15.229 L
13.906 -15.666 13.773 -15.854 QT
13.64 -16.041 13.398 -16.088 QT
13.156 -16.135 12.656 -16.135 QT
12.656 -16.698 L
15.031 -16.869 L
15.031 -6.838 L
15.031 -6.494 15.382 -6.408 QT
15.734 -6.323 16.265 -6.323 QT
16.265 -5.76 L
12.656 -5.76 L
cp
f
GR
GS
[0 -1 1 0 28.3 157.24988] CT
N
17.1 -5.76 M
17.1 -6.323 L
17.647 -6.323 17.998 -6.408 QT
18.35 -6.494 18.35 -6.838 QT
18.35 -11.198 L
18.35 -11.823 18.108 -11.963 QT
17.866 -12.104 17.163 -12.104 QT
17.163 -12.666 L
19.475 -12.838 L
19.475 -6.838 L
19.475 -6.494 19.78 -6.408 QT
20.084 -6.323 20.584 -6.323 QT
20.584 -5.76 L
17.1 -5.76 L
cp
17.772 -15.588 M
17.772 -15.932 18.038 -16.198 QT
18.303 -16.463 18.647 -16.463 QT
18.881 -16.463 19.092 -16.346 QT
19.303 -16.229 19.42 -16.018 QT
19.538 -15.807 19.538 -15.588 QT
19.538 -15.244 19.272 -14.979 QT
19.006 -14.713 18.647 -14.713 QT
18.303 -14.713 18.038 -14.979 QT
17.772 -15.244 17.772 -15.588 QT
cp
f
GR
GS
[0 -1 1 0 28.3 157.24988] CT
N
22.685 -7.682 M
22.685 -12.104 L
21.357 -12.104 L
21.357 -12.51 L
22.404 -12.51 22.896 -13.487 QT
23.388 -14.463 23.388 -15.604 QT
23.841 -15.604 L
23.841 -12.666 L
26.107 -12.666 L
26.107 -12.104 L
23.841 -12.104 L
23.841 -7.713 L
23.841 -7.057 24.068 -6.557 QT
24.295 -6.057 24.873 -6.057 QT
25.42 -6.057 25.662 -6.58 QT
25.904 -7.104 25.904 -7.713 QT
25.904 -8.666 L
26.357 -8.666 L
26.357 -7.682 L
26.357 -7.182 26.177 -6.698 QT
25.998 -6.213 25.638 -5.893 QT
25.279 -5.573 24.763 -5.573 QT
23.795 -5.573 23.24 -6.151 QT
22.685 -6.729 22.685 -7.682 QT
cp
f
GR
GS
[0 -1 1 0 28.3 157.24988] CT
N
27.932 -3.135 M
28.229 -2.885 28.604 -2.885 QT
29.604 -2.885 30.244 -4.416 QT
30.791 -5.76 L
28.4 -11.635 L
28.244 -11.932 27.939 -12.018 QT
27.635 -12.104 27.135 -12.104 QT
27.135 -12.666 L
30.494 -12.666 L
30.494 -12.104 L
29.604 -12.104 29.604 -11.713 QT
29.604 -11.651 29.619 -11.619 QT
31.4 -7.244 L
33.01 -11.182 L
33.057 -11.307 33.057 -11.463 QT
33.057 -11.651 32.947 -11.799 QT
32.838 -11.948 32.674 -12.026 QT
32.51 -12.104 32.291 -12.104 QT
32.291 -12.666 L
34.947 -12.666 L
34.947 -12.104 L
34.463 -12.104 34.088 -11.877 QT
33.713 -11.651 33.51 -11.198 QT
30.744 -4.416 L
30.525 -3.901 30.236 -3.463 QT
29.947 -3.026 29.525 -2.752 QT
29.104 -2.479 28.604 -2.479 QT
28.01 -2.479 27.572 -2.862 QT
27.135 -3.244 27.135 -3.823 QT
27.135 -4.119 27.338 -4.323 QT
27.541 -4.526 27.838 -4.526 QT
28.041 -4.526 28.197 -4.432 QT
28.354 -4.338 28.447 -4.182 QT
28.541 -4.026 28.541 -3.823 QT
28.541 -3.557 28.369 -3.354 QT
28.197 -3.151 27.932 -3.135 QT
cp
f
GR
GS
[0 -1 1 0 28.3 157.24988] CT
N
41.084 -5.76 M
41.084 -6.323 L
41.631 -6.323 41.983 -6.408 QT
42.334 -6.494 42.334 -6.838 QT
42.334 -11.198 L
42.334 -11.635 42.202 -11.823 QT
42.069 -12.01 41.827 -12.057 QT
41.584 -12.104 41.084 -12.104 QT
41.084 -12.666 L
43.397 -12.838 L
43.397 -11.276 L
43.725 -11.963 44.35 -12.401 QT
44.975 -12.838 45.725 -12.838 QT
47.569 -12.838 47.881 -11.338 QT
48.209 -12.01 48.827 -12.424 QT
49.444 -12.838 50.178 -12.838 QT
50.897 -12.838 51.397 -12.604 QT
51.897 -12.369 52.147 -11.885 QT
52.397 -11.401 52.397 -10.682 QT
52.397 -6.838 L
52.397 -6.494 52.749 -6.408 QT
53.1 -6.323 53.647 -6.323 QT
53.647 -5.76 L
49.975 -5.76 L
49.975 -6.323 L
50.522 -6.323 50.874 -6.408 QT
51.225 -6.494 51.225 -6.838 QT
51.225 -10.635 L
51.225 -11.432 50.999 -11.924 QT
50.772 -12.416 50.069 -12.416 QT
49.147 -12.416 48.545 -11.674 QT
47.944 -10.932 47.944 -9.994 QT
47.944 -6.838 L
47.944 -6.494 48.295 -6.408 QT
48.647 -6.323 49.194 -6.323 QT
49.194 -5.76 L
45.538 -5.76 L
45.538 -6.323 L
46.084 -6.323 46.436 -6.408 QT
46.788 -6.494 46.788 -6.838 QT
46.788 -10.635 L
46.788 -11.416 46.561 -11.916 QT
46.334 -12.416 45.631 -12.416 QT
44.694 -12.416 44.1 -11.674 QT
43.506 -10.932 43.506 -9.994 QT
43.506 -6.838 L
43.506 -6.494 43.858 -6.408 QT
44.209 -6.323 44.741 -6.323 QT
44.741 -5.76 L
41.084 -5.76 L
cp
f
GR
GS
[0 -1 1 0 28.3 157.24988] CT
N
57.918 -5.573 M
56.949 -5.573 56.129 -6.088 QT
55.308 -6.604 54.848 -7.463 QT
54.387 -8.323 54.387 -9.276 QT
54.387 -10.213 54.808 -11.057 QT
55.23 -11.901 55.996 -12.416 QT
56.762 -12.932 57.699 -12.932 QT
58.433 -12.932 58.973 -12.69 QT
59.512 -12.448 59.863 -12.01 QT
60.215 -11.573 60.394 -10.979 QT
60.574 -10.385 60.574 -9.666 QT
60.574 -9.463 60.418 -9.463 QT
55.777 -9.463 L
55.777 -9.291 L
55.777 -7.963 56.316 -7.01 QT
56.855 -6.057 58.058 -6.057 QT
58.558 -6.057 58.973 -6.276 QT
59.387 -6.494 59.699 -6.885 QT
60.012 -7.276 60.121 -7.713 QT
60.137 -7.776 60.176 -7.815 QT
60.215 -7.854 60.277 -7.854 QT
60.418 -7.854 L
60.574 -7.854 60.574 -7.651 QT
60.355 -6.744 59.605 -6.158 QT
58.855 -5.573 57.918 -5.573 QT
cp
55.793 -9.854 M
59.449 -9.854 L
59.449 -10.463 59.277 -11.08 QT
59.105 -11.698 58.715 -12.104 QT
58.324 -12.51 57.699 -12.51 QT
56.793 -12.51 56.293 -11.666 QT
55.793 -10.823 55.793 -9.854 QT
cp
f
GR
GS
[0 -1 1 0 28.3 157.24988] CT
N
61.685 -7.338 M
61.685 -8.291 62.435 -8.885 QT
63.185 -9.479 64.24 -9.729 QT
65.295 -9.979 66.232 -9.979 QT
66.232 -10.635 L
66.232 -11.088 66.029 -11.526 QT
65.826 -11.963 65.443 -12.237 QT
65.06 -12.51 64.607 -12.51 QT
63.545 -12.51 62.982 -12.041 QT
63.295 -12.041 63.49 -11.807 QT
63.685 -11.573 63.685 -11.276 QT
63.685 -10.948 63.459 -10.721 QT
63.232 -10.494 62.92 -10.494 QT
62.607 -10.494 62.381 -10.721 QT
62.154 -10.948 62.154 -11.276 QT
62.154 -12.119 62.92 -12.526 QT
63.685 -12.932 64.607 -12.932 QT
65.248 -12.932 65.904 -12.658 QT
66.56 -12.385 66.982 -11.869 QT
67.404 -11.354 67.404 -10.666 QT
67.404 -7.057 L
67.404 -6.744 67.537 -6.487 QT
67.67 -6.229 67.951 -6.229 QT
68.216 -6.229 68.341 -6.494 QT
68.466 -6.76 68.466 -7.057 QT
68.466 -8.088 L
68.935 -8.088 L
68.935 -7.057 L
68.935 -6.698 68.748 -6.377 QT
68.56 -6.057 68.248 -5.862 QT
67.935 -5.666 67.56 -5.666 QT
67.091 -5.666 66.756 -6.033 QT
66.42 -6.401 66.373 -6.901 QT
66.076 -6.291 65.498 -5.932 QT
64.92 -5.573 64.263 -5.573 QT
63.654 -5.573 63.068 -5.76 QT
62.482 -5.948 62.084 -6.33 QT
61.685 -6.713 61.685 -7.338 QT
cp
62.982 -7.338 M
62.982 -6.776 63.396 -6.393 QT
63.81 -6.01 64.373 -6.01 QT
64.888 -6.01 65.31 -6.268 QT
65.732 -6.526 65.982 -6.971 QT
66.232 -7.416 66.232 -7.901 QT
66.232 -9.573 L
65.513 -9.573 64.748 -9.33 QT
63.982 -9.088 63.482 -8.58 QT
62.982 -8.073 62.982 -7.338 QT
cp
f
GR
GS
[0 -1 1 0 28.3 157.24988] CT
N
69.576 -5.713 M
69.576 -8.323 L
69.576 -8.448 69.716 -8.448 QT
69.92 -8.448 L
70.013 -8.448 70.045 -8.323 QT
70.482 -6.01 72.201 -6.01 QT
72.951 -6.01 73.466 -6.354 QT
73.982 -6.698 73.982 -7.416 QT
73.982 -7.932 73.584 -8.291 QT
73.185 -8.651 72.638 -8.791 QT
71.56 -8.994 L
71.029 -9.119 70.584 -9.362 QT
70.138 -9.604 69.857 -10.002 QT
69.576 -10.401 69.576 -10.932 QT
69.576 -11.635 69.951 -12.088 QT
70.326 -12.541 70.92 -12.737 QT
71.513 -12.932 72.201 -12.932 QT
73.013 -12.932 73.623 -12.494 QT
74.091 -12.901 L
74.091 -12.932 74.17 -12.932 QT
74.279 -12.932 L
74.326 -12.932 74.365 -12.893 QT
74.404 -12.854 74.404 -12.807 QT
74.404 -10.713 L
74.404 -10.557 74.279 -10.557 QT
74.091 -10.557 L
73.951 -10.557 73.951 -10.713 QT
73.951 -11.541 73.482 -12.049 QT
73.013 -12.557 72.185 -12.557 QT
71.466 -12.557 70.935 -12.291 QT
70.404 -12.026 70.404 -11.385 QT
70.404 -10.932 70.787 -10.651 QT
71.17 -10.369 71.67 -10.244 QT
72.763 -10.041 L
73.31 -9.916 73.779 -9.619 QT
74.248 -9.323 74.529 -8.869 QT
74.81 -8.416 74.81 -7.838 QT
74.81 -7.26 74.607 -6.838 QT
74.404 -6.416 74.052 -6.135 QT
73.701 -5.854 73.216 -5.713 QT
72.732 -5.573 72.201 -5.573 QT
71.201 -5.573 70.482 -6.26 QT
69.904 -5.619 L
69.904 -5.573 69.81 -5.573 QT
69.716 -5.573 L
69.576 -5.573 69.576 -5.713 QT
cp
f
GR
GS
[0 -1 1 0 28.3 157.24988] CT
N
77.09 -7.666 M
77.09 -11.198 L
77.09 -11.635 76.957 -11.823 QT
76.824 -12.01 76.582 -12.057 QT
76.34 -12.104 75.84 -12.104 QT
75.84 -12.666 L
78.262 -12.838 L
78.262 -7.666 L
78.262 -7.041 78.348 -6.698 QT
78.434 -6.354 78.731 -6.182 QT
79.028 -6.01 79.668 -6.01 QT
80.528 -6.01 81.035 -6.729 QT
81.543 -7.448 81.543 -8.354 QT
81.543 -11.198 L
81.543 -11.635 81.41 -11.823 QT
81.278 -12.01 81.035 -12.057 QT
80.793 -12.104 80.293 -12.104 QT
80.293 -12.666 L
82.699 -12.838 L
82.699 -7.213 L
82.699 -6.791 82.832 -6.604 QT
82.965 -6.416 83.207 -6.369 QT
83.449 -6.323 83.949 -6.323 QT
83.949 -5.76 L
81.59 -5.573 L
81.59 -6.932 L
81.293 -6.338 80.762 -5.955 QT
80.231 -5.573 79.59 -5.573 QT
78.434 -5.573 77.762 -6.065 QT
77.09 -6.557 77.09 -7.666 QT
cp
f
GR
GS
[0 -1 1 0 28.3 157.24988] CT
N
84.667 -5.76 M
84.667 -6.323 L
85.213 -6.323 85.565 -6.408 QT
85.917 -6.494 85.917 -6.838 QT
85.917 -11.198 L
85.917 -11.635 85.784 -11.823 QT
85.651 -12.01 85.409 -12.057 QT
85.167 -12.104 84.667 -12.104 QT
84.667 -12.666 L
86.948 -12.838 L
86.948 -11.276 L
87.213 -11.963 87.69 -12.401 QT
88.167 -12.838 88.838 -12.838 QT
89.323 -12.838 89.698 -12.557 QT
90.073 -12.276 90.073 -11.807 QT
90.073 -11.526 89.862 -11.307 QT
89.651 -11.088 89.354 -11.088 QT
89.057 -11.088 88.846 -11.299 QT
88.635 -11.51 88.635 -11.807 QT
88.635 -12.244 88.932 -12.416 QT
88.838 -12.416 L
88.198 -12.416 87.784 -11.948 QT
87.37 -11.479 87.198 -10.783 QT
87.026 -10.088 87.026 -9.463 QT
87.026 -6.838 L
87.026 -6.323 88.588 -6.323 QT
88.588 -5.76 L
84.667 -5.76 L
cp
f
GR
GS
[0 -1 1 0 28.3 157.24988] CT
N
94.496 -5.573 M
93.527 -5.573 92.707 -6.088 QT
91.886 -6.604 91.425 -7.463 QT
90.964 -8.323 90.964 -9.276 QT
90.964 -10.213 91.386 -11.057 QT
91.808 -11.901 92.574 -12.416 QT
93.339 -12.932 94.277 -12.932 QT
95.011 -12.932 95.55 -12.69 QT
96.089 -12.448 96.441 -12.01 QT
96.793 -11.573 96.972 -10.979 QT
97.152 -10.385 97.152 -9.666 QT
97.152 -9.463 96.996 -9.463 QT
92.355 -9.463 L
92.355 -9.291 L
92.355 -7.963 92.894 -7.01 QT
93.433 -6.057 94.636 -6.057 QT
95.136 -6.057 95.55 -6.276 QT
95.964 -6.494 96.277 -6.885 QT
96.589 -7.276 96.699 -7.713 QT
96.714 -7.776 96.753 -7.815 QT
96.793 -7.854 96.855 -7.854 QT
96.996 -7.854 L
97.152 -7.854 97.152 -7.651 QT
96.933 -6.744 96.183 -6.158 QT
95.433 -5.573 94.496 -5.573 QT
cp
92.371 -9.854 M
96.027 -9.854 L
96.027 -10.463 95.855 -11.08 QT
95.683 -11.698 95.293 -12.104 QT
94.902 -12.51 94.277 -12.51 QT
93.371 -12.51 92.871 -11.666 QT
92.371 -10.823 92.371 -9.854 QT
cp
f
GR
GS
[0 -1 1 0 28.3 157.24988] CT
N
98.154 -5.713 M
98.154 -8.323 L
98.154 -8.448 98.294 -8.448 QT
98.497 -8.448 L
98.591 -8.448 98.622 -8.323 QT
99.06 -6.01 100.779 -6.01 QT
101.529 -6.01 102.044 -6.354 QT
102.56 -6.698 102.56 -7.416 QT
102.56 -7.932 102.161 -8.291 QT
101.763 -8.651 101.216 -8.791 QT
100.138 -8.994 L
99.607 -9.119 99.161 -9.362 QT
98.716 -9.604 98.435 -10.002 QT
98.154 -10.401 98.154 -10.932 QT
98.154 -11.635 98.529 -12.088 QT
98.904 -12.541 99.497 -12.737 QT
100.091 -12.932 100.779 -12.932 QT
101.591 -12.932 102.201 -12.494 QT
102.669 -12.901 L
102.669 -12.932 102.747 -12.932 QT
102.857 -12.932 L
102.904 -12.932 102.943 -12.893 QT
102.982 -12.854 102.982 -12.807 QT
102.982 -10.713 L
102.982 -10.557 102.857 -10.557 QT
102.669 -10.557 L
102.529 -10.557 102.529 -10.713 QT
102.529 -11.541 102.06 -12.049 QT
101.591 -12.557 100.763 -12.557 QT
100.044 -12.557 99.513 -12.291 QT
98.982 -12.026 98.982 -11.385 QT
98.982 -10.932 99.365 -10.651 QT
99.747 -10.369 100.247 -10.244 QT
101.341 -10.041 L
101.888 -9.916 102.357 -9.619 QT
102.826 -9.323 103.107 -8.869 QT
103.388 -8.416 103.388 -7.838 QT
103.388 -7.26 103.185 -6.838 QT
102.982 -6.416 102.63 -6.135 QT
102.279 -5.854 101.794 -5.713 QT
101.31 -5.573 100.779 -5.573 QT
99.779 -5.573 99.06 -6.26 QT
98.482 -5.619 L
98.482 -5.573 98.388 -5.573 QT
98.294 -5.573 L
98.154 -5.573 98.154 -5.713 QT
cp
f
GR
GS
0.502 0 0.502 RC
2 setlinecap
1 LJ
1.2 LW
N
280.5 288.5 M
280.5 26 L
S
GR
GS
0.502 0 0.502 RC
2 setlinecap
1 LJ
1.2 LW
N
280.5 288.5 M
273.938 288.5 L
S
GR
GS
0.502 0 0.502 RC
2 setlinecap
1 LJ
1.2 LW
N
280.5 201 M
273.938 201 L
S
GR
GS
0.502 0 0.502 RC
2 setlinecap
1 LJ
1.2 LW
N
280.5 113.5 M
273.938 113.5 L
S
GR
GS
0.502 0 0.502 RC
2 setlinecap
1 LJ
1.2 LW
N
280.5 26 M
273.938 26 L
S
GR
GS
0.502 0 0.502 RC
2 setlinecap
1 LJ
1.2 LW
N
280.5 288.5 M
277.219 288.5 L
S
GR
GS
0.502 0 0.502 RC
2 setlinecap
1 LJ
1.2 LW
N
280.5 262.16 M
277.219 262.16 L
S
GR
GS
0.502 0 0.502 RC
2 setlinecap
1 LJ
1.2 LW
N
280.5 246.752 M
277.219 246.752 L
S
GR
GS
0.502 0 0.502 RC
2 setlinecap
1 LJ
1.2 LW
N
280.5 235.82 M
277.219 235.82 L
S
GR
GS
0.502 0 0.502 RC
2 setlinecap
1 LJ
1.2 LW
N
280.5 227.34 M
277.219 227.34 L
S
GR
GS
0.502 0 0.502 RC
2 setlinecap
1 LJ
1.2 LW
N
280.5 220.412 M
277.219 220.412 L
S
GR
GS
0.502 0 0.502 RC
2 setlinecap
1 LJ
1.2 LW
N
280.5 214.554 M
277.219 214.554 L
S
GR
GS
0.502 0 0.502 RC
2 setlinecap
1 LJ
1.2 LW
N
280.5 209.48 M
277.219 209.48 L
S
GR
GS
0.502 0 0.502 RC
2 setlinecap
1 LJ
1.2 LW
N
280.5 205.004 M
277.219 205.004 L
S
GR
GS
0.502 0 0.502 RC
2 setlinecap
1 LJ
1.2 LW
N
280.5 201 M
277.219 201 L
S
GR
GS
0.502 0 0.502 RC
2 setlinecap
1 LJ
1.2 LW
N
280.5 174.66 M
277.219 174.66 L
S
GR
GS
0.502 0 0.502 RC
2 setlinecap
1 LJ
1.2 LW
N
280.5 159.252 M
277.219 159.252 L
S
GR
GS
0.502 0 0.502 RC
2 setlinecap
1 LJ
1.2 LW
N
280.5 148.32 M
277.219 148.32 L
S
GR
GS
0.502 0 0.502 RC
2 setlinecap
1 LJ
1.2 LW
N
280.5 139.84 M
277.219 139.84 L
S
GR
GS
0.502 0 0.502 RC
2 setlinecap
1 LJ
1.2 LW
N
280.5 132.912 M
277.219 132.912 L
S
GR
GS
0.502 0 0.502 RC
2 setlinecap
1 LJ
1.2 LW
N
280.5 127.054 M
277.219 127.054 L
S
GR
GS
0.502 0 0.502 RC
2 setlinecap
1 LJ
1.2 LW
N
280.5 121.98 M
277.219 121.98 L
S
GR
GS
0.502 0 0.502 RC
2 setlinecap
1 LJ
1.2 LW
N
280.5 117.504 M
277.219 117.504 L
S
GR
GS
0.502 0 0.502 RC
2 setlinecap
1 LJ
1.2 LW
N
280.5 113.5 M
277.219 113.5 L
S
GR
GS
0.502 0 0.502 RC
2 setlinecap
1 LJ
1.2 LW
N
280.5 87.16 M
277.219 87.16 L
S
GR
GS
0.502 0 0.502 RC
2 setlinecap
1 LJ
1.2 LW
N
280.5 71.752 M
277.219 71.752 L
S
GR
GS
0.502 0 0.502 RC
2 setlinecap
1 LJ
1.2 LW
N
280.5 60.82 M
277.219 60.82 L
S
GR
GS
0.502 0 0.502 RC
2 setlinecap
1 LJ
1.2 LW
N
280.5 52.34 M
277.219 52.34 L
S
GR
GS
0.502 0 0.502 RC
2 setlinecap
1 LJ
1.2 LW
N
280.5 45.412 M
277.219 45.412 L
S
GR
GS
0.502 0 0.502 RC
2 setlinecap
1 LJ
1.2 LW
N
280.5 39.554 M
277.219 39.554 L
S
GR
GS
0.502 0 0.502 RC
2 setlinecap
1 LJ
1.2 LW
N
280.5 34.48 M
277.219 34.48 L
S
GR
GS
0.502 0 0.502 RC
2 setlinecap
1 LJ
1.2 LW
N
280.5 30.004 M
277.219 30.004 L
S
GR
GS
0.502 0 0.502 RC
2 setlinecap
1 LJ
1.2 LW
N
280.5 26 M
277.219 26 L
S
GR
GS
[1 0 0 1 286 298] CT
0.502 0 0.502 RC
/Helvetica 16 F
GS
[1 0 0 1 0 0] CT
0 0 moveto 
1 -1 scale
(10) t 
GR
GR
GS
[1 0 0 1 304 290] CT
0.502 0 0.502 RC
/Helvetica 12.8 F
GS
[1 0 0 1 0 0] CT
0 0 moveto 
1 -1 scale
(-7) t 
GR
GR
GS
[1 0 0 1 286 210] CT
0.502 0 0.502 RC
/Helvetica 16 F
GS
[1 0 0 1 0 0] CT
0 0 moveto 
1 -1 scale
(10) t 
GR
GR
GS
[1 0 0 1 304 202] CT
0.502 0 0.502 RC
/Helvetica 12.8 F
GS
[1 0 0 1 0 0] CT
0 0 moveto 
1 -1 scale
(-6) t 
GR
GR
GS
[1 0 0 1 286 122] CT
0.502 0 0.502 RC
/Helvetica 16 F
GS
[1 0 0 1 0 0] CT
0 0 moveto 
1 -1 scale
(10) t 
GR
GR
GS
[1 0 0 1 304 114] CT
0.502 0 0.502 RC
/Helvetica 12.8 F
GS
[1 0 0 1 0 0] CT
0 0 moveto 
1 -1 scale
(-5) t 
GR
GR
GS
[1 0 0 1 286 35] CT
0.502 0 0.502 RC
/Helvetica 16 F
GS
[1 0 0 1 0 0] CT
0 0 moveto 
1 -1 scale
(10) t 
GR
GR
GS
[1 0 0 1 304 27] CT
0.502 0 0.502 RC
/Helvetica 12.8 F
GS
[1 0 0 1 0 0] CT
0 0 moveto 
1 -1 scale
(-4) t 
GR
GR
GS
[0 -1 1 0 319.19998 157.24988] CT
0.502 0 0.502 RC
N
-26.451 9.625 M
-26.451 -0.016 L
-26.404 -0.359 -26.108 -0.359 QT
-25.826 -0.359 -25.764 -0.016 QT
-25.764 9.625 L
-25.826 9.953 -26.108 9.953 QT
-26.389 9.953 -26.451 9.625 QT
cp
-22.904 9.625 M
-22.904 -0.016 L
-22.842 -0.359 -22.545 -0.359 QT
-22.264 -0.359 -22.217 -0.016 QT
-22.217 9.625 L
-22.279 9.953 -22.545 9.953 QT
-22.842 9.953 -22.904 9.625 QT
cp
f
GR
GS
[0 -1 1 0 319.19998 157.24988] CT
0.502 0 0.502 RC
N
-26.451 19.225 M
-26.451 9.584 L
-26.404 9.241 -26.108 9.241 QT
-25.826 9.241 -25.764 9.584 QT
-25.764 19.225 L
-25.826 19.553 -26.108 19.553 QT
-26.389 19.553 -26.451 19.225 QT
cp
-22.904 19.225 M
-22.904 9.584 L
-22.842 9.241 -22.545 9.241 QT
-22.264 9.241 -22.217 9.584 QT
-22.217 19.225 L
-22.279 19.553 -22.545 19.553 QT
-22.842 19.553 -22.904 19.225 QT
cp
f
GR
GS
[0 -1 1 0 319.19998 157.24988] CT
0.502 0 0.502 RC
N
-19.156 13.381 M
-19.141 13.35 -19.117 13.249 QT
-19.094 13.147 -19.047 13.092 QT
-19 13.038 -18.922 13.038 QT
-17.547 13.038 -17.109 12.959 QT
-16.672 12.85 -16.594 12.491 QT
-14.406 3.709 L
-14.328 3.506 -14.328 3.35 QT
-14.328 3.225 -14.891 3.225 QT
-15.828 3.225 L
-16.891 3.225 -17.476 3.553 QT
-18.062 3.881 -18.336 4.42 QT
-18.609 4.959 -19.031 6.194 QT
-19.094 6.334 -19.203 6.334 QT
-19.344 6.334 L
-19.5 6.334 -19.5 6.131 QT
-18.359 2.819 L
-18.328 2.663 -18.203 2.663 QT
-8.75 2.663 L
-8.594 2.663 -8.594 2.881 QT
-9.125 6.194 L
-9.125 6.241 -9.18 6.288 QT
-9.234 6.334 -9.281 6.334 QT
-9.422 6.334 L
-9.578 6.334 -9.578 6.131 QT
-9.406 4.991 -9.406 4.522 QT
-9.406 3.959 -9.641 3.67 QT
-9.875 3.381 -10.25 3.303 QT
-10.625 3.225 -11.234 3.225 QT
-12.172 3.225 L
-12.609 3.225 -12.758 3.303 QT
-12.906 3.381 -13 3.772 QT
-15.203 12.553 L
-15.203 12.584 -15.211 12.616 QT
-15.219 12.647 -15.234 12.694 QT
-15.234 12.897 -14.984 12.959 QT
-14.578 13.038 -13.219 13.038 QT
-13.062 13.038 -13.062 13.241 QT
-13.109 13.475 -13.141 13.538 QT
-13.172 13.6 -13.328 13.6 QT
-18.984 13.6 L
-19.156 13.6 -19.156 13.381 QT
cp
f
GR
GS
[0 -1 1 0 319.19998 157.24988] CT
0.502 0 0.502 RC
N
-10.009 16 M
-10.103 16 -10.103 15.859 QT
-10.103 15.828 -10.087 15.758 QT
-10.072 15.688 -10.041 15.649 QT
-10.009 15.609 -9.978 15.609 QT
-9.306 15.609 -9.025 15.531 QT
-8.884 15.484 -8.822 15.25 QT
-7.322 9.203 L
-7.291 9.094 -7.291 9.047 QT
-7.291 8.938 -7.431 8.922 QT
-7.634 8.875 -8.212 8.875 QT
-8.322 8.875 -8.322 8.734 QT
-8.322 8.703 -8.306 8.633 QT
-8.291 8.563 -8.259 8.524 QT
-8.228 8.484 -8.181 8.484 QT
-4.228 8.484 L
-3.462 8.484 -2.892 8.859 QT
-2.322 9.234 -2.017 9.867 QT
-1.712 10.5 -1.712 11.25 QT
-1.712 12.094 -2.056 12.938 QT
-2.4 13.781 -3.033 14.484 QT
-3.666 15.188 -4.47 15.594 QT
-5.275 16 -6.119 16 QT
-10.009 16 L
cp
-7.947 15.531 M
-7.947 15.609 -7.572 15.609 QT
-6.291 15.609 L
-5.681 15.609 -5.111 15.359 QT
-4.541 15.109 -4.087 14.672 QT
-3.681 14.25 -3.361 13.578 QT
-3.041 12.906 -2.869 12.18 QT
-2.697 11.453 -2.697 10.844 QT
-2.697 10.391 -2.83 10.031 QT
-2.962 9.672 -3.205 9.414 QT
-3.447 9.156 -3.806 9.016 QT
-4.166 8.875 -4.603 8.875 QT
-5.822 8.875 L
-6.119 8.875 -6.212 8.922 QT
-6.306 8.969 -6.4 9.25 QT
-7.9 15.281 L
-7.947 15.422 -7.947 15.531 QT
cp
f
GR
GS
[0 -1 1 0 319.19998 157.24988] CT
0.502 0 0.502 RC
N
-1.049 19.18 M
-1.049 19.133 -1.033 19.118 QT
-0.237 15.93 L
-0.127 15.493 0.146 15.078 QT
0.42 14.664 0.81 14.407 QT
1.201 14.149 1.638 14.149 QT
1.982 14.149 2.24 14.328 QT
2.498 14.508 2.631 14.805 QT
2.763 15.102 2.763 15.446 QT
2.763 15.836 2.607 16.25 QT
2.451 16.664 2.17 17.008 QT
1.888 17.352 1.529 17.563 QT
1.17 17.774 0.763 17.774 QT
0.529 17.774 0.326 17.633 QT
0.123 17.493 -0.002 17.258 QT
-0.471 19.149 L
-0.502 19.274 -0.596 19.344 QT
-0.69 19.414 -0.799 19.414 QT
-0.893 19.414 -0.971 19.352 QT
-1.049 19.289 -1.049 19.18 QT
cp
0.779 17.555 M
1.201 17.555 1.521 17.118 QT
1.842 16.68 2.006 16.094 QT
2.17 15.508 2.17 15.102 QT
2.17 14.805 2.037 14.578 QT
1.904 14.352 1.623 14.352 QT
1.279 14.352 1.013 14.618 QT
0.748 14.883 0.584 15.235 QT
0.42 15.586 0.326 15.977 QT
0.107 16.868 L
0.154 17.164 0.334 17.36 QT
0.513 17.555 0.779 17.555 QT
cp
f
GR
GS
[0 -1 1 0 319.19998 157.24988] CT
0.502 0 0.502 RC
N
6.796 9.625 M
6.796 -0.016 L
6.843 -0.359 7.14 -0.359 QT
7.421 -0.359 7.484 -0.016 QT
7.484 9.625 L
7.421 9.953 7.14 9.953 QT
6.859 9.953 6.796 9.625 QT
cp
10.343 9.625 M
10.343 -0.016 L
10.406 -0.359 10.703 -0.359 QT
10.984 -0.359 11.031 -0.016 QT
11.031 9.625 L
10.968 9.953 10.703 9.953 QT
10.406 9.953 10.343 9.625 QT
cp
f
GR
GS
[0 -1 1 0 319.19998 157.24988] CT
0.502 0 0.502 RC
N
6.796 19.225 M
6.796 9.584 L
6.843 9.241 7.14 9.241 QT
7.421 9.241 7.484 9.584 QT
7.484 19.225 L
7.421 19.553 7.14 19.553 QT
6.859 19.553 6.796 19.225 QT
cp
10.343 19.225 M
10.343 9.584 L
10.406 9.241 10.703 9.241 QT
10.984 9.241 11.031 9.584 QT
11.031 19.225 L
10.968 19.553 10.703 19.553 QT
10.406 19.553 10.343 19.225 QT
cp
f
GR
GS
[0 -1 1 0 319.19998 157.24988] CT
0.502 0 0.502 RC
N
13.701 19.796 M
13.701 19.405 L
14.826 19.405 14.826 19.061 QT
14.826 13.014 L
14.826 12.671 13.701 12.671 QT
13.701 12.28 L
16.982 12.28 L
16.982 12.671 L
15.857 12.671 15.857 13.014 QT
15.857 15.686 L
19.092 15.686 L
19.092 13.014 L
19.092 12.671 17.967 12.671 QT
17.967 12.28 L
21.248 12.28 L
21.248 12.671 L
20.123 12.671 20.123 13.014 QT
20.123 19.061 L
20.123 19.405 21.248 19.405 QT
21.248 19.796 L
17.967 19.796 L
17.967 19.405 L
19.092 19.405 19.092 19.061 QT
19.092 16.077 L
15.857 16.077 L
15.857 19.061 L
15.857 19.405 16.982 19.405 QT
16.982 19.796 L
13.701 19.796 L
cp
f
GR
GS
[0 -1 1 0 319.19998 157.24988] CT
0.502 0 0.502 RC
N
22.382 19.952 M
22.382 17.389 L
22.382 17.296 22.476 17.296 QT
22.601 17.296 L
22.632 17.296 22.663 17.327 QT
22.695 17.358 22.695 17.389 QT
22.695 18.467 23.359 19.061 QT
24.023 19.655 25.117 19.655 QT
25.492 19.655 25.82 19.436 QT
26.148 19.217 26.327 18.858 QT
26.507 18.499 26.507 18.108 QT
26.507 17.78 26.367 17.467 QT
26.226 17.155 25.976 16.921 QT
25.726 16.686 25.413 16.608 QT
23.976 16.264 L
23.273 16.077 22.827 15.499 QT
22.382 14.921 22.382 14.186 QT
22.382 13.624 22.671 13.124 QT
22.96 12.624 23.452 12.335 QT
23.945 12.046 24.507 12.046 QT
25.601 12.046 26.257 12.78 QT
26.71 12.077 L
26.742 12.046 26.788 12.046 QT
26.867 12.046 L
26.898 12.046 26.921 12.069 QT
26.945 12.092 26.945 12.124 QT
26.945 14.686 L
26.945 14.78 26.867 14.78 QT
26.726 14.78 L
26.632 14.78 26.632 14.686 QT
26.632 14.405 26.538 14.069 QT
26.445 13.733 26.273 13.428 QT
26.101 13.124 25.913 12.936 QT
25.382 12.389 24.507 12.389 QT
24.132 12.389 23.812 12.585 QT
23.492 12.78 23.304 13.108 QT
23.117 13.436 23.117 13.796 QT
23.117 14.264 23.413 14.647 QT
23.71 15.03 24.179 15.155 QT
25.601 15.499 L
25.96 15.592 26.273 15.811 QT
26.585 16.03 26.796 16.327 QT
27.007 16.624 27.124 16.991 QT
27.242 17.358 27.242 17.733 QT
27.242 18.327 26.968 18.858 QT
26.695 19.389 26.202 19.71 QT
25.71 20.03 25.117 20.03 QT
24.742 20.03 24.367 19.952 QT
23.992 19.874 23.663 19.71 QT
23.335 19.546 23.085 19.28 QT
22.617 19.999 L
22.585 20.03 22.538 20.03 QT
22.476 20.03 L
22.382 20.03 22.382 19.952 QT
cp
f
GR
GS
N
59 26 M
281 26 L
281 289 L
59 289 L
59 26 L
cp
clip
[8 8] 0 setdash
2 LJ
2 LW
N
59 254.703 M
60.115 252.997 L
61.231 250.733 L
62.346 248.05 L
63.461 245.761 L
64.576 243.417 L
65.692 241.058 L
66.807 238.091 L
67.922 234.581 L
69.038 230.68 L
70.153 226.8 L
71.268 224.966 L
72.383 223.771 L
73.499 222.502 L
74.614 221.164 L
75.729 219.89 L
76.845 218.598 L
77.96 217.323 L
79.075 216.43 L
80.191 215.43 L
81.306 214.478 L
82.421 213.636 L
83.536 212.934 L
84.652 212.256 L
85.767 211.531 L
86.882 210.749 L
87.998 209.997 L
89.113 209.353 L
90.228 208.612 L
91.343 207.957 L
92.459 207.321 L
93.574 206.737 L
94.689 206.103 L
95.805 205.814 L
96.92 205.487 L
98.035 205.266 L
99.15 205.103 L
100.266 205.059 L
101.381 205.057 L
102.496 205.126 L
103.612 205.315 L
104.727 205.637 L
105.842 206.057 L
106.958 206.528 L
108.073 207.037 L
109.188 207.586 L
110.303 208.237 L
111.419 208.864 L
112.534 209.427 L
113.649 210.011 L
114.765 210.572 L
115.88 211.356 L
116.995 212.056 L
118.11 212.787 L
119.226 213.5 L
120.341 214.189 L
121.456 214.899 L
122.572 215.613 L
123.687 216.301 L
124.802 216.978 L
125.917 217.629 L
127.033 218.217 L
128.148 218.769 L
129.263 219.314 L
130.379 219.865 L
131.494 220.388 L
132.609 220.875 L
133.725 221.334 L
134.84 221.762 L
135.955 222.157 L
137.07 222.544 L
138.186 222.91 L
139.301 223.243 L
140.416 223.603 L
141.532 223.953 L
142.647 224.314 L
143.762 224.642 L
144.877 225.104 L
145.993 225.762 L
147.108 226.389 L
148.223 226.98 L
149.339 227.529 L
150.454 228.08 L
151.569 228.68 L
152.684 229.301 L
153.8 229.897 L
154.915 230.537 L
156.03 231.18 L
157.146 231.892 L
158.261 232.603 L
159.376 233.292 L
160.492 233.957 L
161.607 234.615 L
162.722 235.333 L
163.837 236.028 L
164.953 236.707 L
166.068 237.561 L
167.183 238.378 L
168.299 239.173 L
169.414 240.018 L
170.529 240.816 L
171.644 241.568 L
172.76 242.381 L
173.875 243.231 L
174.99 244.102 L
176.106 245.022 L
177.221 245.88 L
178.336 246.684 L
179.451 247.435 L
180.567 248.198 L
181.682 248.963 L
182.797 249.744 L
183.913 250.507 L
185.028 251.26 L
186.143 251.994 L
187.258 252.707 L
188.374 253.396 L
189.489 254.098 L
190.604 254.796 L
191.72 255.466 L
192.835 256.107 L
193.95 256.703 L
195.066 256.958 L
196.181 257.226 L
197.296 257.479 L
198.411 257.719 L
199.527 257.938 L
200.642 258.139 L
201.757 258.32 L
202.873 258.483 L
203.988 258.627 L
205.103 258.788 L
206.218 258.937 L
207.334 259.071 L
208.449 259.156 L
209.564 259.165 L
210.68 259.173 L
211.795 259.184 L
212.91 259.188 L
214.025 259.185 L
215.141 259.177 L
216.256 259.173 L
217.371 259.177 L
218.487 259.231 L
219.602 259.277 L
220.717 259.328 L
221.833 259.414 L
222.948 259.488 L
224.063 259.586 L
225.178 259.686 L
226.294 259.774 L
227.409 259.854 L
228.524 259.932 L
229.64 260.005 L
230.755 260.064 L
231.87 260.111 L
232.985 260.145 L
234.101 260.168 L
235.216 260.18 L
236.331 260.174 L
237.447 260.165 L
238.562 260.147 L
239.677 260.121 L
240.792 260.097 L
241.908 260.078 L
243.023 260.08 L
244.138 260.101 L
245.254 260.115 L
246.369 260.125 L
247.484 260.134 L
248.6 260.15 L
249.715 260.169 L
250.83 260.186 L
251.945 260.202 L
253.061 260.215 L
254.176 260.228 L
255.291 260.24 L
256.407 260.25 L
257.522 260.279 L
258.637 260.326 L
259.752 260.37 L
260.868 260.415 L
261.983 260.484 L
263.098 260.559 L
264.214 260.644 L
265.329 260.735 L
266.444 260.8 L
267.56 260.858 L
268.675 260.906 L
269.79 260.941 L
270.905 260.964 L
272.021 260.98 L
273.136 260.99 L
274.251 260.993 L
275.367 261.003 L
276.482 261.007 L
277.597 261.012 L
278.712 261.031 L
279.828 261.045 L
280.943 261.063 L
S
GR
GS
0 0 1 RC
1 LJ
2 LW
N
59 272.042 M
60.115 270.977 L
61.231 269.886 L
62.346 268.789 L
63.461 267.669 L
64.576 266.529 L
65.692 265.372 L
66.807 264.201 L
67.922 263.04 L
69.038 261.855 L
70.153 260.666 L
71.268 259.477 L
72.383 258.292 L
73.499 257.116 L
74.614 255.95 L
75.729 254.741 L
76.845 253.521 L
77.96 252.325 L
79.075 251.157 L
80.191 250.023 L
81.306 248.926 L
82.421 247.87 L
83.536 246.858 L
84.652 245.895 L
85.767 244.981 L
86.882 244.121 L
87.998 243.313 L
89.113 242.549 L
90.228 241.843 L
91.343 241.197 L
92.459 240.61 L
93.574 240.083 L
94.689 239.615 L
95.805 239.226 L
96.92 238.875 L
98.035 238.578 L
99.15 238.335 L
100.266 238.143 L
101.381 238.001 L
102.496 237.904 L
103.612 237.852 L
104.727 237.844 L
105.842 237.876 L
106.958 237.946 L
108.073 238.051 L
109.188 238.189 L
110.303 238.357 L
111.419 238.551 L
112.534 238.771 L
113.649 239.012 L
114.765 239.275 L
115.88 239.569 L
116.995 239.88 L
118.11 240.206 L
119.226 240.544 L
120.341 240.892 L
121.456 241.249 L
122.572 241.613 L
123.687 242.002 L
124.802 242.376 L
125.917 242.752 L
127.033 243.13 L
128.148 243.532 L
129.263 243.949 L
130.379 244.364 L
131.494 244.776 L
132.609 245.185 L
133.725 245.589 L
134.84 245.987 L
135.955 246.38 L
137.07 246.767 L
138.186 247.146 L
139.301 247.519 L
140.416 247.884 L
141.532 248.246 L
142.647 248.64 L
143.762 249.023 L
144.877 249.396 L
145.993 249.759 L
147.108 250.11 L
148.223 250.451 L
149.339 250.781 L
150.454 251.101 L
151.569 251.41 L
152.684 251.731 L
153.8 252.019 L
154.915 252.315 L
156.03 252.614 L
157.146 252.903 L
158.261 253.183 L
159.376 253.454 L
160.492 253.717 L
161.607 253.971 L
162.722 254.217 L
163.837 254.456 L
164.953 254.686 L
166.068 254.91 L
167.183 255.126 L
168.299 255.342 L
169.414 255.599 L
170.529 255.854 L
171.644 256.105 L
172.76 256.354 L
173.875 256.601 L
174.99 256.848 L
176.106 257.094 L
177.221 257.34 L
178.336 257.588 L
179.451 257.837 L
180.567 258.109 L
181.682 258.533 L
182.797 259.106 L
183.913 259.697 L
185.028 260.303 L
186.143 260.923 L
187.258 261.553 L
188.374 262.19 L
189.489 262.833 L
190.604 263.479 L
191.72 264.125 L
192.835 264.769 L
193.95 265.401 L
195.066 265.791 L
196.181 266.171 L
197.296 266.54 L
198.411 266.899 L
199.527 267.248 L
200.642 267.587 L
201.757 267.917 L
202.873 268.238 L
203.988 268.549 L
205.103 268.852 L
206.218 269.146 L
207.334 269.433 L
208.449 269.626 L
209.564 269.73 L
210.68 269.832 L
211.795 269.933 L
212.91 270.033 L
214.025 270.132 L
215.141 270.229 L
216.256 270.325 L
217.371 270.421 L
218.487 270.515 L
219.602 270.608 L
220.717 270.7 L
221.833 270.802 L
222.948 270.903 L
224.063 271.003 L
225.178 271.101 L
226.294 271.198 L
227.409 271.294 L
228.524 271.389 L
229.64 271.483 L
230.755 271.576 L
231.87 271.668 L
232.985 271.758 L
234.101 271.848 L
235.216 271.919 L
236.331 271.983 L
237.447 272.04 L
238.562 272.096 L
239.677 272.152 L
240.792 272.208 L
241.908 272.264 L
243.023 272.319 L
244.138 272.374 L
245.254 272.429 L
246.369 272.483 L
247.484 272.538 L
248.6 272.597 L
249.715 272.657 L
250.83 272.716 L
251.945 272.774 L
253.061 272.833 L
254.176 272.89 L
255.291 272.948 L
256.407 273.005 L
257.522 273.062 L
258.637 273.118 L
259.752 273.174 L
260.868 273.225 L
261.983 273.272 L
263.098 273.318 L
264.214 273.364 L
265.329 273.416 L
266.444 273.461 L
267.56 273.507 L
268.675 273.552 L
269.79 273.596 L
270.905 273.641 L
272.021 273.685 L
273.136 273.729 L
274.251 273.774 L
275.367 273.844 L
276.482 273.914 L
277.597 273.983 L
278.712 274.051 L
279.828 274.12 L
280.943 274.187 L
S
GR
GS
0.502 0 0.502 RC
[2 2] 0 setdash
2 LJ
2 LW
N
59 181.693 M
60.115 181.399 L
61.231 181.069 L
62.346 180.699 L
63.461 180.292 L
64.576 179.847 L
65.692 179.361 L
66.807 178.832 L
67.922 178.233 L
69.038 177.61 L
70.153 176.937 L
71.268 176.211 L
72.383 175.43 L
73.499 174.591 L
74.614 173.69 L
75.729 172.696 L
76.845 171.609 L
77.96 170.434 L
79.075 169.167 L
80.191 167.801 L
81.306 166.33 L
82.421 164.746 L
83.536 163.042 L
84.652 161.207 L
85.767 159.232 L
86.882 157.105 L
87.998 154.806 L
89.113 152.282 L
90.228 149.546 L
91.343 146.576 L
92.459 143.342 L
93.574 139.815 L
94.689 135.959 L
95.805 131.719 L
96.92 127.105 L
98.035 122.092 L
99.15 116.741 L
100.266 111.268 L
101.381 106.192 L
102.496 102.532 L
103.612 101.528 L
104.727 103.538 L
105.842 107.712 L
106.958 112.848 L
108.073 118.126 L
109.188 123.16 L
110.303 127.812 L
111.419 132.061 L
112.534 135.931 L
113.649 139.46 L
114.765 142.721 L
115.88 145.909 L
116.995 148.827 L
118.11 151.511 L
119.226 153.992 L
120.341 156.295 L
121.456 158.44 L
122.572 160.446 L
123.687 162.308 L
124.802 164.076 L
125.917 165.744 L
127.033 167.321 L
128.148 168.947 L
129.263 170.57 L
130.379 172.107 L
131.494 173.567 L
132.609 174.957 L
133.725 176.283 L
134.84 177.551 L
135.955 178.765 L
137.07 179.931 L
138.186 181.051 L
139.301 182.129 L
140.416 183.169 L
141.532 184.198 L
142.647 185.407 L
143.762 186.574 L
144.877 187.703 L
145.993 188.797 L
147.108 189.859 L
148.223 190.891 L
149.339 191.895 L
150.454 192.873 L
151.569 193.827 L
152.684 194.737 L
153.8 195.646 L
154.915 196.561 L
156.03 197.472 L
157.146 198.364 L
158.261 199.237 L
159.376 200.093 L
160.492 200.933 L
161.607 201.756 L
162.722 202.566 L
163.837 203.361 L
164.953 204.143 L
166.068 204.912 L
167.183 205.67 L
168.299 206.427 L
169.414 207.263 L
170.529 208.085 L
171.644 208.894 L
172.76 209.69 L
173.875 210.473 L
174.99 211.244 L
176.106 212.003 L
177.221 212.751 L
178.336 213.488 L
179.451 214.214 L
180.567 214.91 L
181.682 215.407 L
182.797 215.723 L
183.913 216.019 L
185.028 216.295 L
186.143 216.55 L
187.259 216.786 L
188.374 217.002 L
189.489 217.197 L
190.604 217.373 L
191.72 217.53 L
192.835 217.666 L
193.95 217.763 L
195.066 217.27 L
196.181 216.777 L
197.296 216.283 L
198.411 215.789 L
199.527 215.295 L
200.642 214.801 L
201.757 214.307 L
202.873 213.813 L
203.988 213.319 L
205.103 212.825 L
206.218 212.332 L
207.334 211.839 L
208.449 211.334 L
209.564 210.856 L
210.68 210.381 L
211.795 209.91 L
212.91 209.442 L
214.026 208.978 L
215.141 208.517 L
216.256 208.059 L
217.371 207.605 L
218.487 207.154 L
219.602 206.706 L
220.717 206.266 L
221.833 205.897 L
222.948 205.531 L
224.063 205.167 L
225.178 204.805 L
226.294 204.445 L
227.409 204.087 L
228.524 203.731 L
229.64 203.377 L
230.755 203.026 L
231.87 202.676 L
232.985 202.328 L
234.101 201.982 L
235.216 201.691 L
236.331 201.424 L
237.447 201.176 L
238.562 200.929 L
239.677 200.684 L
240.793 200.439 L
241.908 200.195 L
243.023 199.952 L
244.138 199.711 L
245.254 199.47 L
246.369 199.23 L
247.484 198.993 L
248.6 198.793 L
249.715 198.594 L
250.83 198.395 L
251.945 198.197 L
253.061 198 L
254.176 197.804 L
255.291 197.608 L
256.407 197.413 L
257.522 197.218 L
258.637 197.024 L
259.752 196.831 L
260.868 196.664 L
261.983 196.52 L
263.098 196.377 L
264.214 196.234 L
265.329 196.072 L
266.444 195.929 L
267.56 195.786 L
268.675 195.644 L
269.79 195.501 L
270.905 195.36 L
272.021 195.218 L
273.136 195.077 L
274.251 194.937 L
275.367 194.824 L
276.482 194.711 L
277.597 194.597 L
278.712 194.484 L
279.828 194.371 L
280.943 194.259 L
S
GR
GS
1 GC
N
274 101 M
274 34 L
172 34 L
172 101 L
cp
f
GR
GS
[1 0 0 1 208.94341 46.23052] CT
N
1.844 3.064 M
2.016 3.533 2.461 3.775 QT
2.906 4.017 3.438 4.017 QT
3.969 4.017 4.461 3.642 QT
4.953 3.267 5.297 2.713 QT
5.641 2.158 5.781 1.611 QT
7.781 -6.436 L
7.797 -6.498 7.805 -6.529 QT
7.813 -6.561 7.813 -6.592 QT
7.813 -6.779 7.688 -6.826 QT
7.234 -6.936 5.875 -6.936 QT
5.688 -6.936 5.688 -7.154 QT
5.734 -7.295 5.75 -7.365 QT
5.766 -7.436 5.82 -7.483 QT
5.875 -7.529 5.984 -7.529 QT
10.594 -7.529 L
10.766 -7.529 10.766 -7.311 QT
10.688 -6.936 10.547 -6.936 QT
9.938 -6.936 9.633 -6.842 QT
9.328 -6.748 9.219 -6.358 QT
7.203 1.674 L
7.016 2.471 6.43 3.103 QT
5.844 3.736 5.039 4.096 QT
4.234 4.455 3.422 4.455 QT
2.531 4.455 1.852 3.955 QT
1.172 3.455 1.172 2.596 QT
1.172 2.033 1.477 1.627 QT
1.781 1.221 2.344 1.221 QT
2.672 1.221 2.891 1.424 QT
3.109 1.627 3.109 1.939 QT
3.109 2.392 2.773 2.736 QT
2.438 3.08 1.969 3.08 QT
1.891 3.08 1.844 3.064 QT
cp
f
GR
GS
[1 0 0 1 208.94341 46.23052] CT
N
10.02 6.63 M
10.02 6.302 L
10.02 6.271 10.052 6.239 QT
11.911 4.177 L
12.333 3.724 12.599 3.411 QT
12.864 3.099 13.122 2.692 QT
13.38 2.286 13.528 1.872 QT
13.677 1.458 13.677 0.989 QT
13.677 0.489 13.497 0.044 QT
13.317 -0.401 12.958 -0.675 QT
12.599 -0.948 12.083 -0.948 QT
11.567 -0.948 11.145 -0.628 QT
10.724 -0.308 10.552 0.177 QT
10.599 0.177 10.692 0.177 QT
10.958 0.177 11.145 0.356 QT
11.333 0.536 11.333 0.817 QT
11.333 1.099 11.145 1.286 QT
10.958 1.474 10.692 1.474 QT
10.411 1.474 10.216 1.278 QT
10.02 1.083 10.02 0.817 QT
10.02 0.364 10.192 -0.026 QT
10.364 -0.417 10.685 -0.729 QT
11.005 -1.042 11.403 -1.206 QT
11.802 -1.37 12.255 -1.37 QT
12.942 -1.37 13.536 -1.073 QT
14.13 -0.776 14.474 -0.253 QT
14.817 0.271 14.817 0.989 QT
14.817 1.505 14.591 1.974 QT
14.364 2.442 14.005 2.825 QT
13.645 3.208 13.091 3.7 QT
12.536 4.192 12.364 4.349 QT
11.005 5.661 L
12.145 5.661 L
13.005 5.661 13.575 5.646 QT
14.145 5.63 14.177 5.599 QT
14.317 5.442 14.474 4.489 QT
14.817 4.489 L
14.474 6.63 L
10.02 6.63 L
cp
f
GR
GS
[8 8] 0 setdash
2 LJ
2 LW
N
175.994 46.231 M
205.948 46.231 L
S
GR
GS
[1 0 0 1 208.94341 67.18281] CT
N
/f-386962647{1.844 3.064 M
2.016 3.533 2.461 3.775 QT
2.906 4.017 3.438 4.017 QT
3.969 4.017 4.461 3.642 QT
4.953 3.267 5.297 2.713 QT
5.641 2.158 5.781 1.611 QT
7.781 -6.436 L
7.797 -6.498 7.805 -6.529 QT
7.813 -6.561 7.813 -6.592 QT
7.813 -6.779 7.688 -6.826 QT
7.234 -6.936 5.875 -6.936 QT
5.688 -6.936 5.688 -7.154 QT
5.734 -7.295 5.75 -7.365 QT
5.766 -7.436 5.82 -7.483 QT
5.875 -7.529 5.984 -7.529 QT
10.594 -7.529 L
10.766 -7.529 10.766 -7.311 QT
10.688 -6.936 10.547 -6.936 QT
9.938 -6.936 9.633 -6.842 QT
9.328 -6.748 9.219 -6.358 QT
7.203 1.674 L
7.016 2.471 6.43 3.103 QT
5.844 3.736 5.039 4.096 QT
4.234 4.455 3.422 4.455 QT
2.531 4.455 1.852 3.955 QT
1.172 3.455 1.172 2.596 QT
1.172 2.033 1.477 1.627 QT
1.781 1.221 2.344 1.221 QT
2.672 1.221 2.891 1.424 QT
3.109 1.627 3.109 1.939 QT
3.109 2.392 2.773 2.736 QT
2.438 3.08 1.969 3.08 QT
1.891 3.08 1.844 3.064 QT
cp}def
f-386962647
f
GR
GS
[1 0 0 1 208.94341 67.18281] CT
N
/f1258772802{9.802 6.63 M
9.802 6.208 L
11.036 6.208 11.036 5.833 QT
11.036 -0.761 L
11.036 -1.151 9.802 -1.151 QT
9.802 -1.573 L
13.395 -1.573 L
13.395 -1.151 L
12.145 -1.151 12.145 -0.761 QT
12.145 2.146 L
15.692 2.146 L
15.692 -0.761 L
15.692 -1.151 14.458 -1.151 QT
14.458 -1.573 L
18.036 -1.573 L
18.036 -1.151 L
16.817 -1.151 16.817 -0.761 QT
16.817 5.833 L
16.817 6.208 18.036 6.208 QT
18.036 6.63 L
14.458 6.63 L
14.458 6.208 L
15.692 6.208 15.692 5.833 QT
15.692 2.567 L
12.145 2.567 L
12.145 5.833 L
12.145 6.208 13.395 6.208 QT
13.395 6.63 L
9.802 6.63 L
cp}def
f1258772802
f
GR
GS
[1 0 0 1 208.94341 67.18281] CT
N
/f656184632{19.024 6.802 M
19.024 4.005 L
19.024 3.911 19.133 3.911 QT
19.274 3.911 L
19.32 3.911 19.344 3.935 QT
19.367 3.958 19.367 4.005 QT
19.367 5.177 20.102 5.825 QT
20.836 6.474 22.008 6.474 QT
22.43 6.474 22.781 6.231 QT
23.133 5.989 23.328 5.599 QT
23.524 5.208 23.524 4.802 QT
23.524 4.427 23.375 4.083 QT
23.227 3.739 22.953 3.489 QT
22.68 3.239 22.336 3.161 QT
20.774 2.786 L
20.008 2.567 19.516 1.935 QT
19.024 1.302 19.024 0.505 QT
19.024 -0.104 19.344 -0.651 QT
19.664 -1.198 20.195 -1.519 QT
20.727 -1.839 21.352 -1.839 QT
22.555 -1.839 23.258 -1.011 QT
23.758 -1.792 L
23.789 -1.839 23.836 -1.839 QT
23.914 -1.839 L
23.961 -1.839 23.992 -1.808 QT
24.024 -1.776 24.024 -1.729 QT
24.024 1.052 L
24.024 1.161 23.914 1.161 QT
23.774 1.161 L
23.664 1.161 23.664 1.052 QT
23.664 0.739 23.563 0.38 QT
23.461 0.021 23.281 -0.315 QT
23.102 -0.651 22.883 -0.854 QT
22.305 -1.448 21.352 -1.448 QT
20.945 -1.448 20.602 -1.237 QT
20.258 -1.026 20.047 -0.667 QT
19.836 -0.308 19.836 0.083 QT
19.836 0.599 20.156 1.013 QT
20.477 1.427 20.992 1.567 QT
22.555 1.942 L
22.945 2.036 23.289 2.278 QT
23.633 2.521 23.86 2.849 QT
24.086 3.177 24.211 3.567 QT
24.336 3.958 24.336 4.38 QT
24.336 5.036 24.039 5.614 QT
23.742 6.192 23.203 6.544 QT
22.664 6.896 22.008 6.896 QT
21.617 6.896 21.203 6.81 QT
20.789 6.724 20.438 6.536 QT
20.086 6.349 19.789 6.067 QT
19.289 6.864 L
19.258 6.896 19.195 6.896 QT
19.133 6.896 L
19.024 6.896 19.024 6.802 QT
cp}def
f656184632
f
GR
GS
0 0 1 RC
1 LJ
2 LW
N
175.994 67.183 M
205.948 67.183 L
S
GR
GS
[1 0 0 1 208.94341 88.45229] CT
N
/f1314030421{2.469 -0.298 M
2.469 -10.532 L
2.531 -10.891 2.844 -10.891 QT
3.141 -10.891 3.203 -10.532 QT
3.203 -0.298 L
3.125 0.062 2.844 0.062 QT
2.531 0.062 2.469 -0.298 QT
cp
6.25 -0.298 M
6.25 -10.532 L
6.297 -10.891 6.609 -10.891 QT
6.922 -10.891 6.969 -10.532 QT
6.969 -0.298 L
6.906 0.062 6.609 0.062 QT
6.313 0.062 6.25 -0.298 QT
cp}def
f1314030421
f
GR
GS
[1 0 0 1 208.94341 88.45229] CT
N
/f1738302975{2.469 9.902 M
2.469 -0.332 L
2.531 -0.691 2.844 -0.691 QT
3.141 -0.691 3.203 -0.332 QT
3.203 9.902 L
3.125 10.262 2.844 10.262 QT
2.531 10.262 2.469 9.902 QT
cp
6.25 9.902 M
6.25 -0.332 L
6.297 -0.691 6.609 -0.691 QT
6.922 -0.691 6.969 -0.332 QT
6.969 9.902 L
6.906 10.262 6.609 10.262 QT
6.313 10.262 6.25 9.902 QT
cp}def
f1738302975
f
GR
GS
[1 0 0 1 208.94341 88.45229] CT
N
/f-344461733{10.226 3.715 M
10.226 3.668 10.257 3.559 QT
10.288 3.449 10.335 3.395 QT
10.382 3.34 10.46 3.34 QT
11.929 3.34 12.398 3.246 QT
12.851 3.137 12.944 2.762 QT
15.273 -6.582 L
15.351 -6.785 15.351 -6.941 QT
15.351 -7.082 14.741 -7.082 QT
13.757 -7.082 L
12.616 -7.082 11.999 -6.73 QT
11.382 -6.379 11.093 -5.808 QT
10.804 -5.238 10.351 -3.941 QT
10.288 -3.785 10.179 -3.785 QT
10.023 -3.785 L
9.851 -3.785 9.851 -4.004 QT
11.069 -7.519 L
11.101 -7.676 11.226 -7.676 QT
21.273 -7.676 L
21.444 -7.676 21.444 -7.457 QT
20.882 -3.941 L
20.882 -3.879 20.827 -3.832 QT
20.773 -3.785 20.71 -3.785 QT
20.554 -3.785 L
20.398 -3.785 20.398 -4.004 QT
20.569 -5.207 20.569 -5.707 QT
20.569 -6.301 20.327 -6.605 QT
20.085 -6.91 19.687 -6.996 QT
19.288 -7.082 18.648 -7.082 QT
17.632 -7.082 L
17.179 -7.082 17.023 -6.996 QT
16.866 -6.91 16.757 -6.504 QT
14.429 2.824 L
14.413 2.856 14.413 2.895 QT
14.413 2.934 14.398 2.981 QT
14.398 3.199 14.648 3.246 QT
15.085 3.34 16.538 3.34 QT
16.694 3.34 16.694 3.559 QT
16.648 3.793 16.609 3.863 QT
16.569 3.934 16.413 3.934 QT
10.398 3.934 L
10.226 3.934 10.226 3.715 QT
cp}def
f-344461733
f
GR
GS
[1 0 0 1 208.94341 88.45229] CT
N
/f-2004211616{19.973 6.484 M
19.848 6.484 19.848 6.327 QT
19.848 6.296 19.871 6.226 QT
19.894 6.156 19.926 6.109 QT
19.957 6.062 20.004 6.062 QT
20.738 6.062 21.019 5.984 QT
21.176 5.921 21.254 5.656 QT
22.894 -0.938 L
22.926 -1.048 22.926 -1.094 QT
22.926 -1.235 22.785 -1.251 QT
22.551 -1.298 21.91 -1.298 QT
21.801 -1.298 21.801 -1.454 QT
21.801 -1.485 21.816 -1.555 QT
21.832 -1.626 21.863 -1.673 QT
21.894 -1.719 21.941 -1.719 QT
26.254 -1.719 L
27.098 -1.719 27.723 -1.313 QT
28.348 -0.907 28.684 -0.212 QT
29.019 0.484 29.019 1.312 QT
29.019 2.234 28.637 3.148 QT
28.254 4.062 27.566 4.827 QT
26.879 5.593 26.004 6.038 QT
25.129 6.484 24.207 6.484 QT
19.973 6.484 L
cp
22.207 5.968 M
22.207 6.062 22.613 6.062 QT
24.019 6.062 L
24.676 6.062 25.301 5.788 QT
25.926 5.515 26.41 5.031 QT
26.863 4.577 27.207 3.843 QT
27.551 3.109 27.746 2.312 QT
27.941 1.515 27.941 0.859 QT
27.941 0.359 27.793 -0.032 QT
27.644 -0.423 27.387 -0.704 QT
27.129 -0.985 26.738 -1.141 QT
26.348 -1.298 25.848 -1.298 QT
24.535 -1.298 L
24.207 -1.298 24.098 -1.243 QT
23.988 -1.188 23.91 -0.876 QT
22.269 5.702 L
22.207 5.843 22.207 5.968 QT
cp}def
f-2004211616
f
GR
GS
[1 0 0 1 208.94341 88.45229] CT
N
/f-1174468785{29.481 9.956 M
29.481 9.909 29.497 9.894 QT
30.387 6.3 L
30.512 5.816 30.825 5.347 QT
31.137 4.878 31.575 4.581 QT
32.012 4.284 32.497 4.284 QT
32.887 4.284 33.176 4.495 QT
33.465 4.706 33.614 5.034 QT
33.762 5.362 33.762 5.753 QT
33.762 6.191 33.583 6.659 QT
33.403 7.128 33.09 7.511 QT
32.778 7.894 32.372 8.128 QT
31.965 8.362 31.512 8.362 QT
31.247 8.362 31.02 8.206 QT
30.794 8.05 30.653 7.8 QT
30.122 9.925 L
30.09 10.05 29.989 10.128 QT
29.887 10.206 29.747 10.206 QT
29.637 10.206 29.559 10.144 QT
29.481 10.081 29.481 9.956 QT
cp
31.528 8.128 M
32.012 8.128 32.364 7.644 QT
32.715 7.159 32.903 6.495 QT
33.09 5.831 33.09 5.378 QT
33.09 5.034 32.942 4.776 QT
32.794 4.519 32.481 4.519 QT
32.09 4.519 31.794 4.816 QT
31.497 5.112 31.317 5.519 QT
31.137 5.925 31.012 6.347 QT
30.762 7.362 L
30.825 7.691 31.028 7.909 QT
31.231 8.128 31.528 8.128 QT
cp}def
f-1174468785
f
GR
GS
[1 0 0 1 208.94341 88.45229] CT
N
/f1436493652{37.794 -0.298 M
37.794 -10.532 L
37.857 -10.891 38.169 -10.891 QT
38.466 -10.891 38.529 -10.532 QT
38.529 -0.298 L
38.451 0.062 38.169 0.062 QT
37.857 0.062 37.794 -0.298 QT
cp
41.576 -0.298 M
41.576 -10.532 L
41.623 -10.891 41.935 -10.891 QT
42.248 -10.891 42.294 -10.532 QT
42.294 -0.298 L
42.232 0.062 41.935 0.062 QT
41.638 0.062 41.576 -0.298 QT
cp}def
f1436493652
f
GR
GS
[1 0 0 1 208.94341 88.45229] CT
N
/f650972268{37.794 9.902 M
37.794 -0.332 L
37.857 -0.691 38.169 -0.691 QT
38.466 -0.691 38.529 -0.332 QT
38.529 9.902 L
38.451 10.262 38.169 10.262 QT
37.857 10.262 37.794 9.902 QT
cp
41.576 9.902 M
41.576 -0.332 L
41.623 -0.691 41.935 -0.691 QT
42.248 -0.691 42.294 -0.332 QT
42.294 9.902 L
42.232 10.262 41.935 10.262 QT
41.638 10.262 41.576 9.902 QT
cp}def
f650972268
f
GR
GS
[1 0 0 1 208.94341 88.45229] CT
N
/f-442306766{45.145 10.516 M
45.145 10.095 L
46.38 10.095 46.38 9.72 QT
46.38 3.126 L
46.38 2.735 45.145 2.735 QT
45.145 2.313 L
48.739 2.313 L
48.739 2.735 L
47.489 2.735 47.489 3.126 QT
47.489 6.032 L
51.036 6.032 L
51.036 3.126 L
51.036 2.735 49.801 2.735 QT
49.801 2.313 L
53.38 2.313 L
53.38 2.735 L
52.161 2.735 52.161 3.126 QT
52.161 9.72 L
52.161 10.095 53.38 10.095 QT
53.38 10.516 L
49.801 10.516 L
49.801 10.095 L
51.036 10.095 51.036 9.72 QT
51.036 6.454 L
47.489 6.454 L
47.489 9.72 L
47.489 10.095 48.739 10.095 QT
48.739 10.516 L
45.145 10.516 L
cp}def
f-442306766
f
GR
GS
[1 0 0 1 208.94341 88.45229] CT
N
/f-2050024009{54.367 10.688 M
54.367 7.891 L
54.367 7.798 54.476 7.798 QT
54.617 7.798 L
54.664 7.798 54.687 7.821 QT
54.711 7.845 54.711 7.891 QT
54.711 9.063 55.445 9.712 QT
56.18 10.36 57.351 10.36 QT
57.773 10.36 58.125 10.118 QT
58.476 9.876 58.672 9.485 QT
58.867 9.095 58.867 8.688 QT
58.867 8.313 58.719 7.97 QT
58.57 7.626 58.297 7.376 QT
58.023 7.126 57.68 7.048 QT
56.117 6.673 L
55.351 6.454 54.859 5.821 QT
54.367 5.188 54.367 4.391 QT
54.367 3.782 54.687 3.235 QT
55.008 2.688 55.539 2.368 QT
56.07 2.048 56.695 2.048 QT
57.898 2.048 58.601 2.876 QT
59.101 2.095 L
59.133 2.048 59.18 2.048 QT
59.258 2.048 L
59.305 2.048 59.336 2.079 QT
59.367 2.11 59.367 2.157 QT
59.367 4.938 L
59.367 5.048 59.258 5.048 QT
59.117 5.048 L
59.008 5.048 59.008 4.938 QT
59.008 4.626 58.906 4.266 QT
58.805 3.907 58.625 3.571 QT
58.445 3.235 58.226 3.032 QT
57.648 2.438 56.695 2.438 QT
56.289 2.438 55.945 2.649 QT
55.601 2.86 55.39 3.22 QT
55.18 3.579 55.18 3.97 QT
55.18 4.485 55.5 4.899 QT
55.82 5.313 56.336 5.454 QT
57.898 5.829 L
58.289 5.923 58.633 6.165 QT
58.976 6.407 59.203 6.735 QT
59.43 7.063 59.555 7.454 QT
59.68 7.845 59.68 8.266 QT
59.68 8.923 59.383 9.501 QT
59.086 10.079 58.547 10.43 QT
58.008 10.782 57.351 10.782 QT
56.961 10.782 56.547 10.696 QT
56.133 10.61 55.781 10.423 QT
55.43 10.235 55.133 9.954 QT
54.633 10.751 L
54.601 10.782 54.539 10.782 QT
54.476 10.782 L
54.367 10.782 54.367 10.688 QT
cp}def
f-2050024009
f
GR
GS
0.502 0 0.502 RC
[2 2] 0 setdash
2 LJ
2 LW
N
175.994 88.452 M
205.948 88.452 L
S
GR
GS
0.149 GC
10.0 ML
1.2 LW
N
172 101 M
172 34 L
274 34 L
274 101 L
cp
S
GR
%%Trailer
%%Pages: 1
%%EOF
