{
    "@context": "",
    "name": "",
    "title": "",
    "description": "",
    "id": "",
    "resources": [
        {
            "@id": "",
            "name": "",
            "topics": [
                ""
            ],
            "title": "",
            "path": "",
            "description": "",
            "languages": [
                ""
            ],
            "subject": [
                {
                    "name": "",
                    "@id": ""
                }
            ],
            "keywords": [
                ""
            ],
            "publicationDate": "",
            "embargoPeriod": {
                "start": "",
                "end": "",
                "isActive": false
            },
            "context": {
                "title": "",
                "homepage": "",
                "documentation": "",
                "sourceCode": "",
                "publisher": "",
                "publisherLogo": "",
                "contact": "",
                "fundingAgency": "",
                "fundingAgencyLogo": "",
                "grantNo": ""
            },
            "spatial": {
                "location": {
                    "address": "",
                    "@id": "",
                    "latitude": "",
                    "longitude": ""
                },
                "extent": {
                    "name": "",
                    "@id": "",
                    "resolutionValue": "",
                    "resolutionUnit": "",
                    "boundingBox": [
                        0,
                        0,
                        0,
                        0
                    ],
                    "crs": ""
                }
            },
            "temporal": {
                "referenceDate": "",
                "timeseries": [
                    {
                        "start": "",
                        "end": "",
                        "resolutionValue": "",
                        "resolutionUnit": "",
                        "alignment": "",
                        "aggregationType": ""
                    }
                ]
            },
            "sources": [
                {
                    "title": "",
                    "authors": [
                        ""
                    ],
                    "description": "",
                    "publicationYear": "",
                    "path": "",
                    "sourceLicenses": [
                        {
                            "name": "",
                            "title": "",
                            "path": "",
                            "instruction": "",
                            "attribution": "",
                            "copyrightStatement": ""
                        }
                    ]
                }
            ],
            "licenses": [
                {
                    "name": "",
                    "title": "",
                    "path": "",
                    "instruction": "",
                    "attribution": "",
                    "copyrightStatement": ""
                }
            ],
            "contributors": [
                {
                    "title": "",
                    "path": "",
                    "organization": "",
                    "roles": [
                        ""
                    ],
                    "date": "",
                    "object": "",
                    "comment": ""
                }
            ],
            "type": "",
            "format": "",
            "encoding": "",
            "schema": {
                "fields": [
                    {
                        "name": "",
                        "description": "",
                        "type": "",
                        "nullable": false,
                        "unit": "",
                        "isAbout": [
                            {
                                "name": "",
                                "@id": ""
                            }
                        ],
                        "valueReference": [
                            {
                                "value": "",
                                "name": "",
                                "@id": ""
                            }
                        ]
                    }
                ],
                "primaryKey": [
                    ""
                ],
                "foreignKeys": [
                    {
                        "fields": [
                            ""
                        ],
                        "reference": {
                            "resource": "",
                            "fields": [
                                ""
                            ]
                        }
                    }
                ]
            },
            "dialect": {
                "delimiter": "",
                "decimalSeparator": ""
            },
            "review": {
                "path": "",
                "badge": ""
            }
        }
    ],
    "metaMetadata": {
        "metadataVersion": "OEMetadata-2.0.1",
        "metadataLicense": {
            "name": "CC0-1.0",
            "title": "Creative Commons Zero v1.0 Universal",
            "path": "https://creativecommons.org/publicdomain/zero/1.0"
        }
    }
}