{
"Domain Decomposition" : "comment",
			"NPROCX" : "4",
			"NPROCY" : "2",

"FD order" : "comment",
			"FDORDER" : "2",
			"MAXRELERROR" : "0",

"2-D Grid" : "comment",
			"NX" : "500",
			"NY" : "100",
			"DH" : "0.2",

"Time Stepping" : "comment",
			"TIME" : "0.5",
			"DT" : "5.0e-05",

"Source" : "comment",
			"SOURCE_SHAPE" : "4",
			"SOURCE_SHAPE values: ricker=1;fumue=2;from_SIGNAL_FILE=3;SIN**3=4;Gaussian_deriv=5" : "comment",
			"SOURCE_SHAPE values: Spike=6;from_SIGNAL_FILE_in_su_format=7;integral_of_SIN**3=8" : "comment",
			"SIGNAL_FILE" : "./ormsby.dat",
			
			"SOURCE_TYPE" : "3",
			"SOURCE_TYPE values (point_source): explosive=1;force_in_x=2;force_in_y=3;rotated_force=4;double-couple=5" : "comment",
			
			"SOURCE_FILE" : "./source/sources.dat",
			"RUN_MULTIPLE_SHOTS" : "1",

"Acoustic Computation" : "comment",
			"ACOUSTIC" : "0",

"Wavetype Computation" : "comment",
			"WAVETYPE" : "1",

"Model" : "comment",
			"READMOD" : "0",
			"MFILE" : "model/model_Test",

"Free Surface" : "comment",
			"FREE_SURF" : "1",

"PML Boundary" : "comment",
			"FW" : "20",
			"VPPML" : "600.0",
			"FPML" : "31.25",
			"BOUNDARY" : "0",
			"npower" : "4.0",
			"k_max_PML" : "8.0",

"Receiver" : "comment",
			"SEISMO" : "1",
			"READREC" : "1",
			"REC_FILE" : "./receiver/receiver.dat",
			"REFRECX, REFRECY" : "0.0 , 0.0",
			"XREC1, YREC1" : "6.0 , 0.2",
			"XREC2, YREC2" : "93.0 , 0.2",
			"NGEOPH" : "80",

"Seismograms" : "comment",
			"NDT" : "1",
			"SEIS_FORMAT" : "1",
			"SEIS_FILE" : "su/IFOS",

"Q-approximation" : "comment",
			"L" : "0",
			"FL1" : "50.0", 
			"FL2" : "100.0",
			"TAU" : "0.00001",
			"F_REF" : "100.00",

"Snapshots" : "comment",
			"SNAP" : "0",
			"TSNAP1" : "2.7e-3",
			"TSNAP2" : "6.0",
			"TSNAPINC" : "0.12",
			"IDX" : "1",
			"IDY" : "1",
			"SNAP_FORMAT" : "3",
			"SNAPSHOT_START , SNAPSHOT_END , SNAPSHOT_INCR" : "2, 3 , 2",
			"SNAP_FILE" : "./snap/waveform_forward",

"Monitoring the simulation" : "comment",
			"LOG_FILE" : "log/2layer.log",
			"LOG" : "1",


"General inversion parameters" : "comment",
			"PARAMETERIZATION" : "1",
			"FORWARD_ONLY" : "10",

"Verbose mode" : "comment",
			"VERBOSE" : "0"
}
