{
    "title": "Sommersemester<br/>2024",
    "monday": [
        {"name": "ITAT", "type": "Vorlesung", "lecturer": "Barth", "lecturehall": "Fritz-Haller-Hörsaal (HS37)", "url": "https://www.irs.kit.edu/Lectures_4631.php"},
        {"name": "HM II", "type": "Vorlesung", "lecturer": "Anapolitanos", "lecturehall": "Benz", "url": "http://campus.studium.kit.edu/ev/hICe7lFrST2auNEVaiBx-g/de"},
        {"name": "ES", "type": "Vorlesung", "lecturer": "Ulusoy", "lecturehall": "Daimler", "url": "http://www.ims.kit.edu/327_617.php"},
        {},
        {},
        {}
    ],
    "tuesday": [
        {},
        {"name": "HM II", "type": "Vorlesung", "lecturer": "Anapolitanos", "lecturehall": "Benz", "url": "http://www.math.kit.edu/iana2/lehre/hm2etec2020s/"},
        {},
        {},
        {},
        {}
    ],
    "wednesday": [
        {},
        {},
        {},
        {},
        {"name": "HM II", "type": "Übung", "lecturer": "Anapolitanos", "lecturehall": "Benz", "url": "http://campus.studium.kit.edu/ev/hICe7lFrST2auNEVaiBx-g/de"},
        {}
    ],
    "thursday": [
        {},
        {},
        {"name": "ES", "type": "Vorlesung / Übung", "lecturer": "Ulusoy", "lecturehall": "Benz", "url": "http://www.ims.kit.edu/327_669.php"},
        {},
        {},
        {}
    ],
    "friday": [
        {},
        {},
        {},
        {"name": "ITAT", "type": "Übung", "lecturer": "Madsen", "lecturehall": "Fritz-Haller-Hörsaal (HS37)", "url": "https://www.irs.kit.edu/Lectures_4631.php"},
        {},
        {}
    ]
}