{
    "title": "Wintersemester<br/>2024/25",
    "monday": [
        {},
        {"name": "SuS", "type": "Vorlesung", "lecturer": "Wahls / Kluwe", "lecturehall": "Daimler", "url": "https://www.iiit.kit.edu/sus.php"},
        {},
        {},
        {"name": "WT", "type": "Übung", "lecturer": "Jäkel", "lecturehall": "MTI", "url": "http://www.cel.kit.edu/lehre_1653.php"},
        {}
    ],
    "tuesday": [
        {"name": "SuS", "type": "Übung", "lecturer": "Leven / Illerhaus", "lecturehall": "Gaede", "url": "https://www.iiit.kit.edu/sus.php"},
        {"name": "EMFW", "type": "Vorlesung", "lecturer": "Doppelbauer / Randel", "lecturehall": "Gaede", "url": "https://www.eti.kit.edu/studium_3316.php"},
        {"name": "MMT", "type": "Vorlesung", "lecturer": "Nahm", "lecturehall": "LTI", "url": "https://www.ibt.kit.edu/5842.php"},
        {"name": "MMT", "type": "Vorlesung", "lecturer": "Nahm", "lecturehall": "LTI", "url": "https://www.ibt.kit.edu/5842.php"},
        {},
        {}
    ],
    "wednesday": [
        {},
        {"name": "WT", "type": "Vorlesung", "lecturer": "Jäkel", "lecturehall": "NTI", "url": "http://www.cel.kit.edu/lehre_1652.php"},
        {"name": "EMFW", "type": "Vorlesung", "lecturer": "Doppelbauer / Randel", "lecturehall": "Gaede", "url": "https://www.eti.kit.edu/studium_3316.php"},
        {},
        {},
        {}
    ],
    "thursday": [
        {},
        {},
        {},
        {},
        {},
        {}
    ],
    "friday": [
        {"name": "SuS", "type": "Vorlesung", "lecturer": "Wahls / Kluwe", "lecturehall": "Tulla", "url": "https://www.iiit.kit.edu/sus.php"},
        {},
        {},
        {"name": "EMFW", "type": "Übung", "lecturer": "Bischoff / Krimmer", "lecturehall": "Gaede", "url": "https://www.eti.kit.edu/studium_3316.php"},
        {},
        {}
    ]
}