[
    {
        "original_directory": "/home/istmbellatrix/users/carlpuch",
        "state": "archived",
        "size": 3235325492,
        "size_queried": "Jan 04 2024 00:00:00",
        "archived": "Jan 04 2024 00:00:00",
        "tape": "AAK786L9",
        "description": "Home directory of Carlos Urbina Puch (MA Stroh)",
        "path_on_tape": "carlos_urbina_puch"
    },
    {
        "original_directory": "/home/istmhome/users/danistal",
        "state": "archived",
        "size": 4378658712,
        "size_queried": "Jan 05 2024 00:00:00",
        "archived": "Jan 05 2024 00:00:00",
        "tape": "AAK786L9",
        "description": "Home directory Daniel Stalder (Partner)",
        "path_on_tape": "daniel_stalder"
    },
    {
        "original_directory": "/home/istmbellatrix/users/hi213_old",
        "state": "archived",
        "size": 3277803841,
        "size_queried": "Jan 05 2024 00:00:00",
        "archived": "Jan 05 2024 00:00:00",
        "tape": "AAK786L9",
        "description": "Old data from Frieder Kaiser on bellatrix",
        "path_on_tape": "frieder_kaiser"
    },
    {
        "original_directory": "/home/istmbellatrix/users/stefcipe",
        "state": "archived",
        "size": 17033772364,
        "size_queried": "Jan 10 2024 00:00:00",
        "archived": "Jan 10 2024 00:00:00",
        "tape": "AAK787L9",
        "description": "Student home Stefano Cipelli",
        "path_on_tape": "stefano_cipelli_student"
    },
    {
        "original_directory": "/net/istmbellatrix/users/hi155",
        "state": "archived",
        "size": 12534603485,
        "size_queried": "Feb 2 2024 00:00:00",
        "archived": "Feb 2 2024 00:00:00",
        "tape": "AAK788L9",
        "description": "Data from Federica Gattere and Alessandro Chiarini",
        "path_on_tape": "federica_gattere_alessandro_chiarini"
    },
    {
        "original_directory": "/net/istmuranus/volume1/data/hi222/fh1_work/kay",
        "state": "archived",
        "size": 15498575501,
        "size_queried": "Feb 17 2024 00:00:00",
        "archived": "Feb 17 2024 00:00:00",
        "tape": "AAK789L9",
        "description": "Directory from Pourya Fooroghi",
        "path_on_tape": "uranus1_pourya_fooroghi_fh1_kay"
    },
    {
        "original_directory": "/net/istmuranus/volume2/data2/hi215",
        "state": "archived",
        "size": 12177487088,
        "size_queried": "Feb 19 2024 00:00:00",
        "archived": "Feb 19 2024 00:00:00",
        "description": "Frieder Kaiser on uranus2",
        "tape": "AAK780L9",
        "path_on_tape": "uranus2_frieder_kaiser"
    },
    {
        "original_directory": "/net/istmuranus/volume1/data/hi215",
        "state": "archived",
        "size": 3681628638,
        "size_queried": "Feb 22 2024 00:00:00",
        "archived": "Feb 22 2024 00:00:00",
        "description": "Frieder Kaiser on uranus1",
        "tape": "AAK780L9",
        "path_on_tape": "uranus1_frieder_kaiser"
    },
    {
        "original_directory": "/net/istmbellatrix/users/hi159",
        "state": "archived",
        "size": 178768842,
        "size_queried": "Feb 28 2024 00:00:00",
        "archived": "Feb 28 2024 00:00:00",
        "description": "Home directory Christopher Diaz",
        "tape": "AAK780L9",
        "path_on_tape": "sthome_christopher_diaz"
    },
    {
        "original_directory": "/net/istmuranus/volume1/data/hi209",
        "state": "archived",
        "size": 166367473,
        "size_queried": "Feb 28 2024 00:00:00",
        "archived": "Feb 28 2024 00:00:00",
        "description": "Anna Daub on uranus1",
        "tape": "AAK780L9",
        "path_on_tape": "uranus1_anna_daub"
    },
    {
        "original_directory": "/net/istmintercrus/volume1/data/hi209",
        "state": "archived",
        "size": 788943,
        "size_queried": "Feb 28 2024 00:00:00",
        "archived": "Feb 28 2024 00:00:00",
        "description": "Anna Daub on intercrus",
        "tape": "AAK780L9",
        "path_on_tape": "intercrus_anna_daub"
    },
    {
        "original_directory": "/net/istmhome/users/mohavaez",
        "state": "archived",
        "size": 47581567,
        "size_queried": "Feb 28 2024 00:00:00",
        "archived": "Feb 28 2024 00:00:00",
        "description": "Home directory Mohammad Vaezi (Student Stroh 2022)",
        "tape": "AAK780L9",
        "path_on_tape": "home_mohammad_vaezi"
    },
    {
        "original_directory": "/net/istmbellatrix/users/hi169",
        "state": "archived",
        "size": 15833255,
        "size_queried": "Feb 29 2024 00:00:00",
        "archived": "Feb 29 2024 00:00:00",
        "description": "Home directory Raphael Hertweck (Student Stroh)",
        "tape": "AAK780L9",
        "path_on_tape": "sthome_raphael_hertweck_"
    },
    {
        "original_directory": "/net/istmbellatrix/users/hi152",
        "state": "archived",
        "size": 4825455,
        "size_queried": "Feb 29 2024 00:00:00",
        "archived": "Feb 29 2024 00:00:00",
        "description": "Home directory Nicolas Kawerau (Student Stroh)",
        "tape": "AAK780L9",
        "path_on_tape": "sthome_nicolas_kawerau"
    },
    {
        "original_directory": "/net/istmhome/users/hi226",
        "state": "archived",
        "size": 413117,
        "size_queried": "Feb 29 2024 00:00:00",
        "archived": "Feb 29 2024 00:00:00",
        "description": "Home directory Jacopo Serpieri",
        "tape": "AAK780L9",
        "path_on_tape": "home_jacopo_serpieri"
    },
    {
        "original_directory": "/net/istmbellatrix/users/hi140",
        "state": "archived",
        "size": 79,
        "size_queried": "Feb 29 2024 00:00:00",
        "archived": "Feb 29 2024 00:00:00",
        "description": "Home directory Simone Paliani (Master Gatti / Serpieri)",
        "tape": "AAK780L9",
        "path_on_tape": "sthome_simone_paliani"
    },
    {
        "original_directory": "/net/istmintercrus/volume1/data/hi202",
        "state": "archived",
        "size": 10356206488,
        "size_queried": "Feb 29 2024 00:00:00",
        "archived": "Feb 29 2024 00:00:00",
        "description": "Steffen Straub on intercrus",
        "tape": "AAK781L9",
        "path_on_tape": "intercrus_steffen_straub"
    },
    {
        "original_directory": "/net/istmuranus/volume2/data2/hi202",
        "state": "archived",
        "size": 1577127118,
        "size_queried": "Mar 01 2024 00:00:00",
        "archived": "Mar 01 2024 00:00:00",
        "description": "Steffen Straub on uranus2",
        "tape": "AAK781L9",
        "path_on_tape": "uranus2_steffen_straub"
    },
    {
        "original_directory": "/net/istmintercrus/volume1/data/hi217",
        "state": "archived",
        "size": 1735239600,
        "size_queried": "Mar 02 2024 00:00:00",
        "archived": "Mar 02 2024 00:00:00",
        "description": "Andrea Codrignani on intercrus",
        "tape": "AAK781L9",
        "path_on_tape": "intercrus_andrea_codrignani"
    },
    {
        "original_directory": "/net/istmuranus/volume2/data2/hi217",
        "state": "archived",
        "size": 975281642,
        "size_queried": "Mar 02 2024 00:00:00",
        "archived": "Mar 02 2024 00:00:00",
        "description": "Andrea Codrignani on uranus2",
        "tape": "AAK781L9",
        "path_on_tape": "uranus2_andrea_codrignani"
    },
    {
        "original_directory": "/net/istmbellatrix/users/hi141",
        "state": "archived",
        "size": 628617095,
        "size_queried": "Mar 02 2024 00:00:00",
        "archived": "Mar 02 2024 00:00:00",
        "description": "Mohit Karnvir Singh (BA Andreolli)",
        "tape": "AAK781L9",
        "path_on_tape": "sthome_mohit_karnvir_singh"
    },
    {
        "original_directory": "/net/istmbellatrix/users/hi151",
        "state": "archived",
        "size": 559239789,
        "size_queried": "Mar 04 2024 00:00:00",
        "archived": "Mar 04 2024 00:00:00",
        "description": "Mohit Karnvir Singh (BA Andreolli)",
        "tape": "AAK781L9",
        "path_on_tape": "sthome_mohit_karnvir_singh2"
    },
    {
        "original_directory": "/net/istmbellatrix/users/hi163",
        "state": "archived",
        "size": 104145399,
        "size_queried": "Mar 04 2024 00:00:00",
        "archived": "Mar 04 2024 00:00:00",
        "description": "Paul Friedrich Reinig (BA Samkhaniani/Stroh)",
        "tape": "AAK781L9",
        "path_on_tape": "sthome_paul_friedrich_reinig"
    },
    {
        "original_directory": "/net/istmbellatrix/users/hi175",
        "state": "archived",
        "size": 43377111,
        "size_queried": "Mar 04 2024 00:00:00",
        "archived": "Mar 04 2024 00:00:00",
        "description": "Toktam Nouri (MA Stroh)",
        "tape": "AAK781L9",
        "path_on_tape": "sthome_toktam_nouri"
    },
    {
        "original_directory": "/net/istmhome/users/vishvenu",
        "state": "archived",
        "size": 18928667,
        "size_queried": "Mar 04 2024 00:00:00",
        "archived": "Mar 04 2024 00:00:00",
        "description": "Home directory Vishnu Venugopal Thuruthiyil",
        "tape": "AAK781L9",
        "path_on_tape": "home_vishnu_venugopal_thuruthiyil"
    },
    {
        "original_directory": "/net/istmbellatrix/users/hi150",
        "state": "archived",
        "size": 19351977,
        "size_queried": "Mar 04 2024 00:00:00",
        "archived": "Mar 04 2024 00:00:00",
        "description": "Student home directory Gabriel Th\u00e4ter",
        "tape": "AAK781L9",
        "path_on_tape": "sthome_gabriel_th\u00e4ter"
    },
    {
        "original_directory": "/net/istmbellatrix/users/hi183",
        "state": "archived",
        "size": 8363420,
        "size_queried": "Mar 04 2024 00:00:00",
        "archived": "Mar 04 2024 00:00:00",
        "description": "Vera Vollmer (BA Leister)",
        "tape": "AAK781L9",
        "path_on_tape": "sthome_vera_vollmer_"
    },
    {
        "original_directory": "/net/istmbellatrix/users/stefmuta",
        "state": "archived",
        "size": 524432,
        "size_queried": "Mar 04 2024 00:00:00",
        "archived": "Mar 04 2024 00:00:00",
        "description": "Stefan Mutaf (MA Stroh)",
        "tape": "AAK781L9",
        "path_on_tape": "sthome_stefan_mutaf"
    },
    {
        "original_directory": "/net/istmbellatrix/users/hi162",
        "state": "archived",
        "size": 1117341,
        "size_queried": "Mar 04 2024 00:00:00",
        "archived": "Mar 04 2024 00:00:00",
        "description": "Giorgio Cavallazzi (MA Gatti)",
        "tape": "AAK781L9",
        "path_on_tape": "sthome_giorgio_cavallazzi"
    },
    {
        "original_directory": "/net/istmbellatrix/users/hi172",
        "state": "archived",
        "size": 1570373,
        "size_queried": "Mar 04 2024 00:00:00",
        "archived": "Mar 04 2024 00:00:00",
        "description": "Michael Willmann (MA)",
        "tape": "AAK781L9",
        "path_on_tape": "sthome_michael_willmann"
    },
    {
        "original_directory": "/net/istmbellatrix/users/joelgies",
        "state": "archived",
        "size": 277756,
        "size_queried": "Mar 04 2024 00:00:00",
        "archived": "Mar 04 2024 00:00:00",
        "description": "Joel Giesser (MA)",
        "tape": "AAK781L9",
        "path_on_tape": "sthome_joel_giesser"
    },
    {
        "original_directory": "/net/istmuranus/volume1/data/hi222",
        "state": "archived",
        "size": 6057551197,
        "size_queried": "Mar 26 2024 00:00:00",
        "archived": "Mar 26 2024 00:00:00",
        "description": "Pourya Fooroghi (uranus1)",
        "tape": "AAK782L9",
        "path_on_tape": "uranus1_pourya_fooroghi"
    },
    {
        "original_directory": "/net/istmuranus/volume2/data2/hi222",
        "state": "archived",
        "size": 1948122004,
        "size_queried": "Mar 26 2024 00:00:00",
        "archived": "Mar 26 2024 00:00:00",
        "description": "Pourya Fooroghi (uranus2)",
        "tape": "AAK782L9",
        "path_on_tape": "uranus2_pourya_fooroghi"
    },
    {
        "original_directory": "/net/istmintercrus/volume1/data/hi222",
        "state": "archived",
        "size": 1231421825,
        "size_queried": "Mar 26 2024 00:00:00",
        "archived": "Mar 26 2024 00:00:00",
        "description": "Pourya Fooroghi (intercrus)",
        "tape": "AAK782L9",
        "path_on_tape": "intercrus_pourya_fooroghi"
    },
    {
        "original_directory": "/net/istmhome/users/hi222_Pourya_Forooghi",
        "state": "archived",
        "size": 1155883424,
        "size_queried": "Mar 26 2024 00:00:00",
        "archived": "Mar 26 2024 00:00:00",
        "description": "Pourya Fooroghi (Home)",
        "tape": "AAK782L9",
        "path_on_tape": "home_pourya_fooroghi"
    },
    {
        "original_directory": "/net/istmhome/users/hannbern",
        "state": "archived",
        "size": 4378658551,
        "size_queried": "Mar 27 2024 00:00:00",
        "archived": "Mar 27 2024 00:00:00",
        "description": "Hanna Berning (Partner Gatti, ETHZ)",
        "tape": "AAK782L9",
        "path_on_tape": "home_hanna_berning"
    },
    {
        "original_directory": "/net/istmuranus/volume1/data/hi214",
        "state": "archived",
        "size": 7060487638,
        "size_queried": "Apr 04 2024 00:00:00",
        "archived": "Apr 04 2024 00:00:00",
        "description": "Data belonging to Giacomo Cocconi",
        "tape": "AAK783L9",
        "path_on_tape": "uranus1_giacomo_cocconi"
    },
    {
        "original_directory": "/net/istmintercrus/volume1/data/hi214",
        "state": "archived",
        "size": 2719896143,
        "size_queried": "Apr 05 2024 00:00:00",
        "archived": "Apr 05 2024 00:00:00",
        "description": "Giacomo Cocconi (intercrus)",
        "tape": "AAK783L9",
        "path_on_tape": "intercrus_giacomo_cocconi"
    },
    {
        "original_directory": "/net/istmbellatrix/users/vanedurs",
        "state": "archived",
        "size": 5698516864,
        "size_queried": "Apr 10 2024 00:00:00",
        "archived": "Apr 10 2024 00:00:00",
        "description": "Home directory Vanessa Durst (BA Stroh 2023)",
        "tape": "AAK783L9",
        "path_on_tape": "sthome_vanessa_durst"
    },
    {
        "original_directory": "/net/istmbellatrix/users/lukagoer",
        "state": "archived",
        "size": 3001186468,
        "size_queried": "Mar 05 2024 00:00:00",
        "description": "Home directory Lukas Johannes G\u00f6rg (BA Stroh 2022)",
        "tape": "AAK785L9",
        "path_on_tape": "sthome_lukas_johannes_goerg",
        "archived": "Jul 30 2024 16:50:03"
    },
    {
        "original_directory": "/net/istmbellatrix/users/hi160",
        "state": "archived",
        "size": 2651165920,
        "size_queried": "Mar 05 2024 00:00:00",
        "description": "Home Directory Andrea Rossi (MA)",
        "tape": "AAK785L9",
        "path_on_tape_old": "sthome_andrea_rossi",
        "path_on_tape": "sthome_andrea_rossi",
        "archived": "Jul 31 2024 17:57:55"
    },
    {
        "original_directory": "/net/istmintercrus/volume1/data/hi207",
        "state": "archived",
        "size": 1276233909,
        "size_queried": "Mar 05 2024 00:00:00",
        "description": "Marc Hehner (Intercrus)",
        "tape": "AAK785L9",
        "path_on_tape_old": "home_marc_hehner",
        "path_on_tape": "home_marc_hehner",
        "archived": "Aug 06 2024 23:28:17"
    },
    {
        "original_directory": "/net/istmhome/users/hi207",
        "state": "archived",
        "size": 1066361312,
        "size_queried": "Mar 05 2024 00:00:00",
        "description": "Marc Hehner (home directory)",
        "tape": "AAK785L9",
        "path_on_tape_old": "intercrus_marc_hehner",
        "path_on_tape": "homedir_marc_hehner",
        "archived": "Aug 01 2024 11:37:56"
    },
    {
        "original_directory": "/net/istmbellatrix/users/hi158",
        "state": "archived",
        "size": 2288693936,
        "size_queried": "Mar 05 2024 00:00:00",
        "description": "Rafael Schoof (MA)",
        "tape": "AAK785L9",
        "path_on_tape_old": "sthome_rafael_schoof",
        "path_on_tape": "sthome_rafael_schoof",
        "archived": "Aug 01 2024 17:39:55"
    },
    {
        "original_directory": "/net/istmbellatrix/users/Daniel_Klauber",
        "state": "archived",
        "size": 809020017,
        "size_queried": "Mar 05 2024 00:00:00",
        "description": "Daniel Klauber (bellatrix)",
        "path_on_tape": "istmbellatrix_users_Daniel_Klauber",
        "tape": "AAK793L9",
        "archived": "Nov 04 2024 16:26:35"
    },
    {
        "original_directory": "/net/istmuranus1/hi208/fh1_work",
        "state": "to_restore",
        "restore_to": "/net/istmuranus/volume1/data/alexstro/fh1_work",
        "size": 9096228864,
        "size_queried": "Apr 28 2024 00:00:00",
        "description": "Folder fh1_work Alex (uranus1)",
        "tape": "AAK795L9",
        "path_on_tape": "alex_uranus1_fh1_work"
    },
    {
        "original_directory": "/lsdf/tcfsm/Xcompact3d/MCGauss",
        "state": "archived",
        "description": "Daten Kay Sch\u00e4fer LSDF",
        "size": 8309694876,
        "size_queried": "Oct 08 2024 17:07:25",
        "path_on_tape": "tcfsm_Xcompact3d_MCGauss",
        "tape": "AAK790L9",
        "archived": "Oct 10 2024 17:17:13"
    },
    {
        "original_directory": "/lsdf/tcfsm/Xcompact3d/Gauss",
        "state": "archived",
        "description": "Daten Kay Sch\u00e4fer LSDF",
        "size": 2071854605,
        "size_queried": "Oct 08 2024 17:07:35",
        "path_on_tape": "tcfsm_Xcompact3d_Gauss",
        "tape": "AAK790L9",
        "archived": "Oct 09 2024 16:43:25"
    },
    {
        "original_directory": "/lsdf/tcfsm/Xcompact3d/MixCon",
        "state": "archived",
        "description": "Daten Kay Sch\u00e4fer LSDF",
        "size": 2035050402,
        "size_queried": "Oct 08 2024 17:08:01",
        "path_on_tape": "tcfsm_Xcompact3d_MixCon",
        "tape": "AAK793L9",
        "archived": "Oct 28 2024 22:44:18"
    },
    {
        "original_directory": "/lsdf/tcfsm/Xcompact3d/OTCF",
        "state": "archived",
        "description": "Daten Kay Sch\u00e4fer LSDF",
        "size": 5808363693,
        "size_queried": "Oct 08 2024 17:09:54",
        "path_on_tape": "tcfsm_Xcompact3d_OTCF",
        "tape": "AAK790L9",
        "archived": "Oct 13 2024 15:41:11"
    },
    {
        "original_directory": "/lsdf/tcfsm/Xcompact3d/RayBen",
        "state": "archived",
        "description": "Daten Kay Sch\u00e4fer LSDF",
        "size": 1133003662,
        "size_queried": "Oct 08 2024 17:09:57",
        "path_on_tape": "tcfsm_Xcompact3d_RayBen",
        "tape": "AAK793L9",
        "archived": "Oct 28 2024 14:10:22"
    },
    {
        "original_directory": "/lsdf/tcfsm/Xcompact3d/RBGauss",
        "state": "archived",
        "description": "Daten Kay Sch\u00e4fer LSDF",
        "size": 396039593,
        "size_queried": "Oct 08 2024 17:10:03",
        "path_on_tape": "tcfsm_Xcompact3d_RBGauss",
        "tape": "AAK790L9",
        "archived": "Oct 15 2024 12:34:46"
    },
    {
        "original_directory": "/lsdf/tcfsm/Xcompact3d/TCF",
        "state": "archived",
        "description": "Daten Kay Sch\u00e4fer LSDF",
        "size": 287147081,
        "size_queried": "Oct 08 2024 17:10:06",
        "path_on_tape": "tcfsm_Xcompact3d_TCF",
        "tape": "AAK790L9",
        "archived": "Oct 15 2024 16:54:13"
    },
    {
        "original_directory": "/lsdf/tcfsm/Xcompact3d/OGauss/OGauss_cpg540_pr1.006.2021",
        "state": "archived",
        "description": "Daten Kay Sch\u00e4fer LSDF",
        "size": 6898580348,
        "size_queried": "Oct 08 2024 17:11:24",
        "path_on_tape": "Xcompact3d_OGauss_OGauss_cpg540_pr1.006.2021",
        "tape": "AAK792L9",
        "archived": "Oct 22 2024 06:31:56"
    },
    {
        "original_directory": "/lsdf/tcfsm/Xcompact3d/OGauss/OGauss_cpg540_pr1.008.2021",
        "state": "archived",
        "description": "Daten Kay Sch\u00e4fer LSDF",
        "size": 3926598114,
        "size_queried": "Oct 08 2024 17:11:44",
        "path_on_tape": "Xcompact3d_OGauss_OGauss_cpg540_pr1.008.2021",
        "tape": "AAK791L9",
        "archived": "Oct 19 2024 06:46:33"
    },
    {
        "original_directory": "/lsdf/tcfsm/Xcompact3d/OGauss/OGauss_cpg540_pr1.009.2021",
        "state": "archived",
        "description": "Daten Kay Sch\u00e4fer LSDF",
        "size": 4115065724,
        "size_queried": "Oct 08 2024 17:12:16",
        "path_on_tape": "Xcompact3d_OGauss_OGauss_cpg540_pr1.009.2021",
        "tape": "AAK793L9",
        "archived": "Oct 25 2024 17:44:33"
    },
    {
        "original_directory": "/lsdf/tcfsm/Xcompact3d/OGauss/OGauss_cpg540_pr1.021.2022",
        "state": "archived",
        "description": "Daten Kay Sch\u00e4fer LSDF",
        "size": 6178276229,
        "size_queried": "Oct 08 2024 17:12:18",
        "path_on_tape": "Xcompact3d_OGauss_OGauss_cpg540_pr1.021.2022",
        "tape": "AAK792L9",
        "archived": "Oct 23 2024 01:25:53"
    },
    {
        "original_directory": "/lsdf/tcfsm/Xcompact3d/OGauss/OGauss_cpg540_pr1.022.2022",
        "state": "archived",
        "description": "Daten Kay Sch\u00e4fer LSDF",
        "size": 7045500282,
        "size_queried": "Oct 08 2024 17:12:20",
        "path_on_tape": "Xcompact3d_OGauss_OGauss_cpg540_pr1.022.2022",
        "tape": "AAK793L9",
        "archived": "Oct 25 2024 03:46:38"
    },
    {
        "original_directory": "/lsdf/tcfsm/Xcompact3d/OGauss/OGauss_cpg540_pr1.007.2021",
        "state": "archived",
        "description": "Daten Kay Sch\u00e4fer LSDF",
        "size": 5466304386,
        "size_queried": "Oct 08 2024 17:13:32",
        "path_on_tape": "Xcompact3d_OGauss_OGauss_cpg540_pr1.007.2021",
        "tape": "AAK791L9",
        "archived": "Oct 17 2024 23:13:58"
    },
    {
        "original_directory": "/lsdf/tcfsm/Xcompact3d/OGauss/OGauss_cpg540_pr1.013.2021",
        "state": "archived",
        "description": "Daten Kay Sch\u00e4fer LSDF",
        "size": 7687282969,
        "size_queried": "Oct 08 2024 17:13:53",
        "path_on_tape": "Xcompact3d_OGauss_OGauss_cpg540_pr1.013.2021",
        "tape": "AAK791L9",
        "archived": "Oct 17 2024 07:51:39"
    },
    {
        "original_directory": "/lsdf/tcfsm/Xcompact3d/OGauss/other",
        "state": "archived",
        "description": "Daten Kay Sch\u00e4fer LSDF, smaller cases from OGauss",
        "size": 3952010717,
        "size_queried": "Oct 08 2024 17:14:06",
        "path_on_tape": "Xcompact3d_OGauss_other",
        "tape": "AAK792L9",
        "archived": "Oct 23 2024 22:42:42"
    },
    {
        "original_directory": "/net/istmbellatrix/users/hi182",
        "state": "archived",
        "description": "Thai An Bui (BA Frede 2021)",
        "size": 67676542,
        "size_queried": "Oct 09 2024 16:43:59",
        "path_on_tape": "istmbellatrix_users_hi182",
        "tape": "AAK782L9",
        "archived": "Nov 24 2024 20:30:06"
    },
    {
        "original_directory": "/net/istmbellatrix/users/hi170",
        "state": "archived",
        "description": "Rico Haase (MA Sch\u00e4fer)",
        "size": 1022582334,
        "size_queried": "Oct 09 2024 16:44:22",
        "path_on_tape": "istmbellatrix_users_hi170",
        "tape": "AAK793L9",
        "archived": "Nov 25 2024 11:57:37"
    },
    {
        "original_directory": "/net/istmbellatrix/users/hi102",
        "state": "archived",
        "description": "Home Daniel Wurche (MA Neuhauser 2023)",
        "size": 355234961,
        "size_queried": "Oct 09 2024 16:50:40",
        "path_on_tape": "istmbellatrix_users_hi102",
        "tape": "AAK781L9",
        "archived": "Nov 25 2024 16:37:30"
    },
    {
        "original_directory": "/net/istmbellatrix/users/hi166",
        "state": "archived",
        "description": "Student Home Wiebke Schrader (MA M\u00fcller)",
        "size": 91637776,
        "size_queried": "Oct 09 2024 16:52:06",
        "path_on_tape": "istmbellatrix_users_hi166",
        "tape": "AAK782L9",
        "archived": "Nov 24 2024 22:19:51"
    },
    {
        "original_directory": "/net/istmbellatrix/users/hi181",
        "state": "archived",
        "description": "Matthew Sleight (MA Frede 2022)",
        "size": 25493567,
        "size_queried": "Oct 09 2024 16:52:27",
        "path_on_tape": "istmbellatrix_users_hi181",
        "tape": "AAK782L9",
        "archived": "Nov 24 2024 19:15:45"
    },
    {
        "original_directory": "/net/istmbellatrix/users/hi219/Taschner",
        "state": "archived",
        "description": "Emanuel Taschner (Thesis Sch\u00e4fer)",
        "size": 40926068,
        "size_queried": "Oct 09 2024 16:52:27",
        "path_on_tape": "users_hi219_Taschner",
        "tape": "AAK790L9",
        "archived": "Nov 24 2024 21:00:06"
    },
    {
        "original_directory": "/net/istmbellatrix/users/fabiwehr",
        "state": "archived",
        "description": "Home Fabian Wehrle (Hiwi Neuhauser/Gatti 2023)",
        "size": 8293858,
        "size_queried": "Oct 09 2024 16:52:33",
        "path_on_tape": "istmbellatrix_users_fabiwehr",
        "tape": "AAK782L9",
        "archived": "Nov 24 2024 18:42:33"
    },
    {
        "original_directory": "/net/istmbellatrix/users/hi179",
        "state": "archived",
        "description": "Home Christoph Grabietz (BA Secchi 2022)",
        "size": 644571,
        "size_queried": "Oct 09 2024 16:52:35",
        "path_on_tape": "istmbellatrix_users_hi179",
        "tape": "AAK781L9",
        "archived": "Nov 25 2024 17:00:20"
    },
    {
        "original_directory": "/net/istmbellatrix/users/katrklin",
        "state": "archived",
        "description": "Home Katrin Klingel (Hiwi Secchi 2023)",
        "size": 45497285,
        "size_queried": "Oct 09 2024 16:52:40",
        "path_on_tape": "istmbellatrix_users_katrklin",
        "tape": "AAK782L9",
        "archived": "Nov 23 2024 20:16:07"
    },
    {
        "original_directory": "/net/istmbellatrix/users/hi128",
        "state": "archived",
        "description": "Home Katharina Schuster (BA M\u00fcller)",
        "size": 226360826,
        "size_queried": "Oct 09 2024 16:54:44",
        "path_on_tape": "istmbellatrix_users_hi128",
        "tape": "AAK782L9",
        "archived": "Nov 23 2024 00:13:54"
    },
    {
        "original_directory": "/net/istmbellatrix/users/hi168",
        "state": "archived",
        "description": "Home Jannik Weber (BA M\u00fcller)",
        "size": 8277193,
        "size_queried": "Oct 09 2024 16:54:57",
        "path_on_tape": "istmbellatrix_users_hi168",
        "tape": "AAK782L9",
        "archived": "Nov 22 2024 14:11:16"
    },
    {
        "original_directory": "/net/istmhome/users/hi219",
        "state": "prepared",
        "description": "Home Directory Kay Sch\u00e4fer (note that he worked on his laptop the last two years)",
        "size": 296903392,
        "size_queried": "Oct 09 2024 16:55:23",
        "path_on_tape": "istmhome_users_hi219",
        "tape": "AAK782L9"
    },
    {
        "original_directory": "/net/istmhome/users/hi212",
        "state": "archived",
        "description": "Home Directory Nima Samkhaniani",
        "size": 1951908075,
        "size_queried": "Oct 12 2024 23:59:09",
        "path_on_tape": "istmhome_users_hi212",
        "tape": "AAK785L9",
        "archived": "Jan 31 2025 08:43:42"
    },
    {
        "original_directory": "/net/istmhome/users/hi206",
        "state": "archived",
        "description": "Home Directory Lars von Deyn",
        "size": 1194778496,
        "size_queried": "Oct 12 2024 23:59:41",
        "path_on_tape": "istmhome_users_hi206",
        "tape": "AAK782L9",
        "archived": "Nov 22 2024 11:01:14"
    },
    {
        "original_directory": "/lsdf/transient_secmot/coriolis",
        "state": "archived",
        "description": "Data Andrea Andreolli LSDF",
        "size": 16390541124,
        "size_queried": "Jan 07 2025 08:59:11",
        "path_on_tape": "lsdf_transient_secmot_coriolis",
        "tape": "AAK796L9",
        "archived": "Jan 09 2025 02:08:02"
    },
    {
        "original_directory": "/lsdf/transient_secmot/sliproj",
        "state": "archived",
        "description": "Data Andrea Andreolli LSDF",
        "size": 8590689785,
        "size_queried": "Jan 07 2025 09:05:24",
        "path_on_tape": "lsdf_transient_secmot_sliproj",
        "tape": "AAK797L9",
        "archived": "Jan 10 2025 14:57:49"
    },
    {
        "original_directory": "/lsdf/couette_dns/high_re_slip/deca_r500_s1",
        "state": "archived",
        "description": "Data Andrea Andreolli LSDF",
        "size": 8215954185,
        "size_queried": "Jan 07 2025 09:05:50",
        "path_on_tape": "couette_dns_high_re_slip_deca_r500_s1",
        "tape": "AAK876L9",
        "archived": "Jan 14 2025 01:27:17"
    },
    {
        "original_directory": "/lsdf/transient_secmot/couette_retau_500",
        "state": "archived",
        "description": "Data Andrea Andreolli LSDF",
        "size": 7448215103,
        "size_queried": "Jan 07 2025 09:05:51",
        "path_on_tape": "lsdf_transient_secmot_couette_retau_500",
        "tape": "AAK798L9",
        "archived": "Jan 11 2025 08:46:12"
    },
    {
        "original_directory": "/lsdf/transient_secmot/am",
        "state": "archived",
        "description": "Data Andrea Andreolli LSDF",
        "size": 7064897570,
        "size_queried": "Jan 07 2025 09:05:54",
        "path_on_tape": "lsdf_transient_secmot_am",
        "tape": "AAK797L9",
        "archived": "Jan 12 2025 03:45:12"
    },
    {
        "original_directory": "/lsdf/transient_secmot/slip_cfr",
        "state": "archived",
        "description": "Data Andrea Andreolli LSDF",
        "size": 2021286230,
        "size_queried": "Jan 07 2025 09:07:22",
        "path_on_tape": "lsdf_transient_secmot_slip_cfr",
        "tape": "AAK799L9",
        "archived": "Jan 19 2025 09:41:10"
    },
    {
        "original_directory": "/lsdf/transient_secmot/slip_large_lowre",
        "state": "archived",
        "description": "Data Andrea Andreolli LSDF",
        "size": 264996626,
        "size_queried": "Jan 07 2025 09:07:23",
        "path_on_tape": "lsdf_transient_secmot_slip_large_lowre",
        "tape": "AAK796L9",
        "archived": "Jan 11 2025 09:39:57"
    },
    {
        "original_directory": "/lsdf/couette_dns/high_re_slip/deca_r500_s3",
        "state": "archived",
        "description": "Data Andrea Andreolli LSDF",
        "size": 14238665202,
        "size_queried": "Jan 07 2025 09:08:10",
        "path_on_tape": "couette_dns_high_re_slip_deca_r500_s3",
        "tape": "AAK799L9",
        "archived": "Jan 19 2025 01:02:49"
    },
    {
        "original_directory": "/lsdf/couette_dns/high_re_slip/r500_s3",
        "state": "archived",
        "description": "Data Andrea Andreolli LSDF",
        "size": 1092640092,
        "size_queried": "Jan 07 2025 09:08:10",
        "path_on_tape": "couette_dns_high_re_slip_r500_s3",
        "tape": "AAK877L9",
        "archived": "Jan 14 2025 20:52:39"
    },
    {
        "original_directory": "/lsdf/couette_dns/high_re_slip/r500_s025",
        "state": "archived",
        "description": "Data Andrea Andreolli LSDF",
        "size": 791947224,
        "size_queried": "Jan 07 2025 09:08:10",
        "path_on_tape": "couette_dns_high_re_slip_r500_s025",
        "tape": "AAK799L9",
        "archived": "Jan 19 2025 11:39:50"
    },
    {
        "original_directory": "/lsdf/couette_dns/high_re_slip/deca_r500_s05",
        "state": "archived",
        "description": "Data Andrea Andreolli LSDF",
        "size": 5895602059,
        "size_queried": "Jan 07 2025 09:08:31",
        "path_on_tape": "couette_dns_high_re_slip_deca_r500_s05",
        "tape": "AAK798L9",
        "archived": "Jan 15 2025 12:02:46"
    },
    {
        "original_directory": "/lsdf/couette_dns/high_re_slip/deca_r500_s2",
        "state": "archived",
        "description": "Data Andrea Andreolli LSDF",
        "size": 5471080682,
        "size_queried": "Jan 07 2025 09:09:16",
        "path_on_tape": "couette_dns_high_re_slip_deca_r500_s2",
        "tape": "AAK876L9",
        "archived": "Jan 12 2025 19:20:37"
    },
    {
        "original_directory": "/lsdf/couette_dns/high_re_slip/r500_s05",
        "state": "archived",
        "description": "Data Andrea Andreolli LSDF",
        "size": 1092435942,
        "size_queried": "Jan 07 2025 09:09:16",
        "path_on_tape": "couette_dns_high_re_slip_r500_s05",
        "tape": "AAK877L9",
        "archived": "Jan 14 2025 04:08:25"
    },
    {
        "original_directory": "/lsdf/couette_dns/high_re_slip/r500_s2",
        "state": "archived",
        "description": "Data Andrea Andreolli LSDF",
        "size": 1243709228,
        "size_queried": "Jan 07 2025 09:09:16",
        "path_on_tape": "couette_dns_high_re_slip_r500_s2",
        "tape": "AAK877L9",
        "archived": "Jan 15 2025 15:17:44"
    },
    {
        "original_directory": "/lsdf/couette_dns/high_re_slip/r500_reflarge",
        "state": "archived",
        "description": "Data Andrea Andreolli LSDF",
        "size": 901116874,
        "size_queried": "Jan 07 2025 09:09:17",
        "path_on_tape": "couette_dns_high_re_slip_r500_reflarge",
        "tape": "AAK877L9",
        "archived": "Jan 14 2025 18:12:53"
    },
    {
        "original_directory": "/lsdf/couette_dns/high_re_slip/r500_ref",
        "state": "archived",
        "description": "Data Andrea Andreolli LSDF",
        "size": 410906313,
        "size_queried": "Jan 07 2025 09:09:17",
        "path_on_tape": "couette_dns_high_re_slip_r500_ref",
        "tape": "AAK796L9",
        "archived": "Jan 14 2025 13:27:38"
    },
    {
        "original_directory": "/lsdf/couette_dns/high_re_slip/r500_s1",
        "state": "archived",
        "description": "Data Andrea Andreolli LSDF",
        "size": 911429470,
        "size_queried": "Jan 07 2025 09:09:17",
        "path_on_tape": "couette_dns_high_re_slip_r500_s1",
        "tape": "AAK797L9",
        "archived": "Jan 15 2025 17:45:34"
    },
    {
        "original_directory": "/lsdf/couette_dns/high_re_slip/xcompact3d_hawk",
        "state": "archived",
        "description": "Data Andrea Andreolli LSDF",
        "size": 191787,
        "size_queried": "Jan 07 2025 09:09:18",
        "path_on_tape": "couette_dns_high_re_slip_xcompact3d_hawk",
        "tape": "AAK796L9",
        "archived": "Jan 14 2025 13:36:32"
    },
    {
        "original_directory": "/lsdf/couette_dns/high_re_slip/deca_r500_s025",
        "state": "archived",
        "description": "Data Andrea Andreolli LSDF",
        "size": 3049943797,
        "size_queried": "Jan 07 2025 09:09:30",
        "path_on_tape": "couette_dns_high_re_slip_deca_r500_s025",
        "tape": "AAK876L9",
        "archived": "Jan 14 2025 12:16:00"
    },
    {
        "original_directory": "/net/istm-capricorn/localhome/localdata_hi209/form_r180_s1",
        "state": "archived",
        "description": "Data Andrea Andreolli LSDF",
        "size": 777240028,
        "size_queried": "Jan 07 2025 09:48:09",
        "path_on_tape": "localhome_localdata_hi209_form_r180_s1",
        "tape": "AAK877L9",
        "archived": "Jan 14 2025 15:57:44"
    },
    {
        "original_directory": "/lsdf/transient_secmot/miscellaneous",
        "state": "archived",
        "description": "Data Andrea Andreolli LSDF",
        "size": 3675027395,
        "size_queried": "Jan 07 2025 09:09:40",
        "path_on_tape": "lsdf_transient_secmot_miscellaneous",
        "tape": "AAK798L9",
        "archived": "Jan 13 2025 04:01:37"
    },
    {
        "original_directory": "/net/istmhome/users/hi211",
        "state": "prepared",
        "description": "Home directory Franco Magagnato",
        "size": 3270640372,
        "size_queried": "Jan 31 2025 08:52:45"
    }
]