{
  "fws": [
    {
      "fw_id": 1,
      "name": "Post the job",
      "spec": {
        "_tasks": [
          {
            "_fw_name": "PyTask",
            "func": "auxiliary.print_func",
            "inputs": ["job description"],
            "outputs": [""]
          }
        ],
        "job description": {}
      }
    },
    {
      "fw_id": 2,
      "name": "Candidates apply",
      "spec": {
        "_tasks": [
          {
            "_fw_name": "PyTask",
            "func": "",
            "inputs": [
                "",
                ""
            ],
            "outputs": [""]
          }
        ],
        "application template": {},
        "maximum applications": 50
      }
    },
    {
      "fw_id": 3,
      "name": "Screen candidates",
      "spec": {
        "_tasks": [
          {
            "_fw_name": "PyTask",
            "func": "",
            "inputs": [
                "",
                "",
                "",
                ""
            ],
            "outputs": [""]
          }
        ],
        "number to invite": 4,
        "minimum score": 2
      }
    },
    {
      "fw_id": 4,
      "name": "Interview candidates",
      "spec": {
        "_tasks": [
          {
            "_fw_name": "PyTask",
            "func": "",
            "inputs": [
                "",
                "",
                ""
            ],
            "outputs": [""]
          }
        ],
        "number to fill": 2
      }
    }
  ],
  "links": {},
  "metadata": {},
  "name": ""
}
