{
  "fws": [
    {
      "fw_id": 1,
      "name": "Post the job",
      "spec": {
        "_tasks": [
          {
            "_fw_name": "{{custom_tasks.DataLoaderTask}}",
            "filename": "job_description.json",
            "outputs": "job description"
          },
          {
            "_fw_name": "{{custom_tasks.DataLoaderTask}}",
            "filename": "appl_template.json",
            "outputs": "application template"
          }
        ]
      }
    },
    {
      "fw_id": 2,
      "name": "Candidates apply",
      "spec": {
        "_tasks": [
          {
            "_fw_name": "PyTask",
            "func": "recruiting.candidates_apply",
            "inputs": ["application template", "maximum applications"],
            "outputs": ["applicant profiles"]
          },
          {
            "_fw_name": "{{custom_tasks.RepeatIfLengthLesser}}",
            "measure": "applicant profiles",
            "minimum": "number to screen"
          }
        ],
        "maximum applications": 30,
        "number to screen": 10
      }
    },
    {
      "fw_id": 3,
      "name": "Screen candidates",
      "spec": {
        "_tasks": [
          {
            "_fw_name": "PyTask",
            "func": "recruiting.screen_candidates",
            "inputs": [
                "job description",
                "applicant profiles",
                "minimum score",
                "number to invite"
            ],
            "outputs": ["invited applicants"]
          },
          {
            "_fw_name": "{{custom_tasks.RepeatIfLengthLesser}}",
            "measure": "invited applicants",
            "minimum": "number to invite"
          }
        ],
        "number to invite": 4,
        "minimum score": 2
      }
    },
    {
      "fw_id": 4,
      "name": "Interview candidates",
      "spec": {
        "_tasks": [
          {
            "_fw_name": "PyTask",
            "func": "recruiting.interview_candidates",
            "inputs": [
                "job description",
                "invited applicants",
                "number to fill"
            ],
            "outputs": ["selected applicants"]
          }
        ],
        "number to fill": 2
      }
    }
  ],
  "links": {
    "1": [
      2,
      3,
      4
    ],
    "2": [
      3
    ],
    "3": [
      4
    ]
  },
  "metadata": {},
  "name": "Recruitment workflow"
}
