{
  "name": "Swirl an image in different angles",
  "fws": [
    {
      "fw_id": 1,
      "name": "Swirl 90",
      "spec": {
        "_tasks": [
          {
            "_fw_name": "CommandLineTask",
            "inputs": ["swirl angle", "original image"],
            "outputs": ["swirl 90"],
            "command_spec": {
                "command": ["convert", "-swirl"],
                "original image": {
                    "source": {
                        "type": "path",
                        "value": "/tmp/capitalA.png"
                    }
                },
                "swirl angle": {
                    "source": {
                        "type": "data",
                        "value": "90"
                    }
                },
                "swirl 90": {
                    "target": {
                        "type": "path",
                        "value": "/tmp"
                    }
                }
            }
          }
        ]
      }
    },
    {
      "fw_id": 2,
      "name": "Swirl 180",
      "spec": {
        "_tasks": [
          {
            "_fw_name": "CommandLineTask",
            "inputs": ["swirl angle", "original image"],
            "outputs": ["swirl 180"],
            "command_spec": {
                "command": ["convert", "-swirl"],
                "original image": {
                    "source": {
                        "type": "path",
                        "value": "/tmp/capitalA.png"
                    }
                },
                "swirl angle": {
                    "source": {
                        "type": "data",
                        "value": "180"
                    }
                },
                "swirl 180": {
                    "target": {
                        "type": "path",
                        "value": "/tmp"
                    }
                }
            }
          }
        ]
      }
    },
    {
      "fw_id": 3,
      "name": "Swirl 270",
      "spec": {
        "_tasks": [
          {
            "_fw_name": "CommandLineTask",
            "inputs": ["swirl angle", "original image"],
            "outputs": ["swirl 270"],
            "command_spec": {
                "command": ["convert", "-swirl"],
                "original image": {
                    "source": {
                        "type": "path",
                        "value": "/tmp/capitalA.png"
                    }
                },
                "swirl angle": {
                    "source": {
                        "type": "data",
                        "value": "270"
                    }
                },
                "swirl 270": {
                    "target": {
                        "type": "path",
                        "value": "/tmp"
                    }
                }
            }
          }
        ]
      }
    },
    {
      "fw_id": 4,
      "name": "Swirl 360",
      "spec": {
        "_tasks": [
          {
            "_fw_name": "CommandLineTask",
            "inputs": ["swirl angle", "original image"],
            "outputs": ["swirl 360"],
            "command_spec": {
                "command": ["convert", "-swirl"],
                "original image": {
                    "source": {
                        "type": "path",
                        "value": "/tmp/capitalA.png"
                    }
                },
                "swirl angle": {
                    "source": {
                        "type": "data",
                        "value": "360"
                    }
                },
                "swirl 360": {
                    "target": {
                        "type": "path",
                        "value": "/tmp"
                    }
                }
            }
          }
        ]
      }
    },
    {
      "fw_id": 5,
      "name": "Make an animation from a list of images",
      "spec": {
        "_tasks": [
          {
            "_fw_name": "CommandLineTask",
            "inputs": [
                "original image",
                "swirl 90",
                "swirl 180",
                "swirl 270",
                "swirl 360",
                "swirl 270",
                "swirl 180",
                "swirl 90",
                "original image"
            ],
            "outputs": ["animation"],
            "command_spec": {
                "command": ["convert", "-delay", "10", "-loop", "0"],
                "original image": {
                    "source": {
                        "type": "path",
                        "value": "/tmp/capitalA.png"
                    }
                },
                "swirl 360": {
                    "source": "swirl 360"
                },
                "swirl 270": {
                    "source": "swirl 270"
                },
                "swirl 180": {
                    "source": "swirl 180"
                },
                "swirl 90": {
                    "source": "swirl 90"
                },
                "animation": {
                    "target": {
                        "type": "path",
                        "value": "/tmp/capitalA-swirled-animated.gif"
                    }
                }
            }
          }
        ]
      }
    }
  ],
  "links": {"1": [5], "2": [5], "3": [5], "4": [5], "5": []},
  "metadata": {}
}
