%!PS-Adobe-2.0 EPSF-2.0
%%BoundingBox:  0 0 567 384
%%Title: ./c1.eps: c1
%%Creator: ROOT Version 5.26/00
%%CreationDate: Tue Jan 19 12:18:43 2010
%%EndComments
%%BeginProlog
80 dict begin
/s {stroke} def /l {lineto} def /m {moveto} def /t {translate} def
/sw {stringwidth} def /r {rotate} def /rl {roll}  def /R {repeat} def
/d {rlineto} def /rm {rmoveto} def /gr {grestore} def /f {eofill} def
/c {setrgbcolor} def /black {0 setgray} def /sd {setdash} def
/cl {closepath} def /sf {scalefont setfont} def /lw {setlinewidth} def
/box {m dup 0 exch d exch 0 d 0 exch neg d cl} def
/NC{systemdict begin initclip end}def/C{NC box clip newpath}def
/bl {box s} def /bf {box f} def /Y { 0 exch d} def /X { 0 d} def 
/mp {newpath /y exch def /x exch def} def
/side {[w .77 mul w .23 mul] .385 w mul sd w 0 l currentpoint t -144 r} def
/mr {mp x y w2 0 360 arc} def /m24 {mr s} def /m20 {mr f} def
/mb {mp x y w2 add m w2 neg 0 d 0 w neg d w 0 d 0 w d cl} def
/mt {mp x y w2 add m w2 neg w neg d w 0 d cl} def
/m21 {mb f} def /m25 {mb s} def /m22 {mt f} def /m26{mt s} def
/m23 {mp x y w2 sub m w2 w d w neg 0 d cl f} def
/m27 {mp x y w2 add m w3 neg w2 neg d w3 w2 neg d w3 w2 d cl s} def
/m28 {mp x w2 sub y w2 sub w3 add m w3 0 d  0 w3 neg d w3 0 d 0 w3 d w3 0 d  0 w3 d w3 neg 0 d 0 w3 d w3 neg 0 d
 0 w3 neg d w3 neg 0 d cl s } def
/m29 {mp gsave x w2 sub y w2 add w3 sub m currentpoint t
 4 {side} repeat cl fill gr} def
/m30 {mp gsave x w2 sub y w2 add w3 sub m currentpoint t
 4 {side} repeat cl s gr} def
/m31 {mp x y w2 sub m 0 w d x w2 sub y m w 0 d x w2 sub y w2 add m w w neg d x w2 sub y w2
 sub m w w d s} def
/m2 {mp x y w2 sub m 0 w d x w2 sub y m w 0 d s} def
/m5 {mp x w2 sub y w2 sub m w w d x w2 sub y w2 add m w w neg d s} def
/reEncode {exch findfont dup length dict begin {1 index /FID eq  {pop pop} {def} ifelse } forall /Encoding exch def currentdict end dup /FontName get exch definefont pop } def [/Times-Bold /Times-Italic /Times-BoldItalic /Helvetica
 /Helvetica-Oblique /Helvetica-Bold /Helvetica-BoldOblique /Courier /Courier-Oblique /Courier-Bold /Courier-BoldOblique /Times-Roman /AvantGarde-Book /AvantGarde-BookOblique /AvantGarde-Demi /AvantGarde-DemiOblique /Bookman-Demi
 /Bookman-DemiItalic /Bookman-Light /Bookman-LightItalic /Helvetica-Narrow /Helvetica-Narrow-Bold /Helvetica-Narrow-BoldOblique /Helvetica-Narrow-Oblique /NewCenturySchlbk-Roman /NewCenturySchlbk-Bold
 /NewCenturySchlbk-BoldItalic /NewCenturySchlbk-Italic /Palatino-Bold /Palatino-BoldItalic /Palatino-Italic /Palatino-Roman ] {ISOLatin1Encoding reEncode } forall
/oshow {gsave [] 0 sd true charpath stroke gr} def
/stwn { /fs exch def /fn exch def /text exch def fn findfont fs sf
 text sw pop xs add /xs exch def} def
/stwb { /fs exch def /fn exch def /nbas exch def /textf exch deftextf length /tlen exch def nbas tlen gt {/nbas tlendef} iffn findfont fs sf textf dup length nbas sub nbas getinterval sw
pop neg xs add /xs exch def} def
%%EndProlog
%%BeginSetup
%%EndSetup
newpath  gsave  .25 .25 scale  gsave  0 0 t black[  ] 0 sd 3 lw 1 1 1 c 2268 1538 0 0 bf black 1 1 1 c 1814 1230 227 154 bf 227 154 m 4 4 d 1222 Y 1806 X 4 4 d -1814 X -1230 Y f 1 7.94729e-08 0 c 227 154 m 4 4 d 1806 X 1222 Y 4 4 d -1230 Y -1814 X f
 black 1814 1230 227 154 bl 1 1 1 c 1814 1230 227 154 bf 227 154 m 4 4 d 1222 Y 1806 X 4 4 d -1814 X -1230 Y f 1 7.94729e-08 0 c 227 154 m 4 4 d 1806 X 1222 Y 4 4 d -1230 Y -1814 X f black 1814 1230 227 154 bl 227 154 m 1814 X s[ 4 8] 0 sd 227 1384
 m -1230 Y s 529 1384 m -1230 Y s 831 1384 m -1230 Y s 1134 1384 m -1230 Y s 1436 1384 m -1230 Y s 1739 1384 m -1230 Y s 2041 1384 m -1230 Y s[  ] 0 sd 227 154 m 1230 Y s[ 4 8] 0 sd 2041 154 m -1814 X s 2041 395 m -1814 X s 2041 637 m -1814 X s 2041
 878 m -1814 X s 2041 1120 m -1814 X s 2041 1361 m -1814 X s 2041 1361 m -1814 X s 1 1 1 c[  ] 0 sd 9 lw 0.95 0.95 0.95 c black 1 1 1 c 236 1326 m 18 -69 d 18 -64 d 18 -61 d 18 -57 d 19 -53 d 18 -51 d 18 -47 d 18 -45 d 18 -42 d 18 -40 d 18 -38 d 19
 -35 d 18 -33 d 18 -31 d 18 -30 d 18 -28 d 18 -26 d 18 -24 d 19 -23 d 18 -22 d 18 -21 d 18 -19 d 18 -18 d 18 -18 d 18 -16 d 19 -15 d 18 -14 d 18 -14 d 18 -13 d 18 -12 d 18 -11 d 18 -10 d 19 -10 d 18 -10 d 18 -9 d 18 -8 d 18 -8 d 18 -7 d 18 -7 d 19
 -7 d 18 -6 d 18 -6 d 18 -5 d 18 -6 d 18 -4 d 18 -5 d 19 -4 d 18 -4 d 18 -4 d s 1125 216 m 18 -4 d 18 -3 d 18 -3 d 18 -3 d 18 -3 d 19 -3 d 18 -3 d 18 -2 d 18 -2 d 18 -2 d 18 -2 d 18 -2 d 19 -2 d 18 -1 d 18 -2 d 18 -1 d 18 -2 d 18 -1 d 18 -1 d 19 -2
 d 18 -1 d 18 -1 d 18 -1 d 18 -1 d 18 X 18 -1 d 19 -1 d 18 -1 d 18 X 18 -1 d 18 -1 d 18 X 18 -1 d 19 X 18 -1 d 36 X 18 -1 d 18 X 18 -1 d 37 X 18 -1 d 54 X 18 -1 d 37 X s 2014 157 m 18 X s black 3 lw 227 154 m 1814 X s
 gsave  2268 1538 0 0 C 2007 39 t 0 r /Helvetica-Bold findfont 58.6478 sf 0 0 m (2) show NC gr 
 gsave  2268 1538 0 0 C 1974 39 t 0 r /Symbol findfont 58.6478 sf 0 0 m (c) show NC gr  227 191 m -37 Y s 302 172 m -18 Y s 378 172 m -18 Y s 454 172 m -18 Y s 529 191 m -37 Y s 605 172 m -18 Y s 680 172 m -18 Y s 756 172 m -18 Y s 831 191 m -37 Y s
 907 172 m -18 Y s 983 172 m -18 Y s 1058 172 m -18 Y s 1134 191 m -37 Y s 1209 172 m -18 Y s 1285 172 m -18 Y s 1361 172 m -18 Y s 1436 191 m -37 Y s 1512 172 m -18 Y s 1587 172 m -18 Y s 1663 172 m -18 Y s 1739 191 m -37 Y s 1814 172 m -18 Y s
 1890 172 m -18 Y s 1965 172 m -18 Y s 2041 191 m -37 Y s
 gsave  2268 1538 0 0 C 209 98 t 0 r /Helvetica-Bold findfont 58.6478 sf 0 0 m (0) show NC gr 
 gsave  2268 1538 0 0 C 512 98 t 0 r /Helvetica-Bold findfont 58.6478 sf 0 0 m (2) show NC gr 
 gsave  2268 1538 0 0 C 815 98 t 0 r /Helvetica-Bold findfont 58.6478 sf 0 0 m (4) show NC gr 
 gsave  2268 1538 0 0 C 1118 98 t 0 r /Helvetica-Bold findfont 58.6478 sf 0 0 m (6) show NC gr 
 gsave  2268 1538 0 0 C 1417 98 t 0 r /Helvetica-Bold findfont 58.6478 sf 0 0 m (8) show NC gr 
 gsave  2268 1538 0 0 C 1704 98 t 0 r /Helvetica-Bold findfont 58.6478 sf 0 0 m (10) show NC gr 
 gsave  2268 1538 0 0 C 2007 98 t 0 r /Helvetica-Bold findfont 58.6478 sf 0 0 m (12) show NC gr  227 154 m 1230 Y s
 gsave  2268 1538 0 0 C 98 893 t 90 r /Helvetica-Bold findfont 58.6478 sf 0 0 m (Verteilungsdichte) show NC gr  281 154 m -54 X s 254 202 m -27 X s 254 250 m -27 X s 254 299 m -27 X s 254 347 m -27 X s 281 395 m -54 X s 254 444 m -27 X s 254 492 m
 -27 X s 254 540 m -27 X s 254 588 m -27 X s 281 637 m -54 X s 254 685 m -27 X s 254 733 m -27 X s 254 782 m -27 X s 254 830 m -27 X s 281 878 m -54 X s 254 927 m -27 X s 254 975 m -27 X s 254 1023 m -27 X s 254 1071 m -27 X s 281 1120 m -54 X s 254
 1168 m -27 X s 254 1216 m -27 X s 254 1265 m -27 X s 254 1313 m -27 X s 281 1361 m -54 X s 281 1361 m -54 X s
 gsave  2268 1538 0 0 C 182 134 t 0 r /Helvetica-Bold findfont 58.6478 sf 0 0 m (0) show NC gr 
 gsave  2268 1538 0 0 C 140 375 t 0 r /Helvetica-Bold findfont 58.6478 sf 0 0 m (0.1) show NC gr 
 gsave  2268 1538 0 0 C 134 616 t 0 r /Helvetica-Bold findfont 58.6478 sf 0 0 m (0.2) show NC gr 
 gsave  2268 1538 0 0 C 134 857 t 0 r /Helvetica-Bold findfont 58.6478 sf 0 0 m (0.3) show NC gr 
 gsave  2268 1538 0 0 C 134 1098 t 0 r /Helvetica-Bold findfont 58.6478 sf 0 0 m (0.4) show NC gr 
 gsave  2268 1538 0 0 C 134 1339 t 0 r /Helvetica-Bold findfont 58.6478 sf 0 0 m (0.5) show NC gr  9 lw 0.95 0.95 0.95 c black 236 1326 m 18 -69 d 18 -64 d 18 -61 d 18 -57 d 19 -53 d 18 -51 d 18 -47 d 18 -45 d 18 -42 d 18 -40 d 18 -38 d 19 -35 d 18
 -33 d 18 -31 d 18 -30 d 18 -28 d 18 -26 d 18 -24 d 19 -23 d 18 -22 d 18 -21 d 18 -19 d 18 -18 d 18 -18 d 18 -16 d 19 -15 d 18 -14 d 18 -14 d 18 -13 d 18 -12 d 18 -11 d 18 -10 d 19 -10 d 18 -10 d 18 -9 d 18 -8 d 18 -8 d 18 -7 d 18 -7 d 19 -7 d 18 -6
 d 18 -6 d 18 -5 d 18 -6 d 18 -4 d 18 -5 d 19 -4 d 18 -4 d 18 -4 d s 1125 216 m 18 -4 d 18 -3 d 18 -3 d 18 -3 d 18 -3 d 19 -3 d 18 -3 d 18 -2 d 18 -2 d 18 -2 d 18 -2 d 18 -2 d 19 -2 d 18 -1 d 18 -2 d 18 -1 d 18 -2 d 18 -1 d 18 -1 d 19 -2 d 18 -1 d
 18 -1 d 18 -1 d 18 -1 d 18 X 18 -1 d 19 -1 d 18 -1 d 18 X 18 -1 d 18 -1 d 18 X 18 -1 d 19 X 18 -1 d 36 X 18 -1 d 18 X 18 -1 d 37 X 18 -1 d 54 X 18 -1 d 37 X s 2014 157 m 18 X s 1 0 0 c 0.95 0.95 0.95 c black 1 0 0 c 236 383 m 18 144 d 18 81 d 18 52
 d 18 34 d 19 22 d 18 14 d 18 7 d 18 1 d 18 -3 d 18 -5 d 18 -9 d 19 -10 d 18 -12 d 18 -13 d 18 -14 d 18 -15 d 18 -15 d 18 -15 d 19 -16 d 18 -16 d 18 -15 d 18 -16 d 18 -15 d 18 -15 d 18 -15 d 19 -15 d 18 -14 d 18 -14 d 18 -13 d 18 -14 d 18 -12 d 18
 -13 d 19 -11 d 18 -12 d 18 -11 d 18 -11 d 18 -10 d 18 -10 d 18 -9 d 19 -9 d 18 -9 d 18 -8 d 18 -8 d 18 -8 d 18 -7 d 18 -7 d 19 -7 d 18 -7 d 18 -6 d s 1125 274 m 18 -6 d 18 -5 d 18 -6 d 18 -5 d 18 -5 d 19 -4 d 18 -5 d 18 -4 d 18 -4 d 18 -4 d 18 -3 d
 18 -4 d 19 -3 d 18 -3 d 18 -3 d 18 -3 d 18 -3 d 18 -2 d 18 -3 d 19 -2 d 18 -2 d 18 -3 d 18 -2 d 18 -1 d 18 -2 d 18 -2 d 19 -2 d 18 -1 d 18 -2 d 18 -1 d 18 -1 d 18 -2 d 18 -1 d 19 -1 d 18 -1 d 18 -1 d 18 -1 d 18 -1 d 18 -1 d 18 -1 d 19 X 18 -1 d 18
 -1 d 18 X 18 -1 d 18 -1 d 18 X 19 -1 d 18 X s 2014 163 m 18 -1 d s 0 1 0 c 0.95 0.95 0.95 c black 0 1 0 c 236 189 m 18 64 d 18 57 d 18 49 d 18 44 d 19 37 d 18 33 d 18 27 d 18 24 d 18 19 d 18 16 d 18 13 d 19 10 d 18 7 d 18 5 d 18 3 d 18 1 d 18 -1 d
 18 -2 d 19 -3 d 18 -4 d 18 -5 d 18 -7 d 18 -7 d 18 -7 d 18 -8 d 19 -9 d 18 -9 d 18 -9 d 18 -9 d 18 -10 d 18 -9 d 18 -10 d 19 -10 d 18 -10 d 18 -10 d 18 -9 d 18 -10 d 18 -9 d 18 -10 d 19 -9 d 18 -9 d 18 -9 d 18 -8 d 18 -9 d 18 -8 d 18 -8 d 19 -8 d
 18 -8 d 18 -7 d s 1125 338 m 18 -7 d 18 -7 d 18 -7 d 18 -7 d 18 -6 d 19 -6 d 18 -6 d 18 -6 d 18 -6 d 18 -5 d 18 -5 d 18 -5 d 19 -5 d 18 -4 d 18 -5 d 18 -4 d 18 -4 d 18 -4 d 18 -4 d 19 -3 d 18 -4 d 18 -3 d 18 -3 d 18 -3 d 18 -3 d 18 -3 d 19 -3 d 18
 -3 d 18 -2 d 18 -2 d 18 -3 d 18 -2 d 18 -2 d 19 -2 d 18 -2 d 18 -2 d 18 -1 d 18 -2 d 18 -2 d 18 -1 d 19 -1 d 18 -2 d 18 -1 d 18 -1 d 18 -2 d 18 -1 d 18 -1 d 19 -1 d 18 -1 d s 2014 173 m 18 -1 d s 0 0 1 c 0.95 0.95 0.95 c black 0 0 1 c 236 158 m 18
 18 d 18 23 d 18 26 d 18 26 d 19 27 d 18 26 d 18 25 d 18 23 d 18 23 d 18 21 d 18 19 d 19 17 d 18 16 d 18 15 d 18 12 d 18 11 d 18 10 d 18 8 d 19 7 d 18 5 d 18 4 d 18 3 d 18 2 d 18 1 d 18 X 19 -1 d 18 -2 d 18 -2 d 18 -3 d 18 -4 d 18 -4 d 18 -4 d 19 -5
 d 18 -6 d 18 -6 d 18 -6 d 18 -6 d 18 -7 d 18 -6 d 19 -7 d 18 -7 d 18 -7 d 18 -8 d 18 -7 d 18 -7 d 18 -7 d 19 -7 d 18 -8 d 18 -7 d s 1125 392 m 18 -7 d 18 -7 d 18 -7 d 18 -6 d 18 -7 d 19 -7 d 18 -6 d 18 -6 d 18 -7 d 18 -6 d 18 -6 d 18 -5 d 19 -6 d
 18 -6 d 18 -5 d 18 -5 d 18 -5 d 18 -5 d 18 -5 d 19 -5 d 18 -4 d 18 -5 d 18 -4 d 18 -4 d 18 -4 d 18 -4 d 19 -4 d 18 -3 d 18 -4 d 18 -3 d 18 -3 d 18 -3 d 18 -3 d 19 -3 d 18 -3 d 18 -3 d 18 -2 d 18 -3 d 18 -2 d 18 -3 d 19 -2 d 18 -2 d 18 -2 d 18 -2 d
 18 -2 d 18 -2 d 18 -2 d 19 -1 d 18 -2 d s 2014 189 m 18 -1 d s 1 1 0 c 0.95 0.95 0.95 c black 1 1 0 c 236 154 m 18 4 d 18 7 d 18 10 d 18 12 d 19 14 d 18 15 d 18 16 d 18 16 d 18 17 d 18 16 d 18 17 d 19 16 d 18 16 d 18 15 d 18 15 d 18 14 d 18 13 d 18
 12 d 19 11 d 18 11 d 18 9 d 18 9 d 18 8 d 18 7 d 18 6 d 19 5 d 18 4 d 18 4 d 18 3 d 18 2 d 18 2 d 18 X 19 1 d 18 -1 d 18 -1 d 18 -1 d 18 -2 d 18 -2 d 18 -3 d 19 -3 d 18 -4 d 18 -4 d 18 -4 d 18 -4 d 18 -5 d 18 -5 d 19 -5 d 18 -5 d 18 -5 d s 1125 427
 m 18 -5 d 18 -6 d 18 -6 d 18 -5 d 18 -6 d 19 -6 d 18 -5 d 18 -6 d 18 -6 d 18 -6 d 18 -5 d 18 -6 d 19 -6 d 18 -5 d 18 -6 d 18 -5 d 18 -5 d 18 -6 d 18 -5 d 19 -5 d 18 -5 d 18 -5 d 18 -5 d 18 -5 d 18 -4 d 18 -5 d 19 -4 d 18 -4 d 18 -5 d 18 -4 d 18 -4
 d 18 -4 d 18 -3 d 19 -4 d 18 -4 d 18 -3 d 18 -4 d 18 -3 d 18 -3 d 18 -3 d 19 -3 d 18 -3 d 18 -3 d 18 -3 d 18 -2 d 18 -3 d 18 -2 d 19 -3 d 18 -2 d s 2014 211 m 18 -2 d s 1 0 1 c 0.95 0.95 0.95 c black 1 0 1 c 236 154 m 18 1 d 18 2 d 18 3 d 18 4 d 19
 6 d 18 7 d 18 8 d 18 9 d 18 10 d 18 11 d 18 11 d 19 11 d 18 12 d 18 12 d 18 12 d 18 12 d 18 12 d 18 12 d 19 12 d 18 11 d 18 11 d 18 10 d 18 10 d 18 10 d 18 9 d 19 8 d 18 8 d 18 7 d 18 7 d 18 6 d 18 5 d 18 5 d 19 5 d 18 3 d 18 4 d 18 2 d 18 3 d 18 1
 d 18 1 d 19 1 d 54 X 18 -1 d 18 -1 d 18 -2 d 19 -2 d 18 -2 d 18 -3 d s 1125 437 m 18 -3 d 18 -3 d 18 -3 d 18 -4 d 18 -3 d 19 -4 d 18 -4 d 18 -4 d 18 -5 d 18 -4 d 18 -4 d 18 -5 d 19 -5 d 18 -4 d 18 -5 d 18 -5 d 18 -4 d 18 -5 d 18 -5 d 19 -5 d 18 -5
 d 18 -4 d 18 -5 d 18 -5 d 18 -5 d 18 -4 d 19 -5 d 18 -4 d 18 -5 d 18 -4 d 18 -4 d 18 -5 d 18 -4 d 19 -4 d 18 -4 d 18 -4 d 18 -4 d 18 -4 d 18 -4 d 18 -3 d 19 -4 d 18 -3 d 18 -4 d 18 -3 d 18 -3 d 18 -3 d 18 -4 d 19 -3 d 18 -3 d s 2014 237 m 18 -2 d s
 0 1 1 c 0.95 0.95 0.95 c black 0 1 1 c 236 154 m 36 X 18 1 d 18 2 d 19 2 d 18 3 d 18 3 d 18 5 d 18 5 d 18 6 d 18 6 d 19 7 d 18 7 d 18 8 d 18 9 d 18 8 d 18 9 d 18 9 d 19 10 d 18 9 d 18 10 d 18 9 d 18 10 d 18 9 d 18 9 d 19 9 d 18 8 d 18 9 d 18 8 d 18
 8 d 18 7 d 18 7 d 19 7 d 18 6 d 18 6 d 18 5 d 18 5 d 18 5 d 18 4 d 19 4 d 18 3 d 18 3 d 18 3 d 18 2 d 18 2 d 18 1 d 19 1 d 18 1 d 18 X s 1125 424 m 36 X 18 -1 d 18 -1 d 18 -1 d 19 -1 d 18 -2 d 18 -2 d 18 -2 d 18 -2 d 18 -3 d 18 -3 d 19 -3 d 18 -3 d
 18 -3 d 18 -3 d 18 -4 d 18 -3 d 18 -4 d 19 -4 d 18 -4 d 18 -3 d 18 -4 d 18 -4 d 18 -4 d 18 -5 d 19 -4 d 18 -4 d 18 -4 d 18 -4 d 18 -4 d 18 -4 d 18 -4 d 19 -4 d 18 -4 d 18 -4 d 18 -4 d 18 -4 d 18 -4 d 18 -4 d 19 -4 d 18 -4 d 18 -3 d 18 -4 d 18 -4 d
 18 -3 d 18 -4 d 19 -3 d 18 -4 d s 2014 266 m 18 -3 d s
 gr  gr 
showpage
end
%%EOF
