%!PS-Adobe-2.0 EPSF-2.0
%%Title: xyErrors.fig
%%Creator: fig2dev Version 3.2 Patchlevel 5
%%CreationDate: Wed Jan 13 19:52:14 2010
%%For: quast@gqhome (quast)
%%BoundingBox: 0 0 651 651
%Magnification: 1.0000
%%EndComments
%%BeginProlog
/$F2psDict 200 dict def
$F2psDict begin
$F2psDict /mtrx matrix put
/col-1 {0 setgray} bind def
/col0 {0.000 0.000 0.000 srgb} bind def
/col1 {0.000 0.000 1.000 srgb} bind def
/col2 {0.000 1.000 0.000 srgb} bind def
/col3 {0.000 1.000 1.000 srgb} bind def
/col4 {1.000 0.000 0.000 srgb} bind def
/col5 {1.000 0.000 1.000 srgb} bind def
/col6 {1.000 1.000 0.000 srgb} bind def
/col7 {1.000 1.000 1.000 srgb} bind def
/col8 {0.000 0.000 0.560 srgb} bind def
/col9 {0.000 0.000 0.690 srgb} bind def
/col10 {0.000 0.000 0.820 srgb} bind def
/col11 {0.530 0.810 1.000 srgb} bind def
/col12 {0.000 0.560 0.000 srgb} bind def
/col13 {0.000 0.690 0.000 srgb} bind def
/col14 {0.000 0.820 0.000 srgb} bind def
/col15 {0.000 0.560 0.560 srgb} bind def
/col16 {0.000 0.690 0.690 srgb} bind def
/col17 {0.000 0.820 0.820 srgb} bind def
/col18 {0.560 0.000 0.000 srgb} bind def
/col19 {0.690 0.000 0.000 srgb} bind def
/col20 {0.820 0.000 0.000 srgb} bind def
/col21 {0.560 0.000 0.560 srgb} bind def
/col22 {0.690 0.000 0.690 srgb} bind def
/col23 {0.820 0.000 0.820 srgb} bind def
/col24 {0.500 0.190 0.000 srgb} bind def
/col25 {0.630 0.250 0.000 srgb} bind def
/col26 {0.750 0.380 0.000 srgb} bind def
/col27 {1.000 0.500 0.500 srgb} bind def
/col28 {1.000 0.630 0.630 srgb} bind def
/col29 {1.000 0.750 0.750 srgb} bind def
/col30 {1.000 0.880 0.880 srgb} bind def
/col31 {1.000 0.840 0.000 srgb} bind def
/col32 {0.612 0.000 0.000 srgb} bind def
/col33 {0.549 0.549 0.549 srgb} bind def
/col34 {0.549 0.549 0.549 srgb} bind def
/col35 {0.259 0.259 0.259 srgb} bind def
/col36 {0.549 0.549 0.549 srgb} bind def
/col37 {0.259 0.259 0.259 srgb} bind def
/col38 {0.549 0.549 0.549 srgb} bind def
/col39 {0.259 0.259 0.259 srgb} bind def
/col40 {0.549 0.549 0.549 srgb} bind def
/col41 {0.259 0.259 0.259 srgb} bind def
/col42 {0.549 0.549 0.549 srgb} bind def
/col43 {0.259 0.259 0.259 srgb} bind def

end
save
newpath 0 651 moveto 0 0 lineto 651 0 lineto 651 651 lineto closepath clip newpath
-118.5 683.7 translate
1 -1 scale

/cp {closepath} bind def
/ef {eofill} bind def
/gr {grestore} bind def
/gs {gsave} bind def
/sa {save} bind def
/rs {restore} bind def
/l {lineto} bind def
/m {moveto} bind def
/rm {rmoveto} bind def
/n {newpath} bind def
/s {stroke} bind def
/sh {show} bind def
/slc {setlinecap} bind def
/slj {setlinejoin} bind def
/slw {setlinewidth} bind def
/srgb {setrgbcolor} bind def
/rot {rotate} bind def
/sc {scale} bind def
/sd {setdash} bind def
/ff {findfont} bind def
/sf {setfont} bind def
/scf {scalefont} bind def
/sw {stringwidth} bind def
/tr {translate} bind def
/tnt {dup dup currentrgbcolor
  4 -2 roll dup 1 exch sub 3 -1 roll mul add
  4 -2 roll dup 1 exch sub 3 -1 roll mul add
  4 -2 roll dup 1 exch sub 3 -1 roll mul add srgb}
  bind def
/shd {dup dup currentrgbcolor 4 -2 roll mul 4 -2 roll mul
  4 -2 roll mul srgb} bind def
/reencdict 12 dict def /ReEncode { reencdict begin
/newcodesandnames exch def /newfontname exch def /basefontname exch def
/basefontdict basefontname findfont def /newfont basefontdict maxlength dict def
basefontdict { exch dup /FID ne { dup /Encoding eq
{ exch dup length array copy newfont 3 1 roll put }
{ exch newfont 3 1 roll put } ifelse } { pop pop } ifelse } forall
newfont /FontName newfontname put newcodesandnames aload pop
128 1 255 { newfont /Encoding get exch /.notdef put } for
newcodesandnames length 2 idiv { newfont /Encoding get 3 1 roll put } repeat
newfontname newfont definefont pop end } def
/isovec [
8#055 /minus 8#200 /grave 8#201 /acute 8#202 /circumflex 8#203 /tilde
8#204 /macron 8#205 /breve 8#206 /dotaccent 8#207 /dieresis
8#210 /ring 8#211 /cedilla 8#212 /hungarumlaut 8#213 /ogonek 8#214 /caron
8#220 /dotlessi 8#230 /oe 8#231 /OE
8#240 /space 8#241 /exclamdown 8#242 /cent 8#243 /sterling
8#244 /currency 8#245 /yen 8#246 /brokenbar 8#247 /section 8#250 /dieresis
8#251 /copyright 8#252 /ordfeminine 8#253 /guillemotleft 8#254 /logicalnot
8#255 /hyphen 8#256 /registered 8#257 /macron 8#260 /degree 8#261 /plusminus
8#262 /twosuperior 8#263 /threesuperior 8#264 /acute 8#265 /mu 8#266 /paragraph
8#267 /periodcentered 8#270 /cedilla 8#271 /onesuperior 8#272 /ordmasculine
8#273 /guillemotright 8#274 /onequarter 8#275 /onehalf
8#276 /threequarters 8#277 /questiondown 8#300 /Agrave 8#301 /Aacute
8#302 /Acircumflex 8#303 /Atilde 8#304 /Adieresis 8#305 /Aring
8#306 /AE 8#307 /Ccedilla 8#310 /Egrave 8#311 /Eacute
8#312 /Ecircumflex 8#313 /Edieresis 8#314 /Igrave 8#315 /Iacute
8#316 /Icircumflex 8#317 /Idieresis 8#320 /Eth 8#321 /Ntilde 8#322 /Ograve
8#323 /Oacute 8#324 /Ocircumflex 8#325 /Otilde 8#326 /Odieresis 8#327 /multiply
8#330 /Oslash 8#331 /Ugrave 8#332 /Uacute 8#333 /Ucircumflex
8#334 /Udieresis 8#335 /Yacute 8#336 /Thorn 8#337 /germandbls 8#340 /agrave
8#341 /aacute 8#342 /acircumflex 8#343 /atilde 8#344 /adieresis 8#345 /aring
8#346 /ae 8#347 /ccedilla 8#350 /egrave 8#351 /eacute
8#352 /ecircumflex 8#353 /edieresis 8#354 /igrave 8#355 /iacute
8#356 /icircumflex 8#357 /idieresis 8#360 /eth 8#361 /ntilde 8#362 /ograve
8#363 /oacute 8#364 /ocircumflex 8#365 /otilde 8#366 /odieresis 8#367 /divide
8#370 /oslash 8#371 /ugrave 8#372 /uacute 8#373 /ucircumflex
8#374 /udieresis 8#375 /yacute 8#376 /thorn 8#377 /ydieresis] def
/Times-Roman /Times-Roman-iso isovec ReEncode
 /DrawEllipse {
	/endangle exch def
	/startangle exch def
	/yrad exch def
	/xrad exch def
	/y exch def
	/x exch def
	/savematrix mtrx currentmatrix def
	x y tr xrad yrad sc 0 0 1 startangle endangle arc
	closepath
	savematrix setmatrix
	} def

/$F2psBegin {$F2psDict begin /$F2psEnteredState save def} def
/$F2psEnd {$F2psEnteredState restore end} def

$F2psBegin
10 setmiterlimit
0 slj 0 slc
 0.06299 0.06299 sc
%%EndProlog
%
% Fig objects follow
%
% 
% here starts figure with depth 50
/Symbol ff 317.50 scf sf
8865 4140 m
gs 1 -1 sc (a) col0 sh gr
% Arc
60.000 slw
0 slc
n 18905.5 27334.9 23188.6 -133.7168 -107.8697 arc
gs col12 s gr

% Arc
7.500 slw
n 6808.5 3226.5 381.3 -168.4248 120.4998 arcn
gs col0 s gr

% Arc
n 5715.0 3607.5 320.4 106.3139 32.5741 arcn
gs col0 s gr

% Arc
15.000 slw
n 6448.5 8077.5 834.1 -46.7489 17.2618 arc
gs col0 s gr

% Ellipse
60.000 slw
n 5617 3150 127 127 0 360 DrawEllipse gs col1 1.00 shd ef gr gs col1 s gr

% Polyline
0 slj
n 4050 3150 m
 7200 3150 l gs col8 s gr 
% Polyline
n 5625 900 m
 5625 5400 l gs col8 s gr 
% Polyline
30.000 slw
n 6870 5175 m 6900 5175 l gs col18 s gr
% Polyline
n 6915 5175 m 6945 5175 l gs col18 s gr
% Polyline
n 6915 5175 m 6945 5175 l gs col18 s gr
% Polyline
n 6915 5175 m 6945 5175 l gs col18 s gr
% Polyline
n 6915 5175 m 6945 5175 l gs col18 s gr
% Polyline
n 6870 3420 m 6900 3420 l gs col18 s gr
% Polyline
n 6735 3510 m 6765 3510 l gs col18 s gr
% Polyline
n 6735 3510 m 6765 3510 l gs col18 s gr
% Polyline
n 6735 3510 m 6765 3510 l gs col18 s gr
% Polyline
 [90 45 15 45] 0 sd
n 7155 3150 m 6165 4005 l
 6210 3960 l gs col5 s gr  [] 0 sd
% Polyline
 [120 60 15 60] 0 sd
n 5625 8370 m
 10260 8370 l gs col0 s gr  [] 0 sd
% Polyline
n 10155 8370 m 10185 8370 l gs col18 s gr
% Polyline
 [90 45 15 45] 0 sd
n 5625 5355 m
 6525 4680 l gs col5 s gr  [] 0 sd
% Polyline
60.000 slw
gs  clippath
11643 10208 m 12165 10208 l 12165 10132 l 11643 10132 l 11643 10140 l 11793 10170 l 11643 10200 l cp
eoclip
n 12150 10170 m
 1935 10170 l gs col0 s gr gr

% arrowhead
135.000 slw
n 11643 10200 m 11793 10170 l 11643 10140 l 11673 10170 l 11643 10200 l 
 cp gs 0.00 setgray ef gr  col0 s
% Polyline
60.000 slw
gs  clippath
3278 1092 m 3278 570 l 3202 570 l 3202 1092 l 3210 1092 l 3240 942 l 3270 1092 l cp
eoclip
n 3240 585 m
 3240 10800 l gs col0 s gr gr

% arrowhead
135.000 slw
n 3270 1092 m 3240 942 l 3210 1092 l 3240 1062 l 3270 1092 l 
 cp gs 0.00 setgray ef gr  col0 s
% Polyline
30.000 slw
 [60] 0 sd
n 5625 8370 m
 3150 8370 l gs col4 s gr  [] 0 sd
% Polyline
2 slc
gs  clippath
6374 4470 m 6499 4668 l 6550 4636 l 6425 4438 l 6425 4438 l 6464 4556 l 6374 4470 l cp
5759 3369 m 5634 3171 l 5583 3203 l 5708 3401 l 5708 3401 l 5670 3284 l 5759 3369 l cp
eoclip
n 5617 3200 m
 6517 4640 l gs col1 s gr gr

% arrowhead
0 slc
45.000 slw
n 5759 3369 m 5670 3284 l 5708 3401 l  col1 s
% arrowhead
n 6374 4470 m 6464 4556 l 6425 4438 l  col1 s
% Polyline
7.500 slw
gs  clippath
6049 3242 m 5951 3418 l 6003 3447 l 6101 3271 l 6101 3271 l 6017 3362 l 6049 3242 l cp
eoclip
n 6435 2610 m
 5985 3420 l gs col8 s gr gr

% arrowhead
30.000 slw
n 6049 3242 m 6017 3362 l 6101 3271 l  col8 s
% Polyline
7.500 slw
gs  clippath
5953 4339 m 6103 4247 l 6072 4196 l 5921 4288 l 5921 4288 l 6014 4267 l 5953 4339 l cp
eoclip
n 3960 5535 m
 6075 4230 l gs col8 s gr gr

% arrowhead
45.000 slw
n 5953 4339 m 6014 4267 l 5921 4288 l 5911 4330 l 5953 4339 l 
 cp gs col8 1.00 shd ef gr  col8 s
% Polyline
7.500 slw
gs  clippath
7058 5060 m 6986 5221 l 7041 5245 l 7113 5085 l 7113 5085 l 7049 5155 l 7058 5060 l cp
eoclip
n 7425 4320 m
 7020 5220 l gs col8 s gr gr

% arrowhead
45.000 slw
n 7058 5060 m 7049 5155 l 7113 5085 l 7098 5045 l 7058 5060 l 
 cp gs col8 1.00 shd ef gr  col8 s
% Polyline
30.000 slw
 [60] 0 sd
n 4005 3150 m
 3060 3150 l gs col4 s gr  [] 0 sd
% Polyline
gs  clippath
6084 3780 m 6211 3976 l 6262 3944 l 6134 3747 l 6134 3747 l 6175 3865 l 6084 3780 l cp
5878 3350 m 5751 3154 l 5700 3186 l 5828 3383 l 5828 3383 l 5788 3266 l 5878 3350 l cp
eoclip
n 5734 3183 m
 6229 3948 l gs col1 s gr gr

% arrowhead
45.000 slw
n 5878 3350 m 5788 3266 l 5828 3383 l  col1 s
% arrowhead
n 6084 3780 m 6175 3865 l 6134 3747 l  col1 s
% Polyline
30.000 slw
n 2565 10440 m
 11295 4365 l gs col18 s gr 
% Polyline
gs  clippath
7671 6412 m 7902 6778 l 7953 6746 l 7722 6380 l 7722 6380 l 7761 6498 l 7671 6412 l cp
eoclip
n 5670 3195 m
 7920 6750 l gs col18 s gr gr

% arrowhead
135.000 slw
n 7671 6412 m 7761 6498 l 7722 6380 l  col18 s
% Polyline
30.000 slw
 [60] 0 sd
n 5625 5445 m
 5625 10350 l gs col4 s gr  [] 0 sd
/Symbol ff 476.25 scf sf
6615 8145 m
gs 1 -1 sc (a) col0 sh gr
/Symbol ff 317.50 scf sf
6570 3420 m
gs 1 -1 sc (a) col0 sh gr
/Times-Roman-iso ff 476.25 scf sf
2295 810 m
gs 1 -1 sc (y) col0 sh gr
/Times-Roman-iso ff 476.25 scf sf
11700 10620 m
gs 1 -1 sc (x) col0 sh gr
/Symbol ff 317.50 scf sf
8865 7830 m
gs 1 -1 sc (a) col0 sh gr
/Times-Roman-iso ff 476.25 scf sf
5400 10575 m
gs 1 -1 sc (x) col0 sh gr
/Times-Roman-iso ff 476.25 scf sf
2385 3285 m
gs 1 -1 sc (y) col0 sh gr
/Symbol ff 317.50 scf sf
6075 5850 m
gs 1 -1 sc (a) col0 sh gr
/Times-Roman-iso ff 317.50 scf sf
5895 1260 m
gs 1 -1 sc (y) col0 sh gr
/Times-Roman-iso ff 317.50 scf sf
4320 3060 m
gs 1 -1 sc (x) col0 sh gr
/Times-Roman-iso ff 317.50 scf sf
2610 3420 m
gs 1 -1 sc (i) col0 sh gr
/Times-Roman-iso ff 317.50 scf sf
5670 10665 m
gs 1 -1 sc (i) col0 sh gr
/Times-Roman-iso ff 476.25 scf sf
2070 8505 m
gs 1 -1 sc (f\(x \)) col0 sh gr
/Times-Roman-iso ff 317.50 scf sf
2655 8595 m
gs 1 -1 sc (i) col8 sh gr
/Symbol ff 317.50 scf sf
4095 3015 m
gs 1 -1 sc (s) col0 sh gr
/Symbol ff 476.25 scf sf
7335 2520 m
gs 1 -1 sc (s) col0 sh gr
/Symbol ff 476.25 scf sf
4680 5850 m
gs 1 -1 sc (s) col0 sh gr
/Symbol ff 476.25 scf sf
6390 2565 m
gs 1 -1 sc (d) col0 sh gr
/Symbol ff 476.25 scf sf
3645 5895 m
gs 1 -1 sc (d) col0 sh gr
/Times-Roman-iso ff 317.50 scf sf
10980 4275 m
gs 1 -1 sc (i) col0 sh gr
/Times-Roman-iso ff 476.25 scf sf
4230 5850 m
gs 1 -1 sc (=      cos\(  \)) col0 sh gr
/Times-Roman-iso ff 317.50 scf sf
4950 5895 m
gs 1 -1 sc (y) col0 sh gr
/Times-Roman-iso ff 476.25 scf sf
6975 2520 m
gs 1 -1 sc (=     sin\(  \)) col0 sh gr
/Symbol ff 317.50 scf sf
8595 2475 m
gs 1 -1 sc (a) col0 sh gr
/Times-Roman-iso ff 317.50 scf sf
7605 2610 m
gs 1 -1 sc (x) col0 sh gr
/Times-Roman-iso ff 317.50 scf sf
6660 2610 m
gs 1 -1 sc (x) col0 sh gr
/Times-Roman-iso ff 317.50 scf sf
3915 5895 m
gs 1 -1 sc (y) col0 sh gr
/Times-Roman-iso ff 476.25 scf sf
8100 7875 m
gs 1 -1 sc (tan\(  \)=f'\(x \)) col0 sh gr
/Times-Roman-iso ff 317.50 scf sf
10215 7965 m
gs 1 -1 sc (i) col0 sh gr
/Times-Roman-iso ff 476.25 scf sf
7290 4185 m
gs 1 -1 sc (d = cos\(  \) [y  - f\(x \)]) col0 sh gr
/Times-Roman-iso ff 317.50 scf sf
9765 4275 m
gs 1 -1 sc (i) col8 sh gr
/Symbol ff 317.50 scf sf
5715 1170 m
gs 1 -1 sc (s) col0 sh gr
/Symbol ff 317.50 scf sf
5670 3825 m
gs 1 -1 sc (a) col0 sh gr
% here ends figure;
$F2psEnd
rs
showpage
%%Trailer
%EOF
