%!PS-Adobe-2.0 EPSF-2.0
%%BoundingBox:  0 0 567 384
%%Title: ./c1.eps: c1
%%Creator: ROOT Version 5.26/00
%%CreationDate: Tue Jan 19 16:57:46 2010
%%EndComments
%%BeginProlog
80 dict begin
/s {stroke} def /l {lineto} def /m {moveto} def /t {translate} def
/sw {stringwidth} def /r {rotate} def /rl {roll}  def /R {repeat} def
/d {rlineto} def /rm {rmoveto} def /gr {grestore} def /f {eofill} def
/c {setrgbcolor} def /black {0 setgray} def /sd {setdash} def
/cl {closepath} def /sf {scalefont setfont} def /lw {setlinewidth} def
/box {m dup 0 exch d exch 0 d 0 exch neg d cl} def
/NC{systemdict begin initclip end}def/C{NC box clip newpath}def
/bl {box s} def /bf {box f} def /Y { 0 exch d} def /X { 0 d} def 
/mp {newpath /y exch def /x exch def} def
/side {[w .77 mul w .23 mul] .385 w mul sd w 0 l currentpoint t -144 r} def
/mr {mp x y w2 0 360 arc} def /m24 {mr s} def /m20 {mr f} def
/mb {mp x y w2 add m w2 neg 0 d 0 w neg d w 0 d 0 w d cl} def
/mt {mp x y w2 add m w2 neg w neg d w 0 d cl} def
/m21 {mb f} def /m25 {mb s} def /m22 {mt f} def /m26{mt s} def
/m23 {mp x y w2 sub m w2 w d w neg 0 d cl f} def
/m27 {mp x y w2 add m w3 neg w2 neg d w3 w2 neg d w3 w2 d cl s} def
/m28 {mp x w2 sub y w2 sub w3 add m w3 0 d  0 w3 neg d w3 0 d 0 w3 d w3 0 d  0 w3 d w3 neg 0 d 0 w3 d w3 neg 0 d
 0 w3 neg d w3 neg 0 d cl s } def
/m29 {mp gsave x w2 sub y w2 add w3 sub m currentpoint t
 4 {side} repeat cl fill gr} def
/m30 {mp gsave x w2 sub y w2 add w3 sub m currentpoint t
 4 {side} repeat cl s gr} def
/m31 {mp x y w2 sub m 0 w d x w2 sub y m w 0 d x w2 sub y w2 add m w w neg d x w2 sub y w2
 sub m w w d s} def
/m2 {mp x y w2 sub m 0 w d x w2 sub y m w 0 d s} def
/m5 {mp x w2 sub y w2 sub m w w d x w2 sub y w2 add m w w neg d s} def
/reEncode {exch findfont dup length dict begin {1 index /FID eq  {pop pop} {def} ifelse } forall /Encoding exch def currentdict end dup /FontName get exch definefont pop } def [/Times-Bold /Times-Italic /Times-BoldItalic /Helvetica
 /Helvetica-Oblique /Helvetica-Bold /Helvetica-BoldOblique /Courier /Courier-Oblique /Courier-Bold /Courier-BoldOblique /Times-Roman /AvantGarde-Book /AvantGarde-BookOblique /AvantGarde-Demi /AvantGarde-DemiOblique /Bookman-Demi
 /Bookman-DemiItalic /Bookman-Light /Bookman-LightItalic /Helvetica-Narrow /Helvetica-Narrow-Bold /Helvetica-Narrow-BoldOblique /Helvetica-Narrow-Oblique /NewCenturySchlbk-Roman /NewCenturySchlbk-Bold
 /NewCenturySchlbk-BoldItalic /NewCenturySchlbk-Italic /Palatino-Bold /Palatino-BoldItalic /Palatino-Italic /Palatino-Roman ] {ISOLatin1Encoding reEncode } forall
/oshow {gsave [] 0 sd true charpath stroke gr} def
/stwn { /fs exch def /fn exch def /text exch def fn findfont fs sf
 text sw pop xs add /xs exch def} def
/stwb { /fs exch def /fn exch def /nbas exch def /textf exch deftextf length /tlen exch def nbas tlen gt {/nbas tlendef} iffn findfont fs sf textf dup length nbas sub nbas getinterval sw
pop neg xs add /xs exch def} def
%%EndProlog
%%BeginSetup
%%EndSetup
newpath  gsave  .25 .25 scale  gsave  0 0 t black[  ] 0 sd 3 lw 1 1 1 c 2268 1538 0 0 bf black 1 1 1 c 1814 1230 227 154 bf black 1814 1230 227 154 bl 1 1 1 c 1814 1230 227 154 bf black 1814 1230 227 154 bl 227 154 m 1814 X s[ 4 8] 0 sd 227 1384 m
 -1230 Y s 408 1384 m -1230 Y s 590 1384 m -1230 Y s 771 1384 m -1230 Y s 952 1384 m -1230 Y s 1134 1384 m -1230 Y s 1315 1384 m -1230 Y s 1497 1384 m -1230 Y s 1678 1384 m -1230 Y s 1860 1384 m -1230 Y s 2041 1384 m -1230 Y s[  ] 0 sd 227 154 m
 1230 Y s[ 4 8] 0 sd 2041 154 m -1814 X s 2041 394 m -1814 X s 2041 634 m -1814 X s 2041 875 m -1814 X s 2041 1115 m -1814 X s 2041 1355 m -1814 X s 2041 1355 m -1814 X s 1 1 1 c[  ] 0 sd 9 lw 0.95 0.95 0.95 c black 1 1 1 c 236 1326 m 18 -58 d 18
 -54 d 18 -52 d 18 -49 d 19 -47 d 18 -44 d 18 -43 d 18 -40 d 18 -38 d 18 -37 d 18 -34 d 19 -33 d 18 -32 d 18 -29 d 18 -29 d 18 -27 d 18 -25 d 18 -25 d 19 -23 d 18 -22 d 18 -21 d 18 -20 d 18 -19 d 18 -18 d 18 -18 d 19 -16 d 18 -15 d 18 -15 d 18 -14 d
 18 -14 d 18 -13 d 18 -12 d 19 -11 d 18 -11 d 18 -11 d 18 -10 d 18 -9 d 18 -9 d 18 -9 d 19 -8 d 18 -7 d 18 -8 d 18 -7 d 18 -6 d 18 -7 d 18 -6 d 19 -5 d 18 -6 d 18 -5 d s 1125 255 m 18 -5 d 18 -5 d 18 -4 d 18 -4 d 18 -4 d 19 -4 d 18 -4 d 18 -3 d 18
 -4 d 18 -3 d 18 -3 d 18 -3 d 19 -2 d 18 -3 d 18 -2 d 18 -3 d 18 -2 d 18 -2 d 18 -2 d 19 -2 d 18 -2 d 18 -2 d 18 -1 d 18 -2 d 18 -1 d 18 -2 d 19 -1 d 18 -1 d 18 -1 d 18 -2 d 18 -1 d 18 -1 d 18 -1 d 19 -1 d 18 -1 d 18 X 18 -1 d 18 -1 d 18 -1 d 18 -1
 d 19 X 18 -1 d 18 X 18 -1 d 18 -1 d 18 X 18 -1 d 37 X s 2014 163 m 18 -1 d s black 3 lw 227 154 m 1814 X s
 gsave  2268 1538 0 0 C 1900 36 t 0 r /Helvetica-Bold findfont 58.6478 sf 0 0 m (2/n_f) show NC gr 
 gsave  2268 1538 0 0 C 1867 36 t 0 r /Symbol findfont 58.6478 sf 0 0 m (c) show NC gr  227 191 m -37 Y s 263 172 m -18 Y s 299 172 m -18 Y s 336 172 m -18 Y s 372 172 m -18 Y s 408 191 m -37 Y s 444 172 m -18 Y s 481 172 m -18 Y s 517 172 m -18 Y s
 553 172 m -18 Y s 590 191 m -37 Y s 626 172 m -18 Y s 662 172 m -18 Y s 698 172 m -18 Y s 735 172 m -18 Y s 771 191 m -37 Y s 807 172 m -18 Y s 844 172 m -18 Y s 880 172 m -18 Y s 916 172 m -18 Y s 952 191 m -37 Y s 989 172 m -18 Y s 1025 172 m -18
 Y s 1061 172 m -18 Y s 1098 172 m -18 Y s 1134 191 m -37 Y s 1170 172 m -18 Y s 1206 172 m -18 Y s 1243 172 m -18 Y s 1279 172 m -18 Y s 1315 191 m -37 Y s 1352 172 m -18 Y s 1388 172 m -18 Y s 1424 172 m -18 Y s 1460 172 m -18 Y s 1497 191 m -37 Y
 s 1533 172 m -18 Y s 1569 172 m -18 Y s 1606 172 m -18 Y s 1642 172 m -18 Y s 1678 191 m -37 Y s 1714 172 m -18 Y s 1751 172 m -18 Y s 1787 172 m -18 Y s 1823 172 m -18 Y s 1860 191 m -37 Y s 1896 172 m -18 Y s 1932 172 m -18 Y s 1968 172 m -18 Y s
 2005 172 m -18 Y s 2041 191 m -37 Y s
 gsave  2268 1538 0 0 C 209 98 t 0 r /Helvetica-Bold findfont 58.6478 sf 0 0 m (0) show NC gr 
 gsave  2268 1538 0 0 C 365 98 t 0 r /Helvetica-Bold findfont 58.6478 sf 0 0 m (0.5) show NC gr 
 gsave  2268 1538 0 0 C 573 98 t 0 r /Helvetica-Bold findfont 58.6478 sf 0 0 m (1) show NC gr 
 gsave  2268 1538 0 0 C 727 98 t 0 r /Helvetica-Bold findfont 58.6478 sf 0 0 m (1.5) show NC gr 
 gsave  2268 1538 0 0 C 935 98 t 0 r /Helvetica-Bold findfont 58.6478 sf 0 0 m (2) show NC gr 
 gsave  2268 1538 0 0 C 1092 98 t 0 r /Helvetica-Bold findfont 58.6478 sf 0 0 m (2.5) show NC gr 
 gsave  2268 1538 0 0 C 1297 98 t 0 r /Helvetica-Bold findfont 58.6478 sf 0 0 m (3) show NC gr 
 gsave  2268 1538 0 0 C 1453 98 t 0 r /Helvetica-Bold findfont 58.6478 sf 0 0 m (3.5) show NC gr 
 gsave  2268 1538 0 0 C 1662 98 t 0 r /Helvetica-Bold findfont 58.6478 sf 0 0 m (4) show NC gr 
 gsave  2268 1538 0 0 C 1815 98 t 0 r /Helvetica-Bold findfont 58.6478 sf 0 0 m (4.5) show NC gr 
 gsave  2268 1538 0 0 C 2023 98 t 0 r /Helvetica-Bold findfont 58.6478 sf 0 0 m (5) show NC gr  227 154 m 1230 Y s
 gsave  2268 1538 0 0 C 101 850 t 90 r /Helvetica-Bold findfont 58.6478 sf 0 0 m (Wahrscheinlichkeit) show NC gr  281 154 m -54 X s 254 214 m -27 X s 254 274 m -27 X s 254 334 m -27 X s 281 394 m -54 X s 254 454 m -27 X s 254 514 m -27 X s 254 574 m
 -27 X s 281 634 m -54 X s 254 694 m -27 X s 254 754 m -27 X s 254 815 m -27 X s 281 875 m -54 X s 254 935 m -27 X s 254 995 m -27 X s 254 1055 m -27 X s 281 1115 m -54 X s 254 1175 m -27 X s 254 1235 m -27 X s 254 1295 m -27 X s 281 1355 m -54 X s
 281 1355 m -54 X s
 gsave  2268 1538 0 0 C 182 134 t 0 r /Helvetica-Bold findfont 58.6478 sf 0 0 m (0) show NC gr 
 gsave  2268 1538 0 0 C 134 371 t 0 r /Helvetica-Bold findfont 58.6478 sf 0 0 m (0.2) show NC gr 
 gsave  2268 1538 0 0 C 134 613 t 0 r /Helvetica-Bold findfont 58.6478 sf 0 0 m (0.4) show NC gr 
 gsave  2268 1538 0 0 C 134 854 t 0 r /Helvetica-Bold findfont 58.6478 sf 0 0 m (0.6) show NC gr 
 gsave  2268 1538 0 0 C 134 1095 t 0 r /Helvetica-Bold findfont 58.6478 sf 0 0 m (0.8) show NC gr 
 gsave  2268 1538 0 0 C 189 1333 t 0 r /Helvetica-Bold findfont 58.6478 sf 0 0 m (1) show NC gr  9 lw 0.95 0.95 0.95 c black 236 1326 m 18 -58 d 18 -54 d 18 -52 d 18 -49 d 19 -47 d 18 -44 d 18 -43 d 18 -40 d 18 -38 d 18 -37 d 18 -34 d 19 -33 d 18
 -32 d 18 -29 d 18 -29 d 18 -27 d 18 -25 d 18 -25 d 19 -23 d 18 -22 d 18 -21 d 18 -20 d 18 -19 d 18 -18 d 18 -18 d 19 -16 d 18 -15 d 18 -15 d 18 -14 d 18 -14 d 18 -13 d 18 -12 d 19 -11 d 18 -11 d 18 -11 d 18 -10 d 18 -9 d 18 -9 d 18 -9 d 19 -8 d 18
 -7 d 18 -8 d 18 -7 d 18 -6 d 18 -7 d 18 -6 d 19 -5 d 18 -6 d 18 -5 d s 1125 255 m 18 -5 d 18 -5 d 18 -4 d 18 -4 d 18 -4 d 19 -4 d 18 -4 d 18 -3 d 18 -4 d 18 -3 d 18 -3 d 18 -3 d 19 -2 d 18 -3 d 18 -2 d 18 -3 d 18 -2 d 18 -2 d 18 -2 d 19 -2 d 18 -2
 d 18 -2 d 18 -1 d 18 -2 d 18 -1 d 18 -2 d 19 -1 d 18 -1 d 18 -1 d 18 -2 d 18 -1 d 18 -1 d 18 -1 d 19 -1 d 18 -1 d 18 X 18 -1 d 18 -1 d 18 -1 d 18 -1 d 19 X 18 -1 d 18 X 18 -1 d 18 -1 d 18 X 18 -1 d 37 X s 2014 163 m 18 -1 d s 1 0 0 c 0.95 0.95 0.95
 c black 1 0 0 c 236 1349 m 18 -26 d 18 -33 d 18 -39 d 18 -41 d 19 -43 d 18 -43 d 18 -44 d 18 -43 d 18 -43 d 18 -41 d 18 -41 d 19 -39 d 18 -38 d 18 -36 d 18 -35 d 18 -34 d 18 -32 d 18 -30 d 19 -30 d 18 -27 d 18 -27 d 18 -25 d 18 -24 d 18 -22 d 18
 -22 d 19 -20 d 18 -19 d 18 -18 d 18 -17 d 18 -16 d 18 -15 d 18 -15 d 19 -13 d 18 -13 d 18 -12 d 18 -11 d 18 -10 d 18 -10 d 18 -10 d 19 -8 d 18 -9 d 18 -7 d 18 -8 d 18 -6 d 18 -7 d 18 -6 d 19 -5 d 18 -6 d 18 -5 d s 1125 225 m 18 -4 d 18 -5 d 18 -4 d
 18 -4 d 18 -3 d 19 -3 d 18 -4 d 18 -3 d 18 -2 d 18 -3 d 18 -2 d 18 -2 d 19 -3 d 18 -2 d 18 -1 d 18 -2 d 18 -2 d 18 -1 d 18 -2 d 19 -1 d 18 -1 d 18 -1 d 18 -1 d 18 -1 d 18 -1 d 18 -1 d 19 -1 d 18 -1 d 18 X 18 -1 d 18 -1 d 18 X 18 -1 d 19 X 18 -1 d
 18 X 18 -1 d 36 X 18 -1 d 37 X 18 -1 d 72 X 19 -1 d 18 X s 2014 156 m 18 X s 0 1 0 c 0.95 0.95 0.95 c black 0 1 0 c 236 1354 m 18 -11 d 18 -20 d 18 -26 d 18 -32 d 19 -37 d 18 -39 d 18 -42 d 18 -43 d 18 -44 d 18 -44 d 18 -44 d 19 -44 d 18 -42 d 18
 -42 d 18 -40 d 18 -39 d 18 -37 d 18 -36 d 19 -34 d 18 -33 d 18 -30 d 18 -30 d 18 -27 d 18 -27 d 18 -24 d 19 -23 d 18 -22 d 18 -21 d 18 -19 d 18 -18 d 18 -17 d 18 -15 d 19 -15 d 18 -13 d 18 -13 d 18 -12 d 18 -11 d 18 -10 d 18 -10 d 19 -9 d 18 -8 d
 18 -7 d 18 -7 d 18 -7 d 18 -6 d 18 -5 d 19 -5 d 18 -5 d 18 -5 d s 1125 204 m 18 -4 d 18 -3 d 18 -4 d 18 -3 d 18 -3 d 19 -3 d 18 -2 d 18 -2 d 18 -3 d 18 -1 d 18 -2 d 18 -2 d 19 -1 d 18 -2 d 18 -1 d 18 -1 d 18 -1 d 18 -1 d 18 -1 d 19 -1 d 18 -1 d 18
 -1 d 18 X 18 -1 d 18 X 18 -1 d 19 X 18 -1 d 36 X 18 -1 d 36 X 19 -1 d 72 X 18 -1 d 164 X 18 -1 d s 2014 154 m 18 X s 0 0 1 c 0.95 0.95 0.95 c black 0 0 1 c 236 1355 m 18 -5 d 18 -11 d 18 -17 d 18 -25 d 19 -30 d 18 -34 d 18 -39 d 18 -41 d 18 -44 d
 18 -45 d 18 -46 d 19 -46 d 18 -46 d 18 -46 d 18 -44 d 18 -44 d 18 -41 d 18 -41 d 19 -38 d 18 -37 d 18 -34 d 18 -33 d 18 -31 d 18 -30 d 18 -27 d 19 -26 d 18 -24 d 18 -22 d 18 -21 d 18 -19 d 18 -18 d 18 -17 d 19 -15 d 18 -14 d 18 -13 d 18 -12 d 18
 -11 d 18 -10 d 18 -9 d 19 -9 d 18 -8 d 18 -7 d 18 -6 d 18 -6 d 18 -6 d 18 -5 d 19 -4 d 18 -4 d 18 -4 d s 1125 190 m 18 -4 d 18 -3 d 18 -2 d 18 -3 d 18 -2 d 19 -2 d 18 -2 d 18 -2 d 18 -2 d 18 -1 d 18 -1 d 18 -2 d 19 -1 d 18 -1 d 18 X 18 -1 d 18 -1 d
 18 -1 d 18 X 19 -1 d 36 X 18 -1 d 18 X 18 -1 d 73 X 18 -1 d 127 X 18 -1 d 200 X s 2014 154 m 18 X s 1 1 0 c 0.95 0.95 0.95 c black 1 1 0 c 236 1355 m 18 -2 d 18 -6 d 18 -11 d 18 -18 d 19 -24 d 18 -30 d 18 -35 d 18 -39 d 18 -42 d 18 -45 d 18 -47 d
 19 -49 d 18 -48 d 18 -49 d 18 -48 d 18 -47 d 18 -46 d 18 -44 d 19 -42 d 18 -41 d 18 -38 d 18 -36 d 18 -34 d 18 -32 d 18 -30 d 19 -28 d 18 -25 d 18 -24 d 18 -22 d 18 -21 d 18 -18 d 18 -17 d 19 -16 d 18 -14 d 18 -13 d 18 -12 d 18 -11 d 18 -10 d 18 -9
 d 19 -8 d 18 -7 d 18 -7 d 18 -5 d 18 -6 d 18 -5 d 18 -4 d 19 -4 d 18 -3 d 18 -3 d s 1125 180 m 18 -3 d 18 -3 d 18 -2 d 18 -2 d 18 -2 d 19 -1 d 18 -2 d 18 -1 d 18 -1 d 18 -1 d 18 -1 d 18 -1 d 19 -1 d 18 X 18 -1 d 18 X 18 -1 d 18 X 18 -1 d 55 X 18 -1
 d 109 X 18 -1 d 345 X s 2014 154 m 18 X s 1 0 1 c 0.95 0.95 0.95 c black 1 0 1 c 236 1355 m 18 -1 d 18 -3 d 18 -7 d 18 -13 d 19 -19 d 18 -25 d 18 -31 d 18 -36 d 18 -41 d 18 -44 d 18 -48 d 19 -49 d 18 -51 d 18 -51 d 18 -51 d 18 -51 d 18 -49 d 18 -48
 d 19 -46 d 18 -44 d 18 -41 d 18 -39 d 18 -37 d 18 -34 d 18 -32 d 19 -30 d 18 -27 d 18 -25 d 18 -23 d 18 -21 d 18 -19 d 18 -17 d 19 -16 d 18 -14 d 18 -13 d 18 -12 d 18 -10 d 18 -10 d 18 -8 d 19 -7 d 18 -7 d 18 -6 d 18 -5 d 18 -5 d 18 -4 d 18 -4 d 19
 -3 d 18 -3 d 18 -3 d s 1125 172 m 18 -2 d 18 -2 d 18 -2 d 18 -1 d 18 -2 d 19 -1 d 18 -1 d 18 -1 d 18 -1 d 18 X 18 -1 d 18 -1 d 37 X 18 -1 d 36 X 18 -1 d 91 X 18 -1 d 454 X s 2014 154 m 18 X s 0 1 1 c 0.95 0.95 0.95 c black 0 1 1 c 236 1355 m 18 X
 18 -2 d 18 -5 d 18 -9 d 19 -15 d 18 -21 d 18 -27 d 18 -33 d 18 -38 d 18 -44 d 18 -47 d 19 -50 d 18 -52 d 18 -54 d 18 -54 d 18 -53 d 18 -53 d 18 -51 d 19 -49 d 18 -47 d 18 -44 d 18 -42 d 18 -39 d 18 -37 d 18 -33 d 19 -31 d 18 -29 d 18 -26 d 18 -24 d
 18 -21 d 18 -19 d 18 -18 d 19 -16 d 18 -14 d 18 -12 d 18 -11 d 18 -10 d 18 -9 d 18 -8 d 19 -7 d 18 -6 d 18 -5 d 18 -5 d 18 -4 d 18 -3 d 18 -4 d 19 -2 d 18 -3 d 18 -2 d s 1125 167 m 18 -2 d 18 -1 d 18 -2 d 18 -1 d 18 -1 d 19 -1 d 18 -1 d 18 X 18 -1
 d 18 X 18 -1 d 37 X 18 -1 d 90 X 19 -1 d 526 X s 2014 154 m 18 X s black[ 12 12] 0 sd 0.95 0.95 0.95 c black 236 1355 m 18 X 18 -1 d 18 -3 d 18 -7 d 19 -11 d 18 -17 d 18 -24 d 18 -30 d 18 -36 d 18 -42 d 18 -47 d 19 -50 d 18 -53 d 18 -56 d 18 -56 d
 18 -56 d 18 -55 d 18 -54 d 19 -53 d 18 -50 d 18 -47 d 18 -44 d 18 -42 d 18 -38 d 18 -35 d 19 -33 d 18 -29 d 18 -27 d 18 -24 d 18 -22 d 18 -20 d 18 -17 d 19 -15 d 18 -14 d 18 -12 d 18 -11 d 18 -9 d 18 -9 d 18 -7 d 19 -6 d 18 -5 d 18 -5 d 18 -4 d 18
 -4 d 18 -3 d 18 -3 d 19 -2 d 18 -2 d 18 -2 d s 1125 163 m 18 -1 d 18 -1 d 18 -1 d 18 -1 d 18 -1 d 19 -1 d 18 X 18 -1 d 36 X 18 -1 d 73 X 18 -1 d 599 X s 2014 154 m 18 X s 1 0 0 c 0.95 0.95 0.95 c black 1 0 0 c 236 1355 m 36 X 18 -2 d 18 -5 d 19 -9
 d 18 -14 d 18 -20 d 18 -27 d 18 -34 d 18 -40 d 18 -46 d 19 -51 d 18 -54 d 18 -56 d 18 -58 d 18 -59 d 18 -58 d 18 -57 d 19 -55 d 18 -53 d 18 -50 d 18 -47 d 18 -43 d 18 -40 d 18 -37 d 19 -34 d 18 -30 d 18 -28 d 18 -24 d 18 -22 d 18 -20 d 18 -17 d 19
 -15 d 18 -13 d 18 -12 d 18 -10 d 18 -9 d 18 -8 d 18 -6 d 19 -6 d 18 -5 d 18 -4 d 18 -3 d 18 -4 d 18 -2 d 18 -2 d 19 -2 d 18 -2 d 18 -1 d s 1125 161 m 18 -1 d 18 -1 d 18 -1 d 18 -1 d 18 X 19 -1 d 18 X 18 -1 d 72 X 19 -1 d 653 X s 2014 154 m 18 X s 0
 1 0 c 0.95 0.95 0.95 c black 0 1 0 c 236 1355 m 36 X 18 -1 d 18 -4 d 19 -6 d 18 -12 d 18 -18 d 18 -24 d 18 -31 d 18 -38 d 18 -45 d 19 -50 d 18 -55 d 18 -58 d 18 -60 d 18 -60 d 18 -61 d 18 -60 d 19 -58 d 18 -55 d 18 -52 d 18 -49 d 18 -46 d 18 -42 d
 18 -38 d 19 -35 d 18 -31 d 18 -28 d 18 -24 d 18 -22 d 18 -20 d 18 -17 d 19 -14 d 18 -13 d 18 -11 d 18 -10 d 18 -8 d 18 -7 d 18 -6 d 19 -5 d 18 -5 d 18 -3 d 18 -4 d 18 -2 d 18 -2 d 18 -2 d 19 -2 d 18 -1 d 18 -1 d s 1125 159 m 18 -1 d 18 -1 d 18 X 18
 -1 d 18 X 19 -1 d 54 X 18 -1 d 708 X s 2014 154 m 18 X s 0 0 1 c 0.95 0.95 0.95 c black 0 0 1 c 236 1355 m 36 X 18 -1 d 18 -2 d 19 -5 d 18 -10 d 18 -15 d 18 -21 d 18 -29 d 18 -37 d 18 -43 d 19 -50 d 18 -54 d 18 -59 d 18 -62 d 18 -63 d 18 -63 d 18
 -62 d 19 -60 d 18 -58 d 18 -55 d 18 -51 d 18 -48 d 18 -43 d 18 -39 d 19 -36 d 18 -32 d 18 -28 d 18 -25 d 18 -22 d 18 -19 d 18 -17 d 19 -14 d 18 -12 d 18 -11 d 18 -9 d 18 -7 d 18 -7 d 18 -5 d 19 -5 d 18 -4 d 18 -3 d 18 -3 d 18 -2 d 18 -2 d 18 -1 d
 19 -2 d 18 -1 d 18 X s 1125 158 m 18 -1 d 18 -1 d 18 X 18 -1 d 55 X 18 -1 d 744 X s 2014 154 m 18 X s 1 1 0 c 0.95 0.95 0.95 c black 1 1 0 c 236 1355 m 54 X 18 -2 d 19 -4 d 18 -8 d 18 -12 d 18 -20 d 18 -26 d 18 -35 d 18 -42 d 19 -49 d 18 -54 d 18
 -60 d 18 -63 d 18 -65 d 18 -65 d 18 -65 d 19 -63 d 18 -60 d 18 -57 d 18 -53 d 18 -49 d 18 -45 d 18 -41 d 19 -36 d 18 -32 d 18 -29 d 18 -25 d 18 -21 d 18 -19 d 18 -17 d 19 -13 d 18 -12 d 18 -10 d 18 -9 d 18 -7 d 18 -6 d 18 -5 d 19 -4 d 18 -3 d 18 -3
 d 18 -2 d 18 -2 d 18 -2 d 18 -1 d 19 -1 d 18 -1 d 18 X s 1125 157 m 18 -1 d 18 X 18 -1 d 36 X 19 -1 d 780 X s 2014 154 m 18 X s 1 0 1 c 0.95 0.95 0.95 c black 1 0 1 c 236 1355 m 54 X 18 -1 d 19 -3 d 18 -6 d 18 -11 d 18 -18 d 18 -24 d 18 -32 d 18
 -41 d 19 -48 d 18 -55 d 18 -60 d 18 -64 d 18 -66 d 18 -68 d 18 -67 d 19 -65 d 18 -63 d 18 -59 d 18 -55 d 18 -51 d 18 -46 d 18 -41 d 19 -38 d 18 -32 d 18 -29 d 18 -25 d 18 -21 d 18 -19 d 18 -16 d 19 -13 d 18 -11 d 18 -10 d 18 -8 d 18 -6 d 18 -6 d 18
 -4 d 19 -4 d 18 -3 d 18 -2 d 18 -2 d 18 -2 d 18 -1 d 18 -1 d 19 -1 d 18 -1 d 18 X s 1125 156 m 18 -1 d 54 X 18 -1 d 799 X s 2014 154 m 18 X s 0 1 1 c 0.95 0.95 0.95 c black 0 1 1 c 236 1355 m 54 X 18 -1 d 19 -2 d 18 -5 d 18 -9 d 18 -16 d 18 -22 d
 18 -30 d 18 -39 d 19 -48 d 18 -54 d 18 -60 d 18 -66 d 18 -68 d 18 -69 d 18 -69 d 19 -68 d 18 -65 d 18 -61 d 18 -57 d 18 -52 d 18 -48 d 18 -42 d 19 -38 d 18 -33 d 18 -29 d 18 -25 d 18 -21 d 18 -18 d 18 -15 d 19 -13 d 18 -11 d 18 -9 d 18 -7 d 18 -6 d
 18 -5 d 18 -4 d 19 -3 d 18 -3 d 18 -2 d 18 -2 d 18 -1 d 18 -1 d 18 -1 d 19 -1 d 18 X 18 -1 d s 1125 155 m 36 X 18 -1 d 835 X s 2014 154 m 18 X s black[ 4 8] 0 sd 0.95 0.95 0.95 c black 236 1355 m 54 X 18 -1 d 19 -1 d 18 -4 d 18 -8 d 18 -14 d 18 -20
 d 18 -29 d 18 -37 d 19 -46 d 18 -54 d 18 -61 d 18 -66 d 18 -70 d 18 -71 d 18 -71 d 19 -70 d 18 -67 d 18 -63 d 18 -59 d 18 -54 d 18 -48 d 18 -44 d 19 -38 d 18 -33 d 18 -29 d 18 -25 d 18 -21 d 18 -17 d 18 -15 d 19 -13 d 18 -10 d 18 -8 d 18 -7 d 18 -6
 d 18 -4 d 18 -4 d 19 -3 d 18 -2 d 18 -2 d 18 -1 d 18 -1 d 18 -1 d 18 -1 d 19 X 18 -1 d 18 X s 1125 155 m 18 X 18 -1 d 853 X s 2014 154 m 18 X s 1 0 0 c 0.95 0.95 0.95 c black 1 0 0 c 236 1355 m 72 X 19 -2 d 18 -3 d 18 -6 d 18 -12 d 18 -19 d 18 -27
 d 18 -36 d 19 -45 d 18 -53 d 18 -61 d 18 -67 d 18 -71 d 18 -73 d 18 -73 d 19 -72 d 18 -69 d 18 -66 d 18 -60 d 18 -55 d 18 -50 d 18 -44 d 19 -39 d 18 -33 d 18 -29 d 18 -24 d 18 -21 d 18 -17 d 18 -15 d 19 -12 d 18 -9 d 18 -8 d 18 -6 d 18 -5 d 18 -5 d
 18 -3 d 19 -2 d 18 -2 d 18 -2 d 18 -1 d 18 -1 d 18 -1 d 18 X 19 -1 d 36 X s 1125 155 m 18 -1 d 871 X s 2014 154 m 18 X s 0 1 0 c 0.95 0.95 0.95 c black 0 1 0 c 236 1355 m 72 X 19 -1 d 18 -3 d 18 -5 d 18 -11 d 18 -17 d 18 -25 d 18 -34 d 19 -44 d 18
 -53 d 18 -61 d 18 -67 d 18 -73 d 18 -74 d 18 -76 d 19 -74 d 18 -71 d 18 -67 d 18 -62 d 18 -57 d 18 -50 d 18 -45 d 19 -39 d 18 -34 d 18 -28 d 18 -25 d 18 -20 d 18 -17 d 18 -14 d 19 -11 d 18 -9 d 18 -7 d 18 -6 d 18 -5 d 18 -4 d 18 -3 d 19 -2 d 18 -2
 d 18 -1 d 18 -1 d 18 -1 d 18 X 18 -1 d 37 X 18 -1 d s 1125 154 m 889 X s 2014 154 m 18 X s 0 0 1 c 0.95 0.95 0.95 c black 0 0 1 c 236 1355 m 72 X 19 -1 d 18 -2 d 18 -5 d 18 -9 d 18 -15 d 18 -24 d 18 -32 d 19 -43 d 18 -52 d 18 -61 d 18 -68 d 18 -74
 d 18 -76 d 18 -77 d 19 -76 d 18 -74 d 18 -68 d 18 -64 d 18 -58 d 18 -51 d 18 -46 d 19 -39 d 18 -34 d 18 -29 d 18 -24 d 18 -19 d 18 -17 d 18 -13 d 19 -11 d 18 -9 d 18 -6 d 18 -6 d 18 -4 d 18 -3 d 18 -3 d 19 -2 d 18 -2 d 18 -1 d 18 -1 d 18 X 18 -1 d
 37 X 18 -1 d 18 X s 1125 154 m 889 X s 2014 154 m 18 X s 1 1 0 c 0.95 0.95 0.95 c black 1 1 0 c 236 1355 m 72 X 19 -1 d 18 -1 d 18 -4 d 18 -8 d 18 -14 d 18 -22 d 18 -31 d 19 -42 d 18 -51 d 18 -61 d 18 -69 d 18 -74 d 18 -78 d 18 -79 d 19 -78 d 18
 -75 d 18 -71 d 18 -65 d 18 -59 d 18 -52 d 18 -46 d 19 -40 d 18 -34 d 18 -28 d 18 -24 d 18 -20 d 18 -15 d 18 -13 d 19 -11 d 18 -8 d 18 -6 d 18 -5 d 18 -4 d 18 -3 d 18 -2 d 19 -2 d 18 -1 d 18 -1 d 18 -1 d 18 -1 d 36 X 19 -1 d 36 X s 1125 154 m 889 X
 s 2014 154 m 18 X s 1 0 1 c 0.95 0.95 0.95 c black 1 0 1 c 236 1355 m 91 X 18 -2 d 18 -3 d 18 -7 d 18 -13 d 18 -20 d 18 -30 d 19 -40 d 18 -51 d 18 -60 d 18 -69 d 18 -76 d 18 -79 d 18 -81 d 19 -80 d 18 -77 d 18 -72 d 18 -67 d 18 -60 d 18 -53 d 18
 -47 d 19 -40 d 18 -34 d 18 -28 d 18 -23 d 18 -19 d 18 -16 d 18 -12 d 19 -10 d 18 -7 d 18 -6 d 18 -5 d 18 -4 d 18 -2 d 18 -2 d 19 -2 d 18 -1 d 18 -1 d 18 -1 d 36 X 18 -1 d 55 X s 1125 154 m 889 X s 2014 154 m 18 X s 0 1 1 c 0.95 0.95 0.95 c black 0
 1 1 c 236 1355 m 91 X 18 -1 d 18 -3 d 18 -6 d 18 -12 d 18 -19 d 18 -28 d 19 -39 d 18 -50 d 18 -60 d 18 -69 d 18 -77 d 18 -81 d 18 -82 d 19 -82 d 18 -79 d 18 -74 d 18 -68 d 18 -61 d 18 -54 d 18 -47 d 19 -40 d 18 -34 d 18 -28 d 18 -23 d 18 -19 d 18
 -15 d 18 -11 d 19 -10 d 18 -7 d 18 -5 d 18 -5 d 18 -3 d 18 -2 d 18 -2 d 19 -2 d 18 -1 d 18 X 18 -1 d 18 X 18 -1 d 73 X s 1125 154 m 889 X s 2014 154 m 18 X s
 gr  gr 
showpage
end
%%EOF
