%!PS-Adobe-2.0 EPSF-2.0
%%BoundingBox:  0 0 567 384
%%Title: ./c1.eps: c1
%%Creator: ROOT Version 5.26/00
%%CreationDate: Tue Jan 19 12:15:07 2010
%%EndComments
%%BeginProlog
80 dict begin
/s {stroke} def /l {lineto} def /m {moveto} def /t {translate} def
/sw {stringwidth} def /r {rotate} def /rl {roll}  def /R {repeat} def
/d {rlineto} def /rm {rmoveto} def /gr {grestore} def /f {eofill} def
/c {setrgbcolor} def /black {0 setgray} def /sd {setdash} def
/cl {closepath} def /sf {scalefont setfont} def /lw {setlinewidth} def
/box {m dup 0 exch d exch 0 d 0 exch neg d cl} def
/NC{systemdict begin initclip end}def/C{NC box clip newpath}def
/bl {box s} def /bf {box f} def /Y { 0 exch d} def /X { 0 d} def 
/mp {newpath /y exch def /x exch def} def
/side {[w .77 mul w .23 mul] .385 w mul sd w 0 l currentpoint t -144 r} def
/mr {mp x y w2 0 360 arc} def /m24 {mr s} def /m20 {mr f} def
/mb {mp x y w2 add m w2 neg 0 d 0 w neg d w 0 d 0 w d cl} def
/mt {mp x y w2 add m w2 neg w neg d w 0 d cl} def
/m21 {mb f} def /m25 {mb s} def /m22 {mt f} def /m26{mt s} def
/m23 {mp x y w2 sub m w2 w d w neg 0 d cl f} def
/m27 {mp x y w2 add m w3 neg w2 neg d w3 w2 neg d w3 w2 d cl s} def
/m28 {mp x w2 sub y w2 sub w3 add m w3 0 d  0 w3 neg d w3 0 d 0 w3 d w3 0 d  0 w3 d w3 neg 0 d 0 w3 d w3 neg 0 d
 0 w3 neg d w3 neg 0 d cl s } def
/m29 {mp gsave x w2 sub y w2 add w3 sub m currentpoint t
 4 {side} repeat cl fill gr} def
/m30 {mp gsave x w2 sub y w2 add w3 sub m currentpoint t
 4 {side} repeat cl s gr} def
/m31 {mp x y w2 sub m 0 w d x w2 sub y m w 0 d x w2 sub y w2 add m w w neg d x w2 sub y w2
 sub m w w d s} def
/m2 {mp x y w2 sub m 0 w d x w2 sub y m w 0 d s} def
/m5 {mp x w2 sub y w2 sub m w w d x w2 sub y w2 add m w w neg d s} def
/reEncode {exch findfont dup length dict begin {1 index /FID eq  {pop pop} {def} ifelse } forall /Encoding exch def currentdict end dup /FontName get exch definefont pop } def [/Times-Bold /Times-Italic /Times-BoldItalic /Helvetica
 /Helvetica-Oblique /Helvetica-Bold /Helvetica-BoldOblique /Courier /Courier-Oblique /Courier-Bold /Courier-BoldOblique /Times-Roman /AvantGarde-Book /AvantGarde-BookOblique /AvantGarde-Demi /AvantGarde-DemiOblique /Bookman-Demi
 /Bookman-DemiItalic /Bookman-Light /Bookman-LightItalic /Helvetica-Narrow /Helvetica-Narrow-Bold /Helvetica-Narrow-BoldOblique /Helvetica-Narrow-Oblique /NewCenturySchlbk-Roman /NewCenturySchlbk-Bold
 /NewCenturySchlbk-BoldItalic /NewCenturySchlbk-Italic /Palatino-Bold /Palatino-BoldItalic /Palatino-Italic /Palatino-Roman ] {ISOLatin1Encoding reEncode } forall
/oshow {gsave [] 0 sd true charpath stroke gr} def
/stwn { /fs exch def /fn exch def /text exch def fn findfont fs sf
 text sw pop xs add /xs exch def} def
/stwb { /fs exch def /fn exch def /nbas exch def /textf exch deftextf length /tlen exch def nbas tlen gt {/nbas tlendef} iffn findfont fs sf textf dup length nbas sub nbas getinterval sw
pop neg xs add /xs exch def} def
%%EndProlog
%%BeginSetup
%%EndSetup
newpath  gsave  .25 .25 scale  gsave  0 0 t black[  ] 0 sd 3 lw 1 1 1 c black 1 1 1 c 1814 1230 227 154 bf 227 154 m 4 4 d 1222 Y 1806 X 4 4 d -1814 X -1230 Y f 1 7.94729e-08 0 c 227 154 m 4 4 d 1806 X 1222 Y 4 4 d -1230 Y -1814 X f black 1814 1230
 227 154 bl 1 1 1 c 1814 1230 227 154 bf 227 154 m 4 4 d 1222 Y 1806 X 4 4 d -1814 X -1230 Y f 1 7.94729e-08 0 c 227 154 m 4 4 d 1806 X 1222 Y 4 4 d -1230 Y -1814 X f black 1814 1230 227 154 bl 227 154 m 1814 X s[ 4 8] 0 sd 227 1384 m -1230 Y s 590
 1384 m -1230 Y s 952 1384 m -1230 Y s 1315 1384 m -1230 Y s 1678 1384 m -1230 Y s 2041 1384 m -1230 Y s[  ] 0 sd 227 154 m 1230 Y s[ 4 8] 0 sd 2041 154 m -1814 X s 2041 279 m -1814 X s 2041 403 m -1814 X s 2041 528 m -1814 X s 2041 653 m -1814 X s
 2041 777 m -1814 X s 2041 902 m -1814 X s 2041 1027 m -1814 X s 2041 1152 m -1814 X s 2041 1276 m -1814 X s 2041 1276 m -1814 X s 1 1 1 c[  ] 0 sd 9 lw 0.95 0.95 0.95 c black 1 1 1 c 236 1326 m 18 -138 d 18 -122 d 18 -107 d 18 -95 d 19 -83 d 18 -74
 d 18 -65 d 18 -57 d 18 -51 d 18 -45 d 18 -39 d 19 -35 d 18 -30 d 18 -28 d 18 -24 d 18 -21 d 18 -18 d 18 -17 d 19 -14 d 18 -13 d 18 -11 d 18 -10 d 18 -9 d 18 -8 d 18 -7 d 19 -6 d 18 -5 d 18 -5 d 18 -4 d 18 -4 d 18 -3 d 18 -3 d 19 -2 d 18 -2 d 18 -2
 d 18 -2 d 18 -2 d 18 -1 d 18 -1 d 19 -1 d 18 -1 d 18 -1 d 18 -1 d 18 X 18 -1 d 18 X 19 -1 d 18 X 18 -1 d s 1125 156 m 54 X 18 -1 d 109 X 18 -1 d 690 X s 2014 154 m 18 X s black 3 lw 227 154 m 1814 X s
 gsave  2268 1538 0 0 C 2007 39 t 0 r /Helvetica-Bold findfont 58.6478 sf 0 0 m (2) show NC gr 
 gsave  2268 1538 0 0 C 1974 39 t 0 r /Symbol findfont 58.6478 sf 0 0 m (c) show NC gr  227 191 m -37 Y s 299 172 m -18 Y s 372 172 m -18 Y s 444 172 m -18 Y s 517 172 m -18 Y s 590 191 m -37 Y s 662 172 m -18 Y s 735 172 m -18 Y s 807 172 m -18 Y s
 880 172 m -18 Y s 952 191 m -37 Y s 1025 172 m -18 Y s 1098 172 m -18 Y s 1170 172 m -18 Y s 1243 172 m -18 Y s 1315 191 m -37 Y s 1388 172 m -18 Y s 1460 172 m -18 Y s 1533 172 m -18 Y s 1606 172 m -18 Y s 1678 191 m -37 Y s 1751 172 m -18 Y s
 1823 172 m -18 Y s 1896 172 m -18 Y s 1968 172 m -18 Y s 2041 191 m -37 Y s
 gsave  2268 1538 0 0 C 209 98 t 0 r /Helvetica-Bold findfont 58.6478 sf 0 0 m (0) show NC gr 
 gsave  2268 1538 0 0 C 570 98 t 0 r /Helvetica-Bold findfont 58.6478 sf 0 0 m (5) show NC gr 
 gsave  2268 1538 0 0 C 919 98 t 0 r /Helvetica-Bold findfont 58.6478 sf 0 0 m (10) show NC gr 
 gsave  2268 1538 0 0 C 1280 98 t 0 r /Helvetica-Bold findfont 58.6478 sf 0 0 m (15) show NC gr 
 gsave  2268 1538 0 0 C 1645 98 t 0 r /Helvetica-Bold findfont 58.6478 sf 0 0 m (20) show NC gr 
 gsave  2268 1538 0 0 C 2007 98 t 0 r /Helvetica-Bold findfont 58.6478 sf 0 0 m (25) show NC gr  227 154 m 1230 Y s
 gsave  2268 1538 0 0 C 98 1176 t 90 r /Helvetica-Bold findfont 58.6478 sf 0 0 m (2_prob.) show NC gr 
 gsave  2268 1538 0 0 C 98 1144 t 90 r /Symbol findfont 58.6478 sf 0 0 m (c) show NC gr  281 154 m -54 X s 254 179 m -27 X s 254 204 m -27 X s 254 229 m -27 X s 254 254 m -27 X s 281 279 m -54 X s 254 303 m -27 X s 254 328 m -27 X s 254 353 m -27 X
 s 254 378 m -27 X s 281 403 m -54 X s 254 428 m -27 X s 254 453 m -27 X s 254 478 m -27 X s 254 503 m -27 X s 281 528 m -54 X s 254 553 m -27 X s 254 578 m -27 X s 254 603 m -27 X s 254 628 m -27 X s 281 653 m -54 X s 254 678 m -27 X s 254 703 m
 -27 X s 254 728 m -27 X s 254 752 m -27 X s 281 777 m -54 X s 254 802 m -27 X s 254 827 m -27 X s 254 852 m -27 X s 254 877 m -27 X s 281 902 m -54 X s 254 927 m -27 X s 254 952 m -27 X s 254 977 m -27 X s 254 1002 m -27 X s 281 1027 m -54 X s 254
 1052 m -27 X s 254 1077 m -27 X s 254 1102 m -27 X s 254 1127 m -27 X s 281 1152 m -54 X s 254 1177 m -27 X s 254 1202 m -27 X s 254 1226 m -27 X s 254 1251 m -27 X s 281 1276 m -54 X s 281 1276 m -54 X s 254 1301 m -27 X s 254 1326 m -27 X s 254
 1351 m -27 X s 254 1376 m -27 X s
 gsave  2268 1538 0 0 C 182 134 t 0 r /Helvetica-Bold findfont 58.6478 sf 0 0 m (0) show NC gr 
 gsave  2268 1538 0 0 C 140 257 t 0 r /Helvetica-Bold findfont 58.6478 sf 0 0 m (0.1) show NC gr 
 gsave  2268 1538 0 0 C 134 381 t 0 r /Helvetica-Bold findfont 58.6478 sf 0 0 m (0.2) show NC gr 
 gsave  2268 1538 0 0 C 134 508 t 0 r /Helvetica-Bold findfont 58.6478 sf 0 0 m (0.3) show NC gr 
 gsave  2268 1538 0 0 C 134 632 t 0 r /Helvetica-Bold findfont 58.6478 sf 0 0 m (0.4) show NC gr 
 gsave  2268 1538 0 0 C 134 756 t 0 r /Helvetica-Bold findfont 58.6478 sf 0 0 m (0.5) show NC gr 
 gsave  2268 1538 0 0 C 134 880 t 0 r /Helvetica-Bold findfont 58.6478 sf 0 0 m (0.6) show NC gr 
 gsave  2268 1538 0 0 C 134 1007 t 0 r /Helvetica-Bold findfont 58.6478 sf 0 0 m (0.7) show NC gr 
 gsave  2268 1538 0 0 C 134 1131 t 0 r /Helvetica-Bold findfont 58.6478 sf 0 0 m (0.8) show NC gr 
 gsave  2268 1538 0 0 C 134 1254 t 0 r /Helvetica-Bold findfont 58.6478 sf 0 0 m (0.9) show NC gr  9 lw 0.95 0.95 0.95 c black 236 1326 m 18 -138 d 18 -122 d 18 -107 d 18 -95 d 19 -83 d 18 -74 d 18 -65 d 18 -57 d 18 -51 d 18 -45 d 18 -39 d 19 -35 d
 18 -30 d 18 -28 d 18 -24 d 18 -21 d 18 -18 d 18 -17 d 19 -14 d 18 -13 d 18 -11 d 18 -10 d 18 -9 d 18 -8 d 18 -7 d 19 -6 d 18 -5 d 18 -5 d 18 -4 d 18 -4 d 18 -3 d 18 -3 d 19 -2 d 18 -2 d 18 -2 d 18 -2 d 18 -2 d 18 -1 d 18 -1 d 19 -1 d 18 -1 d 18 -1
 d 18 -1 d 18 X 18 -1 d 18 X 19 -1 d 18 X 18 -1 d s 1125 156 m 54 X 18 -1 d 109 X 18 -1 d 690 X s 2014 154 m 18 X s 1 0 0 c 0.95 0.95 0.95 c black 1 0 0 c 236 1384 m 18 -51 d 18 -68 d 18 -74 d 18 -76 d 19 -74 d 18 -72 d 18 -68 d 18 -65 d 18 -61 d 18
 -56 d 18 -52 d 19 -48 d 18 -44 d 18 -41 d 18 -37 d 18 -34 d 18 -30 d 18 -28 d 19 -25 d 18 -23 d 18 -21 d 18 -18 d 18 -17 d 18 -15 d 18 -14 d 19 -12 d 18 -11 d 18 -10 d 18 -9 d 18 -8 d 18 -8 d 18 -6 d 19 -6 d 18 -5 d 18 -5 d 18 -4 d 18 -3 d 18 -4 d
 18 -3 d 19 -2 d 18 -3 d 18 -2 d 18 -2 d 18 -1 d 18 -2 d 18 -1 d 19 -1 d 18 -2 d 18 X s 1125 162 m 18 -1 d 18 -1 d 18 -1 d 18 X 18 -1 d 19 X 18 -1 d 18 X 18 -1 d 54 X 19 -1 d 127 X 18 -1 d 508 X s 2014 154 m 18 X s 0 1 0 c 0.95 0.95 0.95 c black 0 1
 0 c 236 1384 m 18 -2 d 18 -31 d 18 -40 d 18 -47 d 19 -52 d 18 -55 d 18 -57 d 18 -57 d 18 -57 d 18 -56 d 18 -54 d 19 -52 d 18 -50 d 18 -48 d 18 -44 d 18 -43 d 18 -39 d 18 -37 d 19 -35 d 18 -32 d 18 -29 d 18 -28 d 18 -25 d 18 -23 d 18 -22 d 19 -19 d
 18 -18 d 18 -17 d 18 -15 d 18 -14 d 18 -12 d 18 -12 d 19 -10 d 18 -9 d 18 -9 d 18 -8 d 18 -7 d 18 -6 d 18 -6 d 19 -5 d 18 -5 d 18 -4 d 18 -4 d 18 -4 d 18 -3 d 18 -3 d 19 -2 d 18 -3 d 18 -2 d s 1125 172 m 18 -2 d 18 -1 d 18 -2 d 18 -1 d 18 -1 d 19
 -2 d 18 -1 d 18 X 18 -1 d 18 -1 d 18 -1 d 18 X 19 -1 d 18 X 18 -1 d 36 X 18 -1 d 55 X 18 -1 d 127 X 18 -1 d 345 X s 2014 154 m 18 X s 0 0 1 c 0.95 0.95 0.95 c black 0 0 1 c 272 1384 m 18 -18 d 18 -25 d 19 -31 d 18 -36 d 18 -40 d 18 -43 d 18 -45 d
 18 -47 d 18 -48 d 19 -48 d 18 -48 d 18 -47 d 18 -46 d 18 -45 d 18 -44 d 18 -41 d 19 -40 d 18 -38 d 18 -36 d 18 -35 d 18 -32 d 18 -30 d 18 -29 d 19 -26 d 18 -25 d 18 -23 d 18 -22 d 18 -20 d 18 -19 d 18 -17 d 19 -16 d 18 -14 d 18 -14 d 18 -12 d 18
 -12 d 18 -10 d 18 -10 d 19 -9 d 18 -8 d 18 -7 d 18 -7 d 18 -6 d 18 -6 d 18 -5 d 19 -5 d 18 -4 d 18 -4 d 18 -3 d 18 -4 d s 1161 184 m 18 -2 d 18 -3 d 18 -3 d 19 -2 d 18 -2 d 18 -2 d 18 -1 d 18 -2 d 18 -1 d 18 -1 d 19 -1 d 18 -1 d 18 -1 d 18 -1 d 18
 -1 d 18 X 18 -1 d 19 X 18 -1 d 18 X 18 -1 d 36 X 18 -1 d 55 X 18 -1 d 127 X 18 -1 d 218 X s 1 1 0 c 0.95 0.95 0.95 c black 1 1 0 c 290 1384 m 18 -7 d 19 -17 d 18 -20 d 18 -25 d 18 -29 d 18 -32 d 18 -35 d 18 -37 d 19 -39 d 18 -41 d 18 -41 d 18 -42 d
 18 -42 d 18 -42 d 18 -42 d 19 -41 d 18 -40 d 18 -39 d 18 -37 d 18 -37 d 18 -35 d 18 -33 d 19 -32 d 18 -30 d 18 -29 d 18 -28 d 18 -25 d 18 -25 d 18 -22 d 19 -22 d 18 -20 d 18 -19 d 18 -17 d 18 -17 d 18 -15 d 18 -14 d 19 -13 d 18 -12 d 18 -12 d 18
 -10 d 18 -10 d 18 -9 d 18 -8 d 19 -7 d 18 -7 d 18 -7 d 18 -6 d 18 -5 d 18 -5 d s 1179 205 m 18 -4 d 18 -5 d 19 -3 d 18 -4 d 18 -3 d 18 -3 d 18 -3 d 18 -2 d 18 -2 d 19 -2 d 18 -2 d 18 -2 d 18 -1 d 18 -2 d 18 -1 d 18 -1 d 19 -1 d 18 -1 d 18 -1 d 18
 -1 d 18 -1 d 18 X 18 -1 d 19 X 18 -1 d 18 X 18 -1 d 36 X 18 -1 d 73 X 18 -1 d 127 X 18 -1 d 73 X s 1 0 1 c 0.95 0.95 0.95 c black 1 0 1 c 308 1384 m 19 X 18 -11 d 18 -14 d 18 -17 d 18 -20 d 18 -24 d 18 -26 d 19 -29 d 18 -31 d 18 -33 d 18 -35 d 18
 -36 d 18 -37 d 18 -37 d 19 -38 d 18 -38 d 18 -38 d 18 -38 d 18 -37 d 18 -36 d 18 -36 d 19 -34 d 18 -34 d 18 -32 d 18 -32 d 18 -30 d 18 -28 d 18 -28 d 19 -26 d 18 -25 d 18 -24 d 18 -22 d 18 -21 d 18 -20 d 18 -19 d 19 -18 d 18 -16 d 18 -16 d 18 -14 d
 18 -14 d 18 -13 d 18 -12 d 19 -11 d 18 -10 d 18 -9 d 18 -9 d 18 -8 d 18 -8 d 18 -7 d s 1197 233 m 18 -7 d 19 -6 d 18 -5 d 18 -5 d 18 -5 d 18 -4 d 18 -4 d 18 -4 d 19 -3 d 18 -3 d 18 -3 d 18 -3 d 18 -2 d 18 -2 d 18 -2 d 19 -2 d 18 -2 d 18 -2 d 18 -1
 d 18 -1 d 18 -1 d 18 -2 d 19 X 18 -1 d 18 -1 d 18 -1 d 18 -1 d 18 X 18 -1 d 19 X 18 -1 d 18 X 18 -1 d 54 X 19 -1 d 54 X 18 -1 d 91 X s 0 1 1 c 0.95 0.95 0.95 c black 0 1 1 c 345 1384 m 18 -2 d 18 -10 d 18 -12 d 18 -14 d 18 -17 d 19 -20 d 18 -22 d
 18 -24 d 18 -26 d 18 -28 d 18 -30 d 18 -31 d 19 -33 d 18 -33 d 18 -34 d 18 -35 d 18 -34 d 18 -35 d 18 -35 d 19 -35 d 18 -34 d 18 -34 d 18 -33 d 18 -32 d 18 -31 d 18 -31 d 19 -29 d 18 -29 d 18 -27 d 18 -26 d 18 -25 d 18 -25 d 18 -23 d 19 -21 d 18
 -21 d 18 -20 d 18 -19 d 18 -17 d 18 -17 d 18 -16 d 19 -15 d 18 -13 d 18 -14 d 18 -12 d 18 -11 d 18 -11 d 18 -10 d 18 -9 d 19 -9 d s 1234 260 m 18 -8 d 18 -8 d 18 -7 d 18 -6 d 18 -6 d 18 -6 d 19 -5 d 18 -5 d 18 -5 d 18 -4 d 18 -3 d 18 -4 d 18 -3 d
 19 -3 d 18 -3 d 18 -3 d 18 -2 d 18 -2 d 18 -2 d 18 -2 d 19 -1 d 18 -2 d 18 -1 d 18 -2 d 18 -1 d 18 -1 d 18 -1 d 19 -1 d 18 -1 d 18 X 18 -1 d 18 -1 d 18 X 18 -1 d 19 X 18 -1 d 18 X 18 -1 d 54 X 19 -1 d 36 X s black[ 12 12] 0 sd 0.95 0.95 0.95 c
 black 381 1384 m 18 -3 d 18 -8 d 18 -11 d 19 -12 d 18 -14 d 18 -17 d 18 -18 d 18 -21 d 18 -22 d 18 -24 d 19 -26 d 18 -27 d 18 -29 d 18 -29 d 18 -31 d 18 -31 d 18 -32 d 19 -32 d 18 -32 d 18 -33 d 18 -32 d 18 -32 d 18 -32 d 18 -32 d 19 -31 d 18 -30 d
 18 -29 d 18 -29 d 18 -28 d 18 -27 d 18 -26 d 19 -26 d 18 -24 d 18 -23 d 18 -23 d 18 -21 d 18 -20 d 18 -20 d 19 -18 d 18 -18 d 18 -17 d 18 -15 d 18 -15 d 18 -14 d 18 -14 d 18 -12 d 19 -12 d 18 -11 d 18 -11 d s 1270 290 m 18 -9 d 18 -9 d 18 -9 d 18
 -8 d 19 -7 d 18 -7 d 18 -7 d 18 -6 d 18 -6 d 18 -5 d 18 -5 d 19 -4 d 18 -5 d 18 -3 d 18 -4 d 18 -3 d 18 -4 d 18 -2 d 19 -3 d 18 -3 d 18 -2 d 18 -2 d 18 -2 d 18 -2 d 18 -1 d 19 -2 d 18 -1 d 18 -1 d 18 -2 d 18 -1 d 18 -1 d 18 -1 d 19 X 18 -1 d 18 -1
 d 18 X 18 -1 d 18 -1 d 18 X 19 -1 d 36 X s 1 0 0 c 0.95 0.95 0.95 c black 1 0 0 c 417 1384 m 18 -3 d 19 -7 d 18 -9 d 18 -10 d 18 -13 d 18 -14 d 18 -16 d 18 -17 d 19 -19 d 18 -21 d 18 -23 d 18 -23 d 18 -25 d 18 -27 d 18 -27 d 19 -28 d 18 -29 d 18
 -29 d 18 -30 d 18 -30 d 18 -31 d 18 -30 d 19 -30 d 18 -31 d 18 -30 d 18 -29 d 18 -29 d 18 -29 d 18 -28 d 19 -27 d 18 -27 d 18 -26 d 18 -25 d 18 -24 d 18 -24 d 18 -22 d 19 -22 d 18 -21 d 18 -20 d 18 -19 d 18 -18 d 18 -18 d 18 -16 d 18 -16 d 19 -15 d
 18 -14 d 18 -14 d 18 -13 d 18 -12 d s 1306 324 m 18 -11 d 18 -11 d 19 -10 d 18 -9 d 18 -9 d 18 -9 d 18 -8 d 18 -7 d 18 -7 d 19 -6 d 18 -6 d 18 -6 d 18 -5 d 18 -5 d 18 -5 d 18 -4 d 19 -4 d 18 -4 d 18 -3 d 18 -3 d 18 -3 d 18 -3 d 18 -2 d 19 -3 d 18
 -2 d 18 -2 d 18 -2 d 18 -2 d 18 -1 d 18 -2 d 19 -1 d 18 -1 d 18 -1 d 18 -1 d 18 -1 d 18 -1 d 18 -1 d 19 -1 d 18 -1 d 18 X s 0 1 0 c 0.95 0.95 0.95 c black 0 1 0 c 454 1384 m 18 -2 d 18 -6 d 18 -8 d 18 -9 d 18 -11 d 18 -12 d 19 -13 d 18 -16 d 18 -16
 d 18 -18 d 18 -20 d 18 -20 d 18 -23 d 19 -23 d 18 -24 d 18 -25 d 18 -26 d 18 -27 d 18 -28 d 18 -28 d 19 -28 d 18 -28 d 18 -29 d 18 -29 d 18 -29 d 18 -28 d 18 -29 d 19 -28 d 18 -27 d 18 -28 d 18 -26 d 18 -26 d 18 -26 d 18 -25 d 19 -24 d 18 -23 d 18
 -23 d 18 -22 d 18 -21 d 18 -20 d 18 -20 d 18 -19 d 19 -18 d 18 -17 d 18 -17 d 18 -15 d 18 -15 d 18 -15 d 18 -13 d s 1342 361 m 19 -13 d 18 -12 d 18 -12 d 18 -11 d 18 -10 d 18 -10 d 18 -9 d 19 -9 d 18 -8 d 18 -8 d 18 -7 d 18 -7 d 18 -6 d 18 -6 d 19
 -6 d 18 -5 d 18 -5 d 18 -4 d 18 -5 d 18 -4 d 18 -3 d 19 -4 d 18 -3 d 18 -3 d 18 -3 d 18 -3 d 18 -2 d 18 -2 d 19 -2 d 18 -2 d 18 -2 d 18 -2 d 18 -1 d 18 -2 d 18 -1 d 19 -1 d 18 -1 d 18 -1 d s 0 0 1 c 0.95 0.95 0.95 c black 0 0 1 c 490 1384 m 18 -1 d
 18 -6 d 18 -6 d 18 -8 d 19 -9 d 18 -11 d 18 -11 d 18 -14 d 18 -14 d 18 -16 d 18 -17 d 19 -18 d 18 -19 d 18 -21 d 18 -22 d 18 -22 d 18 -24 d 18 -24 d 19 -25 d 18 -26 d 18 -26 d 18 -27 d 18 -27 d 18 -27 d 18 -27 d 19 -28 d 18 -27 d 18 -27 d 18 -27 d
 18 -27 d 18 -26 d 18 -26 d 19 -26 d 18 -25 d 18 -24 d 18 -24 d 18 -24 d 18 -22 d 18 -22 d 18 -21 d 19 -21 d 18 -20 d 18 -19 d 18 -19 d 18 -17 d 18 -18 d 18 -16 d 19 -16 d 18 -14 d s 1379 400 m 18 -15 d 18 -13 d 18 -13 d 18 -13 d 18 -11 d 19 -12 d
 18 -10 d 18 -10 d 18 -10 d 18 -9 d 18 -8 d 18 -8 d 19 -7 d 18 -8 d 18 -6 d 18 -7 d 18 -5 d 18 -6 d 18 -5 d 19 -5 d 18 -5 d 18 -4 d 18 -4 d 18 -4 d 18 -3 d 18 -3 d 19 -3 d 18 -3 d 18 -3 d 18 -2 d 18 -3 d 18 -2 d 18 -2 d 19 -2 d 18 -1 d 18 -2 d s 1 1
 0 c 0.95 0.95 0.95 c black 1 1 0 c 544 1384 m 18 -5 d 19 -6 d 18 -6 d 18 -8 d 18 -9 d 18 -11 d 18 -11 d 18 -12 d 19 -14 d 18 -15 d 18 -16 d 18 -17 d 18 -19 d 18 -19 d 18 -20 d 19 -22 d 18 -22 d 18 -22 d 18 -24 d 18 -24 d 18 -25 d 18 -25 d 19 -25 d
 18 -26 d 18 -26 d 18 -26 d 18 -26 d 18 -26 d 18 -26 d 19 -26 d 18 -26 d 18 -25 d 18 -25 d 18 -25 d 18 -24 d 18 -23 d 18 -23 d 19 -23 d 18 -22 d 18 -21 d 18 -21 d 18 -20 d 18 -20 d 18 -18 d 19 -18 d 18 -18 d 18 -17 d 18 -16 d 18 -16 d s 1433 424 m
 18 -14 d 18 -15 d 19 -13 d 18 -13 d 18 -13 d 18 -12 d 18 -11 d 18 -11 d 18 -10 d 19 -9 d 18 -10 d 18 -8 d 18 -9 d 18 -7 d 18 -8 d 18 -7 d 19 -6 d 18 -6 d 18 -6 d 18 -6 d 18 -5 d 18 -5 d 18 -4 d 19 -4 d 18 -4 d 18 -4 d 18 -4 d 18 -3 d 18 -3 d 18 -3
 d 19 -2 d 18 -3 d 18 -2 d s 1 0 1 c 0.95 0.95 0.95 c black 1 0 1 c 581 1384 m 18 -3 d 18 -5 d 18 -6 d 18 -7 d 18 -8 d 18 -9 d 19 -10 d 18 -10 d 18 -13 d 18 -13 d 18 -14 d 18 -15 d 18 -16 d 19 -17 d 18 -19 d 18 -19 d 18 -20 d 18 -21 d 18 -21 d 18
 -22 d 19 -23 d 18 -23 d 18 -24 d 18 -24 d 18 -25 d 18 -25 d 18 -24 d 19 -25 d 18 -26 d 18 -25 d 18 -24 d 18 -25 d 18 -25 d 18 -24 d 18 -24 d 19 -24 d 18 -23 d 18 -23 d 18 -22 d 18 -22 d 18 -21 d 18 -21 d 19 -20 d 18 -20 d 18 -19 d 18 -18 d 18 -18 d
 18 -17 d 18 -17 d s 1469 465 m 19 -16 d 18 -15 d 18 -15 d 18 -14 d 18 -14 d 18 -13 d 18 -12 d 19 -12 d 18 -12 d 18 -11 d 18 -10 d 18 -10 d 18 -9 d 18 -9 d 19 -8 d 18 -8 d 18 -8 d 18 -7 d 18 -7 d 18 -6 d 18 -6 d 19 -6 d 18 -5 d 18 -6 d 18 -4 d 18 -5
 d 18 -4 d 18 -4 d 19 -4 d 18 -3 d 18 -4 d s 0 1 1 c 0.95 0.95 0.95 c black 0 1 1 c 617 1384 m 18 -1 d 18 -5 d 18 -5 d 18 -6 d 19 -7 d 18 -8 d 18 -8 d 18 -10 d 18 -10 d 18 -12 d 18 -12 d 19 -14 d 18 -14 d 18 -16 d 18 -16 d 18 -17 d 18 -18 d 18 -19 d
 19 -20 d 18 -20 d 18 -21 d 18 -22 d 18 -22 d 18 -22 d 18 -23 d 19 -24 d 18 -23 d 18 -24 d 18 -24 d 18 -24 d 18 -24 d 18 -24 d 18 -24 d 19 -24 d 18 -24 d 18 -23 d 18 -23 d 18 -23 d 18 -22 d 18 -22 d 19 -22 d 18 -21 d 18 -21 d 18 -20 d 18 -20 d 18
 -19 d 18 -19 d 19 -18 d 18 -17 d s 1506 507 m 18 -17 d 18 -17 d 18 -16 d 18 -15 d 18 -14 d 19 -15 d 18 -13 d 18 -13 d 18 -13 d 18 -12 d 18 -11 d 18 -11 d 19 -11 d 18 -9 d 18 -10 d 18 -9 d 18 -9 d 18 -8 d 18 -8 d 19 -7 d 18 -7 d 18 -7 d 18 -6 d 18
 -6 d 18 -5 d 18 -6 d 19 -5 d 18 -4 d 18 -5 d s black[ 4 8] 0 sd 0.95 0.95 0.95 c black 671 1384 m 18 -3 d 19 -5 d 18 -5 d 18 -6 d 18 -7 d 18 -8 d 18 -8 d 18 -9 d 19 -11 d 18 -11 d 18 -12 d 18 -12 d 18 -14 d 18 -15 d 18 -15 d 19 -17 d 18 -17 d 18
 -17 d 18 -19 d 18 -19 d 18 -20 d 18 -21 d 19 -21 d 18 -21 d 18 -22 d 18 -22 d 18 -23 d 18 -23 d 18 -23 d 18 -23 d 19 -23 d 18 -23 d 18 -23 d 18 -23 d 18 -23 d 18 -23 d 18 -23 d 19 -22 d 18 -22 d 18 -22 d 18 -21 d 18 -22 d 18 -20 d 18 -20 d 19 -20 d
 18 -19 d 18 -19 d 18 -18 d 18 -18 d s 1560 531 m 18 -17 d 18 -17 d 19 -16 d 18 -16 d 18 -15 d 18 -14 d 18 -14 d 18 -14 d 18 -13 d 19 -13 d 18 -11 d 18 -12 d 18 -11 d 18 -11 d 18 -10 d 18 -9 d 19 -9 d 18 -9 d 18 -8 d 18 -8 d 18 -8 d 18 -7 d 18 -7 d
 19 -6 d 18 -7 d 18 -5 d s 1 0 0 c 0.95 0.95 0.95 c black 1 0 0 c 708 1384 m 18 -1 d 18 -5 d 18 -4 d 18 -5 d 18 -6 d 18 -7 d 19 -7 d 18 -9 d 18 -9 d 18 -9 d 18 -11 d 18 -11 d 18 -13 d 19 -13 d 18 -14 d 18 -14 d 18 -16 d 18 -16 d 18 -17 d 18 -18 d 19
 -18 d 18 -19 d 18 -19 d 18 -20 d 18 -21 d 18 -20 d 18 -22 d 18 -21 d 19 -22 d 18 -22 d 18 -22 d 18 -23 d 18 -22 d 18 -23 d 18 -22 d 19 -23 d 18 -22 d 18 -22 d 18 -22 d 18 -21 d 18 -22 d 18 -21 d 19 -21 d 18 -20 d 18 -20 d 18 -20 d 18 -19 d 18 -19 d
 18 -18 d s 1596 573 m 19 -18 d 18 -18 d 18 -17 d 18 -16 d 18 -16 d 18 -16 d 18 -14 d 19 -15 d 18 -14 d 18 -13 d 18 -13 d 18 -13 d 18 -12 d 18 -11 d 19 -11 d 18 -11 d 18 -10 d 18 -10 d 18 -9 d 18 -9 d 18 -8 d 19 -9 d 18 -7 d 18 -8 d s 0 1 0 c 0.95
 0.95 0.95 c black 0 1 0 c 762 1384 m 18 -3 d 18 -4 d 18 -5 d 19 -5 d 18 -6 d 18 -7 d 18 -7 d 18 -8 d 18 -8 d 18 -10 d 19 -10 d 18 -11 d 18 -12 d 18 -12 d 18 -13 d 18 -14 d 18 -15 d 19 -16 d 18 -16 d 18 -16 d 18 -18 d 18 -18 d 18 -18 d 18 -19 d 18
 -20 d 19 -20 d 18 -20 d 18 -21 d 18 -21 d 18 -21 d 18 -21 d 18 -22 d 19 -22 d 18 -21 d 18 -22 d 18 -22 d 18 -21 d 18 -22 d 18 -21 d 19 -22 d 18 -21 d 18 -21 d 18 -20 d 18 -20 d 18 -20 d 18 -20 d 19 -19 d 18 -19 d 18 -18 d s 1651 596 m 18 -18 d 18
 -18 d 18 -17 d 18 -17 d 19 -16 d 18 -16 d 18 -15 d 18 -15 d 18 -14 d 18 -14 d 18 -13 d 19 -13 d 18 -12 d 18 -12 d 18 -12 d 18 -11 d 18 -11 d 18 -10 d 19 -10 d 18 -9 d 18 -9 d s 0 0 1 c 0.95 0.95 0.95 c black 0 0 1 c 798 1384 m 18 -1 d 19 -4 d 18 -4
 d 18 -4 d 18 -6 d 18 -5 d 18 -7 d 18 -7 d 19 -8 d 18 -8 d 18 -9 d 18 -10 d 18 -10 d 18 -11 d 18 -12 d 19 -13 d 18 -13 d 18 -14 d 18 -15 d 18 -15 d 18 -16 d 18 -17 d 18 -17 d 19 -18 d 18 -18 d 18 -19 d 18 -19 d 18 -19 d 18 -20 d 18 -20 d 19 -20 d 18
 -21 d 18 -21 d 18 -21 d 18 -21 d 18 -21 d 18 -21 d 19 -21 d 18 -21 d 18 -21 d 18 -21 d 18 -21 d 18 -20 d 18 -20 d 19 -20 d 18 -20 d 18 -20 d 18 -19 d 18 -18 d s 1687 637 m 18 -19 d 18 -18 d 19 -17 d 18 -18 d 18 -17 d 18 -16 d 18 -16 d 18 -15 d 18
 -15 d 19 -15 d 18 -14 d 18 -14 d 18 -13 d 18 -13 d 18 -13 d 18 -11 d 19 -12 d 18 -11 d 18 -11 d s 1 1 0 c 0.95 0.95 0.95 c black 1 1 0 c 853 1384 m 18 -2 d 18 -4 d 18 -4 d 18 -5 d 18 -5 d 19 -6 d 18 -6 d 18 -7 d 18 -7 d 18 -8 d 18 -9 d 18 -9 d 19
 -10 d 18 -11 d 18 -11 d 18 -13 d 18 -12 d 18 -14 d 18 -14 d 18 -14 d 19 -16 d 18 -15 d 18 -17 d 18 -17 d 18 -17 d 18 -18 d 18 -18 d 19 -19 d 18 -19 d 18 -19 d 18 -20 d 18 -20 d 18 -20 d 18 -20 d 19 -20 d 18 -21 d 18 -20 d 18 -21 d 18 -20 d 18 -21 d
 18 -20 d 19 -20 d 18 -21 d 18 -20 d 18 -19 d 18 -20 d 18 -19 d 18 -19 d 19 -19 d s 1742 658 m 18 -18 d 18 -18 d 18 -18 d 18 -17 d 18 -17 d 18 -16 d 19 -17 d 18 -15 d 18 -16 d 18 -14 d 18 -15 d 18 -14 d 18 -14 d 19 -13 d 18 -13 d 18 -12 d s 1 0 1 c
 0.95 0.95 0.95 c black 1 0 1 c 889 1384 m 18 X 18 -4 d 18 -3 d 19 -4 d 18 -5 d 18 -5 d 18 -5 d 18 -6 d 18 -7 d 18 -7 d 19 -8 d 18 -9 d 18 -9 d 18 -9 d 18 -11 d 18 -10 d 18 -12 d 18 -12 d 19 -13 d 18 -13 d 18 -14 d 18 -15 d 18 -15 d 18 -16 d 18 -16
 d 19 -16 d 18 -18 d 18 -17 d 18 -18 d 18 -18 d 18 -19 d 18 -19 d 19 -19 d 18 -19 d 18 -20 d 18 -20 d 18 -19 d 18 -20 d 18 -20 d 19 -20 d 18 -20 d 18 -20 d 18 -20 d 18 -20 d 18 -20 d 18 -19 d 19 -19 d 18 -19 d 18 -19 d s 1778 698 m 18 -19 d 18 -18 d
 18 -18 d 18 -18 d 19 -17 d 18 -17 d 18 -16 d 18 -17 d 18 -16 d 18 -15 d 18 -15 d 19 -15 d 18 -14 d 18 -14 d s 0 1 1 c 0.95 0.95 0.95 c black 0 1 1 c 943 1384 m 19 -1 d 18 -4 d 18 -3 d 18 -4 d 18 -5 d 18 -5 d 18 -5 d 19 -6 d 18 -6 d 18 -7 d 18 -8 d
 18 -8 d 18 -9 d 18 -9 d 18 -10 d 19 -10 d 18 -11 d 18 -12 d 18 -12 d 18 -13 d 18 -14 d 18 -13 d 19 -15 d 18 -15 d 18 -15 d 18 -16 d 18 -17 d 18 -17 d 18 -17 d 19 -17 d 18 -18 d 18 -18 d 18 -19 d 18 -19 d 18 -19 d 18 -19 d 19 -19 d 18 -19 d 18 -20 d
 18 -19 d 18 -20 d 18 -19 d 18 -20 d 19 -19 d 18 -19 d 18 -19 d 18 -19 d 18 -19 d 18 -19 d s 1832 718 m 18 -18 d 19 -18 d 18 -18 d 18 -18 d 18 -17 d 18 -17 d 18 -17 d 18 -16 d 19 -16 d 18 -16 d 18 -15 d s
 gr  gr 
showpage
end
%%EOF
