%!PS-Adobe-2.0 EPSF-2.0
%%BoundingBox:  0 0 567 424
%%Title: ./roofilab.eps: RooFiLab Graphs
%%Creator: ROOT Version 5.26/00
%%CreationDate: Wed Jan 20 20:52:36 2010
%%EndComments
%%BeginProlog
80 dict begin
/s {stroke} def /l {lineto} def /m {moveto} def /t {translate} def
/sw {stringwidth} def /r {rotate} def /rl {roll}  def /R {repeat} def
/d {rlineto} def /rm {rmoveto} def /gr {grestore} def /f {eofill} def
/c {setrgbcolor} def /black {0 setgray} def /sd {setdash} def
/cl {closepath} def /sf {scalefont setfont} def /lw {setlinewidth} def
/box {m dup 0 exch d exch 0 d 0 exch neg d cl} def
/NC{systemdict begin initclip end}def/C{NC box clip newpath}def
/bl {box s} def /bf {box f} def /Y { 0 exch d} def /X { 0 d} def 
/mp {newpath /y exch def /x exch def} def
/side {[w .77 mul w .23 mul] .385 w mul sd w 0 l currentpoint t -144 r} def
/mr {mp x y w2 0 360 arc} def /m24 {mr s} def /m20 {mr f} def
/mb {mp x y w2 add m w2 neg 0 d 0 w neg d w 0 d 0 w d cl} def
/mt {mp x y w2 add m w2 neg w neg d w 0 d cl} def
/m21 {mb f} def /m25 {mb s} def /m22 {mt f} def /m26{mt s} def
/m23 {mp x y w2 sub m w2 w d w neg 0 d cl f} def
/m27 {mp x y w2 add m w3 neg w2 neg d w3 w2 neg d w3 w2 d cl s} def
/m28 {mp x w2 sub y w2 sub w3 add m w3 0 d  0 w3 neg d w3 0 d 0 w3 d w3 0 d  0 w3 d w3 neg 0 d 0 w3 d w3 neg 0 d
 0 w3 neg d w3 neg 0 d cl s } def
/m29 {mp gsave x w2 sub y w2 add w3 sub m currentpoint t
 4 {side} repeat cl fill gr} def
/m30 {mp gsave x w2 sub y w2 add w3 sub m currentpoint t
 4 {side} repeat cl s gr} def
/m31 {mp x y w2 sub m 0 w d x w2 sub y m w 0 d x w2 sub y w2 add m w w neg d x w2 sub y w2
 sub m w w d s} def
/m2 {mp x y w2 sub m 0 w d x w2 sub y m w 0 d s} def
/m5 {mp x w2 sub y w2 sub m w w d x w2 sub y w2 add m w w neg d s} def
/reEncode {exch findfont dup length dict begin {1 index /FID eq  {pop pop} {def} ifelse } forall /Encoding exch def currentdict end dup /FontName get exch definefont pop } def [/Times-Bold /Times-Italic /Times-BoldItalic /Helvetica
 /Helvetica-Oblique /Helvetica-Bold /Helvetica-BoldOblique /Courier /Courier-Oblique /Courier-Bold /Courier-BoldOblique /Times-Roman /AvantGarde-Book /AvantGarde-BookOblique /AvantGarde-Demi /AvantGarde-DemiOblique /Bookman-Demi
 /Bookman-DemiItalic /Bookman-Light /Bookman-LightItalic /Helvetica-Narrow /Helvetica-Narrow-Bold /Helvetica-Narrow-BoldOblique /Helvetica-Narrow-Oblique /NewCenturySchlbk-Roman /NewCenturySchlbk-Bold
 /NewCenturySchlbk-BoldItalic /NewCenturySchlbk-Italic /Palatino-Bold /Palatino-BoldItalic /Palatino-Italic /Palatino-Roman ] {ISOLatin1Encoding reEncode } forall
/oshow {gsave [] 0 sd true charpath stroke gr} def
/stwn { /fs exch def /fn exch def /text exch def fn findfont fs sf
 text sw pop xs add /xs exch def} def
/stwb { /fs exch def /fn exch def /nbas exch def /textf exch deftextf length /tlen exch def nbas tlen gt {/nbas tlendef} iffn findfont fs sf textf dup length nbas sub nbas getinterval sw
pop neg xs add /xs exch def} def
%%EndProlog
%%BeginSetup
%%EndSetup
newpath  gsave  .25 .25 scale  gsave  0 0 t black[  ] 0 sd 3 lw 1 1 1 c 2268 1698 0 0 bf black 1 1 1 c 1814 1316 397 212 bf 397 212 m 4 4 d 1308 Y 1806 X 4 4 d -1814 X -1316 Y f 397 212 m 4 4 d 1806 X 1308 Y 4 4 d -1316 Y -1814 X f black 1814 1316
 397 212 bl 1 1 1 c 1814 1316 397 212 bf 397 212 m 4 4 d 1308 Y 1806 X 4 4 d -1814 X -1316 Y f 397 212 m 4 4 d 1806 X 1308 Y 4 4 d -1316 Y -1814 X f black 1814 1316 397 212 bl 397 212 m 1814 X s 0.6 0.6 0.6 c[ 4 8] 0 sd 0 lw 461 1528 m -1316 Y s 824
 1528 m -1316 Y s 1186 1528 m -1316 Y s 1549 1528 m -1316 Y s 1911 1528 m -1316 Y s 461 1528 m -1316 Y s 1911 1528 m -1316 Y s black[  ] 0 sd 3 lw 397 212 m 1316 Y s 0.6 0.6 0.6 c[ 4 8] 0 sd 0 lw 2211 287 m -1814 X s 2211 434 m -1814 X s 2211 582 m
 -1814 X s 2211 730 m -1814 X s 2211 877 m -1814 X s 2211 1025 m -1814 X s 2211 1173 m -1814 X s 2211 1320 m -1814 X s 2211 1468 m -1814 X s 2211 287 m -1814 X s 2211 1468 m -1814 X s black[  ] 0 sd 3 lw 397 212 m 1814 X s 461 253 m -41 Y s 534 233
 m -21 Y s 606 233 m -21 Y s 679 233 m -21 Y s 751 233 m -21 Y s 824 253 m -41 Y s 896 233 m -21 Y s 969 233 m -21 Y s 1041 233 m -21 Y s 1114 233 m -21 Y s 1186 253 m -41 Y s 1259 233 m -21 Y s 1331 233 m -21 Y s 1404 233 m -21 Y s 1476 233 m -21 Y
 s 1549 253 m -41 Y s 1621 233 m -21 Y s 1694 233 m -21 Y s 1766 233 m -21 Y s 1839 233 m -21 Y s 1911 253 m -41 Y s 461 253 m -41 Y s 1911 253 m -41 Y s 1984 233 m -21 Y s 2056 233 m -21 Y s 2129 233 m -21 Y s 2201 233 m -21 Y s
 gsave  2268 1698 0 0 C 446 166 t 0 r /Helvetica-Bold findfont 48.8732 sf 0 0 m (0) show NC gr 
 gsave  2268 1698 0 0 C 811 166 t 0 r /Helvetica-Bold findfont 48.8732 sf 0 0 m (1) show NC gr 
 gsave  2268 1698 0 0 C 1173 166 t 0 r /Helvetica-Bold findfont 48.8732 sf 0 0 m (2) show NC gr 
 gsave  2268 1698 0 0 C 1535 166 t 0 r /Helvetica-Bold findfont 48.8732 sf 0 0 m (3) show NC gr 
 gsave  2268 1698 0 0 C 1896 166 t 0 r /Helvetica-Bold findfont 48.8732 sf 0 0 m (4) show NC gr  397 212 m 1316 Y s 450 287 m -53 X s 423 316 m -26 X s 423 346 m -26 X s 423 375 m -26 X s 423 405 m -26 X s 450 434 m -53 X s 423 464 m -26 X s 423 493
 m -26 X s 423 523 m -26 X s 423 553 m -26 X s 450 582 m -53 X s 423 612 m -26 X s 423 641 m -26 X s 423 671 m -26 X s 423 700 m -26 X s 450 730 m -53 X s 423 759 m -26 X s 423 789 m -26 X s 423 818 m -26 X s 423 848 m -26 X s 450 877 m -53 X s 423
 907 m -26 X s 423 936 m -26 X s 423 966 m -26 X s 423 995 m -26 X s 450 1025 m -53 X s 423 1055 m -26 X s 423 1084 m -26 X s 423 1114 m -26 X s 423 1143 m -26 X s 450 1173 m -53 X s 423 1202 m -26 X s 423 1232 m -26 X s 423 1261 m -26 X s 423 1291
 m -26 X s 450 1320 m -53 X s 423 1350 m -26 X s 423 1379 m -26 X s 423 1409 m -26 X s 423 1438 m -26 X s 450 1468 m -53 X s 450 287 m -53 X s 423 257 m -26 X s 423 228 m -26 X s 450 1468 m -53 X s 423 1498 m -26 X s 423 1527 m -26 X s
 gsave  2268 1698 0 0 C 316 270 t 0 r /Helvetica-Bold findfont 48.8732 sf 0 0 m (0.2) show NC gr 
 gsave  2268 1698 0 0 C 316 417 t 0 r /Helvetica-Bold findfont 48.8732 sf 0 0 m (0.3) show NC gr 
 gsave  2268 1698 0 0 C 316 564 t 0 r /Helvetica-Bold findfont 48.8732 sf 0 0 m (0.4) show NC gr 
 gsave  2268 1698 0 0 C 316 710 t 0 r /Helvetica-Bold findfont 48.8732 sf 0 0 m (0.5) show NC gr 
 gsave  2268 1698 0 0 C 316 860 t 0 r /Helvetica-Bold findfont 48.8732 sf 0 0 m (0.6) show NC gr 
 gsave  2268 1698 0 0 C 316 1007 t 0 r /Helvetica-Bold findfont 48.8732 sf 0 0 m (0.7) show NC gr 
 gsave  2268 1698 0 0 C 316 1153 t 0 r /Helvetica-Bold findfont 48.8732 sf 0 0 m (0.8) show NC gr 
 gsave  2268 1698 0 0 C 316 1303 t 0 r /Helvetica-Bold findfont 48.8732 sf 0 0 m (0.9) show NC gr 
 gsave  2268 1698 0 0 C 365 1450 t 0 r /Helvetica-Bold findfont 48.8732 sf 0 0 m (1) show NC gr  0 0 1 c 479 528 m 69 Y s 473 597 m 13 X s 479 489 m -69 Y s 473 420 m 13 X s 592 395 m 84 Y s 585 479 m 13 X s 592 356 m -84 Y s 585 272 m 13 X s 708
 779 m 54 Y s 701 833 m 13 X s 708 740 m -55 Y s 701 685 m 13 X s 751 661 m 54 Y s 745 715 m 13 X s 751 622 m -55 Y s 745 567 m 13 X s 856 720 m 84 Y s 850 804 m 13 X s 856 681 m -84 Y s 850 597 m 13 X s 990 823 m 84 Y s 984 907 m 13 X s 990 784 m
 -84 Y s 984 700 m 13 X s 1081 986 m 113 Y s 1075 1099 m 13 X s 1081 946 m -113 Y s 1075 833 m 13 X s 1125 720 m 128 Y s 1118 848 m 13 X s 1125 681 m -128 Y s 1118 553 m 13 X s 1219 1045 m 128 Y s 1212 1173 m 13 X s 1219 1005 m -128 Y s 1212 877 m
 13 X s 1346 1118 m 143 Y s 1339 1261 m 13 X s 1346 1079 m -143 Y s 1339 936 m 13 X s 1810 1118 m 143 Y s 1803 1261 m 13 X s 1810 1079 m -143 Y s 1803 936 m 13 X s 2042 1192 m 158 Y s 2035 1350 m 13 X s 2042 1153 m -158 Y s 2035 995 m 13 X s 2129
 1340 m 128 Y s 2122 1468 m 13 X s 2129 1301 m -128 Y s 2122 1173 m 13 X s black 0 0 1 c /w 36 def /w2 {w 2 div} def /w3 {w 3 div} def 479 508 592 375 708 759 751 641 856 700 990 804 1081 966 1125 700 1219 1025 1346 1099 1810 1099 2042 1173 2129
 1320 13 { m20} R 1 0 0 c 9 lw 0.95 0.95 0.95 c 0.4 0.4 0.4 c 1 0 0 c 488 478 m 16 13 d 17 12 d 16 13 d 17 12 d 16 13 d 17 12 d 16 12 d 16 12 d 17 12 d 16 12 d 17 12 d 16 11 d 17 12 d 16 11 d 17 12 d 16 11 d 17 11 d 16 11 d 17 11 d 16 11 d 17 11 d
 16 10 d 17 11 d 16 10 d 17 11 d 16 10 d 17 10 d 16 10 d 17 10 d 16 10 d 17 10 d 16 9 d 17 10 d 16 9 d 17 10 d 16 9 d 17 9 d 16 9 d 17 9 d 16 9 d 17 9 d 16 8 d 17 9 d 16 8 d 17 9 d 16 8 d 17 8 d 16 8 d 17 8 d s 1296 985 m 16 8 d 17 7 d 16 8 d 17 7 d
 16 8 d 17 7 d 16 7 d 17 8 d 16 7 d 17 6 d 16 7 d 17 7 d 16 7 d 17 6 d 16 7 d 17 6 d 16 6 d 17 6 d 16 6 d 17 6 d 16 6 d 17 6 d 16 5 d 17 6 d 16 5 d 16 5 d 17 6 d 16 5 d 17 5 d 16 5 d 17 4 d 16 5 d 17 5 d 16 4 d 17 4 d 16 5 d 17 4 d 16 4 d 17 4 d 16
 4 d 17 4 d 16 3 d 17 4 d 16 3 d 17 4 d 16 3 d 17 3 d 16 3 d 17 3 d s 2104 1249 m 16 3 d s black 3 lw 0.95 0.95 0.95 c 624 212 1474 297 bf black 1484 297 m -6 Y 620 X 208 Y -6 X -202 Y f 1474 297 m 212 Y 624 X -212 Y -624 X cl s
 gsave  2268 1698 0 0 C 1629 433 t 0 r /Helvetica-Bold findfont 65.1643 sf 0 0 m (Daten) show NC gr  1497 419 m 110 X 74 Y -110 X cl s 0 0 1 c 1497 456 m 110 X s 1552 456 m20 black
 gsave  2268 1698 0 0 C 1629 326 t 0 r /Helvetica-Bold findfont 65.1643 sf 0 0 m (Funktion) show NC gr  0.95 0.95 0.95 c 1497 313 m 110 X 74 Y -110 X cl s 1 0 0 c 9 lw 1497 350 m 110 X s 0.4 0.4 0.4 c 3 lw /w 2
 def /w2 {w 2 div} def /w3 {w 3 div} def 1552 350 m20 9 lw black 3 lw 0.95 0.95 0.95 c 1814 85 397 42 bf black
 gsave  2268 1698 0 0 C 1284 65 t 0 r /Helvetica-Bold findfont 55.3896 sf 0 0 m (X) show NC gr  0.95 0.95 0.95 c 113 1316 57 212 bf black
 gsave  2268 1698 0 0 C 127 759 t 90 r /Helvetica-Bold findfont 55.3896 sf 0 0 m (Y =  f \(x\) ) show NC gr  0.95 0.95 0.95 c 113 85 57 42 bf 1 1 1 c
 gsave  2268 1698 0 0 C 62 121 t 315 r /Helvetica-Bold findfont 22.8075 sf 0 0 m (RooFiLab) show NC gr 
 gr  gr 
showpage
end
%%EOF
