%!PS-Adobe-2.0 EPSF-2.0
%%BoundingBox:  0 0 567 384
%%Title: ./c1.eps: c1
%%Creator: ROOT Version 5.26/00
%%CreationDate: Tue Jan 19 16:50:00 2010
%%EndComments
%%BeginProlog
80 dict begin
/s {stroke} def /l {lineto} def /m {moveto} def /t {translate} def
/sw {stringwidth} def /r {rotate} def /rl {roll}  def /R {repeat} def
/d {rlineto} def /rm {rmoveto} def /gr {grestore} def /f {eofill} def
/c {setrgbcolor} def /black {0 setgray} def /sd {setdash} def
/cl {closepath} def /sf {scalefont setfont} def /lw {setlinewidth} def
/box {m dup 0 exch d exch 0 d 0 exch neg d cl} def
/NC{systemdict begin initclip end}def/C{NC box clip newpath}def
/bl {box s} def /bf {box f} def /Y { 0 exch d} def /X { 0 d} def 
/mp {newpath /y exch def /x exch def} def
/side {[w .77 mul w .23 mul] .385 w mul sd w 0 l currentpoint t -144 r} def
/mr {mp x y w2 0 360 arc} def /m24 {mr s} def /m20 {mr f} def
/mb {mp x y w2 add m w2 neg 0 d 0 w neg d w 0 d 0 w d cl} def
/mt {mp x y w2 add m w2 neg w neg d w 0 d cl} def
/m21 {mb f} def /m25 {mb s} def /m22 {mt f} def /m26{mt s} def
/m23 {mp x y w2 sub m w2 w d w neg 0 d cl f} def
/m27 {mp x y w2 add m w3 neg w2 neg d w3 w2 neg d w3 w2 d cl s} def
/m28 {mp x w2 sub y w2 sub w3 add m w3 0 d  0 w3 neg d w3 0 d 0 w3 d w3 0 d  0 w3 d w3 neg 0 d 0 w3 d w3 neg 0 d
 0 w3 neg d w3 neg 0 d cl s } def
/m29 {mp gsave x w2 sub y w2 add w3 sub m currentpoint t
 4 {side} repeat cl fill gr} def
/m30 {mp gsave x w2 sub y w2 add w3 sub m currentpoint t
 4 {side} repeat cl s gr} def
/m31 {mp x y w2 sub m 0 w d x w2 sub y m w 0 d x w2 sub y w2 add m w w neg d x w2 sub y w2
 sub m w w d s} def
/m2 {mp x y w2 sub m 0 w d x w2 sub y m w 0 d s} def
/m5 {mp x w2 sub y w2 sub m w w d x w2 sub y w2 add m w w neg d s} def
/reEncode {exch findfont dup length dict begin {1 index /FID eq  {pop pop} {def} ifelse } forall /Encoding exch def currentdict end dup /FontName get exch definefont pop } def [/Times-Bold /Times-Italic /Times-BoldItalic /Helvetica
 /Helvetica-Oblique /Helvetica-Bold /Helvetica-BoldOblique /Courier /Courier-Oblique /Courier-Bold /Courier-BoldOblique /Times-Roman /AvantGarde-Book /AvantGarde-BookOblique /AvantGarde-Demi /AvantGarde-DemiOblique /Bookman-Demi
 /Bookman-DemiItalic /Bookman-Light /Bookman-LightItalic /Helvetica-Narrow /Helvetica-Narrow-Bold /Helvetica-Narrow-BoldOblique /Helvetica-Narrow-Oblique /NewCenturySchlbk-Roman /NewCenturySchlbk-Bold
 /NewCenturySchlbk-BoldItalic /NewCenturySchlbk-Italic /Palatino-Bold /Palatino-BoldItalic /Palatino-Italic /Palatino-Roman ] {ISOLatin1Encoding reEncode } forall
/oshow {gsave [] 0 sd true charpath stroke gr} def
/stwn { /fs exch def /fn exch def /text exch def fn findfont fs sf
 text sw pop xs add /xs exch def} def
/stwb { /fs exch def /fn exch def /nbas exch def /textf exch deftextf length /tlen exch def nbas tlen gt {/nbas tlendef} iffn findfont fs sf textf dup length nbas sub nbas getinterval sw
pop neg xs add /xs exch def} def
%%EndProlog
%%BeginSetup
%%EndSetup
newpath  gsave  .25 .25 scale  gsave  0 0 t black[  ] 0 sd 3 lw 1 1 1 c 2268 1538 0 0 bf black 1 1 1 c 1815 1229 225 156 bf black 1815 1229 225 156 bl 1 1 1 c 1815 1229 225 156 bf black 1815 1229 225 156 bl 225 156 m 1815 X s[ 4 8] 0 sd 225 1385 m
 -1229 Y s 452 1385 m -1229 Y s 679 1385 m -1229 Y s 905 1385 m -1229 Y s 1132 1385 m -1229 Y s 1359 1385 m -1229 Y s 1586 1385 m -1229 Y s 1813 1385 m -1229 Y s 2040 1385 m -1229 Y s[  ] 0 sd 225 156 m 1229 Y s[ 4 8] 0 sd 2040 156 m -1815 X s 2040
 395 m -1815 X s 2040 634 m -1815 X s 2040 872 m -1815 X s 2040 1111 m -1815 X s 2040 1350 m -1815 X s 2040 1350 m -1815 X s 1 1 1 c[  ] 0 sd 9 lw 0.95 0.95 0.95 c black 1 1 1 c 234 1326 m 18 -46 d 18 -44 d 18 -42 d 18 -41 d 19 -39 d 18 -37 d 18 -36
 d 18 -35 d 18 -33 d 18 -32 d 19 -31 d 18 -30 d 18 -28 d 18 -27 d 18 -27 d 18 -25 d 18 -24 d 19 -23 d 18 -23 d 18 -21 d 18 -21 d 18 -19 d 18 -19 d 18 -19 d 19 -17 d 18 -17 d 18 -16 d 18 -16 d 18 -15 d 18 -14 d 18 -14 d 19 -13 d 18 -13 d 18 -12 d 18
 -12 d 18 -11 d 18 -11 d 19 -11 d 18 -10 d 18 -9 d 18 -10 d 18 -9 d 18 -8 d 18 -8 d 19 -8 d 18 -8 d 18 -7 d 18 -7 d 18 -7 d s 1123 321 m 18 -6 d 18 -6 d 19 -6 d 18 -6 d 18 -6 d 18 -5 d 18 -5 d 18 -5 d 18 -5 d 19 -4 d 18 -4 d 18 -5 d 18 -4 d 18 -3 d
 18 -4 d 19 -4 d 18 -3 d 18 -3 d 18 -4 d 18 -3 d 18 -2 d 18 -3 d 19 -3 d 18 -3 d 18 -2 d 18 -2 d 18 -3 d 18 -2 d 18 -2 d 19 -2 d 18 -2 d 18 -2 d 18 -2 d 18 -1 d 18 -2 d 18 -2 d 19 -1 d 18 -2 d 18 -1 d 18 -1 d 18 -2 d 18 -1 d 19 -1 d 18 -1 d 18 -1 d
 18 -1 d 18 -1 d 18 -1 d 18 -1 d s 2012 180 m 19 -1 d s black 3 lw 225 156 m 1815 X s
 gsave  2268 1538 0 0 C 1900 39 t 0 r /Helvetica-Bold findfont 58.6478 sf 0 0 m (2/n_f) show NC gr 
 gsave  2268 1538 0 0 C 1867 39 t 0 r /Symbol findfont 58.6478 sf 0 0 m (c) show NC gr  225 193 m -37 Y s 270 175 m -19 Y s 316 175 m -19 Y s 361 175 m -19 Y s 406 175 m -19 Y s 452 193 m -37 Y s 497 175 m -19 Y s 542 175 m -19 Y s 588 175 m -19 Y s
 633 175 m -19 Y s 679 193 m -37 Y s 724 175 m -19 Y s 769 175 m -19 Y s 815 175 m -19 Y s 860 175 m -19 Y s 905 193 m -37 Y s 951 175 m -19 Y s 996 175 m -19 Y s 1041 175 m -19 Y s 1087 175 m -19 Y s 1132 193 m -37 Y s 1178 175 m -19 Y s 1223 175 m
 -19 Y s 1268 175 m -19 Y s 1314 175 m -19 Y s 1359 193 m -37 Y s 1404 175 m -19 Y s 1450 175 m -19 Y s 1495 175 m -19 Y s 1541 175 m -19 Y s 1586 193 m -37 Y s 1631 175 m -19 Y s 1677 175 m -19 Y s 1722 175 m -19 Y s 1767 175 m -19 Y s 1813 193 m
 -37 Y s 1858 175 m -19 Y s 1904 175 m -19 Y s 1949 175 m -19 Y s 1994 175 m -19 Y s 2040 193 m -37 Y s
 gsave  2268 1538 0 0 C 209 101 t 0 r /Helvetica-Bold findfont 58.6478 sf 0 0 m (0) show NC gr 
 gsave  2268 1538 0 0 C 407 101 t 0 r /Helvetica-Bold findfont 58.6478 sf 0 0 m (0.5) show NC gr 
 gsave  2268 1538 0 0 C 665 101 t 0 r /Helvetica-Bold findfont 58.6478 sf 0 0 m (1) show NC gr 
 gsave  2268 1538 0 0 C 860 101 t 0 r /Helvetica-Bold findfont 58.6478 sf 0 0 m (1.5) show NC gr 
 gsave  2268 1538 0 0 C 1114 101 t 0 r /Helvetica-Bold findfont 58.6478 sf 0 0 m (2) show NC gr 
 gsave  2268 1538 0 0 C 1316 101 t 0 r /Helvetica-Bold findfont 58.6478 sf 0 0 m (2.5) show NC gr 
 gsave  2268 1538 0 0 C 1567 101 t 0 r /Helvetica-Bold findfont 58.6478 sf 0 0 m (3) show NC gr 
 gsave  2268 1538 0 0 C 1769 101 t 0 r /Helvetica-Bold findfont 58.6478 sf 0 0 m (3.5) show NC gr 
 gsave  2268 1538 0 0 C 2023 101 t 0 r /Helvetica-Bold findfont 58.6478 sf 0 0 m (4) show NC gr  225 156 m 1229 Y s
 gsave  2268 1538 0 0 C 94 893 t 90 r /Helvetica-Bold findfont 58.6478 sf 0 0 m (Verteilungsdichte) show NC gr  279 156 m -54 X s 252 216 m -27 X s 252 276 m -27 X s 252 335 m -27 X s 279 395 m -54 X s 252 455 m -27 X s 252 514 m -27 X s 252 574 m
 -27 X s 279 634 m -54 X s 252 693 m -27 X s 252 753 m -27 X s 252 813 m -27 X s 279 872 m -54 X s 252 932 m -27 X s 252 992 m -27 X s 252 1052 m -27 X s 279 1111 m -54 X s 252 1171 m -27 X s 252 1231 m -27 X s 252 1290 m -27 X s 279 1350 m -54 X s
 279 1350 m -54 X s
 gsave  2268 1538 0 0 C 179 134 t 0 r /Helvetica-Bold findfont 58.6478 sf 0 0 m (0) show NC gr 
 gsave  2268 1538 0 0 C 130 375 t 0 r /Helvetica-Bold findfont 58.6478 sf 0 0 m (0.2) show NC gr 
 gsave  2268 1538 0 0 C 130 613 t 0 r /Helvetica-Bold findfont 58.6478 sf 0 0 m (0.4) show NC gr 
 gsave  2268 1538 0 0 C 130 850 t 0 r /Helvetica-Bold findfont 58.6478 sf 0 0 m (0.6) show NC gr 
 gsave  2268 1538 0 0 C 130 1092 t 0 r /Helvetica-Bold findfont 58.6478 sf 0 0 m (0.8) show NC gr 
 gsave  2268 1538 0 0 C 186 1329 t 0 r /Helvetica-Bold findfont 58.6478 sf 0 0 m (1) show NC gr  9 lw 0.95 0.95 0.95 c black 234 1326 m 18 -46 d 18 -44 d 18 -42 d 18 -41 d 19 -39 d 18 -37 d 18 -36 d 18 -35 d 18 -33 d 18 -32 d 19 -31 d 18 -30 d 18
 -28 d 18 -27 d 18 -27 d 18 -25 d 18 -24 d 19 -23 d 18 -23 d 18 -21 d 18 -21 d 18 -19 d 18 -19 d 18 -19 d 19 -17 d 18 -17 d 18 -16 d 18 -16 d 18 -15 d 18 -14 d 18 -14 d 19 -13 d 18 -13 d 18 -12 d 18 -12 d 18 -11 d 18 -11 d 19 -11 d 18 -10 d 18 -9 d
 18 -10 d 18 -9 d 18 -8 d 18 -8 d 19 -8 d 18 -8 d 18 -7 d 18 -7 d 18 -7 d s 1123 321 m 18 -6 d 18 -6 d 19 -6 d 18 -6 d 18 -6 d 18 -5 d 18 -5 d 18 -5 d 18 -5 d 19 -4 d 18 -4 d 18 -5 d 18 -4 d 18 -3 d 18 -4 d 19 -4 d 18 -3 d 18 -3 d 18 -4 d 18 -3 d 18
 -2 d 18 -3 d 19 -3 d 18 -3 d 18 -2 d 18 -2 d 18 -3 d 18 -2 d 18 -2 d 19 -2 d 18 -2 d 18 -2 d 18 -2 d 18 -1 d 18 -2 d 18 -2 d 19 -1 d 18 -2 d 18 -1 d 18 -1 d 18 -2 d 18 -1 d 19 -1 d 18 -1 d 18 -1 d 18 -1 d 18 -1 d 18 -1 d 18 -1 d s 2012 180 m 19 -1
 d s 1 0 0 c 0.95 0.95 0.95 c black 1 0 0 c 234 496 m 18 214 d 18 120 d 18 77 d 18 51 d 19 33 d 18 20 d 18 9 d 18 3 d 18 -4 d 18 -9 d 19 -12 d 18 -15 d 18 -18 d 18 -19 d 18 -21 d 18 -22 d 18 -22 d 19 -23 d 18 -23 d 18 -24 d 18 -23 d 18 -23 d 18 -23
 d 18 -22 d 19 -23 d 18 -21 d 18 -21 d 18 -21 d 18 -20 d 18 -19 d 18 -19 d 19 -18 d 18 -18 d 18 -17 d 18 -16 d 18 -16 d 18 -15 d 19 -15 d 18 -14 d 18 -13 d 18 -13 d 18 -13 d 18 -12 d 18 -11 d 19 -11 d 18 -10 d 18 -10 d 18 -10 d 18 -9 d s 1123 335 m
 18 -9 d 18 -8 d 19 -8 d 18 -8 d 18 -7 d 18 -7 d 18 -6 d 18 -6 d 18 -6 d 19 -6 d 18 -6 d 18 -5 d 18 -5 d 18 -4 d 18 -5 d 19 -4 d 18 -4 d 18 -4 d 18 -3 d 18 -4 d 18 -3 d 18 -3 d 19 -3 d 18 -3 d 18 -3 d 18 -2 d 18 -3 d 18 -2 d 18 -2 d 19 -2 d 18 -2 d
 18 -2 d 18 -2 d 18 -1 d 18 -2 d 18 -2 d 19 -1 d 18 -1 d 18 -2 d 18 -1 d 18 -1 d 18 -1 d 19 -1 d 18 -1 d 18 -1 d 18 -1 d 18 -1 d 18 -1 d 18 X s 2012 170 m 19 -1 d s 0 1 0 c 0.95 0.95 0.95 c black 0 1 0 c 234 248 m 18 162 d 18 137 d 18 115 d 18 94 d
 19 77 d 18 61 d 18 48 d 18 37 d 18 26 d 18 17 d 19 10 d 18 3 d 18 -3 d 18 -8 d 18 -11 d 18 -15 d 18 -18 d 19 -19 d 18 -22 d 18 -23 d 18 -24 d 18 -25 d 18 -26 d 18 -26 d 19 -25 d 18 -26 d 18 -26 d 18 -25 d 18 -25 d 18 -24 d 18 -24 d 19 -23 d 18 -22
 d 18 -22 d 18 -21 d 18 -20 d 18 -19 d 19 -19 d 18 -18 d 18 -17 d 18 -16 d 18 -16 d 18 -15 d 18 -14 d 19 -14 d 18 -12 d 18 -13 d 18 -11 d 18 -11 d s 1123 337 m 18 -11 d 18 -10 d 19 -9 d 18 -9 d 18 -9 d 18 -8 d 18 -7 d 18 -7 d 18 -7 d 19 -6 d 18 -6 d
 18 -6 d 18 -5 d 18 -5 d 18 -5 d 19 -4 d 18 -4 d 18 -4 d 18 -4 d 18 -4 d 18 -3 d 18 -3 d 19 -3 d 18 -2 d 18 -3 d 18 -2 d 18 -2 d 18 -3 d 18 -2 d 19 -1 d 18 -2 d 18 -2 d 18 -1 d 18 -2 d 18 -1 d 18 -1 d 19 -1 d 18 -1 d 18 -1 d 18 -1 d 18 -1 d 18 -1 d
 19 -1 d 18 -1 d 18 X 18 -1 d 18 X 18 -1 d 18 X s 2012 164 m 19 -1 d s 0 0 1 c 0.95 0.95 0.95 c black 0 0 1 c 234 180 m 18 89 d 18 106 d 18 109 d 18 104 d 19 97 d 18 85 d 18 75 d 18 63 d 18 52 d 18 41 d 19 32 d 18 22 d 18 14 d 18 7 d 18 X 18 -6 d 18
 -11 d 19 -15 d 18 -18 d 18 -22 d 18 -23 d 18 -26 d 18 -27 d 18 -29 d 19 -29 d 18 -30 d 18 -29 d 18 -30 d 18 -29 d 18 -29 d 18 -29 d 19 -28 d 18 -27 d 18 -26 d 18 -25 d 18 -25 d 18 -23 d 19 -23 d 18 -21 d 18 -21 d 18 -19 d 18 -19 d 18 -18 d 18 -17 d
 19 -15 d 18 -15 d 18 -15 d 18 -13 d 18 -13 d s 1123 331 m 18 -11 d 18 -11 d 19 -11 d 18 -10 d 18 -9 d 18 -9 d 18 -8 d 18 -7 d 18 -7 d 19 -7 d 18 -6 d 18 -6 d 18 -5 d 18 -5 d 18 -4 d 19 -5 d 18 -4 d 18 -4 d 18 -3 d 18 -3 d 18 -3 d 18 -3 d 19 -2 d 18
 -3 d 18 -2 d 18 -2 d 18 -2 d 18 -2 d 18 -1 d 19 -2 d 18 -1 d 18 -2 d 18 -1 d 18 -1 d 18 -1 d 18 -1 d 19 -1 d 18 X 18 -1 d 18 -1 d 18 X 18 -1 d 19 -1 d 36 X 18 -1 d 18 X 18 -1 d 18 X s 2012 160 m 19 X s 1 1 0 c 0.95 0.95 0.95 c black 1 1 0 c 234 162
 m 18 43 d 18 71 d 18 88 d 18 97 d 19 98 d 18 97 d 18 90 d 18 82 d 18 72 d 18 63 d 19 51 d 18 41 d 18 31 d 18 22 d 18 13 d 18 4 d 18 -2 d 19 -8 d 18 -14 d 18 -19 d 18 -23 d 18 -26 d 18 -28 d 18 -31 d 19 -32 d 18 -33 d 18 -34 d 18 -34 d 18 -34 d 18
 -34 d 18 -33 d 19 -32 d 18 -32 d 18 -31 d 18 -30 d 18 -28 d 18 -28 d 19 -26 d 18 -25 d 18 -24 d 18 -22 d 18 -22 d 18 -20 d 18 -19 d 19 -18 d 18 -16 d 18 -16 d 18 -15 d 18 -13 d s 1123 323 m 18 -13 d 18 -12 d 19 -11 d 18 -10 d 18 -10 d 18 -9 d 18 -8
 d 18 -8 d 18 -7 d 19 -6 d 18 -6 d 18 -6 d 18 -5 d 18 -5 d 18 -4 d 19 -4 d 18 -4 d 18 -3 d 18 -3 d 18 -3 d 18 -2 d 18 -3 d 19 -2 d 18 -2 d 18 -2 d 18 -2 d 18 -1 d 18 -1 d 18 -2 d 19 -1 d 18 -1 d 18 -1 d 18 -1 d 18 -1 d 18 X 18 -1 d 19 -1 d 18 X 18
 -1 d 18 X 18 -1 d 37 X 18 -1 d 54 X 18 -1 d 18 X s 2012 158 m 19 X s 1 0 1 c 0.95 0.95 0.95 c black 1 0 1 c 234 158 m 18 19 d 18 44 d 18 65 d 18 81 d 19 92 d 18 97 d 18 97 d 18 94 d 18 88 d 18 79 d 19 69 d 18 58 d 18 48 d 18 37 d 18 26 d 18 16 d 18
 7 d 19 -1 d 18 -8 d 18 -15 d 18 -21 d 18 -25 d 18 -29 d 18 -33 d 19 -34 d 18 -37 d 18 -38 d 18 -38 d 18 -39 d 18 -38 d 18 -39 d 19 -37 d 18 -37 d 18 -35 d 18 -34 d 18 -33 d 18 -31 d 19 -30 d 18 -28 d 18 -27 d 18 -25 d 18 -24 d 18 -22 d 18 -21 d 19
 -19 d 18 -18 d 18 -17 d 18 -16 d 18 -14 d s 1123 312 m 18 -14 d 18 -12 d 19 -11 d 18 -11 d 18 -9 d 18 -9 d 18 -8 d 18 -8 d 18 -7 d 19 -6 d 18 -6 d 18 -5 d 18 -4 d 18 -5 d 18 -4 d 19 -3 d 18 -4 d 18 -2 d 18 -3 d 18 -3 d 18 -2 d 18 -2 d 19 -1 d 18 -2
 d 18 -2 d 18 -1 d 18 -1 d 18 -1 d 18 -1 d 19 -1 d 18 -1 d 18 X 18 -1 d 18 -1 d 18 X 18 -1 d 37 X 18 -1 d 36 X 18 -1 d 91 X 18 -1 d 18 X s 2012 157 m 19 X s 0 1 1 c 0.95 0.95 0.95 c black 0 1 1 c 234 157 m 18 8 d 18 26 d 18 45 d 18 65 d 19 80 d 18
 92 d 18 98 d 18 99 d 18 98 d 18 92 d 19 84 d 18 74 d 18 63 d 18 52 d 18 40 d 18 28 d 18 18 d 19 7 d 18 -3 d 18 -10 d 18 -18 d 18 -24 d 18 -30 d 18 -34 d 19 -37 d 18 -40 d 18 -41 d 18 -43 d 18 -44 d 18 -43 d 18 -43 d 19 -42 d 18 -42 d 18 -40 d 18
 -38 d 18 -37 d 18 -35 d 19 -33 d 18 -31 d 18 -30 d 18 -27 d 18 -26 d 18 -24 d 18 -22 d 19 -21 d 18 -19 d 18 -18 d 18 -16 d 18 -15 d s 1123 300 m 18 -14 d 18 -12 d 19 -12 d 18 -10 d 18 -9 d 18 -9 d 18 -8 d 18 -7 d 18 -6 d 19 -6 d 18 -5 d 18 -5 d 18
 -4 d 18 -4 d 18 -4 d 19 -3 d 18 -3 d 18 -2 d 18 -2 d 18 -2 d 18 -2 d 18 -2 d 19 -1 d 18 -1 d 18 -2 d 18 -1 d 18 -1 d 18 X 18 -1 d 19 -1 d 18 X 18 -1 d 18 X 18 -1 d 36 X 19 -1 d 72 X 18 -1 d 127 X s 2012 157 m 19 X s
 gr  gr 
showpage
end
%%EOF
