#set terminal x11
#set terminal dumb 140,30
#set xrange [0:30]
#plot "<  sed -n '/^\#/p' runtimedata.txt | sed -e 's/^\#//g' |  sed -e '/zz/d'" u 2:5 w l lw 2
plot "<  sed -n '/^\#/p' runtimedata.txt | sed -e 's/^\#//g' | tail -n +1 " u 2:5 w l lw 2
#plot "<  sed -n '/^\#/p' runtimedata.txt | sed -e 's/^\#//g' | tail -n +72 " u 2:10 w l lw 2
