# vtk DataFile Version 2.0
VTK from Matlab
ASCII
DATASET STRUCTURED_GRID
DIMENSIONS 10 8 6
POINTS 480 float
0.00 0.00 0.00 0.00 0.22 0.00 0.00 0.44 0.00 0.00 0.67 0.00 0.00 0.89 0.00 0.00 1.11 0.00 0.00 1.33 0.00 0.00 1.56 0.00 0.00 1.78 0.00 0.00 2.00 0.00 0.14 0.00 0.00 0.14 0.22 0.00 0.14 0.44 0.00 0.14 0.67 0.00 0.14 0.89 0.00 0.14 1.11 0.00 0.14 1.33 0.00 0.14 1.56 0.00 0.14 1.78 0.00 0.14 2.00 0.00 0.29 0.00 0.00 0.29 0.22 0.00 0.29 0.44 0.00 0.29 0.67 0.00 0.29 0.89 0.00 0.29 1.11 0.00 0.29 1.33 0.00 0.29 1.56 0.00 0.29 1.78 0.00 0.29 2.00 0.00 0.43 0.00 0.00 0.43 0.22 0.00 0.43 0.44 0.00 0.43 0.67 0.00 0.43 0.89 0.00 0.43 1.11 0.00 0.43 1.33 0.00 0.43 1.56 0.00 0.43 1.78 0.00 0.43 2.00 0.00 0.57 0.00 0.00 0.57 0.22 0.00 0.57 0.44 0.00 0.57 0.67 0.00 0.57 0.89 0.00 0.57 1.11 0.00 0.57 1.33 0.00 0.57 1.56 0.00 0.57 1.78 0.00 0.57 2.00 0.00 0.71 0.00 0.00 0.71 0.22 0.00 0.71 0.44 0.00 0.71 0.67 0.00 0.71 0.89 0.00 0.71 1.11 0.00 0.71 1.33 0.00 0.71 1.56 0.00 0.71 1.78 0.00 0.71 2.00 0.00 0.86 0.00 0.00 0.86 0.22 0.00 0.86 0.44 0.00 0.86 0.67 0.00 0.86 0.89 0.00 0.86 1.11 0.00 0.86 1.33 0.00 0.86 1.56 0.00 0.86 1.78 0.00 0.86 2.00 0.00 1.00 0.00 0.00 1.00 0.22 0.00 1.00 0.44 0.00 1.00 0.67 0.00 1.00 0.89 0.00 1.00 1.11 0.00 1.00 1.33 0.00 1.00 1.56 0.00 1.00 1.78 0.00 1.00 2.00 0.00 0.00 0.00 0.10 0.00 0.22 0.10 0.00 0.44 0.10 0.00 0.67 0.10 0.00 0.89 0.10 0.00 1.11 0.10 0.00 1.33 0.10 0.00 1.56 0.10 0.00 1.78 0.10 0.00 2.00 0.10 0.14 0.00 0.10 0.14 0.22 0.10 0.14 0.44 0.10 0.14 0.67 0.10 0.14 0.89 0.10 0.14 1.11 0.10 0.14 1.33 0.10 0.14 1.56 0.10 0.14 1.78 0.10 0.14 2.00 0.10 0.29 0.00 0.10 0.29 0.22 0.10 0.29 0.44 0.10 0.29 0.67 0.10 0.29 0.89 0.10 0.29 1.11 0.10 0.29 1.33 0.10 0.29 1.56 0.10 0.29 1.78 0.10 0.29 2.00 0.10 0.43 0.00 0.10 0.43 0.22 0.10 0.43 0.44 0.10 0.43 0.67 0.10 0.43 0.89 0.10 0.43 1.11 0.10 0.43 1.33 0.10 0.43 1.56 0.10 0.43 1.78 0.10 0.43 2.00 0.10 0.57 0.00 0.10 0.57 0.22 0.10 0.57 0.44 0.10 0.57 0.67 0.10 0.57 0.89 0.10 0.57 1.11 0.10 0.57 1.33 0.10 0.57 1.56 0.10 0.57 1.78 0.10 0.57 2.00 0.10 0.71 0.00 0.10 0.71 0.22 0.10 0.71 0.44 0.10 0.71 0.67 0.10 0.71 0.89 0.10 0.71 1.11 0.10 0.71 1.33 0.10 0.71 1.56 0.10 0.71 1.78 0.10 0.71 2.00 0.10 0.86 0.00 0.10 0.86 0.22 0.10 0.86 0.44 0.10 0.86 0.67 0.10 0.86 0.89 0.10 0.86 1.11 0.10 0.86 1.33 0.10 0.86 1.56 0.10 0.86 1.78 0.10 0.86 2.00 0.10 1.00 0.00 0.10 1.00 0.22 0.10 1.00 0.44 0.10 1.00 0.67 0.10 1.00 0.89 0.10 1.00 1.11 0.10 1.00 1.33 0.10 1.00 1.56 0.10 1.00 1.78 0.10 1.00 2.00 0.10 0.00 0.00 0.20 0.00 0.22 0.20 0.00 0.44 0.20 0.00 0.67 0.20 0.00 0.89 0.20 0.00 1.11 0.20 0.00 1.33 0.20 0.00 1.56 0.20 0.00 1.78 0.20 0.00 2.00 0.20 0.14 0.00 0.20 0.14 0.22 0.20 0.14 0.44 0.20 0.14 0.67 0.20 0.14 0.89 0.20 0.14 1.11 0.20 0.14 1.33 0.20 0.14 1.56 0.20 0.14 1.78 0.20 0.14 2.00 0.20 0.29 0.00 0.20 0.29 0.22 0.20 0.29 0.44 0.20 0.29 0.67 0.20 0.29 0.89 0.20 0.29 1.11 0.20 0.29 1.33 0.20 0.29 1.56 0.20 0.29 1.78 0.20 0.29 2.00 0.20 0.43 0.00 0.20 0.43 0.22 0.20 0.43 0.44 0.20 0.43 0.67 0.20 0.43 0.89 0.20 0.43 1.11 0.20 0.43 1.33 0.20 0.43 1.56 0.20 0.43 1.78 0.20 0.43 2.00 0.20 0.57 0.00 0.20 0.57 0.22 0.20 0.57 0.44 0.20 0.57 0.67 0.20 0.57 0.89 0.20 0.57 1.11 0.20 0.57 1.33 0.20 0.57 1.56 0.20 0.57 1.78 0.20 0.57 2.00 0.20 0.71 0.00 0.20 0.71 0.22 0.20 0.71 0.44 0.20 0.71 0.67 0.20 0.71 0.89 0.20 0.71 1.11 0.20 0.71 1.33 0.20 0.71 1.56 0.20 0.71 1.78 0.20 0.71 2.00 0.20 0.86 0.00 0.20 0.86 0.22 0.20 0.86 0.44 0.20 0.86 0.67 0.20 0.86 0.89 0.20 0.86 1.11 0.20 0.86 1.33 0.20 0.86 1.56 0.20 0.86 1.78 0.20 0.86 2.00 0.20 1.00 0.00 0.20 1.00 0.22 0.20 1.00 0.44 0.20 1.00 0.67 0.20 1.00 0.89 0.20 1.00 1.11 0.20 1.00 1.33 0.20 1.00 1.56 0.20 1.00 1.78 0.20 1.00 2.00 0.20 0.00 0.00 0.30 0.00 0.22 0.30 0.00 0.44 0.30 0.00 0.67 0.30 0.00 0.89 0.30 0.00 1.11 0.30 0.00 1.33 0.30 0.00 1.56 0.30 0.00 1.78 0.30 0.00 2.00 0.30 0.14 0.00 0.30 0.14 0.22 0.30 0.14 0.44 0.30 0.14 0.67 0.30 0.14 0.89 0.30 0.14 1.11 0.30 0.14 1.33 0.30 0.14 1.56 0.30 0.14 1.78 0.30 0.14 2.00 0.30 0.29 0.00 0.30 0.29 0.22 0.30 0.29 0.44 0.30 0.29 0.67 0.30 0.29 0.89 0.30 0.29 1.11 0.30 0.29 1.33 0.30 0.29 1.56 0.30 0.29 1.78 0.30 0.29 2.00 0.30 0.43 0.00 0.30 0.43 0.22 0.30 0.43 0.44 0.30 0.43 0.67 0.30 0.43 0.89 0.30 0.43 1.11 0.30 0.43 1.33 0.30 0.43 1.56 0.30 0.43 1.78 0.30 0.43 2.00 0.30 0.57 0.00 0.30 0.57 0.22 0.30 0.57 0.44 0.30 0.57 0.67 0.30 0.57 0.89 0.30 0.57 1.11 0.30 0.57 1.33 0.30 0.57 1.56 0.30 0.57 1.78 0.30 0.57 2.00 0.30 0.71 0.00 0.30 0.71 0.22 0.30 0.71 0.44 0.30 0.71 0.67 0.30 0.71 0.89 0.30 0.71 1.11 0.30 0.71 1.33 0.30 0.71 1.56 0.30 0.71 1.78 0.30 0.71 2.00 0.30 0.86 0.00 0.30 0.86 0.22 0.30 0.86 0.44 0.30 0.86 0.67 0.30 0.86 0.89 0.30 0.86 1.11 0.30 0.86 1.33 0.30 0.86 1.56 0.30 0.86 1.78 0.30 0.86 2.00 0.30 1.00 0.00 0.30 1.00 0.22 0.30 1.00 0.44 0.30 1.00 0.67 0.30 1.00 0.89 0.30 1.00 1.11 0.30 1.00 1.33 0.30 1.00 1.56 0.30 1.00 1.78 0.30 1.00 2.00 0.30 0.00 0.00 0.40 0.00 0.22 0.40 0.00 0.44 0.40 0.00 0.67 0.40 0.00 0.89 0.40 0.00 1.11 0.40 0.00 1.33 0.40 0.00 1.56 0.40 0.00 1.78 0.40 0.00 2.00 0.40 0.14 0.00 0.40 0.14 0.22 0.40 0.14 0.44 0.40 0.14 0.67 0.40 0.14 0.89 0.40 0.14 1.11 0.40 0.14 1.33 0.40 0.14 1.56 0.40 0.14 1.78 0.40 0.14 2.00 0.40 0.29 0.00 0.40 0.29 0.22 0.40 0.29 0.44 0.40 0.29 0.67 0.40 0.29 0.89 0.40 0.29 1.11 0.40 0.29 1.33 0.40 0.29 1.56 0.40 0.29 1.78 0.40 0.29 2.00 0.40 0.43 0.00 0.40 0.43 0.22 0.40 0.43 0.44 0.40 0.43 0.67 0.40 0.43 0.89 0.40 0.43 1.11 0.40 0.43 1.33 0.40 0.43 1.56 0.40 0.43 1.78 0.40 0.43 2.00 0.40 0.57 0.00 0.40 0.57 0.22 0.40 0.57 0.44 0.40 0.57 0.67 0.40 0.57 0.89 0.40 0.57 1.11 0.40 0.57 1.33 0.40 0.57 1.56 0.40 0.57 1.78 0.40 0.57 2.00 0.40 0.71 0.00 0.40 0.71 0.22 0.40 0.71 0.44 0.40 0.71 0.67 0.40 0.71 0.89 0.40 0.71 1.11 0.40 0.71 1.33 0.40 0.71 1.56 0.40 0.71 1.78 0.40 0.71 2.00 0.40 0.86 0.00 0.40 0.86 0.22 0.40 0.86 0.44 0.40 0.86 0.67 0.40 0.86 0.89 0.40 0.86 1.11 0.40 0.86 1.33 0.40 0.86 1.56 0.40 0.86 1.78 0.40 0.86 2.00 0.40 1.00 0.00 0.40 1.00 0.22 0.40 1.00 0.44 0.40 1.00 0.67 0.40 1.00 0.89 0.40 1.00 1.11 0.40 1.00 1.33 0.40 1.00 1.56 0.40 1.00 1.78 0.40 1.00 2.00 0.40 0.00 0.00 0.50 0.00 0.22 0.50 0.00 0.44 0.50 0.00 0.67 0.50 0.00 0.89 0.50 0.00 1.11 0.50 0.00 1.33 0.50 0.00 1.56 0.50 0.00 1.78 0.50 0.00 2.00 0.50 0.14 0.00 0.50 0.14 0.22 0.50 0.14 0.44 0.50 0.14 0.67 0.50 0.14 0.89 0.50 0.14 1.11 0.50 0.14 1.33 0.50 0.14 1.56 0.50 0.14 1.78 0.50 0.14 2.00 0.50 0.29 0.00 0.50 0.29 0.22 0.50 0.29 0.44 0.50 0.29 0.67 0.50 0.29 0.89 0.50 0.29 1.11 0.50 0.29 1.33 0.50 0.29 1.56 0.50 0.29 1.78 0.50 0.29 2.00 0.50 0.43 0.00 0.50 0.43 0.22 0.50 0.43 0.44 0.50 0.43 0.67 0.50 0.43 0.89 0.50 0.43 1.11 0.50 0.43 1.33 0.50 0.43 1.56 0.50 0.43 1.78 0.50 0.43 2.00 0.50 0.57 0.00 0.50 0.57 0.22 0.50 0.57 0.44 0.50 0.57 0.67 0.50 0.57 0.89 0.50 0.57 1.11 0.50 0.57 1.33 0.50 0.57 1.56 0.50 0.57 1.78 0.50 0.57 2.00 0.50 0.71 0.00 0.50 0.71 0.22 0.50 0.71 0.44 0.50 0.71 0.67 0.50 0.71 0.89 0.50 0.71 1.11 0.50 0.71 1.33 0.50 0.71 1.56 0.50 0.71 1.78 0.50 0.71 2.00 0.50 0.86 0.00 0.50 0.86 0.22 0.50 0.86 0.44 0.50 0.86 0.67 0.50 0.86 0.89 0.50 0.86 1.11 0.50 0.86 1.33 0.50 0.86 1.56 0.50 0.86 1.78 0.50 0.86 2.00 0.50 1.00 0.00 0.50 1.00 0.22 0.50 1.00 0.44 0.50 1.00 0.67 0.50 1.00 0.89 0.50 1.00 1.11 0.50 1.00 1.33 0.50 1.00 1.56 0.50 1.00 1.78 0.50 1.00 2.00 0.50 
POINT_DATA 480
SCALARS lambda float
LOOKUP_TABLE default
1.00 1.00 1.00 1.00 1.00 1.00 1.00 1.00 1.00 1.00 1.00 1.00 1.00 1.00 1.00 1.00 1.00 1.00 1.00 1.00 1.00 1.00 1.00 1.00 1.00 1.00 1.00 1.00 1.00 1.00 1.00 1.00 1.00 1.00 1.00 1.00 1.00 1.00 1.00 1.00 1.00 1.00 1.00 1.00 1.00 1.00 1.00 1.00 1.00 1.00 1.00 1.00 1.00 1.00 1.00 1.00 1.00 1.00 1.00 1.00 1.00 1.00 1.00 1.00 1.00 1.00 1.00 1.00 1.00 1.00 1.00 1.00 1.00 1.00 1.00 1.00 1.00 1.00 1.00 1.00 2.00 2.00 2.00 2.00 2.00 2.00 2.00 2.00 2.00 2.00 2.00 2.00 2.00 2.00 2.00 2.00 2.00 2.00 2.00 2.00 2.00 2.00 2.00 2.00 2.00 2.00 2.00 2.00 2.00 2.00 2.00 2.00 2.00 2.00 2.00 2.00 2.00 2.00 2.00 2.00 2.00 2.00 2.00 2.00 2.00 2.00 2.00 2.00 2.00 2.00 2.00 2.00 2.00 2.00 2.00 2.00 2.00 2.00 2.00 2.00 2.00 2.00 2.00 2.00 2.00 2.00 2.00 2.00 2.00 2.00 2.00 2.00 2.00 2.00 2.00 2.00 2.00 2.00 2.00 2.00 3.00 3.00 3.00 3.00 3.00 3.00 3.00 3.00 3.00 3.00 3.00 3.00 3.00 3.00 3.00 3.00 3.00 3.00 3.00 3.00 3.00 3.00 3.00 3.00 3.00 3.00 3.00 3.00 3.00 3.00 3.00 3.00 3.00 3.00 3.00 3.00 3.00 3.00 3.00 3.00 3.00 3.00 3.00 3.00 3.00 3.00 3.00 3.00 3.00 3.00 3.00 3.00 3.00 3.00 3.00 3.00 3.00 3.00 3.00 3.00 3.00 3.00 3.00 3.00 3.00 3.00 3.00 3.00 3.00 3.00 3.00 3.00 3.00 3.00 3.00 3.00 3.00 3.00 3.00 3.00 4.00 4.00 4.00 4.00 4.00 4.00 4.00 4.00 4.00 4.00 4.00 4.00 4.00 4.00 4.00 4.00 4.00 4.00 4.00 4.00 4.00 4.00 4.00 4.00 4.00 4.00 4.00 4.00 4.00 4.00 4.00 4.00 4.00 4.00 4.00 4.00 4.00 4.00 4.00 4.00 4.00 4.00 4.00 4.00 4.00 4.00 4.00 4.00 4.00 4.00 4.00 4.00 4.00 4.00 4.00 4.00 4.00 4.00 4.00 4.00 4.00 4.00 4.00 4.00 4.00 4.00 4.00 4.00 4.00 4.00 4.00 4.00 4.00 4.00 4.00 4.00 4.00 4.00 4.00 4.00 5.00 5.00 5.00 5.00 5.00 5.00 5.00 5.00 5.00 5.00 5.00 5.00 5.00 5.00 5.00 5.00 5.00 5.00 5.00 5.00 5.00 5.00 5.00 5.00 5.00 5.00 5.00 5.00 5.00 5.00 5.00 5.00 5.00 5.00 5.00 5.00 5.00 5.00 5.00 5.00 5.00 5.00 5.00 5.00 5.00 5.00 5.00 5.00 5.00 5.00 5.00 5.00 5.00 5.00 5.00 5.00 5.00 5.00 5.00 5.00 5.00 5.00 5.00 5.00 5.00 5.00 5.00 5.00 5.00 5.00 5.00 5.00 5.00 5.00 5.00 5.00 5.00 5.00 5.00 5.00 6.00 6.00 6.00 6.00 6.00 6.00 6.00 6.00 6.00 6.00 6.00 6.00 6.00 6.00 6.00 6.00 6.00 6.00 6.00 6.00 6.00 6.00 6.00 6.00 6.00 6.00 6.00 6.00 6.00 6.00 6.00 6.00 6.00 6.00 6.00 6.00 6.00 6.00 6.00 6.00 6.00 6.00 6.00 6.00 6.00 6.00 6.00 6.00 6.00 6.00 6.00 6.00 6.00 6.00 6.00 6.00 6.00 6.00 6.00 6.00 6.00 6.00 6.00 6.00 6.00 6.00 6.00 6.00 6.00 6.00 6.00 6.00 6.00 6.00 6.00 6.00 6.00 6.00 6.00 6.00 