set terminal dumb 140,30
#set xrange [3:]
#plot "<  sed -n '/^\#/p' runtimedata.txt | sed -e 's/^\#//g' |  sed -e '/zz/d'" u 2:5 w l lw 2
plot "<  sed -n '/^\#/p' runtimedata.txt | sed -e 's/^\#//g' | tail -n +71 " u 2:10 w l lw 2
replot "<  sed -n '/^\#/p' runtimedata.txt | sed -e 's/^\#//g' | tail -n +71 " u 2:11 w l lw 2
replot "<  sed -n '/^\#/p' runtimedata.txt | sed -e 's/^\#//g' | tail -n +71 " u 2:12 w l lw 2
