{
    "Ag": 1.72,
    "Ar": 1.88,
    "As": 1.85,
    "Au": 1.66,
    "Br": 1.85,
    "C": 1.70,
    "Cd": 1.58,
    "Cl": 1.75,
    "Cu": 1.40,
    "F": 1.47,
    "Ga": 1.87,
    "H": 1.20,
    "He": 1.40,
    "Hg": 1.55,
    "I": 1.98,
    "In": 1.93,
    "K": 2.75,
    "Kr": 2.02,
    "Li": 1.82,
    "Mg": 1.73,
    "N": 1.55,
    "Na": 2.27,
    "Ne": 1.54,
    "Ni": 1.63,
    "O": 1.52,
    "P": 1.80,
    "Pb": 2.02,
    "Pd": 1.63,
    "Pt": 1.72,
    "S": 1.80,
    "Se": 1.90,
    "Si": 2.10,
    "Sn": 2.17,
    "Te": 2.06,
    "Tl": 1.96,
    "U": 1.86,
    "Xe": 2.16,
    "Zn": 1.39
}
