{
    "pattern": "C-N(-[H])-C(-[H])(-C)-C(=O)-N",
	"mainchain": [2, 4, 7],
	"caps": [1, 9],
	"lengths": {
		"4-2": 1.47,
		"2-3": 1.00,
		"7p-2": 1.32,
		"4-7": 1.53,
		"4-6": 1.54,
		"4-5": 1.07,
		"7-8": 1.24
	},
	"angles": {
		"2-4-6": 109.5,
		"7-4-5": 109.4,
		"5-4-6": 109.5,
		"6-4-7": 109.5,
		"2-4-7": 109.7,
		"7p-2-4": 120.9,
		"4-2-3": 116.1,
		"7p-2-3": 123.0,
		"8-7-2n": 123.6,
		"4-7-2n": 115.4,
		"8-7-4": 121.0,
		"7-4-6": 109.4
	},
	"dihedrals": {
		"2n-7-4-2": -47.5,
		"4-2-7p-4p": -179.8,
		"7p-2-4-7": -57.4
	},
	"chiral_orders": {
		"4": "5-6-7"
	}
}
