{
    "os": "Linux-5.15.0-72-generic-x86_64-with-glibc2.29",
    "python": "3.8.10",
    "heartbeatAt": "2023-05-25T13:58:17.353567",
    "startedAt": "2023-05-25T13:58:16.701307",
    "docker": null,
    "cuda": null,
    "args": [],
    "state": "running",
    "program": "<python with no main file>",
    "git": {
        "remote": "https://git.scc.kit.edu/balintvarga/dongxu-master-thesis.git",
        "commit": "254316a0fbc147737419a2ed53bbb90c33870f79"
    },
    "email": "ubtef@student.kit.edu",
    "root": "/home/yang/MasterThesis_ws/src/dongxu-master-thesis",
    "host": "yang-ThinkPad-T480s",
    "username": "yang",
    "executable": "/usr/bin/python3.8",
    "cpu_count": 4,
    "cpu_count_logical": 8,
    "cpu_freq": {
        "current": 3697.8843749999996,
        "min": 400.0,
        "max": 4000.0
    },
    "cpu_freq_per_core": [
        {
            "current": 3700.035,
            "min": 400.0,
            "max": 4000.0
        },
        {
            "current": 3700.001,
            "min": 400.0,
            "max": 4000.0
        },
        {
            "current": 3699.997,
            "min": 400.0,
            "max": 4000.0
        },
        {
            "current": 3699.995,
            "min": 400.0,
            "max": 4000.0
        },
        {
            "current": 3700.013,
            "min": 400.0,
            "max": 4000.0
        },
        {
            "current": 3700.001,
            "min": 400.0,
            "max": 4000.0
        },
        {
            "current": 3700.002,
            "min": 400.0,
            "max": 4000.0
        },
        {
            "current": 3699.996,
            "min": 400.0,
            "max": 4000.0
        }
    ],
    "disk": {
        "total": 109.54700088500977,
        "used": 30.558963775634766
    },
    "memory": {
        "total": 15.522789001464844
    }
}
