% This file was created with tikzplotlib v0.10.1.
\begin{tikzpicture}

\definecolor{darkgray176}{RGB}{176,176,176}
\definecolor{green}{RGB}{0,128,0}
\definecolor{lightgray204}{RGB}{204,204,204}

\begin{axis}[
legend cell align={left},
legend style={fill opacity=0.8, draw opacity=1, text opacity=1, draw=lightgray204},
tick align=outside,
tick pos=left,
title={Speed of vehicle and pedestrian},
x grid style={darkgray176},
xlabel={Time in s},
xmajorgrids,
xmin=-0.2325, xmax=4.8825,
xtick style={color=black},
y grid style={darkgray176},
ylabel={Speed in m/s},
ymajorgrids,
ymin=-0.299992861597782, ymax=6.29985009355342,
ytick style={color=black}
]
\addplot [thick, red]
table {%
0 5.99985723195563
0.01 5.99985044279197
0.02 5.9998436536283
0.03 5.99984111886674
0.04 5.99983858410517
0.05 5.99983604934361
0.06 5.99983351458204
0.07 5.99983097982048
0.08 5.99982844505892
0.09 5.99982591029735
0.1 5.99982337553579
0.11 5.99982084077422
0.12 5.99981830601266
0.13 5.99981577125109
0.14 5.99981323648953
0.15 5.99981197527372
0.16 5.99981071405791
0.17 5.9998094528421
0.18 5.99980819162628
0.19 5.99980693041047
0.2 5.99980566919466
0.21 5.99980440797885
0.22 5.99980314676304
0.23 5.99980188554722
0.24 5.99980062433141
0.25 5.99979779471375
0.26 5.99979496509609
0.27 5.99979213547843
0.28 5.99978930586077
0.29 5.99978647624311
0.3 5.99978364662545
0.31 5.99978081700779
0.32 5.99977798739013
0.33 5.99977515777247
0.34 5.96622683522584
0.35 5.93267851267921
0.36 5.89913019013258
0.37 5.86558186758595
0.38 5.83203354503932
0.39 5.79848522249269
0.4 5.76493689994606
0.41 5.73138857739943
0.42 5.6978402548528
0.43 5.66314395866135
0.44 5.62844766246989
0.45 5.59375136627843
0.46 5.55905507008698
0.47 5.52435877389552
0.48 5.48966247770407
0.49 5.45496618151261
0.5 5.42026988532116
0.51 5.3855735891297
0.52 5.35087729293824
0.53 5.31618099674679
0.54 5.28148470055533
0.55 5.25003775747402
0.56 5.21859081439271
0.57 5.18714387131139
0.58 5.15569692823008
0.59 5.12424998514876
0.6 5.09280304206745
0.61 5.06135609898613
0.62 5.02990915590482
0.63 4.99846221282351
0.64 4.96839698213827
0.65 4.93833175145304
0.66 4.90826652076781
0.67 4.87820129008258
0.68 4.84813605939734
0.69 4.81807082871211
0.7 4.78800559802688
0.71 4.75794036734165
0.72 4.72787513665642
0.73 4.69921614093069
0.74 4.67055714520497
0.75 4.64189814947925
0.76 4.61323915375353
0.77 4.58458015802781
0.78 4.55592116230209
0.79 4.52726216657636
0.8 4.49860317085064
0.81 4.46994417512492
0.82 4.4412851793992
0.83 4.41262618367348
0.84 4.38396718794776
0.85 4.3567434607533
0.86 4.32951973355885
0.87 4.3022960063644
0.88 4.27507227916995
0.89 4.24784855197549
0.9 4.22062482478104
0.91 4.19340109758659
0.92 4.16617737039214
0.93 4.13895364319769
0.94 4.11372244388646
0.95 4.08849124457524
0.96 4.06326004526401
0.97 4.03802884595279
0.98 4.01279764664156
0.99 3.98756644733034
1 3.96233524801912
1.01 3.93710404870789
1.02 3.91187284939667
1.03 3.88664165008544
1.04 3.86141045077422
1.05 3.83925157561365
1.06 3.81709270045308
1.07 3.79493382529252
1.08 3.77277495013195
1.09 3.75061607497138
1.1 3.72845719981081
1.11 3.70629832465025
1.12 3.68413944948968
1.13 3.66198057432911
1.14 3.63982169916854
1.15 3.61766282400797
1.16 3.60095540814164
1.17 3.58424799227531
1.18 3.56754057640898
1.19 3.55083316054265
1.2 3.53412574467632
1.21 3.51741832880999
1.22 3.50071091294366
1.23 3.48400349707733
1.24 3.46251535861791
1.25 3.44102722015848
1.26 3.41953908169906
1.27 3.39805094323963
1.28 3.33358652786136
1.29 3.29061025094251
1.3 3.26912211248309
1.31 3.24848898750484
1.32 3.2278558625266
1.33 3.20722273754835
1.34 3.1865896125701
1.35 3.16595648759185
1.36 3.14532336261361
1.37 3.12469023763536
1.38 3.10405711265711
1.39 3.08342398767887
1.4 3.06279086270062
1.41 3.04386479762668
1.42 3.02493873255275
1.43 3.00601266747881
1.44 2.98708660240488
1.45 2.96816053733094
1.46 2.949234472257
1.47 2.93030840718307
1.48 2.91138234210913
1.49 2.8924562770352
1.5 2.87353021196126
1.51 2.87353021196126
1.52 2.8554160538427
1.53 2.83730189572414
1.54 2.81918773760559
1.55 2.80107357948703
1.56 2.78295942136847
1.57 2.76484526324991
1.58 2.74673110513135
1.59 2.7286169470128
1.6 2.71050278889424
1.61 2.69238863077568
1.62 2.67476901411008
1.63 2.65714939744447
1.64 2.63952978077887
1.65 2.62191016411327
1.66 2.60429054744767
1.67 2.58667093078207
1.68 2.56905131411646
1.69 2.55143169745086
1.7 2.53381208078526
1.71 2.51619246411966
1.72 2.49932840128918
1.73 2.48246433845871
1.74 2.46560027562824
1.75 2.44873621279777
1.76 2.4318721499673
1.77 2.41500808713683
1.78 2.39814402430635
1.79 2.38127996147588
1.8 2.36441589864541
1.81 2.34755183581494
1.82 2.33147212005824
1.83 2.31539240430155
1.84 2.29931268854485
1.85 2.28323297278815
1.86 2.26715325703146
1.87 2.25107354127476
1.88 2.23499382551806
1.89 2.21891410976136
1.9 2.20283439400467
1.91 2.18753813596961
1.92 2.17224187793455
1.93 2.1569456198995
1.94 2.14164936186444
1.95 2.12635310382938
1.96 2.11105684579433
1.97 2.09576058775927
1.98 2.08046432972421
1.99 2.06516807168916
2 2.0498718136541
2.01 2.03457555561904
2.02 2.01927929758399
2.03 2.00474781249497
2.04 1.99021632740595
2.05 1.97568484231693
2.06 1.96115335722791
2.07 1.94662187213889
2.08 1.93209038704987
2.09 1.91755890196085
2.1 1.90302741687184
2.11 1.88927010935614
2.12 1.87551280184044
2.13 1.86175549432474
2.14 1.84799818680904
2.15 1.83424087929334
2.16 1.82048357177764
2.17 1.80672626426195
2.18 1.79296895674625
2.19 1.77921164923055
2.2 1.76545434171485
2.21 1.75169703419915
2.22 1.73793972668345
2.23 1.76929318168479
2.24 1.80064663668613
2.25 1.83200009168747
2.26 1.86335354668882
2.27 1.89470700169016
2.28 1.9260604566915
2.29 1.95741391169284
2.3 1.98876736669418
2.31 2.02047701143656
2.32 2.05218665617894
2.33 2.08389630092133
2.34 2.11560594566371
2.35 2.14731559040609
2.36 2.17902523514847
2.37 2.21073487989086
2.38 2.24244452463324
2.39 2.27415416937562
2.4 2.305863814118
2.41 2.33757345886039
2.42 2.36689524156511
2.43 2.39621702426983
2.44 2.42553880697455
2.45 2.45486058967927
2.46 2.484182372384
2.47 2.51350415508872
2.48 2.54282593779344
2.49 2.57214772049816
2.5 2.60146950320289
2.51 2.63079128590761
2.52 2.65798082986109
2.53 2.68517037381456
2.54 2.71235991776804
2.55 2.73954946172152
2.56 2.766739005675
2.57 2.79392854962848
2.58 2.82111809358196
2.59 2.84830763753543
2.6 2.87549718148891
2.61 2.90268672544239
2.62 2.92987626939587
2.63 2.95488108209155
2.64 2.97988589478723
2.65 3.00489070748292
2.66 3.0298955201786
2.67 3.05490033287428
2.68 3.07990514556997
2.69 3.10490995826565
2.7 3.12991477096133
2.71 3.1528971195196
2.72 3.17587946807788
2.73 3.19886181663615
2.74 3.22184416519442
2.75 3.2448265137527
2.76 3.26780886231097
2.77 3.29079121086924
2.78 3.31377355942752
2.79 3.33675590798579
2.8 3.35973825654406
2.81 3.38272060510234
2.82 3.40570295366061
2.83 3.42686136336276
2.84 3.44801977306491
2.85 3.46917818276706
2.86 3.49033659246922
2.87 3.51149500217137
2.88 3.53265341187352
2.89 3.55381182157567
2.9 3.57497023127782
2.91 3.59612864097998
2.92 3.61573278621707
2.93 3.63533693145416
2.94 3.65494107669126
2.95 3.67454522192835
2.96 3.69414936716544
2.97 3.71375351240253
2.98 3.73335765763963
2.99 3.75296180287672
3 3.77256594811381
3.01 3.7921700933509
3.02 3.811774238588
3.03 3.82978887185224
3.04 3.84780350511648
3.05 3.86581813838073
3.06 3.88383277164497
3.07 3.90184740490921
3.08 3.91986203817346
3.09 3.9378766714377
3.1 3.95589130470194
3.11 3.97241660205386
3.12 3.98894189940579
3.13 4.00546719675771
3.14 4.02199249410963
3.15 4.03851779146155
3.16 4.05504308881348
3.17 4.0715683861654
3.18 4.08809368351732
3.19 4.10461898086924
3.2 4.12114427822117
3.21 4.13766957557309
3.22 4.15419487292501
3.23 4.16937410177938
3.24 4.18455333063375
3.25 4.19973255948813
3.26 4.2149117883425
3.27 4.23009101719687
3.28 4.24527024605124
3.29 4.26044947490561
3.3 4.27562870375998
3.31 4.28987659733139
3.32 4.3041244909028
3.33 4.31837238447421
3.34 4.33262027804562
3.35 4.34686817161702
3.36 4.36111606518843
3.37 4.37536395875984
3.38 4.38961185233125
3.39 4.40270242912616
3.4 4.41579300592107
3.41 4.42888358271597
3.42 4.44197415951088
3.43 4.45506473630579
3.44 4.4681553131007
3.45 4.48124588989561
3.46 4.49433646669052
3.47 4.50742704348543
3.48 4.52051762028034
3.49 4.53360819707525
3.5 4.5456347030329
3.51 4.55766120899056
3.52 4.56968771494821
3.53 4.58171422090587
3.54 4.59374072686352
3.55 4.60576723282118
3.56 4.61779373877884
3.57 4.62982024473649
3.58 4.64184675069415
3.59 4.66589976260946
3.6 4.69930029220084
3.61 4.72156731192843
3.62 4.73270082179223
3.63 4.74383433165602
3.64 4.75496784151982
3.65 4.75496784151982
3.66 4.76610135138361
3.67 4.77596965904586
3.68 4.78583796670811
3.69 4.79570627437036
3.7 4.80557458203261
3.71 4.81544288969486
3.72 4.82531119735711
3.73 4.83517950501936
3.74 4.84504781268161
3.75 4.85491612034386
3.76 4.86478442800611
3.77 4.87392810378744
3.78 4.88307177956876
3.79 4.89221545535009
3.8 4.90135913113142
3.81 4.91050280691275
3.82 4.91964648269408
3.83 4.92879015847541
3.84 4.93793383425674
3.85 4.94707751003806
3.86 4.95622118581939
3.87 4.96463108772412
3.88 4.97304098962885
3.89 4.98145089153358
3.9 4.98986079343831
3.91 4.99827069534304
3.92 5.00668059724777
3.93 5.0150904991525
3.94 5.02350040105723
3.95 5.03191030296196
3.96 5.04032020486669
3.97 5.04805262055409
3.98 5.05578503624149
3.99 5.06351745192889
4 5.07124986761629
4.01 5.07898228330369
4.02 5.08671469899109
4.03 5.09444711467849
4.04 5.10217953036588
4.05 5.10991194605328
4.06 5.11702134357993
4.07 5.12413074110657
4.08 5.13124013863322
4.09 5.13834953615986
4.1 5.1454589336865
4.11 5.15256833121315
4.12 5.15967772873979
4.13 5.16678712626644
4.14 5.17389652379308
4.15 5.18811531884637
4.16 5.19471157865015
4.17 5.20130783845392
4.18 5.2079040982577
4.19 5.21450035806147
4.2 5.22109661786525
4.21 5.22769287766903
4.22 5.2342891374728
4.23 5.24088539727658
4.24 5.24748165708035
4.25 5.25349406452696
4.26 5.25950647197356
4.27 5.26551887942016
4.28 5.27153128686676
4.29 5.27754369431337
4.3 5.28355610175997
4.31 5.28956850920657
4.32 5.29558091665318
4.33 5.30159332409978
4.34 5.30760573154638
4.35 5.31361813899298
4.36 5.31914841749426
4.37 5.32467869599553
4.38 5.33020897449681
4.39 5.33573925299808
4.4 5.34126953149936
4.41 5.34679981000063
4.42 5.35233008850191
4.43 5.35786036700318
4.44 5.36339064550446
4.45 5.36892092400573
4.46 5.37400570867202
4.47 5.3790904933383
4.48 5.38417527800459
4.49 5.38926006267087
4.5 5.39434484733716
4.51 5.39942963200345
4.52 5.40451441666973
4.53 5.40959920133602
4.54 5.4146839860023
4.55 5.41976877066859
4.56 5.42444386341217
4.57 5.42911895615574
4.58 5.43379404889932
4.59 5.4384691416429
4.6 5.44314423438647
4.61 5.44781932713005
4.62 5.45249441987363
4.63 5.45716951261721
4.64 5.46184460536078
4.65 5.46651969810436
};
\addlegendentry{vehicle speed(MPC)}
\addplot [thick, green]
table {%
0 -0
0.01 -0
0.02 -0
0.03 -0
0.04 -0
0.05 -0
0.06 -0
0.07 -0
0.08 0.2
0.09 0.2
0.1 0.2
0.11 0.4
0.12 0.4
0.13 0.4
0.14 0.4
0.15 0.6
0.16 0.6
0.17 0.6
0.18 0.8
0.19 0.8
0.2 0.8
0.21 1
0.22 1
0.23 1
0.24 1
0.25 1.2
0.26 1.2
0.27 1.2
0.28 1.4
0.29 1.4
0.3 1.4
0.31 1.6
0.32 1.6
0.33 1.6
0.34 1.8
0.35 1.8
0.36 1.8
0.37 1.8
0.38 1.8
0.39 1.8
0.4 1.8
0.41 1.8
0.42 1.8
0.43 1.8
0.44 1.8
0.45 1.8
0.46 1.8
0.47 1.8
0.48 1.8
0.49 1.8
0.5 1.8
0.51 1.8
0.52 1.8
0.53 1.8
0.54 1.8
0.55 1.8
0.56 1.8
0.57 1.8
0.58 1.8
0.59 1.8
0.6 1.8
0.61 1.8
0.62 1.8
0.63 1.8
0.64 1.8
0.65 1.8
0.66 1.8
0.67 1.8
0.68 1.8
0.69 1.8
0.7 1.8
0.71 1.8
0.72 1.8
0.73 1.8
0.74 1.8
0.75 1.8
0.76 1.8
0.77 1.8
0.78 1.8
0.79 1.8
0.8 1.8
0.81 1.8
0.82 1.8
0.83 1.8
0.84 1.8
0.85 1.8
0.86 1.8
0.87 1.8
0.88 1.8
0.89 1.8
0.9 1.8
0.91 1.8
0.92 1.8
0.93 1.8
0.94 1.8
0.95 1.8
0.96 1.8
0.97 1.8
0.98 1.8
0.99 1.8
1 1.8
1.01 1.8
1.02 1.8
1.03 1.8
1.04 1.8
1.05 1.8
1.06 1.8
1.07 1.8
1.08 1.8
1.09 1.8
1.1 1.8
1.11 1.8
1.12 1.8
1.13 1.8
1.14 1.8
1.15 1.8
1.16 1.8
1.17 1.8
1.18 1.8
1.19 1.8
1.2 1.8
1.21 1.8
1.22 1.8
1.23 -0
1.24 -0
1.25 -0
1.26 -0
1.27 -0
1.28 -0
1.29 -0
1.3 -0
1.31 -0
1.32 -0
1.33 -0
1.34 -0
1.35 -0
1.36 -0
1.37 -0
1.38 -0
1.39 -0
1.4 -0
1.41 -0
1.42 -0
1.43 -0
1.44 -0
1.45 -0
1.46 -0
1.47 -0
1.48 -0
1.49 -0
1.5 -0
1.51 -0
1.52 -0
1.53 -0
1.54 -0
1.55 -0
1.56 -0
1.57 -0
1.58 -0
1.59 -0
1.6 -0
1.61 -0
1.62 -0
1.63 -0
1.64 -0
1.65 -0
1.66 -0
1.67 -0
1.68 -0
1.69 -0
1.7 -0
1.71 -0
1.72 -0
1.73 -0
1.74 -0
1.75 -0
1.76 -0
1.77 -0
1.78 -0
1.79 -0
1.8 -0
1.81 -0
1.82 -0
1.83 -0
1.84 -0
1.85 -0
1.86 -0
1.87 -0
1.88 -0
1.89 -0
1.9 -0
1.91 -0
1.92 -0
1.93 -0
1.94 -0
1.95 -0
1.96 -0
1.97 -0
1.98 -0
1.99 -0
2 -0
2.01 -0
2.02 -0
2.03 -0
2.04 -0
2.05 -0
2.06 -0
2.07 -0
2.08 -0
2.09 -0
2.1 -0
2.11 -0
2.12 -0
2.13 -0
2.14 -0
2.15 -0
2.16 -0
2.17 -0
2.18 -0
2.19 -0
2.2 -0
2.21 -0
2.22 -0
2.23 -0
2.24 -0
2.25 -0
2.26 -0
2.27 -0
2.28 -0
2.29 -0
2.3 -0
2.31 -0
2.32 -0
2.33 -0
2.34 -0
2.35 -0
2.36 -0
2.37 -0
2.38 -0
2.39 -0
2.4 -0
2.41 -0
2.42 -0
2.43 -0
2.44 -0
2.45 -0
2.46 -0
2.47 -0
2.48 -0
2.49 -0
2.5 -0
2.51 -0
2.52 -0
2.53 -0
2.54 -0
2.55 -0
2.56 -0
2.57 -0
2.58 -0
2.59 -0
2.6 -0
2.61 -0
2.62 -0
2.63 -0
2.64 -0
2.65 -0
2.66 -0
2.67 -0
2.68 -0
2.69 -0
2.7 -0
2.71 -0
2.72 -0
2.73 -0
2.74 -0
2.75 -0
2.76 -0
2.77 -0
2.78 -0
2.79 -0
2.8 -0
2.81 -0
2.82 -0
2.83 -0
2.84 -0
2.85 -0
2.86 -0
2.87 -0
2.88 -0
2.89 -0
2.9 -0
2.91 -0
2.92 -0
2.93 -0
2.94 -0
2.95 -0
2.96 -0
2.97 -0
2.98 -0
2.99 -0
3 -0
3.01 -0
3.02 -0
3.03 -0
3.04 -0
3.05 -0
3.06 -0
3.07 -0
3.08 -0
3.09 -0
3.1 -0
3.11 -0
3.12 -0
3.13 -0
3.14 -0
3.15 -0
3.16 -0
3.17 -0
3.18 -0
3.19 -0
3.2 -0
3.21 -0
3.22 -0
3.23 -0
3.24 -0
3.25 -0
3.26 -0
3.27 -0
3.28 -0
3.29 -0
3.3 -0
3.31 -0
3.32 -0
3.33 -0
3.34 -0
3.35 -0
3.36 -0
3.37 -0
3.38 -0
3.39 -0
3.4 -0
3.41 -0
3.42 -0
3.43 -0
3.44 -0
3.45 -0
3.46 -0
3.47 -0
3.48 -0
3.49 -0
3.5 -0
3.51 -0
3.52 -0
3.53 -0
3.54 -0
3.55 -0
3.56 -0
3.57 -0
3.58 -0
3.59 -0
3.6 -0
3.61 -0
3.62 -0
3.63 -0
3.64 -0
3.65 -0
3.66 -0
3.67 -0
3.68 -0
3.69 -0
3.7 -0
3.71 -0
3.72 -0
3.73 -0
3.74 -0
3.75 -0
3.76 -0
3.77 -0
3.78 -0
3.79 -0
3.8 -0
3.81 -0
3.82 -0
3.83 -0
3.84 -0
3.85 -0
3.86 -0
3.87 -0
3.88 -0
3.89 -0
3.9 -0
3.91 -0
3.92 -0
3.93 -0
3.94 -0
3.95 -0
3.96 -0
3.97 -0
3.98 -0
3.99 -0
4 -0
4.01 -0
4.02 -0
4.03 -0
4.04 -0
4.05 -0
4.06 -0
4.07 -0
4.08 -0
4.09 -0
4.1 -0
4.11 -0
4.12 -0
4.13 -0
4.14 -0
4.15 -0
4.16 -0
4.17 -0
4.18 -0
4.19 -0
4.2 -0
4.21 -0
4.22 -0
4.23 -0
4.24 -0
4.25 -0
4.26 -0
4.27 -0
4.28 -0
4.29 -0
4.3 -0
4.31 -0
4.32 -0
4.33 -0
4.34 -0
4.35 -0
4.36 -0
4.37 -0
4.38 -0
4.39 -0
4.4 -0
4.41 -0
4.42 -0
4.43 -0
4.44 -0
4.45 -0
4.46 -0
4.47 -0
4.48 -0
4.49 -0
4.5 -0
4.51 -0
4.52 -0
4.53 -0
4.54 -0
4.55 -0
4.56 -0
4.57 -0
4.58 -0
4.59 -0
4.6 -0
4.61 -0
4.62 -0
4.63 -0
4.64 -0
4.65 -0
};
\addlegendentry{human speed(MPC)}
\end{axis}

\begin{axis}[
axis y line=right,
legend cell align={left},
legend style={
  fill opacity=0.8,
  draw opacity=1,
  text opacity=1,
  at={(0.97,0.03)},
  anchor=south east,
  draw=lightgray204
},
tick align=outside,
x grid style={darkgray176},
xmin=-0.2325, xmax=4.8825,
xtick pos=left,
xtick style={color=black},
y grid style={darkgray176},
ylabel={Intention of Pedestrian},
ymin=0, ymax=1.5,
ytick pos=right,
ytick style={color=black},
yticklabel style={anchor=west}
]
\addplot [very thick, blue]
table {%
0 0.8
0.01 0.8
0.02 0.8
0.03 0.8
0.04 0.8
0.05 0.8
0.06 0.8
0.07 0.8
0.08 0.8
0.09 0.8
0.1 0.8
0.11 0.8
0.12 0.8
0.13 0.8
0.14 0.8
0.15 0.8
0.16 0.8
0.17 0.8
0.18 0.8
0.19 0.8
0.2 0.8
0.21 0.8
0.22 0.8
0.23 0.8
0.24 0.8
0.25 0.8
0.26 0.8
0.27 0.8
0.28 0.8
0.29 0.8
0.3 0.8
0.31 0.8
0.32 0.8
0.33 0.8
0.34 0.8
0.35 0.8
0.36 0.8
0.37 0.8
0.38 0.8
0.39 0.8
0.4 0.8
0.41 0.8
0.42 0.8
0.43 0.8
0.44 0.8
0.45 0.8
0.46 0.8
0.47 0.8
0.48 0.8
0.49 0.8
0.5 0.8
0.51 0.8
0.52 0.8
0.53 0.8
0.54 0.8
0.55 0.8
0.56 0.8
0.57 0.8
0.58 0.8
0.59 0.8
0.6 0.8
0.61 0.8
0.62 0.8
0.63 0.8
0.64 0.8
0.65 0.8
0.66 0.8
0.67 0.8
0.68 0.8
0.69 0.8
0.7 0.8
0.71 0.8
0.72 0.8
0.73 0.8
0.74 0.8
0.75 0.8
0.76 0.8
0.77 0.8
0.78 0.8
0.79 0.8
0.8 0.8
0.81 0.8
0.82 0.8
0.83 0.8
0.84 0.8
0.85 0.8
0.86 0.8
0.87 0.8
0.88 0.8
0.89 0.8
0.9 0.8
0.91 0.8
0.92 0.8
0.93 0.8
0.94 0.8
0.95 0.8
0.96 0.8
0.97 0.8
0.98 0.8
0.99 0.8
1 0.8
1.01 0.8
1.02 0.8
1.03 0.8
1.04 0.8
1.05 0.8
1.06 0.8
1.07 0.8
1.08 0.8
1.09 0.8
1.1 0.8
1.11 0.8
1.12 0.8
1.13 0.8
1.14 0.8
1.15 0.8
1.16 0.8
1.17 0.8
1.18 0.8
1.19 0.8
1.2 0.8
1.21 0.8
1.22 0.8
1.23 0.8
1.24 0.8
1.25 0.8
1.26 0.8
1.27 0.8
1.28 0.8
1.29 0.8
1.3 0.8
1.31 0.8
1.32 0.8
1.33 0.8
1.34 0.8
1.35 0.8
1.36 0.8
1.37 0.8
1.38 0.8
1.39 0.8
1.4 0.8
1.41 0.8
1.42 0.8
1.43 0.8
1.44 0.8
1.45 0.8
1.46 0.8
1.47 0.8
1.48 0.8
1.49 0.8
1.5 0.8
1.51 0.8
1.52 0.8
1.53 0.8
1.54 0.8
1.55 0.8
1.56 0.8
1.57 0.8
1.58 0.8
1.59 0.8
1.6 0.8
1.61 0.8
1.62 0.8
1.63 0.8
1.64 0.8
1.65 0.8
1.66 0.8
1.67 0.8
1.68 0.8
1.69 0.8
1.7 0.8
1.71 0.8
1.72 0.8
1.73 0.8
1.74 0.8
1.75 0.8
1.76 0.8
1.77 0.8
1.78 0.8
1.79 0.8
1.8 0.8
1.81 0.8
1.82 0.8
1.83 0.8
1.84 0.8
1.85 0.8
1.86 0.8
1.87 0.8
1.88 0.8
1.89 0.8
1.9 0.8
1.91 0.8
1.92 0.8
1.93 0.8
1.94 0.8
1.95 0.8
1.96 0.8
1.97 0.8
1.98 0.8
1.99 0.8
2 0.8
2.01 0.8
2.02 0.8
2.03 0.8
2.04 0.8
2.05 0.8
2.06 0.8
2.07 0.8
2.08 0.8
2.09 0.8
2.1 0.2
2.11 0.2
2.12 0.2
2.13 0.2
2.14 0.2
2.15 0.2
2.16 0.2
2.17 0.2
2.18 0.2
2.19 0.2
2.2 0.2
2.21 0.2
2.22 0.2
2.23 0.2
2.24 0.2
2.25 0.2
2.26 0.2
2.27 0.2
2.28 0.2
2.29 0.2
2.3 0.2
2.31 0.2
2.32 0.2
2.33 0.2
2.34 0.2
2.35 0.2
2.36 0.2
2.37 0.2
2.38 0.2
2.39 0.2
2.4 0.2
2.41 0.2
2.42 0.2
2.43 0.2
2.44 0.2
2.45 0.2
2.46 0.2
2.47 0.2
2.48 0.2
2.49 0.2
2.5 0.2
2.51 0.2
2.52 0.2
2.53 0.2
2.54 0.2
2.55 0.2
2.56 0.2
2.57 0.2
2.58 0.2
2.59 0.2
2.6 0.2
2.61 0.2
2.62 0.2
2.63 0.2
2.64 0.2
2.65 0.2
2.66 0.2
2.67 0.2
2.68 0.2
2.69 0.2
2.7 0.2
2.71 0.2
2.72 0.2
2.73 0.2
2.74 0.2
2.75 0.2
2.76 0.2
2.77 0.2
2.78 0.2
2.79 0.2
2.8 0.2
2.81 0.2
2.82 0.2
2.83 0.2
2.84 0.2
2.85 0.2
2.86 0.2
2.87 0.2
2.88 0.2
2.89 0.2
2.9 0.2
2.91 0.2
2.92 0.2
2.93 0.2
2.94 0.2
2.95 0.2
2.96 0.2
2.97 0.2
2.98 0.2
2.99 0.2
3 0.2
3.01 0.2
3.02 0.2
3.03 0.2
3.04 0.2
3.05 0.2
3.06 0.2
3.07 0.2
3.08 0.2
3.09 0.2
3.1 0.2
3.11 0.2
3.12 0.2
3.13 0.2
3.14 0.2
3.15 0.2
3.16 0.2
3.17 0.2
3.18 0.2
3.19 0.2
3.2 0.2
3.21 0.2
3.22 0.2
3.23 0.2
3.24 0.2
3.25 0.2
3.26 0.2
3.27 0.2
3.28 0.2
3.29 0.2
3.3 0.2
3.31 0.2
3.32 0.2
3.33 0.2
3.34 0.2
3.35 0.2
3.36 0.2
3.37 0.2
3.38 0.2
3.39 0.2
3.4 0.2
3.41 0.2
3.42 0.2
3.43 0.2
3.44 0.2
3.45 0.2
3.46 0.2
3.47 0.2
3.48 0.2
3.49 0.2
3.5 0.2
3.51 0.2
3.52 0.2
3.53 0.2
3.54 0.2
3.55 0.2
3.56 0.2
3.57 0.2
3.58 0.2
3.59 0.2
3.6 0.2
3.61 0.2
3.62 0.2
3.63 0.2
3.64 0.2
3.65 0.2
3.66 0.2
3.67 0.2
3.68 0.2
3.69 0.2
3.7 0.2
3.71 0.2
3.72 0.2
3.73 0.2
3.74 0.2
3.75 0.2
3.76 0.2
3.77 0.2
3.78 0.2
3.79 0.2
3.8 0.2
3.81 0.2
3.82 0.2
3.83 0.2
3.84 0.2
3.85 0.2
3.86 0.2
3.87 0.2
3.88 0.2
3.89 0.2
3.9 0.2
3.91 0.2
3.92 0.2
3.93 0.2
3.94 0.2
3.95 0.2
3.96 0.2
3.97 0.2
3.98 0.2
3.99 0.2
4 0.2
4.01 0.2
4.02 0.2
4.03 0.2
4.04 0.2
4.05 0.2
4.06 0.2
4.07 0.2
4.08 0.2
4.09 0.2
4.1 0.2
4.11 0.2
4.12 0.2
4.13 0.2
4.14 0.2
4.15 0.2
4.16 0.2
4.17 0.2
4.18 0.2
4.19 0.2
4.2 0.2
4.21 0.2
4.22 0.2
4.23 0.2
4.24 0.2
4.25 0.2
4.26 0.2
4.27 0.2
4.28 0.2
4.29 0.2
4.3 0.2
4.31 0.2
4.32 0.2
4.33 0.2
4.34 0.2
4.35 0.2
4.36 0.2
4.37 0.2
4.38 0.2
4.39 0.2
4.4 0.2
4.41 0.2
4.42 0.2
4.43 0.2
4.44 0.2
4.45 0.2
4.46 0.2
4.47 0.2
4.48 0.2
4.49 0.2
4.5 0.2
4.51 0.2
4.52 0.2
4.53 0.2
4.54 0.2
4.55 0.2
4.56 0.2
4.57 0.2
4.58 0.2
4.59 0.2
4.6 0.2
4.61 0.2
4.62 0.2
4.63 0.2
4.64 0.2
4.65 0.2
};
\addlegendentry{human intention}
\end{axis}

\end{tikzpicture}
