% This file was created with tikzplotlib v0.10.1.
\begin{tikzpicture}

\definecolor{darkgray176}{RGB}{176,176,176}
\definecolor{green}{RGB}{0,128,0}
\definecolor{green01270}{RGB}{0,127,0}
\definecolor{lightgray204}{RGB}{204,204,204}

\begin{axis}[
legend cell align={left},
legend style={fill opacity=0.8, draw opacity=1, text opacity=1, draw=lightgray204},
tick align=outside,
tick pos=left,
title={Speed of vehicle and pedestrian},
x grid style={darkgray176},
xlabel={Distance between vehicle and human in m (in x direction)},
xmajorgrids,
xmin=-13.6138804834641, xmax=7.1343021243595,
xtick style={color=black},
y grid style={darkgray176},
ylabel={Speed in m/s},
ymajorgrids,
ymin=-0.130445412588011, ymax=9.42665083817072,
ytick style={color=black}
]
\addplot [semithick, red]
table {%
-12.6707812740175 5.95010919188378
-12.3767186838883 5.92014779335301
-12.075474777893 6.09469833760722
-11.765503344685 6.26924888186143
-11.4468043842643 6.44379942611564
-11.1193778966309 6.61834997036985
-10.7832238817848 6.79290051462406
-10.438342339726 6.96745105887828
-10.0847332704544 7.14200160313249
-9.72065116852764 7.38637236508838
-9.34749243829963 7.56092290934259
-8.9652570797704 7.70056334474596
-8.57499239620547 7.87511388900017
-8.17600018542784 8.04966443325438
-7.76828044743749 8.2242149775086
-7.35183318223444 8.39876552176281
-6.92665838981867 8.57331606601703
-6.49275607019019 8.74786661027124
-6.050126223349 8.92241715452546
-5.60086345582614 8.99223737222714
-5.15125158721477 8.99223737222714
-4.7016397186034 8.99223737222714
-4.25202784999203 8.99223737222714
-3.80241598138066 8.99223737222714
-3.35280411276929 8.99223737222714
-2.90319224415792 8.99223737222714
-2.45358037554655 8.99223737222714
-2.00396850693518 8.99223737222714
-1.55435663832381 8.99223737222714
-1.10474476971244 8.99223737222714
-0.655132901101069 8.99223737222714
-0.205521032489699 8.99223737222714
0.244090836121671 8.99223737222714
0.693702704733042 8.99223737222714
1.14331457334441 8.99223737222714
1.59292644195578 8.99223737222714
2.04253831056715 8.99223737222714
2.49215017917852 8.99223737222714
2.94176204778989 8.99223737222714
3.39137391640126 8.99223737222714
};
\addlegendentry{vehicle speed(SFM)}
\addplot [semithick, green]
table {%
-12.6707812740175 0.303968053355568
-12.3767186838883 0.311610231987883
-12.075474777893 0.316284426503709
-11.765503344685 0.32102873496872
-11.4468043842643 0.325844208691726
-11.1193778966309 0.330731915161058
-10.7832238817848 0.335692937877518
-10.438342339726 0.34072837659457
-10.0847332704544 0.344811056647991
-9.72065116852764 0.352070717615332
-9.34749243829963 0.357354975056938
-8.9652570797704 0.361643263275349
-8.57499239620547 0.367071195988375
-8.17600018542784 0.372577312750215
-7.76828044743749 0.378166021996167
-7.35183318223444 0.383838562624136
-6.92665838981867 0.389596192116002
-6.49275607019019 0.39544018681604
-6.050126223349 0.40137184221386
-5.60086345582614 0.407392473231589
-5.15125158721477 0.412273936704048
-4.7016397186034 0.418450712722699
-4.25202784999203 0.424708910054088
-3.80241598138066 0.432346239437357
-3.35280411276929 0.438831501763972
-2.90319224415792 0.445414032657277
-2.45358037554655 0.452095302389493
-2.00396850693518 0.458876792056336
-1.55435663832381 0.465760004970155
-1.10474476971244 0.472746466993184
-0.655132901101069 0.479837726875794
-0.205521032489699 0.487035356599817
0.244090836121671 0.494340951727022
0.693702704733042 0.501756131752816
1.14331457334441 0.509282540465256
1.59292644195578 0.516921846309433
2.04253831056715 0.523115714082343
2.49215017917852 0.530948479071086
2.94176204778989 0.538889166050143
3.39137391640126 0.546948610859337
};
\addlegendentry{human speed(SFM)}
\addplot [semithick, red, dashed]
table {%
-12.056103278491 5.95302465579654
-11.7654983473317 5.71814793477921
-11.4861674987812 5.53024655796535
-11.2057396145856 5.6868688098586
-10.9139566171277 5.92180218769847
-10.6119931732968 6.11758000256503
-10.3002408387225 6.31335781743159
-9.97869961340496 6.50913563229814
-9.64736949734406 6.7049134471647
-9.30429271239117 6.93984682500457
-8.95142703669495 7.13562463987113
-8.58877247025539 7.33140245473769
-8.2163290130725 7.52718026960424
-7.83409666514628 7.7229580844708
-7.44207542647675 7.91873589933736
-7.04026529706389 8.11451371420392
-6.62905783253744 8.27113596609716
-6.2155010342326 8.27113596609716
-5.80194423592775 8.27113596609716
-5.3883874376229 8.27113596609716
-4.97483063931806 8.27113596609716
-4.56127384101321 8.27113596609716
-4.14771704270836 8.27113596609716
-3.73416024440352 8.27113596609716
-3.32060344609867 8.27113596609716
-2.90704664779383 8.27113596609716
-2.49348984948898 8.27113596609716
-2.07993305118413 8.27113596609716
-1.66637625287929 8.27113596609716
-1.25281945457444 8.27113596609716
-0.839262656269597 8.27113596609716
-0.425705857964751 8.27113596609716
-0.0121490596599045 8.27113596609716
0.401407738644942 8.27113596609716
0.814964536949788 8.27113596609716
1.22852133525463 8.27113596609716
1.64207813355948 8.27113596609716
2.05563493186433 8.27113596609716
2.46919173016917 8.27113596609716
2.88274852847402 8.27113596609716
3.29630532677886 8.27113596609716
3.70986212508371 8.27113596609716
4.12341892338857 8.27113596609716
4.53697572169345 8.27113596609716
4.95053251999833 8.27113596609716
5.36408931830321 8.27113596609716
5.7776461166081 8.27113596609716
6.19120291491298 8.27113596609716
};
\addlegendentry{vehicle speed(MDP)}
\addplot [semithick, green01270, dashed]
table {%
-12.056103278491 0.30451978286158
-11.7654983473317 0.331916407550163
-11.4861674987812 0.347608649957492
-11.2057396145856 0.351399272796305
-10.9139566171277 0.35754837235795
-10.6119931732968 0.361744996075745
-10.3002408387225 0.367049393655807
-9.97869961340496 0.372437764868593
-9.64736949734406 0.378996804165767
-9.30429271239117 0.384550955436424
-8.95142703669495 0.389052860677096
-8.58877247025539 0.394771040571755
-8.2163290130725 0.400569628892426
-7.83409666514628 0.406439631053138
-7.44207542647675 0.412395907245934
-7.04026529706389 0.418439568915095
-6.62905783253744 0.424571796754666
-6.2155010342326 0.43079389182781
-5.80194423592775 0.43838088706261
-5.3883874376229 0.44480535424226
-4.97483063931806 0.451335402082847
-4.56127384101321 0.456630552722683
-4.14771704270836 0.463337765388636
-3.73416024440352 0.470131572559869
-3.32060344609867 0.477021156791488
-2.90704664779383 0.485422285693873
-2.49348984948898 0.492536145022141
-2.07993305118413 0.499766913580496
-1.66637625287929 0.507112148406883
-1.25281945457444 0.514565103439348
-0.839262656269597 0.522127586021116
-0.425705857964751 0.528257519113891
-0.0121490596599045 0.536021238154783
0.401407738644942 0.543885246914497
0.814964536949788 0.551855556089776
1.22852133525463 0.559942962309245
1.64207813355948 0.568148923325376
2.05563493186433 0.576475139717389
2.46919173016917 0.584923376662301
2.88274852847402 0.593495422449549
3.29630532677886 0.60394786160499
3.70986212508371 0.612798711013603
4.12341892338857 0.619972690250573
4.53697572169345 0.629084858750251
4.95053251999833 0.638319773700909
5.36408931830321 0.64767387798263
5.7776461166081 0.657165447528004
6.19120291491298 0.666796204979286
};
\addlegendentry{human speed(MDP)}
\end{axis}

\end{tikzpicture}
