% This file was created with tikzplotlib v0.10.1.
\begin{tikzpicture}

\definecolor{darkgray176}{RGB}{176,176,176}
\definecolor{green}{RGB}{0,128,0}
\definecolor{green01270}{RGB}{0,127,0}
\definecolor{lightgray204}{RGB}{204,204,204}

\begin{axis}[
legend cell align={left},
legend style={fill opacity=0.8, draw opacity=1, text opacity=1, draw=lightgray204},
tick align=outside,
tick pos=left,
title={Speed of vehicle and pedestrian},
x grid style={darkgray176},
xlabel={Distance between vehicle and human in m (in x direction)},
xmajorgrids,
xmin=-11.761280832772, xmax=6.97341028131796,
xtick style={color=black},
y grid style={darkgray176},
ylabel={Speed in m/s},
ymajorgrids,
ymin=-0.449245581590241, ymax=9.43415721339506,
ytick style={color=black}
]
\addplot [semithick, red]
table {%
-10.7947429052565 5.92688963306158
-10.5058665339189 5.67838039130981
-10.2292962841682 5.43402548832989
-9.9652800553872 5.14680288619401
-9.71727397965768 4.8689978480103
-9.47877988416143 4.68928881375919
-9.25099302172665 4.46744049037936
-9.03412875504105 4.25129344809483
-8.827894474396 4.04108552033032
-8.63198742716911 3.83700679101146
-8.4460960765518 3.63922317944152
-8.26990134795026 3.44787517777561
-8.10307793151656 3.26307685584801
-7.94459554186112 3.15492345371416
-7.78161285284779 3.32947399796837
-7.60990263662174 3.50402454222258
-7.42946489318299 3.6785750864768
-7.24029962253152 3.85312563073101
-7.04240682466735 4.02767617498522
-6.83578649959046 4.20222671923943
-6.62043864730087 4.37677726349364
-6.39636326779856 4.55132780774785
-6.16356036108353 4.72587835200206
-5.9220299271558 4.90042889625627
-5.67177196601536 5.07497944051048
-5.41278647766221 5.24952998476469
-5.14507346209635 5.4240805290189
-4.86863291931778 5.59863107327311
-4.5834648493265 5.77318161752732
-4.2895692521225 5.94773216178153
-3.9869461277058 6.12228270603574
-3.67559547607639 6.29683325028995
-3.35551729723426 6.47138379454417
-3.02671159117943 6.64593433879838
-2.68917835791189 6.82048488305259
-2.34291759743163 6.9950354273068
-1.98792930973866 7.16958597156101
-1.62421349483299 7.34413651581522
-1.2517701527146 7.51868706006943
-0.870599283383498 7.69323760432364
-0.475813471600574 8.00742858398122
-0.0712528293394143 8.14706901938459
0.341337137957439 8.32161956363881
0.762654632467004 8.49617010789302
1.19269965418928 8.67072065214724
1.63147220312428 8.84527119640145
2.07862317818346 8.98491163180482
2.52786875977371 8.98491163180482
2.97711434136396 8.98491163180482
3.42635992295421 8.98491163180482
3.87560550454445 8.98491163180482
4.3248510861347 8.98491163180482
4.77409666772495 8.98491163180482
5.22334224931519 8.98491163180482
5.67258783090544 8.98491163180482
6.12183341249569 8.98491163180482
};
\addlegendentry{vehicle speed(SFM)}
\addplot [semithick, green]
table {%
-10.7947429052565 0.6
-10.5058665339189 1
-10.2292962841682 1.2
-9.9652800553872 1.6
-9.71727397965768 1.8
-9.47877988416143 2.2
-9.25099302172665 2.4
-9.03412875504105 2.4
-8.827894474396 2.4
-8.63198742716911 2.4
-8.4460960765518 2.4
-8.26990134795026 2.4
-8.10307793151656 2.4
-7.94459554186112 -0
-7.78161285284779 -0
-7.60990263662174 -0
-7.42946489318299 -0
-7.24029962253152 -0
-7.04240682466735 -0
-6.83578649959046 -0
-6.62043864730087 -0
-6.39636326779856 -0
-6.16356036108353 -0
-5.9220299271558 -0
-5.67177196601536 -0
-5.41278647766221 -0
-5.14507346209635 -0
-4.86863291931778 -0
-4.5834648493265 -0
-4.2895692521225 -0
-3.9869461277058 -0
-3.67559547607639 -0
-3.35551729723426 -0
-3.02671159117943 -0
-2.68917835791189 -0
-2.34291759743163 -0
-1.98792930973866 -0
-1.62421349483299 -0
-1.2517701527146 -0
-0.870599283383498 -0
-0.475813471600574 -0
-0.0712528293394143 -0
0.341337137957439 -0
0.762654632467004 -0
1.19269965418928 -0
1.63147220312428 -0
2.07862317818346 -0
2.52786875977371 -0
2.97711434136396 -0
3.42635992295421 -0
3.87560550454445 -0
4.3248510861347 -0
4.77409666772495 -0
5.22334224931519 -0
5.67258783090544 -0
6.12183341249569 -0
};
\addlegendentry{human speed(SFM)}
\addplot [semithick, red, dashed]
table {%
-10.9097039639497 6
-10.6111132242758 5.90604931159307
-10.3228570603267 5.67117259057575
-10.0463447324284 5.43629586955842
-9.781576240581 5.2014191485411
-9.52855158478446 4.96654242752378
-9.28727076503879 4.73166570650646
-9.05773378134399 4.49678898548913
-8.83986221770758 4.26529663304159
-8.63338602752258 4.03985076554959
-8.43798736815135 3.8209518200743
-8.25332905187543 3.60890565629461
-8.07906156690866 3.40393563364657
-7.91482547213739 3.20622461250243
-7.76025326382157 3.01591964255443
-7.61271186396752 2.98365046568767
-7.45765600623714 3.17942828055422
-7.29281125776343 3.37520609542078
-7.1181776185464 3.57098391028733
-6.93375508858605 3.76676172515389
-6.73954366788237 3.96253954002044
-6.53554335643533 4.158317354887
-6.32175415424498 4.35409516975356
-6.0981760613113 4.54987298462012
-5.8648090776343 4.74565079948668
-5.62165320321397 4.94142861435323
-5.36831688242059 5.1763619921931
-5.10362544836494 5.37213980705966
-4.82914512356595 5.56791762192622
-4.54487590802363 5.76369543679278
-4.25081780173799 5.95947325165933
-3.94697080470903 6.15525106652589
-3.63333491693675 6.35102888139245
-3.30991013842114 6.54680669625901
-2.97669646916221 6.74258451112557
-2.63369390915992 6.93836232599212
-2.2809024584143 7.13414014085868
-1.91832211692537 7.32991795572524
-1.54516977343364 7.56485133356511
-1.15909609416073 7.79978471140498
-0.763233524144496 7.99556252627154
-0.357582063384932 8.19134034113809
0.0539427318206549 8.23049590411141
0.465467527026242 8.23049590411141
0.876992322231828 8.23049590411141
1.28851711743742 8.23049590411141
1.700041912643 8.23049590411141
2.11156670784859 8.23049590411141
2.52309150305418 8.23049590411141
2.93461629825976 8.23049590411141
3.34614109346535 8.23049590411141
3.75766588867094 8.23049590411141
4.16919068387651 8.23049590411141
4.58071547908206 8.23049590411141
4.99224027428761 8.23049590411141
};
\addlegendentry{vehicle speed(MDP)}
\addplot [semithick, green01270, dashed]
table {%
-10.9097039639497 0.6
-10.6111132242758 0.8
-10.3228570603267 1.2
-10.0463447324284 1.4
-9.781576240581 1.8
-9.52855158478446 2
-9.28727076503879 2.4
-9.05773378134399 2.5
-8.83986221770758 2.5
-8.63338602752258 2.5
-8.43798736815135 2.5
-8.25332905187543 2.5
-8.07906156690866 2.5
-7.91482547213739 -0
-7.76025326382157 -0
-7.61271186396752 -0
-7.45765600623714 -0
-7.29281125776343 -0
-7.1181776185464 -0
-6.93375508858605 -0
-6.73954366788237 -0
-6.53554335643533 -0
-6.32175415424498 -0
-6.0981760613113 -0
-5.8648090776343 -0
-5.62165320321397 -0
-5.36831688242059 -0
-5.10362544836494 -0
-4.82914512356595 -0
-4.54487590802363 -0
-4.25081780173799 -0
-3.94697080470903 -0
-3.63333491693675 -0
-3.30991013842114 -0
-2.97669646916221 -0
-2.63369390915992 -0
-2.2809024584143 -0
-1.91832211692537 -0
-1.54516977343364 -0
-1.15909609416073 -0
-0.763233524144496 -0
-0.357582063384932 -0
0.0539427318206549 -0
0.465467527026242 -0
0.876992322231828 -0
1.28851711743742 -0
1.700041912643 -0
2.11156670784859 -0
2.52309150305418 -0
2.93461629825976 -0
3.34614109346535 -0
3.75766588867094 -0
4.16919068387651 -0
4.58071547908206 -0
4.99224027428761 -0
};
\addlegendentry{human speed(MDP)}
\end{axis}

\end{tikzpicture}
