% This file was created with tikzplotlib v0.10.1.
\begin{tikzpicture}

\definecolor{darkgray176}{RGB}{176,176,176}
\definecolor{green}{RGB}{0,128,0}
\definecolor{green01270}{RGB}{0,127,0}
\definecolor{lightgray204}{RGB}{204,204,204}

\begin{axis}[
legend cell align={left},
legend style={fill opacity=0.8, draw opacity=1, text opacity=1, draw=lightgray204},
tick align=outside,
tick pos=left,
title={Pedestrian and vehicle's distance to intersection},
x grid style={darkgray176},
xlabel={Time in s},
xmajorgrids,
xmin=-0.245, xmax=5.145,
xtick style={color=black},
y grid style={darkgray176},
ylabel={Distance in m},
ymajorgrids,
ymin=-13.4137679624474, ymax=8.21526454187469,
ytick style={color=black}
]
\addplot [semithick, red]
table {%
0 -12.4306301213418
0.1 -12.1236480995717
0.2 -11.8079385505888
0.3 -11.4835014743932
0.4 -11.1503368709849
0.5 -10.8084447403639
0.6 -10.4578250825302
0.7 -10.0984778974837
0.8 -9.73040318522459
0.9 -9.35360094575274
1 -8.96807117906818
1.1 -8.5738138851709
1.2 -8.17082906406092
1.3 -7.75911671573822
1.4 -7.33867684020282
1.5 -6.9095094374547
1.6 -6.47161450749388
1.7 -6.02359564596631
1.8 -5.5734821779077
1.9 -5.12336870984909
2 -4.67325524179048
2.1 -4.22314177373187
2.2 -3.77302830567326
2.3 -3.32291483761465
2.4 -2.87280136955604
2.5 -2.42268790149743
2.6 -1.97257443343882
2.7 -1.5224609653802
2.8 -1.07234749732159
2.9 -0.622234029262984
3 -0.172120561204373
3.1 0.277992906854237
3.2 0.728106374912848
3.3 1.17821984297146
3.4 1.62833331103007
3.5 2.07844677908868
3.6 2.52856024714729
3.7 2.9786737152059
3.8 3.42878718326451
3.9 3.87890065132312
4 4.32901411938175
4.1 4.7791275874404
4.2 5.22924105549905
4.3 5.67935452355769
};
\addlegendentry{vehicle_distance_to_intersection_SFM}
\addplot [semithick, green]
table {%
0 -3.95480824019133
0.1 -3.91143770449206
0.2 -3.87003631045203
0.3 -3.83051554415233
0.4 -3.79278997990336
0.5 -3.7567780719585
0.6 -3.72240197872713
0.7 -3.68958739451623
0.8 -3.6582633889148
0.9 -3.62836225347417
1 -3.59981935535267
1.1 -3.57237034154527
1.2 -3.54612326289396
1.3 -3.52107970294317
1.4 -3.49718456417415
1.5 -3.47438518417632
1.6 -3.45263131477099
1.7 -3.43221731508569
1.8 -3.41294258386446
1.9 -3.39435954597703
2 -3.37661186123235
2.1 -3.35966289001196
2.2 -3.34347668718791
2.3 -3.32801892527098
2.4 -3.31314806241221
2.5 -3.29892354968537
2.6 -3.28534516496416
2.7 -3.27238356848378
2.8 -3.2600107430917
2.9 -3.24819994428969
3 -3.23711059282912
3.1 -3.22653664592725
3.2 -3.21643424418812
3.3 -3.20678235905517
3.4 -3.19756089974033
3.5 -3.18868651232201
3.6 -3.18019489914605
3.7 -3.17208544091047
3.8 -3.16434093924795
3.9 -3.15687666672972
4 -3.14975065977554
4.1 -3.14294834502554
4.2 -3.13645502047248
4.3 -3.13025665046222
};
\addlegendentry{pedestrian_distance_to_intersection_SFM}
\addplot [semithick, red, dashed]
table {%
0 -12.177112858031
0.1 -11.877112858031
0.2 -11.5731973017337
0.3 -11.259492854693
0.4 -10.935999516909
0.5 -10.6027172883817
0.6 -10.2596461691111
0.7 -9.90678615909712
0.8 -9.54413725833981
0.9 -9.17169946683917
1 -8.78947278459521
1.1 -8.39745721160793
1.2 -7.99565274787732
1.3 -7.58523406029259
1.4 -7.17364070581866
1.5 -6.76204735134473
1.6 -6.3504539968708
1.7 -5.93886064239688
1.8 -5.52726728792295
1.9 -5.11567393344902
2 -4.70408057897509
2.1 -4.29248722450116
2.2 -3.88089387002723
2.3 -3.4693005155533
2.4 -3.05770716107937
2.5 -2.64611380660544
2.6 -2.23452045213151
2.7 -1.82292709765758
2.8 -1.41133374318365
2.9 -0.999740388709725
3 -0.588147034235796
3.1 -0.176553679761867
3.2 0.235039674712063
3.3 0.646633029185992
3.4 1.05822638365992
3.5 1.46981973813385
3.6 1.88141309260778
3.7 2.29300644708171
3.8 2.70459980155564
3.9 3.11619315602957
4 3.5277865105035
4.1 3.93937986497743
4.2 4.35097321945139
4.3 4.76256657392535
4.4 5.17415992839932
4.5 5.58575328287328
4.6 5.99734663734725
4.7 6.40893999182121
4.8 6.82053334629518
4.9 7.23212670076914
};
\addlegendentry{vehicle_distance_to_intersection_MDP}
\addplot [semithick, green01270, dashed]
table {%
0 -3.97254561660576
0.1 -3.92756063918171
0.2 -3.88339111985898
0.3 -3.84124604464879
0.4 -3.80109956323792
0.5 -3.76286783568997
0.6 -3.72646058194035
0.7 -3.69179082462718
0.8 -3.65877565305772
0.9 -3.62733610441861
1 -3.59739698344056
1.1 -3.56888668340558
1.2 -3.54173701496159
1.3 -3.51588304303875
1.4 -3.49126293154214
1.5 -3.46781779545572
1.6 -3.44536033662276
1.7 -3.42389065053839
1.8 -3.40344875558125
1.9 -3.38399100137018
2 -3.36547147711551
2.1 -3.34784510344341
2.2 -3.33106883068846
2.3 -3.31510166278263
2.4 -3.2999045777247
2.5 -3.28544043513794
2.6 -3.27167388583897
2.7 -3.25857128549825
2.8 -3.24597671347895
2.9 -3.23398956695114
3 -3.2225828025283
3.1 -3.21173175209978
3.2 -3.20140959368254
3.3 -3.19159063792648
3.4 -3.182250364992
3.5 -3.17336544107082
3.6 -3.16491366776496
3.7 -3.15687392853579
3.8 -3.14922613624061
3.9 -3.14196536667163
4 -3.13510027851603
4.1 -3.12854367919911
4.2 -3.12227991934308
4.3 -3.11631949096251
4.4 -3.11064889072861
4.5 -3.10525464739876
4.6 -3.10012336084301
4.7 -3.09524222748984
4.8 -3.09059905470916
4.9 -3.08618224207525
};
\addlegendentry{pedestrian_distance_to_intersection_MDP}
\end{axis}

\end{tikzpicture}
