% This file was created with tikzplotlib v0.10.1.
\begin{tikzpicture}

\definecolor{darkgray176}{RGB}{176,176,176}
\definecolor{darkorange25512714}{RGB}{255,127,14}
\definecolor{lightgray204}{RGB}{204,204,204}
\definecolor{steelblue31119180}{RGB}{31,119,180}

\begin{axis}[
legend cell align={left},
legend style={fill opacity=0.8, draw opacity=1, text opacity=1, draw=lightgray204},
tick align=outside,
tick pos=left,
title={Distance between vehicle and pedestrian},
x grid style={darkgray176},
xlabel={Time in s},
xmajorgrids,
xmin=-0.475, xmax=9.975,
xtick style={color=black},
y grid style={darkgray176},
ylabel={Distance between vehicle and human in m (in x direction)},
ymajorgrids,
ymin=-12.4324788273451, ymax=-3.79494906900445,
ytick style={color=black}
]
\addplot [semithick, steelblue31119180]
table {%
0 -12.0398638383297
0.1 -11.734627322002
0.2 -11.4206632784617
0.3 -11.0979717077086
0.4 -10.7716406647609
0.5 -10.4569343146726
0.6 -10.1547006666133
0.7 -9.86493972058304
0.8 -9.58765147658186
0.9 -9.32283593460975
1 -9.07049309466667
1.1 -8.83060019465443
1.2 -8.60294501958286
1.3 -8.38721116639961
1.4 -8.18306201845674
1.5 -7.99014648113909
1.6 -7.80936043338414
1.7 -7.64704779351832
1.8 -7.49291796396987
1.9 -7.34774083471657
2 -7.21115751837839
2.1 -7.08279935842488
2.2 -6.96229904223711
2.3 -6.84929211270737
2.4 -6.74341838911667
2.5 -6.64436532182275
2.6 -6.55181079412696
2.7 -6.46540911008029
2.8 -6.38482305250099
2.9 -6.30972522604979
3 -6.2397988136068
3.1 -6.17473819226267
3.2 -6.1145947491216
3.3 -6.05969475290063
3.4 -6.00818730848527
3.5 -5.95949215439146
3.6 -5.91094158649754
3.7 -5.86239101860362
3.8 -5.8138404507097
3.9 -5.76528988281578
4 -5.71673931492186
4.1 -5.66818874702794
4.2 -5.61963817913402
4.3 -5.5710876112401
4.4 -5.52253704334618
4.5 -5.47398647545226
4.6 -5.42543590755835
4.7 -5.37688533966443
4.8 -5.32833477177051
4.9 -5.27978420387659
5 -5.23123363598267
5.1 -5.18268306808875
5.2 -5.13413250019483
5.3 -5.08558193230091
5.4 -5.03703136440699
5.5 -4.98848079651307
5.6 -4.93993022861915
5.7 -4.89137966072524
5.8 -4.84282909283132
5.9 -4.7942785249374
6 -4.7481977401089
6.1 -4.70614908907785
6.2 -4.66785111006265
6.3 -4.63297281722805
6.4 -4.60120204671073
6.5 -4.57231741711966
6.6 -4.54607927951686
6.7 -4.52225806261252
6.8 -4.50064181978935
6.9 -4.4810353376841
7 -4.46325913643494
7.1 -4.44714847133641
7.2 -4.43255234945477
7.3 -4.41933866711509
7.4 -4.40739823518813
7.5 -4.39661331260591
7.6 -4.38687463036011
7.7 -4.37808273320266
7.8 -4.37014724374748
7.9 -4.36298610476135
8 -4.35652486972764
8.1 -4.35069604334439
8.2 -4.34543847054959
8.3 -4.34069677216404
8.4 -4.33642082495323
8.5 -4.33256528372447
8.6 -4.32908914297099
8.7 -4.32595645043706
8.8 -4.32313661175512
8.9 -4.32060099893807
9 -4.31832129857867
9.1 -4.31635446821254
};
\addlegendentry{distance_SFM}
\addplot [semithick, darkorange25512714]
table {%
0 -12.0262719519329
0.1 -11.7047363922976
0.2 -11.3742732509907
0.3 -11.0503860913041
0.4 -10.7382427676683
0.5 -10.4378432800834
0.6 -10.1491876285494
0.7 -9.87227581306627
0.8 -9.60710783363398
0.9 -9.35368369025255
1 -9.11200338292199
1.1 -8.88204400817553
1.2 -8.66359349541462
1.3 -8.45806930511792
1.4 -8.26413440445818
1.5 -8.08011408576793
1.6 -7.90612538153127
1.7 -7.74181528387591
1.8 -7.58682347887469
1.9 -7.44078621074826
2 -7.30333789130661
2.1 -7.17411268420818
2.2 -7.05274604490861
2.3 -6.93887619704433
2.4 -6.83214552805511
2.5 -6.73220188927712
2.6 -6.63869978842417
2.7 -6.55130146520568
2.8 -6.46967784369597
2.9 -6.39371515441498
3 -6.32405991520083
3.1 -6.25874442875032
3.2 -6.1979279056169
3.3 -6.14117759530833
3.4 -6.08541197294021
3.5 -6.0296463505721
3.6 -5.97388072820399
3.7 -5.91811510583587
3.8 -5.86234948346776
3.9 -5.80658386109965
4 -5.75081823873153
4.1 -5.69505261636342
4.2 -5.63928699399531
4.3 -5.58352137162719
4.4 -5.52775574925908
4.5 -5.47199012689097
4.6 -5.41622450452285
4.7 -5.36045888215474
4.8 -5.30469325978662
4.9 -5.24892763741851
5 -5.1931620150504
5.1 -5.13739639268228
5.2 -5.08163077031417
5.3 -5.02586514794606
5.4 -4.97009952557794
5.5 -4.91433390320983
5.6 -4.85856828084172
5.7 -4.8028026584736
5.8 -4.74703703610549
5.9 -4.69242258322526
6 -4.64402790319201
6.1 -4.60042575279432
6.2 -4.56038250957273
6.3 -4.52396091386115
6.4 -4.49085746575267
6.5 -4.46078953107567
6.6 -4.43349519092451
6.7 -4.40873229772811
6.8 -4.38627746895006
6.9 -4.36592504426217
7 -4.34748602640471
7.1 -4.33078702266762
7.2 -4.31566920086667
7.3 -4.30198727089857
7.4 -4.28960850046792
7.5 -4.27841177139789
7.6 -4.26828668105964
7.7 -4.25913269186908
7.8 -4.25085833048084
7.9 -4.24338043723261
8 -4.23662346553174
8.1 -4.23051883020052
8.2 -4.2250043032832
8.3 -4.22002345543858
8.4 -4.21552514077752
8.5 -4.21146402218049
8.6 -4.20780414176606
8.7 -4.2045073367349
8.8 -4.20153784101697
8.9 -4.19886335209706
9 -4.19645471891442
9.1 -4.19428564143521
9.2 -4.19233239738629
9.3 -4.19057359412643
9.4 -4.18898994354578
9.5 -4.18756405801994
};
\addlegendentry{distance_MDP}
\end{axis}

\end{tikzpicture}
