{
    "os": "Linux-5.15.0-72-generic-x86_64-with-glibc2.29",
    "python": "3.8.10",
    "heartbeatAt": "2023-05-30T13:37:20.200611",
    "startedAt": "2023-05-30T13:37:19.162542",
    "docker": null,
    "cuda": null,
    "args": [],
    "state": "running",
    "program": "/home/yang/MasterThesis_ws/src/dongxu-master-thesis/reinforcement_learning/RecurrentPPO/sb3/train.py",
    "codePath": "reinforcement_learning/RecurrentPPO/sb3/train.py",
    "git": {
        "remote": "https://git.scc.kit.edu/balintvarga/dongxu-master-thesis.git",
        "commit": "254316a0fbc147737419a2ed53bbb90c33870f79"
    },
    "email": "ubtef@student.kit.edu",
    "root": "/home/yang/MasterThesis_ws/src/dongxu-master-thesis",
    "host": "yang-ThinkPad-T480s",
    "username": "yang",
    "executable": "/usr/bin/python3.8",
    "cpu_count": 4,
    "cpu_count_logical": 8,
    "cpu_freq": {
        "current": 913.402125,
        "min": 400.0,
        "max": 4000.0
    },
    "cpu_freq_per_core": [
        {
            "current": 902.994,
            "min": 400.0,
            "max": 4000.0
        },
        {
            "current": 896.214,
            "min": 400.0,
            "max": 4000.0
        },
        {
            "current": 839.039,
            "min": 400.0,
            "max": 4000.0
        },
        {
            "current": 826.982,
            "min": 400.0,
            "max": 4000.0
        },
        {
            "current": 800.515,
            "min": 400.0,
            "max": 4000.0
        },
        {
            "current": 800.061,
            "min": 400.0,
            "max": 4000.0
        },
        {
            "current": 800.079,
            "min": 400.0,
            "max": 4000.0
        },
        {
            "current": 800.058,
            "min": 400.0,
            "max": 4000.0
        }
    ],
    "disk": {
        "total": 109.54700088500977,
        "used": 30.501365661621094
    },
    "memory": {
        "total": 15.522789001464844
    }
}
