% This file was created with tikzplotlib v0.10.1.
\begin{tikzpicture}

\definecolor{darkgray176}{RGB}{176,176,176}
\definecolor{darkorange25512714}{RGB}{255,127,14}
\definecolor{lightgray204}{RGB}{204,204,204}
\definecolor{steelblue31119180}{RGB}{31,119,180}

\begin{axis}[
legend cell align={left},
legend style={fill opacity=0.8, draw opacity=1, text opacity=1, draw=lightgray204},
tick align=outside,
tick pos=left,
title={Distance between vehicle and pedestrian},
x grid style={darkgray176},
xlabel={Time in s},
xmajorgrids,
xmin=-0.45, xmax=9.45,
xtick style={color=black},
y grid style={darkgray176},
ylabel={Distance between vehicle and human in m (in x direction)},
ymajorgrids,
ymin=-12.0394158311282, ymax=2.50341738217059,
ytick style={color=black}
]
\addplot [semithick, steelblue31119180]
table {%
0 -11.3437493375267
0.1 -11.0367673157565
0.2 -10.7337441768037
0.3 -10.4431929481139
0.4 -10.1655706886802
0.5 -9.90451436427664
0.6 -9.65517341323241
0.7 -9.41726912798737
0.8 -9.18920922063508
0.9 -8.97123815774592
1 -8.76401736935087
1.1 -8.56724030865377
1.2 -8.3805908400232
1.3 -8.20374498117471
1.4 -8.03637224748206
1.5 -7.87813703843386
1.6 -7.7287000487445
1.7 -7.5870432792548
1.8 -7.44074483200914
1.9 -7.28571885755078
2 -7.11847434499462
2.1 -6.94250230522575
2.2 -6.75780273824417
2.3 -6.56936960193217
2.4 -6.39079097692844
2.5 -6.2231149708581
2.6 -6.06689090322362
2.7 -5.92158438047299
2.8 -5.78665604362342
2.9 -5.66156605090978
3 -5.54577745075555
3.1 -5.43875937385787
3.2 -5.33999405448076
3.3 -5.25171362819029
3.4 -5.17068663368496
3.5 -5.09610413289801
3.6 -5.02660134774856
3.7 -4.96258543070807
3.8 -4.90392450756206
3.9 -4.8502231110735
4 -4.80110661098507
4.1 -4.75538363410185
4.2 -4.71366000110677
4.3 -4.67620362606476
4.4 -4.64260392596116
4.5 -4.61160608836615
4.6 -4.58337324950474
4.7 -4.55767505773142
4.8 -4.53429549576195
4.9 -4.51303500299633
5 -4.49370955519376
5.1 -4.47614973338094
5.2 -4.46019979968329
5.3 -4.44572311406877
5.4 -4.43280412925342
5.5 -4.42136905674117
5.6 -4.40980959924467
5.7 -4.39069081844769
5.8 -4.36284451043801
5.9 -4.32627067521561
6 -4.2809693127805
6.1 -4.22798772639821
6.2 -4.16697681498022
6.3 -4.09723837634952
6.4 -4.01877241050612
6.5 -3.93157891745
6.6 -3.83565789718116
6.7 -3.73100934969962
6.8 -3.61763327500537
6.9 -3.4955296730984
7 -3.36469854397873
7.1 -3.22513988764635
7.2 -3.07475909757021
7.3 -2.91599988136986
7.4 -2.74851313795681
7.5 -2.57229886733104
7.6 -2.38735706949256
7.7 -2.19368774444137
7.8 -1.99129089217747
7.9 -1.78016651270086
8 -1.56031460601154
8.1 -1.33173517210951
8.2 -1.09442821099477
8.3 -0.848393722667318
8.4 -0.593631707127159
8.5 -0.330142164374287
8.6 -0.0579250944087022
8.7 0.223019502769588
8.8 0.512691627160592
8.9 0.811091278764309
9 1.11821845758073
};
\addlegendentry{distance_SFM}
\addplot [semithick, darkorange25512714]
table {%
0 -11.3783779577964
0.1 -11.0830754922168
0.2 -10.799516862688
0.3 -10.52770206921
0.4 -10.2676165281353
0.5 -10.0191067041449
0.6 -9.78193167183021
0.7 -9.5558336303375
0.8 -9.34054228511536
0.9 -9.13577600333189
1 -8.94125007242204
1.1 -8.7566877343237
1.2 -8.58516047618023
1.3 -8.42959725595995
1.4 -8.28123094765297
1.5 -8.14079373906284
1.6 -8.00798529107481
1.7 -7.88250160404239
1.8 -7.7633774589661
1.9 -7.63846541103456
2 -7.5037644723597
2.1 -7.35927464294151
2.2 -7.20499592278001
2.3 -7.05237235066509
2.4 -6.90911584482816
2.5 -6.77491723645977
2.6 -6.6493812043413
2.7 -6.53209146279412
2.8 -6.42263533950536
2.9 -6.32060582165972
3 -6.22560322801895
3.1 -6.13723672175151
3.2 -6.0551256530502
3.3 -5.97890072370105
3.4 -5.90820497024207
3.5 -5.84465678513276
3.6 -5.78652578713088
3.7 -5.72944366831583
3.8 -5.67236154950078
3.9 -5.61527943068574
4 -5.55819731187069
4.1 -5.50111519305565
4.2 -5.4440330742406
4.3 -5.38695095542555
4.4 -5.32986883661051
4.5 -5.27278671779546
4.6 -5.21570459898042
4.7 -5.15862248016537
4.8 -5.10154036135032
4.9 -5.04445824253528
5 -4.98737612372023
5.1 -4.93029400490519
5.2 -4.87321188609014
5.3 -4.81573821164536
5.4 -4.74730097956806
5.5 -4.66907485674744
5.6 -4.58262606570242
5.7 -4.48638838391408
5.8 -4.38036181138239
5.9 -4.26298012558844
6 -4.13659266031063
6.1 -4.00119941554897
6.2 -3.85601728004398
6.3 -3.70104625379567
6.4 -3.53628633680403
6.5 -3.36173752906906
6.6 -3.17739983059074
6.7 -2.9832732413691
6.8 -2.77935776140414
6.9 -2.56565339069586
7 -2.34216012924425
7.1 -2.10887797704932
7.2 -1.86424071159212
7.3 -1.60746522161318
7.4 -1.34207550778012
7.5 -1.06768001446319
7.6 -0.783495630402946
7.7 -0.489522355599377
7.8 -0.185760190052484
7.9 0.127790866237731
8 0.451130813271305
8.1 0.784259651048202
8.2 1.12717737956842
8.3 1.47988399883197
8.4 1.84237950883883
};
\addlegendentry{distance_MDP}
\end{axis}

\end{tikzpicture}
