% This file was created with tikzplotlib v0.10.1.
\begin{tikzpicture}

\definecolor{darkgray176}{RGB}{176,176,176}
\definecolor{green}{RGB}{0,128,0}
\definecolor{lightgray204}{RGB}{204,204,204}

\begin{axis}[
legend cell align={left},
legend style={fill opacity=0.8, draw opacity=1, text opacity=1, draw=lightgray204},
tick align=outside,
tick pos=left,
title={Pedestrian and vehicle's distance to intersection},
x grid style={darkgray176},
xlabel={Time in s},
xmajorgrids,
xmin=-0.215, xmax=4.515,
xtick style={color=black},
y grid style={darkgray176},
ylabel={Distance in m},
ymajorgrids,
ymin=-5.33949281045738, ymax=7.40521948839195,
ytick style={color=black}
]
\addplot [very thick, red]
table {%
0 -4.76018770596423
0.01 -4.76018770596423
0.02 -4.76018770596423
0.03 -4.76018770596423
0.04 -4.76018770596423
0.05 -4.76018770596423
0.06 -4.76018770596423
0.07 -4.76018770596423
0.08 -4.76003678550988
0.09 -4.75973494460117
0.1 -4.75928218323812
0.11 -4.75867850142072
0.12 -4.75792389914896
0.13 -4.75701837642286
0.14 -4.7559619332424
0.15 -4.75475456960758
0.16 -4.75339628551843
0.17 -4.75188068711199
0.18 -4.75020777438829
0.19 -4.74837754734731
0.2 -4.74639000598906
0.21 -4.74424515031355
0.22 -4.74194298032076
0.23 -4.7394834960107
0.24 -4.73686669738337
0.25 -4.73409258443877
0.26 -4.7311611571769
0.27 -4.72807241559776
0.28 -4.72484447349662
0.29 -4.7214773308735
0.3 -4.71797098772839
0.31 -4.71432544406128
0.32 -4.71054069987218
0.33 -4.7066167551611
0.34 -4.70255360992802
0.35 -4.69835126417296
0.36 -4.6940097178959
0.37 -4.68955858395353
0.38 -4.68499786234584
0.39 -4.68032755307284
0.4 -4.67554765613451
0.41 -4.67065817153087
0.42 -4.66565909926192
0.43 -4.66055043932765
0.44 -4.65533219172806
0.45 -4.65000435646316
0.46 -4.64456693353294
0.47 -4.63901992293741
0.48 -4.63336332467656
0.49 -4.62762301288201
0.5 -4.62179898755377
0.51 -4.61589124869182
0.52 -4.60989979629618
0.53 -4.60382463036684
0.54 -4.59766575090381
0.55 -4.59142315790707
0.56 -4.58509685137664
0.57 -4.57856959150602
0.58 -4.5718413782952
0.59 -4.56491221174419
0.6 -4.55778209185298
0.61 -4.55045101862157
0.62 -4.54291899204998
0.63 -4.53518601213818
0.64 -4.5272520788862
0.65 -4.51911719229402
0.66 -4.51078135236165
0.67 -4.50238702950274
0.68 -4.49393422371729
0.69 -4.48542293500531
0.7 -4.47685316336679
0.71 -4.46822490880174
0.72 -4.45953817131014
0.73 -4.45079295089202
0.74 -4.44198924754735
0.75 -4.43312706127615
0.76 -4.42420639207842
0.77 -4.41522723995414
0.78 -4.40618960490333
0.79 -4.39696790358869
0.8 -4.38756213601022
0.81 -4.37797230216791
0.82 -4.36819840206178
0.83 -4.35824043569181
0.84 -4.34809840305801
0.85 -4.33777230416038
0.86 -4.32726213899892
0.87 -4.31679702806558
0.88 -4.30637697136036
0.89 -4.29600196888327
0.9 -4.28567202063431
0.91 -4.27538712661347
0.92 -4.26514728682075
0.93 -4.25495250125616
0.94 -4.24480276991969
0.95 -4.23469809281134
0.96 -4.22463846993112
0.97 -4.21465483809427
0.98 -4.20474719730078
0.99 -4.19491554755067
1 -4.18515988884393
1.01 -4.17548022118056
1.02 -4.16587654456055
1.03 -4.15634885898392
1.04 -4.14689716445066
1.05 -4.13752146096076
1.06 -4.12822174851424
1.07 -4.11899802711109
1.08 -4.10955786630333
1.09 -4.09990126609098
1.1 -4.09002822647403
1.11 -4.07993874745247
1.12 -4.06963282902631
1.13 -4.05911047119555
1.14 -4.0483716739602
1.15 -4.03741643732024
1.16 -4.02624476127568
1.17 -4.01485664582652
1.18 -4.00325209097276
1.19 -3.99142904317386
1.2 -3.97938750242982
1.21 -3.96712746874065
1.22 -3.95464894210634
1.23 -3.94195192252689
1.24 -3.9290364100023
1.25 -3.91590240453258
1.26 -3.90254990611771
1.27 -3.88897891475771
1.28 -3.87518943045256
1.29 -3.86151363604643
1.3 -3.8479515315393
1.31 -3.83450311693118
1.32 -3.82116839222206
1.33 -3.80794735741195
1.34 -3.79484001250086
1.35 -3.78184635748876
1.36 -3.76896639237567
1.37 -3.7558864370058
1.38 -3.74260649137914
1.39 -3.72912655549568
1.4 -3.71544662935544
1.41 -3.70156671295842
1.42 -3.68748680630461
1.43 -3.673206909394
1.44 -3.65872702222661
1.45 -3.64404714480244
1.46 -3.62916727712148
1.47 -3.61408741918373
1.48 -3.59880540197089
1.49 -3.58332122548297
1.5 -3.56763488971995
1.51 -3.55174639468186
1.52 -3.53565574036867
1.53 -3.5193629267804
1.54 -3.50286795391703
1.55 -3.48617082177859
1.56 -3.46927153036505
1.57 -3.45217882179654
1.58 -3.43489269607307
1.59 -3.41741315319463
1.6 -3.39974019316122
1.61 -3.38187381597285
1.62 -3.3638140216295
1.63 -3.34556081013119
1.64 -3.32711418147791
1.65 -3.30847413566966
1.66 -3.28964067270645
1.67 -3.27061379258826
1.68 -3.25139349531511
1.69 -3.2319874396194
1.7 -3.21239562550113
1.71 -3.1926180529603
1.72 -3.17265472199691
1.73 -3.15250563261095
1.74 -3.13217078480244
1.75 -3.11165017857137
1.76 -3.09094381391773
1.77 -3.07005977480195
1.78 -3.04899806122403
1.79 -3.02775867318397
1.8 -3.00634161068176
1.81 -2.98474687371741
1.82 -2.96297446229092
1.83 -2.94102437640228
1.84 -2.91889661605151
1.85 -2.89659118123858
1.86 -2.87410807196352
1.87 -2.85144728822631
1.88 -2.82860883002697
1.89 -2.80560071496227
1.9 -2.78242294303222
1.91 -2.75907551423683
1.92 -2.73555842857608
1.93 -2.71187168605
1.94 -2.68801528665855
1.95 -2.66398923040177
1.96 -2.63979351727963
1.97 -2.61543593289775
1.98 -2.59091647725614
1.99 -2.56623515035478
2 -2.54139195219368
2.01 -2.51638688277284
2.02 -2.49121994209225
2.03 -2.46589113015192
2.04 -2.44040044695186
2.05 -2.41474789249204
2.06 -2.38893346677249
2.07 -2.3629571697932
2.08 -2.33681900155416
2.09 -2.31052617803345
2.1 -2.28407869923107
2.11 -2.25747656514701
2.12 -2.23071977578127
2.13 -2.20380833113387
2.14 -2.17674223120479
2.15 -2.14952147599404
2.16 -2.1221528161138
2.17 -2.09463625156407
2.18 -2.06697178234485
2.19 -2.03915940845614
2.2 -2.01090332055897
2.21 -1.98205561398383
2.22 -1.95306000273921
2.23 -1.92391648682509
2.24 -1.89463167267476
2.25 -1.86520556028822
2.26 -1.83563814966546
2.27 -1.80592944080648
2.28 -1.77607943371129
2.29 -1.74608812837988
2.3 -1.71595552481226
2.31 -1.68569126043175
2.32 -1.65529533523836
2.33 -1.62476774923207
2.34 -1.5941085024129
2.35 -1.56331759478084
2.36 -1.53239502633589
2.37 -1.50134079707806
2.38 -1.47015490700733
2.39 -1.43883735612372
2.4 -1.40738814442722
2.41 -1.37580727191784
2.42 -1.34410062490561
2.43 -1.31226820339054
2.44 -1.28031000737263
2.45 -1.24822603685188
2.46 -1.21601629182828
2.47 -1.18368077230185
2.48 -1.15121947827257
2.49 -1.11863240974046
2.5 -1.0859195667055
2.51 -1.0530809491677
2.52 -1.02012207261225
2.53 -0.987042937039156
2.54 -0.953843542448411
2.55 -0.920523888840016
2.56 -0.887083976213972
2.57 -0.853523804570287
2.58 -0.819843373908952
2.59 -0.786042684229969
2.6 -0.752121735533336
2.61 -0.718080527819055
2.62 -0.683924380293071
2.63 -0.649653292955385
2.64 -0.615267265805997
2.65 -0.580766298844907
2.66 -0.546150392072114
2.67 -0.51141954548762
2.68 -0.476573759091423
2.69 -0.441613032883524
2.7 -0.406537366863923
2.71 -0.371346761032619
2.72 -0.33604639316944
2.73 -0.300636263274377
2.74 -0.265116371347439
2.75 -0.229486717388617
2.76 -0.19374730139792
2.77 -0.15789812337534
2.78 -0.121939183320883
2.79 -0.0858704812345437
2.8 -0.0496920171163282
2.81 -0.0134037909662297
2.82 0.0229892192349297
2.83 0.059487013487157
2.84 0.0960895917904452
2.85 0.132796954144801
2.86 0.169609100550218
2.87 0.206421246955635
2.88 0.24333817741212
2.89 0.280359891919666
2.9 0.31748639047828
2.91 0.354822457139022
2.92 0.392337512396878
2.93 0.430031556251848
2.94 0.467904588703931
2.95 0.505956609753127
2.96 0.544187619399437
2.97 0.582597617642861
2.98 0.621007615886285
2.99 0.659775591323935
3 0.698543566761586
3.01 0.73749053079635
3.02 0.776605531127707
3.03 0.815888567755657
3.04 0.855339640680207
3.05 0.894958749901349
3.06 0.934745895419084
3.07 0.974701077233412
3.08 1.01482429534433
3.09 1.05511554975185
3.1 1.09557484045595
3.11 1.13620216745665
3.12 1.17698551883678
3.13 1.21792489459634
3.14 1.25902029473534
3.15 1.30027171925376
3.16 1.34167916815161
3.17 1.3832426414289
3.18 1.42496213908561
3.19 1.46683766112177
3.2 1.50886920753734
3.21 1.55104427110189
3.22 1.59336285181539
3.23 1.63582494967787
3.24 1.67843056468931
3.25 1.72117969684971
3.26 1.76407234615908
3.27 1.80710851261741
3.28 1.85028819622471
3.29 1.89361139698097
3.3 1.9370781148862
3.31 1.9806768855788
3.32 2.02440770905878
3.33 2.06827058532613
3.34 2.11226551438086
3.35 2.15639249622296
3.36 2.20065153085244
3.37 2.2450426182693
3.38 2.28956575847352
3.39 2.33422095146513
3.4 2.3790081972441
3.41 2.42391694859053
3.42 2.4689472055044
3.43 2.51409896798571
3.44 2.55937223603447
3.45 2.60476700965067
3.46 2.65028328883432
3.47 2.69592107358542
3.48 2.74168036390395
3.49 2.78756115978994
3.5 2.83367526205577
3.51 2.88001296594642
3.52 2.92646247064948
3.53 2.97302377616494
3.54 3.0196968824928
3.55 3.06648178963308
3.56 3.11337849758576
3.57 3.16038700635085
3.58 3.20739551511594
3.59 3.25451582469343
3.6 3.30173727946109
3.61 3.34905987941889
3.62 3.39648362456684
3.63 3.44400851490494
3.64 3.4916345504332
3.65 3.53936173115162
3.66 3.58719005706018
3.67 3.6351195281589
3.68 3.68315014444777
3.69 3.73128190592679
3.7 3.77950840212098
3.71 3.82782963303035
3.72 3.87624559865489
3.73 3.9247562989946
3.74 3.97336173404949
3.75 4.02206190381955
3.76 4.07085680830478
3.77 4.11974644750519
3.78 4.16873082142077
3.79 4.21780993005153
3.8 4.26697626282971
3.81 4.31622981975531
3.82 4.36557060082834
3.83 4.41499860604879
3.84 4.46451383541667
3.85 4.51411628893197
3.86 4.56380596659469
3.87 4.61358286840484
3.88 4.66344699436242
3.89 4.71339834446741
3.9 4.76342995393109
3.91 4.81354182275345
3.92 4.86373395093448
3.93 4.91400633847419
3.94 4.96435898537258
3.95 5.01479189162966
3.96 5.0653050572454
3.97 5.11589848221983
3.98 5.16657216655293
3.99 5.21732611024471
4 5.26815390297476
4.01 5.31905554474307
4.02 5.37003103554965
4.03 5.4210803753945
4.04 5.47220356427761
4.05 5.52340060219898
4.06 5.57467148915863
4.07 5.62601622515653
4.08 5.6774348101927
4.09 5.72892724426713
4.1 5.78048762899627
4.11 5.8321159643801
4.12 5.88381225041863
4.13 5.93557648711185
4.14 5.98740867445978
4.15 6.0393088124624
4.16 6.09127690111972
4.17 6.14331294043173
4.18 6.19541693039845
4.19 6.24758887101986
4.2 6.29982333501929
4.21 6.35212032239673
4.22 6.40447983315218
4.23 6.45690186728564
4.24 6.50938642479712
4.25 6.56193350568661
4.26 6.61454310995411
4.27 6.66721523759963
4.28 6.72001241200118
4.29 6.77293463315875
4.3 6.8259143838988
};
\addlegendentry{vehicle_distance_to_intersection}
\addplot [very thick, green]
table {%
0 -2.88
0.01 -2.86499999999999
0.02 -2.84999999999999
0.03 -2.83499999999999
0.04 -2.81999999999999
0.05 -2.80499999999999
0.06 -2.78999999999999
0.07 -2.77499999999999
0.08 -2.75999999999999
0.09 -2.74499999999999
0.1 -2.72999999999999
0.11 -2.71499999999999
0.12 -2.69999999999999
0.13 -2.68499999999999
0.14 -2.66999999999999
0.15 -2.65499999999999
0.16 -2.63999999999999
0.17 -2.62499999999999
0.18 -2.60999999999999
0.19 -2.59499999999998
0.2 -2.57999999999998
0.21 -2.56499999999998
0.22 -2.54999999999998
0.23 -2.53499999999998
0.24 -2.51999999999998
0.25 -2.50499999999998
0.26 -2.48999999999998
0.27 -2.47499999999998
0.28 -2.45999999999998
0.29 -2.44499999999998
0.3 -2.42999999999998
0.31 -2.41499999999998
0.32 -2.39999999999998
0.33 -2.38499999999998
0.34 -2.36999999999998
0.35 -2.35499999999998
0.36 -2.33999999999997
0.37 -2.32499999999997
0.38 -2.30999999999997
0.39 -2.29499999999997
0.4 -2.27999999999997
0.41 -2.26499999999997
0.42 -2.24999999999997
0.43 -2.23499999999997
0.44 -2.21999999999997
0.45 -2.20499999999997
0.46 -2.18999999999997
0.47 -2.17499999999997
0.48 -2.15999999999997
0.49 -2.14499999999997
0.5 -2.12999999999997
0.51 -2.11499999999997
0.52 -2.09999999999997
0.53 -2.08499999999997
0.54 -2.06999999999996
0.55 -2.05499999999996
0.56 -2.03999999999996
0.57 -2.02499999999996
0.58 -2.00999999999996
0.59 -1.99499999999996
0.6 -1.97999999999996
0.61 -1.96499999999996
0.62 -1.94999999999996
0.63 -1.93499999999996
0.64 -1.91999999999996
0.65 -1.90499999999996
0.66 -1.88999999999996
0.67 -1.87499999999996
0.68 -1.85999999999996
0.69 -1.84499999999996
0.7 -1.82999999999996
0.71 -1.81499999999996
0.72 -1.79999999999995
0.73 -1.78499999999995
0.74 -1.78499999999995
0.75 -1.78499999999995
0.76 -1.78499999999995
0.77 -1.78499999999995
0.78 -1.78499999999995
0.79 -1.78499999999995
0.8 -1.78499999999995
0.81 -1.78499999999995
0.82 -1.78499999999995
0.83 -1.78499999999995
0.84 -1.78499999999995
0.85 -1.78499999999995
0.86 -1.78499999999995
0.87 -1.78499999999995
0.88 -1.78499999999995
0.89 -1.78499999999995
0.9 -1.78499999999995
0.91 -1.78499999999995
0.92 -1.78499999999995
0.93 -1.78499999999995
0.94 -1.78499999999995
0.95 -1.78499999999995
0.96 -1.78499999999995
0.97 -1.78499999999995
0.98 -1.78499999999995
0.99 -1.78499999999995
1 -1.78499999999995
1.01 -1.78499999999995
1.02 -1.78499999999995
1.03 -1.78499999999995
1.04 -1.78499999999995
1.05 -1.78499999999995
1.06 -1.78499999999995
1.07 -1.78499999999995
1.08 -1.78499999999995
1.09 -1.78499999999995
1.1 -1.78499999999995
1.11 -1.78499999999995
1.12 -1.78499999999995
1.13 -1.78499999999995
1.14 -1.78499999999995
1.15 -1.78499999999995
1.16 -1.78499999999995
1.17 -1.78499999999995
1.18 -1.78499999999995
1.19 -1.78499999999995
1.2 -1.78499999999995
1.21 -1.78499999999995
1.22 -1.78499999999995
1.23 -1.78499999999995
1.24 -1.78499999999995
1.25 -1.78499999999995
1.26 -1.78499999999995
1.27 -1.78499999999995
1.28 -1.78499999999995
1.29 -1.78499999999995
1.3 -1.78499999999995
1.31 -1.78499999999995
1.32 -1.78499999999995
1.33 -1.78499999999995
1.34 -1.78499999999995
1.35 -1.78499999999995
1.36 -1.78499999999995
1.37 -1.78499999999995
1.38 -1.78499999999995
1.39 -1.78499999999995
1.4 -1.78499999999995
1.41 -1.78499999999995
1.42 -1.78499999999995
1.43 -1.78499999999995
1.44 -1.78499999999995
1.45 -1.78499999999995
1.46 -1.78499999999995
1.47 -1.78499999999995
1.48 -1.78499999999995
1.49 -1.78499999999995
1.5 -1.78499999999995
1.51 -1.78499999999995
1.52 -1.78499999999995
1.53 -1.78499999999995
1.54 -1.78499999999995
1.55 -1.78499999999995
1.56 -1.78499999999995
1.57 -1.78499999999995
1.58 -1.78499999999995
1.59 -1.78499999999995
1.6 -1.78499999999995
1.61 -1.78499999999995
1.62 -1.78499999999995
1.63 -1.78499999999995
1.64 -1.78499999999995
1.65 -1.78499999999995
1.66 -1.78499999999995
1.67 -1.78499999999995
1.68 -1.78499999999995
1.69 -1.78499999999995
1.7 -1.78499999999995
1.71 -1.78499999999995
1.72 -1.78499999999995
1.73 -1.78499999999995
1.74 -1.78499999999995
1.75 -1.78499999999995
1.76 -1.78499999999995
1.77 -1.78499999999995
1.78 -1.78499999999995
1.79 -1.78499999999995
1.8 -1.78499999999995
1.81 -1.78499999999995
1.82 -1.78499999999995
1.83 -1.78499999999995
1.84 -1.78499999999995
1.85 -1.78499999999995
1.86 -1.78499999999995
1.87 -1.78499999999995
1.88 -1.78499999999995
1.89 -1.78499999999995
1.9 -1.78499999999995
1.91 -1.78499999999995
1.92 -1.78499999999995
1.93 -1.78499999999995
1.94 -1.78499999999995
1.95 -1.78499999999995
1.96 -1.78499999999995
1.97 -1.78499999999995
1.98 -1.78499999999995
1.99 -1.78499999999995
2 -1.78499999999995
2.01 -1.78499999999995
2.02 -1.78499999999995
2.03 -1.78499999999995
2.04 -1.78499999999995
2.05 -1.78499999999995
2.06 -1.78499999999995
2.07 -1.78499999999995
2.08 -1.78499999999995
2.09 -1.78499999999995
2.1 -1.78499999999995
2.11 -1.78499999999995
2.12 -1.78499999999995
2.13 -1.78499999999995
2.14 -1.78499999999995
2.15 -1.78499999999995
2.16 -1.78499999999995
2.17 -1.78499999999995
2.18 -1.78499999999995
2.19 -1.78499999999995
2.2 -1.78499999999995
2.21 -1.78499999999995
2.22 -1.78499999999995
2.23 -1.78499999999995
2.24 -1.78499999999995
2.25 -1.78499999999995
2.26 -1.78499999999995
2.27 -1.78499999999995
2.28 -1.78499999999995
2.29 -1.78499999999995
2.3 -1.78499999999995
2.31 -1.78499999999995
2.32 -1.78499999999995
2.33 -1.78499999999995
2.34 -1.78499999999995
2.35 -1.78499999999995
2.36 -1.78499999999995
2.37 -1.78499999999995
2.38 -1.78499999999995
2.39 -1.78499999999995
2.4 -1.78499999999995
2.41 -1.78499999999995
2.42 -1.78499999999995
2.43 -1.78499999999995
2.44 -1.78499999999995
2.45 -1.78499999999995
2.46 -1.78499999999995
2.47 -1.78499999999995
2.48 -1.78499999999995
2.49 -1.78499999999995
2.5 -1.78499999999995
2.51 -1.78499999999995
2.52 -1.78499999999995
2.53 -1.78499999999995
2.54 -1.78499999999995
2.55 -1.78499999999995
2.56 -1.78499999999995
2.57 -1.78499999999995
2.58 -1.78499999999995
2.59 -1.78499999999995
2.6 -1.78499999999995
2.61 -1.78499999999995
2.62 -1.78499999999995
2.63 -1.78499999999995
2.64 -1.78499999999995
2.65 -1.78499999999995
2.66 -1.78499999999995
2.67 -1.78499999999995
2.68 -1.78499999999995
2.69 -1.78499999999995
2.7 -1.78499999999995
2.71 -1.78499999999995
2.72 -1.78499999999995
2.73 -1.78499999999995
2.74 -1.78499999999995
2.75 -1.78499999999995
2.76 -1.78499999999995
2.77 -1.78499999999995
2.78 -1.78499999999995
2.79 -1.78499999999995
2.8 -1.78499999999995
2.81 -1.78499999999995
2.82 -1.78499999999995
2.83 -1.78499999999995
2.84 -1.78499999999995
2.85 -1.78499999999995
2.86 -1.78499999999995
2.87 -1.78499999999995
2.88 -1.78499999999995
2.89 -1.78499999999995
2.9 -1.78499999999995
2.91 -1.78499999999995
2.92 -1.78499999999995
2.93 -1.78499999999995
2.94 -1.78499999999995
2.95 -1.78499999999995
2.96 -1.78499999999995
2.97 -1.78499999999995
2.98 -1.78499999999995
2.99 -1.78499999999995
3 -1.78499999999995
3.01 -1.78499999999995
3.02 -1.78499999999995
3.03 -1.78499999999995
3.04 -1.78499999999995
3.05 -1.78499999999995
3.06 -1.78499999999995
3.07 -1.78499999999995
3.08 -1.78499999999995
3.09 -1.78499999999995
3.1 -1.78499999999995
3.11 -1.78499999999995
3.12 -1.78499999999995
3.13 -1.78499999999995
3.14 -1.78499999999995
3.15 -1.78499999999995
3.16 -1.78499999999995
3.17 -1.78499999999995
3.18 -1.78499999999995
3.19 -1.78499999999995
3.2 -1.78499999999995
3.21 -1.78499999999995
3.22 -1.78499999999995
3.23 -1.78499999999995
3.24 -1.78499999999995
3.25 -1.78499999999995
3.26 -1.78499999999995
3.27 -1.78499999999995
3.28 -1.78499999999995
3.29 -1.78499999999995
3.3 -1.78499999999995
3.31 -1.78499999999995
3.32 -1.78499999999995
3.33 -1.78499999999995
3.34 -1.78499999999995
3.35 -1.78499999999995
3.36 -1.78499999999995
3.37 -1.78499999999995
3.38 -1.78499999999995
3.39 -1.78499999999995
3.4 -1.78499999999995
3.41 -1.78499999999995
3.42 -1.78499999999995
3.43 -1.78499999999995
3.44 -1.78499999999995
3.45 -1.78499999999995
3.46 -1.78499999999995
3.47 -1.78499999999995
3.48 -1.78499999999995
3.49 -1.78499999999995
3.5 -1.78499999999995
3.51 -1.78499999999995
3.52 -1.78499999999995
3.53 -1.78499999999995
3.54 -1.78499999999995
3.55 -1.78499999999995
3.56 -1.78499999999995
3.57 -1.78499999999995
3.58 -1.78499999999995
3.59 -1.78499999999995
3.6 -1.78499999999995
3.61 -1.78499999999995
3.62 -1.78499999999995
3.63 -1.78499999999995
3.64 -1.78499999999995
3.65 -1.78499999999995
3.66 -1.78499999999995
3.67 -1.78499999999995
3.68 -1.78499999999995
3.69 -1.78499999999995
3.7 -1.78499999999995
3.71 -1.78499999999995
3.72 -1.78499999999995
3.73 -1.78499999999995
3.74 -1.78499999999995
3.75 -1.78499999999995
3.76 -1.78499999999995
3.77 -1.78499999999995
3.78 -1.78499999999995
3.79 -1.78499999999995
3.8 -1.78499999999995
3.81 -1.78499999999995
3.82 -1.78499999999995
3.83 -1.78499999999995
3.84 -1.78499999999995
3.85 -1.78499999999995
3.86 -1.78499999999995
3.87 -1.78499999999995
3.88 -1.78499999999995
3.89 -1.78499999999995
3.9 -1.78499999999995
3.91 -1.78499999999995
3.92 -1.78499999999995
3.93 -1.78499999999995
3.94 -1.78499999999995
3.95 -1.78499999999995
3.96 -1.78499999999995
3.97 -1.78499999999995
3.98 -1.78499999999995
3.99 -1.78499999999995
4 -1.78499999999995
4.01 -1.78499999999995
4.02 -1.78499999999995
4.03 -1.78499999999995
4.04 -1.78499999999995
4.05 -1.78499999999995
4.06 -1.78499999999995
4.07 -1.78499999999995
4.08 -1.78499999999995
4.09 -1.78499999999995
4.1 -1.78499999999995
4.11 -1.78499999999995
4.12 -1.78499999999995
4.13 -1.78499999999995
4.14 -1.78499999999995
4.15 -1.78499999999995
4.16 -1.78499999999995
4.17 -1.78499999999995
4.18 -1.78499999999995
4.19 -1.78499999999995
4.2 -1.78499999999995
4.21 -1.78499999999995
4.22 -1.78499999999995
4.23 -1.78499999999995
4.24 -1.78499999999995
4.25 -1.78499999999995
4.26 -1.78499999999995
4.27 -1.78499999999995
4.28 -1.78499999999995
4.29 -1.78499999999995
4.3 -1.78499999999995
};
\addlegendentry{pedestrian_distance_to_intersection}
\end{axis}

\end{tikzpicture}
