{
    "os": "Linux-5.15.0-72-generic-x86_64-with-glibc2.29",
    "python": "3.8.10",
    "heartbeatAt": "2023-05-25T20:17:26.530059",
    "startedAt": "2023-05-25T20:17:25.872937",
    "docker": null,
    "cuda": null,
    "args": [],
    "state": "running",
    "program": "<python with no main file>",
    "git": {
        "remote": "https://git.scc.kit.edu/balintvarga/dongxu-master-thesis.git",
        "commit": "254316a0fbc147737419a2ed53bbb90c33870f79"
    },
    "email": "ubtef@student.kit.edu",
    "root": "/home/yang/MasterThesis_ws/src/dongxu-master-thesis",
    "host": "yang-ThinkPad-T480s",
    "username": "yang",
    "executable": "/usr/bin/python3.8",
    "cpu_count": 4,
    "cpu_count_logical": 8,
    "cpu_freq": {
        "current": 2199.98625,
        "min": 400.0,
        "max": 4000.0
    },
    "cpu_freq_per_core": [
        {
            "current": 2276.527,
            "min": 400.0,
            "max": 4000.0
        },
        {
            "current": 2207.08,
            "min": 400.0,
            "max": 4000.0
        },
        {
            "current": 2307.206,
            "min": 400.0,
            "max": 4000.0
        },
        {
            "current": 2507.944,
            "min": 400.0,
            "max": 4000.0
        },
        {
            "current": 2255.914,
            "min": 400.0,
            "max": 4000.0
        },
        {
            "current": 2551.431,
            "min": 400.0,
            "max": 4000.0
        },
        {
            "current": 2199.958,
            "min": 400.0,
            "max": 4000.0
        },
        {
            "current": 2308.627,
            "min": 400.0,
            "max": 4000.0
        }
    ],
    "disk": {
        "total": 109.54700088500977,
        "used": 30.622268676757812
    },
    "memory": {
        "total": 15.522789001464844
    }
}
