% This file was created with tikzplotlib v0.10.1.
\begin{tikzpicture}

\definecolor{darkgray176}{RGB}{176,176,176}
\definecolor{green}{RGB}{0,128,0}
\definecolor{green01270}{RGB}{0,127,0}
\definecolor{lightgray204}{RGB}{204,204,204}

\begin{axis}[
legend cell align={left},
legend style={fill opacity=0.8, draw opacity=1, text opacity=1, draw=lightgray204},
tick align=outside,
tick pos=left,
title={Speed of vehicle and pedestrian},
x grid style={darkgray176},
xlabel={Time in s},
xmajorgrids,
xmin=-0.55, xmax=11.55,
xtick style={color=black},
y grid style={darkgray176},
ylabel={Speed in m/s},
ymajorgrids,
ymin=-0.422185380977948, ymax=8.86589300053691,
ytick style={color=black}
]
\addplot [semithick, red]
table {%
0 6
0.1 6.13964043540337
0.2 6.31419097965758
0.3 6.48874152391179
0.4 6.663292068166
0.5 6.83784261242021
0.6 7.01239315667442
0.7 7.22185380977947
0.8 7.39640435403368
0.9 7.60586500713874
1 7.74550544254211
1.1 7.92005598679632
1.2 8.09460653105053
1.3 8.26915707530474
1.4 8.44370761955896
1.5 8.27905449594491
1.6 8.02960045536378
1.7 7.78014641478266
1.8 7.53069237420154
1.9 7.28123833362042
2 6.98189348492308
2.1 6.73243944434196
2.2 6.48298540376084
2.3 6.23353136317971
2.4 5.98407732259859
2.5 5.73462328201747
2.6 5.48516924143635
2.7 5.23571520085523
2.8 4.98626116027411
2.9 4.73680711969299
3 4.48735307911187
3.1 4.23789903853075
3.2 3.98844499794963
3.3 3.73899095736851
3.4 3.48953691678739
3.5 3.24008287620627
3.6 2.99062883562515
3.7 2.74117479504404
3.8 2.49172075446292
3.9 2.2422667138818
4 1.99281267330068
4.1 1.74335863271956
4.2 1.49390459213844
4.3 1.24445055155732
4.4 0.945105702859982
4.5 0.695651662278863
4.6 0.456129896109458
4.7 0.287766571834119
4.8 0.180026162731327
4.9 0.110823093493692
5 0.0644114784046994
5.1 0.036953343452252
5.2 0.0211346391241282
5.3 0.0120715018213697
5.4 0.00688993712217931
5.5 0.00393089767693095
5.6 0.00224216143467889
5.7 0.00127874559303292
5.8 0
5.9 0
6 0
6.1 0
6.2 0
6.3 0
6.4 0
6.5 0
6.6 0
6.7 0
6.8 0
6.9 0
7 0.0698202177016843
7.1 0.244370761955895
7.2 0.418921306210106
7.3 0.593471850464316
7.4 0.768022394718527
7.5 0.942572938972737
7.6 1.11712348322695
7.7 1.29167402748116
7.8 1.46622457173537
7.9 1.64077511598958
8 1.81532566024379
8.1 1.989876204498
8.2 2.19933685760305
8.3 2.37388740185726
8.4 2.54843794611147
8.5 2.72298849036569
8.6 2.8975390346199
8.7 3.07208957887411
8.8 3.24664012312832
8.9 3.42119066738253
9 3.59574121163674
9.1 3.77029175589095
9.2 3.94484230014516
9.3 4.11939284439937
9.4 4.29394338865358
9.5 4.46849393290779
9.6 4.643044477162
9.7 4.8874152391179
9.8 5.06196578337211
9.9 5.23651632762632
10 5.41106687188053
10.1 5.58561741613474
10.2 5.76016796038895
10.3 5.93471850464316
10.4 6.10926904889737
10.5 6.31872970200242
10.6 6.49328024625663
10.7 6.66783079051084
10.8 6.84238133476506
10.9 7.01693187901927
11 7.19148242327348
};
\addlegendentry{vehicle speed(SFM)}
\addplot [semithick, green]
table {%
0 -0
0.1 -0
0.2 -0
0.3 -0
0.4 -0
0.5 -0
0.6 -0
0.7 -0
0.8 -0
0.9 -0
1 -0
1.1 -0
1.2 -0
1.3 -0
1.4 1.8
1.5 1.8
1.6 1.8
1.7 1.8
1.8 1.8
1.9 1.8
2 1.8
2.1 1.8
2.2 1.8
2.3 1.8
2.4 1.8
2.5 1.8
2.6 1.8
2.7 1.8
2.8 1.8
2.9 1.8
3 1.8
3.1 1.8
3.2 1.8
3.3 1.8
3.4 1.8
3.5 1.8
3.6 1.8
3.7 1.8
3.8 1.8
3.9 1.8
4 1.8
4.1 1.8
4.2 1.8
4.3 1.8
4.4 1.8
4.5 1.8
4.6 1.8
4.7 1.8
4.8 1.8
4.9 1.8
5 1.8
5.1 1.8
5.2 1.8
5.3 1.8
5.4 1.8
5.5 1.8
5.6 1.8
5.7 1.8
5.8 1.8
5.9 1.8
6 1.8
6.1 1.8
6.2 1.8
6.3 1.8
6.4 1.8
6.5 1.8
6.6 1.8
6.7 1.8
6.8 1.8
6.9 1.8
7 1.8
7.1 1.8
7.2 1.8
7.3 1.8
7.4 1.8
7.5 1.8
7.6 1.8
7.7 1.8
7.8 1.8
7.9 1.8
8 1.8
8.1 1.8
8.2 1.8
8.3 1.8
8.4 1.8
8.5 1.8
8.6 1.8
8.7 1.8
8.8 1.8
8.9 1.8
9 1.8
9.1 1.8
9.2 1.8
9.3 1.8
9.4 1.8
9.5 1.8
9.6 1.8
9.7 1.8
9.8 1.8
9.9 1.8
10 1.8
10.1 1.8
10.2 1.8
10.3 1.8
10.4 1.8
10.5 1.8
10.6 1.8
10.7 1.8
10.8 1.8
10.9 1.8
11 1.8
};
\addlegendentry{human speed(SFM)}
\addplot [semithick, red, dashed]
table {%
0 6.07831112594662
0.1 6.27408894081318
0.2 6.46986675567974
0.3 6.6656445705463
0.4 6.86142238541285
0.5 7.05720020027941
0.6 7.25297801514597
0.7 7.44875583001253
0.8 7.64453364487909
0.9 7.84031145974564
1 8.0360892746122
1.1 8.0360892746122
1.2 8.0360892746122
1.3 8.0360892746122
1.4 8.0360892746122
1.5 7.80121255359488
1.6 7.56633583257756
1.7 7.33145911156023
1.8 7.09658239054291
1.9 6.86170566952559
2 6.62682894850826
2.1 6.39195222749094
2.2 6.15707550647362
2.3 5.92219878545629
2.4 5.68732206443897
2.5 5.45244534342165
2.6 5.21756862240433
2.7 4.982691901387
2.8 4.65386449196275
2.9 4.41898777094543
3 4.1841110499281
3.1 3.94923432891078
3.2 3.71435760789346
3.3 3.47948088687614
3.4 3.24460416585882
3.5 3.0097274448415
3.6 2.77485072382418
3.7 2.53997400280686
3.8 2.30509728178954
3.9 2.07022056077222
4 1.83534383975489
4.1 1.60046711873757
4.2 1.36559039772025
4.3 1.036762988296
4.4 0.848861611482142
4.5 0.614068304193169
4.6 0.406322464897198
4.7 0.263939211094765
4.8 0.170098306975706
4.9 0.108136380027953
5 0.0652015228543085
5.1 0.0386533276680157
5.2 0.0227913470251791
5.3 0.013409267101988
5.4 0.00788084721335637
5.5 0.00462898095866611
5.6 0.00271801497235798
5.7 0.00159563415277051
5.8 0
5.9 0
6 0
6.1 0
6.2 0
6.3 0
6.4 0
6.5 0
6.6 0
6.7 0
6.8 0
6.9 0
7 0.0783111259466226
7.1 0.274088940813179
7.2 0.469866755679736
7.3 0.665644570546292
7.4 0.861422385412848
7.5 1.0572002002794
7.6 1.25297801514596
7.7 1.44875583001252
7.8 1.64453364487907
7.9 1.84031145974563
8 2.03608927461219
8.1 2.23186708947874
8.2 2.54511159326523
8.3 2.81920053407841
8.4 2.97582278597166
8.5 3.17160060083821
8.6 3.36737841570477
8.7 3.56315623057132
8.8 3.75893404543788
8.9 3.95471186030443
9 4.15048967517099
9.1 4.34626749003755
9.2 4.54204530490411
9.3 4.73782311977066
9.4 4.93360093463722
9.5 5.12937874950378
9.6 5.36431212734365
9.7 5.56008994221021
9.8 5.75586775707677
9.9 5.95164557194332
10 6.14742338680988
10.1 6.34320120167644
10.2 6.538979016543
10.3 6.73475683140955
10.4 6.93053464627611
10.5 7.12631246114267
10.6 7.32209027600923
};
\addlegendentry{vehicle speed(MDP)}
\addplot [semithick, green01270, dashed]
table {%
0 -0
0.1 -0
0.2 -0
0.3 -0
0.4 -0
0.5 -0
0.6 -0
0.7 -0
0.8 -0
0.9 -0
1 -0
1.1 -0
1.2 -0
1.3 -0
1.4 1.8
1.5 1.8
1.6 1.8
1.7 1.8
1.8 1.8
1.9 1.8
2 1.8
2.1 1.8
2.2 1.8
2.3 1.8
2.4 1.8
2.5 1.8
2.6 1.8
2.7 1.8
2.8 1.8
2.9 1.8
3 1.8
3.1 1.8
3.2 1.8
3.3 1.8
3.4 1.8
3.5 1.8
3.6 1.8
3.7 1.8
3.8 1.8
3.9 1.8
4 1.8
4.1 1.8
4.2 1.8
4.3 1.8
4.4 1.8
4.5 1.8
4.6 1.8
4.7 1.8
4.8 1.8
4.9 1.8
5 1.8
5.1 1.8
5.2 1.8
5.3 1.8
5.4 1.8
5.5 1.8
5.6 1.8
5.7 1.8
5.8 1.8
5.9 1.8
6 1.8
6.1 1.8
6.2 1.8
6.3 1.8
6.4 1.8
6.5 1.8
6.6 1.8
6.7 1.8
6.8 1.8
6.9 1.8
7 1.8
7.1 1.8
7.2 1.8
7.3 1.8
7.4 1.8
7.5 1.8
7.6 1.8
7.7 1.8
7.8 1.8
7.9 1.8
8 1.8
8.1 1.8
8.2 1.8
8.3 1.8
8.4 1.8
8.5 1.8
8.6 1.8
8.7 1.8
8.8 1.8
8.9 1.8
9 1.8
9.1 1.8
9.2 1.8
9.3 1.8
9.4 1.8
9.5 1.8
9.6 1.8
9.7 1.8
9.8 1.8
9.9 1.8
10 1.8
10.1 1.8
10.2 1.8
10.3 1.8
10.4 1.8
10.5 1.8
10.6 1.8
};
\addlegendentry{human speed(MDP)}
\end{axis}

\end{tikzpicture}
