% This file was created with tikzplotlib v0.10.1.
\begin{tikzpicture}

\definecolor{darkgray176}{RGB}{176,176,176}
\definecolor{green}{RGB}{0,128,0}
\definecolor{lightgray204}{RGB}{204,204,204}

\begin{axis}[
legend cell align={left},
legend style={fill opacity=0.8, draw opacity=1, text opacity=1, draw=lightgray204},
tick align=outside,
tick pos=left,
title={Pedestrian and vehicle's distance to intersection},
x grid style={darkgray176},
xlabel={Time in s},
xmajorgrids,
xmin=-0.362, xmax=7.602,
xtick style={color=black},
y grid style={darkgray176},
ylabel={Distance in m},
ymajorgrids,
ymin=-5.33602752064409, ymax=6.01337196804809,
ytick style={color=black}
]
\addplot [very thick, red]
table {%
0 -4.82014572570354
0.01 -4.82014572570354
0.02 -4.82014572570354
0.03 -4.82014572570354
0.04 -4.82014572570354
0.05 -4.82014572570354
0.06 -4.82014572570354
0.07 -4.82014572570354
0.08 -4.82014572570354
0.09 -4.82014572570354
0.1 -4.82014572570354
0.11 -4.82014572570354
0.12 -4.82014572570354
0.13 -4.82014572570354
0.14 -4.81988627474519
0.15 -4.8193673728285
0.16 -4.81858901995347
0.17 -4.81755121612009
0.18 -4.81625396132837
0.19 -4.8146972555783
0.2 -4.81288109886989
0.21 -4.81080549120313
0.22 -4.80847266245153
0.23 -4.80588261261509
0.24 -4.80303534169382
0.25 -4.79993084968771
0.26 -4.79656913659677
0.27 -4.79295020242098
0.28 -4.78907404716035
0.29 -4.78494067081488
0.3 -4.78055007338458
0.31 -4.77590225486944
0.32 -4.77099721526947
0.33 -4.7658460889953
0.34 -4.76044887604693
0.35 -4.75480557642437
0.36 -4.74891619012761
0.37 -4.74278071715666
0.38 -4.73639915751152
0.39 -4.72977151119218
0.4 -4.72289777819865
0.41 -4.71577795853092
0.42 -4.708412052189
0.43 -4.70081099810911
0.44 -4.69297479629122
0.45 -4.68490344673536
0.46 -4.67659694944152
0.47 -4.66805530440971
0.48 -4.6592785116399
0.49 -4.65026657113212
0.5 -4.64101948288636
0.51 -4.63153724690262
0.52 -4.6218198631809
0.53 -4.6118673317212
0.54 -4.60167965252352
0.55 -4.59126621096019
0.56 -4.58062700703122
0.57 -4.5697620407366
0.58 -4.55867131207633
0.59 -4.54735482105043
0.6 -4.53581256765887
0.61 -4.52404455190167
0.62 -4.5120609481509
0.63 -4.49986175640656
0.64 -4.48744697666865
0.65 -4.47481660893717
0.66 -4.46197065321211
0.67 -4.44890910949349
0.68 -4.4356319777813
0.69 -4.42213925807553
0.7 -4.4084309503762
0.71 -4.3945070546833
0.72 -4.38036757099682
0.73 -4.36601249931677
0.74 -4.35145145810908
0.75 -4.33668444737373
0.76 -4.32171146711072
0.77 -4.30653251732007
0.78 -4.29114759800176
0.79 -4.27555670915581
0.8 -4.2597598507822
0.81 -4.24375702288094
0.82 -4.22755741220426
0.83 -4.21116101875214
0.84 -4.19456784252461
0.85 -4.17777788352164
0.86 -4.16079114174325
0.87 -4.14360761718944
0.88 -4.1262273098602
0.89 -4.10865021975553
0.9 -4.09087634687544
0.91 -4.07290569121992
0.92 -4.05473825278898
0.93 -4.03637403158261
0.94 -4.01782177989328
0.95 -3.99908149772099
0.96 -3.98015318506575
0.97 -3.96103684192754
0.98 -3.94173246830637
0.99 -3.92224006420224
1 -3.90255962961516
1.01 -3.88269116454512
1.02 -3.86263466899212
1.03 -3.84239014295616
1.04 -3.82221836128379
1.05 -3.80211932397501
1.06 -3.78209303102982
1.07 -3.76213948244822
1.08 -3.74225867823021
1.09 -3.72245061837579
1.1 -3.70271530288496
1.11 -3.68305273175772
1.12 -3.66346290499407
1.13 -3.64399160563661
1.14 -3.62463883368535
1.15 -3.60540458914029
1.16 -3.58628887200141
1.17 -3.56729168226872
1.18 -3.54841301994223
1.19 -3.52965288502193
1.2 -3.51101127750783
1.21 -3.49248819739991
1.22 -3.4740836446982
1.23 -3.45585546744761
1.24 -3.43780366564816
1.25 -3.41992823929984
1.26 -3.40222918840266
1.27 -3.3847065129566
1.28 -3.36736021296169
1.29 -3.3501902884179
1.3 -3.33319673932525
1.31 -3.31637956568373
1.32 -3.29973876749334
1.33 -3.28327434475408
1.34 -3.26717448556183
1.35 -3.25143918991659
1.36 -3.23606845781836
1.37 -3.22106228926713
1.38 -3.20642068426291
1.39 -3.1921436428057
1.4 -3.17823116489549
1.41 -3.16468325053229
1.42 -3.1514998997161
1.43 -3.13864583735666
1.44 -3.12612106345398
1.45 -3.11392557800805
1.46 -3.10205938101888
1.47 -3.09052247248646
1.48 -3.0793148524108
1.49 -3.0684365207919
1.5 -3.05788747762975
1.51 -3.04766772292435
1.52 -3.03777725667571
1.53 -3.02821607888382
1.54 -3.01898418954869
1.55 -3.01000938146274
1.56 -3.00129165462599
1.57 -2.99283100903842
1.58 -2.98462744470003
1.59 -2.97668096161083
1.6 -2.96899155977082
1.61 -2.96155923918
1.62 -2.95423401351549
1.63 -2.9470158827773
1.64 -2.93990484696543
1.65 -2.93290090607987
1.66 -2.92600406012063
1.67 -2.91921430908771
1.68 -2.9125316529811
1.69 -2.90595609180081
1.7 -2.89948762554684
1.71 -2.89312625421918
1.72 -2.88687197781785
1.73 -2.88072479634283
1.74 -2.87465342327199
1.75 -2.86865785860533
1.76 -2.86273810234286
1.77 -2.85689415448457
1.78 -2.85112601503046
1.79 -2.84543368398053
1.8 -2.83981716133479
1.81 -2.83427644709322
1.82 -2.82884019630696
1.83 -2.82350840897601
1.84 -2.81828108510036
1.85 -2.81315822468001
1.86 -2.80813982771496
1.87 -2.80322589420521
1.88 -2.79841642415077
1.89 -2.79371141755163
1.9 -2.78911087440779
1.91 -2.78461479471925
1.92 -2.78022317848602
1.93 -2.77593602570808
1.94 -2.77174915950427
1.95 -2.76786315302279
1.96 -2.76427800626364
1.97 -2.7606928595045
1.98 -2.75720799931948
1.99 -2.75382342570856
2 -2.75053913867176
2.01 -2.74736918709428
2.02 -2.74431357097611
2.03 -2.74137229031726
2.04 -2.73854534511772
2.05 -2.7358327353775
2.06 -2.73323446109659
2.07 -2.730750522275
2.08 -2.72838091891273
2.09 -2.72612565100978
2.1 -2.72398471856614
2.11 -2.72195538582807
2.12 -2.72003765279558
2.13 -2.71823151946865
2.14 -2.71653698584728
2.15 -2.71495405193149
2.16 -2.71348271772127
2.17 -2.71212298321662
2.18 -2.71087484841753
2.19 -2.70973831332402
2.2 -2.70871337793607
2.21 -2.70780004225369
2.22 -2.70699501018414
2.23 -2.70629828172739
2.24 -2.70570985688347
2.25 -2.70522973565236
2.26 -2.70485791803407
2.27 -2.70459440402859
2.28 -2.70443919363593
2.29 -2.70439228685608
2.3 -2.70439228685608
2.31 -2.70439228685608
2.32 -2.70439228685608
2.33 -2.70439228685608
2.34 -2.70439228685608
2.35 -2.70439228685608
2.36 -2.70439228685608
2.37 -2.70439228685608
2.38 -2.70439228685608
2.39 -2.70439228685608
2.4 -2.70439228685608
2.41 -2.70439228685608
2.42 -2.70439228685608
2.43 -2.70439228685608
2.44 -2.70439228685608
2.45 -2.70439228685608
2.46 -2.70439228685608
2.47 -2.70439228685608
2.48 -2.70439228685608
2.49 -2.70439228685608
2.5 -2.70439228685608
2.51 -2.70439228685608
2.52 -2.70439228685608
2.53 -2.70439228685608
2.54 -2.70439228685608
2.55 -2.70439228685608
2.56 -2.70439228685608
2.57 -2.70439228685608
2.58 -2.70439228685608
2.59 -2.70439228685608
2.6 -2.70439228685608
2.61 -2.70439228685608
2.62 -2.70439228685608
2.63 -2.70439228685608
2.64 -2.70439228685608
2.65 -2.70439228685608
2.66 -2.70439228685608
2.67 -2.70439228685608
2.68 -2.70439228685608
2.69 -2.70439228685608
2.7 -2.70439228685608
2.71 -2.70439228685608
2.72 -2.70439228685608
2.73 -2.70439228685608
2.74 -2.70439228685608
2.75 -2.70439228685608
2.76 -2.70439228685608
2.77 -2.70439228685608
2.78 -2.70439228685608
2.79 -2.70439228685608
2.8 -2.70439228685608
2.81 -2.70439228685608
2.82 -2.70439228685608
2.83 -2.70439228685608
2.84 -2.70439228685608
2.85 -2.70439228685608
2.86 -2.70439228685608
2.87 -2.70439228685608
2.88 -2.70439228685608
2.89 -2.70439228685608
2.9 -2.70439228685608
2.91 -2.70439228685608
2.92 -2.70439228685608
2.93 -2.70439228685608
2.94 -2.70439228685608
2.95 -2.70439228685608
2.96 -2.70439228685608
2.97 -2.70439228685608
2.98 -2.70439228685608
2.99 -2.70439228685608
3 -2.70439228685608
3.01 -2.70439228685608
3.02 -2.70439228685608
3.03 -2.70439228685608
3.04 -2.70439228685608
3.05 -2.70439228685608
3.06 -2.70439228685608
3.07 -2.70439228685608
3.08 -2.70439228685608
3.09 -2.70439228685608
3.1 -2.70439228685608
3.11 -2.70439228685608
3.12 -2.70439228685608
3.13 -2.70439228685608
3.14 -2.70439228685608
3.15 -2.70439228685608
3.16 -2.70439228685608
3.17 -2.70439228685608
3.18 -2.70439228685608
3.19 -2.70439228685608
3.2 -2.70439228685608
3.21 -2.70439228685608
3.22 -2.70439228685608
3.23 -2.70439228685608
3.24 -2.70439228685608
3.25 -2.70439228685608
3.26 -2.70439228685608
3.27 -2.70439228685608
3.28 -2.70439228685608
3.29 -2.70439228685608
3.3 -2.70439228685608
3.31 -2.70439228685608
3.32 -2.70439228685608
3.33 -2.70439228685608
3.34 -2.70439228685608
3.35 -2.70439228685608
3.36 -2.70439228685608
3.37 -2.70439228685608
3.38 -2.70439228685608
3.39 -2.70439228685608
3.4 -2.70439228685608
3.41 -2.70439228685608
3.42 -2.70439228685608
3.43 -2.70439228685608
3.44 -2.70439228685608
3.45 -2.70439228685608
3.46 -2.70439228685608
3.47 -2.70439228685608
3.48 -2.70439228685608
3.49 -2.70439228685608
3.5 -2.70439228685608
3.51 -2.70439228685608
3.52 -2.70439228685608
3.53 -2.70439228685608
3.54 -2.70439228685608
3.55 -2.70439228685608
3.56 -2.70439228685608
3.57 -2.70439228685608
3.58 -2.70439228685608
3.59 -2.70439228685608
3.6 -2.70439228685608
3.61 -2.70439228685608
3.62 -2.70439228685608
3.63 -2.70439228685608
3.64 -2.70439228685608
3.65 -2.70439228685608
3.66 -2.70439228685608
3.67 -2.70439228685608
3.68 -2.70439228685608
3.69 -2.70439228685608
3.7 -2.70439228685608
3.71 -2.70439228685608
3.72 -2.70439228685608
3.73 -2.70439228685608
3.74 -2.70439228685608
3.75 -2.70439228685608
3.76 -2.70439228685608
3.77 -2.70439228685608
3.78 -2.70439228685608
3.79 -2.70439228685608
3.8 -2.70439228685608
3.81 -2.70439228685608
3.82 -2.70439228685608
3.83 -2.70439228685608
3.84 -2.70439228685608
3.85 -2.70439228685608
3.86 -2.70439228685608
3.87 -2.70439228685608
3.88 -2.70439228685608
3.89 -2.70439228685608
3.9 -2.70439228685608
3.91 -2.70439228685608
3.92 -2.70439228685608
3.93 -2.70439228685608
3.94 -2.70439228685608
3.95 -2.70439228685608
3.96 -2.70439228685608
3.97 -2.70439228685608
3.98 -2.70439228685608
3.99 -2.70439228685608
4 -2.70439228685608
4.01 -2.70439228685608
4.02 -2.70439228685608
4.03 -2.70439228685608
4.04 -2.70439228685608
4.05 -2.70439228685608
4.06 -2.70439228685608
4.07 -2.70439228685608
4.08 -2.70439228685608
4.09 -2.70439228685608
4.1 -2.70439228685608
4.11 -2.70439228685608
4.12 -2.70439228685608
4.13 -2.70439228685608
4.14 -2.70439228685608
4.15 -2.70439228685608
4.16 -2.70439228685608
4.17 -2.70439228685608
4.18 -2.70439228685608
4.19 -2.70439228685608
4.2 -2.70439228685608
4.21 -2.70439228685608
4.22 -2.70439228685608
4.23 -2.70439228685608
4.24 -2.70439228685608
4.25 -2.70439228685608
4.26 -2.70439228685608
4.27 -2.70439228685608
4.28 -2.70439228685608
4.29 -2.70439228685608
4.3 -2.70439228685608
4.31 -2.70439228685608
4.32 -2.70439228685608
4.33 -2.70439228685608
4.34 -2.70439228685608
4.35 -2.70439228685608
4.36 -2.70439228685608
4.37 -2.70439228685608
4.38 -2.70439228685608
4.39 -2.70439228685608
4.4 -2.70439228685608
4.41 -2.70439228685608
4.42 -2.70439228685608
4.43 -2.70439228685608
4.44 -2.70439228685608
4.45 -2.70439228685608
4.46 -2.70439228685608
4.47 -2.70439228685608
4.48 -2.70439228685608
4.49 -2.70439228685608
4.5 -2.70439228685608
4.51 -2.70439228685608
4.52 -2.70439228685608
4.53 -2.70439228685608
4.54 -2.70439228685608
4.55 -2.70439228685608
4.56 -2.70439228685608
4.57 -2.70439228685608
4.58 -2.70439228685608
4.59 -2.70439228685608
4.6 -2.70439228685608
4.61 -2.70439228685608
4.62 -2.70439228685608
4.63 -2.70439228685608
4.64 -2.70439228685608
4.65 -2.70439228685608
4.66 -2.70439228685608
4.67 -2.70439228685608
4.68 -2.70439228685608
4.69 -2.70439228685608
4.7 -2.70439228685608
4.71 -2.70439228685608
4.72 -2.70439228685608
4.73 -2.70439228685608
4.74 -2.70439228685608
4.75 -2.70439228685608
4.76 -2.70439228685608
4.77 -2.70439228685608
4.78 -2.70439228685608
4.79 -2.70439228685608
4.8 -2.70439228685608
4.81 -2.70439228685608
4.82 -2.70439228685608
4.83 -2.70439228685608
4.84 -2.70439228685608
4.85 -2.70439228685608
4.86 -2.70392914283201
4.87 -2.70300285478387
4.88 -2.70161342271165
4.89 -2.69976084661536
4.9 -2.697445126495
4.91 -2.69466626235057
4.92 -2.69142425418207
4.93 -2.6877191019895
4.94 -2.68356153089216
4.95 -2.67895154089007
4.96 -2.67388913198321
4.97 -2.66837430417159
4.98 -2.66240705745521
4.99 -2.65598739183407
5 -2.64911530730816
5.01 -2.6417908038775
5.02 -2.63401388154207
5.03 -2.62578454030189
5.04 -2.61710278015693
5.05 -2.60800393756544
5.06 -2.59848801252738
5.07 -2.58855500504278
5.08 -2.57820491511162
5.09 -2.56743774273392
5.1 -2.55625348790966
5.11 -2.54465215063885
5.12 -2.53263373092148
5.13 -2.52019822875756
5.14 -2.5073456441471
5.15 -2.4941098085508
5.16 -2.48049072196865
5.17 -2.46648838440066
5.18 -2.45210279584683
5.19 -2.43733395630717
5.2 -2.42218186578167
5.21 -2.40664652427032
5.22 -2.39072793177314
5.23 -2.37442608829011
5.24 -2.35774099382124
5.25 -2.34070379865106
5.26 -2.32331450277955
5.27 -2.30557310620673
5.28 -2.28747960893259
5.29 -2.26903401095712
5.3 -2.25023631228034
5.31 -2.23108651290224
5.32 -2.21158461282283
5.33 -2.19173061204209
5.34 -2.17155313215613
5.35 -2.15105217316495
5.36 -2.13022773506855
5.37 -2.10907981786693
5.38 -2.08760842156008
5.39 -2.06581354614802
5.4 -2.04369519163074
5.41 -2.02125335800823
5.42 -1.9984880452805
5.43 -1.97539925344756
5.44 -1.95198698250939
5.45 -1.92827730669519
5.46 -1.90427022600495
5.47 -1.87996574043868
5.48 -1.85536384999639
5.49 -1.83046455467805
5.5 -1.80526785448369
5.51 -1.77977374941329
5.52 -1.75398223946685
5.53 -1.72789332464438
5.54 -1.70153116944008
5.55 -1.67489577385393
5.56 -1.64798713788595
5.57 -1.62080526153613
5.58 -1.59335014480446
5.59 -1.56562178769096
5.6 -1.53762019019562
5.61 -1.50934535231843
5.62 -1.48079727405941
5.63 -1.45197595541855
5.64 -1.42288139639585
5.65 -1.3935356212364
5.66 -1.36393862994021
5.67 -1.33409042250727
5.68 -1.30399099893759
5.69 -1.27364035923117
5.7 -1.24303850338799
5.71 -1.21218543140807
5.72 -1.18108114329141
5.73 -1.149725639038
5.74 -1.11811891864784
5.75 -1.08628139370278
5.76 -1.05421306420281
5.77 -1.02191393014792
5.78 -0.989383991538134
5.79 -0.956623248373432
5.8 -0.923631700653829
5.81 -0.890409348379315
5.82 -0.856956191549891
5.83 -0.823272230165557
5.84 -0.78935746422632
5.85 -0.755230655040783
5.86 -0.720891802608946
5.87 -0.686340906930809
5.88 -0.651577968006379
5.89 -0.616602985835648
5.9 -0.581415960418617
5.91 -0.546016891755293
5.92 -0.510405779845669
5.93 -0.474582624689745
5.94 -0.438547426287521
5.95 -0.402300184639003
5.96 -0.365840899744185
5.97 -0.329185171506225
5.98 -0.292332999925122
5.99 -0.255284385000884
6 -0.218039326733503
6.01 -0.18059782512298
6.02 -0.142959880169315
6.03 -0.105125491872506
6.04 -0.0671109075762644
6.05 -0.0289161272805813
6.06 0.00945884901454264
6.07 0.0480140213091076
6.08 0.0867493896031135
6.09 0.125664953896553
6.1 0.164760714189434
6.11 0.204036670481756
6.12 0.243492822773518
6.13 0.283129171064722
6.14 0.32294571535536
6.15 0.362942455645438
6.16 0.403106120943896
6.17 0.443436711250726
6.18 0.483934226565928
6.19 0.52459866688951
6.2 0.565430032221464
6.21 0.606428322561797
6.22 0.647593537910502
6.23 0.688925678267587
6.24 0.730410936622661
6.25 0.772049312975724
6.26 0.813840807326777
6.27 0.855785419675819
6.28 0.897883150022849
6.29 0.94013399836787
6.3 0.982537964710879
6.31 1.02509504905188
6.32 1.06780525139088
6.33 1.11066857172786
6.34 1.15368501006284
6.35 1.19684200107417
6.36 1.24013954476185
6.37 1.28357764112588
6.38 1.32715629016626
6.39 1.37087549188301
6.4 1.4147352462761
6.41 1.45873555334555
6.42 1.50287641309135
6.43 1.54715782551351
6.44 1.59157979061202
6.45 1.63613068309104
6.46 1.68081050295057
6.47 1.72561925019062
6.48 1.77055692481117
6.49 1.81562352681225
6.5 1.86081905619383
6.51 1.90614351295592
6.52 1.95159689709853
6.53 1.99717920862165
6.54 2.04289044752529
6.55 2.08871994392695
6.56 2.13466769782665
6.57 2.18073370922438
6.58 2.22691797812013
6.59 2.27322050451392
6.6 2.31964128840575
6.61 2.3661803297956
6.62 2.41283762868349
6.63 2.45961318506941
6.64 2.50650699895336
6.65 2.55350928306744
6.66 2.60062003741166
6.67 2.64783926198601
6.68 2.6951669567905
6.69 2.74260312182512
6.7 2.79014775708988
6.71 2.83780086258476
6.72 2.88556243830979
6.73 2.93343248426495
6.74 2.98141100045024
6.75 3.02949798686567
6.76 3.07768530352178
6.77 3.12597295041857
6.78 3.17436092755604
6.79 3.2228492349342
6.8 3.27143787255304
6.81 3.32012684041256
6.82 3.36891613851275
6.83 3.41780576685363
6.84 3.4667957254352
6.85 3.5158784786566
6.86 3.56505402651786
6.87 3.61432236901896
6.88 3.66368350615991
6.89 3.7131374379407
6.9 3.76268416436135
6.91 3.81232368542184
6.92 3.86205600112218
6.93 3.91188111146236
6.94 3.9617990164424
6.95 4.01180971606228
6.96 4.06190540293031
6.97 4.1120860770465
6.98 4.16235173841083
6.99 4.21270238702332
7 4.26313802288396
7.01 4.31365864599276
7.02 4.36426425634971
7.03 4.4149548539548
7.04 4.46573043880805
7.05 4.51659101090946
7.06 4.56752940737852
7.07 4.61854562821525
7.08 4.66963967341965
7.09 4.7208115429917
7.1 4.77206123693143
7.11 4.82338875523882
7.12 4.87479409791387
7.13 4.92627726495659
7.14 4.97783825636697
7.15 5.02947707214502
7.16 5.08119371229073
7.17 5.13298155631564
7.18 5.18484060421975
7.19 5.23677085600306
7.2 5.28877231166555
7.21 5.34084497120725
7.22 5.39298883462815
7.23 5.44520390192825
7.24 5.49749017310754
};
\addlegendentry{vehicle_distance_to_intersection}
\addplot [very thick, green]
table {%
0 -2.48400000000001
0.01 -2.48200000000001
0.02 -2.48000000000001
0.03 -2.47800000000001
0.04 -2.47600000000001
0.05 -2.47400000000001
0.06 -2.47200000000002
0.07 -2.47000000000002
0.08 -2.46800000000002
0.09 -2.46600000000002
0.1 -2.46400000000002
0.11 -2.46200000000002
0.12 -2.46000000000002
0.13 -2.45800000000002
0.14 -2.45600000000002
0.15 -2.45400000000003
0.16 -2.45200000000003
0.17 -2.45000000000003
0.18 -2.44800000000003
0.19 -2.44600000000003
0.2 -2.44400000000003
0.21 -2.44200000000003
0.22 -2.44000000000003
0.23 -2.43800000000003
0.24 -2.43600000000004
0.25 -2.43400000000004
0.26 -2.43200000000004
0.27 -2.43000000000004
0.28 -2.42800000000004
0.29 -2.42600000000004
0.3 -2.42400000000004
0.31 -2.42200000000004
0.32 -2.42000000000004
0.33 -2.41800000000005
0.34 -2.41600000000005
0.35 -2.41400000000005
0.36 -2.41200000000005
0.37 -2.41000000000005
0.38 -2.40800000000005
0.39 -2.40600000000005
0.4 -2.40400000000005
0.41 -2.40200000000005
0.42 -2.40000000000006
0.43 -2.39800000000006
0.44 -2.39600000000006
0.45 -2.39400000000006
0.46 -2.39200000000006
0.47 -2.39000000000006
0.48 -2.38800000000006
0.49 -2.38600000000006
0.5 -2.38400000000006
0.51 -2.38200000000007
0.52 -2.38000000000007
0.53 -2.37800000000007
0.54 -2.37600000000007
0.55 -2.37400000000007
0.56 -2.37200000000007
0.57 -2.37000000000007
0.58 -2.36800000000007
0.59 -2.36600000000007
0.6 -2.36400000000008
0.61 -2.36200000000008
0.62 -2.36000000000008
0.63 -2.35800000000008
0.64 -2.35600000000008
0.65 -2.35400000000008
0.66 -2.35200000000008
0.67 -2.35000000000008
0.68 -2.34800000000008
0.69 -2.34600000000009
0.7 -2.34400000000009
0.71 -2.34200000000009
0.72 -2.34000000000009
0.73 -2.33800000000009
0.74 -2.33600000000009
0.75 -2.33400000000009
0.76 -2.33200000000009
0.77 -2.33000000000009
0.78 -2.3280000000001
0.79 -2.3260000000001
0.8 -2.3240000000001
0.81 -2.3220000000001
0.82 -2.3200000000001
0.83 -2.3180000000001
0.84 -2.3160000000001
0.85 -2.3140000000001
0.86 -2.3120000000001
0.87 -2.31000000000011
0.88 -2.3060000000001
0.89 -2.3020000000001
0.9 -2.2980000000001
0.91 -2.2940000000001
0.92 -2.2880000000001
0.93 -2.2820000000001
0.94 -2.2760000000001
0.95 -2.2680000000001
0.96 -2.2600000000001
0.97 -2.2520000000001
0.98 -2.2420000000001
0.99 -2.2320000000001
1 -2.2220000000001
1.01 -2.2120000000001
1.02 -2.20200000000009
1.03 -2.19200000000009
1.04 -2.18200000000009
1.05 -2.17200000000009
1.06 -2.16200000000009
1.07 -2.15200000000009
1.08 -2.14200000000008
1.09 -2.13200000000008
1.1 -2.12200000000008
1.11 -2.11200000000008
1.12 -2.10200000000008
1.13 -2.09200000000008
1.14 -2.08200000000008
1.15 -2.07200000000007
1.16 -2.06200000000007
1.17 -2.05200000000007
1.18 -2.04200000000007
1.19 -2.03200000000007
1.2 -2.02200000000007
1.21 -2.01200000000006
1.22 -2.00200000000006
1.23 -1.99200000000006
1.24 -1.98200000000006
1.25 -1.97200000000006
1.26 -1.96200000000006
1.27 -1.95200000000006
1.28 -1.94200000000005
1.29 -1.93200000000005
1.3 -1.92200000000005
1.31 -1.91200000000005
1.32 -1.90200000000005
1.33 -1.89200000000005
1.34 -1.88200000000004
1.35 -1.87200000000004
1.36 -1.86200000000004
1.37 -1.85200000000004
1.38 -1.84200000000004
1.39 -1.83200000000004
1.4 -1.82200000000003
1.41 -1.81200000000003
1.42 -1.80200000000003
1.43 -1.79200000000003
1.44 -1.78200000000003
1.45 -1.77200000000003
1.46 -1.76200000000003
1.47 -1.75200000000002
1.48 -1.74200000000002
1.49 -1.73200000000002
1.5 -1.72200000000002
1.51 -1.71200000000002
1.52 -1.70200000000002
1.53 -1.69200000000001
1.54 -1.68200000000001
1.55 -1.67200000000001
1.56 -1.66200000000001
1.57 -1.65200000000001
1.58 -1.64200000000001
1.59 -1.63200000000001
1.6 -1.622
1.61 -1.612
1.62 -1.602
1.63 -1.592
1.64 -1.582
1.65 -1.572
1.66 -1.56199999999999
1.67 -1.55199999999999
1.68 -1.54199999999999
1.69 -1.53199999999999
1.7 -1.52199999999999
1.71 -1.51199999999999
1.72 -1.50199999999998
1.73 -1.49199999999998
1.74 -1.48199999999998
1.75 -1.47199999999998
1.76 -1.46199999999998
1.77 -1.45199999999998
1.78 -1.44199999999998
1.79 -1.43199999999997
1.8 -1.42199999999997
1.81 -1.41199999999997
1.82 -1.40199999999997
1.83 -1.39199999999997
1.84 -1.38199999999997
1.85 -1.37199999999996
1.86 -1.36199999999996
1.87 -1.35199999999996
1.88 -1.34199999999996
1.89 -1.33199999999996
1.9 -1.32199999999996
1.91 -1.31199999999995
1.92 -1.30199999999995
1.93 -1.29199999999995
1.94 -1.28199999999995
1.95 -1.27199999999995
1.96 -1.26199999999995
1.97 -1.25199999999995
1.98 -1.24199999999994
1.99 -1.23199999999994
2 -1.22199999999994
2.01 -1.21199999999994
2.02 -1.20199999999994
2.03 -1.19199999999994
2.04 -1.18199999999993
2.05 -1.17199999999993
2.06 -1.16199999999993
2.07 -1.15199999999993
2.08 -1.14199999999993
2.09 -1.13199999999993
2.1 -1.12199999999993
2.11 -1.11199999999992
2.12 -1.10199999999992
2.13 -1.09199999999992
2.14 -1.08199999999992
2.15 -1.07199999999992
2.16 -1.06199999999992
2.17 -1.05199999999991
2.18 -1.04199999999991
2.19 -1.03199999999991
2.2 -1.02199999999991
2.21 -1.01199999999991
2.22 -1.00199999999991
2.23 -0.991999999999907
2.24 -0.981999999999907
2.25 -0.971999999999907
2.26 -0.961999999999907
2.27 -0.951999999999908
2.28 -0.941999999999908
2.29 -0.931999999999908
2.3 -0.921999999999908
2.31 -0.911999999999908
2.32 -0.901999999999909
2.33 -0.891999999999909
2.34 -0.881999999999909
2.35 -0.871999999999909
2.36 -0.86199999999991
2.37 -0.85199999999991
2.38 -0.84199999999991
2.39 -0.83199999999991
2.4 -0.82199999999991
2.41 -0.811999999999911
2.42 -0.801999999999911
2.43 -0.791999999999911
2.44 -0.781999999999911
2.45 -0.771999999999911
2.46 -0.761999999999912
2.47 -0.751999999999912
2.48 -0.741999999999912
2.49 -0.731999999999912
2.5 -0.721999999999912
2.51 -0.711999999999913
2.52 -0.701999999999913
2.53 -0.691999999999913
2.54 -0.681999999999913
2.55 -0.671999999999914
2.56 -0.661999999999914
2.57 -0.651999999999914
2.58 -0.641999999999914
2.59 -0.631999999999914
2.6 -0.621999999999915
2.61 -0.611999999999915
2.62 -0.601999999999915
2.63 -0.591999999999915
2.64 -0.581999999999915
2.65 -0.571999999999916
2.66 -0.561999999999916
2.67 -0.551999999999916
2.68 -0.541999999999916
2.69 -0.531999999999917
2.7 -0.521999999999917
2.71 -0.511999999999917
2.72 -0.501999999999917
2.73 -0.491999999999917
2.74 -0.481999999999918
2.75 -0.471999999999918
2.76 -0.461999999999918
2.77 -0.451999999999918
2.78 -0.441999999999918
2.79 -0.431999999999919
2.8 -0.421999999999919
2.81 -0.411999999999919
2.82 -0.401999999999919
2.83 -0.39199999999992
2.84 -0.38199999999992
2.85 -0.37199999999992
2.86 -0.36199999999992
2.87 -0.35199999999992
2.88 -0.341999999999921
2.89 -0.331999999999921
2.9 -0.321999999999921
2.91 -0.311999999999921
2.92 -0.301999999999921
2.93 -0.291999999999922
2.94 -0.281999999999922
2.95 -0.271999999999922
2.96 -0.261999999999922
2.97 -0.251999999999923
2.98 -0.241999999999923
2.99 -0.231999999999923
3 -0.221999999999923
3.01 -0.211999999999923
3.02 -0.201999999999924
3.03 -0.191999999999924
3.04 -0.181999999999924
3.05 -0.171999999999924
3.06 -0.161999999999924
3.07 -0.151999999999925
3.08 -0.141999999999925
3.09 -0.131999999999925
3.1 -0.121999999999925
3.11 -0.111999999999925
3.12 -0.101999999999926
3.13 -0.0919999999999259
3.14 -0.0819999999999261
3.15 -0.0719999999999263
3.16 -0.0619999999999266
3.17 -0.0519999999999268
3.18 -0.041999999999927
3.19 -0.0319999999999272
3.2 -0.0219999999999274
3.21 -0.0119999999999276
3.22 -0.00199999999992784
3.23 0.00800000000007195
3.24 0.0180000000000717
3.25 0.0280000000000715
3.26 0.0380000000000713
3.27 0.0480000000000711
3.28 0.0580000000000709
3.29 0.0680000000000707
3.3 0.0780000000000705
3.31 0.0880000000000702
3.32 0.09800000000007
3.33 0.10800000000007
3.34 0.11800000000007
3.35 0.128000000000069
3.36 0.138000000000069
3.37 0.148000000000069
3.38 0.158000000000069
3.39 0.168000000000069
3.4 0.178000000000068
3.41 0.188000000000068
3.42 0.198000000000068
3.43 0.208000000000068
3.44 0.218000000000067
3.45 0.228000000000067
3.46 0.238000000000067
3.47 0.248000000000067
3.48 0.258000000000067
3.49 0.268000000000066
3.5 0.278000000000066
3.51 0.288000000000066
3.52 0.298000000000066
3.53 0.308000000000066
3.54 0.318000000000065
3.55 0.328000000000065
3.56 0.338000000000065
3.57 0.348000000000065
3.58 0.358000000000064
3.59 0.368000000000064
3.6 0.378000000000064
3.61 0.388000000000064
3.62 0.398000000000064
3.63 0.408000000000063
3.64 0.418000000000063
3.65 0.428000000000063
3.66 0.438000000000063
3.67 0.448000000000063
3.68 0.458000000000062
3.69 0.468000000000062
3.7 0.478000000000062
3.71 0.488000000000062
3.72 0.498000000000062
3.73 0.508000000000061
3.74 0.518000000000061
3.75 0.528000000000061
3.76 0.538000000000061
3.77 0.54800000000006
3.78 0.55800000000006
3.79 0.56800000000006
3.8 0.57800000000006
3.81 0.58800000000006
3.82 0.598000000000059
3.83 0.608000000000059
3.84 0.618000000000059
3.85 0.628000000000059
3.86 0.638000000000059
3.87 0.648000000000058
3.88 0.658000000000058
3.89 0.668000000000058
3.9 0.678000000000058
3.91 0.688000000000057
3.92 0.698000000000057
3.93 0.708000000000057
3.94 0.718000000000057
3.95 0.728000000000057
3.96 0.738000000000056
3.97 0.748000000000056
3.98 0.758000000000056
3.99 0.768000000000056
4 0.778000000000056
4.01 0.788000000000055
4.02 0.798000000000055
4.03 0.808000000000055
4.04 0.818000000000055
4.05 0.828000000000054
4.06 0.838000000000054
4.07 0.848000000000054
4.08 0.858000000000054
4.09 0.868000000000054
4.1 0.878000000000053
4.11 0.888000000000053
4.12 0.898000000000053
4.13 0.908000000000053
4.14 0.918000000000053
4.15 0.928000000000052
4.16 0.938000000000052
4.17 0.948000000000052
4.18 0.958000000000052
4.19 0.968000000000051
4.2 0.978000000000051
4.21 0.988000000000051
4.22 0.998000000000051
4.23 1.00800000000005
4.24 1.01800000000005
4.25 1.02800000000005
4.26 1.03800000000005
4.27 1.04800000000005
4.28 1.05800000000005
4.29 1.06800000000005
4.3 1.07800000000005
4.31 1.08800000000005
4.32 1.09800000000005
4.33 1.10800000000005
4.34 1.11800000000005
4.35 1.12800000000005
4.36 1.13800000000005
4.37 1.14800000000005
4.38 1.15800000000005
4.39 1.16800000000005
4.4 1.17800000000005
4.41 1.18800000000005
4.42 1.19800000000005
4.43 1.20800000000005
4.44 1.21800000000005
4.45 1.22800000000005
4.46 1.23800000000005
4.47 1.24800000000005
4.48 1.25800000000005
4.49 1.26800000000005
4.5 1.27800000000004
4.51 1.28800000000004
4.52 1.29800000000004
4.53 1.30800000000004
4.54 1.31800000000004
4.55 1.32800000000004
4.56 1.33800000000004
4.57 1.34800000000004
4.58 1.35800000000004
4.59 1.36800000000004
4.6 1.37800000000004
4.61 1.38800000000004
4.62 1.39800000000004
4.63 1.40800000000004
4.64 1.41800000000004
4.65 1.42800000000004
4.66 1.43800000000004
4.67 1.44800000000004
4.68 1.45800000000004
4.69 1.46800000000004
4.7 1.47800000000004
4.71 1.48800000000004
4.72 1.49800000000004
4.73 1.50800000000004
4.74 1.51800000000004
4.75 1.52800000000004
4.76 1.53800000000004
4.77 1.54800000000004
4.78 1.55800000000004
4.79 1.56800000000004
4.8 1.57800000000004
4.81 1.58800000000004
4.82 1.59800000000004
4.83 1.60800000000004
4.84 1.61800000000004
4.85 1.62800000000004
4.86 1.63800000000004
4.87 1.64800000000004
4.88 1.65800000000004
4.89 1.66800000000004
4.9 1.67800000000004
4.91 1.68800000000004
4.92 1.69800000000004
4.93 1.70800000000004
4.94 1.71800000000004
4.95 1.72800000000004
4.96 1.73800000000004
4.97 1.74800000000003
4.98 1.75800000000003
4.99 1.76800000000003
5 1.77800000000003
5.01 1.78800000000003
5.02 1.79800000000003
5.03 1.80800000000003
5.04 1.81800000000003
5.05 1.82800000000003
5.06 1.83800000000003
5.07 1.84800000000003
5.08 1.85800000000003
5.09 1.86800000000003
5.1 1.87800000000003
5.11 1.88800000000003
5.12 1.89800000000003
5.13 1.90800000000003
5.14 1.91800000000003
5.15 1.92800000000003
5.16 1.93800000000003
5.17 1.94800000000003
5.18 1.95800000000003
5.19 1.96800000000003
5.2 1.97800000000003
5.21 1.98800000000003
5.22 1.99800000000003
5.23 2.00800000000003
5.24 2.01800000000003
5.25 2.02800000000003
5.26 2.03800000000003
5.27 2.04800000000003
5.28 2.05800000000003
5.29 2.06800000000003
5.3 2.07800000000003
5.31 2.08800000000003
5.32 2.09800000000003
5.33 2.10800000000003
5.34 2.11800000000003
5.35 2.12800000000003
5.36 2.13800000000003
5.37 2.14800000000003
5.38 2.15800000000003
5.39 2.16800000000003
5.4 2.17800000000003
5.41 2.18800000000003
5.42 2.19800000000003
5.43 2.20800000000003
5.44 2.21800000000002
5.45 2.22800000000002
5.46 2.23800000000002
5.47 2.24800000000002
5.48 2.25800000000002
5.49 2.26800000000002
5.5 2.27800000000002
5.51 2.28800000000002
5.52 2.29800000000002
5.53 2.30800000000002
5.54 2.31800000000002
5.55 2.32800000000002
5.56 2.33800000000002
5.57 2.34800000000002
5.58 2.35800000000002
5.59 2.36800000000002
5.6 2.37800000000002
5.61 2.38800000000002
5.62 2.39800000000002
5.63 2.40800000000002
5.64 2.41800000000002
5.65 2.42800000000002
5.66 2.43800000000002
5.67 2.44800000000002
5.68 2.45800000000002
5.69 2.46800000000002
5.7 2.47800000000002
5.71 2.48800000000002
5.72 2.49800000000002
5.73 2.50800000000002
5.74 2.51800000000002
5.75 2.52800000000002
5.76 2.53800000000002
5.77 2.54800000000002
5.78 2.55800000000002
5.79 2.56800000000002
5.8 2.57800000000002
5.81 2.58800000000002
5.82 2.59800000000002
5.83 2.60800000000002
5.84 2.61800000000002
5.85 2.62800000000002
5.86 2.63800000000002
5.87 2.64800000000002
5.88 2.65800000000002
5.89 2.66800000000002
5.9 2.67800000000002
5.91 2.68800000000001
5.92 2.69800000000001
5.93 2.70800000000001
5.94 2.71800000000001
5.95 2.72800000000001
5.96 2.73800000000001
5.97 2.74800000000001
5.98 2.75800000000001
5.99 2.76800000000001
6 2.77800000000001
6.01 2.78800000000001
6.02 2.79800000000001
6.03 2.80800000000001
6.04 2.81800000000001
6.05 2.82800000000001
6.06 2.83800000000001
6.07 2.84800000000001
6.08 2.85800000000001
6.09 2.86800000000001
6.1 2.87800000000001
6.11 2.88800000000001
6.12 2.89800000000001
6.13 2.90800000000001
6.14 2.91800000000001
6.15 2.92800000000001
6.16 2.93800000000001
6.17 2.94800000000001
6.18 2.95800000000001
6.19 2.96800000000001
6.2 2.97800000000001
6.21 2.98800000000001
6.22 2.99800000000001
6.23 3.00800000000001
6.24 3.01800000000001
6.25 3.02800000000001
6.26 3.03800000000001
6.27 3.04800000000001
6.28 3.05800000000001
6.29 3.06800000000001
6.3 3.07800000000001
6.31 3.08800000000001
6.32 3.09800000000001
6.33 3.10800000000001
6.34 3.11800000000001
6.35 3.12800000000001
6.36 3.13800000000001
6.37 3.14800000000001
6.38 3.158
6.39 3.168
6.4 3.178
6.41 3.188
6.42 3.198
6.43 3.208
6.44 3.218
6.45 3.228
6.46 3.238
6.47 3.248
6.48 3.258
6.49 3.268
6.5 3.278
6.51 3.288
6.52 3.298
6.53 3.308
6.54 3.318
6.55 3.328
6.56 3.338
6.57 3.348
6.58 3.358
6.59 3.368
6.6 3.378
6.61 3.388
6.62 3.398
6.63 3.408
6.64 3.418
6.65 3.428
6.66 3.438
6.67 3.448
6.68 3.458
6.69 3.468
6.7 3.478
6.71 3.488
6.72 3.498
6.73 3.508
6.74 3.518
6.75 3.528
6.76 3.538
6.77 3.548
6.78 3.558
6.79 3.568
6.8 3.578
6.81 3.588
6.82 3.598
6.83 3.608
6.84 3.61799999999999
6.85 3.62799999999999
6.86 3.63799999999999
6.87 3.64799999999999
6.88 3.65799999999999
6.89 3.66799999999999
6.9 3.67799999999999
6.91 3.68799999999999
6.92 3.69799999999999
6.93 3.70799999999999
6.94 3.71799999999999
6.95 3.72799999999999
6.96 3.73799999999999
6.97 3.74799999999999
6.98 3.75799999999999
6.99 3.76799999999999
7 3.77799999999999
7.01 3.78799999999999
7.02 3.79799999999999
7.03 3.80799999999999
7.04 3.81799999999999
7.05 3.82799999999999
7.06 3.83799999999999
7.07 3.84799999999999
7.08 3.85799999999999
7.09 3.86799999999999
7.1 3.87799999999999
7.11 3.88799999999999
7.12 3.89799999999999
7.13 3.90799999999999
7.14 3.91799999999999
7.15 3.92799999999999
7.16 3.93799999999999
7.17 3.94799999999999
7.18 3.95799999999999
7.19 3.96799999999999
7.2 3.97799999999999
7.21 3.98799999999999
7.22 3.99799999999999
7.23 4.00799999999999
7.24 4.01799999999999
};
\addlegendentry{pedestrian_distance_to_intersection}
\end{axis}

\end{tikzpicture}
