% This file was created with tikzplotlib v0.10.1.
\begin{tikzpicture}

\definecolor{darkgray176}{RGB}{176,176,176}
\definecolor{green}{RGB}{0,128,0}
\definecolor{green01270}{RGB}{0,127,0}
\definecolor{lightgray204}{RGB}{204,204,204}

\begin{axis}[
legend cell align={left},
legend style={fill opacity=0.8, draw opacity=1, text opacity=1, draw=lightgray204},
tick align=outside,
tick pos=left,
title={Speed of vehicle and pedestrian},
x grid style={darkgray176},
xlabel={Time in s},
xmajorgrids,
xmin=-0.245, xmax=5.145,
xtick style={color=black},
y grid style={darkgray176},
ylabel={Speed in m/s},
ymajorgrids,
ymin=-0.359205379185819, ymax=9.44805387261808,
ytick style={color=black}
]
\addplot [semithick, red]
table {%
0 6.03491010885084
0.1 6.20946065310505
0.2 6.38401119735926
0.3 6.55856174161347
0.4 6.73311228586768
0.5 6.90766283012189
0.6 7.08221337437611
0.7 7.25676391863032
0.8 7.43131446288453
0.9 7.60586500713874
1 7.78041555139295
1.1 7.95496609564716
1.2 8.12951663990137
1.3 8.30406718415559
1.4 8.4786177284098
1.5 8.65316827266402
1.6 8.82771881691823
1.7 9.00226936117245
1.8 9.00226936117245
1.9 9.00226936117245
2 9.00226936117245
2.1 9.00226936117245
2.2 9.00226936117245
2.3 9.00226936117245
2.4 9.00226936117245
2.5 9.00226936117245
2.6 9.00226936117245
2.7 9.00226936117245
2.8 9.00226936117245
2.9 9.00226936117245
3 9.00226936117245
3.1 9.00226936117245
3.2 9.00226936117245
3.3 9.00226936117245
3.4 9.00226936117245
3.5 9.00226936117245
3.6 9.00226936117245
3.7 9.00226936117245
3.8 9.00226936117245
3.9 9.00226936117245
4 9.00226936117245
4.1 9.00226936117245
4.2 9.00226936117245
4.3 9.00226936117245
};
\addlegendentry{vehicle speed(SFM)}
\addplot [semithick, green]
table {%
0 0.891647689719456
0.1 0.851375480088908
0.2 0.812702466169997
0.3 0.775786048122361
0.4 0.740546531405403
0.5 0.706907744092394
0.6 0.674796974215026
0.7 0.644144812693182
0.8 0.614885003303704
0.9 0.586954299464154
1 0.560292327522085
1.1 0.539837419817402
1.2 0.515133307390743
1.3 0.491510936604561
1.4 0.468971732648849
1.5 0.447466107756737
1.6 0.426946665758685
1.7 0.396159450509137
1.8 0.378492411347561
1.9 0.364866400961268
2 0.34844603078415
2.1 0.332764629438483
2.2 0.317788951006424
2.3 0.303487235263488
2.4 0.292510687077005
2.5 0.279225017098297
2.6 0.266541426510208
2.7 0.2544339761674
2.8 0.242876497944857
2.9 0.231844009760504
3 0.217329390449791
3.1 0.207637586255175
3.2 0.198377988083293
3.3 0.189531321692455
3.4 0.181079172389866
3.5 0.174574988364574
3.6 0.16671858706025
3.7 0.159215614306012
3.8 0.152050303962683
3.9 0.146538392587492
4 0.139882357692821
4.1 0.133528303538332
4.2 0.127462877515262
4.3 0.121672969055486
};
\addlegendentry{human speed(SFM)}
\addplot [semithick, red, dashed]
table {%
0 6
0.1 6
0.2 6.15662225189325
0.3 6.3524000667598
0.4 6.54817788162636
0.5 6.74395569649292
0.6 6.93973351135948
0.7 7.13551132622604
0.8 7.33128914109259
0.9 7.52706695595915
1 7.72284477082571
1.1 7.91862258569227
1.2 8.11440040055883
1.3 8.23186708947876
1.4 8.23186708947876
1.5 8.23186708947876
1.6 8.23186708947876
1.7 8.23186708947876
1.8 8.23186708947876
1.9 8.23186708947876
2 8.23186708947876
2.1 8.23186708947876
2.2 8.23186708947876
2.3 8.23186708947876
2.4 8.23186708947876
2.5 8.23186708947876
2.6 8.23186708947876
2.7 8.23186708947876
2.8 8.23186708947876
2.9 8.23186708947876
3 8.23186708947876
3.1 8.23186708947876
3.2 8.23186708947876
3.3 8.23186708947876
3.4 8.23186708947876
3.5 8.23186708947876
3.6 8.23186708947876
3.7 8.23186708947876
3.8 8.23186708947876
3.9 8.23186708947876
4 8.23186708947876
4.1 8.23186708947876
4.2 8.23186708947876
4.3 8.23186708947876
4.4 8.23186708947876
4.5 8.23186708947876
4.6 8.23186708947876
4.7 8.23186708947876
4.8 8.23186708947876
4.9 8.23186708947876
};
\addlegendentry{vehicle speed(MDP)}
\addplot [semithick, green01270, dashed]
table {%
0 0.899894540870213
0.1 0.899638675590462
0.2 0.867192935015735
0.3 0.826708277145169
0.4 0.787320150408502
0.5 0.749753276311297
0.6 0.713972656404234
0.7 0.679898942117638
0.8 0.6474513079182
0.9 0.616552205392862
1 0.587127737557574
1.1 0.559107529192131
1.2 0.532424563173517
1.3 0.507015020670195
1.4 0.482818128549401
1.5 0.459776014027761
1.6 0.442136638387925
1.7 0.421036015910144
1.8 0.400824302960483
1.9 0.381501585484551
2 0.363103880023127
2.1 0.345591901233166
2.2 0.328924329403958
2.3 0.31306059309907
2.4 0.297961947619613
2.5 0.283591496504365
2.6 0.26991411995223
2.7 0.256896391624142
2.8 0.24693572433464
2.9 0.23502622447304
3 0.223601463650066
3.1 0.212705846276286
3.2 0.202336935448325
3.3 0.192472929506287
3.4 0.183089666733325
3.5 0.174163830499386
3.6 0.165673135493397
3.7 0.157596371438232
3.8 0.149913359207905
3.9 0.141186535682215
4 0.134303522616553
4.1 0.129039508825607
4.2 0.122798982367978
4.3 0.116850666858626
4.4 0.111157118250082
4.5 0.105739197867988
4.6 0.10058441572
4.7 0.0956808354396951
4.8 0.091016284500185
4.9 0.0865791322598128
};
\addlegendentry{human speed(MDP)}
\end{axis}

\end{tikzpicture}
