/home/yang/.local/lib/python3.8/site-packages/gym/utils/passive_env_checker.py:69: UserWarning: [33mWARN: Agent's minimum action space value is -infinity. This is probably too low.
  logger.warn(
/home/yang/.local/lib/python3.8/site-packages/gym/utils/passive_env_checker.py:73: UserWarning: [33mWARN: Agent's maximum action space value is infinity. This is probably too high
  logger.warn(
/home/yang/.local/lib/python3.8/site-packages/gym/utils/passive_env_checker.py:97: UserWarning: [33mWARN: We recommend you to use a symmetric and normalized Box action space (range=[-1, 1]) https://stable-baselines3.readthedocs.io/en/master/guide/rl_tips.html
  logger.warn(
Process ForkServerProcess-2:
Traceback (most recent call last):
  File "/usr/lib/python3.8/multiprocessing/process.py", line 315, in _bootstrap
    self.run()
  File "/usr/lib/python3.8/multiprocessing/process.py", line 108, in run
    self._target(*self._args, **self._kwargs)
  File "/home/yang/.local/lib/python3.8/site-packages/stable_baselines3/common/vec_env/subproc_vec_env.py", line 28, in _worker
    cmd, data = remote.recv()
  File "/usr/lib/python3.8/multiprocessing/connection.py", line 250, in recv
    buf = self._recv_bytes()
  File "/usr/lib/python3.8/multiprocessing/connection.py", line 414, in _recv_bytes
    buf = self._recv(4)
  File "/usr/lib/python3.8/multiprocessing/connection.py", line 379, in _recv
    chunk = read(handle, remaining)
