2023-05-25 15:58:16,706 INFO    StreamThr :7063 [internal.py:wandb_internal():86] W&B internal server running at pid: 7063, started at: 2023-05-25 15:58:16.705739
2023-05-25 15:58:16,706 DEBUG   HandlerThread:7063 [handler.py:handle_request():144] handle_request: status
2023-05-25 15:58:16,709 INFO    StreamThr :7063 [internal.py:wandb_internal():86] W&B internal server running at pid: 7063, started at: 2023-05-25 15:58:16.709408
2023-05-25 15:58:16,710 INFO    WriterThread:7063 [datastore.py:open_for_write():85] open: /home/yang/MasterThesis_ws/src/dongxu-master-thesis/reinforcement_learning/RecurrentPPO/sb3/wandb/run-20230525_155816-y1i9oypj/run-y1i9oypj.wandb
2023-05-25 15:58:16,711 DEBUG   HandlerThread:7063 [handler.py:handle_request():144] handle_request: status
2023-05-25 15:58:16,712 DEBUG   SenderThread:7063 [sender.py:send():375] send: header
2023-05-25 15:58:16,714 INFO    WriterThread:7063 [datastore.py:open_for_write():85] open: /home/yang/MasterThesis_ws/src/dongxu-master-thesis/reinforcement_learning/RecurrentPPO/sb3/wandb/run-20230525_155816-ts1wfzpk/run-ts1wfzpk.wandb
2023-05-25 15:58:16,715 DEBUG   SenderThread:7063 [sender.py:send():375] send: header
2023-05-25 15:58:16,730 DEBUG   SenderThread:7063 [sender.py:send():375] send: run
2023-05-25 15:58:16,733 DEBUG   SenderThread:7063 [sender.py:send():375] send: run
2023-05-25 15:58:17,142 DEBUG   HandlerThread:7063 [handler.py:handle_request():144] handle_request: check_version
2023-05-25 15:58:17,145 INFO    SenderThread:7063 [dir_watcher.py:__init__():219] watching files in: /home/yang/MasterThesis_ws/src/dongxu-master-thesis/reinforcement_learning/RecurrentPPO/sb3/wandb/run-20230525_155816-ts1wfzpk/files
2023-05-25 15:58:17,146 INFO    SenderThread:7063 [dir_watcher.py:__init__():219] watching files in: /home/yang/MasterThesis_ws/src/dongxu-master-thesis/reinforcement_learning/RecurrentPPO/sb3/wandb/run-20230525_155816-iv69ycmx/files
2023-05-25 15:58:17,147 INFO    SenderThread:7063 [sender.py:_start_run_threads():1124] run started: ts1wfzpk with start time 1685023096.710803
2023-05-25 15:58:17,148 INFO    SenderThread:7063 [sender.py:_start_run_threads():1124] run started: iv69ycmx with start time 1685023096.659577
2023-05-25 15:58:17,148 INFO    SenderThread:7063 [dir_watcher.py:__init__():219] watching files in: /home/yang/MasterThesis_ws/src/dongxu-master-thesis/reinforcement_learning/RecurrentPPO/sb3/wandb/run-20230525_155816-dwcigh60/files
2023-05-25 15:58:17,149 DEBUG   HandlerThread:7063 [handler.py:handle_request():144] handle_request: check_version
2023-05-25 15:58:17,149 DEBUG   SenderThread:7063 [sender.py:send_request():402] send_request: summary_record
2023-05-25 15:58:17,151 DEBUG   HandlerThread:7063 [handler.py:handle_request():144] handle_request: check_version
2023-05-25 15:58:17,152 DEBUG   SenderThread:7063 [sender.py:send_request():402] send_request: summary_record
2023-05-25 15:58:17,153 INFO    SenderThread:7063 [sender.py:_start_run_threads():1124] run started: dwcigh60 with start time 1685023096.657564
2023-05-25 15:58:17,155 INFO    SenderThread:7063 [sender.py:_save_file():1378] saving file wandb-summary.json with policy end
2023-05-25 15:58:17,156 INFO    SenderThread:7063 [dir_watcher.py:__init__():219] watching files in: /home/yang/MasterThesis_ws/src/dongxu-master-thesis/reinforcement_learning/RecurrentPPO/sb3/wandb/run-20230525_155816-y1i9oypj/files
2023-05-25 15:58:17,157 DEBUG   SenderThread:7063 [sender.py:send_request():402] send_request: summary_record
2023-05-25 15:58:17,157 INFO    SenderThread:7063 [sender.py:_save_file():1378] saving file wandb-summary.json with policy end
2023-05-25 15:58:17,158 DEBUG   SenderThread:7063 [sender.py:send_request():402] send_request: check_version
2023-05-25 15:58:17,158 INFO    SenderThread:7063 [sender.py:_start_run_threads():1124] run started: y1i9oypj with start time 1685023096.707614
2023-05-25 15:58:17,159 INFO    SenderThread:7063 [sender.py:_save_file():1378] saving file wandb-summary.json with policy end
2023-05-25 15:58:17,160 DEBUG   SenderThread:7063 [sender.py:send_request():402] send_request: check_version
2023-05-25 15:58:17,161 DEBUG   HandlerThread:7063 [handler.py:handle_request():144] handle_request: check_version
2023-05-25 15:58:17,163 DEBUG   SenderThread:7063 [sender.py:send_request():402] send_request: summary_record
2023-05-25 15:58:17,164 DEBUG   SenderThread:7063 [sender.py:send_request():402] send_request: check_version
2023-05-25 15:58:17,170 INFO    SenderThread:7063 [sender.py:_save_file():1378] saving file wandb-summary.json with policy end
2023-05-25 15:58:17,171 DEBUG   SenderThread:7063 [sender.py:send_request():402] send_request: check_version
2023-05-25 15:58:17,234 DEBUG   HandlerThread:7063 [handler.py:handle_request():144] handle_request: run_start
2023-05-25 15:58:17,235 DEBUG   HandlerThread:7063 [system_info.py:__init__():31] System info init
2023-05-25 15:58:17,236 DEBUG   HandlerThread:7063 [system_info.py:__init__():46] System info init done
2023-05-25 15:58:17,236 INFO    HandlerThread:7063 [system_monitor.py:start():181] Starting system monitor
2023-05-25 15:58:17,236 INFO    SystemMonitor:7063 [system_monitor.py:_start():145] Starting system asset monitoring threads
2023-05-25 15:58:17,236 INFO    HandlerThread:7063 [system_monitor.py:probe():201] Collecting system info
2023-05-25 15:58:17,237 INFO    SystemMonitor:7063 [interfaces.py:start():190] Started cpu monitoring
2023-05-25 15:58:17,242 INFO    SystemMonitor:7063 [interfaces.py:start():190] Started disk monitoring
2023-05-25 15:58:17,243 DEBUG   HandlerThread:7063 [handler.py:handle_request():144] handle_request: run_start
2023-05-25 15:58:17,244 INFO    SystemMonitor:7063 [interfaces.py:start():190] Started memory monitoring
2023-05-25 15:58:17,245 INFO    SystemMonitor:7063 [interfaces.py:start():190] Started network monitoring
2023-05-25 15:58:17,246 DEBUG   HandlerThread:7063 [system_info.py:__init__():31] System info init
2023-05-25 15:58:17,246 DEBUG   HandlerThread:7063 [system_info.py:__init__():46] System info init done
2023-05-25 15:58:17,247 INFO    HandlerThread:7063 [system_monitor.py:start():181] Starting system monitor
2023-05-25 15:58:17,247 INFO    SystemMonitor:7063 [system_monitor.py:_start():145] Starting system asset monitoring threads
2023-05-25 15:58:17,247 INFO    HandlerThread:7063 [system_monitor.py:probe():201] Collecting system info
2023-05-25 15:58:17,248 INFO    SystemMonitor:7063 [interfaces.py:start():190] Started cpu monitoring
2023-05-25 15:58:17,249 INFO    SystemMonitor:7063 [interfaces.py:start():190] Started disk monitoring
2023-05-25 15:58:17,250 DEBUG   HandlerThread:7063 [handler.py:handle_request():144] handle_request: run_start
2023-05-25 15:58:17,250 INFO    SystemMonitor:7063 [interfaces.py:start():190] Started memory monitoring
2023-05-25 15:58:17,257 INFO    SystemMonitor:7063 [interfaces.py:start():190] Started network monitoring
2023-05-25 15:58:17,257 DEBUG   HandlerThread:7063 [system_info.py:__init__():31] System info init
2023-05-25 15:58:17,258 DEBUG   HandlerThread:7063 [system_info.py:__init__():46] System info init done
2023-05-25 15:58:17,258 INFO    HandlerThread:7063 [system_monitor.py:start():181] Starting system monitor
2023-05-25 15:58:17,258 INFO    SystemMonitor:7063 [system_monitor.py:_start():145] Starting system asset monitoring threads
2023-05-25 15:58:17,258 INFO    HandlerThread:7063 [system_monitor.py:probe():201] Collecting system info
2023-05-25 15:58:17,259 INFO    SystemMonitor:7063 [interfaces.py:start():190] Started cpu monitoring
2023-05-25 15:58:17,260 INFO    SystemMonitor:7063 [interfaces.py:start():190] Started disk monitoring
2023-05-25 15:58:17,260 DEBUG   HandlerThread:7063 [handler.py:handle_request():144] handle_request: run_start
2023-05-25 15:58:17,261 INFO    SystemMonitor:7063 [interfaces.py:start():190] Started memory monitoring
2023-05-25 15:58:17,263 INFO    SystemMonitor:7063 [interfaces.py:start():190] Started network monitoring
2023-05-25 15:58:17,263 DEBUG   HandlerThread:7063 [system_info.py:__init__():31] System info init
2023-05-25 15:58:17,263 DEBUG   HandlerThread:7063 [system_info.py:__init__():46] System info init done
2023-05-25 15:58:17,264 INFO    HandlerThread:7063 [system_monitor.py:start():181] Starting system monitor
2023-05-25 15:58:17,264 INFO    SystemMonitor:7063 [system_monitor.py:_start():145] Starting system asset monitoring threads
2023-05-25 15:58:17,264 INFO    HandlerThread:7063 [system_monitor.py:probe():201] Collecting system info
2023-05-25 15:58:17,264 INFO    SystemMonitor:7063 [interfaces.py:start():190] Started cpu monitoring
2023-05-25 15:58:17,265 INFO    SystemMonitor:7063 [interfaces.py:start():190] Started disk monitoring
2023-05-25 15:58:17,266 INFO    SystemMonitor:7063 [interfaces.py:start():190] Started memory monitoring
2023-05-25 15:58:17,267 INFO    SystemMonitor:7063 [interfaces.py:start():190] Started network monitoring
2023-05-25 15:58:17,280 DEBUG   HandlerThread:7063 [system_info.py:probe():195] Probing system
2023-05-25 15:58:17,281 DEBUG   HandlerThread:7063 [system_info.py:_probe_git():180] Probing git
2023-05-25 15:58:17,283 DEBUG   HandlerThread:7063 [system_info.py:probe():195] Probing system
2023-05-25 15:58:17,288 DEBUG   HandlerThread:7063 [system_info.py:_probe_git():180] Probing git
2023-05-25 15:58:17,291 DEBUG   HandlerThread:7063 [system_info.py:probe():195] Probing system
2023-05-25 15:58:17,301 DEBUG   HandlerThread:7063 [system_info.py:_probe_git():180] Probing git
2023-05-25 15:58:17,303 DEBUG   HandlerThread:7063 [system_info.py:_probe_git():188] Probing git done
2023-05-25 15:58:17,304 DEBUG   HandlerThread:7063 [system_info.py:probe():240] Probing system done
2023-05-25 15:58:17,307 DEBUG   HandlerThread:7063 [system_monitor.py:probe():210] {'os': 'Linux-5.15.0-72-generic-x86_64-with-glibc2.29', 'python': '3.8.10', 'heartbeatAt': '2023-05-25T13:58:17.280376', 'startedAt': '2023-05-25T13:58:16.698477', 'docker': None, 'cuda': None, 'args': (), 'state': 'running', 'program': '<python with no main file>', 'git': {'remote': 'https://git.scc.kit.edu/balintvarga/dongxu-master-thesis.git', 'commit': '254316a0fbc147737419a2ed53bbb90c33870f79'}, 'email': 'ubtef@student.kit.edu', 'root': '/home/yang/MasterThesis_ws/src/dongxu-master-thesis', 'host': 'yang-ThinkPad-T480s', 'username': 'yang', 'executable': '/usr/bin/python3.8', 'cpu_count': 4, 'cpu_count_logical': 8, 'cpu_freq': {'current': 3597.8525000000004, 'min': 400.0, 'max': 4000.0}, 'cpu_freq_per_core': [{'current': 3699.981, 'min': 400.0, 'max': 4000.0}, {'current': 3699.976, 'min': 400.0, 'max': 4000.0}, {'current': 3699.973, 'min': 400.0, 'max': 4000.0}, {'current': 3700.02, 'min': 400.0, 'max': 4000.0}, {'current': 3699.999, 'min': 400.0, 'max': 4000.0}, {'current': 3685.685, 'min': 400.0, 'max': 4000.0}, {'current': 3697.72, 'min': 400.0, 'max': 4000.0}, {'current': 3700.007, 'min': 400.0, 'max': 4000.0}], 'disk': {'total': 109.54700088500977, 'used': 30.55895233154297}, 'memory': {'total': 15.522789001464844}}
2023-05-25 15:58:17,308 INFO    HandlerThread:7063 [system_monitor.py:probe():211] Finished collecting system info
2023-05-25 15:58:17,309 INFO    HandlerThread:7063 [system_monitor.py:probe():214] Publishing system info
2023-05-25 15:58:17,309 DEBUG   HandlerThread:7063 [system_info.py:_save_pip():51] Saving list of pip packages installed into the current environment
2023-05-25 15:58:17,313 DEBUG   HandlerThread:7063 [system_info.py:_save_pip():67] Saving pip packages done
2023-05-25 15:58:17,314 INFO    HandlerThread:7063 [system_monitor.py:probe():216] Finished publishing system info
2023-05-25 15:58:17,314 DEBUG   HandlerThread:7063 [system_info.py:_probe_git():188] Probing git done
2023-05-25 15:58:17,315 DEBUG   SenderThread:7063 [sender.py:send():375] send: files
2023-05-25 15:58:17,316 DEBUG   HandlerThread:7063 [system_info.py:probe():240] Probing system done
2023-05-25 15:58:17,317 INFO    SenderThread:7063 [sender.py:_save_file():1378] saving file wandb-metadata.json with policy now
2023-05-25 15:58:17,319 DEBUG   HandlerThread:7063 [system_monitor.py:probe():210] {'os': 'Linux-5.15.0-72-generic-x86_64-with-glibc2.29', 'python': '3.8.10', 'heartbeatAt': '2023-05-25T13:58:17.286295', 'startedAt': '2023-05-25T13:58:16.651575', 'docker': None, 'cuda': None, 'args': (), 'state': 'running', 'program': '<python with no main file>', 'git': {'remote': 'https://git.scc.kit.edu/balintvarga/dongxu-master-thesis.git', 'commit': '254316a0fbc147737419a2ed53bbb90c33870f79'}, 'email': 'ubtef@student.kit.edu', 'root': '/home/yang/MasterThesis_ws/src/dongxu-master-thesis', 'host': 'yang-ThinkPad-T480s', 'username': 'yang', 'executable': '/usr/bin/python3.8', 'cpu_count': 4, 'cpu_count_logical': 8, 'cpu_freq': {'current': 3597.1160000000004, 'min': 400.0, 'max': 4000.0}, 'cpu_freq_per_core': [{'current': 3699.981, 'min': 400.0, 'max': 4000.0}, {'current': 3699.976, 'min': 400.0, 'max': 4000.0}, {'current': 3699.973, 'min': 400.0, 'max': 4000.0}, {'current': 3700.02, 'min': 400.0, 'max': 4000.0}, {'current': 3694.682, 'min': 400.0, 'max': 4000.0}, {'current': 3709.847, 'min': 400.0, 'max': 4000.0}, {'current': 3697.72, 'min': 400.0, 'max': 4000.0}, {'current': 3700.007, 'min': 400.0, 'max': 4000.0}], 'disk': {'total': 109.54700088500977, 'used': 30.55895233154297}, 'memory': {'total': 15.522789001464844}}
2023-05-25 15:58:17,320 DEBUG   HandlerThread:7063 [handler.py:handle_request():144] handle_request: stop_status
2023-05-25 15:58:17,321 INFO    HandlerThread:7063 [system_monitor.py:probe():211] Finished collecting system info
2023-05-25 15:58:17,322 INFO    HandlerThread:7063 [system_monitor.py:probe():214] Publishing system info
2023-05-25 15:58:17,322 DEBUG   SenderThread:7063 [sender.py:send_request():402] send_request: stop_status
2023-05-25 15:58:17,323 DEBUG   HandlerThread:7063 [system_info.py:_probe_git():188] Probing git done
2023-05-25 15:58:17,323 DEBUG   HandlerThread:7063 [system_info.py:_save_pip():51] Saving list of pip packages installed into the current environment
2023-05-25 15:58:17,326 DEBUG   HandlerThread:7063 [system_info.py:probe():240] Probing system done
2023-05-25 15:58:17,328 DEBUG   HandlerThread:7063 [system_info.py:_save_pip():67] Saving pip packages done
2023-05-25 15:58:17,328 DEBUG   HandlerThread:7063 [system_monitor.py:probe():210] {'os': 'Linux-5.15.0-72-generic-x86_64-with-glibc2.29', 'python': '3.8.10', 'heartbeatAt': '2023-05-25T13:58:17.295187', 'startedAt': '2023-05-25T13:58:16.653404', 'docker': None, 'cuda': None, 'args': (), 'state': 'running', 'program': '<python with no main file>', 'git': {'remote': 'https://git.scc.kit.edu/balintvarga/dongxu-master-thesis.git', 'commit': '254316a0fbc147737419a2ed53bbb90c33870f79'}, 'email': 'ubtef@student.kit.edu', 'root': '/home/yang/MasterThesis_ws/src/dongxu-master-thesis', 'host': 'yang-ThinkPad-T480s', 'username': 'yang', 'executable': '/usr/bin/python3.8', 'cpu_count': 4, 'cpu_count_logical': 8, 'cpu_freq': {'current': 3597.8525000000004, 'min': 400.0, 'max': 4000.0}, 'cpu_freq_per_core': [{'current': 3699.981, 'min': 400.0, 'max': 4000.0}, {'current': 3692.791, 'min': 400.0, 'max': 4000.0}, {'current': 3703.868, 'min': 400.0, 'max': 4000.0}, {'current': 3700.02, 'min': 400.0, 'max': 4000.0}, {'current': 3694.682, 'min': 400.0, 'max': 4000.0}, {'current': 3709.847, 'min': 400.0, 'max': 4000.0}, {'current': 3714.939, 'min': 400.0, 'max': 4000.0}, {'current': 3690.335, 'min': 400.0, 'max': 4000.0}], 'disk': {'total': 109.54700088500977, 'used': 30.55895233154297}, 'memory': {'total': 15.522789001464844}}
2023-05-25 15:58:17,329 INFO    HandlerThread:7063 [system_monitor.py:probe():216] Finished publishing system info
2023-05-25 15:58:17,329 INFO    HandlerThread:7063 [system_monitor.py:probe():211] Finished collecting system info
2023-05-25 15:58:17,332 DEBUG   SenderThread:7063 [sender.py:send():375] send: files
2023-05-25 15:58:17,332 INFO    HandlerThread:7063 [system_monitor.py:probe():214] Publishing system info
2023-05-25 15:58:17,332 INFO    SenderThread:7063 [sender.py:_save_file():1378] saving file wandb-metadata.json with policy now
2023-05-25 15:58:17,333 DEBUG   HandlerThread:7063 [system_info.py:_save_pip():51] Saving list of pip packages installed into the current environment
2023-05-25 15:58:17,334 DEBUG   HandlerThread:7063 [system_info.py:_save_pip():67] Saving pip packages done
2023-05-25 15:58:17,334 INFO    HandlerThread:7063 [system_monitor.py:probe():216] Finished publishing system info
2023-05-25 15:58:17,335 DEBUG   SenderThread:7063 [sender.py:send():375] send: files
2023-05-25 15:58:17,335 INFO    SenderThread:7063 [sender.py:_save_file():1378] saving file wandb-metadata.json with policy now
2023-05-25 15:58:17,339 DEBUG   HandlerThread:7063 [handler.py:handle_request():144] handle_request: stop_status
2023-05-25 15:58:17,340 DEBUG   SenderThread:7063 [sender.py:send_request():402] send_request: stop_status
2023-05-25 15:58:17,347 DEBUG   HandlerThread:7063 [handler.py:handle_request():144] handle_request: stop_status
2023-05-25 15:58:17,348 DEBUG   SenderThread:7063 [sender.py:send_request():402] send_request: stop_status
2023-05-25 15:58:17,353 DEBUG   HandlerThread:7063 [system_info.py:probe():195] Probing system
2023-05-25 15:58:17,355 DEBUG   HandlerThread:7063 [system_info.py:_probe_git():180] Probing git
2023-05-25 15:58:17,380 DEBUG   HandlerThread:7063 [system_info.py:_probe_git():188] Probing git done
2023-05-25 15:58:17,381 DEBUG   HandlerThread:7063 [system_info.py:probe():240] Probing system done
2023-05-25 15:58:17,381 DEBUG   HandlerThread:7063 [system_monitor.py:probe():210] {'os': 'Linux-5.15.0-72-generic-x86_64-with-glibc2.29', 'python': '3.8.10', 'heartbeatAt': '2023-05-25T13:58:17.353567', 'startedAt': '2023-05-25T13:58:16.701307', 'docker': None, 'cuda': None, 'args': (), 'state': 'running', 'program': '<python with no main file>', 'git': {'remote': 'https://git.scc.kit.edu/balintvarga/dongxu-master-thesis.git', 'commit': '254316a0fbc147737419a2ed53bbb90c33870f79'}, 'email': 'ubtef@student.kit.edu', 'root': '/home/yang/MasterThesis_ws/src/dongxu-master-thesis', 'host': 'yang-ThinkPad-T480s', 'username': 'yang', 'executable': '/usr/bin/python3.8', 'cpu_count': 4, 'cpu_count_logical': 8, 'cpu_freq': {'current': 3697.8843749999996, 'min': 400.0, 'max': 4000.0}, 'cpu_freq_per_core': [{'current': 3700.035, 'min': 400.0, 'max': 4000.0}, {'current': 3700.001, 'min': 400.0, 'max': 4000.0}, {'current': 3699.997, 'min': 400.0, 'max': 4000.0}, {'current': 3699.995, 'min': 400.0, 'max': 4000.0}, {'current': 3700.013, 'min': 400.0, 'max': 4000.0}, {'current': 3700.001, 'min': 400.0, 'max': 4000.0}, {'current': 3700.002, 'min': 400.0, 'max': 4000.0}, {'current': 3699.996, 'min': 400.0, 'max': 4000.0}], 'disk': {'total': 109.54700088500977, 'used': 30.558963775634766}, 'memory': {'total': 15.522789001464844}}
2023-05-25 15:58:17,382 INFO    HandlerThread:7063 [system_monitor.py:probe():211] Finished collecting system info
2023-05-25 15:58:17,382 INFO    HandlerThread:7063 [system_monitor.py:probe():214] Publishing system info
2023-05-25 15:58:17,382 DEBUG   HandlerThread:7063 [system_info.py:_save_pip():51] Saving list of pip packages installed into the current environment
2023-05-25 15:58:17,386 DEBUG   HandlerThread:7063 [system_info.py:_save_pip():67] Saving pip packages done
2023-05-25 15:58:17,396 INFO    HandlerThread:7063 [system_monitor.py:probe():216] Finished publishing system info
2023-05-25 15:58:17,406 DEBUG   SenderThread:7063 [sender.py:send():375] send: files
2023-05-25 15:58:17,407 INFO    SenderThread:7063 [sender.py:_save_file():1378] saving file wandb-metadata.json with policy now
2023-05-25 15:58:17,412 DEBUG   HandlerThread:7063 [handler.py:handle_request():144] handle_request: stop_status
2023-05-25 15:58:17,417 DEBUG   SenderThread:7063 [sender.py:send_request():402] send_request: stop_status
2023-05-25 15:58:17,418 DEBUG   SenderThread:7063 [sender.py:send():375] send: exit
2023-05-25 15:58:17,422 INFO    SenderThread:7063 [sender.py:send_exit():598] handling exit code: 1
2023-05-25 15:58:17,422 INFO    SenderThread:7063 [sender.py:send_exit():600] handling runtime: 4
2023-05-25 15:58:17,422 INFO    SenderThread:7063 [sender.py:_save_file():1378] saving file wandb-summary.json with policy end
2023-05-25 15:58:17,422 INFO    SenderThread:7063 [sender.py:send_exit():606] send defer
2023-05-25 15:58:17,423 DEBUG   HandlerThread:7063 [handler.py:handle_request():144] handle_request: defer
2023-05-25 15:58:17,423 INFO    HandlerThread:7063 [handler.py:handle_request_defer():170] handle defer: 0
2023-05-25 15:58:17,423 DEBUG   SenderThread:7063 [sender.py:send_request():402] send_request: defer
2023-05-25 15:58:17,423 INFO    SenderThread:7063 [sender.py:send_request_defer():622] handle sender defer: 0
2023-05-25 15:58:17,423 INFO    SenderThread:7063 [sender.py:transition_state():626] send defer: 1
2023-05-25 15:58:17,423 DEBUG   HandlerThread:7063 [handler.py:handle_request():144] handle_request: defer
2023-05-25 15:58:17,424 INFO    HandlerThread:7063 [handler.py:handle_request_defer():170] handle defer: 1
2023-05-25 15:58:17,424 DEBUG   SenderThread:7063 [sender.py:send_request():402] send_request: defer
2023-05-25 15:58:17,424 INFO    SenderThread:7063 [sender.py:send_request_defer():622] handle sender defer: 1
2023-05-25 15:58:17,424 INFO    SenderThread:7063 [sender.py:transition_state():626] send defer: 2
2023-05-25 15:58:17,424 DEBUG   HandlerThread:7063 [handler.py:handle_request():144] handle_request: defer
2023-05-25 15:58:17,424 INFO    HandlerThread:7063 [handler.py:handle_request_defer():170] handle defer: 2
2023-05-25 15:58:17,424 INFO    HandlerThread:7063 [system_monitor.py:finish():190] Stopping system monitor
2023-05-25 15:58:17,425 DEBUG   SystemMonitor:7063 [system_monitor.py:_start():159] Starting system metrics aggregation loop
2023-05-25 15:58:17,425 INFO    HandlerThread:7063 [interfaces.py:finish():202] Joined cpu monitor
2023-05-25 15:58:17,425 DEBUG   SystemMonitor:7063 [system_monitor.py:_start():166] Finished system metrics aggregation loop
2023-05-25 15:58:17,425 INFO    HandlerThread:7063 [interfaces.py:finish():202] Joined disk monitor
2023-05-25 15:58:17,426 DEBUG   SystemMonitor:7063 [system_monitor.py:_start():170] Publishing last batch of metrics
2023-05-25 15:58:17,426 INFO    HandlerThread:7063 [interfaces.py:finish():202] Joined memory monitor
2023-05-25 15:58:17,426 INFO    HandlerThread:7063 [interfaces.py:finish():202] Joined network monitor
2023-05-25 15:58:17,427 DEBUG   SenderThread:7063 [sender.py:send_request():402] send_request: defer
2023-05-25 15:58:17,427 INFO    SenderThread:7063 [sender.py:send_request_defer():622] handle sender defer: 2
2023-05-25 15:58:17,427 INFO    SenderThread:7063 [sender.py:transition_state():626] send defer: 3
2023-05-25 15:58:17,427 DEBUG   SenderThread:7063 [sender.py:send():375] send: stats
2023-05-25 15:58:17,427 DEBUG   HandlerThread:7063 [handler.py:handle_request():144] handle_request: defer
2023-05-25 15:58:17,428 INFO    HandlerThread:7063 [handler.py:handle_request_defer():170] handle defer: 3
2023-05-25 15:58:17,428 DEBUG   SenderThread:7063 [sender.py:send_request():402] send_request: defer
2023-05-25 15:58:17,429 INFO    SenderThread:7063 [sender.py:send_request_defer():622] handle sender defer: 3
2023-05-25 15:58:17,429 INFO    SenderThread:7063 [sender.py:transition_state():626] send defer: 4
2023-05-25 15:58:17,429 DEBUG   HandlerThread:7063 [handler.py:handle_request():144] handle_request: defer
2023-05-25 15:58:17,429 INFO    HandlerThread:7063 [handler.py:handle_request_defer():170] handle defer: 4
2023-05-25 15:58:17,429 DEBUG   SenderThread:7063 [sender.py:send_request():402] send_request: defer
2023-05-25 15:58:17,429 INFO    SenderThread:7063 [sender.py:send_request_defer():622] handle sender defer: 4
2023-05-25 15:58:17,430 INFO    SenderThread:7063 [sender.py:transition_state():626] send defer: 5
2023-05-25 15:58:17,430 DEBUG   HandlerThread:7063 [handler.py:handle_request():144] handle_request: defer
2023-05-25 15:58:17,430 INFO    HandlerThread:7063 [handler.py:handle_request_defer():170] handle defer: 5
2023-05-25 15:58:17,430 DEBUG   SenderThread:7063 [sender.py:send():375] send: summary
2023-05-25 15:58:17,430 INFO    SenderThread:7063 [sender.py:_save_file():1378] saving file wandb-summary.json with policy end
2023-05-25 15:58:17,431 DEBUG   SenderThread:7063 [sender.py:send_request():402] send_request: defer
2023-05-25 15:58:17,431 INFO    SenderThread:7063 [sender.py:send_request_defer():622] handle sender defer: 5
2023-05-25 15:58:17,431 INFO    SenderThread:7063 [sender.py:transition_state():626] send defer: 6
2023-05-25 15:58:17,431 DEBUG   HandlerThread:7063 [handler.py:handle_request():144] handle_request: defer
2023-05-25 15:58:17,431 INFO    HandlerThread:7063 [handler.py:handle_request_defer():170] handle defer: 6
2023-05-25 15:58:17,431 DEBUG   SenderThread:7063 [sender.py:send_request():402] send_request: defer
2023-05-25 15:58:17,431 INFO    SenderThread:7063 [sender.py:send_request_defer():622] handle sender defer: 6
2023-05-25 15:58:17,435 DEBUG   HandlerThread:7063 [handler.py:handle_request():144] handle_request: status_report
2023-05-25 15:58:17,474 DEBUG   SenderThread:7063 [sender.py:send():375] send: telemetry
2023-05-25 15:58:17,476 DEBUG   SenderThread:7063 [sender.py:send():375] send: exit
2023-05-25 15:58:17,476 INFO    SenderThread:7063 [sender.py:send_exit():598] handling exit code: 1
2023-05-25 15:58:17,477 INFO    SenderThread:7063 [sender.py:send_exit():600] handling runtime: 0
2023-05-25 15:58:17,477 INFO    SenderThread:7063 [sender.py:_save_file():1378] saving file wandb-summary.json with policy end
2023-05-25 15:58:17,477 INFO    SenderThread:7063 [sender.py:send_exit():606] send defer
2023-05-25 15:58:17,477 DEBUG   HandlerThread:7063 [handler.py:handle_request():144] handle_request: defer
2023-05-25 15:58:17,477 INFO    HandlerThread:7063 [handler.py:handle_request_defer():170] handle defer: 0
2023-05-25 15:58:17,478 DEBUG   SenderThread:7063 [sender.py:send_request():402] send_request: defer
2023-05-25 15:58:17,478 INFO    SenderThread:7063 [sender.py:send_request_defer():622] handle sender defer: 0
2023-05-25 15:58:17,478 INFO    SenderThread:7063 [sender.py:transition_state():626] send defer: 1
2023-05-25 15:58:17,478 DEBUG   HandlerThread:7063 [handler.py:handle_request():144] handle_request: defer
2023-05-25 15:58:17,478 INFO    HandlerThread:7063 [handler.py:handle_request_defer():170] handle defer: 1
2023-05-25 15:58:17,478 DEBUG   SenderThread:7063 [sender.py:send_request():402] send_request: defer
2023-05-25 15:58:17,478 INFO    SenderThread:7063 [sender.py:send_request_defer():622] handle sender defer: 1
2023-05-25 15:58:17,479 INFO    SenderThread:7063 [sender.py:transition_state():626] send defer: 2
2023-05-25 15:58:17,479 DEBUG   HandlerThread:7063 [handler.py:handle_request():144] handle_request: defer
2023-05-25 15:58:17,479 INFO    HandlerThread:7063 [handler.py:handle_request_defer():170] handle defer: 2
2023-05-25 15:58:17,479 INFO    HandlerThread:7063 [system_monitor.py:finish():190] Stopping system monitor
2023-05-25 15:58:17,479 DEBUG   SystemMonitor:7063 [system_monitor.py:_start():159] Starting system metrics aggregation loop
2023-05-25 15:58:17,479 INFO    HandlerThread:7063 [interfaces.py:finish():202] Joined cpu monitor
2023-05-25 15:58:17,480 DEBUG   SystemMonitor:7063 [system_monitor.py:_start():166] Finished system metrics aggregation loop
2023-05-25 15:58:17,480 INFO    HandlerThread:7063 [interfaces.py:finish():202] Joined disk monitor
2023-05-25 15:58:17,480 DEBUG   SystemMonitor:7063 [system_monitor.py:_start():170] Publishing last batch of metrics
2023-05-25 15:58:17,480 INFO    HandlerThread:7063 [interfaces.py:finish():202] Joined memory monitor
2023-05-25 15:58:17,481 INFO    HandlerThread:7063 [interfaces.py:finish():202] Joined network monitor
2023-05-25 15:58:17,481 DEBUG   SenderThread:7063 [sender.py:send_request():402] send_request: defer
2023-05-25 15:58:17,481 INFO    SenderThread:7063 [sender.py:send_request_defer():622] handle sender defer: 2
2023-05-25 15:58:17,482 INFO    SenderThread:7063 [sender.py:transition_state():626] send defer: 3
2023-05-25 15:58:17,482 DEBUG   SenderThread:7063 [sender.py:send():375] send: stats
2023-05-25 15:58:17,482 DEBUG   HandlerThread:7063 [handler.py:handle_request():144] handle_request: defer
2023-05-25 15:58:17,482 INFO    HandlerThread:7063 [handler.py:handle_request_defer():170] handle defer: 3
2023-05-25 15:58:17,483 DEBUG   SenderThread:7063 [sender.py:send_request():402] send_request: defer
2023-05-25 15:58:17,483 INFO    SenderThread:7063 [sender.py:send_request_defer():622] handle sender defer: 3
2023-05-25 15:58:17,483 INFO    SenderThread:7063 [sender.py:transition_state():626] send defer: 4
2023-05-25 15:58:17,483 DEBUG   HandlerThread:7063 [handler.py:handle_request():144] handle_request: defer
2023-05-25 15:58:17,483 INFO    HandlerThread:7063 [handler.py:handle_request_defer():170] handle defer: 4
2023-05-25 15:58:17,483 DEBUG   SenderThread:7063 [sender.py:send_request():402] send_request: defer
2023-05-25 15:58:17,483 INFO    SenderThread:7063 [sender.py:send_request_defer():622] handle sender defer: 4
2023-05-25 15:58:17,484 INFO    SenderThread:7063 [sender.py:transition_state():626] send defer: 5
2023-05-25 15:58:17,484 DEBUG   HandlerThread:7063 [handler.py:handle_request():144] handle_request: defer
2023-05-25 15:58:17,484 INFO    HandlerThread:7063 [handler.py:handle_request_defer():170] handle defer: 5
2023-05-25 15:58:17,484 DEBUG   SenderThread:7063 [sender.py:send():375] send: summary
2023-05-25 15:58:17,484 INFO    SenderThread:7063 [sender.py:_save_file():1378] saving file wandb-summary.json with policy end
2023-05-25 15:58:17,485 DEBUG   SenderThread:7063 [sender.py:send_request():402] send_request: defer
2023-05-25 15:58:17,485 INFO    SenderThread:7063 [sender.py:send_request_defer():622] handle sender defer: 5
2023-05-25 15:58:17,485 INFO    SenderThread:7063 [sender.py:transition_state():626] send defer: 6
2023-05-25 15:58:17,485 DEBUG   HandlerThread:7063 [handler.py:handle_request():144] handle_request: defer
2023-05-25 15:58:17,485 INFO    HandlerThread:7063 [handler.py:handle_request_defer():170] handle defer: 6
2023-05-25 15:58:17,485 DEBUG   SenderThread:7063 [sender.py:send_request():402] send_request: defer
2023-05-25 15:58:17,485 INFO    SenderThread:7063 [sender.py:send_request_defer():622] handle sender defer: 6
2023-05-25 15:58:17,489 DEBUG   HandlerThread:7063 [handler.py:handle_request():144] handle_request: status_report
2023-05-25 15:58:17,522 DEBUG   SenderThread:7063 [sender.py:send():375] send: telemetry
2023-05-25 15:58:17,524 DEBUG   SenderThread:7063 [sender.py:send():375] send: exit
2023-05-25 15:58:17,525 INFO    SenderThread:7063 [sender.py:send_exit():598] handling exit code: 1
2023-05-25 15:58:17,525 INFO    SenderThread:7063 [sender.py:send_exit():600] handling runtime: 0
2023-05-25 15:58:17,525 INFO    SenderThread:7063 [sender.py:_save_file():1378] saving file wandb-summary.json with policy end
2023-05-25 15:58:17,526 INFO    SenderThread:7063 [sender.py:send_exit():606] send defer
2023-05-25 15:58:17,527 DEBUG   HandlerThread:7063 [handler.py:handle_request():144] handle_request: defer
2023-05-25 15:58:17,527 INFO    HandlerThread:7063 [handler.py:handle_request_defer():170] handle defer: 0
2023-05-25 15:58:17,528 DEBUG   SenderThread:7063 [sender.py:send_request():402] send_request: defer
2023-05-25 15:58:17,529 INFO    SenderThread:7063 [sender.py:send_request_defer():622] handle sender defer: 0
2023-05-25 15:58:17,529 INFO    SenderThread:7063 [sender.py:transition_state():626] send defer: 1
2023-05-25 15:58:17,530 DEBUG   HandlerThread:7063 [handler.py:handle_request():144] handle_request: defer
2023-05-25 15:58:17,530 INFO    HandlerThread:7063 [handler.py:handle_request_defer():170] handle defer: 1
2023-05-25 15:58:17,530 DEBUG   SenderThread:7063 [sender.py:send_request():402] send_request: defer
2023-05-25 15:58:17,531 INFO    SenderThread:7063 [sender.py:send_request_defer():622] handle sender defer: 1
2023-05-25 15:58:17,531 INFO    SenderThread:7063 [sender.py:transition_state():626] send defer: 2
2023-05-25 15:58:17,531 DEBUG   HandlerThread:7063 [handler.py:handle_request():144] handle_request: defer
2023-05-25 15:58:17,531 INFO    HandlerThread:7063 [handler.py:handle_request_defer():170] handle defer: 2
2023-05-25 15:58:17,531 INFO    HandlerThread:7063 [system_monitor.py:finish():190] Stopping system monitor
2023-05-25 15:58:17,532 DEBUG   SystemMonitor:7063 [system_monitor.py:_start():159] Starting system metrics aggregation loop
2023-05-25 15:58:17,532 INFO    HandlerThread:7063 [interfaces.py:finish():202] Joined cpu monitor
2023-05-25 15:58:17,532 DEBUG   SystemMonitor:7063 [system_monitor.py:_start():166] Finished system metrics aggregation loop
2023-05-25 15:58:17,532 INFO    HandlerThread:7063 [interfaces.py:finish():202] Joined disk monitor
2023-05-25 15:58:17,533 DEBUG   SystemMonitor:7063 [system_monitor.py:_start():170] Publishing last batch of metrics
2023-05-25 15:58:17,533 INFO    HandlerThread:7063 [interfaces.py:finish():202] Joined memory monitor
2023-05-25 15:58:17,534 INFO    HandlerThread:7063 [interfaces.py:finish():202] Joined network monitor
2023-05-25 15:58:17,534 DEBUG   SenderThread:7063 [sender.py:send_request():402] send_request: defer
2023-05-25 15:58:17,535 INFO    SenderThread:7063 [sender.py:send_request_defer():622] handle sender defer: 2
2023-05-25 15:58:17,535 INFO    SenderThread:7063 [sender.py:transition_state():626] send defer: 3
2023-05-25 15:58:17,535 DEBUG   SenderThread:7063 [sender.py:send():375] send: stats
2023-05-25 15:58:17,535 DEBUG   HandlerThread:7063 [handler.py:handle_request():144] handle_request: defer
2023-05-25 15:58:17,536 INFO    HandlerThread:7063 [handler.py:handle_request_defer():170] handle defer: 3
2023-05-25 15:58:17,536 DEBUG   SenderThread:7063 [sender.py:send_request():402] send_request: defer
2023-05-25 15:58:17,536 INFO    SenderThread:7063 [sender.py:send_request_defer():622] handle sender defer: 3
2023-05-25 15:58:17,536 INFO    SenderThread:7063 [sender.py:transition_state():626] send defer: 4
2023-05-25 15:58:17,536 DEBUG   HandlerThread:7063 [handler.py:handle_request():144] handle_request: defer
2023-05-25 15:58:17,537 INFO    HandlerThread:7063 [handler.py:handle_request_defer():170] handle defer: 4
2023-05-25 15:58:17,537 DEBUG   SenderThread:7063 [sender.py:send_request():402] send_request: defer
2023-05-25 15:58:17,537 INFO    SenderThread:7063 [sender.py:send_request_defer():622] handle sender defer: 4
2023-05-25 15:58:17,537 INFO    SenderThread:7063 [sender.py:transition_state():626] send defer: 5
2023-05-25 15:58:17,538 DEBUG   HandlerThread:7063 [handler.py:handle_request():144] handle_request: defer
2023-05-25 15:58:17,538 INFO    HandlerThread:7063 [handler.py:handle_request_defer():170] handle defer: 5
2023-05-25 15:58:17,538 DEBUG   SenderThread:7063 [sender.py:send():375] send: summary
2023-05-25 15:58:17,539 INFO    SenderThread:7063 [sender.py:_save_file():1378] saving file wandb-summary.json with policy end
2023-05-25 15:58:17,539 DEBUG   SenderThread:7063 [sender.py:send_request():402] send_request: defer
2023-05-25 15:58:17,539 INFO    SenderThread:7063 [sender.py:send_request_defer():622] handle sender defer: 5
2023-05-25 15:58:17,539 INFO    SenderThread:7063 [sender.py:transition_state():626] send defer: 6
2023-05-25 15:58:17,539 DEBUG   HandlerThread:7063 [handler.py:handle_request():144] handle_request: defer
2023-05-25 15:58:17,539 INFO    HandlerThread:7063 [handler.py:handle_request_defer():170] handle defer: 6
2023-05-25 15:58:17,540 DEBUG   SenderThread:7063 [sender.py:send_request():402] send_request: defer
2023-05-25 15:58:17,540 INFO    SenderThread:7063 [sender.py:send_request_defer():622] handle sender defer: 6
2023-05-25 15:58:17,545 DEBUG   HandlerThread:7063 [handler.py:handle_request():144] handle_request: status_report
2023-05-25 15:58:17,547 DEBUG   SenderThread:7063 [sender.py:send():375] send: telemetry
2023-05-25 15:58:17,553 DEBUG   SenderThread:7063 [sender.py:send():375] send: exit
2023-05-25 15:58:17,554 INFO    SenderThread:7063 [sender.py:send_exit():598] handling exit code: 1
2023-05-25 15:58:17,554 INFO    SenderThread:7063 [sender.py:send_exit():600] handling runtime: 0
2023-05-25 15:58:17,554 INFO    SenderThread:7063 [sender.py:_save_file():1378] saving file wandb-summary.json with policy end
2023-05-25 15:58:17,554 INFO    SenderThread:7063 [sender.py:send_exit():606] send defer
2023-05-25 15:58:17,555 DEBUG   HandlerThread:7063 [handler.py:handle_request():144] handle_request: defer
2023-05-25 15:58:17,555 INFO    HandlerThread:7063 [handler.py:handle_request_defer():170] handle defer: 0
2023-05-25 15:58:17,555 DEBUG   SenderThread:7063 [sender.py:send_request():402] send_request: defer
2023-05-25 15:58:17,555 INFO    SenderThread:7063 [sender.py:send_request_defer():622] handle sender defer: 0
2023-05-25 15:58:17,555 INFO    SenderThread:7063 [sender.py:transition_state():626] send defer: 1
2023-05-25 15:58:17,555 DEBUG   HandlerThread:7063 [handler.py:handle_request():144] handle_request: defer
2023-05-25 15:58:17,556 INFO    HandlerThread:7063 [handler.py:handle_request_defer():170] handle defer: 1
2023-05-25 15:58:17,556 DEBUG   SenderThread:7063 [sender.py:send_request():402] send_request: defer
2023-05-25 15:58:17,556 INFO    SenderThread:7063 [sender.py:send_request_defer():622] handle sender defer: 1
2023-05-25 15:58:17,556 INFO    SenderThread:7063 [sender.py:transition_state():626] send defer: 2
2023-05-25 15:58:17,556 DEBUG   HandlerThread:7063 [handler.py:handle_request():144] handle_request: defer
2023-05-25 15:58:17,556 INFO    HandlerThread:7063 [handler.py:handle_request_defer():170] handle defer: 2
2023-05-25 15:58:17,556 INFO    HandlerThread:7063 [system_monitor.py:finish():190] Stopping system monitor
2023-05-25 15:58:17,557 INFO    HandlerThread:7063 [interfaces.py:finish():202] Joined cpu monitor
2023-05-25 15:58:17,557 DEBUG   SystemMonitor:7063 [system_monitor.py:_start():159] Starting system metrics aggregation loop
2023-05-25 15:58:17,557 INFO    HandlerThread:7063 [interfaces.py:finish():202] Joined disk monitor
2023-05-25 15:58:17,558 DEBUG   SystemMonitor:7063 [system_monitor.py:_start():166] Finished system metrics aggregation loop
2023-05-25 15:58:17,558 INFO    HandlerThread:7063 [interfaces.py:finish():202] Joined memory monitor
2023-05-25 15:58:17,558 DEBUG   SystemMonitor:7063 [system_monitor.py:_start():170] Publishing last batch of metrics
2023-05-25 15:58:17,559 INFO    HandlerThread:7063 [interfaces.py:finish():202] Joined network monitor
2023-05-25 15:58:17,560 DEBUG   SenderThread:7063 [sender.py:send_request():402] send_request: defer
2023-05-25 15:58:17,561 INFO    SenderThread:7063 [sender.py:send_request_defer():622] handle sender defer: 2
2023-05-25 15:58:17,564 INFO    SenderThread:7063 [sender.py:transition_state():626] send defer: 3
2023-05-25 15:58:17,564 DEBUG   SenderThread:7063 [sender.py:send():375] send: stats
2023-05-25 15:58:17,564 DEBUG   HandlerThread:7063 [handler.py:handle_request():144] handle_request: defer
2023-05-25 15:58:17,565 INFO    HandlerThread:7063 [handler.py:handle_request_defer():170] handle defer: 3
2023-05-25 15:58:17,565 DEBUG   SenderThread:7063 [sender.py:send_request():402] send_request: defer
2023-05-25 15:58:17,566 INFO    SenderThread:7063 [sender.py:send_request_defer():622] handle sender defer: 3
2023-05-25 15:58:17,566 INFO    SenderThread:7063 [sender.py:transition_state():626] send defer: 4
2023-05-25 15:58:17,566 DEBUG   HandlerThread:7063 [handler.py:handle_request():144] handle_request: defer
2023-05-25 15:58:17,566 INFO    HandlerThread:7063 [handler.py:handle_request_defer():170] handle defer: 4
2023-05-25 15:58:17,567 DEBUG   SenderThread:7063 [sender.py:send_request():402] send_request: defer
2023-05-25 15:58:17,567 INFO    SenderThread:7063 [sender.py:send_request_defer():622] handle sender defer: 4
2023-05-25 15:58:17,567 INFO    SenderThread:7063 [sender.py:transition_state():626] send defer: 5
2023-05-25 15:58:17,567 DEBUG   HandlerThread:7063 [handler.py:handle_request():144] handle_request: defer
2023-05-25 15:58:17,567 INFO    HandlerThread:7063 [handler.py:handle_request_defer():170] handle defer: 5
2023-05-25 15:58:17,568 DEBUG   SenderThread:7063 [sender.py:send():375] send: summary
2023-05-25 15:58:17,568 INFO    SenderThread:7063 [sender.py:_save_file():1378] saving file wandb-summary.json with policy end
2023-05-25 15:58:17,569 DEBUG   SenderThread:7063 [sender.py:send_request():402] send_request: defer
2023-05-25 15:58:17,569 INFO    SenderThread:7063 [sender.py:send_request_defer():622] handle sender defer: 5
2023-05-25 15:58:17,569 INFO    SenderThread:7063 [sender.py:transition_state():626] send defer: 6
2023-05-25 15:58:17,570 DEBUG   HandlerThread:7063 [handler.py:handle_request():144] handle_request: defer
2023-05-25 15:58:17,570 INFO    HandlerThread:7063 [handler.py:handle_request_defer():170] handle defer: 6
2023-05-25 15:58:17,570 DEBUG   SenderThread:7063 [sender.py:send_request():402] send_request: defer
2023-05-25 15:58:17,570 INFO    SenderThread:7063 [sender.py:send_request_defer():622] handle sender defer: 6
2023-05-25 15:58:17,576 DEBUG   HandlerThread:7063 [handler.py:handle_request():144] handle_request: status_report
2023-05-25 15:58:17,583 DEBUG   SenderThread:7063 [sender.py:send():375] send: telemetry
2023-05-25 15:58:17,584 DEBUG   SenderThread:7063 [sender.py:send():375] send: exit
2023-05-25 15:58:17,584 INFO    SenderThread:7063 [sender.py:send_exit():598] handling exit code: 1
2023-05-25 15:58:17,584 INFO    SenderThread:7063 [sender.py:send_exit():600] handling runtime: 0
2023-05-25 15:58:17,584 INFO    SenderThread:7063 [sender.py:_save_file():1378] saving file wandb-summary.json with policy end
2023-05-25 15:58:17,584 INFO    SenderThread:7063 [sender.py:send_exit():606] send defer
2023-05-25 15:58:17,585 DEBUG   HandlerThread:7063 [handler.py:handle_request():144] handle_request: defer
2023-05-25 15:58:17,585 INFO    HandlerThread:7063 [handler.py:handle_request_defer():170] handle defer: 0
2023-05-25 15:58:17,587 DEBUG   SenderThread:7063 [sender.py:send_request():402] send_request: defer
2023-05-25 15:58:17,587 INFO    SenderThread:7063 [sender.py:send_request_defer():622] handle sender defer: 0
2023-05-25 15:58:17,587 INFO    SenderThread:7063 [sender.py:transition_state():626] send defer: 1
2023-05-25 15:58:17,587 DEBUG   HandlerThread:7063 [handler.py:handle_request():144] handle_request: defer
2023-05-25 15:58:17,588 INFO    HandlerThread:7063 [handler.py:handle_request_defer():170] handle defer: 1
2023-05-25 15:58:17,588 DEBUG   SenderThread:7063 [sender.py:send_request():402] send_request: defer
2023-05-25 15:58:17,588 INFO    SenderThread:7063 [sender.py:send_request_defer():622] handle sender defer: 1
2023-05-25 15:58:17,588 INFO    SenderThread:7063 [sender.py:transition_state():626] send defer: 2
2023-05-25 15:58:17,588 DEBUG   HandlerThread:7063 [handler.py:handle_request():144] handle_request: defer
2023-05-25 15:58:17,588 INFO    HandlerThread:7063 [handler.py:handle_request_defer():170] handle defer: 2
2023-05-25 15:58:17,588 INFO    HandlerThread:7063 [system_monitor.py:finish():190] Stopping system monitor
2023-05-25 15:58:17,589 DEBUG   SystemMonitor:7063 [system_monitor.py:_start():159] Starting system metrics aggregation loop
2023-05-25 15:58:17,589 DEBUG   SystemMonitor:7063 [system_monitor.py:_start():166] Finished system metrics aggregation loop
2023-05-25 15:58:17,589 INFO    HandlerThread:7063 [interfaces.py:finish():202] Joined cpu monitor
2023-05-25 15:58:17,590 DEBUG   SystemMonitor:7063 [system_monitor.py:_start():170] Publishing last batch of metrics
2023-05-25 15:58:17,590 INFO    HandlerThread:7063 [interfaces.py:finish():202] Joined disk monitor
2023-05-25 15:58:17,591 INFO    HandlerThread:7063 [interfaces.py:finish():202] Joined memory monitor
2023-05-25 15:58:17,591 INFO    HandlerThread:7063 [interfaces.py:finish():202] Joined network monitor
2023-05-25 15:58:17,592 DEBUG   SenderThread:7063 [sender.py:send_request():402] send_request: defer
2023-05-25 15:58:17,592 INFO    SenderThread:7063 [sender.py:send_request_defer():622] handle sender defer: 2
2023-05-25 15:58:17,592 INFO    SenderThread:7063 [sender.py:transition_state():626] send defer: 3
2023-05-25 15:58:17,593 DEBUG   SenderThread:7063 [sender.py:send():375] send: stats
2023-05-25 15:58:17,593 DEBUG   HandlerThread:7063 [handler.py:handle_request():144] handle_request: defer
2023-05-25 15:58:17,594 INFO    HandlerThread:7063 [handler.py:handle_request_defer():170] handle defer: 3
2023-05-25 15:58:17,595 DEBUG   SenderThread:7063 [sender.py:send_request():402] send_request: defer
2023-05-25 15:58:17,595 INFO    SenderThread:7063 [sender.py:send_request_defer():622] handle sender defer: 3
2023-05-25 15:58:17,596 INFO    SenderThread:7063 [sender.py:transition_state():626] send defer: 4
2023-05-25 15:58:17,596 DEBUG   HandlerThread:7063 [handler.py:handle_request():144] handle_request: defer
2023-05-25 15:58:17,596 INFO    HandlerThread:7063 [handler.py:handle_request_defer():170] handle defer: 4
2023-05-25 15:58:17,597 DEBUG   SenderThread:7063 [sender.py:send_request():402] send_request: defer
2023-05-25 15:58:17,597 INFO    SenderThread:7063 [sender.py:send_request_defer():622] handle sender defer: 4
2023-05-25 15:58:17,597 INFO    SenderThread:7063 [sender.py:transition_state():626] send defer: 5
2023-05-25 15:58:17,597 DEBUG   HandlerThread:7063 [handler.py:handle_request():144] handle_request: defer
2023-05-25 15:58:17,597 INFO    HandlerThread:7063 [handler.py:handle_request_defer():170] handle defer: 5
2023-05-25 15:58:17,598 DEBUG   SenderThread:7063 [sender.py:send():375] send: summary
2023-05-25 15:58:17,598 INFO    SenderThread:7063 [sender.py:_save_file():1378] saving file wandb-summary.json with policy end
2023-05-25 15:58:17,598 DEBUG   SenderThread:7063 [sender.py:send_request():402] send_request: defer
2023-05-25 15:58:17,598 INFO    SenderThread:7063 [sender.py:send_request_defer():622] handle sender defer: 5
2023-05-25 15:58:17,599 INFO    SenderThread:7063 [sender.py:transition_state():626] send defer: 6
2023-05-25 15:58:17,599 DEBUG   HandlerThread:7063 [handler.py:handle_request():144] handle_request: defer
2023-05-25 15:58:17,599 INFO    HandlerThread:7063 [handler.py:handle_request_defer():170] handle defer: 6
2023-05-25 15:58:17,599 DEBUG   SenderThread:7063 [sender.py:send_request():402] send_request: defer
2023-05-25 15:58:17,599 INFO    SenderThread:7063 [sender.py:send_request_defer():622] handle sender defer: 6
2023-05-25 15:58:17,634 DEBUG   HandlerThread:7063 [handler.py:handle_request():144] handle_request: status_report
2023-05-25 15:58:17,640 INFO    SenderThread:7063 [sender.py:transition_state():626] send defer: 7
2023-05-25 15:58:17,640 DEBUG   HandlerThread:7063 [handler.py:handle_request():144] handle_request: defer
2023-05-25 15:58:17,640 INFO    HandlerThread:7063 [handler.py:handle_request_defer():170] handle defer: 7
2023-05-25 15:58:17,641 DEBUG   SenderThread:7063 [sender.py:send_request():402] send_request: defer
2023-05-25 15:58:17,641 INFO    SenderThread:7063 [sender.py:send_request_defer():622] handle sender defer: 7
2023-05-25 15:58:17,687 INFO    SenderThread:7063 [sender.py:transition_state():626] send defer: 7
2023-05-25 15:58:17,687 DEBUG   HandlerThread:7063 [handler.py:handle_request():144] handle_request: defer
2023-05-25 15:58:17,687 INFO    HandlerThread:7063 [handler.py:handle_request_defer():170] handle defer: 7
2023-05-25 15:58:17,687 DEBUG   SenderThread:7063 [sender.py:send_request():402] send_request: defer
2023-05-25 15:58:17,687 INFO    SenderThread:7063 [sender.py:send_request_defer():622] handle sender defer: 7
2023-05-25 15:58:17,730 INFO    SenderThread:7063 [sender.py:transition_state():626] send defer: 7
2023-05-25 15:58:17,731 DEBUG   HandlerThread:7063 [handler.py:handle_request():144] handle_request: defer
2023-05-25 15:58:17,732 INFO    HandlerThread:7063 [handler.py:handle_request_defer():170] handle defer: 7
2023-05-25 15:58:17,733 DEBUG   SenderThread:7063 [sender.py:send_request():402] send_request: defer
2023-05-25 15:58:17,733 INFO    SenderThread:7063 [sender.py:send_request_defer():622] handle sender defer: 7
2023-05-25 15:58:17,784 INFO    SenderThread:7063 [sender.py:transition_state():626] send defer: 7
2023-05-25 15:58:17,785 DEBUG   HandlerThread:7063 [handler.py:handle_request():144] handle_request: defer
2023-05-25 15:58:17,785 INFO    HandlerThread:7063 [handler.py:handle_request_defer():170] handle defer: 7
2023-05-25 15:58:17,786 DEBUG   SenderThread:7063 [sender.py:send_request():402] send_request: defer
2023-05-25 15:58:17,787 INFO    SenderThread:7063 [sender.py:send_request_defer():622] handle sender defer: 7
2023-05-25 15:58:17,790 INFO    wandb-upload_0:7063 [upload_job.py:push():137] Uploaded file /tmp/tmpr077ydtwwandb/4oga6rrs-wandb-metadata.json
2023-05-25 15:58:17,809 INFO    SenderThread:7063 [sender.py:transition_state():626] send defer: 7
2023-05-25 15:58:17,810 DEBUG   HandlerThread:7063 [handler.py:handle_request():144] handle_request: defer
2023-05-25 15:58:17,810 INFO    HandlerThread:7063 [handler.py:handle_request_defer():170] handle defer: 7
2023-05-25 15:58:17,811 DEBUG   SenderThread:7063 [sender.py:send_request():402] send_request: defer
2023-05-25 15:58:17,812 INFO    SenderThread:7063 [sender.py:send_request_defer():622] handle sender defer: 7
2023-05-25 15:58:17,815 INFO    wandb-upload_0:7063 [upload_job.py:push():137] Uploaded file /tmp/tmpda3b19yowandb/322tsfor-wandb-metadata.json
2023-05-25 15:58:17,876 INFO    wandb-upload_0:7063 [upload_job.py:push():137] Uploaded file /tmp/tmpg1wvir0zwandb/ubqj9p6s-wandb-metadata.json
2023-05-25 15:58:17,905 INFO    wandb-upload_0:7063 [upload_job.py:push():137] Uploaded file /tmp/tmpyt1xu0qvwandb/pqk38ypm-wandb-metadata.json
2023-05-25 15:58:18,147 INFO    Thread-52 :7063 [dir_watcher.py:_on_file_modified():295] file/dir modified: /home/yang/MasterThesis_ws/src/dongxu-master-thesis/reinforcement_learning/RecurrentPPO/sb3/wandb/run-20230525_155816-ts1wfzpk/files/config.yaml
2023-05-25 15:58:18,149 INFO    Thread-52 :7063 [dir_watcher.py:_on_file_created():278] file/dir created: /home/yang/MasterThesis_ws/src/dongxu-master-thesis/reinforcement_learning/RecurrentPPO/sb3/wandb/run-20230525_155816-ts1wfzpk/files/wandb-summary.json
2023-05-25 15:58:18,149 INFO    Thread-52 :7063 [dir_watcher.py:_on_file_created():278] file/dir created: /home/yang/MasterThesis_ws/src/dongxu-master-thesis/reinforcement_learning/RecurrentPPO/sb3/wandb/run-20230525_155816-ts1wfzpk/files/wandb-metadata.json
2023-05-25 15:58:18,151 INFO    Thread-52 :7063 [dir_watcher.py:_on_file_created():278] file/dir created: /home/yang/MasterThesis_ws/src/dongxu-master-thesis/reinforcement_learning/RecurrentPPO/sb3/wandb/run-20230525_155816-ts1wfzpk/files/output.log
2023-05-25 15:58:18,155 INFO    Thread-56 :7063 [dir_watcher.py:_on_file_modified():295] file/dir modified: /home/yang/MasterThesis_ws/src/dongxu-master-thesis/reinforcement_learning/RecurrentPPO/sb3/wandb/run-20230525_155816-dwcigh60/files/config.yaml
2023-05-25 15:58:18,160 INFO    Thread-50 :7063 [dir_watcher.py:_on_file_modified():295] file/dir modified: /home/yang/MasterThesis_ws/src/dongxu-master-thesis/reinforcement_learning/RecurrentPPO/sb3/wandb/run-20230525_155816-iv69ycmx/files/config.yaml
2023-05-25 15:58:18,161 INFO    Thread-52 :7063 [dir_watcher.py:_on_file_created():278] file/dir created: /home/yang/MasterThesis_ws/src/dongxu-master-thesis/reinforcement_learning/RecurrentPPO/sb3/wandb/run-20230525_155816-ts1wfzpk/files/requirements.txt
2023-05-25 15:58:18,164 INFO    Thread-50 :7063 [dir_watcher.py:_on_file_created():278] file/dir created: /home/yang/MasterThesis_ws/src/dongxu-master-thesis/reinforcement_learning/RecurrentPPO/sb3/wandb/run-20230525_155816-iv69ycmx/files/requirements.txt
2023-05-25 15:58:18,166 INFO    Thread-50 :7063 [dir_watcher.py:_on_file_created():278] file/dir created: /home/yang/MasterThesis_ws/src/dongxu-master-thesis/reinforcement_learning/RecurrentPPO/sb3/wandb/run-20230525_155816-iv69ycmx/files/wandb-metadata.json
2023-05-25 15:58:18,167 INFO    Thread-56 :7063 [dir_watcher.py:_on_file_created():278] file/dir created: /home/yang/MasterThesis_ws/src/dongxu-master-thesis/reinforcement_learning/RecurrentPPO/sb3/wandb/run-20230525_155816-dwcigh60/files/wandb-summary.json
2023-05-25 15:58:18,172 INFO    Thread-61 :7063 [dir_watcher.py:_on_file_modified():295] file/dir modified: /home/yang/MasterThesis_ws/src/dongxu-master-thesis/reinforcement_learning/RecurrentPPO/sb3/wandb/run-20230525_155816-y1i9oypj/files/config.yaml
2023-05-25 15:58:18,173 INFO    Thread-50 :7063 [dir_watcher.py:_on_file_created():278] file/dir created: /home/yang/MasterThesis_ws/src/dongxu-master-thesis/reinforcement_learning/RecurrentPPO/sb3/wandb/run-20230525_155816-iv69ycmx/files/wandb-summary.json
2023-05-25 15:58:18,174 INFO    Thread-56 :7063 [dir_watcher.py:_on_file_created():278] file/dir created: /home/yang/MasterThesis_ws/src/dongxu-master-thesis/reinforcement_learning/RecurrentPPO/sb3/wandb/run-20230525_155816-dwcigh60/files/requirements.txt
2023-05-25 15:58:18,175 INFO    Thread-61 :7063 [dir_watcher.py:_on_file_created():278] file/dir created: /home/yang/MasterThesis_ws/src/dongxu-master-thesis/reinforcement_learning/RecurrentPPO/sb3/wandb/run-20230525_155816-y1i9oypj/files/wandb-metadata.json
2023-05-25 15:58:18,176 INFO    Thread-50 :7063 [dir_watcher.py:_on_file_created():278] file/dir created: /home/yang/MasterThesis_ws/src/dongxu-master-thesis/reinforcement_learning/RecurrentPPO/sb3/wandb/run-20230525_155816-iv69ycmx/files/output.log
2023-05-25 15:58:18,177 INFO    Thread-56 :7063 [dir_watcher.py:_on_file_created():278] file/dir created: /home/yang/MasterThesis_ws/src/dongxu-master-thesis/reinforcement_learning/RecurrentPPO/sb3/wandb/run-20230525_155816-dwcigh60/files/wandb-metadata.json
2023-05-25 15:58:18,180 INFO    Thread-61 :7063 [dir_watcher.py:_on_file_created():278] file/dir created: /home/yang/MasterThesis_ws/src/dongxu-master-thesis/reinforcement_learning/RecurrentPPO/sb3/wandb/run-20230525_155816-y1i9oypj/files/wandb-summary.json
2023-05-25 15:58:18,181 INFO    Thread-56 :7063 [dir_watcher.py:_on_file_created():278] file/dir created: /home/yang/MasterThesis_ws/src/dongxu-master-thesis/reinforcement_learning/RecurrentPPO/sb3/wandb/run-20230525_155816-dwcigh60/files/output.log
2023-05-25 15:58:18,182 INFO    Thread-61 :7063 [dir_watcher.py:_on_file_created():278] file/dir created: /home/yang/MasterThesis_ws/src/dongxu-master-thesis/reinforcement_learning/RecurrentPPO/sb3/wandb/run-20230525_155816-y1i9oypj/files/requirements.txt
2023-05-25 15:58:18,184 INFO    Thread-61 :7063 [dir_watcher.py:_on_file_created():278] file/dir created: /home/yang/MasterThesis_ws/src/dongxu-master-thesis/reinforcement_learning/RecurrentPPO/sb3/wandb/run-20230525_155816-y1i9oypj/files/output.log
2023-05-25 15:58:18,322 INFO    Thread-12 :7063 [dir_watcher.py:_on_file_modified():295] file/dir modified: /home/yang/MasterThesis_ws/src/dongxu-master-thesis/reinforcement_learning/RecurrentPPO/sb3/wandb/run-20230525_155812-8zyr7d4m/files/config.yaml
2023-05-25 15:58:18,323 INFO    Thread-12 :7063 [dir_watcher.py:_on_file_modified():295] file/dir modified: /home/yang/MasterThesis_ws/src/dongxu-master-thesis/reinforcement_learning/RecurrentPPO/sb3/wandb/run-20230525_155812-8zyr7d4m/files/wandb-summary.json
2023-05-25 15:58:18,323 INFO    Thread-12 :7063 [dir_watcher.py:_on_file_created():278] file/dir created: /home/yang/MasterThesis_ws/src/dongxu-master-thesis/reinforcement_learning/RecurrentPPO/sb3/wandb/run-20230525_155812-8zyr7d4m/files/output.log
2023-05-25 15:58:18,419 DEBUG   HandlerThread:7063 [handler.py:handle_request():144] handle_request: poll_exit
2023-05-25 15:58:18,421 DEBUG   HandlerThread:7063 [handler.py:handle_request():144] handle_request: poll_exit
2023-05-25 15:58:18,423 DEBUG   HandlerThread:7063 [handler.py:handle_request():144] handle_request: poll_exit
2023-05-25 15:58:18,425 DEBUG   HandlerThread:7063 [handler.py:handle_request():144] handle_request: poll_exit
2023-05-25 15:58:18,426 DEBUG   HandlerThread:7063 [handler.py:handle_request():144] handle_request: poll_exit
2023-05-25 15:58:19,425 INFO    SenderThread:7063 [sender.py:transition_state():626] send defer: 8
2023-05-25 15:58:19,429 DEBUG   SenderThread:7063 [sender.py:send_request():402] send_request: poll_exit
2023-05-25 15:58:19,430 DEBUG   HandlerThread:7063 [handler.py:handle_request():144] handle_request: defer
2023-05-25 15:58:19,432 INFO    HandlerThread:7063 [handler.py:handle_request_defer():170] handle defer: 8
2023-05-25 15:58:19,434 DEBUG   SenderThread:7063 [sender.py:send_request():402] send_request: defer
2023-05-25 15:58:19,434 INFO    SenderThread:7063 [sender.py:send_request_defer():622] handle sender defer: 8
2023-05-25 15:58:19,457 INFO    SenderThread:7063 [sender.py:transition_state():626] send defer: 9
2023-05-25 15:58:19,459 DEBUG   SenderThread:7063 [sender.py:send():375] send: artifact
2023-05-25 15:58:19,459 DEBUG   HandlerThread:7063 [handler.py:handle_request():144] handle_request: defer
2023-05-25 15:58:19,468 INFO    HandlerThread:7063 [handler.py:handle_request_defer():170] handle defer: 9
2023-05-25 15:58:19,500 INFO    SenderThread:7063 [sender.py:transition_state():626] send defer: 8
2023-05-25 15:58:19,501 DEBUG   SenderThread:7063 [sender.py:send_request():402] send_request: poll_exit
2023-05-25 15:58:19,501 DEBUG   HandlerThread:7063 [handler.py:handle_request():144] handle_request: defer
2023-05-25 15:58:19,503 INFO    HandlerThread:7063 [handler.py:handle_request_defer():170] handle defer: 8
2023-05-25 15:58:19,504 DEBUG   SenderThread:7063 [sender.py:send_request():402] send_request: defer
2023-05-25 15:58:19,505 INFO    SenderThread:7063 [sender.py:send_request_defer():622] handle sender defer: 8
2023-05-25 15:58:19,506 INFO    SenderThread:7063 [sender.py:transition_state():626] send defer: 9
2023-05-25 15:58:19,507 DEBUG   HandlerThread:7063 [handler.py:handle_request():144] handle_request: defer
2023-05-25 15:58:19,508 INFO    HandlerThread:7063 [handler.py:handle_request_defer():170] handle defer: 9
2023-05-25 15:58:19,509 DEBUG   SenderThread:7063 [sender.py:send_request():402] send_request: defer
2023-05-25 15:58:19,510 INFO    SenderThread:7063 [sender.py:send_request_defer():622] handle sender defer: 9
2023-05-25 15:58:19,511 INFO    SenderThread:7063 [dir_watcher.py:finish():365] shutting down directory watcher
2023-05-25 15:58:19,540 INFO    SenderThread:7063 [sender.py:transition_state():626] send defer: 8
2023-05-25 15:58:19,541 DEBUG   SenderThread:7063 [sender.py:send_request():402] send_request: poll_exit
2023-05-25 15:58:19,541 DEBUG   HandlerThread:7063 [handler.py:handle_request():144] handle_request: defer
2023-05-25 15:58:19,542 INFO    HandlerThread:7063 [handler.py:handle_request_defer():170] handle defer: 8
2023-05-25 15:58:19,543 DEBUG   SenderThread:7063 [sender.py:send_request():402] send_request: defer
2023-05-25 15:58:19,544 INFO    SenderThread:7063 [sender.py:send_request_defer():622] handle sender defer: 8
2023-05-25 15:58:19,544 INFO    SenderThread:7063 [sender.py:transition_state():626] send defer: 9
2023-05-25 15:58:19,545 DEBUG   HandlerThread:7063 [handler.py:handle_request():144] handle_request: defer
2023-05-25 15:58:19,545 INFO    HandlerThread:7063 [handler.py:handle_request_defer():170] handle defer: 9
2023-05-25 15:58:19,546 DEBUG   SenderThread:7063 [sender.py:send_request():402] send_request: defer
2023-05-25 15:58:19,547 INFO    SenderThread:7063 [sender.py:send_request_defer():622] handle sender defer: 9
2023-05-25 15:58:19,547 INFO    SenderThread:7063 [dir_watcher.py:finish():365] shutting down directory watcher
2023-05-25 15:58:19,569 INFO    SenderThread:7063 [sender.py:transition_state():626] send defer: 8
2023-05-25 15:58:19,570 DEBUG   SenderThread:7063 [sender.py:send_request():402] send_request: poll_exit
2023-05-25 15:58:19,572 DEBUG   HandlerThread:7063 [handler.py:handle_request():144] handle_request: defer
2023-05-25 15:58:19,573 INFO    HandlerThread:7063 [handler.py:handle_request_defer():170] handle defer: 8
2023-05-25 15:58:19,574 DEBUG   SenderThread:7063 [sender.py:send_request():402] send_request: defer
2023-05-25 15:58:19,575 INFO    SenderThread:7063 [sender.py:send_request_defer():622] handle sender defer: 8
2023-05-25 15:58:19,577 INFO    SenderThread:7063 [sender.py:transition_state():626] send defer: 9
2023-05-25 15:58:19,578 DEBUG   HandlerThread:7063 [handler.py:handle_request():144] handle_request: defer
2023-05-25 15:58:19,578 INFO    HandlerThread:7063 [handler.py:handle_request_defer():170] handle defer: 9
2023-05-25 15:58:19,578 DEBUG   SenderThread:7063 [sender.py:send_request():402] send_request: defer
2023-05-25 15:58:19,579 INFO    SenderThread:7063 [sender.py:send_request_defer():622] handle sender defer: 9
2023-05-25 15:58:19,579 INFO    SenderThread:7063 [dir_watcher.py:finish():365] shutting down directory watcher
2023-05-25 15:58:19,596 INFO    SenderThread:7063 [sender.py:transition_state():626] send defer: 8
2023-05-25 15:58:19,596 DEBUG   SenderThread:7063 [sender.py:send_request():402] send_request: poll_exit
2023-05-25 15:58:19,598 DEBUG   HandlerThread:7063 [handler.py:handle_request():144] handle_request: defer
2023-05-25 15:58:19,599 INFO    HandlerThread:7063 [handler.py:handle_request_defer():170] handle defer: 8
2023-05-25 15:58:19,601 DEBUG   SenderThread:7063 [sender.py:send_request():402] send_request: defer
2023-05-25 15:58:19,602 INFO    SenderThread:7063 [sender.py:send_request_defer():622] handle sender defer: 8
2023-05-25 15:58:19,602 INFO    SenderThread:7063 [sender.py:transition_state():626] send defer: 9
2023-05-25 15:58:19,603 DEBUG   HandlerThread:7063 [handler.py:handle_request():144] handle_request: defer
2023-05-25 15:58:19,603 INFO    HandlerThread:7063 [handler.py:handle_request_defer():170] handle defer: 9
2023-05-25 15:58:19,603 DEBUG   SenderThread:7063 [sender.py:send_request():402] send_request: defer
2023-05-25 15:58:19,604 INFO    SenderThread:7063 [sender.py:send_request_defer():622] handle sender defer: 9
2023-05-25 15:58:19,604 INFO    SenderThread:7063 [dir_watcher.py:finish():365] shutting down directory watcher
2023-05-25 15:58:20,146 INFO    Thread-52 :7063 [dir_watcher.py:_on_file_modified():295] file/dir modified: /home/yang/MasterThesis_ws/src/dongxu-master-thesis/reinforcement_learning/RecurrentPPO/sb3/wandb/run-20230525_155816-ts1wfzpk/files/output.log
2023-05-25 15:58:20,148 INFO    SenderThread:7063 [dir_watcher.py:finish():395] scan: /home/yang/MasterThesis_ws/src/dongxu-master-thesis/reinforcement_learning/RecurrentPPO/sb3/wandb/run-20230525_155816-ts1wfzpk/files
2023-05-25 15:58:20,149 INFO    SenderThread:7063 [dir_watcher.py:finish():409] scan save: /home/yang/MasterThesis_ws/src/dongxu-master-thesis/reinforcement_learning/RecurrentPPO/sb3/wandb/run-20230525_155816-ts1wfzpk/files/output.log output.log
2023-05-25 15:58:20,149 INFO    SenderThread:7063 [dir_watcher.py:finish():409] scan save: /home/yang/MasterThesis_ws/src/dongxu-master-thesis/reinforcement_learning/RecurrentPPO/sb3/wandb/run-20230525_155816-ts1wfzpk/files/config.yaml config.yaml
2023-05-25 15:58:20,162 INFO    Thread-56 :7063 [dir_watcher.py:_on_file_modified():295] file/dir modified: /home/yang/MasterThesis_ws/src/dongxu-master-thesis/reinforcement_learning/RecurrentPPO/sb3/wandb/run-20230525_155816-dwcigh60/files/output.log
2023-05-25 15:58:20,162 INFO    SenderThread:7063 [dir_watcher.py:finish():409] scan save: /home/yang/MasterThesis_ws/src/dongxu-master-thesis/reinforcement_learning/RecurrentPPO/sb3/wandb/run-20230525_155816-ts1wfzpk/files/requirements.txt requirements.txt
2023-05-25 15:58:20,165 INFO    Thread-50 :7063 [dir_watcher.py:_on_file_modified():295] file/dir modified: /home/yang/MasterThesis_ws/src/dongxu-master-thesis/reinforcement_learning/RecurrentPPO/sb3/wandb/run-20230525_155816-iv69ycmx/files/output.log
2023-05-25 15:58:20,193 INFO    SenderThread:7063 [dir_watcher.py:finish():409] scan save: /home/yang/MasterThesis_ws/src/dongxu-master-thesis/reinforcement_learning/RecurrentPPO/sb3/wandb/run-20230525_155816-ts1wfzpk/files/wandb-summary.json wandb-summary.json
2023-05-25 15:58:20,195 INFO    SenderThread:7063 [dir_watcher.py:finish():395] scan: /home/yang/MasterThesis_ws/src/dongxu-master-thesis/reinforcement_learning/RecurrentPPO/sb3/wandb/run-20230525_155816-iv69ycmx/files
2023-05-25 15:58:20,204 INFO    SenderThread:7063 [dir_watcher.py:finish():409] scan save: /home/yang/MasterThesis_ws/src/dongxu-master-thesis/reinforcement_learning/RecurrentPPO/sb3/wandb/run-20230525_155816-ts1wfzpk/files/wandb-metadata.json wandb-metadata.json
2023-05-25 15:58:20,205 INFO    SenderThread:7063 [sender.py:transition_state():626] send defer: 10
2023-05-25 15:58:20,206 INFO    SenderThread:7063 [dir_watcher.py:finish():409] scan save: /home/yang/MasterThesis_ws/src/dongxu-master-thesis/reinforcement_learning/RecurrentPPO/sb3/wandb/run-20230525_155816-iv69ycmx/files/output.log output.log
2023-05-25 15:58:20,206 DEBUG   HandlerThread:7063 [handler.py:handle_request():144] handle_request: defer
2023-05-25 15:58:20,208 INFO    SenderThread:7063 [dir_watcher.py:finish():409] scan save: /home/yang/MasterThesis_ws/src/dongxu-master-thesis/reinforcement_learning/RecurrentPPO/sb3/wandb/run-20230525_155816-iv69ycmx/files/config.yaml config.yaml
2023-05-25 15:58:20,211 INFO    HandlerThread:7063 [handler.py:handle_request_defer():170] handle defer: 10
2023-05-25 15:58:20,211 INFO    SenderThread:7063 [dir_watcher.py:finish():395] scan: /home/yang/MasterThesis_ws/src/dongxu-master-thesis/reinforcement_learning/RecurrentPPO/sb3/wandb/run-20230525_155816-dwcigh60/files
2023-05-25 15:58:20,212 INFO    SenderThread:7063 [dir_watcher.py:finish():409] scan save: /home/yang/MasterThesis_ws/src/dongxu-master-thesis/reinforcement_learning/RecurrentPPO/sb3/wandb/run-20230525_155816-iv69ycmx/files/requirements.txt requirements.txt
2023-05-25 15:58:20,221 INFO    SenderThread:7063 [dir_watcher.py:_on_file_modified():295] file/dir modified: /home/yang/MasterThesis_ws/src/dongxu-master-thesis/reinforcement_learning/RecurrentPPO/sb3/wandb/run-20230525_155816-y1i9oypj/files/output.log
2023-05-25 15:58:20,222 DEBUG   SenderThread:7063 [sender.py:send_request():402] send_request: defer
2023-05-25 15:58:20,223 INFO    SenderThread:7063 [dir_watcher.py:finish():409] scan save: /home/yang/MasterThesis_ws/src/dongxu-master-thesis/reinforcement_learning/RecurrentPPO/sb3/wandb/run-20230525_155816-dwcigh60/files/output.log output.log
2023-05-25 15:58:20,223 INFO    SenderThread:7063 [dir_watcher.py:finish():409] scan save: /home/yang/MasterThesis_ws/src/dongxu-master-thesis/reinforcement_learning/RecurrentPPO/sb3/wandb/run-20230525_155816-iv69ycmx/files/wandb-summary.json wandb-summary.json
2023-05-25 15:58:20,223 INFO    SenderThread:7063 [dir_watcher.py:finish():395] scan: /home/yang/MasterThesis_ws/src/dongxu-master-thesis/reinforcement_learning/RecurrentPPO/sb3/wandb/run-20230525_155816-y1i9oypj/files
2023-05-25 15:58:20,223 INFO    SenderThread:7063 [sender.py:send_request_defer():622] handle sender defer: 10
2023-05-25 15:58:20,226 INFO    SenderThread:7063 [dir_watcher.py:finish():409] scan save: /home/yang/MasterThesis_ws/src/dongxu-master-thesis/reinforcement_learning/RecurrentPPO/sb3/wandb/run-20230525_155816-dwcigh60/files/config.yaml config.yaml
2023-05-25 15:58:20,226 INFO    SenderThread:7063 [dir_watcher.py:finish():409] scan save: /home/yang/MasterThesis_ws/src/dongxu-master-thesis/reinforcement_learning/RecurrentPPO/sb3/wandb/run-20230525_155816-iv69ycmx/files/wandb-metadata.json wandb-metadata.json
2023-05-25 15:58:20,232 INFO    SenderThread:7063 [file_pusher.py:finish():168] shutting down file pusher
2023-05-25 15:58:20,232 INFO    SenderThread:7063 [dir_watcher.py:finish():409] scan save: /home/yang/MasterThesis_ws/src/dongxu-master-thesis/reinforcement_learning/RecurrentPPO/sb3/wandb/run-20230525_155816-y1i9oypj/files/output.log output.log
2023-05-25 15:58:20,233 INFO    SenderThread:7063 [sender.py:transition_state():626] send defer: 10
2023-05-25 15:58:20,234 INFO    SenderThread:7063 [dir_watcher.py:finish():409] scan save: /home/yang/MasterThesis_ws/src/dongxu-master-thesis/reinforcement_learning/RecurrentPPO/sb3/wandb/run-20230525_155816-dwcigh60/files/requirements.txt requirements.txt
2023-05-25 15:58:20,239 INFO    SenderThread:7063 [dir_watcher.py:finish():409] scan save: /home/yang/MasterThesis_ws/src/dongxu-master-thesis/reinforcement_learning/RecurrentPPO/sb3/wandb/run-20230525_155816-y1i9oypj/files/config.yaml config.yaml
2023-05-25 15:58:20,240 INFO    SenderThread:7063 [dir_watcher.py:finish():409] scan save: /home/yang/MasterThesis_ws/src/dongxu-master-thesis/reinforcement_learning/RecurrentPPO/sb3/wandb/run-20230525_155816-dwcigh60/files/wandb-summary.json wandb-summary.json
2023-05-25 15:58:20,240 DEBUG   HandlerThread:7063 [handler.py:handle_request():144] handle_request: defer
2023-05-25 15:58:20,246 INFO    SenderThread:7063 [dir_watcher.py:finish():409] scan save: /home/yang/MasterThesis_ws/src/dongxu-master-thesis/reinforcement_learning/RecurrentPPO/sb3/wandb/run-20230525_155816-y1i9oypj/files/requirements.txt requirements.txt
2023-05-25 15:58:20,247 INFO    HandlerThread:7063 [handler.py:handle_request_defer():170] handle defer: 10
2023-05-25 15:58:20,251 INFO    SenderThread:7063 [dir_watcher.py:finish():409] scan save: /home/yang/MasterThesis_ws/src/dongxu-master-thesis/reinforcement_learning/RecurrentPPO/sb3/wandb/run-20230525_155816-dwcigh60/files/wandb-metadata.json wandb-metadata.json
2023-05-25 15:58:20,252 INFO    SenderThread:7063 [dir_watcher.py:finish():409] scan save: /home/yang/MasterThesis_ws/src/dongxu-master-thesis/reinforcement_learning/RecurrentPPO/sb3/wandb/run-20230525_155816-y1i9oypj/files/wandb-summary.json wandb-summary.json
2023-05-25 15:58:20,259 DEBUG   SenderThread:7063 [sender.py:send_request():402] send_request: defer
2023-05-25 15:58:20,259 INFO    SenderThread:7063 [sender.py:transition_state():626] send defer: 10
2023-05-25 15:58:20,260 INFO    SenderThread:7063 [dir_watcher.py:finish():409] scan save: /home/yang/MasterThesis_ws/src/dongxu-master-thesis/reinforcement_learning/RecurrentPPO/sb3/wandb/run-20230525_155816-y1i9oypj/files/wandb-metadata.json wandb-metadata.json
2023-05-25 15:58:20,260 INFO    SenderThread:7063 [sender.py:send_request_defer():622] handle sender defer: 10
2023-05-25 15:58:20,264 DEBUG   HandlerThread:7063 [handler.py:handle_request():144] handle_request: defer
2023-05-25 15:58:20,264 INFO    SenderThread:7063 [sender.py:transition_state():626] send defer: 10
2023-05-25 15:58:20,265 INFO    SenderThread:7063 [file_pusher.py:finish():168] shutting down file pusher
2023-05-25 15:58:20,266 INFO    HandlerThread:7063 [handler.py:handle_request_defer():170] handle defer: 10
2023-05-25 15:58:20,267 DEBUG   HandlerThread:7063 [handler.py:handle_request():144] handle_request: defer
2023-05-25 15:58:20,269 DEBUG   SenderThread:7063 [sender.py:send_request():402] send_request: defer
2023-05-25 15:58:20,269 INFO    HandlerThread:7063 [handler.py:handle_request_defer():170] handle defer: 10
2023-05-25 15:58:20,269 INFO    SenderThread:7063 [sender.py:send_request_defer():622] handle sender defer: 10
2023-05-25 15:58:20,270 INFO    SenderThread:7063 [file_pusher.py:finish():168] shutting down file pusher
2023-05-25 15:58:20,271 DEBUG   SenderThread:7063 [sender.py:send_request():402] send_request: defer
2023-05-25 15:58:20,272 INFO    SenderThread:7063 [sender.py:send_request_defer():622] handle sender defer: 10
2023-05-25 15:58:20,272 INFO    SenderThread:7063 [file_pusher.py:finish():168] shutting down file pusher
2023-05-25 15:58:20,324 INFO    Thread-12 :7063 [dir_watcher.py:_on_file_modified():295] file/dir modified: /home/yang/MasterThesis_ws/src/dongxu-master-thesis/reinforcement_learning/RecurrentPPO/sb3/wandb/run-20230525_155812-8zyr7d4m/files/output.log
2023-05-25 15:58:20,373 INFO    SenderThread:7063 [sender.py:send_artifact():1474] sent artifact job-https___git.scc.kit.edu_balintvarga_dongxu-master-thesis.git_reinforcement_learning_RecurrentPPO_sb3_train.py - {'id': 'QXJ0aWZhY3Q6NDY1MjI0MjQ2', 'digest': '42e464009753193fb2b0fb8c7371b08c', 'state': 'COMMITTED', 'aliases': [{'artifactCollectionName': 'job-https___git.scc.kit.edu_balintvarga_dongxu-master-thesis.git_reinforcement_learning_RecurrentPPO_sb3_train.py', 'alias': 'latest'}, {'artifactCollectionName': 'job-https___git.scc.kit.edu_balintvarga_dongxu-master-thesis.git_reinforcement_learning_RecurrentPPO_sb3_train.py', 'alias': 'v0'}], 'artifactSequence': {'id': 'QXJ0aWZhY3RDb2xsZWN0aW9uOjcxNzU0MzMw', 'latestArtifact': {'id': 'QXJ0aWZhY3Q6NDY1MjI0MjQ2', 'versionIndex': 0}}, 'version': 'v0'}
2023-05-25 15:58:20,373 DEBUG   SenderThread:7063 [sender.py:send_request():402] send_request: defer
2023-05-25 15:58:20,373 INFO    SenderThread:7063 [sender.py:send_request_defer():622] handle sender defer: 9
2023-05-25 15:58:20,373 INFO    SenderThread:7063 [dir_watcher.py:finish():365] shutting down directory watcher
2023-05-25 15:58:20,600 INFO    wandb-upload_0:7063 [upload_job.py:push():137] Uploaded file /home/yang/MasterThesis_ws/src/dongxu-master-thesis/reinforcement_learning/RecurrentPPO/sb3/wandb/run-20230525_155816-ts1wfzpk/files/output.log
2023-05-25 15:58:20,631 INFO    wandb-upload_0:7063 [upload_job.py:push():137] Uploaded file /home/yang/MasterThesis_ws/src/dongxu-master-thesis/reinforcement_learning/RecurrentPPO/sb3/wandb/run-20230525_155816-iv69ycmx/files/output.log
2023-05-25 15:58:20,655 INFO    wandb-upload_1:7063 [upload_job.py:push():137] Uploaded file /home/yang/MasterThesis_ws/src/dongxu-master-thesis/reinforcement_learning/RecurrentPPO/sb3/wandb/run-20230525_155816-dwcigh60/files/config.yaml
2023-05-25 15:58:20,674 INFO    wandb-upload_1:7063 [upload_job.py:push():137] Uploaded file /home/yang/MasterThesis_ws/src/dongxu-master-thesis/reinforcement_learning/RecurrentPPO/sb3/wandb/run-20230525_155816-iv69ycmx/files/config.yaml
2023-05-25 15:58:20,689 INFO    wandb-upload_0:7063 [upload_job.py:push():137] Uploaded file /home/yang/MasterThesis_ws/src/dongxu-master-thesis/reinforcement_learning/RecurrentPPO/sb3/wandb/run-20230525_155816-y1i9oypj/files/output.log
2023-05-25 15:58:20,692 INFO    wandb-upload_0:7063 [upload_job.py:push():137] Uploaded file /home/yang/MasterThesis_ws/src/dongxu-master-thesis/reinforcement_learning/RecurrentPPO/sb3/wandb/run-20230525_155816-dwcigh60/files/output.log
2023-05-25 15:58:20,695 INFO    wandb-upload_2:7063 [upload_job.py:push():137] Uploaded file /home/yang/MasterThesis_ws/src/dongxu-master-thesis/reinforcement_learning/RecurrentPPO/sb3/wandb/run-20230525_155816-ts1wfzpk/files/requirements.txt
2023-05-25 15:58:20,697 INFO    wandb-upload_3:7063 [upload_job.py:push():137] Uploaded file /home/yang/MasterThesis_ws/src/dongxu-master-thesis/reinforcement_learning/RecurrentPPO/sb3/wandb/run-20230525_155816-ts1wfzpk/files/wandb-summary.json
2023-05-25 15:58:20,706 INFO    wandb-upload_1:7063 [upload_job.py:push():137] Uploaded file /home/yang/MasterThesis_ws/src/dongxu-master-thesis/reinforcement_learning/RecurrentPPO/sb3/wandb/run-20230525_155816-ts1wfzpk/files/config.yaml
2023-05-25 15:58:20,720 INFO    wandb-upload_1:7063 [upload_job.py:push():137] Uploaded file /home/yang/MasterThesis_ws/src/dongxu-master-thesis/reinforcement_learning/RecurrentPPO/sb3/wandb/run-20230525_155816-y1i9oypj/files/config.yaml
2023-05-25 15:58:20,739 INFO    wandb-upload_2:7063 [upload_job.py:push():137] Uploaded file /home/yang/MasterThesis_ws/src/dongxu-master-thesis/reinforcement_learning/RecurrentPPO/sb3/wandb/run-20230525_155816-iv69ycmx/files/requirements.txt
2023-05-25 15:58:20,754 INFO    wandb-upload_3:7063 [upload_job.py:push():137] Uploaded file /home/yang/MasterThesis_ws/src/dongxu-master-thesis/reinforcement_learning/RecurrentPPO/sb3/wandb/run-20230525_155816-iv69ycmx/files/wandb-summary.json
2023-05-25 15:58:20,782 INFO    wandb-upload_2:7063 [upload_job.py:push():137] Uploaded file /home/yang/MasterThesis_ws/src/dongxu-master-thesis/reinforcement_learning/RecurrentPPO/sb3/wandb/run-20230525_155816-dwcigh60/files/requirements.txt
2023-05-25 15:58:20,799 INFO    wandb-upload_3:7063 [upload_job.py:push():137] Uploaded file /home/yang/MasterThesis_ws/src/dongxu-master-thesis/reinforcement_learning/RecurrentPPO/sb3/wandb/run-20230525_155816-y1i9oypj/files/wandb-summary.json
2023-05-25 15:58:20,808 INFO    wandb-upload_3:7063 [upload_job.py:push():137] Uploaded file /home/yang/MasterThesis_ws/src/dongxu-master-thesis/reinforcement_learning/RecurrentPPO/sb3/wandb/run-20230525_155816-dwcigh60/files/wandb-summary.json
2023-05-25 15:58:20,830 INFO    wandb-upload_2:7063 [upload_job.py:push():137] Uploaded file /home/yang/MasterThesis_ws/src/dongxu-master-thesis/reinforcement_learning/RecurrentPPO/sb3/wandb/run-20230525_155816-y1i9oypj/files/requirements.txt
2023-05-25 15:58:20,907 INFO    Thread-49 :7063 [sender.py:transition_state():626] send defer: 11
2023-05-25 15:58:20,907 DEBUG   HandlerThread:7063 [handler.py:handle_request():144] handle_request: defer
2023-05-25 15:58:20,908 INFO    HandlerThread:7063 [handler.py:handle_request_defer():170] handle defer: 11
2023-05-25 15:58:20,908 DEBUG   SenderThread:7063 [sender.py:send_request():402] send_request: defer
2023-05-25 15:58:20,908 INFO    SenderThread:7063 [sender.py:send_request_defer():622] handle sender defer: 11
2023-05-25 15:58:20,908 INFO    SenderThread:7063 [file_pusher.py:join():173] waiting for file pusher
2023-05-25 15:58:20,908 INFO    SenderThread:7063 [sender.py:transition_state():626] send defer: 12
2023-05-25 15:58:20,909 DEBUG   HandlerThread:7063 [handler.py:handle_request():144] handle_request: defer
2023-05-25 15:58:20,909 INFO    HandlerThread:7063 [handler.py:handle_request_defer():170] handle defer: 12
2023-05-25 15:58:20,909 DEBUG   SenderThread:7063 [sender.py:send_request():402] send_request: defer
2023-05-25 15:58:20,909 INFO    SenderThread:7063 [sender.py:send_request_defer():622] handle sender defer: 12
2023-05-25 15:58:20,955 INFO    Thread-46 :7063 [sender.py:transition_state():626] send defer: 11
2023-05-25 15:58:20,955 DEBUG   HandlerThread:7063 [handler.py:handle_request():144] handle_request: defer
2023-05-25 15:58:20,956 INFO    HandlerThread:7063 [handler.py:handle_request_defer():170] handle defer: 11
2023-05-25 15:58:20,956 DEBUG   SenderThread:7063 [sender.py:send_request():402] send_request: defer
2023-05-25 15:58:20,956 INFO    SenderThread:7063 [sender.py:send_request_defer():622] handle sender defer: 11
2023-05-25 15:58:20,956 INFO    SenderThread:7063 [file_pusher.py:join():173] waiting for file pusher
2023-05-25 15:58:20,956 INFO    SenderThread:7063 [sender.py:transition_state():626] send defer: 12
2023-05-25 15:58:20,957 DEBUG   HandlerThread:7063 [handler.py:handle_request():144] handle_request: defer
2023-05-25 15:58:20,957 INFO    HandlerThread:7063 [handler.py:handle_request_defer():170] handle defer: 12
2023-05-25 15:58:20,957 DEBUG   SenderThread:7063 [sender.py:send_request():402] send_request: defer
2023-05-25 15:58:20,957 INFO    SenderThread:7063 [sender.py:send_request_defer():622] handle sender defer: 12
2023-05-25 15:58:21,009 INFO    Thread-55 :7063 [sender.py:transition_state():626] send defer: 11
2023-05-25 15:58:21,010 DEBUG   HandlerThread:7063 [handler.py:handle_request():144] handle_request: defer
2023-05-25 15:58:21,010 INFO    HandlerThread:7063 [handler.py:handle_request_defer():170] handle defer: 11
2023-05-25 15:58:21,010 DEBUG   SenderThread:7063 [sender.py:send_request():402] send_request: defer
2023-05-25 15:58:21,010 INFO    SenderThread:7063 [sender.py:send_request_defer():622] handle sender defer: 11
2023-05-25 15:58:21,010 INFO    SenderThread:7063 [file_pusher.py:join():173] waiting for file pusher
2023-05-25 15:58:21,010 INFO    SenderThread:7063 [sender.py:transition_state():626] send defer: 12
2023-05-25 15:58:21,011 DEBUG   HandlerThread:7063 [handler.py:handle_request():144] handle_request: defer
2023-05-25 15:58:21,011 INFO    HandlerThread:7063 [handler.py:handle_request_defer():170] handle defer: 12
2023-05-25 15:58:21,011 DEBUG   SenderThread:7063 [sender.py:send_request():402] send_request: defer
2023-05-25 15:58:21,011 INFO    SenderThread:7063 [sender.py:send_request_defer():622] handle sender defer: 12
2023-05-25 15:58:21,032 INFO    Thread-60 :7063 [sender.py:transition_state():626] send defer: 11
2023-05-25 15:58:21,032 DEBUG   HandlerThread:7063 [handler.py:handle_request():144] handle_request: defer
2023-05-25 15:58:21,032 INFO    HandlerThread:7063 [handler.py:handle_request_defer():170] handle defer: 11
2023-05-25 15:58:21,032 DEBUG   SenderThread:7063 [sender.py:send_request():402] send_request: defer
2023-05-25 15:58:21,033 INFO    SenderThread:7063 [sender.py:send_request_defer():622] handle sender defer: 11
2023-05-25 15:58:21,033 INFO    SenderThread:7063 [file_pusher.py:join():173] waiting for file pusher
2023-05-25 15:58:21,033 INFO    SenderThread:7063 [sender.py:transition_state():626] send defer: 12
2023-05-25 15:58:21,033 DEBUG   HandlerThread:7063 [handler.py:handle_request():144] handle_request: defer
2023-05-25 15:58:21,033 INFO    HandlerThread:7063 [handler.py:handle_request_defer():170] handle defer: 12
2023-05-25 15:58:21,033 DEBUG   SenderThread:7063 [sender.py:send_request():402] send_request: defer
2023-05-25 15:58:21,033 INFO    SenderThread:7063 [sender.py:send_request_defer():622] handle sender defer: 12
2023-05-25 15:58:21,084 INFO    SenderThread:7063 [sender.py:transition_state():626] send defer: 13
2023-05-25 15:58:21,084 DEBUG   HandlerThread:7063 [handler.py:handle_request():144] handle_request: defer
2023-05-25 15:58:21,084 INFO    HandlerThread:7063 [handler.py:handle_request_defer():170] handle defer: 13
2023-05-25 15:58:21,085 DEBUG   SenderThread:7063 [sender.py:send_request():402] send_request: defer
2023-05-25 15:58:21,085 INFO    SenderThread:7063 [sender.py:send_request_defer():622] handle sender defer: 13
2023-05-25 15:58:21,085 INFO    SenderThread:7063 [sender.py:transition_state():626] send defer: 14
2023-05-25 15:58:21,085 DEBUG   SenderThread:7063 [sender.py:send():375] send: final
2023-05-25 15:58:21,086 DEBUG   HandlerThread:7063 [handler.py:handle_request():144] handle_request: defer
2023-05-25 15:58:21,086 DEBUG   SenderThread:7063 [sender.py:send():375] send: footer
2023-05-25 15:58:21,086 INFO    HandlerThread:7063 [handler.py:handle_request_defer():170] handle defer: 14
2023-05-25 15:58:21,087 DEBUG   SenderThread:7063 [sender.py:send_request():402] send_request: defer
2023-05-25 15:58:21,087 INFO    SenderThread:7063 [sender.py:send_request_defer():622] handle sender defer: 14
2023-05-25 15:58:21,126 INFO    SenderThread:7063 [sender.py:transition_state():626] send defer: 13
2023-05-25 15:58:21,127 DEBUG   HandlerThread:7063 [handler.py:handle_request():144] handle_request: defer
2023-05-25 15:58:21,128 INFO    HandlerThread:7063 [handler.py:handle_request_defer():170] handle defer: 13
2023-05-25 15:58:21,129 DEBUG   SenderThread:7063 [sender.py:send_request():402] send_request: defer
2023-05-25 15:58:21,130 INFO    SenderThread:7063 [sender.py:send_request_defer():622] handle sender defer: 13
2023-05-25 15:58:21,130 INFO    SenderThread:7063 [sender.py:transition_state():626] send defer: 14
2023-05-25 15:58:21,131 DEBUG   HandlerThread:7063 [handler.py:handle_request():144] handle_request: defer
2023-05-25 15:58:21,133 INFO    HandlerThread:7063 [handler.py:handle_request_defer():170] handle defer: 14
2023-05-25 15:58:21,133 DEBUG   SenderThread:7063 [sender.py:send():375] send: final
2023-05-25 15:58:21,135 DEBUG   SenderThread:7063 [sender.py:send():375] send: footer
2023-05-25 15:58:21,137 DEBUG   SenderThread:7063 [sender.py:send_request():402] send_request: defer
2023-05-25 15:58:21,137 INFO    SenderThread:7063 [sender.py:send_request_defer():622] handle sender defer: 14
2023-05-25 15:58:21,187 INFO    SenderThread:7063 [sender.py:transition_state():626] send defer: 13
2023-05-25 15:58:21,188 DEBUG   HandlerThread:7063 [handler.py:handle_request():144] handle_request: defer
2023-05-25 15:58:21,188 INFO    HandlerThread:7063 [handler.py:handle_request_defer():170] handle defer: 13
2023-05-25 15:58:21,189 DEBUG   SenderThread:7063 [sender.py:send_request():402] send_request: defer
2023-05-25 15:58:21,190 INFO    SenderThread:7063 [sender.py:send_request_defer():622] handle sender defer: 13
2023-05-25 15:58:21,190 INFO    SenderThread:7063 [sender.py:transition_state():626] send defer: 14
2023-05-25 15:58:21,192 DEBUG   SenderThread:7063 [sender.py:send():375] send: final
2023-05-25 15:58:21,192 DEBUG   HandlerThread:7063 [handler.py:handle_request():144] handle_request: defer
2023-05-25 15:58:21,193 DEBUG   SenderThread:7063 [sender.py:send():375] send: footer
2023-05-25 15:58:21,194 INFO    HandlerThread:7063 [handler.py:handle_request_defer():170] handle defer: 14
2023-05-25 15:58:21,196 DEBUG   SenderThread:7063 [sender.py:send_request():402] send_request: defer
2023-05-25 15:58:21,196 INFO    SenderThread:7063 [sender.py:send_request_defer():622] handle sender defer: 14
2023-05-25 15:58:21,200 INFO    SenderThread:7063 [sender.py:transition_state():626] send defer: 13
2023-05-25 15:58:21,201 DEBUG   HandlerThread:7063 [handler.py:handle_request():144] handle_request: defer
2023-05-25 15:58:21,202 INFO    HandlerThread:7063 [handler.py:handle_request_defer():170] handle defer: 13
2023-05-25 15:58:21,203 DEBUG   SenderThread:7063 [sender.py:send_request():402] send_request: defer
2023-05-25 15:58:21,203 INFO    SenderThread:7063 [sender.py:send_request_defer():622] handle sender defer: 13
2023-05-25 15:58:21,204 INFO    SenderThread:7063 [sender.py:transition_state():626] send defer: 14
2023-05-25 15:58:21,205 DEBUG   SenderThread:7063 [sender.py:send():375] send: final
2023-05-25 15:58:21,206 DEBUG   HandlerThread:7063 [handler.py:handle_request():144] handle_request: defer
2023-05-25 15:58:21,206 DEBUG   SenderThread:7063 [sender.py:send():375] send: footer
2023-05-25 15:58:21,207 INFO    HandlerThread:7063 [handler.py:handle_request_defer():170] handle defer: 14
2023-05-25 15:58:21,209 DEBUG   SenderThread:7063 [sender.py:send_request():402] send_request: defer
2023-05-25 15:58:21,209 INFO    SenderThread:7063 [sender.py:send_request_defer():622] handle sender defer: 14
2023-05-25 15:58:21,325 INFO    SenderThread:7063 [dir_watcher.py:finish():395] scan: /home/yang/MasterThesis_ws/src/dongxu-master-thesis/reinforcement_learning/RecurrentPPO/sb3/wandb/run-20230525_155812-8zyr7d4m/files
2023-05-25 15:58:21,326 INFO    SenderThread:7063 [dir_watcher.py:finish():409] scan save: /home/yang/MasterThesis_ws/src/dongxu-master-thesis/reinforcement_learning/RecurrentPPO/sb3/wandb/run-20230525_155812-8zyr7d4m/files/output.log output.log
2023-05-25 15:58:21,326 INFO    SenderThread:7063 [dir_watcher.py:finish():409] scan save: /home/yang/MasterThesis_ws/src/dongxu-master-thesis/reinforcement_learning/RecurrentPPO/sb3/wandb/run-20230525_155812-8zyr7d4m/files/config.yaml config.yaml
2023-05-25 15:58:21,331 INFO    SenderThread:7063 [dir_watcher.py:finish():409] scan save: /home/yang/MasterThesis_ws/src/dongxu-master-thesis/reinforcement_learning/RecurrentPPO/sb3/wandb/run-20230525_155812-8zyr7d4m/files/requirements.txt requirements.txt
2023-05-25 15:58:21,331 INFO    SenderThread:7063 [dir_watcher.py:finish():409] scan save: /home/yang/MasterThesis_ws/src/dongxu-master-thesis/reinforcement_learning/RecurrentPPO/sb3/wandb/run-20230525_155812-8zyr7d4m/files/wandb-summary.json wandb-summary.json
2023-05-25 15:58:21,336 INFO    SenderThread:7063 [dir_watcher.py:finish():409] scan save: /home/yang/MasterThesis_ws/src/dongxu-master-thesis/reinforcement_learning/RecurrentPPO/sb3/wandb/run-20230525_155812-8zyr7d4m/files/wandb-metadata.json wandb-metadata.json
2023-05-25 15:58:21,336 INFO    SenderThread:7063 [sender.py:transition_state():626] send defer: 10
2023-05-25 15:58:21,338 DEBUG   HandlerThread:7063 [handler.py:handle_request():144] handle_request: defer
2023-05-25 15:58:21,341 INFO    HandlerThread:7063 [handler.py:handle_request_defer():170] handle defer: 10
2023-05-25 15:58:21,342 DEBUG   SenderThread:7063 [sender.py:send_request():402] send_request: defer
2023-05-25 15:58:21,342 INFO    SenderThread:7063 [sender.py:send_request_defer():622] handle sender defer: 10
2023-05-25 15:58:21,342 INFO    SenderThread:7063 [file_pusher.py:finish():168] shutting down file pusher
2023-05-25 15:58:21,914 INFO    wandb-upload_1:7063 [upload_job.py:push():137] Uploaded file /home/yang/MasterThesis_ws/src/dongxu-master-thesis/reinforcement_learning/RecurrentPPO/sb3/wandb/run-20230525_155812-8zyr7d4m/files/config.yaml
2023-05-25 15:58:21,916 INFO    wandb-upload_2:7063 [upload_job.py:push():137] Uploaded file /home/yang/MasterThesis_ws/src/dongxu-master-thesis/reinforcement_learning/RecurrentPPO/sb3/wandb/run-20230525_155812-8zyr7d4m/files/requirements.txt
2023-05-25 15:58:21,918 INFO    wandb-upload_0:7063 [upload_job.py:push():137] Uploaded file /home/yang/MasterThesis_ws/src/dongxu-master-thesis/reinforcement_learning/RecurrentPPO/sb3/wandb/run-20230525_155812-8zyr7d4m/files/output.log
2023-05-25 15:58:21,921 INFO    wandb-upload_3:7063 [upload_job.py:push():137] Uploaded file /home/yang/MasterThesis_ws/src/dongxu-master-thesis/reinforcement_learning/RecurrentPPO/sb3/wandb/run-20230525_155812-8zyr7d4m/files/wandb-summary.json
2023-05-25 15:58:22,127 INFO    Thread-11 :7063 [sender.py:transition_state():626] send defer: 11
2023-05-25 15:58:22,129 DEBUG   HandlerThread:7063 [handler.py:handle_request():144] handle_request: defer
2023-05-25 15:58:22,130 INFO    HandlerThread:7063 [handler.py:handle_request_defer():170] handle defer: 11
2023-05-25 15:58:22,131 DEBUG   SenderThread:7063 [sender.py:send_request():402] send_request: defer
2023-05-25 15:58:22,132 INFO    SenderThread:7063 [sender.py:send_request_defer():622] handle sender defer: 11
2023-05-25 15:58:22,132 INFO    SenderThread:7063 [file_pusher.py:join():173] waiting for file pusher
2023-05-25 15:58:22,132 INFO    SenderThread:7063 [sender.py:transition_state():626] send defer: 12
2023-05-25 15:58:22,133 DEBUG   HandlerThread:7063 [handler.py:handle_request():144] handle_request: defer
2023-05-25 15:58:22,134 INFO    HandlerThread:7063 [handler.py:handle_request_defer():170] handle defer: 12
2023-05-25 15:58:22,135 DEBUG   SenderThread:7063 [sender.py:send_request():402] send_request: defer
2023-05-25 15:58:22,135 INFO    SenderThread:7063 [sender.py:send_request_defer():622] handle sender defer: 12
2023-05-25 15:58:22,732 INFO    SenderThread:7063 [sender.py:transition_state():626] send defer: 13
2023-05-25 15:58:22,733 DEBUG   HandlerThread:7063 [handler.py:handle_request():144] handle_request: defer
2023-05-25 15:58:22,733 INFO    HandlerThread:7063 [handler.py:handle_request_defer():170] handle defer: 13
2023-05-25 15:58:22,734 DEBUG   SenderThread:7063 [sender.py:send_request():402] send_request: defer
2023-05-25 15:58:22,735 INFO    SenderThread:7063 [sender.py:send_request_defer():622] handle sender defer: 13
2023-05-25 15:58:22,735 INFO    SenderThread:7063 [sender.py:transition_state():626] send defer: 14
2023-05-25 15:58:22,735 DEBUG   HandlerThread:7063 [handler.py:handle_request():144] handle_request: defer
2023-05-25 15:58:22,737 INFO    HandlerThread:7063 [handler.py:handle_request_defer():170] handle defer: 14
2023-05-25 15:58:22,737 DEBUG   SenderThread:7063 [sender.py:send():375] send: final
2023-05-25 15:58:22,738 DEBUG   SenderThread:7063 [sender.py:send():375] send: footer
2023-05-25 15:58:22,739 DEBUG   SenderThread:7063 [sender.py:send_request():402] send_request: defer
2023-05-25 15:58:22,739 INFO    SenderThread:7063 [sender.py:send_request_defer():622] handle sender defer: 14
2023-05-25 15:58:22,740 DEBUG   HandlerThread:7063 [handler.py:handle_request():144] handle_request: poll_exit
2023-05-25 15:58:22,741 DEBUG   HandlerThread:7063 [handler.py:handle_request():144] handle_request: server_info
2023-05-25 15:58:22,741 DEBUG   SenderThread:7063 [sender.py:send_request():402] send_request: poll_exit
2023-05-25 15:58:22,742 DEBUG   HandlerThread:7063 [handler.py:handle_request():144] handle_request: get_summary
2023-05-25 15:58:22,743 DEBUG   SenderThread:7063 [sender.py:send_request():402] send_request: server_info
2023-05-25 15:58:22,744 DEBUG   HandlerThread:7063 [handler.py:handle_request():144] handle_request: sampled_history
2023-05-25 15:58:22,937 INFO    MainThread:7063 [wandb_run.py:_footer_history_summary_info():3476] rendering history
2023-05-25 15:58:22,938 INFO    MainThread:7063 [wandb_run.py:_footer_history_summary_info():3508] rendering summary
2023-05-25 15:58:22,938 INFO    MainThread:7063 [wandb_run.py:_footer_sync_info():3434] logging synced files
2023-05-25 15:58:22,939 DEBUG   HandlerThread:7063 [handler.py:handle_request():144] handle_request: shutdown
2023-05-25 15:58:22,940 INFO    HandlerThread:7063 [handler.py:finish():845] shutting down handler
2023-05-25 15:58:23,743 INFO    WriterThread:7063 [datastore.py:close():298] close: /home/yang/MasterThesis_ws/src/dongxu-master-thesis/reinforcement_learning/RecurrentPPO/sb3/wandb/run-20230525_155812-8zyr7d4m/run-8zyr7d4m.wandb
2023-05-25 15:58:23,937 INFO    SenderThread:7063 [sender.py:finish():1550] shutting down sender
2023-05-25 15:58:23,937 INFO    SenderThread:7063 [file_pusher.py:finish():168] shutting down file pusher
2023-05-25 15:58:23,937 INFO    SenderThread:7063 [file_pusher.py:join():173] waiting for file pusher
