2023-05-30 15:01:55,014 INFO    MainThread:4362 [wandb_setup.py:_flush():76] Configure stats pid to 4362
2023-05-30 15:01:55,015 INFO    MainThread:4362 [wandb_setup.py:_flush():76] Loading settings from /home/yang/.config/wandb/settings
2023-05-30 15:01:55,015 INFO    MainThread:4362 [wandb_setup.py:_flush():76] Loading settings from /home/yang/MasterThesis_ws/src/dongxu-master-thesis/reinforcement_learning/RecurrentPPO/sb3/wandb/settings
2023-05-30 15:01:55,015 INFO    MainThread:4362 [wandb_setup.py:_flush():76] Loading settings from environment variables: {}
2023-05-30 15:01:55,015 INFO    MainThread:4362 [wandb_setup.py:_flush():76] Inferring run settings from compute environment: {'program_relpath': 'reinforcement_learning/RecurrentPPO/sb3/train.py', 'program': '/home/yang/MasterThesis_ws/src/dongxu-master-thesis/reinforcement_learning/RecurrentPPO/sb3/train.py'}
2023-05-30 15:01:55,015 INFO    MainThread:4362 [wandb_setup.py:_flush():76] Applying login settings: {'api_key': '***REDACTED***'}
2023-05-30 15:01:55,015 INFO    MainThread:4362 [wandb_setup.py:_flush():76] Applying login settings: {'api_key': '***REDACTED***'}
2023-05-30 15:01:55,015 INFO    MainThread:4362 [wandb_init.py:_log_setup():507] Logging user logs to /home/yang/MasterThesis_ws/src/dongxu-master-thesis/reinforcement_learning/RecurrentPPO/sb3/wandb/run-20230530_150155-rcuyow25/logs/debug.log
2023-05-30 15:01:55,015 INFO    MainThread:4362 [wandb_init.py:_log_setup():508] Logging internal logs to /home/yang/MasterThesis_ws/src/dongxu-master-thesis/reinforcement_learning/RecurrentPPO/sb3/wandb/run-20230530_150155-rcuyow25/logs/debug-internal.log
2023-05-30 15:01:55,015 INFO    MainThread:4362 [wandb_init.py:init():547] calling init triggers
2023-05-30 15:01:55,015 INFO    MainThread:4362 [wandb_init.py:init():554] wandb.init called with sweep_config: {}
config: {}
2023-05-30 15:01:55,015 INFO    MainThread:4362 [wandb_init.py:init():595] starting backend
2023-05-30 15:01:55,015 INFO    MainThread:4362 [wandb_init.py:init():599] setting up manager
2023-05-30 15:01:55,017 INFO    MainThread:4362 [backend.py:_multiprocessing_setup():106] multiprocessing start_methods=fork,spawn,forkserver, using: spawn
2023-05-30 15:01:55,019 INFO    MainThread:4362 [wandb_init.py:init():605] backend started and connected
2023-05-30 15:01:55,022 INFO    MainThread:4362 [wandb_init.py:init():695] updated telemetry
2023-05-30 15:01:55,033 INFO    MainThread:4362 [wandb_init.py:init():732] communicating run to backend with 60.0 second timeout
2023-05-30 15:01:55,744 INFO    MainThread:4362 [wandb_run.py:_on_init():2176] communicating current version
2023-05-30 15:01:55,849 INFO    MainThread:4362 [wandb_run.py:_on_init():2185] got version response upgrade_message: "wandb version 0.15.3 is available!  To upgrade, please run:\n $ pip install wandb --upgrade"

2023-05-30 15:01:55,849 INFO    MainThread:4362 [wandb_init.py:init():782] starting run threads in backend
2023-05-30 15:01:59,932 WARNING MsgRouterThr:4362 [router.py:message_loop():77] message_loop has been closed
2023-05-30 15:02:05,924 ERROR   MainThread:4362 [wandb_init.py:init():1163] transport failed
Traceback (most recent call last):
  File "/home/yang/.local/lib/python3.8/site-packages/wandb/sdk/wandb_init.py", line 1145, in init
    run = wi.init()
  File "/home/yang/.local/lib/python3.8/site-packages/wandb/sdk/wandb_init.py", line 794, in init
    run_start_result = run_start_handle.wait(timeout=30)
  File "/home/yang/.local/lib/python3.8/site-packages/wandb/sdk/lib/mailbox.py", line 281, in wait
    raise MailboxError("transport failed")
wandb.sdk.lib.mailbox.MailboxError: transport failed
