% This file was created with tikzplotlib v0.10.1.
\begin{tikzpicture}

\definecolor{darkgray176}{RGB}{176,176,176}
\definecolor{darkorange25512714}{RGB}{255,127,14}
\definecolor{lightgray204}{RGB}{204,204,204}
\definecolor{steelblue31119180}{RGB}{31,119,180}

\begin{axis}[
legend cell align={left},
legend style={fill opacity=0.8, draw opacity=1, text opacity=1, draw=lightgray204},
tick align=outside,
tick pos=left,
title={Distance between vehicle and pedestrian},
x grid style={darkgray176},
xlabel={Time in s},
xmajorgrids,
xmin=-0.56, xmax=11.76,
xtick style={color=black},
y grid style={darkgray176},
ylabel={Distance between vehicle and human in m (in x direction)},
ymajorgrids,
ymin=-12.4647665523075, ymax=5.58453872195547,
ytick style={color=black}
]
\addplot [semithick, steelblue31119180]
table {%
0 -11.6113550492759
0.1 -11.3236072346391
0.2 -11.0473476892795
0.3 -10.7823384707132
0.4 -10.5283691570762
0.5 -10.2852179871959
0.6 -10.0526524146527
0.7 -9.83042975806954
0.8 -9.61829793039637
0.9 -9.41599624114536
1 -9.22325626416456
1.1 -9.03980276228372
1.2 -8.8653546590828
1.3 -8.69962604715455
1.4 -8.5423295656318
1.5 -8.39448393045527
1.6 -8.25627713806966
1.7 -8.1253958777431
1.8 -8.00154964923759
1.9 -7.88445349579897
2 -7.77357538165344
2.1 -7.66792880687828
2.2 -7.5683122886209
2.3 -7.47445931571627
2.4 -7.38609919838827
2.5 -7.30296738690649
2.6 -7.22480602133727
2.7 -7.15136440126117
2.8 -7.08239938245762
2.9 -7.01767570204572
3 -6.95696623445892
3.1 -6.90079429062175
3.2 -6.84859716912456
3.3 -6.79916731396749
3.4 -6.75051500594013
3.5 -6.70186269791277
3.6 -6.65321038988542
3.7 -6.60455808185806
3.8 -6.5559057738307
3.9 -6.50725346580334
4 -6.45860115777599
4.1 -6.40994884974863
4.2 -6.36129654172127
4.3 -6.31264423369392
4.4 -6.26399192566656
4.5 -6.2153396176392
4.6 -6.16668730961185
4.7 -6.11803500158449
4.8 -6.06938269355713
4.9 -6.02073038552977
5 -5.97207807750242
5.1 -5.92342576947506
5.2 -5.8747734614477
5.3 -5.82612115342035
5.4 -5.77746884539299
5.5 -5.72881653736563
5.6 -5.68016422933827
5.7 -5.63151192131092
5.8 -5.58285961328356
5.9 -5.5342073052562
6 -5.48555499722885
6.1 -5.43690268920149
6.2 -5.38825038117413
6.3 -5.33959807314677
6.4 -5.29094576511942
6.5 -5.24229345709206
6.6 -5.1936411490647
6.7 -5.14498884103735
6.8 -5.09633653300999
6.9 -5.04768422498263
7 -4.99903191695527
7.1 -4.95037960892792
7.2 -4.90172730090056
7.3 -4.8530749928732
7.4 -4.80232807831479
7.5 -4.74320273763217
7.6 -4.67534986973683
7.7 -4.5987694746288
7.8 -4.51346155230804
7.9 -4.41942610277458
8 -4.31666312602841
8.1 -4.20517262206953
8.2 -4.08495459089793
8.3 -3.95600903251363
8.4 -3.81833594691661
8.5 -3.67193533410688
8.6 -3.51680719408445
8.7 -3.3529515268493
8.8 -3.18036833240144
8.9 -2.99905761074088
9 -2.8090193618676
9.1 -2.61025358578161
9.2 -2.40276028248292
9.3 -2.18653945197151
9.4 -1.96159109424739
9.5 -1.72791520931056
9.6 -1.48551179716102
9.7 -1.23368265562175
9.8 -0.972078683604245
9.9 -0.701747184374028
10 -0.422688157931105
10.1 -0.13490160427547
10.2 0.161612476592879
10.3 0.466854084673933
10.4 0.780823219967701
10.5 1.10351988247418
10.6 1.43494407219337
10.7 1.7761430923908
10.8 2.13165525721706
10.9 2.49624405034455
11 2.87060767395027
11.1 3.25300062259169
};
\addlegendentry{distance_SFM}
\addplot [semithick, darkorange25512714]
table {%
0 -11.6443435852956
0.1 -11.3560241451896
0.2 -11.0791967656276
0.3 -10.8136656376296
0.4 -10.5592183909322
0.5 -10.3156312626538
0.6 -10.082669674738
0.7 -9.86008889407577
0.8 -9.6480293528694
0.9 -9.44775657091288
1 -9.25661520140057
1.1 -9.07475367550405
1.2 -8.90258334825878
1.3 -8.74277647940409
1.4 -8.59008669660879
1.5 -8.44533552351342
1.6 -8.30825037340425
1.7 -8.17853842864769
1.8 -8.05590752935138
1.9 -7.94006727294857
2 -7.83072992940992
2.1 -7.72761130333578
2.2 -7.630431536829
2.3 -7.53891584760145
2.4 -7.4527951980943
2.5 -7.37180689271991
2.6 -7.29569510162302
2.7 -7.22421712878383
2.8 -7.15714890046376
2.9 -7.09428019314459
3 -7.03538264292504
3.1 -6.97980272198021
3.2 -6.92466419385601
3.3 -6.86952566573181
3.4 -6.8143871376076
3.5 -6.7592486094834
3.6 -6.7041100813592
3.7 -6.64897155323499
3.8 -6.59383302511079
3.9 -6.53869449698659
4 -6.48355596886238
4.1 -6.42841744073818
4.2 -6.37327891261398
4.3 -6.31814038448977
4.4 -6.26300185636557
4.5 -6.20786332824137
4.6 -6.15272480011716
4.7 -6.09758627199296
4.8 -6.04244774386876
4.9 -5.98730921574455
5 -5.93217068762035
5.1 -5.87703215949615
5.2 -5.82189363137194
5.3 -5.76675510324774
5.4 -5.71161657512354
5.5 -5.65647804699933
5.6 -5.60133951887513
5.7 -5.54620099075093
5.8 -5.49106246262672
5.9 -5.43592393450252
6 -5.38078540637832
6.1 -5.32564687825411
6.2 -5.27050835012991
6.3 -5.21536982200571
6.4 -5.1602312938815
6.5 -5.1050927657573
6.6 -5.0499542376331
6.7 -4.99481570950889
6.8 -4.93967718138469
6.9 -4.88453865326048
7 -4.82940012513628
7.1 -4.77426159701208
7.2 -4.71969132452469
7.3 -4.66927233055988
7.4 -4.6148252527646
7.5 -4.550589284226
7.6 -4.47656442494407
7.7 -4.39157600802962
7.8 -4.29405781096369
7.9 -4.18675072315443
8 -4.06965474460185
8.1 -3.94472765345461
8.2 -3.81001167156404
8.3 -3.66550679893015
8.4 -3.51121303555294
8.5 -3.3471303814324
8.6 -3.17325883656851
8.7 -2.98959840096129
8.8 -2.79614907461075
8.9 -2.59095307936823
9 -2.37518508212291
9.1 -2.15041130539374
9.2 -1.91584863792124
9.3 -1.67149707970539
9.4 -1.41735663074621
9.5 -1.15342729104371
9.6 -0.879709060597889
9.7 -0.596201939408743
9.8 -0.302905927476274
9.9 0.000178975199517595
10 0.313052768618661
10.1 0.635715452781135
10.2 0.968167027686931
10.3 1.31040749333605
10.4 1.66243684972849
10.5 2.02425509686426
10.6 2.39586223474335
10.7 2.77725826336577
10.8 3.16844318273154
10.9 3.56706765906224
11 3.96608369102267
11.1 4.36509972298309
11.2 4.76411575494352
};
\addlegendentry{distance_MDP}
\end{axis}

\end{tikzpicture}
