{
    "os": "Linux-5.15.0-72-generic-x86_64-with-glibc2.29",
    "python": "3.8.10",
    "heartbeatAt": "2023-05-25T20:17:22.353254",
    "startedAt": "2023-05-25T20:17:21.195318",
    "docker": null,
    "cuda": null,
    "args": [],
    "state": "running",
    "program": "/home/yang/MasterThesis_ws/src/dongxu-master-thesis/reinforcement_learning/RecurrentPPO/sb3/train.py",
    "codePath": "reinforcement_learning/RecurrentPPO/sb3/train.py",
    "git": {
        "remote": "https://git.scc.kit.edu/balintvarga/dongxu-master-thesis.git",
        "commit": "254316a0fbc147737419a2ed53bbb90c33870f79"
    },
    "email": "ubtef@student.kit.edu",
    "root": "/home/yang/MasterThesis_ws/src/dongxu-master-thesis",
    "host": "yang-ThinkPad-T480s",
    "username": "yang",
    "executable": "/usr/bin/python3.8",
    "cpu_count": 4,
    "cpu_count_logical": 8,
    "cpu_freq": {
        "current": 995.8098750000001,
        "min": 400.0,
        "max": 4000.0
    },
    "cpu_freq_per_core": [
        {
            "current": 876.221,
            "min": 400.0,
            "max": 4000.0
        },
        {
            "current": 868.594,
            "min": 400.0,
            "max": 4000.0
        },
        {
            "current": 875.044,
            "min": 400.0,
            "max": 4000.0
        },
        {
            "current": 873.833,
            "min": 400.0,
            "max": 4000.0
        },
        {
            "current": 887.748,
            "min": 400.0,
            "max": 4000.0
        },
        {
            "current": 872.167,
            "min": 400.0,
            "max": 4000.0
        },
        {
            "current": 899.873,
            "min": 400.0,
            "max": 4000.0
        },
        {
            "current": 1001.016,
            "min": 400.0,
            "max": 4000.0
        }
    ],
    "disk": {
        "total": 109.54700088500977,
        "used": 30.622188568115234
    },
    "memory": {
        "total": 15.522789001464844
    }
}
