% This file was created with tikzplotlib v0.10.1.
\begin{tikzpicture}

\definecolor{darkgray176}{RGB}{176,176,176}
\definecolor{darkorange25512714}{RGB}{255,127,14}
\definecolor{lightgray204}{RGB}{204,204,204}
\definecolor{steelblue31119180}{RGB}{31,119,180}

\begin{axis}[
legend cell align={left},
legend style={fill opacity=0.8, draw opacity=1, text opacity=1, draw=lightgray204},
tick align=outside,
tick pos=left,
title={Distance between vehicle and pedestrian},
x grid style={darkgray176},
xlabel={Time in s},
xmajorgrids,
xmin=-0.55, xmax=11.55,
xtick style={color=black},
y grid style={darkgray176},
ylabel={Distance between vehicle and human in m (in x direction)},
ymajorgrids,
ymin=-13.5254242437499, ymax=7.9384024538699,
ytick style={color=black}
]
\addplot [semithick, steelblue31119180]
table {%
0 -12.5497957574945
0.1 -12.2463047466094
0.2 -11.9340862085116
0.3 -11.6131401432011
0.4 -11.2834665506779
0.5 -10.9450654309419
0.6 -10.5979367839933
0.7 -10.2417315087435
0.8 -9.87540230192685
0.9 -9.49894916354351
1 -9.11516490230149
1.1 -8.72265311384676
1.2 -8.32141379817932
1.3 -7.91144695529917
1.4 -7.4927525852063
1.5 -7.07381077959742
1.6 -6.66734167601761
1.7 -6.27334527446686
1.8 -5.89182157494517
1.9 -5.52277057745251
2 -5.16818791431357
2.1 -4.82657686128486
2.2 -4.4974385102852
2.3 -4.18077286131458
2.4 -3.87657991437302
2.5 -3.58485966946053
2.6 -3.3056121265771
2.7 -3.03883728572271
2.8 -2.78453514689738
2.9 -2.54270571010111
3 -2.3133489753339
3.1 -2.09646494259573
3.2 -1.89205361188662
3.3 -1.70011498320658
3.4 -1.5206490565556
3.5 -1.35365583193365
3.6 -1.19913530934077
3.7 -1.05708748877695
3.8 -0.927512370242191
3.9 -0.810409953736468
4 -0.705780239259809
4.1 -0.613623226812216
4.2 -0.533938916393673
4.3 -0.466727308004174
4.4 -0.412487309724902
4.5 -0.372715645799346
4.6 -0.345284770973322
4.7 -0.327822514874008
4.8 -0.316861731767673
4.9 -0.310050622623024
5 -0.305993812066596
5.1 -0.303656654182703
5.2 -0.302318508026261
5.3 -0.301553803619278
5.4 -0.301117215980177
5.5 -0.300868090320051
5.6 -0.300725977291449
5.7 -0.300644923343548
5.8 -0.300623279891759
5.9 -0.300623279891759
6 -0.300623279891759
6.1 -0.300623279891759
6.2 -0.300623279891759
6.3 -0.300623279891759
6.4 -0.300623279891759
6.5 -0.300623279891759
6.6 -0.300623279891759
6.7 -0.300623279891759
6.8 -0.300623279891759
6.9 -0.300623279891759
7 -0.29957597662623
7.1 -0.290848449413517
7.2 -0.273393394988098
7.3 -0.247210813349966
7.4 -0.212300704499121
7.5 -0.168663068435571
7.6 -0.116297905159307
7.7 -0.0552052146703303
7.8 0.0146150030313521
7.9 0.0931627479457475
8 0.180438020072856
8.1 0.27644081941267
8.2 0.381520247053707
8.3 0.496723606261483
8.4 0.620654492681972
8.5 0.753312906315173
8.6 0.894698847161081
8.7 1.0448123152197
8.8 1.20365331049103
8.9 1.37122183297507
9 1.54751788267183
9.1 1.73254145958129
9.2 1.92629256370346
9.3 2.12877119503835
9.4 2.33997735358594
9.5 2.55991103934625
9.6 2.78857225231926
9.7 3.02700829577051
9.8 3.27766287731956
9.9 3.53599768281579
10 3.80306001552474
10.1 4.07884987544639
10.2 4.36336726258075
10.3 4.65661217692782
10.4 4.95858461848761
10.5 5.26963368834861
10.6 5.59080668977636
10.7 5.92070721841682
10.8 6.25933527426999
10.9 6.60669085733586
11 6.96277396761445
};
\addlegendentry{distance_SFM}
\addplot [semithick, darkorange25512714]
table {%
0 -12.3980186208249
0.1 -12.0882297300816
0.2 -11.7686519485949
0.3 -11.4392852763649
0.4 -11.1001297133916
0.5 -10.751185259675
0.6 -10.392451915215
0.7 -10.0239296800117
0.8 -9.6456185540651
0.9 -9.25751853737515
1 -8.85962962994187
1.1 -8.45782516621126
1.2 -8.05602070248066
1.3 -7.65421623875005
1.4 -7.25241177501945
1.5 -6.85765361291936
1.6 -6.47463928687013
1.7 -6.10336879687177
1.8 -5.74384214292428
1.9 -5.39605932502766
2 -5.0600203431819
2.1 -4.735725197387
2.2 -4.42317388764297
2.3 -4.12236641394981
2.4 -3.83330277630752
2.5 -3.55598297471609
2.6 -3.29040700917552
2.7 -3.03657487968583
2.8 -2.7958958465731
2.9 -2.57212793737362
3 -2.35822485045687
3.1 -2.15606559959099
3.2 -1.96565018477597
3.3 -1.78697860601181
3.4 -1.62005086329853
3.5 -1.46486695663611
3.6 -1.32142688602455
3.7 -1.18973065146386
3.8 -1.06977825295404
3.9 -0.961569690495082
4 -0.865104964086996
4.1 -0.78038407372977
4.2 -0.707407019423414
4.3 -0.648522568378091
4.4 -0.603260967151769
4.5 -0.568333107512927
4.6 -0.544137881332098
4.7 -0.528324810202648
4.8 -0.518102161284247
4.9 -0.511543378712034
5 -0.507501355934423
5.1 -0.505091229327569
5.2 -0.503667401229883
5.3 -0.502829003557032
5.4 -0.502336057310998
5.5 -0.5020464478484
5.6 -0.50187637416925
5.7 -0.501776523185093
5.8 -0.501727275082452
5.9 -0.501727275082452
6 -0.501727275082452
6.1 -0.501727275082452
6.2 -0.501727275082452
6.3 -0.501727275082452
6.4 -0.501727275082452
6.5 -0.501727275082452
6.6 -0.501727275082452
6.7 -0.501727275082452
6.8 -0.501727275082452
6.9 -0.501727275082452
7 -0.500552608193253
7.1 -0.49076371744993
7.2 -0.471185935963284
7.3 -0.441819263733315
7.4 -0.402663700759994
7.5 -0.353719247043344
7.6 -0.29498590258337
7.7 -0.226463667380074
7.8 -0.148152541433454
7.9 -0.0600525247435115
8 0.0378363826897541
8.1 0.145514180866357
8.2 0.265721759194435
8.3 0.402374673971295
8.4 0.547641812602279
8.5 0.702306286346854
8.6 0.866759650834751
8.7 1.04100190606597
8.8 1.22503305204054
8.9 1.41885308875845
9 1.62246201621967
9.1 1.83585983442422
9.2 2.05904654337209
9.3 2.29202214306329
9.4 2.5347866334978
9.5 2.78734001467566
9.6 3.05124850911579
9.7 3.32533744992897
9.8 3.60921528148548
9.9 3.90288200378532
10 4.20633761682848
10.1 4.51958212061496
10.2 4.84261551514476
10.3 5.17543780041788
10.4 5.51804897643433
10.5 5.8704490431941
10.6 6.23263800069725
};
\addlegendentry{distance_MDP}
\end{axis}

\end{tikzpicture}
