% This file was created with tikzplotlib v0.10.1.
\begin{tikzpicture}

\definecolor{darkgray176}{RGB}{176,176,176}
\definecolor{green}{RGB}{0,128,0}
\definecolor{lightgray204}{RGB}{204,204,204}

\begin{axis}[
legend cell align={left},
legend style={fill opacity=0.8, draw opacity=1, text opacity=1, draw=lightgray204},
tick align=outside,
tick pos=left,
title={Speed of vehicle and pedestrian},
x grid style={darkgray176},
xlabel={Time in s},
xmajorgrids,
xmin=-0.362, xmax=7.602,
xtick style={color=black},
y grid style={darkgray176},
ylabel={Speed in m/s},
ymajorgrids,
ymin=-0.261431355896466, ymax=5.49005847382579,
ytick style={color=black}
]
\addplot [very thick, red]
table {%
0 0
0.01 0
0.02 0
0.03 0
0.04 0
0.05 0
0.06 0
0.07 0
0.08 0
0.09 0
0.1 0
0.11 0
0.12 0
0.13 0
0.14 0.0259450958344778
0.15 0.0518901916689555
0.16 0.0778352875034333
0.17 0.103780383337911
0.18 0.129725479172389
0.19 0.155670575006867
0.2 0.181615670841344
0.21 0.207560766675822
0.22 0.233282875159634
0.23 0.259004983643445
0.24 0.284727092127257
0.25 0.310449200611068
0.26 0.33617130909488
0.27 0.361893417578691
0.28 0.387615526062503
0.29 0.413337634546314
0.3 0.439059743030126
0.31 0.464781851513937
0.32 0.490503959997749
0.33 0.515112627417173
0.34 0.539721294836597
0.35 0.564329962256021
0.36 0.588938629675444
0.37 0.613547297094868
0.38 0.638155964514292
0.39 0.662764631933716
0.4 0.68737329935314
0.41 0.711981966772564
0.42 0.736590634191988
0.43 0.760105407989996
0.44 0.783620181788005
0.45 0.807134955586014
0.46 0.830649729384022
0.47 0.854164503182031
0.48 0.877679276980039
0.49 0.901194050778048
0.5 0.924708824576057
0.51 0.948223598374065
0.52 0.971738372172074
0.53 0.995253145970082
0.54 1.01876791976809
0.55 1.04134415633265
0.56 1.0639203928972
0.57 1.08649662946176
0.58 1.10907286602632
0.59 1.13164910259087
0.6 1.15422533915543
0.61 1.17680157571999
0.62 1.19836037507704
0.63 1.21991917443409
0.64 1.24147797379115
0.65 1.2630367731482
0.66 1.28459557250525
0.67 1.3061543718623
0.68 1.32771317121936
0.69 1.34927197057641
0.7 1.37083076993346
0.71 1.39238956929051
0.72 1.41394836864757
0.73 1.43550716800462
0.74 1.45610412076978
0.75 1.47670107353495
0.76 1.49729802630011
0.77 1.51789497906528
0.78 1.53849193183044
0.79 1.55908888459561
0.8 1.57968583736078
0.81 1.60028279012594
0.82 1.61996106766853
0.83 1.63963934521112
0.84 1.65931762275371
0.85 1.67899590029629
0.86 1.69867417783888
0.87 1.71835245538147
0.88 1.73803073292406
0.89 1.75770901046665
0.9 1.77738728800924
0.91 1.79706556555182
0.92 1.81674384309441
0.93 1.836422120637
0.94 1.85522516893291
0.95 1.87402821722882
0.96 1.89283126552473
0.97 1.91163431382064
0.98 1.93043736211655
0.99 1.94924041041246
1 1.96804345870837
1.01 1.98684650700428
1.02 2.00564955530019
1.03 2.0244526035961
1.04 2.01717816723709
1.05 2.00990373087809
1.06 2.00262929451908
1.07 1.99535485816007
1.08 1.98808042180106
1.09 1.98080598544205
1.1 1.97353154908304
1.11 1.96625711272403
1.12 1.95898267636502
1.13 1.9471299357457
1.14 1.93527719512637
1.15 1.92342445450705
1.16 1.91157171388773
1.17 1.8997189732684
1.18 1.88786623264908
1.19 1.87601349202976
1.2 1.86416075141043
1.21 1.85230801079111
1.22 1.84045527017179
1.23 1.8228177250585
1.24 1.80518017994521
1.25 1.78754263483192
1.26 1.76990508971863
1.27 1.75226754460534
1.28 1.73462999949205
1.29 1.71699245437876
1.3 1.69935490926547
1.31 1.68171736415218
1.32 1.66407981903889
1.33 1.6464422739256
1.34 1.60998591922488
1.35 1.57352956452417
1.36 1.53707320982345
1.37 1.50061685512274
1.38 1.46416050042202
1.39 1.42770414572131
1.4 1.39124779102059
1.41 1.35479143631988
1.42 1.31833508161916
1.43 1.28540623594366
1.44 1.25247739026817
1.45 1.21954854459267
1.46 1.18661969891718
1.47 1.15369085324168
1.48 1.12076200756618
1.49 1.08783316189069
1.5 1.05490431621519
1.51 1.0219754705397
1.52 0.989046624864199
1.53 0.956117779188703
1.54 0.923188933513207
1.55 0.897480808594511
1.56 0.871772683675814
1.57 0.846064558757118
1.58 0.820356433838421
1.59 0.794648308919725
1.6 0.768940184001029
1.61 0.743232059082332
1.62 0.732522566450659
1.63 0.721813073818986
1.64 0.711103581187313
1.65 0.70039408855564
1.66 0.689684595923966
1.67 0.678975103292293
1.68 0.66826561066062
1.69 0.657556118028947
1.7 0.646846625397274
1.71 0.6361371327656
1.72 0.625427640133927
1.73 0.614718147502254
1.74 0.607137307083975
1.75 0.599556466665696
1.76 0.591975626247416
1.77 0.584394785829137
1.78 0.576813945410858
1.79 0.569233104992579
1.8 0.5616522645743
1.81 0.55407142415602
1.82 0.543625078625785
1.83 0.533178733095549
1.84 0.522732387565313
1.85 0.512286042035077
1.86 0.501839696504842
1.87 0.491393350974606
1.88 0.48094700544437
1.89 0.470500659914134
1.9 0.460054314383899
1.91 0.449607968853663
1.92 0.439161623323427
1.93 0.428715277793191
1.94 0.41868662038187
1.95 0.388600648147906
1.96 0.358514675913942
1.97 0.358514675913942
1.98 0.34848601850262
1.99 0.338457361091299
2 0.328428703679978
2.01 0.31699515774838
2.02 0.305561611816782
2.03 0.294128065885184
2.04 0.282694519953585
2.05 0.271260974021987
2.06 0.259827428090389
2.07 0.248393882158791
2.08 0.236960336227193
2.09 0.225526790295595
2.1 0.214093244363997
2.11 0.202933273807046
2.12 0.191773303250094
2.13 0.180613332693143
2.14 0.169453362136192
2.15 0.15829339157924
2.16 0.147133421022289
2.17 0.135973450465338
2.18 0.124813479908386
2.19 0.113653509351435
2.2 0.102493538794484
2.21 0.0913335682375324
2.22 0.0805032069558892
2.23 0.069672845674246
2.24 0.0588424843926028
2.25 0.0480121231109596
2.26 0.0371817618293165
2.27 0.0263514005476733
2.28 0.0155210392660301
2.29 0.00469067798438694
2.3 0
2.31 0
2.32 0
2.33 0
2.34 0
2.35 0
2.36 0
2.37 0
2.38 0
2.39 0
2.4 0
2.41 0
2.42 0
2.43 0
2.44 0
2.45 0
2.46 0
2.47 0
2.48 0
2.49 0
2.5 0
2.51 0
2.52 0
2.53 0
2.54 0
2.55 0
2.56 0
2.57 0
2.58 0
2.59 0
2.6 0
2.61 0
2.62 0
2.63 0
2.64 0
2.65 0
2.66 0
2.67 0
2.68 0
2.69 0
2.7 0
2.71 0
2.72 0
2.73 0
2.74 0
2.75 0
2.76 0
2.77 0
2.78 0
2.79 0
2.8 0
2.81 0
2.82 0
2.83 0
2.84 0
2.85 0
2.86 0
2.87 0
2.88 0
2.89 0
2.9 0
2.91 0
2.92 0
2.93 0
2.94 0
2.95 0
2.96 0
2.97 0
2.98 0
2.99 0
3 0
3.01 0
3.02 0
3.03 0
3.04 0
3.05 0
3.06 0
3.07 0
3.08 0
3.09 0
3.1 0
3.11 0
3.12 0
3.13 0
3.14 0
3.15 0
3.16 0
3.17 0
3.18 0
3.19 0
3.2 0
3.21 0
3.22 0
3.23 0
3.24 0
3.25 0
3.26 0
3.27 0
3.28 0
3.29 0
3.3 0
3.31 0
3.32 0
3.33 0
3.34 0
3.35 0
3.36 0
3.37 0
3.38 0
3.39 0
3.4 0
3.41 0
3.42 0
3.43 0
3.44 0
3.45 0
3.46 0
3.47 0
3.48 0
3.49 0
3.5 0
3.51 0
3.52 0
3.53 0
3.54 0
3.55 0
3.56 0
3.57 0
3.58 0
3.59 0
3.6 0
3.61 0
3.62 0
3.63 0
3.64 0
3.65 0
3.66 0
3.67 0
3.68 0
3.69 0
3.7 0
3.71 0
3.72 0
3.73 0
3.74 0
3.75 0
3.76 0
3.77 0
3.78 0
3.79 0
3.8 0
3.81 0
3.82 0
3.83 0
3.84 0
3.85 0
3.86 0
3.87 0
3.88 0
3.89 0
3.9 0
3.91 0
3.92 0
3.93 0
3.94 0
3.95 0
3.96 0
3.97 0
3.98 0
3.99 0
4 0
4.01 0
4.02 0
4.03 0
4.04 0
4.05 0
4.06 0
4.07 0
4.08 0
4.09 0
4.1 0
4.11 0
4.12 0
4.13 0
4.14 0
4.15 0
4.16 0
4.17 0
4.18 0
4.19 0
4.2 0
4.21 0
4.22 0
4.23 0
4.24 0
4.25 0
4.26 0
4.27 0
4.28 0
4.29 0
4.3 0
4.31 0
4.32 0
4.33 0
4.34 0
4.35 0
4.36 0
4.37 0
4.38 0
4.39 0
4.4 0
4.41 0
4.42 0
4.43 0
4.44 0
4.45 0
4.46 0
4.47 0
4.48 0
4.49 0
4.5 0
4.51 0
4.52 0
4.53 0
4.54 0
4.55 0
4.56 0
4.57 0
4.58 0
4.59 0
4.6 0
4.61 0
4.62 0
4.63 0
4.64 0
4.65 0
4.66 0
4.67 0
4.68 0
4.69 0
4.7 0
4.71 0
4.72 0
4.73 0
4.74 0
4.75 0
4.76 0
4.77 0
4.78 0
4.79 0
4.8 0
4.81 0
4.82 0
4.83 0
4.84 0
4.85 0
4.86 0.0463144024071675
4.87 0.0926288048143351
4.88 0.138943207221503
4.89 0.18525760962867
4.9 0.231572012035838
4.91 0.277886414443005
4.92 0.324200816850173
4.93 0.37051521925734
4.94 0.415757109733489
4.95 0.460999000209638
4.96 0.506240890685787
4.97 0.551482781161936
4.98 0.596724671638085
4.99 0.641966562114234
5 0.687208452590383
5.01 0.732450343066532
5.02 0.777692233542681
5.03 0.82293412401883
5.04 0.868176014494979
5.05 0.909884259150143
5.06 0.951592503805308
5.07 0.993300748460473
5.08 1.03500899311564
5.09 1.0767172377708
5.1 1.11842548242597
5.11 1.16013372708113
5.12 1.2018419717363
5.13 1.24355021639146
5.14 1.28525846104663
5.15 1.32358355963063
5.16 1.36190865821463
5.17 1.40023375679863
5.18 1.43855885538263
5.19 1.47688395396663
5.2 1.51520905255062
5.21 1.55353415113462
5.22 1.59185924971862
5.23 1.63018434830262
5.24 1.66850944688662
5.25 1.70371951701852
5.26 1.73892958715043
5.27 1.77413965728233
5.28 1.80934972741423
5.29 1.84455979754613
5.3 1.87976986767803
5.31 1.91497993780993
5.32 1.95019000794183
5.33 1.98540007807374
5.34 2.01774798859583
5.35 2.05009589911793
5.36 2.08244380964003
5.37 2.11479172016213
5.38 2.14713963068422
5.39 2.17948754120632
5.4 2.21183545172842
5.41 2.24418336225052
5.42 2.27653127277262
5.43 2.30887918329471
5.44 2.34122709381681
5.45 2.37096758142013
5.46 2.40070806902345
5.47 2.43044855662676
5.48 2.46018904423008
5.49 2.4899295318334
5.5 2.51967001943671
5.51 2.54941050704003
5.52 2.57915099464335
5.53 2.60889148224667
5.54 2.63621552043061
5.55 2.66353955861456
5.56 2.69086359679851
5.57 2.71818763498246
5.58 2.7455116731664
5.59 2.77283571135035
5.6 2.8001597495343
5.61 2.82748378771825
5.62 2.8548078259022
5.63 2.88213186408614
5.64 2.90945590227009
5.65 2.93457751594464
5.66 2.9596991296192
5.67 2.98482074329375
5.68 3.0099423569683
5.69 3.03506397064285
5.7 3.06018558431741
5.71 3.08530719799196
5.72 3.11042881166651
5.73 3.13555042534106
5.74 3.16067203901562
5.75 3.18375249450645
5.76 3.20683294999729
5.77 3.22991340548813
5.78 3.25299386097897
5.79 3.27607431646981
5.8 3.29915477196065
5.81 3.32223522745149
5.82 3.34531568294232
5.83 3.36839613843316
5.84 3.391476593924
5.85 3.41268091855382
5.86 3.43388524318363
5.87 3.45508956781345
5.88 3.47629389244327
5.89 3.49749821707308
5.9 3.5187025417029
5.91 3.53990686633272
5.92 3.56111119096253
5.93 3.58231551559235
5.94 3.60351984022216
5.95 3.62472416485198
5.96 3.6459284894818
5.97 3.6655728237959
5.98 3.68521715811001
5.99 3.70486149242411
6 3.72450582673822
6.01 3.74415016105232
6.02 3.76379449536643
6.03 3.78343882968053
6.04 3.80145842962448
6.05 3.81947802956843
6.06 3.83749762951239
6.07 3.85551722945634
6.08 3.87353682940029
6.09 3.89155642934424
6.1 3.90957602928819
6.11 3.92759562923214
6.12 3.9456152291761
6.13 3.96363482912005
6.14 3.981654429064
6.15 3.99967402900795
6.16 4.01636652984548
6.17 4.03305903068301
6.18 4.04975153152054
6.19 4.06644403235807
6.2 4.0831365331956
6.21 4.09982903403313
6.22 4.11652153487066
6.23 4.13321403570819
6.24 4.1485258355072
6.25 4.16383763530621
6.26 4.17914943510522
6.27 4.19446123490423
6.28 4.20977303470325
6.29 4.22508483450226
6.3 4.24039663430127
6.31 4.25570843410028
6.32 4.27102023389929
6.33 4.2863320336983
6.34 4.30164383349732
6.35 4.31569910113267
6.36 4.32975436876803
6.37 4.34380963640339
6.38 4.35786490403874
6.39 4.3719201716741
6.4 4.38597543930946
6.41 4.40003070694482
6.42 4.41408597458017
6.43 4.42814124221553
6.44 4.44219650985089
6.45 4.45508924790213
6.46 4.46798198595337
6.47 4.48087472400461
6.48 4.49376746205585
6.49 4.5066602001071
6.5 4.51955293815834
6.51 4.53244567620958
6.52 4.54533841426082
6.53 4.55823115231206
6.54 4.5711238903633
6.55 4.58294964016647
6.56 4.59477538996963
6.57 4.6066011397728
6.58 4.61842688957597
6.59 4.63025263937913
6.6 4.6420783891823
6.61 4.65390413898547
6.62 4.66572988878863
6.63 4.6775556385918
6.64 4.68938138839496
6.65 4.70022841140841
6.66 4.71107543442185
6.67 4.72192245743529
6.68 4.73276948044873
6.69 4.74361650346217
6.7 4.75446352647562
6.71 4.76531054948906
6.72 4.7761575725025
6.73 4.78700459551594
6.74 4.79785161852938
6.75 4.80869864154282
6.76 4.81873166561097
6.77 4.82876468967912
6.78 4.83879771374726
6.79 4.84883073781541
6.8 4.85886376188356
6.81 4.8688967859517
6.82 4.87892981001985
6.83 4.888962834088
6.84 4.89899585815614
6.85 4.90827532214086
6.86 4.91755478612558
6.87 4.9268342501103
6.88 4.93611371409502
6.89 4.94539317807974
6.9 4.95467264206447
6.91 4.96395210604919
6.92 4.97323157003391
6.93 4.98251103401863
6.94 4.99179049800335
6.95 5.00106996198807
6.96 5.00956868680329
6.97 5.01806741161851
6.98 5.02656613643374
6.99 5.03506486124896
7 5.04356358606418
7.01 5.05206231087941
7.02 5.06056103569463
7.03 5.06905976050985
7.04 5.07755848532508
7.05 5.0860572101403
7.06 5.09383964690674
7.07 5.10162208367317
7.08 5.10940452043961
7.09 5.11718695720605
7.1 5.12496939397248
7.11 5.13275183073892
7.12 5.14053426750536
7.13 5.14831670427179
7.14 5.15609914103823
7.15 5.16388157780467
7.16 5.17166401457111
7.17 5.17878440249088
7.18 5.18590479041066
7.19 5.19302517833044
7.2 5.20014556625021
7.21 5.20726595416999
7.22 5.21438634208977
7.23 5.22150673000954
7.24 5.22862711792932
};
\addlegendentry{vehicle speed}
\addplot [very thick, green]
table {%
0 0.2
0.01 0.2
0.02 0.2
0.03 0.2
0.04 0.2
0.05 0.2
0.06 0.2
0.07 0.2
0.08 0.2
0.09 0.2
0.1 0.2
0.11 0.2
0.12 0.2
0.13 0.2
0.14 0.2
0.15 0.2
0.16 0.2
0.17 0.2
0.18 0.2
0.19 0.2
0.2 0.2
0.21 0.2
0.22 0.2
0.23 0.2
0.24 0.2
0.25 0.2
0.26 0.2
0.27 0.2
0.28 0.2
0.29 0.2
0.3 0.2
0.31 0.2
0.32 0.2
0.33 0.2
0.34 0.2
0.35 0.2
0.36 0.2
0.37 0.2
0.38 0.2
0.39 0.2
0.4 0.2
0.41 0.2
0.42 0.2
0.43 0.2
0.44 0.2
0.45 0.2
0.46 0.2
0.47 0.2
0.48 0.2
0.49 0.2
0.5 0.2
0.51 0.2
0.52 0.2
0.53 0.2
0.54 0.2
0.55 0.2
0.56 0.2
0.57 0.2
0.58 0.2
0.59 0.2
0.6 0.2
0.61 0.2
0.62 0.2
0.63 0.2
0.64 0.2
0.65 0.2
0.66 0.2
0.67 0.2
0.68 0.2
0.69 0.2
0.7 0.2
0.71 0.2
0.72 0.2
0.73 0.2
0.74 0.2
0.75 0.2
0.76 0.2
0.77 0.2
0.78 0.2
0.79 0.2
0.8 0.2
0.81 0.2
0.82 0.2
0.83 0.2
0.84 0.2
0.85 0.2
0.86 0.2
0.87 0.2
0.88 0.4
0.89 0.4
0.9 0.4
0.91 0.4
0.92 0.6
0.93 0.6
0.94 0.6
0.95 0.8
0.96 0.8
0.97 0.8
0.98 1
0.99 1
1 1
1.01 1
1.02 1
1.03 1
1.04 1
1.05 1
1.06 1
1.07 1
1.08 1
1.09 1
1.1 1
1.11 1
1.12 1
1.13 1
1.14 1
1.15 1
1.16 1
1.17 1
1.18 1
1.19 1
1.2 1
1.21 1
1.22 1
1.23 1
1.24 1
1.25 1
1.26 1
1.27 1
1.28 1
1.29 1
1.3 1
1.31 1
1.32 1
1.33 1
1.34 1
1.35 1
1.36 1
1.37 1
1.38 1
1.39 1
1.4 1
1.41 1
1.42 1
1.43 1
1.44 1
1.45 1
1.46 1
1.47 1
1.48 1
1.49 1
1.5 1
1.51 1
1.52 1
1.53 1
1.54 1
1.55 1
1.56 1
1.57 1
1.58 1
1.59 1
1.6 1
1.61 1
1.62 1
1.63 1
1.64 1
1.65 1
1.66 1
1.67 1
1.68 1
1.69 1
1.7 1
1.71 1
1.72 1
1.73 1
1.74 1
1.75 1
1.76 1
1.77 1
1.78 1
1.79 1
1.8 1
1.81 1
1.82 1
1.83 1
1.84 1
1.85 1
1.86 1
1.87 1
1.88 1
1.89 1
1.9 1
1.91 1
1.92 1
1.93 1
1.94 1
1.95 1
1.96 1
1.97 1
1.98 1
1.99 1
2 1
2.01 1
2.02 1
2.03 1
2.04 1
2.05 1
2.06 1
2.07 1
2.08 1
2.09 1
2.1 1
2.11 1
2.12 1
2.13 1
2.14 1
2.15 1
2.16 1
2.17 1
2.18 1
2.19 1
2.2 1
2.21 1
2.22 1
2.23 1
2.24 1
2.25 1
2.26 1
2.27 1
2.28 1
2.29 1
2.3 1
2.31 1
2.32 1
2.33 1
2.34 1
2.35 1
2.36 1
2.37 1
2.38 1
2.39 1
2.4 1
2.41 1
2.42 1
2.43 1
2.44 1
2.45 1
2.46 1
2.47 1
2.48 1
2.49 1
2.5 1
2.51 1
2.52 1
2.53 1
2.54 1
2.55 1
2.56 1
2.57 1
2.58 1
2.59 1
2.6 1
2.61 1
2.62 1
2.63 1
2.64 1
2.65 1
2.66 1
2.67 1
2.68 1
2.69 1
2.7 1
2.71 1
2.72 1
2.73 1
2.74 1
2.75 1
2.76 1
2.77 1
2.78 1
2.79 1
2.8 1
2.81 1
2.82 1
2.83 1
2.84 1
2.85 1
2.86 1
2.87 1
2.88 1
2.89 1
2.9 1
2.91 1
2.92 1
2.93 1
2.94 1
2.95 1
2.96 1
2.97 1
2.98 1
2.99 1
3 1
3.01 1
3.02 1
3.03 1
3.04 1
3.05 1
3.06 1
3.07 1
3.08 1
3.09 1
3.1 1
3.11 1
3.12 1
3.13 1
3.14 1
3.15 1
3.16 1
3.17 1
3.18 1
3.19 1
3.2 1
3.21 1
3.22 1
3.23 1
3.24 1
3.25 1
3.26 1
3.27 1
3.28 1
3.29 1
3.3 1
3.31 1
3.32 1
3.33 1
3.34 1
3.35 1
3.36 1
3.37 1
3.38 1
3.39 1
3.4 1
3.41 1
3.42 1
3.43 1
3.44 1
3.45 1
3.46 1
3.47 1
3.48 1
3.49 1
3.5 1
3.51 1
3.52 1
3.53 1
3.54 1
3.55 1
3.56 1
3.57 1
3.58 1
3.59 1
3.6 1
3.61 1
3.62 1
3.63 1
3.64 1
3.65 1
3.66 1
3.67 1
3.68 1
3.69 1
3.7 1
3.71 1
3.72 1
3.73 1
3.74 1
3.75 1
3.76 1
3.77 1
3.78 1
3.79 1
3.8 1
3.81 1
3.82 1
3.83 1
3.84 1
3.85 1
3.86 1
3.87 1
3.88 1
3.89 1
3.9 1
3.91 1
3.92 1
3.93 1
3.94 1
3.95 1
3.96 1
3.97 1
3.98 1
3.99 1
4 1
4.01 1
4.02 1
4.03 1
4.04 1
4.05 1
4.06 1
4.07 1
4.08 1
4.09 1
4.1 1
4.11 1
4.12 1
4.13 1
4.14 1
4.15 1
4.16 1
4.17 1
4.18 1
4.19 1
4.2 1
4.21 1
4.22 1
4.23 1
4.24 1
4.25 1
4.26 1
4.27 1
4.28 1
4.29 1
4.3 1
4.31 1
4.32 1
4.33 1
4.34 1
4.35 1
4.36 1
4.37 1
4.38 1
4.39 1
4.4 1
4.41 1
4.42 1
4.43 1
4.44 1
4.45 1
4.46 1
4.47 1
4.48 1
4.49 1
4.5 1
4.51 1
4.52 1
4.53 1
4.54 1
4.55 1
4.56 1
4.57 1
4.58 1
4.59 1
4.6 1
4.61 1
4.62 1
4.63 1
4.64 1
4.65 1
4.66 1
4.67 1
4.68 1
4.69 1
4.7 1
4.71 1
4.72 1
4.73 1
4.74 1
4.75 1
4.76 1
4.77 1
4.78 1
4.79 1
4.8 1
4.81 1
4.82 1
4.83 1
4.84 1
4.85 1
4.86 1
4.87 1
4.88 1
4.89 1
4.9 1
4.91 1
4.92 1
4.93 1
4.94 1
4.95 1
4.96 1
4.97 1
4.98 1
4.99 1
5 1
5.01 1
5.02 1
5.03 1
5.04 1
5.05 1
5.06 1
5.07 1
5.08 1
5.09 1
5.1 1
5.11 1
5.12 1
5.13 1
5.14 1
5.15 1
5.16 1
5.17 1
5.18 1
5.19 1
5.2 1
5.21 1
5.22 1
5.23 1
5.24 1
5.25 1
5.26 1
5.27 1
5.28 1
5.29 1
5.3 1
5.31 1
5.32 1
5.33 1
5.34 1
5.35 1
5.36 1
5.37 1
5.38 1
5.39 1
5.4 1
5.41 1
5.42 1
5.43 1
5.44 1
5.45 1
5.46 1
5.47 1
5.48 1
5.49 1
5.5 1
5.51 1
5.52 1
5.53 1
5.54 1
5.55 1
5.56 1
5.57 1
5.58 1
5.59 1
5.6 1
5.61 1
5.62 1
5.63 1
5.64 1
5.65 1
5.66 1
5.67 1
5.68 1
5.69 1
5.7 1
5.71 1
5.72 1
5.73 1
5.74 1
5.75 1
5.76 1
5.77 1
5.78 1
5.79 1
5.8 1
5.81 1
5.82 1
5.83 1
5.84 1
5.85 1
5.86 1
5.87 1
5.88 1
5.89 1
5.9 1
5.91 1
5.92 1
5.93 1
5.94 1
5.95 1
5.96 1
5.97 1
5.98 1
5.99 1
6 1
6.01 1
6.02 1
6.03 1
6.04 1
6.05 1
6.06 1
6.07 1
6.08 1
6.09 1
6.1 1
6.11 1
6.12 1
6.13 1
6.14 1
6.15 1
6.16 1
6.17 1
6.18 1
6.19 1
6.2 1
6.21 1
6.22 1
6.23 1
6.24 1
6.25 1
6.26 1
6.27 1
6.28 1
6.29 1
6.3 1
6.31 1
6.32 1
6.33 1
6.34 1
6.35 1
6.36 1
6.37 1
6.38 1
6.39 1
6.4 1
6.41 1
6.42 1
6.43 1
6.44 1
6.45 1
6.46 1
6.47 1
6.48 1
6.49 1
6.5 1
6.51 1
6.52 1
6.53 1
6.54 1
6.55 1
6.56 1
6.57 1
6.58 1
6.59 1
6.6 1
6.61 1
6.62 1
6.63 1
6.64 1
6.65 1
6.66 1
6.67 1
6.68 1
6.69 1
6.7 1
6.71 1
6.72 1
6.73 1
6.74 1
6.75 1
6.76 1
6.77 1
6.78 1
6.79 1
6.8 1
6.81 1
6.82 1
6.83 1
6.84 1
6.85 1
6.86 1
6.87 1
6.88 1
6.89 1
6.9 1
6.91 1
6.92 1
6.93 1
6.94 1
6.95 1
6.96 1
6.97 1
6.98 1
6.99 1
7 1
7.01 1
7.02 1
7.03 1
7.04 1
7.05 1
7.06 1
7.07 1
7.08 1
7.09 1
7.1 1
7.11 1
7.12 1
7.13 1
7.14 1
7.15 1
7.16 1
7.17 1
7.18 1
7.19 1
7.2 1
7.21 1
7.22 1
7.23 1
7.24 1
};
\addlegendentry{human speed}
\addplot [very thick, blue, dashed]
table {%
0 0.2
0.01 0.2
0.02 0.2
0.03 0.2
0.04 0.2
0.05 0.2
0.06 0.2
0.07 0.2
0.08 0.2
0.09 0.2
0.1 0.2
0.11 0.2
0.12 0.2
0.13 0.2
0.14 0.2
0.15 0.2
0.16 0.2
0.17 0.2
0.18 0.2
0.19 0.2
0.2 0.2
0.21 0.2
0.22 0.2
0.23 0.2
0.24 0.2
0.25 0.2
0.26 0.2
0.27 0.2
0.28 0.2
0.29 0.2
0.3 0.2
0.31 0.2
0.32 0.2
0.33 0.2
0.34 0.2
0.35 0.2
0.36 0.8
0.37 0.8
0.38 0.8
0.39 0.8
0.4 0.8
0.41 0.8
0.42 0.8
0.43 0.8
0.44 0.8
0.45 0.8
0.46 0.8
0.47 0.8
0.48 0.8
0.49 0.8
0.5 0.8
0.51 0.8
0.52 0.8
0.53 0.8
0.54 0.8
0.55 0.8
0.56 0.8
0.57 0.8
0.58 0.8
0.59 0.8
0.6 0.8
0.61 0.8
0.62 0.8
0.63 0.8
0.64 0.8
0.65 0.8
0.66 0.8
0.67 0.8
0.68 0.8
0.69 0.8
0.7 0.8
0.71 0.8
0.72 0.8
0.73 0.8
0.74 0.8
0.75 0.8
0.76 0.8
0.77 0.8
0.78 0.8
0.79 0.8
0.8 0.8
0.81 0.8
0.82 0.8
0.83 0.8
0.84 0.8
0.85 0.8
0.86 0.8
0.87 0.8
0.88 0.8
0.89 0.8
0.9 0.8
0.91 0.8
0.92 0.8
0.93 0.8
0.94 0.8
0.95 0.8
0.96 0.8
0.97 0.8
0.98 0.8
0.99 0.8
1 0.8
1.01 0.8
1.02 0.8
1.03 0.8
1.04 0.8
1.05 0.8
1.06 0.8
1.07 0.8
1.08 0.8
1.09 0.8
1.1 0.8
1.11 0.8
1.12 0.8
1.13 0.8
1.14 0.8
1.15 0.8
1.16 0.8
1.17 0.8
1.18 0.8
1.19 0.8
1.2 0.8
1.21 0.8
1.22 0.8
1.23 0.8
1.24 0.8
1.25 0.8
1.26 0.8
1.27 0.8
1.28 0.8
1.29 0.8
1.3 0.8
1.31 0.8
1.32 0.8
1.33 0.8
1.34 0.8
1.35 0.8
1.36 0.8
1.37 0.8
1.38 0.8
1.39 0.8
1.4 0.8
1.41 0.8
1.42 0.8
1.43 0.8
1.44 0.8
1.45 0.8
1.46 0.8
1.47 0.8
1.48 0.8
1.49 0.8
1.5 0.8
1.51 0.8
1.52 0.8
1.53 0.8
1.54 0.8
1.55 0.8
1.56 0.8
1.57 0.8
1.58 0.8
1.59 0.8
1.6 0.8
1.61 0.8
1.62 0.8
1.63 0.8
1.64 0.8
1.65 0.8
1.66 0.8
1.67 0.8
1.68 0.8
1.69 0.8
1.7 0.8
1.71 0.8
1.72 0.8
1.73 0.8
1.74 0.8
1.75 0.8
1.76 0.8
1.77 0.8
1.78 0.8
1.79 0.8
1.8 0.8
1.81 0.8
1.82 0.8
1.83 0.8
1.84 0.8
1.85 0.8
1.86 0.8
1.87 0.8
1.88 0.8
1.89 0.8
1.9 0.8
1.91 0.8
1.92 0.8
1.93 0.8
1.94 0.8
1.95 0.8
1.96 0.8
1.97 0.8
1.98 0.8
1.99 0.8
2 0.8
2.01 0.8
2.02 0.8
2.03 0.8
2.04 0.8
2.05 0.8
2.06 0.8
2.07 0.8
2.08 0.8
2.09 0.8
2.1 0.8
2.11 0.8
2.12 0.8
2.13 0.8
2.14 0.8
2.15 0.8
2.16 0.8
2.17 0.8
2.18 0.8
2.19 0.8
2.2 0.8
2.21 0.8
2.22 0.8
2.23 0.8
2.24 0.8
2.25 0.8
2.26 0.8
2.27 0.8
2.28 0.8
2.29 0.8
2.3 0.8
2.31 0.8
2.32 0.8
2.33 0.8
2.34 0.8
2.35 0.8
2.36 0.8
2.37 0.8
2.38 0.8
2.39 0.8
2.4 0.8
2.41 0.8
2.42 0.8
2.43 0.8
2.44 0.8
2.45 0.8
2.46 0.8
2.47 0.8
2.48 0.8
2.49 0.8
2.5 0.8
2.51 0.8
2.52 0.8
2.53 0.8
2.54 0.8
2.55 0.8
2.56 0.8
2.57 0.8
2.58 0.8
2.59 0.8
2.6 0.8
2.61 0.8
2.62 0.8
2.63 0.8
2.64 0.8
2.65 0.8
2.66 0.8
2.67 0.8
2.68 0.8
2.69 0.8
2.7 0.8
2.71 0.8
2.72 0.8
2.73 0.8
2.74 0.8
2.75 0.8
2.76 0.8
2.77 0.8
2.78 0.8
2.79 0.8
2.8 0.8
2.81 0.8
2.82 0.8
2.83 0.8
2.84 0.8
2.85 0.8
2.86 0.8
2.87 0.8
2.88 0.8
2.89 0.8
2.9 0.8
2.91 0.8
2.92 0.8
2.93 0.8
2.94 0.8
2.95 0.8
2.96 0.8
2.97 0.8
2.98 0.8
2.99 0.8
3 0.8
3.01 0.8
3.02 0.8
3.03 0.8
3.04 0.8
3.05 0.8
3.06 0.8
3.07 0.8
3.08 0.8
3.09 0.8
3.1 0.8
3.11 0.8
3.12 0.8
3.13 0.8
3.14 0.8
3.15 0.8
3.16 0.8
3.17 0.8
3.18 0.8
3.19 0.8
3.2 0.8
3.21 0.8
3.22 0.8
3.23 0.8
3.24 0.8
3.25 0.8
3.26 0.8
3.27 0.8
3.28 0.8
3.29 0.8
3.3 0.8
3.31 0.8
3.32 0.8
3.33 0.8
3.34 0.8
3.35 0.8
3.36 0.8
3.37 0.8
3.38 0.8
3.39 0.8
3.4 0.8
3.41 0.8
3.42 0.8
3.43 0.8
3.44 0.8
3.45 0.8
3.46 0.8
3.47 0.8
3.48 0.8
3.49 0.8
3.5 0.8
3.51 0.8
3.52 0.8
3.53 0.8
3.54 0.8
3.55 0.8
3.56 0.8
3.57 0.8
3.58 0.8
3.59 0.8
3.6 0.8
3.61 0.8
3.62 0.8
3.63 0.8
3.64 0.8
3.65 0.8
3.66 0.8
3.67 0.8
3.68 0.8
3.69 0.8
3.7 0.8
3.71 0.8
3.72 0.8
3.73 0.8
3.74 0.8
3.75 0.8
3.76 0.8
3.77 0.8
3.78 0.8
3.79 0.8
3.8 0.8
3.81 0.8
3.82 0.8
3.83 0.8
3.84 0.8
3.85 0.8
3.86 0.8
3.87 0.8
3.88 0.8
3.89 0.8
3.9 0.8
3.91 0.8
3.92 0.8
3.93 0.8
3.94 0.8
3.95 0.8
3.96 0.8
3.97 0.8
3.98 0.8
3.99 0.8
4 0.8
4.01 0.8
4.02 0.8
4.03 0.8
4.04 0.8
4.05 0.8
4.06 0.8
4.07 0.8
4.08 0.8
4.09 0.8
4.1 0.8
4.11 0.8
4.12 0.8
4.13 0.8
4.14 0.8
4.15 0.8
4.16 0.8
4.17 0.8
4.18 0.8
4.19 0.8
4.2 0.8
4.21 0.8
4.22 0.8
4.23 0.8
4.24 0.8
4.25 0.8
4.26 0.8
4.27 0.8
4.28 0.8
4.29 0.8
4.3 0.8
4.31 0.8
4.32 0.8
4.33 0.8
4.34 0.8
4.35 0.8
4.36 0.8
4.37 0.8
4.38 0.8
4.39 0.8
4.4 0.8
4.41 0.8
4.42 0.8
4.43 0.8
4.44 0.8
4.45 0.8
4.46 0.8
4.47 0.8
4.48 0.8
4.49 0.8
4.5 0.8
4.51 0.8
4.52 0.8
4.53 0.8
4.54 0.8
4.55 0.8
4.56 0.8
4.57 0.8
4.58 0.8
4.59 0.8
4.6 0.8
4.61 0.8
4.62 0.8
4.63 0.8
4.64 0.8
4.65 0.8
4.66 0.8
4.67 0.8
4.68 0.8
4.69 0.8
4.7 0.8
4.71 0.8
4.72 0.8
4.73 0.8
4.74 0.8
4.75 0.8
4.76 0.8
4.77 0.8
4.78 0.8
4.79 0.8
4.8 0.8
4.81 0.8
4.82 0.8
4.83 0.8
4.84 0.8
4.85 0.8
4.86 0.8
4.87 0.8
4.88 0.8
4.89 0.8
4.9 0.8
4.91 0.8
4.92 0.8
4.93 0.8
4.94 0.8
4.95 0.8
4.96 0.8
4.97 0.8
4.98 0.8
4.99 0.8
5 0.8
5.01 0.8
5.02 0.8
5.03 0.8
5.04 0.8
5.05 0.8
5.06 0.8
5.07 0.8
5.08 0.8
5.09 0.8
5.1 0.8
5.11 0.8
5.12 0.8
5.13 0.8
5.14 0.8
5.15 0.8
5.16 0.8
5.17 0.8
5.18 0.8
5.19 0.8
5.2 0.8
5.21 0.8
5.22 0.8
5.23 0.8
5.24 0.8
5.25 0.8
5.26 0.8
5.27 0.8
5.28 0.8
5.29 0.8
5.3 0.8
5.31 0.8
5.32 0.8
5.33 0.8
5.34 0.8
5.35 0.8
5.36 0.8
5.37 0.8
5.38 0.8
5.39 0.8
5.4 0.8
5.41 0.8
5.42 0.8
5.43 0.8
5.44 0.8
5.45 0.8
5.46 0.8
5.47 0.8
5.48 0.8
5.49 0.8
5.5 0.8
5.51 0.8
5.52 0.8
5.53 0.8
5.54 0.8
5.55 0.8
5.56 0.8
5.57 0.8
5.58 0.8
5.59 0.8
5.6 0.8
5.61 0.8
5.62 0.8
5.63 0.8
5.64 0.8
5.65 0.8
5.66 0.8
5.67 0.8
5.68 0.8
5.69 0.8
5.7 0.8
5.71 0.8
5.72 0.8
5.73 0.8
5.74 0.8
5.75 0.8
5.76 0.8
5.77 0.8
5.78 0.8
5.79 0.8
5.8 0.8
5.81 0.8
5.82 0.8
5.83 0.8
5.84 0.8
5.85 0.8
5.86 0.8
5.87 0.8
5.88 0.8
5.89 0.8
5.9 0.8
5.91 0.8
5.92 0.8
5.93 0.8
5.94 0.8
5.95 0.8
5.96 0.8
5.97 0.8
5.98 0.8
5.99 0.8
6 0.8
6.01 0.8
6.02 0.8
6.03 0.8
6.04 0.8
6.05 0.8
6.06 0.8
6.07 0.8
6.08 0.8
6.09 0.8
6.1 0.8
6.11 0.8
6.12 0.8
6.13 0.8
6.14 0.8
6.15 0.8
6.16 0.8
6.17 0.8
6.18 0.8
6.19 0.8
6.2 0.8
6.21 0.8
6.22 0.8
6.23 0.8
6.24 0.8
6.25 0.8
6.26 0.8
6.27 0.8
6.28 0.8
6.29 0.8
6.3 0.8
6.31 0.8
6.32 0.8
6.33 0.8
6.34 0.8
6.35 0.8
6.36 0.8
6.37 0.8
6.38 0.8
6.39 0.8
6.4 0.8
6.41 0.8
6.42 0.8
6.43 0.8
6.44 0.8
6.45 0.8
6.46 0.8
6.47 0.8
6.48 0.8
6.49 0.8
6.5 0.8
6.51 0.8
6.52 0.8
6.53 0.8
6.54 0.8
6.55 0.8
6.56 0.8
6.57 0.8
6.58 0.8
6.59 0.8
6.6 0.8
6.61 0.8
6.62 0.8
6.63 0.8
6.64 0.8
6.65 0.8
6.66 0.8
6.67 0.8
6.68 0.8
6.69 0.8
6.7 0.8
6.71 0.8
6.72 0.8
6.73 0.8
6.74 0.8
6.75 0.8
6.76 0.8
6.77 0.8
6.78 0.8
6.79 0.8
6.8 0.8
6.81 0.8
6.82 0.8
6.83 0.8
6.84 0.8
6.85 0.8
6.86 0.8
6.87 0.8
6.88 0.8
6.89 0.8
6.9 0.8
6.91 0.8
6.92 0.8
6.93 0.8
6.94 0.8
6.95 0.8
6.96 0.8
6.97 0.8
6.98 0.8
6.99 0.8
7 0.8
7.01 0.8
7.02 0.8
7.03 0.8
7.04 0.8
7.05 0.8
7.06 0.8
7.07 0.8
7.08 0.8
7.09 0.8
7.1 0.8
7.11 0.8
7.12 0.8
7.13 0.8
7.14 0.8
7.15 0.8
7.16 0.8
7.17 0.8
7.18 0.8
7.19 0.8
7.2 0.8
7.21 0.8
7.22 0.8
7.23 0.8
7.24 0.8
};
\addlegendentry{human intention}
\end{axis}

\end{tikzpicture}
