% This file was created with tikzplotlib v0.10.1.
\begin{tikzpicture}

\definecolor{darkgray176}{RGB}{176,176,176}
\definecolor{green}{RGB}{0,128,0}
\definecolor{green01270}{RGB}{0,127,0}
\definecolor{lightgray204}{RGB}{204,204,204}

\begin{axis}[
legend cell align={left},
legend style={
  fill opacity=0.8,
  draw opacity=1,
  text opacity=1,
  at={(0.97,0.03)},
  anchor=south east,
  draw=lightgray204
},
tick align=outside,
tick pos=left,
title={Pedestrian and vehicle's distance to intersection},
x grid style={darkgray176},
xlabel={Time in s},
xmajorgrids,
xmin=-0.4085, xmax=8.5785,
xtick style={color=black},
y grid style={darkgray176},
ylabel={Distance in m},
ymajorgrids,
ymin=-12.5233111868519, ymax=8.20330305978767,
ytick style={color=black}
]
\addplot [thick, red]
table {%
0 -11.520024953451
0.01 -11.4600246981586
0.02 -11.4000243918076
0.03 -11.3400240343982
0.04 -11.2800236259303
0.05 -11.2200231664038
0.06 -11.1600226558189
0.07 -11.1000220941755
0.08 -11.0400215352321
0.09 -10.9800209789886
0.1 -10.9200204254451
0.11 -10.8600198746016
0.12 -10.800019326458
0.13 -10.7400187810144
0.14 -10.6800182382708
0.15 -10.6200176982271
0.16 -10.5600171608834
0.17 -10.5000166262397
0.18 -10.4400160942959
0.19 -10.3800155703518
0.2 -10.3200150544073
0.21 -10.2600145464624
0.22 -10.2000140465172
0.23 -10.1400135545716
0.24 -10.0800130706257
0.25 -10.0200125946794
0.26 -9.96001212673276
0.27 -9.90001166483989
0.28 -9.8400112090008
0.29 -9.78001075921548
0.3 -9.72001031548394
0.31 -9.66000987780617
0.32 -9.60000944618218
0.33 -9.54000902061197
0.34 -9.48000860109553
0.35 -9.42000818763287
0.36 -9.36000778022399
0.37 -9.30000737886888
0.38 -9.24000698356755
0.39 -9.18000660009115
0.4 -9.12000622843966
0.41 -9.0600058686131
0.42 -9.00000552061147
0.43 -8.94000518443475
0.44 -8.88000486008296
0.45 -8.8200045475561
0.46 -8.76000424685415
0.47 -8.70000394275638
0.48 -8.64000363526279
0.49 -8.58000332437338
0.5 -8.52000301008815
0.51 -8.46000269240709
0.52 -8.40000237133021
0.53 -8.34000204685751
0.54 -8.28000171898898
0.55 -8.22000138772464
0.56 -8.16000105306447
0.57 -8.10000071500848
0.58 -8.0400003682335
0.59 -7.98000001273953
0.6 -7.91999964852658
0.61 -7.85999927559463
0.62 -7.79999889394369
0.63 -7.73999850357377
0.64 -7.67999810448486
0.65 -7.61999769667696
0.66 -7.55999728015007
0.67 -7.4999968549042
0.68 -7.43999643577829
0.69 -7.37999602277236
0.7 -7.3199956158864
0.71 -7.25999521512041
0.72 -7.19999482047439
0.73 -7.13999443194834
0.74 -7.07999404954226
0.75 -7.01999367325616
0.76 -6.95999330309003
0.77 -6.89999294550257
0.78 -6.83999260049377
0.79 -6.77999226806365
0.8 -6.7199919482122
0.81 -6.65999164093942
0.82 -6.5999913462453
0.83 -6.53999107670853
0.84 -6.47999081975043
0.85 -6.41999058794966
0.86 -6.35999036872757
0.87 -6.29999014815345
0.88 -6.23998991364865
0.89 -6.17998967914385
0.9 -6.11998943070837
0.91 -6.05998916834219
0.92 -5.99998889204533
0.93 -5.93998860181778
0.94 -5.87998829765954
0.95 -5.81998793401813
0.96 -5.75998751089354
0.97 -5.69998702828578
0.98 -5.63998648619484
0.99 -5.57998588462072
1 -5.51998522356342
1.01 -5.45998450302296
1.02 -5.39998372299932
1.03 -5.3399828834925
1.04 -5.27998198450251
1.05 -5.21998102602934
1.06 -5.15997997353632
1.07 -5.09997882702347
1.08 -5.03997758649077
1.09 -4.97997625193823
1.1 -4.91997482336585
1.11 -4.85997330077362
1.12 -4.79997168416156
1.13 -4.73996997352965
1.14 -4.67996816887789
1.15 -4.6199662883745
1.16 -4.55996433201948
1.17 -4.49996229981281
1.18 -4.43996019175452
1.19 -4.37995800784458
1.2 -4.319955748083
1.21 -4.25995341246979
1.22 -4.19995100100494
1.23 -4.13994851368845
1.24 -4.07994595052033
1.25 -4.01994331150056
1.26 -3.95994059662917
1.27 -3.89993785331313
1.28 -3.83993508155246
1.29 -3.77993228134715
1.3 -3.7199294526972
1.31 -3.65992659560261
1.32 -3.59992371006339
1.33 -3.53992079607952
1.34 -3.47991785365102
1.35 -3.41991489933213
1.36 -3.35991193312287
1.37 -3.29990895502324
1.38 -3.23990596503323
1.39 -3.17990296315284
1.4 -3.11989994938208
1.41 -3.05989692372094
1.42 -2.99989388616943
1.43 -2.93989083672754
1.44 -2.87988777539528
1.45 -2.81988465290647
1.46 -2.75988146926112
1.47 -2.69987822445922
1.48 -2.63987491850078
1.49 -2.57987155138579
1.5 -2.51986812311426
1.51 -2.45986463368619
1.52 -2.39986108310157
1.53 -2.3398574713604
1.54 -2.2798537984627
1.55 -2.21985006440845
1.56 -2.15984618029842
1.57 -2.09984214613263
1.58 -2.03983796191106
1.59 -1.97983362763372
1.6 -1.91982914330062
1.61 -1.85982450891174
1.62 -1.79981972446708
1.63 -1.73981478996666
1.64 -1.67980970541046
1.65 -1.61980443341288
1.66 -1.5597989739739
1.67 -1.49979332709354
1.68 -1.43978749277179
1.69 -1.37978147100865
1.7 -1.31977526180412
1.71 -1.2597688651582
1.72 -1.19976228107089
1.73 -1.13975550954219
1.74 -1.07974855057211
1.75 -1.01974144165848
1.76 -0.95973418280132
1.77 -0.899726774000619
1.78 -0.83971921525638
1.79 -0.779711506568603
1.8 -0.719703647937294
1.81 -0.659695639362447
1.82 -0.599687480844061
1.83 -0.539679172382137
1.84 -0.479670713976674
1.85 -0.419662168637579
1.86 -0.359653536364853
1.87 -0.299644817158487
1.88 -0.23963601101849
1.89 -0.179627117944861
1.9 -0.119618137937593
1.91 -0.059609070996693
1.92 0.00040008287783877
1.93 0.0604093236860095
1.94 0.120418651427812
1.95 0.180428066103246
1.96 0.24043756771232
1.97 0.300447101052235
1.98 0.360456666123
1.99 0.420466262924613
2 0.480475891457068
2.01 0.540485551720373
2.02 0.600495243714519
2.03 0.66050486212017
2.04 0.720514406937319
2.05 0.780523878165965
2.06 0.840533275806109
2.07 0.900542599857751
2.08 0.96055185032089
2.09 1.02056102719553
2.1 1.08057013048166
2.11 1.14057916017929
2.12 1.20058811628842
2.13 1.26059699880905
2.14 1.32060580935668
2.15 1.38061454793132
2.16 1.44062321453296
2.17 1.50063180916162
2.18 1.56064033181728
2.19 1.62064878249996
2.2 1.68065708923664
2.21 1.74066532400033
2.22 1.80067348679103
2.23 1.86068158268365
2.24 1.92068961167816
2.25 1.98069757377459
2.26 2.04070546897293
2.27 2.10071329727317
2.28 2.16072105867533
2.29 2.22072875317939
2.3 2.28073638078536
2.31 2.34074394149324
2.32 2.40075143530303
2.33 2.46075886816924
2.34 2.52076624009187
2.35 2.58077355107092
2.36 2.64078080110639
2.37 2.70078799019829
2.38 2.76079511834661
2.39 2.82080218555136
2.4 2.88080919181252
2.41 2.94081613713011
2.42 3.00082302150413
2.43 3.06082984991461
2.44 3.12083662236158
2.45 3.18084333884502
2.46 3.24084999936495
2.47 3.30085660392135
2.48 3.36086315251423
2.49 3.42086964514358
2.5 3.48087608180941
2.51 3.54088246251172
2.52 3.60088878725051
2.53 3.66089506057629
2.54 3.72090128248905
2.55 3.78090745298881
2.56 3.84091357207554
2.57 3.90091963974927
2.58 3.96092565600998
2.59 4.02093162085768
2.6 4.08093753429237
2.61 4.14094339631406
2.62 4.20094920692273
2.63 4.26095497029775
2.64 4.32096054473814
2.65 4.3809660719449
2.66 4.440971551918
2.67 4.50097698465744
2.68 4.56098237016323
2.69 4.62098771336873
2.7 4.68099301427394
2.71 4.74099827287885
2.72 4.80100348918347
2.73 4.8610086631878
2.74 4.92101379489183
2.75 4.98101888429558
2.76 5.04102393139904
2.77 5.1010289362022
2.78 5.16103389870507
2.79 5.22103881890764
2.8 5.28104370015127
2.81 5.34104854243597
2.82 5.40105334576172
2.83 5.46105811012853
2.84 5.5210628355364
2.85 5.58106752198532
2.86 5.64107216947529
2.87 5.70107677800634
2.88 5.76108134757844
2.89 5.8210858781916
2.9 5.88109037293046
2.91 5.94109483179501
2.92 6.00109925478527
2.93 6.06110364190123
2.94 6.12110799314289
2.95 6.18111230851025
2.96 6.24111658800331
2.97 6.30112083162207
2.98 6.36112503936654
2.99 6.4211292140773
3 6.48113335575435
3.01 6.54113746439769
3.02 6.60114154000733
3.03 6.66114558258326
3.04 6.72114959212549
3.05 6.78115356863401
3.06 6.84115751210882
3.07 6.90116142254993
3.08 6.96116529995733
3.09 7.02116914692478
3.1 7.08117296345226
3.11 7.14117674953978
3.12 7.20118050518735
3.13 7.26118423039496
};
\addlegendentry{vehicle_distance_to_intersection(MPC)}
\addplot [thick, green]
table {%
0 -3.45148500897959
0.01 -3.44835076571428
0.02 -3.44520588408163
0.03 -3.44205029294647
0.04 -3.4388839558344
0.05 -3.43569609029411
0.06 -3.43249740558421
0.07 -3.42928786486136
0.08 -3.4260783241385
0.09 -3.42284688667194
0.1 -3.41960444506575
0.11 -3.41635099931994
0.12 -3.41309755357413
0.13 -3.40983302861415
0.14 -3.40655738671152
0.15 -3.40325943546663
0.16 -3.39995029156473
0.17 -3.39664114766284
0.18 -3.39332077298871
0.19 -3.38998909105316
0.2 -3.38664606348139
0.21 -3.38329169027337
0.22 -3.37992593292362
0.23 -3.37654875266438
0.24 -3.37316011059631
0.25 -3.36975996782011
0.26 -3.36634828530442
0.27 -3.36292502388498
0.28 -3.35949014426417
0.29 -3.35604360701098
0.3 -3.3525853725606
0.31 -3.34911540121392
0.32 -3.34563365313711
0.33 -3.34214008836115
0.34 -3.33863466678136
0.35 -3.33511734815695
0.36 -3.33158809211056
0.37 -3.3280468581278
0.38 -3.32449360555676
0.39 -3.32092829360758
0.4 -3.31735088135196
0.41 -3.31376132772269
0.42 -3.31015959151317
0.43 -3.30654563137697
0.44 -3.30291940582732
0.45 -3.29928087323665
0.46 -3.29562999183613
0.47 -3.29196671971513
0.48 -3.28829101482083
0.49 -3.28460283495764
0.5 -3.28090213778679
0.51 -3.27718888082581
0.52 -3.27346302144806
0.53 -3.2697245168822
0.54 -3.26597332421175
0.55 -3.26220940037458
0.56 -3.2584327021624
0.57 -3.25465600395022
0.58 -3.25085362677609
0.59 -3.24703834472023
0.6 -3.24322306266438
0.61 -3.23938188324935
0.62 -3.23552766711258
0.63 -3.23167345097581
0.64 -3.227806153872
0.65 -3.22391260604314
0.66 -3.22001905821428
0.67 -3.21611229593009
0.68 -3.21219231919058
0.69 -3.20825908314671
0.7 -3.204312497796
0.71 -3.20035256313845
0.72 -3.19637923386735
0.73 -3.19239246467601
0.74 -3.18839221010394
0.75 -3.1843784243821
0.76 -3.18035106174143
0.77 -3.17631007625755
0.78 -3.17225542185072
0.79 -3.16818705228537
0.8 -3.16410492116896
0.81 -3.16000898195207
0.82 -3.15589918792782
0.83 -3.15176154353565
0.84 -3.14760990326538
0.85 -3.14343012905256
0.86 -3.13923616863039
0.87 -3.13501364335857
0.88 -3.13077673879388
0.89 -3.12653983422918
0.9 -3.12228845243498
0.91 -3.11802254411085
0.92 -3.11374210925678
0.93 -3.10944709823655
0.94 -3.10513746124493
0.95 -3.10081314847667
0.96 -3.09647410995634
0.97 -3.09212029553775
0.98 -3.08775165490396
0.99 -3.08336813756667
1 -3.07896969286565
1.01 -3.07455626996818
1.02 -3.07012781786841
1.03 -3.06568428538681
1.04 -3.06122562116956
1.05 -3.05675177368796
1.06 -3.05226269123786
1.07 -3.04775832193901
1.08 -3.04323861373451
1.09 -3.03870351439019
1.1 -3.03415297149398
1.11 -3.02958693245535
1.12 -3.02502089341673
1.13 -3.02042370360471
1.14 -3.0158108588017
1.15 -3.01119801399869
1.16 -3.00656951420469
1.17 -3.00192525261705
1.18 -2.99726517556151
1.19 -2.99258928303808
1.2 -2.9878975213725
1.21 -2.98318983652432
1.22 -2.97846617426911
1.23 -2.97372648038238
1.24 -2.96897070045566
1.25 -2.96419877989517
1.26 -2.95941066392124
1.27 -2.95460629756827
1.28 -2.94978562568411
1.29 -2.94494859292947
1.3 -2.9400951437772
1.31 -2.93522522251172
1.32 -2.93033877322835
1.33 -2.92543573983268
1.34 -2.92051606603992
1.35 -2.91557969537424
1.36 -2.91062657116817
1.37 -2.90565663656188
1.38 -2.90066983450259
1.39 -2.89566610774387
1.4 -2.89064539884502
1.41 -2.88560765017037
1.42 -2.88055280388867
1.43 -2.87548080197236
1.44 -2.87039158619697
1.45 -2.86528509814041
1.46 -2.86016127918232
1.47 -2.85502007050336
1.48 -2.84986141308461
1.49 -2.84468524770681
1.5 -2.83949151494972
1.51 -2.83428015519144
1.52 -2.82905110860773
1.53 -2.8238043151713
1.54 -2.81853971465113
1.55 -2.81325724661178
1.56 -2.80795685041273
1.57 -2.8026384652076
1.58 -2.79730202994355
1.59 -2.7919474833605
1.6 -2.78657476399049
1.61 -2.78118381015692
1.62 -2.77577455997387
1.63 -2.77034695134539
1.64 -2.76490092196479
1.65 -2.75945489258418
1.66 -2.75399037993329
1.67 -2.74850732128177
1.68 -2.74300565368639
1.69 -2.73748531399027
1.7 -2.73194630219341
1.71 -2.72638855492461
1.72 -2.72081200859758
1.73 -2.71521659941022
1.74 -2.7096022633439
1.75 -2.70396893637999
1.76 -2.69831655428259
1.77 -2.69264505259778
1.78 -2.6869543666529
1.79 -2.68124443155579
1.8 -2.67551518219481
1.81 -2.66976655323807
1.82 -2.66399847913269
1.83 -2.65821089410407
1.84 -2.65240373215512
1.85 -2.6465769270655
1.86 -2.64073041239089
1.87 -2.6348641214622
1.88 -2.62897798738484
1.89 -2.62307194303795
1.9 -2.6171459210736
1.91 -2.61119985391608
1.92 -2.6052336737611
1.93 -2.59924731257499
1.94 -2.59324070209398
1.95 -2.58721377382337
1.96 -2.5811664590368
1.97 -2.57509868877541
1.98 -2.56901039384709
1.99 -2.5629015048257
2 -2.55677195205024
2.01 -2.55062166562408
2.02 -2.54445057541416
2.03 -2.53825861105021
2.04 -2.5320457019239
2.05 -2.52581177718807
2.06 -2.51955676575593
2.07 -2.5132805963002
2.08 -2.50698319725237
2.09 -2.50066449680183
2.1 -2.49432442289504
2.11 -2.48796290323478
2.12 -2.48157986527924
2.13 -2.47517523624125
2.14 -2.46874894308742
2.15 -2.46230091253735
2.16 -2.45583107106273
2.17 -2.44933934488654
2.18 -2.44282565998222
2.19 -2.43628994207281
2.2 -2.42970993431645
2.21 -2.42310766921321
2.22 -2.416483071476
2.23 -2.40983606556311
2.24 -2.40316649962362
2.25 -2.39647429734664
2.26 -2.38975938216313
2.27 -2.38302167724506
2.28 -2.37626110524377
2.29 -2.36947758854896
2.3 -2.3626710492878
2.31 -2.35584140932407
2.32 -2.34898859025634
2.33 -2.34211251341707
2.34 -2.33521309987178
2.35 -2.32829027041803
2.36 -2.32134394558462
2.37 -2.31437404563063
2.38 -2.30738049054447
2.39 -2.30036320004305
2.4 -2.29332209357077
2.41 -2.28625709029864
2.42 -2.27916810912336
2.43 -2.27205506866637
2.44 -2.26494202820937
2.45 -2.2578048468159
2.46 -2.25064344255407
2.47 -2.24345773321392
2.48 -2.23624763630649
2.49 -2.22901315183178
2.5 -2.22175419702086
2.51 -2.2144706888239
2.52 -2.20716254390921
2.53 -2.19982967866226
2.54 -2.19247200946854
2.55 -2.18508945242976
2.56 -2.17768192336287
2.57 -2.17024933779913
2.58 -2.16279161098311
2.59 -2.15530865787272
2.6 -2.14780039313819
2.61 -2.14026673116115
2.62 -2.13270758603361
2.63 -2.12512287155698
2.64 -2.11743501185195
2.65 -2.10972114741158
2.66 -2.10198092459507
2.67 -2.09421425424334
2.68 -2.08642104598481
2.69 -2.07860120914221
2.7 -2.07075465272845
2.71 -2.06288128544551
2.72 -2.05498101568343
2.73 -2.04705375151924
2.74 -2.03909940071587
2.75 -2.03111787072108
2.76 -2.02310906866639
2.77 -2.01507290136601
2.78 -2.00700927531572
2.79 -1.99891809669183
2.8 -1.99079927135006
2.81 -1.98265270482443
2.82 -1.9744783023262
2.83 -1.96627596874274
2.84 -1.95804560863643
2.85 -1.94978712624355
2.86 -1.94150042547316
2.87 -1.93318540990599
2.88 -1.92484198279333
2.89 -1.91647004705586
2.9 -1.90806950528258
2.91 -1.89964025972963
2.92 -1.89118221231917
2.93 -1.88269526463825
2.94 -1.87417931793763
2.95 -1.86563427313067
2.96 -1.85706003079217
2.97 -1.84845649115719
2.98 -1.83982355411991
2.99 -1.83116111923245
3 -1.82246908570372
3.01 -1.81374735239823
3.02 -1.80499581783493
3.03 -1.796214380186
3.04 -1.78740293727573
3.05 -1.77856138657922
3.06 -1.76968962522131
3.07 -1.76078754997529
3.08 -1.75185505726177
3.09 -1.7428920431474
3.1 -1.73389840334372
3.11 -1.72487403320594
3.12 -1.71581882773169
3.13 -1.70673268155983
};
\addlegendentry{pedestrian_distance_to_intersection(MPC)}
\addplot [thick, red, dashed]
table {%
0 -11.5811923574592
0.01 -11.5219582555058
0.02 -11.4631077961067
0.03 -11.4046409792618
0.04 -11.3465578049713
0.05 -11.288858273235
0.06 -11.231542384053
0.07 -11.1746101374253
0.08 -11.1180615333518
0.09 -11.0618965718327
0.1 -11.0061174757396
0.11 -10.9507242450726
0.12 -10.8957168798316
0.13 -10.8410953800167
0.14 -10.7868597456279
0.15 -10.7330099766651
0.16 -10.6795460731284
0.17 -10.6264680350178
0.18 -10.5737758623332
0.19 -10.5214695550747
0.2 -10.4695488934441
0.21 -10.4180138774416
0.22 -10.366864507067
0.23 -10.3161007823204
0.24 -10.2657227032017
0.25 -10.2157302697111
0.26 -10.1661234818484
0.27 -10.1169023396137
0.28 -10.0680668430069
0.29 -10.0196169920282
0.3 -9.97155248784355
0.31 -9.92387333045305
0.32 -9.87657951985668
0.33 -9.82967105605443
0.34 -9.78314793904631
0.35 -9.73701016883232
0.36 -9.69125774541246
0.37 -9.64589066878673
0.38 -9.60090893895512
0.39 -9.55631255591764
0.4 -9.51210115496539
0.41 -9.46827473609837
0.42 -9.42483329931658
0.43 -9.38177684462002
0.44 -9.33910537200868
0.45 -9.29681888148257
0.46 -9.25491737304169
0.47 -9.21340084668604
0.48 -9.17226930241562
0.49 -9.13152274023042
0.5 -9.09116057731624
0.51 -9.05118281367307
0.52 -9.01158944930091
0.53 -8.97238048419975
0.54 -8.93355591836961
0.55 -8.89511575181049
0.56 -8.85705998452237
0.57 -8.81938861650526
0.58 -8.78210164775917
0.59 -8.74519907828409
0.6 -8.70867998835651
0.61 -8.67254437797643
0.62 -8.63679224714384
0.63 -8.60142359585876
0.64 -8.56643842412118
0.65 -8.5318367319311
0.66 -8.49761851928852
0.67 -8.46378378619345
0.68 -8.43033253264587
0.69 -8.3972647586458
0.7 -8.36457878222167
0.71 -8.33227460337349
0.72 -8.30035222210127
0.73 -8.26881163840499
0.74 -8.23765285228467
0.75 -8.20687586374029
0.76 -8.17648067277187
0.77 -8.1464672793794
0.78 -8.11683568356288
0.79 -8.08758588532231
0.8 -8.05871409806998
0.81 -8.03022032180588
0.82 -8.00210455653001
0.83 -7.97436680224239
0.84 -7.94700705894299
0.85 -7.92002532663184
0.86 -7.89342160530892
0.87 -7.86719589497423
0.88 -7.84134819562778
0.89 -7.81587850726957
0.9 -7.79077607707862
0.91 -7.76604090505494
0.92 -7.74167299119852
0.93 -7.71767233550937
0.94 -7.69403893798749
0.95 -7.67077279863287
0.96 -7.64787391744552
0.97 -7.62534229442544
0.98 -7.60317792957263
0.99 -7.58138082288708
1 -7.5599158375976
1.01 -7.53878297370418
1.02 -7.51798223120683
1.03 -7.49751361010554
1.04 -7.47737711040032
1.05 -7.45757273209116
1.06 -7.43810047517806
1.07 -7.41896033966103
1.08 -7.40015232554007
1.09 -7.38167643281517
1.1 -7.36345033485956
1.11 -7.34547403167323
1.12 -7.32774752325619
1.13 -7.31027080960844
1.14 -7.29304389072998
1.15 -7.2760667666208
1.16 -7.25933943728091
1.17 -7.24286190271031
1.18 -7.22663416290899
1.19 -7.21065621787697
1.2 -7.19482450126567
1.21 -7.17913901307511
1.22 -7.16359975330528
1.23 -7.14820672195619
1.24 -7.13295991902783
1.25 -7.11785934452021
1.26 -7.10290499843332
1.27 -7.08809688076717
1.28 -7.07343499152175
1.29 -7.05891933069707
1.3 -7.04451147443304
1.31 -7.03021142272969
1.32 -7.01601917558698
1.33 -7.00193473300494
1.34 -6.98795809498357
1.35 -6.97408926152285
1.36 -6.96032823262279
1.37 -6.9466750082834
1.38 -6.93312958850467
1.39 -6.9196919732866
1.4 -6.90634937290293
1.41 -6.89310178735366
1.42 -6.87994921663881
1.43 -6.86689166075835
1.44 -6.8539291197123
1.45 -6.84106159350065
1.46 -6.8282890821234
1.47 -6.81561158558056
1.48 -6.80302910387213
1.49 -6.79054163699809
1.5 -6.77814170255495
1.51 -6.76582930054269
1.52 -6.75360443096132
1.53 -6.74146709381084
1.54 -6.72941728909124
1.55 -6.71745501680254
1.56 -6.70558027694472
1.57 -6.69379306951778
1.58 -6.68209339452174
1.59 -6.67056177186524
1.6 -6.65911066911742
1.61 -6.64774008627826
1.62 -6.63645002334777
1.63 -6.62524048032594
1.64 -6.61411145721279
1.65 -6.60306295400829
1.66 -6.59209497071247
1.67 -6.58120750732531
1.68 -6.57040056384682
1.69 -6.55966482180604
1.7 -6.54900028120297
1.71 -6.53840694203761
1.72 -6.52788480430996
1.73 -6.51743386802003
1.74 -6.50705413316781
1.75 -6.4967455997533
1.76 -6.4865082677765
1.77 -6.47634213723741
1.78 -6.46624720813603
1.79 -6.45621375779847
1.8 -6.44624178622473
1.81 -6.43633129341481
1.82 -6.42648227936871
1.83 -6.41669474408642
1.84 -6.40696868756795
1.85 -6.39730410981331
1.86 -6.38770101082249
1.87 -6.37815939059548
1.88 -6.3686792491323
1.89 -6.35925141583514
1.9 -6.34987589070401
1.91 -6.3405526737389
1.92 -6.33128176493982
1.93 -6.32206316430676
1.94 -6.31289687183973
1.95 -6.30378288753874
1.96 -6.29472121140377
1.97 -6.28571184343483
1.98 -6.27675478363191
1.99 -6.26784339469297
2 -6.25897767661803
2.01 -6.25015762940707
2.02 -6.2413832530601
2.03 -6.23265454757711
2.04 -6.22397151295811
2.05 -6.21533414920309
2.06 -6.20674245631206
2.07 -6.19819643428502
2.08 -6.18969608312197
2.09 -6.18123601910488
2.1 -6.17281624223376
2.11 -6.16443675250862
2.12 -6.15609754992946
2.13 -6.14779863449626
2.14 -6.13954000620904
2.15 -6.13132166506779
2.16 -6.12314361107251
2.17 -6.1150058442232
2.18 -6.10690836451986
2.19 -6.09884741779971
2.2 -6.09085953704593
2.21 -6.08294472225851
2.22 -6.07506644045428
2.23 -6.06722469163323
2.24 -6.05941947579537
2.25 -6.05165079294068
2.26 -6.04391864306919
2.27 -6.03621985496046
2.28 -6.02855442861448
2.29 -6.02092236403127
2.3 -6.01332366121083
2.31 -6.00575832015314
2.32 -5.99822634085822
2.33 -5.99072772332605
2.34 -5.98326246755666
2.35 -5.97583057355002
2.36 -5.96843204130614
2.37 -5.96106497301314
2.38 -5.95372936867101
2.39 -5.94642522827976
2.4 -5.93915255183937
2.41 -5.93191133934986
2.42 -5.92470159081122
2.43 -5.91752330622345
2.44 -5.91037648558655
2.45 -5.90326112890053
2.46 -5.89617723616538
2.47 -5.88912332521326
2.48 -5.88209939604418
2.49 -5.87510544865812
2.5 -5.8681414830551
2.51 -5.86120749923511
2.52 -5.85430349719815
2.53 -5.84742947694423
2.54 -5.84058543847333
2.55 -5.83377138178547
2.56 -5.82698730688065
2.57 -5.82023198715189
2.58 -5.81350542259919
2.59 -5.80680761322257
2.6 -5.80013855902201
2.61 -5.79349825999752
2.62 -5.7868867161491
2.63 -5.78030392747674
2.64 -5.77374989398046
2.65 -5.76722461566024
2.66 -5.76072809251609
2.67 -5.75425935166013
2.68 -5.74781839309237
2.69 -5.74140521681279
2.7 -5.73501982282141
2.71 -5.72866221111823
2.72 -5.72233238170323
2.73 -5.71603033457644
2.74 -5.70975606973784
2.75 -5.70350958718743
2.76 -5.69729088692521
2.77 -5.69109897771998
2.78 -5.68493385957174
2.79 -5.6787955324805
2.8 -5.67268399644625
2.81 -5.66659925146898
2.82 -5.6605412975487
2.83 -5.65451013468542
2.84 -5.64850576287913
2.85 -5.64252818212983
2.86 -5.63657739243752
2.87 -5.63065237859205
2.88 -5.62475314059341
2.89 -5.61890545428846
2.9 -5.61308354383034
2.91 -5.60728740921906
2.92 -5.60151705045462
2.93 -5.59577246753702
2.94 -5.59005366046627
2.95 -5.58436062924235
2.96 -5.5786921827484
2.97 -5.57304832098441
2.98 -5.5674290439504
2.99 -5.56183435164635
3 -5.55626424407228
3.01 -5.55071872122818
3.02 -5.54519778311404
3.03 -5.53970142972987
3.04 -5.53422966107568
3.05 -5.52878247715145
3.06 -5.52335861008891
3.07 -5.51795805988807
3.08 -5.51258082654891
3.09 -5.50722691007144
3.1 -5.50189631045566
3.11 -5.49658902770157
3.12 -5.49130506180916
3.13 -5.48604441277845
3.14 -5.48080708060943
3.15 -5.47559306530209
3.16 -5.47040083461177
3.17 -5.46523038853844
3.18 -5.46008172708213
3.19 -5.45495485024282
3.2 -5.44984975802052
3.21 -5.44476645041522
3.22 -5.43970492742694
3.23 -5.43466518905566
3.24 -5.42964723530138
3.25 -5.42465106616412
3.26 -5.41967498791827
3.27 -5.41471900056384
3.28 -5.40978310410084
3.29 -5.40486729852925
3.3 -5.39997158384909
3.31 -5.39509596006035
3.32 -5.39024042716303
3.33 -5.38540498515713
3.34 -5.38058963404265
3.35 -5.37579437381959
3.36 -5.37101693779483
3.37 -5.36625732596838
3.38 -5.36151553834024
3.39 -5.3567915749104
3.4 -5.35208543567887
3.41 -5.34739712064565
3.42 -5.34272662981073
3.43 -5.33807396317411
3.44 -5.3334391207358
3.45 -5.3288221024958
3.46 -5.3242200719227
3.47 -5.31963302901651
3.48 -5.31506097377722
3.49 -5.31050390620484
3.5 -5.30596182629936
3.51 -5.30143473406078
3.52 -5.29692262948912
3.53 -5.29242551258435
3.54 -5.28794338334649
3.55 -5.28347624177554
3.56 -5.27902075718256
3.57 -5.27457692956757
3.58 -5.27014475893056
3.59 -5.26572424527154
3.6 -5.26131538859049
3.61 -5.25691818888743
3.62 -5.25253264616234
3.63 -5.24815876041524
3.64 -5.24379653164612
3.65 -5.23944595985498
3.66 -5.23510337114264
3.67 -5.23076876550912
3.68 -5.2264421429544
3.69 -5.22212350347849
3.7 -5.21781284708139
3.71 -5.2135101737631
3.72 -5.20921548352361
3.73 -5.20492877636293
3.74 -5.20065005228106
3.75 -5.19637931127799
3.76 -5.19211315460711
3.77 -5.18785158226842
3.78 -5.1835945942619
3.79 -5.17934219058756
3.8 -5.17509437124541
3.81 -5.17085113623545
3.82 -5.16661248555766
3.83 -5.16237841921206
3.84 -5.15814893719865
3.85 -5.15392403951741
3.86 -5.14970019121963
3.87 -5.1454773923053
3.88 -5.14125564277441
3.89 -5.13703494262698
3.9 -5.13281529186299
3.91 -5.12859669048246
3.92 -5.12437913848538
3.93 -5.12016263587175
3.94 -5.11594718264157
3.95 -5.11173277879484
3.96 -5.10751612291364
3.97 -5.10329721499797
3.98 -5.09907605504782
3.99 -5.09485264306321
4 -5.09062697904413
4.01 -5.08639906299058
4.02 -5.08216889490256
4.03 -5.07793647478007
4.04 -5.0737018026231
4.05 -5.06946487843166
4.06 -5.06522283544884
4.07 -5.06097567367463
4.08 -5.05672339310903
4.09 -5.05246599375205
4.1 -5.04820347560369
4.11 -5.04393583866393
4.12 -5.03966308293279
4.13 -5.03538520841026
4.14 -5.03110221509635
4.15 -5.02681410299105
4.16 -5.02251842259417
4.17 -5.01821517390572
4.18 -5.0139043569257
4.19 -5.0095859716541
4.2 -5.00526001809092
4.21 -5.00092649623618
4.22 -4.99658540608985
4.23 -4.99223674765195
4.24 -4.98788052092248
4.25 -4.98351672590143
4.26 -4.97914325180952
4.27 -4.97476009864675
4.28 -4.97036726641313
4.29 -4.96596475510864
4.3 -4.96155256473329
4.31 -4.95713069528708
4.32 -4.95269914677001
4.33 -4.94825791918208
4.34 -4.94380701252329
4.35 -4.93933487994567
4.36 -4.93485120052008
4.37 -4.93035597424652
4.38 -4.925849201125
4.39 -4.9213308811555
4.4 -4.91680101433803
4.41 -4.9122596006726
4.42 -4.9077066401592
4.43 -4.90314213279783
4.44 -4.89856607858848
4.45 -4.89397673215741
4.46 -4.88937409350462
4.47 -4.88475816263011
4.48 -4.88012893953386
4.49 -4.87548642421589
4.5 -4.8708306166762
4.51 -4.86616151691479
4.52 -4.86147912493164
4.53 -4.85678344072677
4.54 -4.85207446430018
4.55 -4.84735052936229
4.56 -4.84261163591312
4.57 -4.83785778395264
4.58 -4.83308897348088
4.59 -4.82830520449782
4.6 -4.82350647700347
4.61 -4.81869279099783
4.62 -4.8138641464809
4.63 -4.80902054345267
4.64 -4.80416198191315
4.65 -4.79928673813773
4.66 -4.79439481212641
4.67 -4.7894862038792
4.68 -4.78456091339609
4.69 -4.77961894067709
4.7 -4.77466028572219
4.71 -4.76968494853139
4.72 -4.7646929291047
4.73 -4.75968422744211
4.74 -4.75465884354362
4.75 -4.74961528307311
4.76 -4.74455354603057
4.77 -4.73947363241601
4.78 -4.73437554222943
4.79 -4.72925927547082
4.8 -4.72412483214018
4.81 -4.71897221223752
4.82 -4.71380141576283
4.83 -4.7085942661441
4.84 -4.70336735602547
4.85 -4.69812068540694
4.86 -4.69285425428852
4.87 -4.6875680626702
4.88 -4.682262110552
4.89 -4.67693639793389
4.9 -4.671571164316
4.91 -4.66618617019821
4.92 -4.66078141558053
4.93 -4.65533465053931
4.94 -4.64984587507455
4.95 -4.64431508918624
4.96 -4.63876329808617
4.97 -4.63319050177432
4.98 -4.62759670025071
4.99 -4.62198189351532
5 -4.6163460194482
5.01 -4.61068907804935
5.02 -4.60501106931877
5.03 -4.59931199325646
5.04 -4.59359184986241
5.05 -4.58785063913664
5.06 -4.58208836107914
5.07 -4.5763050156899
5.08 -4.57050060296893
5.09 -4.56467512291623
5.1 -4.55882959119494
5.11 -4.55296400780507
5.12 -4.54707837274662
5.13 -4.54119273768816
5.14 -4.53528705096112
5.15 -4.5293613125655
5.16 -4.5234155225013
5.17 -4.51744968076851
5.18 -4.51146378736713
5.19 -4.50545784229718
5.2 -4.49943184555863
5.21 -4.49338820873159
5.22 -4.48732693181605
5.23 -4.48124801481201
5.24 -4.47515145771947
5.25 -4.46903726053844
5.26 -4.4629054232689
5.27 -4.45675594591086
5.28 -4.45058882846433
5.29 -4.4444040709293
5.3 -4.43820167330577
5.31 -4.43198529205259
5.32 -4.42575492716978
5.33 -4.41951057865732
5.34 -4.41325224651521
5.35 -4.40697993074346
5.36 -4.40069363134207
5.37 -4.39439334831103
5.38 -4.38807908165035
5.39 -4.38175083136002
5.4 -4.37540859744006
5.41 -4.36905627631239
5.42 -4.36269386797701
5.43 -4.35632137243392
5.44 -4.34993878968314
5.45 -4.34354611972464
5.46 -4.33714336255844
5.47 -4.33073051818454
5.48 -4.32430758660293
5.49 -4.31787456781363
5.5 -4.31143146181661
5.51 -4.30498170166658
5.52 -4.29852528736352
5.53 -4.29206221890745
5.54 -4.28559249629836
5.55 -4.27911611953625
5.56 -4.27263308862111
5.57 -4.26614340355296
5.58 -4.25964706433179
5.59 -4.2531440709576
5.6 -4.24663442343039
5.61 -4.24011812175016
5.62 -4.23359516591691
5.63 -4.22706555593064
5.64 -4.22028594594438
5.65 -4.21325633595811
5.66 -4.20597672597184
5.67 -4.19844711598558
5.68 -4.19066750599931
5.69 -4.18263789601305
5.7 -4.17435828602678
5.71 -4.16582867604051
5.72 -4.15704906605425
5.73 -4.14801945606798
5.74 -4.13873984608172
5.75 -4.12921023609545
5.76 -4.11943062610919
5.77 -4.10940101612292
5.78 -4.09912140613665
5.79 -4.08859179615039
5.8 -4.07781218616412
5.81 -4.06678257617786
5.82 -4.05550296619159
5.83 -4.04397335620532
5.84 -4.03219374621906
5.85 -4.02016413623279
5.86 -4.00788452624653
5.87 -3.99535491626026
5.88 -3.98257530627399
5.89 -3.96954569628772
5.9 -3.95626608630146
5.91 -3.9427364763152
5.92 -3.92895686632893
5.93 -3.91492725634266
5.94 -3.9006476463564
5.95 -3.88611803637013
5.96 -3.87133842638386
5.97 -3.8563088163976
5.98 -3.84102920641133
5.99 -3.82549959642507
6 -3.8097199864388
6.01 -3.79369037645253
6.02 -3.77741076646627
6.03 -3.76088115648
6.04 -3.74410154649374
6.05 -3.72707193650747
6.06 -3.7097923265212
6.07 -3.69226271653493
6.08 -3.67448310654867
6.09 -3.65645349656241
6.1 -3.63817388657614
6.11 -3.61964427658987
6.12 -3.60086466660361
6.13 -3.58183505661734
6.14 -3.56255544663107
6.15 -3.54302583664481
6.16 -3.52324622665854
6.17 -3.50321661667228
6.18 -3.48293700668601
6.19 -3.46240739669974
6.2 -3.44162778671348
6.21 -3.42059817672721
6.22 -3.39931856674094
6.23 -3.37778895675468
6.24 -3.35600934676841
6.25 -3.33397973678214
6.26 -3.31170012679588
6.27 -3.28917051680961
6.28 -3.26639090682335
6.29 -3.24336129683708
6.3 -3.22008168685081
6.31 -3.19655207686454
6.32 -3.17277246687828
6.33 -3.14874285689201
6.34 -3.12446324690575
6.35 -3.09993363691948
6.36 -3.07515402693321
6.37 -3.05012441694694
6.38 -3.02484480696068
6.39 -2.99931519697441
6.4 -2.97353558698815
6.41 -2.94750597700188
6.42 -2.92122636701561
6.43 -2.89469675702934
6.44 -2.86791714704308
6.45 -2.84088753705682
6.46 -2.81360792707055
6.47 -2.78607831708428
6.48 -2.75829870709801
6.49 -2.73026909711174
6.5 -2.70198948712548
6.51 -2.67345987713922
6.52 -2.64468026715295
6.53 -2.61565065716668
6.54 -2.58637104718041
6.55 -2.55684143719415
6.56 -2.52706182720789
6.57 -2.49703221722162
6.58 -2.46675260723536
6.59 -2.43622299724909
6.6 -2.40544338726282
6.61 -2.37441377727656
6.62 -2.34313416729029
6.63 -2.31161935432064
6.64 -2.2798693383676
6.65 -2.24788411943117
6.66 -2.21566369751135
6.67 -2.18320807260815
6.68 -2.15051724472155
6.69 -2.11759121385157
6.7 -2.0844299799982
6.71 -2.05103354316144
6.72 -2.01742085835087
6.73 -1.98359192556648
6.74 -1.94954674480827
6.75 -1.91528531607625
6.76 -1.88080763937042
6.77 -1.84611371469077
6.78 -1.8112035420373
6.79 -1.77607712141001
6.8 -1.74073445280892
6.81 -1.705175536234
6.82 -1.66941794190127
6.83 -1.63346166981074
6.84 -1.59730671996239
6.85 -1.56095309235623
6.86 -1.52440078699226
6.87 -1.48764980387048
6.88 -1.45070014299088
6.89 -1.41355180435347
6.9 -1.37620478795826
6.91 -1.33865909380523
6.92 -1.30093087171779
6.93 -1.26302012169594
6.94 -1.22492684373967
6.95 -1.186651037849
6.96 -1.14819270402392
6.97 -1.10955184226442
6.98 -1.07072845257052
6.99 -1.0317225349422
7 -0.992534089379483
7.01 -0.953163115882347
7.02 -0.913624451873879
7.03 -0.873918097354085
7.04 -0.834044052322966
7.05 -0.794002316780514
7.06 -0.753792890726736
7.07 -0.713415774161625
7.08 -0.672870967085188
7.09 -0.632158469497419
7.1 -0.591278281398324
7.11 -0.550230402787896
7.12 -0.509028464995552
7.13 -0.467672468021291
7.14 -0.426162411865121
7.15 -0.384498296527035
7.16 -0.342680122007032
7.17 -0.300707888305112
7.18 -0.258581595421276
7.19 -0.216301243355524
7.2 -0.173866832107855
7.21 -0.13127836167827
7.22 -0.0885471661320594
7.23 -0.0456732454692244
7.24 -0.00265659968976451
7.25 0.0405027712063202
7.26 0.0838048672190297
7.27 0.127249688348364
7.28 0.170837234594323
7.29 0.214567505956907
7.3 0.258440502436116
7.31 0.30245622403195
7.32 0.346603041278065
7.33 0.390880954174456
7.34 0.435289962721129
7.35 0.479830066918083
7.36 0.524501266765313
7.37 0.569303562262824
7.38 0.614236953410618
7.39 0.659301440208694
7.4 0.704497022657044
7.41 0.749823700755677
7.42 0.795270726763007
7.43 0.840838100679036
7.44 0.886525822503764
7.45 0.932333892237189
7.46 0.978262309879305
7.47 1.02431107543012
7.48 1.07048018888963
7.49 1.11676965025784
7.5 1.16317945953475
7.51 1.20970961672036
7.52 1.25646072877625
7.53 1.30332231826729
7.54 1.35029438519347
7.55 1.3973769295548
7.56 1.44456995135126
7.57 1.49187345058286
7.58 1.5392874272496
7.59 1.58681188135149
7.6 1.63444681288853
7.61 1.68218230791473
7.62 1.73001836643009
7.63 1.77795498843462
7.64 1.82599217392832
7.65 1.87412992291118
7.66 1.92236823538321
7.67 1.9707071113444
7.68 2.01914655079476
7.69 2.06768655373428
7.7 2.11632712016297
7.71 2.16506002835916
7.72 2.21388527832287
7.73 2.26280287005408
7.74 2.3118128035528
7.75 2.36091507881902
7.76 2.41010969585275
7.77 2.45939665465398
7.78 2.50877595522272
7.79 2.55824759755897
7.8 2.60781158166272
7.81 2.65746111161918
7.82 2.70719618742836
7.83 2.75701680909025
7.84 2.80692297660485
7.85 2.85691468997215
7.86 2.90699194919217
7.87 2.9571547542649
7.88 3.00740310519034
7.89 3.05773700196849
7.9 3.10815644459935
7.91 3.15865446253432
7.92 3.20923105577341
7.93 3.2598862243166
7.94 3.31061996816391
7.95 3.36143228731532
7.96 3.41232318177084
7.97 3.46329265153048
7.98 3.51434069659422
7.99 3.56546731696208
8 3.61667251263405
8.01 3.66794984168678
8.02 3.71929930412026
8.03 3.77072089993451
8.04 3.82221462912952
8.05 3.87378049170529
8.06 3.92541848766182
8.07 3.97712861699912
8.08 4.02891087971717
8.09 4.08076527581599
8.1 4.13269180529556
8.11 4.18468455205239
8.12 4.23674351608646
8.13 4.28886869739779
8.14 4.34106009598636
8.15 4.39331771185221
8.16 4.4456415449953
8.17 4.49803159541564
};
\addlegendentry{vehicle_distance_to_intersection(PPO)}
\addplot [thick, green01270, dashed]
table {%
0 -3.43084571428571
0.01 -3.42769142857143
0.02 -3.42448571428572
0.03 -3.42126971428572
0.04 -3.4180432522449
0.05 -3.41480615183674
0.06 -3.4115582367347
0.07 -3.40829933061224
0.08 -3.40502939820408
0.09 -3.40174840364035
0.1 -3.39845631044665
0.11 -3.39515308154402
0.12 -3.39183867924898
0.13 -3.38851306575711
0.14 -3.38517620314102
0.15 -3.38182805334826
0.16 -3.37846857819927
0.17 -3.37509773938527
0.18 -3.37171549846786
0.19 -3.36832181687863
0.2 -3.36491665591868
0.21 -3.36149997675822
0.22 -3.35807174043612
0.23 -3.35463190785944
0.24 -3.35118043980302
0.25 -3.34771729690903
0.26 -3.34424243968649
0.27 -3.34075582851084
0.28 -3.3372574236235
0.29 -3.33374718513139
0.3 -3.33022507300651
0.31 -3.32669104708544
0.32 -3.3231450670689
0.33 -3.31959908705237
0.34 -3.31602907740139
0.35 -3.31245906775041
0.36 -3.30887698228644
0.37 -3.30528278016216
0.38 -3.30167642039211
0.39 -3.29805790297629
0.4 -3.29442714552738
0.41 -3.29078414804538
0.42 -3.2871288691275
0.43 -3.28346126723091
0.44 -3.27978130067225
0.45 -3.27608892776817
0.46 -3.27238410655284
0.47 -3.26866679506043
0.48 -3.26493695118315
0.49 -3.2611945326708
0.5 -3.25743949713024
0.51 -3.25367180202545
0.52 -3.24989140467649
0.53 -3.24609826225955
0.54 -3.24229233180646
0.55 -3.23847357020419
0.56 -3.23464193419435
0.57 -3.23079738037273
0.58 -3.22693986518876
0.59 -3.22306934494508
0.6 -3.21918577579699
0.61 -3.21528911375198
0.62 -3.21137931466921
0.63 -3.20745633425906
0.64 -3.20352012808257
0.65 -3.19957065155095
0.66 -3.19560785992511
0.67 -3.19163170831512
0.68 -3.1876421516797
0.69 -3.18363914482573
0.7 -3.17962264240772
0.71 -3.17559259892732
0.72 -3.17154896873278
0.73 -3.16749170601843
0.74 -3.1634207648242
0.75 -3.15933609903503
0.76 -3.15523766238043
0.77 -3.15112540843389
0.78 -3.1469992906124
0.79 -3.14285926217589
0.8 -3.13870527622672
0.81 -3.13453728570913
0.82 -3.13035524340872
0.83 -3.12615910195192
0.84 -3.12194881380545
0.85 -3.11772433127576
0.86 -3.11348560650854
0.87 -3.10923259148812
0.88 -3.10496523803695
0.89 -3.10068349781507
0.9 -3.09638732231954
0.91 -3.09207666288392
0.92 -3.08775147067766
0.93 -3.08341169670562
0.94 -3.07905729180746
0.95 -3.07468820665711
0.96 -3.07030439176221
0.97 -3.06590579746352
0.98 -3.06149237393442
0.99 -3.05706407118026
1 -3.05262083903789
1.01 -3.048162627175
1.02 -3.04368938508961
1.03 -3.03920106210949
1.04 -3.03469760739155
1.05 -3.03017896992131
1.06 -3.0256450985123
1.07 -3.02111122710329
1.08 -3.01656207039646
1.09 -3.01198218832369
1.1 -3.00738686583475
1.11 -3.00277605087448
1.12 -2.99816523591421
1.13 -2.99352333154999
1.14 -2.98886583007706
1.15 -2.98419262615132
1.16 -2.97950366683418
1.17 -2.97481470751704
1.18 -2.97009413118303
1.19 -2.96537355484902
1.2 -2.96062109483785
1.21 -2.95586863482669
1.22 -2.95110015240207
1.23 -2.9463155935455
1.24 -2.94151495825698
1.25 -2.93669813813533
1.26 -2.93186513318052
1.27 -2.92701583407711
1.28 -2.92215024082509
1.29 -2.91726829849047
1.3 -2.91236995195405
1.31 -2.90745514609665
1.32 -2.9025238254274
1.33 -2.89757593445545
1.34 -2.89261141731514
1.35 -2.88763021814082
1.36 -2.88263228087851
1.37 -2.87761754928521
1.38 -2.87258596692897
1.39 -2.86753747718758
1.4 -2.86247202324857
1.41 -2.85738954810794
1.42 -2.85228999457013
1.43 -2.84717330524743
1.44 -2.84203942255927
1.45 -2.8368882887316
1.46 -2.83171984579624
1.47 -2.82653403559024
1.48 -2.82133079975518
1.49 -2.81611007973656
1.5 -2.81087181678312
1.51 -2.80561595194618
1.52 -2.80034242607898
1.53 -2.79505117983599
1.54 -2.7897421536723
1.55 -2.78441528784289
1.56 -2.77907052240199
1.57 -2.77370779720239
1.58 -2.76832705189478
1.59 -2.76291008451136
1.6 -2.75747491475252
1.61 -2.7520214814537
1.62 -2.74654972324479
1.63 -2.74105957854949
1.64 -2.73555098558455
1.65 -2.73002382016002
1.66 -2.72447801986774
1.67 -2.71891352208987
1.68 -2.71333026399814
1.69 -2.70772818255316
1.7 -2.70210721450374
1.71 -2.69646729617286
1.72 -2.69080836366955
1.73 -2.68513035288814
1.74 -2.67943319950757
1.75 -2.67371683899061
1.76 -2.66798120658319
1.77 -2.66222623731293
1.78 -2.65645186598837
1.79 -2.65065802719827
1.8 -2.64484465531087
1.81 -2.63901168447312
1.82 -2.63315904860998
1.83 -2.62728668142362
1.84 -2.62139451639272
1.85 -2.61548248677169
1.86 -2.6095505255899
1.87 -2.60359856565095
1.88 -2.5976265395319
1.89 -2.59163437958249
1.9 -2.58562201792441
1.91 -2.57958938645049
1.92 -2.57353641682394
1.93 -2.5674630404776
1.94 -2.56136918861313
1.95 -2.55525479220028
1.96 -2.54911978197602
1.97 -2.54296408844385
1.98 -2.53678764187296
1.99 -2.53059037229745
2 -2.52437220951555
2.01 -2.51813308308881
2.02 -2.5118729223413
2.03 -2.50559165635882
2.04 -2.49931039037635
2.05 -2.49298670022423
2.06 -2.4866630100721
2.07 -2.48031800050473
2.08 -2.47395159964675
2.09 -2.46756373538049
2.1 -2.46115433534515
2.11 -2.45472339954072
2.12 -2.44827078251292
2.13 -2.44179648426174
2.14 -2.43530043169204
2.15 -2.42878255146226
2.16 -2.42224276998356
2.17 -2.41568101341903
2.18 -2.40909720793174
2.19 -2.40249127918607
2.2 -2.39584088066616
2.21 -2.38914571302039
2.22 -2.38242804792354
2.23 -2.3756878097793
2.24 -2.36892492273651
2.25 -2.36213923432737
2.26 -2.35533059105772
2.27 -2.34849891579346
2.28 -2.34164413114128
2.29 -2.3347661594478
2.3 -2.32786492253693
2.31 -2.32094034170627
2.32 -2.31399233798899
2.33 -2.3070208321529
2.34 -2.30002574469957
2.35 -2.29300699586256
2.36 -2.28596450560555
2.37 -2.27889819362152
2.38 -2.27180797933175
2.39 -2.26469378188501
2.4 -2.25755552015654
2.41 -2.25039311274719
2.42 -2.24320647798246
2.43 -2.2359955339116
2.44 -2.22876019830663
2.45 -2.22150038866146
2.46 -2.21421602219088
2.47 -2.20690701582967
2.48 -2.19957328623165
2.49 -2.19221474976871
2.5 -2.18483132252983
2.51 -2.1774229203202
2.52 -2.16998945866019
2.53 -2.16253085278441
2.54 -2.15504701764076
2.55 -2.14753786788944
2.56 -2.14000331790196
2.57 -2.13244328176023
2.58 -2.12488324561849
2.59 -2.1172719782504
2.6 -2.10963496522603
2.61 -2.10199795220165
2.62 -2.09433510643445
2.63 -2.08664634054335
2.64 -2.07893165452833
2.65 -2.07119087273947
2.66 -2.06342390690596
2.67 -2.0556307570278
2.68 -2.04781133453557
2.69 -2.03996555056029
2.7 -2.03209331623296
2.71 -2.02419454208235
2.72 -2.0162691383346
2.73 -2.00831701521584
2.74 -2.00033808264853
2.75 -1.99233225025045
2.76 -1.98429942733468
2.77 -1.97623952290753
2.78 -1.96815244566753
2.79 -1.96003810400542
2.8 -1.95189640600307
2.81 -1.9437272594325
2.82 -1.93553057175479
2.83 -1.92730625011905
2.84 -1.91905420136133
2.85 -1.91077433200364
2.86 -1.90246654825279
2.87 -1.89413075599942
2.88 -1.88576686081686
2.89 -1.87734647522153
2.9 -1.86889770150269
2.91 -1.86042044395384
2.92 -1.85191460654584
2.93 -1.84338009292578
2.94 -1.83481670941226
2.95 -1.82622435867455
2.96 -1.81760294305382
2.97 -1.80895236456198
2.98 -1.80027252488058
2.99 -1.79156332502713
3 -1.78282466568545
3.01 -1.77405644720449
3.02 -1.76525856959727
3.03 -1.75643093253972
3.04 -1.74757343536838
3.05 -1.73868597707931
3.06 -1.72976845632687
3.07 -1.72082077142263
3.08 -1.71184282033419
3.09 -1.70283450068403
3.1 -1.6937957097483
3.11 -1.6847263444557
3.12 -1.67562630138629
3.13 -1.6664954767703
3.14 -1.65733376648693
3.15 -1.64814106606321
3.16 -1.63891727067277
3.17 -1.62966227513467
3.18 -1.62037597391216
3.19 -1.61105826111155
3.2 -1.60170903048091
3.21 -1.59232817540893
3.22 -1.58294732033695
3.23 -1.57350289510465
3.24 -1.56405846987235
3.25 -1.55455004369114
3.26 -1.54500945457826
3.27 -1.5354367025337
3.28 -1.52586395048914
3.29 -1.51625881755807
3.3 -1.50662130374049
3.31 -1.49695118960458
3.32 -1.48724836487742
3.33 -1.4775127192861
3.34 -1.46774425283064
3.35 -1.45794285449084
3.36 -1.44810841324652
3.37 -1.43824081732516
3.38 -1.42833995457617
3.39 -1.41840571247086
3.4 -1.40843797848057
3.41 -1.39843663969597
3.42 -1.3884015828271
3.43 -1.37833269420079
3.44 -1.36822985975933
3.45 -1.35809296505923
3.46 -1.34792189527116
3.47 -1.33771653517869
3.48 -1.32747676917696
3.49 -1.31720248127136
3.5 -1.30689355507625
3.51 -1.29654987381359
3.52 -1.28617132031167
3.53 -1.27575777700371
3.54 -1.2653091259266
3.55 -1.25482524871953
3.56 -1.24430602662265
3.57 -1.23375134047572
3.58 -1.22316107071679
3.59 -1.2125350973808
3.6 -1.20187330009827
3.61 -1.19117555809388
3.62 -1.18044175018516
3.63 -1.16967175478107
3.64 -1.15886544988068
3.65 -1.1480227130717
3.66 -1.13714342152918
3.67 -1.12622745201407
3.68 -1.11527468087185
3.69 -1.1042849840311
3.7 -1.09325823700212
3.71 -1.08219431487551
3.72 -1.07109309232075
3.73 -1.05999186976599
3.74 -1.04881566867184
3.75 -1.03760178861709
3.76 -1.02635010257253
3.77 -1.01506048308067
3.78 -1.00377086358882
3.79 -0.992443182762488
3.8 -0.981039122197934
3.81 -0.969596614044622
3.82 -0.958115528682013
3.83 -0.946634443319404
3.84 -0.935114650689966
3.85 -0.923556150793699
3.86 -0.911958813134598
3.87 -0.900322375839277
3.88 -0.88864670708743
3.89 -0.87693167461434
3.9 -0.865177278420006
3.91 -0.8533833857938
3.92 -0.841549864025092
3.93 -0.829676579955839
3.94 -0.817763399530145
3.95 -0.805810188240159
3.96 -0.79381681112455
3.97 -0.781783133221991
3.98 -0.76970901911614
3.99 -0.757594332935655
4 -0.745438938352647
4.01 -0.733242698579607
4.02 -0.721005476367859
4.03 -0.708727134006001
4.04 -0.696407533319904
4.05 -0.684046535671159
4.06 -0.67164400195551
4.07 -0.65919979260129
4.08 -0.646713767567849
4.09 -0.634185786343968
4.1 -0.621615707946274
4.11 -0.609003390917657
4.12 -0.596348693325671
4.13 -0.583651472760948
4.14 -0.570911586335582
4.15 -0.558128890681528
4.16 -0.545303241948993
4.17 -0.532434495804809
4.18 -0.519522507430812
4.19 -0.506567131522214
4.2 -0.493568222285965
4.21 -0.480525633439116
4.22 -0.467439218207167
4.23 -0.45430882932242
4.24 -0.441134319022321
4.25 -0.427915539047799
4.26 -0.41465234064159
4.27 -0.40134457454657
4.28 -0.387992091004076
4.29 -0.374594739752215
4.3 -0.361152370024177
4.31 -0.34766483054654
4.32 -0.334131969537561
4.33 -0.320553634705474
4.34 -0.306929673246778
4.35 -0.293213998068785
4.36 -0.27945223476601
4.37 -0.265644228470741
4.38 -0.251789823794869
4.39 -0.237888864828145
4.4 -0.223941195136419
4.41 -0.209946500272654
4.42 -0.195904622220423
4.43 -0.181815402432322
4.44 -0.167678681828191
4.45 -0.153494300793316
4.46 -0.139262099176641
4.47 -0.124981915749004
4.48 -0.110653588739474
4.49 -0.0962769558335275
4.5 -0.0818518541712248
4.51 -0.0673781203453725
4.52 -0.0528555903996928
4.53 -0.0382840998251179
4.54 -0.0236634835579395
4.55 -0.00899357597793937
4.56 0.00572578909347321
4.57 0.0204947783951468
4.58 0.0353135592280616
4.59 0.0501822994572318
4.6 0.0651011675136051
4.61 0.0800703323959659
4.62 0.0950703323959665
4.63 0.110070332395967
4.64 0.125070332395968
4.65 0.140070332395968
4.66 0.155070332395969
4.67 0.170070332395969
4.68 0.18507033239597
4.69 0.20007033239597
4.7 0.215070332395971
4.71 0.230070332395972
4.72 0.245070332395972
4.73 0.260070332395973
4.74 0.275070332395973
4.75 0.290070332395974
4.76 0.305070332395974
4.77 0.320070332395975
4.78 0.335070332395976
4.79 0.350070332395976
4.8 0.365070332395977
4.81 0.380070332395977
4.82 0.395070332395978
4.83 0.410070332395978
4.84 0.425070332395979
4.85 0.44007033239598
4.86 0.45507033239598
4.87 0.470070332395981
4.88 0.485070332395981
4.89 0.500070332395982
4.9 0.515070332395982
4.91 0.530070332395983
4.92 0.545070332395984
4.93 0.560070332395984
4.94 0.575070332395985
4.95 0.590070332395985
4.96 0.605070332395986
4.97 0.620070332395986
4.98 0.635070332395987
4.99 0.650070332395988
5 0.665070332395988
5.01 0.680070332395989
5.02 0.695070332395989
5.03 0.71007033239599
5.04 0.72507033239599
5.05 0.740070332395991
5.06 0.755070332395992
5.07 0.770070332395992
5.08 0.785070332395993
5.09 0.800070332395993
5.1 0.815070332395994
5.11 0.830070332395994
5.12 0.845070332395995
5.13 0.860070332395996
5.14 0.875070332395996
5.15 0.890070332395997
5.16 0.905070332395997
5.17 0.920070332395998
5.18 0.935070332395998
5.19 0.950070332395999
5.2 0.965070332395999
5.21 0.980070332396
5.22 0.995070332396001
5.23 1.010070332396
5.24 1.025070332396
5.25 1.040070332396
5.26 1.055070332396
5.27 1.070070332396
5.28 1.085070332396
5.29 1.100070332396
5.3 1.11507033239601
5.31 1.13007033239601
5.32 1.14507033239601
5.33 1.16007033239601
5.34 1.17507033239601
5.35 1.19007033239601
5.36 1.20507033239601
5.37 1.22007033239601
5.38 1.23507033239601
5.39 1.25007033239601
5.4 1.26507033239601
5.41 1.28007033239601
5.42 1.29507033239601
5.43 1.31007033239601
5.44 1.32507033239601
5.45 1.34007033239601
5.46 1.35507033239601
5.47 1.37007033239601
5.48 1.38507033239602
5.49 1.40007033239602
5.5 1.41507033239602
5.51 1.43007033239602
5.52 1.44507033239602
5.53 1.46007033239602
5.54 1.47507033239602
5.55 1.49007033239602
5.56 1.50507033239602
5.57 1.52007033239602
5.58 1.53507033239602
5.59 1.55007033239602
5.6 1.56507033239602
5.61 1.58007033239602
5.62 1.59507033239602
5.63 1.61007033239602
5.64 1.62507033239602
5.65 1.64007033239603
5.66 1.65507033239603
5.67 1.67007033239603
5.68 1.68507033239603
5.69 1.70007033239603
5.7 1.71507033239603
5.71 1.73007033239603
5.72 1.74507033239603
5.73 1.76007033239603
5.74 1.77507033239603
5.75 1.79007033239603
5.76 1.80507033239603
5.77 1.82007033239603
5.78 1.83507033239603
5.79 1.85007033239603
5.8 1.86507033239603
5.81 1.88007033239603
5.82 1.89507033239603
5.83 1.91007033239604
5.84 1.92507033239604
5.85 1.94007033239604
5.86 1.95507033239604
5.87 1.97007033239604
5.88 1.98507033239604
5.89 2.00007033239604
5.9 2.01507033239604
5.91 2.03007033239604
5.92 2.04507033239604
5.93 2.06007033239604
5.94 2.07507033239604
5.95 2.09007033239604
5.96 2.10507033239604
5.97 2.12007033239604
5.98 2.13507033239604
5.99 2.15007033239604
6 2.16507033239604
6.01 2.18007033239605
6.02 2.19507033239605
6.03 2.21007033239605
6.04 2.22507033239605
6.05 2.24007033239605
6.06 2.25507033239605
6.07 2.27007033239605
6.08 2.28507033239605
6.09 2.30007033239605
6.1 2.31507033239605
6.11 2.33007033239605
6.12 2.34507033239605
6.13 2.36007033239605
6.14 2.37507033239605
6.15 2.39007033239605
6.16 2.40507033239605
6.17 2.42007033239605
6.18 2.43507033239606
6.19 2.45007033239606
6.2 2.46507033239606
6.21 2.48007033239606
6.22 2.49507033239606
6.23 2.51007033239606
6.24 2.52507033239606
6.25 2.54007033239606
6.26 2.55507033239606
6.27 2.57007033239606
6.28 2.58507033239606
6.29 2.60007033239606
6.3 2.61507033239606
6.31 2.63007033239606
6.32 2.64507033239606
6.33 2.66007033239606
6.34 2.67507033239606
6.35 2.69007033239606
6.36 2.70507033239607
6.37 2.72007033239607
6.38 2.73507033239607
6.39 2.75007033239607
6.4 2.76507033239607
6.41 2.78007033239607
6.42 2.79507033239607
6.43 2.81007033239607
6.44 2.82507033239607
6.45 2.84007033239607
6.46 2.85507033239607
6.47 2.87007033239607
6.48 2.88507033239607
6.49 2.90007033239607
6.5 2.91507033239607
6.51 2.93007033239607
6.52 2.94507033239607
6.53 2.96007033239608
6.54 2.97507033239608
6.55 2.99007033239608
6.56 3.00507033239608
6.57 3.02007033239608
6.58 3.03507033239608
6.59 3.05007033239608
6.6 3.06507033239608
6.61 3.08007033239608
6.62 3.09507033239608
6.63 3.11007033239608
6.64 3.12507033239608
6.65 3.14007033239608
6.66 3.15507033239608
6.67 3.17007033239608
6.68 3.18507033239608
6.69 3.20007033239608
6.7 3.21507033239608
6.71 3.23007033239609
6.72 3.24507033239609
6.73 3.26007033239609
6.74 3.27507033239609
6.75 3.29007033239609
6.76 3.30507033239609
6.77 3.32007033239609
6.78 3.33507033239609
6.79 3.35007033239609
6.8 3.36507033239609
6.81 3.38007033239609
6.82 3.39507033239609
6.83 3.41007033239609
6.84 3.42507033239609
6.85 3.44007033239609
6.86 3.45507033239609
6.87 3.47007033239609
6.88 3.48507033239609
6.89 3.5000703323961
6.9 3.5150703323961
6.91 3.5300703323961
6.92 3.5450703323961
6.93 3.5600703323961
6.94 3.5750703323961
6.95 3.5900703323961
6.96 3.6050703323961
6.97 3.6200703323961
6.98 3.6350703323961
6.99 3.6500703323961
7 3.6650703323961
7.01 3.6800703323961
7.02 3.6950703323961
7.03 3.7100703323961
7.04 3.7250703323961
7.05 3.7400703323961
7.06 3.75507033239611
7.07 3.77007033239611
7.08 3.78507033239611
7.09 3.80007033239611
7.1 3.81507033239611
7.11 3.83007033239611
7.12 3.84507033239611
7.13 3.86007033239611
7.14 3.87507033239611
7.15 3.89007033239611
7.16 3.90507033239611
7.17 3.92007033239611
7.18 3.93507033239611
7.19 3.95007033239611
7.2 3.96507033239611
7.21 3.98007033239611
7.22 3.99507033239611
7.23 4.01007033239611
7.24 4.02507033239612
7.25 4.04007033239612
7.26 4.05507033239612
7.27 4.07007033239612
7.28 4.08507033239612
7.29 4.10007033239612
7.3 4.11507033239612
7.31 4.13007033239612
7.32 4.14507033239612
7.33 4.16007033239612
7.34 4.17507033239612
7.35 4.19007033239612
7.36 4.20507033239612
7.37 4.22007033239612
7.38 4.23507033239612
7.39 4.25007033239612
7.4 4.26507033239612
7.41 4.28007033239613
7.42 4.29507033239613
7.43 4.31007033239613
7.44 4.32507033239613
7.45 4.34007033239613
7.46 4.35507033239613
7.47 4.37007033239613
7.48 4.38507033239613
7.49 4.40007033239613
7.5 4.41507033239613
7.51 4.43007033239613
7.52 4.44507033239613
7.53 4.46007033239613
7.54 4.47507033239613
7.55 4.49007033239613
7.56 4.50507033239613
7.57 4.52007033239613
7.58 4.53507033239613
7.59 4.55007033239614
7.6 4.56507033239614
7.61 4.58007033239614
7.62 4.59507033239614
7.63 4.61007033239614
7.64 4.62507033239614
7.65 4.64007033239614
7.66 4.65507033239614
7.67 4.67007033239614
7.68 4.68507033239614
7.69 4.70007033239614
7.7 4.71507033239614
7.71 4.73007033239614
7.72 4.74507033239614
7.73 4.76007033239614
7.74 4.77507033239614
7.75 4.79007033239614
7.76 4.80507033239615
7.77 4.82007033239615
7.78 4.83507033239615
7.79 4.85007033239615
7.8 4.86507033239615
7.81 4.88007033239615
7.82 4.89507033239615
7.83 4.91007033239615
7.84 4.92507033239615
7.85 4.94007033239615
7.86 4.95507033239615
7.87 4.97007033239615
7.88 4.98507033239615
7.89 5.00007033239615
7.9 5.01507033239615
7.91 5.03007033239615
7.92 5.04507033239615
7.93 5.06007033239615
7.94 5.07507033239616
7.95 5.09007033239616
7.96 5.10507033239616
7.97 5.12007033239616
7.98 5.13507033239616
7.99 5.15007033239616
8 5.16507033239616
8.01 5.18007033239616
8.02 5.19507033239616
8.03 5.21007033239616
8.04 5.22507033239616
8.05 5.24007033239616
8.06 5.25507033239616
8.07 5.27007033239616
8.08 5.28507033239616
8.09 5.30007033239616
8.1 5.31507033239616
8.11 5.33007033239616
8.12 5.34507033239617
8.13 5.36007033239617
8.14 5.37507033239617
8.15 5.39007033239617
8.16 5.40507033239617
8.17 5.42007033239617
};
\addlegendentry{pedestrian_distance_to_intersection(PPO)}
\end{axis}

\end{tikzpicture}
