% This file was created with tikzplotlib v0.10.1.
\begin{tikzpicture}

\definecolor{darkgray176}{RGB}{176,176,176}
\definecolor{darkorange25512714}{RGB}{255,127,14}
\definecolor{lightgray204}{RGB}{204,204,204}
\definecolor{steelblue31119180}{RGB}{31,119,180}

\begin{axis}[
legend cell align={left},
legend style={fill opacity=0.8, draw opacity=1, text opacity=1, draw=lightgray204},
tick align=outside,
tick pos=left,
title={Distance between vehicle and pedestrian},
x grid style={darkgray176},
xlabel={Time in s},
xmajorgrids,
xmin=-1.14, xmax=23.94,
xtick style={color=black},
y grid style={darkgray176},
ylabel={Distance between vehicle and human in m (in x direction)},
ymajorgrids,
ymin=-13.6669878623067, ymax=7.5986501071682,
ytick style={color=black}
]
\addplot [semithick, steelblue31119180]
table {%
0 -12.3696595958241
0.1 -12.0767905904826
0.2 -11.794976245545
0.3 -11.5240090900108
0.4 -11.2637046513147
0.5 -11.013869726042
0.6 -10.7743152074529
0.7 -10.5448517860892
0.8 -10.3252535701427
0.9 -10.1152893622169
1 -9.9147203039316
1.1 -9.72330662517574
1.2 -9.54085138438177
1.3 -9.36712667410667
1.4 -9.20187341879731
1.5 -9.04481635758636
1.6 -8.89568329737693
1.7 -8.75419351342705
1.8 -8.62005823043383
1.9 -8.49302423253511
2 -8.37307321445062
2.1 -8.26322752777651
2.2 -8.16228810768953
2.3 -8.06640883463479
2.4 -7.97577724455154
2.5 -7.89016082668758
2.6 -7.80935140620807
2.7 -7.73312737303218
2.8 -7.66124949290351
2.9 -7.59350715310362
3 -7.52968818002989
3.1 -7.46960842716365
3.2 -7.41307863123534
3.3 -7.35991135313672
3.4 -7.30993780472247
3.5 -7.26241669025875
3.6 -7.21489557579503
3.7 -7.16737446133131
3.8 -7.11985334686759
3.9 -7.07233223240387
4 -7.02481111794015
4.1 -6.97729000347643
4.2 -6.92976888901271
4.3 -6.88224777454899
4.4 -6.83472666008527
4.5 -6.78720554562155
4.6 -6.73968443115783
4.7 -6.69216331669411
4.8 -6.64464220223039
4.9 -6.59712108776667
5 -6.54959997330295
5.1 -6.50207885883923
5.2 -6.45455774437551
5.3 -6.40703662991179
5.4 -6.35951551544807
5.5 -6.31199440098435
5.6 -6.26447328652063
5.7 -6.21695217205691
5.8 -6.16943105759319
5.9 -6.12190994312947
6 -6.07438882866575
6.1 -6.02686771420203
6.2 -5.97934659973831
6.3 -5.93182548527459
6.4 -5.88430437081087
6.5 -5.83678325634715
6.6 -5.78926214188343
6.7 -5.74174102741971
6.8 -5.69421991295599
6.9 -5.64669879849227
7 -5.59917768402855
7.1 -5.55165656956483
7.2 -5.50413545510111
7.3 -5.45661434063739
7.4 -5.40909322617367
7.5 -5.36157211170995
7.6 -5.31405099724623
7.7 -5.26652988278251
7.8 -5.21900876831879
7.9 -5.17148765385507
8 -5.12396653939135
8.1 -5.07644542492763
8.2 -5.02892431046391
8.3 -4.98140319600019
8.4 -4.93388208153647
8.5 -4.88636096707275
8.6 -4.83883985260903
8.7 -4.79131873814531
8.8 -4.74621838651317
8.9 -4.70504673287818
9 -4.66751607049878
9.1 -4.63330971268218
9.2 -4.60216404478982
9.3 -4.57382623041372
9.4 -4.54804855145806
9.5 -4.52461600910469
9.6 -4.50332220723161
9.7 -4.48398906014658
9.8 -4.46643410587455
9.9 -4.45049159948561
10 -4.43618466957803
10.1 -4.42356298830652
10.2 -4.41208646641544
10.3 -4.40157859979118
10.4 -4.39192353830689
10.5 -4.38316760450334
10.6 -4.37522941041836
10.7 -4.36803377710991
10.8 -4.36151630580351
10.9 -4.35561380138593
11 -4.35026778278724
11.1 -4.34542918592776
11.2 -4.34104903423914
11.3 -4.33708181676261
11.4 -4.33349008679789
11.5 -4.33023992191587
11.6 -4.32729788150362
11.7 -4.32463487642959
11.8 -4.32222439466707
11.9 -4.32008848302495
12 -4.31815758657515
12.1 -4.31641054181261
12.2 -4.31482915365427
12.3 -4.31339790894466
12.4 -4.31210278904363
12.5 -4.31093040036011
12.6 -4.30988603176439
12.7 -4.3089846756008
12.8 -4.30816648559107
12.9 -4.30742405350635
13 -4.306750648338
13.1 -4.30612810771287
13.2 -4.30556520595999
13.3 -4.30505634328518
13.4 -4.30459625136746
13.5 -4.30418008728303
13.6 -4.30380370837891
13.7 -4.30346323544874
13.8 -4.30315521442766
13.9 -4.30287655398127
14 -4.30262464663036
14.1 -4.30239689770502
14.2 -4.30219081470405
14.3 -4.30200437525564
14.4 -4.30183581414857
14.5 -4.30168331552296
14.6 -4.30154920897849
14.7 -4.30142929054273
14.8 -4.30131843999391
14.9 -4.30121814604527
15 -4.30112744526574
15.1 -4.3010454435878
15.2 -4.30097135827197
15.3 -4.30090438840043
15.4 -4.30084381174852
15.5 -4.3007890019717
15.6 -4.30076858935345
15.7 -4.30076858935345
15.8 -4.30076858935345
15.9 -4.30076858935345
16 -4.30076858935345
16.1 -4.30076858935345
16.2 -4.30076858935345
16.3 -4.30076858935345
16.4 -4.30076858935345
16.5 -4.30076858935345
16.6 -4.30076858935345
16.7 -4.30076858935345
16.8 -4.30076858935345
16.9 -4.30076858935345
17 -4.30076858935345
17.1 -4.30076858935345
17.2 -4.30076858935345
17.3 -4.30076858935345
17.4 -4.30076858935345
17.5 -4.30076858935345
17.6 -4.30076858935345
17.7 -4.30076858935345
17.8 -4.30076858935345
17.9 -4.29972128608792
18 -4.29099375887521
18.1 -4.27353870444979
18.2 -4.24735612281166
18.3 -4.21244601396081
18.4 -4.16880837789726
18.5 -4.116443214621
18.6 -4.05535052413202
18.7 -3.98553030643034
18.8 -3.90698256151595
18.9 -3.81970728938884
19 -3.72370449004902
19.1 -3.6189741634965
19.2 -3.50551630973126
19.3 -3.38333092875331
19.4 -3.25241802056265
19.5 -3.10858837209718
19.6 -2.95149288226839
19.7 -2.78566986522689
19.8 -2.61111932097268
19.9 -2.42888855277128
20 -2.2386284595342
20.1 -2.0396408390844
20.2 -1.83192569142189
20.3 -1.61548301654667
20.4 -1.39031281445874
20.5 -1.15641508515809
20.6 -0.913789828644738
20.7 -0.662437044918676
20.8 -0.4023567339799
20.9 -0.133548895828412
21 0.143986469535783
21.1 0.43024936211269
21.2 0.725239781902303
21.3 1.02895772890463
21.4 1.34140320311967
21.5 1.66257620454741
21.6 1.99247673318787
21.7 2.33110478904104
21.8 2.67846037210692
21.9 3.03454348238551
22 3.39935411987681
22.1 3.77289228458082
22.2 4.15515797649753
22.3 4.54615119562696
22.4 4.9458719419691
22.5 5.35432021552396
22.6 5.77149601629152
22.7 6.1973993442718
22.8 6.63203019946479
};
\addlegendentry{distance_SFM}
\addplot [semithick, darkorange25512714]
table {%
0 -12.7003679546033
0.1 -12.4030813826929
0.2 -12.1163212276379
0.3 -11.8403369296682
0.4 -11.5749506870637
0.5 -11.3199747796553
0.6 -11.0752120677284
0.7 -10.8404564392265
0.8 -10.6154933182472
0.9 -10.4001002316914
1 -10.1940662428601
1.1 -9.99718361561522
1.2 -9.80920942116708
1.3 -9.62989500445821
1.4 -9.45931312185235
1.5 -9.29814429261511
1.6 -9.14474496546266
1.7 -8.99884641607137
1.8 -8.86018940661454
1.9 -8.72851458229399
2 -8.60356323946626
2.1 -8.48507807276838
2.2 -8.37280389005126
2.3 -8.26648828957448
2.4 -8.16588229469556
2.5 -8.070744789626
2.6 -7.98086568086934
2.7 -7.8960208805433
2.8 -7.81597690387179
2.9 -7.74050600678161
3 -7.669386712746
3.1 -7.60240410574585
3.2 -7.53935006792927
3.3 -7.48044741821151
3.4 -7.42466170948739
3.5 -7.36887600076327
3.6 -7.31309029203914
3.7 -7.25730458331502
3.8 -7.2015188745909
3.9 -7.14573316586677
4 -7.08994745714265
4.1 -7.03416174841853
4.2 -6.9783760396944
4.3 -6.92259033097028
4.4 -6.86680462224616
4.5 -6.81101891352203
4.6 -6.75523320479791
4.7 -6.69944749607379
4.8 -6.64366178734966
4.9 -6.58787607862554
5 -6.53209036990142
5.1 -6.47630466117729
5.2 -6.42051895245317
5.3 -6.36473324372905
5.4 -6.30894753500493
5.5 -6.2531618262808
5.6 -6.19737611755668
5.7 -6.14159040883256
5.8 -6.08580470010843
5.9 -6.03001899138431
6 -5.97423328266019
6.1 -5.91844757393606
6.2 -5.86266186521194
6.3 -5.80687615648782
6.4 -5.75109044776369
6.5 -5.69530473903957
6.6 -5.63951903031545
6.7 -5.58373332159132
6.8 -5.5279476128672
6.9 -5.47216190414308
7 -5.41637619541896
7.1 -5.36059048669483
7.2 -5.30480477797071
7.3 -5.24901906924659
7.4 -5.19323336052246
7.5 -5.13744765179834
7.6 -5.08166194307422
7.7 -5.02587623435009
7.8 -4.97009052562597
7.9 -4.91430481690185
8 -4.85851910817772
8.1 -4.8027333994536
8.2 -4.74694769072948
8.3 -4.69308255974533
8.4 -4.64394751883592
8.5 -4.599201154959
8.6 -4.55851878863113
8.7 -4.52153982332457
8.8 -4.48795533772532
8.9 -4.45747693646582
9 -4.42984101831942
9.1 -4.40481656546826
9.2 -4.38217182543654
9.3 -4.36169079594461
9.4 -4.34317522276873
9.5 -4.32644348994847
9.6 -4.31132949806416
9.7 -4.29768156713709
9.8 -4.28536137480982
9.9 -4.27424293751239
10 -4.26421164010019
10.1 -4.25516331757459
10.2 -4.24700339093914
10.3 -4.23964605797349
10.4 -4.23301353869097
10.5 -4.22703537445184
10.6 -4.22164777910034
10.7 -4.21679472534527
10.8 -4.21243064920453
10.9 -4.20862070686403
11 -4.2053048333999
11.1 -4.20229340569228
11.2 -4.19952520067903
11.3 -4.19702554426317
11.4 -4.19476921778242
11.5 -4.19273263982888
11.6 -4.19089449360221
11.7 -4.18923551441236
11.8 -4.18773829504444
11.9 -4.18638710903971
12 -4.1851677503488
12.1 -4.18406738792255
12.2 -4.18307478228394
12.3 -4.182179414316
12.4 -4.18137242863378
12.5 -4.18064546207707
12.6 -4.17999008542748
12.7 -4.1793990085275
12.8 -4.17886674057559
12.9 -4.17838761341565
13 -4.17795632891701
13.1 -4.17756811395292
13.2 -4.17722570561662
13.3 -4.17692107982825
13.4 -4.17664236496383
13.5 -4.17639086729885
13.6 -4.17616395857107
13.7 -4.17595923583988
13.8 -4.17577453073544
13.9 -4.17560788665457
14 -4.17545753810931
14.1 -4.17532192630323
14.2 -4.17519981913039
14.3 -4.17508991285765
14.4 -4.17499098917189
14.5 -4.17490195084144
14.6 -4.17482181020735
14.7 -4.17474967825554
14.8 -4.1746847547708
14.9 -4.17462655285976
15 -4.1745956578515
15.1 -4.1745956578515
15.2 -4.1745956578515
15.3 -4.1745956578515
15.4 -4.1745956578515
15.5 -4.1745956578515
15.6 -4.1745956578515
15.7 -4.1745956578515
15.8 -4.1745956578515
15.9 -4.1745956578515
16 -4.1745956578515
16.1 -4.1745956578515
16.2 -4.1745956578515
16.3 -4.1745956578515
16.4 -4.1745956578515
16.5 -4.1745956578515
16.6 -4.1745956578515
16.7 -4.1745956578515
16.8 -4.1745956578515
16.9 -4.1745956578515
17 -4.1745956578515
17.1 -4.1745956578515
17.2 -4.1745956578515
17.3 -4.1745956578515
17.4 -4.1745956578515
17.5 -4.1745956578515
17.6 -4.1745956578515
17.7 -4.1745956578515
17.8 -4.1745956578515
17.9 -4.1745956578515
18 -4.17342099096231
18.1 -4.16363210021898
18.2 -4.14405431873234
18.3 -4.11468764650237
18.4 -4.07553208352905
18.5 -4.0265876298124
18.6 -3.96785428535242
18.7 -3.89933205014913
18.8 -3.82102092420251
18.9 -3.73292090751256
19 -3.6350320000793
19.1 -3.5273542019027
19.2 -3.40988751298275
19.3 -3.28263193331948
19.4 -3.14558746291289
19.5 -2.99875410176297
19.6 -2.84213184986973
19.7 -2.67572070723317
19.8 -2.49952067385328
19.9 -2.31353174973004
20 -2.11775393486347
20.1 -1.91218722925358
20.2 -1.69683163290037
20.3 -1.47168714580383
20.4 -1.23675376796398
20.5 -0.992031499380793
20.6 -0.737520340054267
20.7 -0.473220289984404
20.8 -0.199131349171218
20.9 0.0847464823852917
21 0.378413204685124
21.1 0.681868817728279
21.2 0.995113321514758
21.3 1.31814671604457
21.4 1.65096900131773
21.5 1.99358017733422
21.6 2.34598024409402
21.7 2.70816920159715
21.8 3.0801470498436
21.9 3.46191378883338
22 3.85346941856648
22.1 4.25481393904293
22.2 4.66007401581672
22.3 5.0653340925905
22.4 5.47059416936429
};
\addlegendentry{distance_MDP}
\end{axis}

\end{tikzpicture}
