% This file was created with tikzplotlib v0.10.1.
\begin{tikzpicture}

\definecolor{darkgray176}{RGB}{176,176,176}
\definecolor{green}{RGB}{0,128,0}
\definecolor{green01270}{RGB}{0,127,0}
\definecolor{lightgray204}{RGB}{204,204,204}

\begin{axis}[
legend cell align={left},
legend style={fill opacity=0.8, draw opacity=1, text opacity=1, draw=lightgray204},
tick align=outside,
tick pos=left,
title={Speed of vehicle and pedestrian},
x grid style={darkgray176},
xlabel={Distance between vehicle and human in m (in x direction)},
xmajorgrids,
xmin=-13.4049193108727, xmax=9.29272825853224,
xtick style={color=black},
y grid style={darkgray176},
ylabel={Speed in m/s},
ymajorgrids,
ymin=0.523577427729975, ymax=9.20223048804935,
ytick style={color=black}
]
\addplot [semithick, red]
table {%
-12.3732080577179 5.85032757565133
-12.0877856721062 5.620531832814
-11.813173354288 5.40722286109596
-11.5491212257948 5.19726494762154
-11.2954727322991 4.99061961218105
-11.0520385953228 4.78793257019222
-10.8186150985828 4.5893928476596
-10.5949896924961 4.39517172441245
-10.3809416093526 4.20542884365959
-10.1762424745902 4.02031119568343
-9.98065697043508 3.83995209889804
-9.79394354701824 3.66447029950771
-9.61585517449729 3.49396920683398
-9.44614012899411 3.32853627746355
-9.28454280458836 3.16824255844477
-9.13080454319092 3.01314239653484
-8.98466447387364 2.86327331706467
-8.84586035315922 2.71865607246199
-8.71412939787811 2.57929485698138
-8.58920910247282 2.44517768085135
-8.47084426187037 2.31586176190837
-8.35881454026843 2.19110407322043
-8.2528678171921 2.07150842264753
-8.15274707282509 1.95702973904893
-8.05819883697283 1.84758681940498
-7.96897409477269 1.74308570135868
-7.88482885729458 1.64342165936732
-7.80552466349779 1.54848040537993
-7.73082902275137 1.45813927644053
-7.6605157979282 1.3722684220835
-7.59436552951961 1.2907319766835
-7.53216570196464 1.21338920224106
-7.47371095406071 1.14009558892435
-7.41880323589617 1.07070390268933
-7.36725336848034 1.00491984512893
-7.31890393516171 0.942175637445869
-7.27288097304201 0.918061657744492
-7.22697789015478 0.918061657744492
-7.18107480726755 0.918061657744492
-7.13517172438032 0.918061657744492
-7.08926864149309 0.918061657744492
-7.04336555860586 0.918061657744492
-6.99746247571863 0.918061657744492
-6.95155939283141 0.918061657744492
-6.90565630994418 0.918061657744492
-6.85975322705695 0.918061657744492
-6.81385014416972 0.918061657744492
-6.76794706128249 0.918061657744492
-6.72204397839526 0.918061657744492
-6.67614089550803 0.918061657744492
-6.63023781262081 0.918061657744492
-6.58433472973358 0.918061657744492
-6.53843164684635 0.918061657744492
-6.49252856395912 0.918061657744492
-6.44662548107189 0.918061657744492
-6.40072239818466 0.918061657744492
-6.35481931529743 0.918061657744492
-6.3089162324102 0.918061657744492
-6.26301314952298 0.918061657744492
-6.21711006663575 0.918061657744492
-6.17120698374852 0.918061657744492
-6.12530390086129 0.918061657744492
-6.07940081797406 0.918061657744492
-6.03349773508683 0.918061657744492
-5.9875946521996 0.918061657744492
-5.94169156931238 0.918061657744492
-5.89578848642515 0.918061657744492
-5.84988540353792 0.918061657744492
-5.80398232065069 0.918061657744492
-5.75807923776346 0.918061657744492
-5.71217615487623 0.918061657744492
-5.666273071989 0.918061657744492
-5.62036998910177 0.918061657744492
-5.5723722996835 1.02279198429702
-5.51599618414102 1.19734252855123
-5.45089254138583 1.37189307280544
-5.37706137141794 1.54644361705965
-5.29450267423733 1.72099416131386
-5.20321644984401 1.89554470556807
-5.10320269823798 2.07009524982228
-4.99201771179968 2.31446601177818
-4.87140699597165 2.45410644718155
-4.74311605619644 2.62865699143576
-4.60644669029703 2.80320753568997
-4.46104979718491 2.97775807994418
-4.30692537686007 3.15230862419839
-4.14407342932252 3.3268591684526
-3.97249395457227 3.50140971270681
-3.79218695260931 3.67596025696102
-3.60315242343363 3.85051080121523
-3.40539036704524 4.02506134546944
-3.19890078344414 4.19961188972365
-2.98368367263033 4.37416243397786
-2.7597390346038 4.54871297823207
-2.52706686936457 4.72326352248628
-2.28566717691263 4.89781406674049
-2.03553995724798 5.0723646109947
-1.77668521037062 5.24691515524891
-1.50910293628055 5.42146569950313
-1.23279313497777 5.59601624375734
-0.947755806462276 5.77056678801155
-0.65399095073407 5.94511733226576
-0.351498567793158 6.11966787651997
-0.0402786576395329 6.29421842077418
0.279668779726805 6.46876896502839
0.608343744305849 6.6433195092826
0.945746236097605 6.81787005353681
1.29187625510207 6.99242059779102
1.64673380131925 7.16697114204523
2.01450808781124 7.44625201285197
2.39100990151593 7.58589244825534
2.77554104025632 7.76044299250955
3.16879970620943 7.93499353676376
3.57078589937524 8.10954408101797
3.98149961975376 8.28409462527219
4.400940867345 8.4586451695264
4.82910964214895 8.63319571378062
5.26600594416561 8.80774625803483
};
\addlegendentry{vehicle speed(SFM)}
\addplot [semithick, green]
table {%
-12.3732080577179 1
-12.0877856721062 1
-11.813173354288 1
-11.5491212257948 1
-11.2954727322991 1
-11.0520385953228 1
-10.8186150985828 1
-10.5949896924961 1
-10.3809416093526 1
-10.1762424745902 1
-9.98065697043508 1
-9.79394354701824 1
-9.61585517449729 1
-9.44614012899411 1
-9.28454280458836 1
-9.13080454319092 1
-8.98466447387364 1
-8.84586035315922 1
-8.71412939787811 1
-8.58920910247282 1
-8.47084426187037 1.5
-8.35881454026843 1.5
-8.2528678171921 1.5
-8.15274707282509 1.5
-8.05819883697283 1.5
-7.96897409477269 1.5
-7.88482885729458 1.5
-7.80552466349779 1.5
-7.73082902275137 1.5
-7.6605157979282 1.5
-7.59436552951961 1.5
-7.53216570196464 1.5
-7.47371095406071 1.5
-7.41880323589617 1.5
-7.36725336848034 1.5
-7.31890393516171 1.5
-7.27288097304201 1.5
-7.22697789015478 1.5
-7.18107480726755 1.5
-7.13517172438032 1.5
-7.08926864149309 1.5
-7.04336555860586 1.5
-6.99746247571863 1.5
-6.95155939283141 1.5
-6.90565630994418 1.5
-6.85975322705695 1.5
-6.81385014416972 1.5
-6.76794706128249 1.5
-6.72204397839526 1.5
-6.67614089550803 1.5
-6.63023781262081 1.5
-6.58433472973358 1.5
-6.53843164684635 1.5
-6.49252856395912 1.5
-6.44662548107189 1.5
-6.40072239818466 1.5
-6.35481931529743 1.5
-6.3089162324102 1.5
-6.26301314952298 1.5
-6.21711006663575 1.5
-6.17120698374852 1.5
-6.12530390086129 1.5
-6.07940081797406 1.5
-6.03349773508683 1.5
-5.9875946521996 1.5
-5.94169156931238 1.5
-5.89578848642515 1.5
-5.84988540353792 1.5
-5.80398232065069 1.5
-5.75807923776346 1.5
-5.71217615487623 1.5
-5.666273071989 1.5
-5.62036998910177 1.5
-5.5723722996835 1.5
-5.51599618414102 1.5
-5.45089254138583 1.5
-5.37706137141794 1.5
-5.29450267423733 1.5
-5.20321644984401 1.5
-5.10320269823798 1.5
-4.99201771179968 1.5
-4.87140699597165 1.5
-4.74311605619644 1.5
-4.60644669029703 1.5
-4.46104979718491 1.5
-4.30692537686007 1.5
-4.14407342932252 1.5
-3.97249395457227 1.5
-3.79218695260931 1.5
-3.60315242343363 1.5
-3.40539036704524 1.5
-3.19890078344414 1.5
-2.98368367263033 1.5
-2.7597390346038 1.5
-2.52706686936457 1.5
-2.28566717691263 1.5
-2.03553995724798 1.5
-1.77668521037062 1.5
-1.50910293628055 1.5
-1.23279313497777 1.5
-0.947755806462276 1.5
-0.65399095073407 1.5
-0.351498567793158 1.5
-0.0402786576395329 1.5
0.279668779726805 1.5
0.608343744305849 1.5
0.945746236097605 1.5
1.29187625510207 1.5
1.64673380131925 1.5
2.01450808781124 1.5
2.39100990151593 1.5
2.77554104025632 1.5
3.16879970620943 1.5
3.57078589937524 1.5
3.98149961975376 1.5
4.400940867345 1.5
4.82910964214895 1.5
5.26600594416561 1.5
};
\addlegendentry{human speed(SFM)}
\addplot [semithick, red, dashed]
table {%
-12.1315253179403 5.95302465579654
-11.840920386781 5.71814793477921
-11.5620592916726 5.48327121376189
-11.2946048123002 5.26016081055294
-11.0381833735812 5.04118443694502
-10.7925800255398 4.82655744125108
-10.5575776759988 4.61630382514377
-10.3329514593128 4.41062835819715
-10.118466511875 4.20972906207619
-9.91387832217274 4.01379412921097
-9.7189334150284 3.82299666761847
-9.53337015615549 3.63749303875204
-9.35691963052967 3.45742153693824
-9.18930657861424 3.28290132137328
-9.0302503795915 3.11403156289363
-8.87946607055575 2.95089081556955
-8.73670018627803 2.79237572462639
-8.60168565604883 2.63967798795477
-8.47413070797706 2.49283123067671
-8.35374130717403 2.35187786976733
-8.24022315561928 2.2168012431554
-8.13328353469628 2.08756113008819
-8.03263237569494 1.964096398972
-7.93867630563759 1.8234491384649
-7.85085781142976 1.71238687937428
-7.76842029956713 1.60730328508677
-7.69104609623826 1.50830195039753
-7.61848704863031 1.41364446104
-7.55052051523799 1.32377278540765
-7.48690270182008 1.23871213667029
-7.42739666216187 1.15834167768171
-7.37177260042709 1.08250013475989
-7.31980920979009 1.01101545673286
-7.26925843695345 1.01101545673286
-7.21870766411681 1.01101545673286
-7.16815689128016 1.01101545673286
-7.11760611844352 1.01101545673286
-7.06705534560687 1.01101545673286
-7.01650457277023 1.01101545673286
-6.96595379993359 1.01101545673286
-6.91540302709694 1.01101545673286
-6.8648522542603 1.01101545673286
-6.81430148142366 1.01101545673286
-6.76375070858701 1.01101545673286
-6.71319993575037 1.01101545673286
-6.66264916291372 1.01101545673286
-6.61209839007708 1.01101545673286
-6.56154761724044 1.01101545673286
-6.51099684440379 1.01101545673286
-6.46044607156715 1.01101545673286
-6.4098952987305 1.01101545673286
-6.35934452589386 1.01101545673286
-6.30879375305722 1.01101545673286
-6.25824298022057 1.01101545673286
-6.20769220738393 1.01101545673286
-6.15714143454728 1.01101545673286
-6.10659066171064 1.01101545673286
-6.056039888874 1.01101545673286
-6.00548911603735 1.01101545673286
-5.95493834320071 1.01101545673286
-5.90438757036407 1.01101545673286
-5.85383679752742 1.01101545673286
-5.80328602469078 1.01101545673286
-5.75273525185413 1.01101545673286
-5.70218447901749 1.01101545673286
-5.65163370618085 1.01101545673286
-5.6010829333442 1.01101545673286
-5.55053216050756 1.01101545673286
-5.49998138767091 1.01101545673286
-5.44943061483427 1.01101545673286
-5.39887984199763 1.01101545673286
-5.34832906916098 1.01101545673286
-5.29621207380541 1.08932658267948
-5.23587241022544 1.28510439754604
-5.16574385590215 1.4808822124126
-5.08582641083554 1.67666002727915
-4.99612007502558 1.87243784214571
-4.89662484847229 2.06821565701227
-4.78734073117567 2.26399347187882
-4.66826772313573 2.45977128674538
-4.53940582435246 2.65554910161193
-4.40075503482588 2.85132691647849
-4.2503575764073 3.12541585729167
-4.08977967161566 3.28203810918491
-3.9198044317104 3.47781592405147
-3.74004030106182 3.67359373891802
-3.55048727966992 3.86937155378458
-3.3511453675347 4.06514936865113
-3.14201456465615 4.26092718351769
-2.92309487103428 4.45670499838425
-2.69438628666909 4.65248281325081
-2.45588881156053 4.84826062811737
-2.20760244570866 5.04403844298392
-1.94952718911346 5.23981625785048
-1.68166304177494 5.43559407271704
-1.4040100036931 5.6313718875836
-1.11656807486793 5.82714970245016
-0.819337255299438 6.02292751731671
-0.512317544987596 6.21870533218327
-0.195508943932424 6.41448314704983
0.131088547866071 6.61026096191639
0.467474930407889 6.80603877678294
0.81365020369303 7.0018165916495
1.16961436772149 7.19759440651606
1.53654208938248 7.47168334732924
1.91599959119495 7.6674611621958
2.30524598375074 7.86323897706236
2.70193193327147 7.94155010300898
3.09900943842192 7.94155010300898
3.49608694357238 7.94155010300898
3.89316444872284 7.94155010300898
4.29024195387326 7.94155010300898
4.68731945902368 7.94155010300898
5.0843969641741 7.94155010300898
5.48147446932452 7.94155010300898
5.87855197447495 7.94155010300898
6.27562947962537 7.94155010300898
6.67270698477579 7.94155010300898
7.06978448992621 7.94155010300898
7.46686199507663 7.94155010300898
7.86393950022705 7.94155010300898
8.26101700537747 7.94155010300898
};
\addlegendentry{vehicle speed(MDP)}
\addplot [semithick, green01270, dashed]
table {%
-12.1315253179403 1
-11.840920386781 1
-11.5620592916726 1
-11.2946048123002 1
-11.0381833735812 1
-10.7925800255398 1
-10.5575776759988 1
-10.3329514593128 1
-10.118466511875 1
-9.91387832217274 1
-9.7189334150284 1
-9.53337015615549 1
-9.35691963052967 1
-9.18930657861424 1
-9.0302503795915 1
-8.87946607055575 1
-8.73670018627803 1
-8.60168565604883 1
-8.47413070797706 1
-8.35374130717403 1.5
-8.24022315561928 1.5
-8.13328353469628 1.5
-8.03263237569494 1.5
-7.93867630563759 1.5
-7.85085781142976 1.5
-7.76842029956713 1.5
-7.69104609623826 1.5
-7.61848704863031 1.5
-7.55052051523799 1.5
-7.48690270182008 1.5
-7.42739666216187 1.5
-7.37177260042709 1.5
-7.31980920979009 1.5
-7.26925843695345 1.5
-7.21870766411681 1.5
-7.16815689128016 1.5
-7.11760611844352 1.5
-7.06705534560687 1.5
-7.01650457277023 1.5
-6.96595379993359 1.5
-6.91540302709694 1.5
-6.8648522542603 1.5
-6.81430148142366 1.5
-6.76375070858701 1.5
-6.71319993575037 1.5
-6.66264916291372 1.5
-6.61209839007708 1.5
-6.56154761724044 1.5
-6.51099684440379 1.5
-6.46044607156715 1.5
-6.4098952987305 1.5
-6.35934452589386 1.5
-6.30879375305722 1.5
-6.25824298022057 1.5
-6.20769220738393 1.5
-6.15714143454728 1.5
-6.10659066171064 1.5
-6.056039888874 1.5
-6.00548911603735 1.5
-5.95493834320071 1.5
-5.90438757036407 1.5
-5.85383679752742 1.5
-5.80328602469078 1.5
-5.75273525185413 1.5
-5.70218447901749 1.5
-5.65163370618085 1.5
-5.6010829333442 1.5
-5.55053216050756 1.5
-5.49998138767091 1.5
-5.44943061483427 1.5
-5.39887984199763 1.5
-5.34832906916098 1.5
-5.29621207380541 1.5
-5.23587241022544 1.5
-5.16574385590215 1.5
-5.08582641083554 1.5
-4.99612007502558 1.5
-4.89662484847229 1.5
-4.78734073117567 1.5
-4.66826772313573 1.5
-4.53940582435246 1.5
-4.40075503482588 1.5
-4.2503575764073 1.5
-4.08977967161566 1.5
-3.9198044317104 1.5
-3.74004030106182 1.5
-3.55048727966992 1.5
-3.3511453675347 1.5
-3.14201456465615 1.5
-2.92309487103428 1.5
-2.69438628666909 1.5
-2.45588881156053 1.5
-2.20760244570866 1.5
-1.94952718911346 1.5
-1.68166304177494 1.5
-1.4040100036931 1.5
-1.11656807486793 1.5
-0.819337255299438 1.5
-0.512317544987596 1.5
-0.195508943932424 1.5
0.131088547866071 1.5
0.467474930407889 1.5
0.81365020369303 1.5
1.16961436772149 1.5
1.53654208938248 1.5
1.91599959119495 1.5
2.30524598375074 1.5
2.70193193327147 1.5
3.09900943842192 1.5
3.49608694357238 1.5
3.89316444872284 1.5
4.29024195387326 1.5
4.68731945902368 1.5
5.0843969641741 1.5
5.48147446932452 1.5
5.87855197447495 1.5
6.27562947962537 1.5
6.67270698477579 1.5
7.06978448992621 1.5
7.46686199507663 1.5
7.86393950022705 1.5
8.26101700537747 1.5
};
\addlegendentry{human speed(MDP)}
\end{axis}

\end{tikzpicture}
