solid OpenSCAD_Model
  facet normal 0 0 1
    outer loop
      vertex 0.0112 0.00799942 0.000579834
      vertex 0.00149918 0.00699997 0.000579834
      vertex 0.0112 0 0.000579834
    endloop
  endfacet
  facet normal -0 0 1
    outer loop
      vertex -0.00149918 0.00799942 0.000579834
      vertex 0.00149918 0.00699997 0.000579834
      vertex 0.0112 0.00799942 0.000579834
    endloop
  endfacet
  facet normal 0 0 1
    outer loop
      vertex 0.00149918 0.00699997 0.000579834
      vertex -0.00149918 0.00799942 0.000579834
      vertex -0.000999451 0.00699997 0.000579834
    endloop
  endfacet
  facet normal 0 0 1
    outer loop
      vertex -0.00149918 0 0.000579834
      vertex -0.000999451 0.00699997 0.000579834
      vertex -0.00149918 0.00799942 0.000579834
    endloop
  endfacet
  facet normal 0 0 1
    outer loop
      vertex -0.000999451 0.00699997 0.000579834
      vertex -0.00149918 0 0.000579834
      vertex -0.000999451 0 0.000579834
    endloop
  endfacet
  facet normal 0 0 1
    outer loop
      vertex 0.0112 0 0.000579834
      vertex 0.00149918 0.00699997 0.000579834
      vertex 0.00149918 0 0.000579834
    endloop
  endfacet
  facet normal 0 0 -1
    outer loop
      vertex -0.000999451 0 0.000579834
      vertex -0.00149918 0 0.000579834
      vertex -0.000999451 0.00699997 0.000579834
    endloop
  endfacet
  facet normal 0 0 -1
    outer loop
      vertex 0.00149918 0.00699997 0.000579834
      vertex 0.0112 0 0.000579834
      vertex 0.00149918 0 0.000579834
    endloop
  endfacet
  facet normal 0 0 -1
    outer loop
      vertex 0.0112 0 0.000579834
      vertex 0.00149918 0.00699997 0.000579834
      vertex 0.0112 0.00799942 0.000579834
    endloop
  endfacet
  facet normal 0 0 -1
    outer loop
      vertex -0.00149918 0.00799942 0.000579834
      vertex 0.00149918 0.00699997 0.000579834
      vertex -0.000999451 0.00699997 0.000579834
    endloop
  endfacet
  facet normal 0 0 -1
    outer loop
      vertex 0.00149918 0.00699997 0.000579834
      vertex -0.00149918 0.00799942 0.000579834
      vertex 0.0112 0.00799942 0.000579834
    endloop
  endfacet
  facet normal 0 0 -1
    outer loop
      vertex -0.00149918 0.00799942 0.000579834
      vertex -0.000999451 0.00699997 0.000579834
      vertex -0.00149918 0 0.000579834
    endloop
  endfacet
  facet normal 0 1 -0
    outer loop
      vertex 0.0112 0.00799942 0
      vertex -0.00149918 0.00799942 0.000579834
      vertex 0.0112 0.00799942 0.000579834
    endloop
  endfacet
  facet normal 0 1 0
    outer loop
      vertex -0.00149918 0.00799942 0.000579834
      vertex 0.0112 0.00799942 0
      vertex -0.00149918 0.00799942 0
    endloop
  endfacet
  facet normal 0 -1 0
    outer loop
      vertex -0.00149918 0.00799942 0
      vertex 0.0112 0.00799942 0.000579834
      vertex -0.00149918 0.00799942 0.000579834
    endloop
  endfacet
  facet normal 0 -1 -0
    outer loop
      vertex 0.0112 0.00799942 0.000579834
      vertex -0.00149918 0.00799942 0
      vertex 0.0112 0.00799942 0
    endloop
  endfacet
  facet normal 1 -0 0
    outer loop
      vertex -0.00149918 0 0.000579834
      vertex -0.00149918 0.00799942 0
      vertex -0.00149918 0.00799942 0.000579834
    endloop
  endfacet
  facet normal 1 0 0
    outer loop
      vertex -0.00149918 0.00799942 0
      vertex -0.00149918 0 0.000579834
      vertex -0.00149918 0 0
    endloop
  endfacet
  facet normal -1 0 0
    outer loop
      vertex -0.00149918 0 0
      vertex -0.00149918 0.00799942 0.000579834
      vertex -0.00149918 0.00799942 0
    endloop
  endfacet
  facet normal -1 -0 0
    outer loop
      vertex -0.00149918 0.00799942 0.000579834
      vertex -0.00149918 0 0
      vertex -0.00149918 0 0.000579834
    endloop
  endfacet
endsolid OpenSCAD_Model
