solid OpenSCAD_Model
  facet normal 0 0 -1
    outer loop
      vertex 0 0 0.00318
      vertex 0.0005 0.006 0.00318
      vertex 0.0005 0 0.00318
    endloop
  endfacet
  facet normal -0 0 -1
    outer loop
      vertex 0.0005 0.006 0.00318
      vertex 0 0 0.00318
      vertex 0 0.006 0.00318
    endloop
  endfacet
endsolid OpenSCAD_Model
