solid OpenSCAD_Model
  facet normal 0 1 0
    outer loop
      vertex 0.0911999 0 0.000579834
      vertex 0.00149918 0 0.000179291
      vertex 0.00149918 0 0.000579834
    endloop
  endfacet
  facet normal 0 1 0
    outer loop
      vertex -0.00149918 0 0
      vertex 0.000499725 0 0.000179291
      vertex 0.00149918 0 0.000179291
    endloop
  endfacet
  facet normal 0 1 0
    outer loop
      vertex 0.000499725 0 0.000179291
      vertex -0.00149918 0 0
      vertex 0 0 0.000179291
    endloop
  endfacet
  facet normal 0 1 0
    outer loop
      vertex -0.00149918 0 0
      vertex 0.00149918 0 0.000179291
      vertex 0.0911999 0 0
    endloop
  endfacet
  facet normal 0 1 -0
    outer loop
      vertex 0.0911999 0 0
      vertex 0.00149918 0 0.000179291
      vertex 0.0911999 0 0.000579834
    endloop
  endfacet
  facet normal 0 1 -0
    outer loop
      vertex 0.000499725 0 0.000179291
      vertex 0 0 0.00317955
      vertex 0.000499725 0 0.00317955
    endloop
  endfacet
  facet normal 0 1 0
    outer loop
      vertex 0 0 0.00317955
      vertex 0.000499725 0 0.000179291
      vertex 0 0 0.000179291
    endloop
  endfacet
  facet normal 0 1 -0
    outer loop
      vertex -0.000999451 0 0.000179291
      vertex -0.00149918 0 0.000579834
      vertex -0.000999451 0 0.000579834
    endloop
  endfacet
  facet normal 0 1 0
    outer loop
      vertex -0.000999451 0 0.000179291
      vertex -0.00149918 0 0
      vertex -0.00149918 0 0.000579834
    endloop
  endfacet
  facet normal 0 1 0
    outer loop
      vertex 0 0 0.000179291
      vertex -0.00149918 0 0
      vertex -0.000999451 0 0.000179291
    endloop
  endfacet
  facet normal 0 -1 0
    outer loop
      vertex -0.00149918 0 0.000579834
      vertex -0.000999451 0 0.000179291
      vertex -0.000999451 0 0.000579834
    endloop
  endfacet
  facet normal 0 -1 0
    outer loop
      vertex -0.00149918 0 0
      vertex 0 0 0.000179291
      vertex -0.000999451 0 0.000179291
    endloop
  endfacet
  facet normal 0 -1 -0
    outer loop
      vertex 0 0 0.000179291
      vertex -0.00149918 0 0
      vertex 0.000499725 0 0.000179291
    endloop
  endfacet
  facet normal 0 -1 -0
    outer loop
      vertex 0.000499725 0 0.000179291
      vertex -0.00149918 0 0
      vertex 0.00149918 0 0.000179291
    endloop
  endfacet
  facet normal 0 -1 0
    outer loop
      vertex -0.00149918 0 0
      vertex -0.000999451 0 0.000179291
      vertex -0.00149918 0 0.000579834
    endloop
  endfacet
  facet normal 0 -1 0
    outer loop
      vertex 0 0 0.000179291
      vertex 0.000499725 0 0.00317955
      vertex 0 0 0.00317955
    endloop
  endfacet
  facet normal 0 -1 -0
    outer loop
      vertex 0.000499725 0 0.00317955
      vertex 0 0 0.000179291
      vertex 0.000499725 0 0.000179291
    endloop
  endfacet
  facet normal 0 -1 0
    outer loop
      vertex 0.00149918 0 0.000179291
      vertex 0.0911999 0 0.000579834
      vertex 0.00149918 0 0.000579834
    endloop
  endfacet
  facet normal 0 -1 0
    outer loop
      vertex 0.0911999 0 0
      vertex 0.00149918 0 0.000179291
      vertex -0.00149918 0 0
    endloop
  endfacet
  facet normal 0 -1 0
    outer loop
      vertex 0.00149918 0 0.000179291
      vertex 0.0911999 0 0
      vertex 0.0911999 0 0.000579834
    endloop
  endfacet
endsolid OpenSCAD_Model
