solid OpenSCAD_Model
  facet normal 0 0 -1
    outer loop
      vertex -0.0015 0.007 0
      vertex 0.0112 0.008 0
      vertex 0.0112 0.007 0
    endloop
  endfacet
  facet normal -0 0 -1
    outer loop
      vertex 0.0112 0.008 0
      vertex -0.0015 0.007 0
      vertex -0.0015 0.008 0
    endloop
  endfacet
endsolid OpenSCAD_Model
